##TITLE=1H_SA_Pheracyl
 CDCl3, 8 sc, 
 5.6.2020
##JCAMPDX= 6.0         $$ Bruker NMR JCAMP-DX V2.0
##DATA TYPE= NMR FID
##DATA CLASS= NTUPLES
##ORIGIN= UXNMR, Bruker Analytische Messtechnik GmbH
##OWNER= root
$$ XWIN-NMR		Version 3.5
$$ Fri Jun  5 11:08:04 2020 Russian Standard Time (UT+4h)  she@DPX200
##.OBSERVE FREQUENCY= 200.1315
##.OBSERVE NUCLEUS= ^1H
##.DELAY= (6, 6)
##.ACQUISITION MODE= SIMULTANEOUS
##.ACQUISITION SCHEME= undefined
##.AVERAGES= 8
##.DIGITISER RES= 18
##SPECTROMETER/DATA SYSTEM= spect
##.PULSE SEQUENCE= zg30
##.SOLVENT NAME= D2O
##.SHIFT REFERENCE= (INTERNAL, D2O, 0, 15.7039)
##AUDIT TRAIL= $$ (NUMBER, WHEN, WHO, WHERE, WHAT)
$$ ##TITLE= Audit trail, XWIN-NMR		Version 3.5
$$ ##JCAMPDX= 5.01
$$ ##ORIGIN= Bruker BioSpin GmbH
$$ ##OWNER= she
$$ F:/spectra/data/she/nmr/H-F/1/audita.txt
$$ ##AUDIT TRAIL=  $$ (NUMBER, WHEN, WHO, WHERE, WHAT)
(   1,<2020-06-05 11:06:55.35 +0400>,<she>,<DPX200>,
      <created by zg, POWCHK disabled, PULCHK disabled
       configuration hash MD5:
       00 E9 B6 7A A2 85 ED C7 34 08 36 98 17 FE 4E 26
       data hash MD5: 16K
       43 65 CB 6F 52 26 E1 8F 76 5B CC FB E3 9B 1B 14>)
$$ ##END=
$$ 
$$ hash MD5
$$ 78 16 6B 92 18 5C 65 48 F0 8C 38 71 CB 9E 5E 07
##$RELAX= 
##$RELAX= 
##$RELAX= 
##$RELAX= 
##$RELAX= 
##$RELAX= 
$$ Bruker specific parameters
$$ --------------------------
##$DU= <F:/spectra>
##$EXPNO= 1
##$NAME= <H-F>
##$PROCNO= 1
##$TYPE= <nmr>
##$USER= <she>
##$AMP= (0..31)
100 100 100 100 100 100 100 100 100 100 100 100 100 100 100 100 100 100 
100 100 100 100 100 100 100 100 100 100 100 100 100 100 
##$AQSEQ= 0
##$AQ_mod= 1
##$AUNM= <au_zg>
##$AUTOPOS= <>
##$BF1= 200.13
##$BF2= 200.13
##$BF3= 200.13
##$BF4= 200.13
##$BF5= 200.13
##$BF6= 200.13
##$BF7= 200.13
##$BF8= 200.13
##$BYTORDA= 1
##$CFDGTYP= 0
##$CFRGTYP= 5
##$CHEMSTR= <none>
##$CNST= (0..31)
1 1 145 1 1 1 1 1 1 1 1 1 1 1 1 1 1 1 1 1 1 1 1 1 1 1 1 1 1 1 1 1 
##$CPDPRG= <>
##$CPDPRG1= <>
##$CPDPRG2= <>
##$CPDPRG3= <>
##$CPDPRG4= <mlev>
##$CPDPRG5= <mlev>
##$CPDPRG6= <mlev>
##$CPDPRG7= <mlev>
##$CPDPRG8= <mlev>
##$CPDPRGB= <>
##$CPDPRGT= <>
##$D= (0..31)
0 1.2 0 0 0 0 0 0 0 0.06 0 0.03 0 0 0 0 0.0002 0 0 0 0 0 0 0 0 0 0 0 0 
0 0 0 
##$DATE= 1591340814
##$DBL= (0..7)
120 120 120 120 120 120 120 120 
##$DBP= (0..7)
150 150 150 150 150 150 150 150 
##$DBP07= 0
##$DBPNAM0= <>
##$DBPNAM1= <>
##$DBPNAM2= <>
##$DBPNAM3= <>
##$DBPNAM4= <>
##$DBPNAM5= <>
##$DBPNAM6= <>
##$DBPNAM7= <>
##$DBPOAL= (0..7)
0.5 0.5 0.5 0.5 0.5 0.5 0.5 0.5 
##$DBPOFFS= (0..7)
0 0 0 0 0 0 0 0 
##$DE= 6
##$DECBNUC= <off>
##$DECIM= 24
##$DECNUC= <off>
##$DECSTAT= 4
##$DIGMOD= 1
##$DIGTYP= 9
##$DL= (0..7)
0 120 120 120 120 120 120 120 
##$DP= (0..7)
150 150 150 150 150 150 150 150 
##$DP07= 0
##$DPNAME0= <>
##$DPNAME1= <>
##$DPNAME2= <>
##$DPNAME3= <>
##$DPNAME4= <>
##$DPNAME5= <>
##$DPNAME6= <>
##$DPNAME7= <>
##$DPOAL= (0..7)
0.5 0.5 0.5 0.5 0.5 0.5 0.5 0.5 
##$DPOFFS= (0..7)
0 0 0 0 0 0 0 0 
##$DQDMODE= 0
##$DR= 18
##$DS= 0
##$DSLIST= <SSSSSSSSSSSSSSS>
$$ [...]
##$SUBNAM2= <"">
##$SUBNAM3= <"">
##$SUBNAM4= <"">
##$SUBNAM5= <"">
##$SUBNAM6= <"">
##$SUBNAM7= <"">
##$SUBNAM8= <"">
##$SUBNAM9= <"">
##$SW= 24.9337058887773
##$SWIBOX= (0..15)
0 0 2 0 0 0 0 0 0 0 0 0 0 0 0 0 
##$SW_h= 4990.01996007984
##$TD= 16384
##$TD0= 1
##$TE= 0
##$TE2= 300
##$TE3= 300
##$TEG= 300
##$TL= (0..7)
0 120 120 120 120 120 120 120 
##$TP= (0..7)
150 150 150 150 150 150 150 150 
##$TP07= 0
##$TPNAME0= <>
##$TPNAME1= <>
##$TPNAME2= <>
##$TPNAME3= <>
##$TPNAME4= <>
##$TPNAME5= <>
##$TPNAME6= <>
##$TPNAME7= <>
##$TPOAL= (0..7)
0.5 0.5 0.5 0.5 0.5 0.5 0.5 0.5 
##$TPOFFS= (0..7)
0 0 0 0 0 0 0 0 
##$TUNHIN= 0
##$TUNHOUT= 0
##$TUNXOUT= 0
##$USERA1= <user>
##$USERA2= <user>
##$USERA3= <user>
##$USERA4= <user>
##$USERA5= <user>
##$V9= 5
##$VALIST= <valist>
##$VCLIST= <CCCCCCCCCCCCCCC>
##$VD= 0
##$VDLIST= <DDDDDDDDDDDDDDD>
##$VPLIST= <PPPPPPPPPPPPPPP>
##$VTLIST= <TTTTTTTTTTTTTTT>
##$WBST= 1024
##$WBSW= 4
##$XGAIN= (0..3)
0 0 0 0 
##$XL= 0
##$YL= 0
##$YMAX_a= 257713
##$YMIN_a= -205333
##$ZGOPTNS= <>
##$ZL1= 120
##$ZL2= 120
##$ZL3= 120
##$ZL4= 120
##$ABSF1= 10
##$ABSF2= 0
##$ABSG= 5
##$ABSL= 3
##$ALPHA= 0
##$AQORDER= 0
##$ASSFAC= 0
##$ASSFACI= 0
##$ASSFACX= 0
##$ASSWID= 0
##$AUNMP= <proc_1d>
##$AZFE= 0.1
##$AZFW= 0.1
##$BCFW= 1
##$BC_mod= 2
##$BYTORDP= 1
##$COROFFS= 0
##$CY= 11.3945322036743
##$DATMOD= 1
##$DC= 2
##$DFILT= <>
##$DTYPP= 0
##$F1P= 16.9975609425685
##$F2P= -3.02152046262296
##$FCOR= 0.5
##$FTSIZE= 0
##$FT_mod= 4
##$GAMMA= 1
##$GB= 0.15
##$INTBC= 1
##$INTSCL= 1
##$ISEN= 128
##$LB= 0.24
##$LEV0= 0
##$LPBIN= 0
##$MAXI= 10000
##$MC2= 0
##$MEAN= 0
##$ME_mod= 0
##$MI= 1.114404
##$NCOEF= 0
##$NC_proc= 0
##$NLEV= 6
##$NOISF1= 3.799351
##$NOISF2= 2.8
##$NSP= 1
##$NTH_PI= 0
##$NZP= 0
##$OFFSET= 15.70392
##$PC= 1
##$PHC0= -9793.292
##$PHC1= 13.60082
##$PH_mod= 1
##$PKNL= yes
##$PPARMOD= 0
##$PSCAL= 0
##$PSIGN= 0
##$REVERSE= no
##$SF= 200.130013532006
##$SI= 16384
##$SIGF1= 3
##$SIGF2= 2
##$SINO= 400
##$SIOLD= 16384
##$SREGLST= <1H.CDCl3>
##$SSB= 0
##$STSI= 0
##$STSR= 0
##$SW_p= 3612.71676300578
##$SYMM= 0
##$S_DEV= 0
##$TDeff= 0
##$TDoff= 0
##$TI= <>
##$TILT= no
##$TM1= 0
##$TM2= 0
##$TOPLEV= 0
##$USERP1= <user>
##$USERP2= <user>
##$USERP3= <user>
##$USERP4= <user>
##$USERP5= <user>
##$WDW= 1
##$XDIM= 8192
##$YMAX_p= 0
##$YMIN_p= 0
$$ End of Bruker specific parameters
$$ ---------------------------------
##NTUPLES= NMR FID
##VAR_NAME=  TIME,          FID/REAL,        FID/IMAG
##SYMBOL=    X,             R,               I
##VAR_TYPE=  INDEPENDENT,   DEPENDENT,       DEPENDENT
##VAR_FORM=  AFFN,          ASDF,            ASDF
##VAR_DIM=   8192,          8192,            8192
##UNITS=     SECONDS,       ARBITRARY UNITS, ARBITRARY UNITS
##FACTOR=    0.0002004,     1,               1
##FIRST=     0,             0,               0
##LAST=      1.6414764,     0,               0
##MIN=       0,             -205333,         0
##MAX=       1.6414764,     257713,          0
$$ Real data points
##PAGE= N=1
##DATA TABLE= (X++(R..R)), XYDATA
$$ plain form
0 0 0 0 0 0 0 0 0 0 0 5 -8 8 -8 8 -15 16 -17 23 -25 31 -37 41 -49 56 -64 73 -85 95 -109 121 -138 154 -174
33 -174 194 -217 242 -270 299 -331 367 -408 452 -499 555 -612 680 -755 842 -939 1054 -1190
51 -1190 1350 -1548 1796 -2123 2564 -3211 4245 -6178 11093 -53915 -80466 -27288 -47931 -76413
65 -76413 -129348 -172757 -205333 -187151 -135871 -76073 -58474 -78115 -117854 -150362 -175209 -170248
77 -170248 -123536 -53629 -10500 -11876 -44700 -80168 -104764 -105038 -75524 -16627 39220 53401 19591
90 19591 -26559 -58855 -70901 -60546 -20851 28520 50843 27307 -27260 -77352 -102498 -101284
102 -101284 -80020 -41910 -8524 -15510 -66024 -125547 -159781 -163955 -145011 -108559 -69477 -54774
114 -54774 -82405 -136801 -179345 -182393 -156482 -118254 -74675 -40513 -42614 -82807 -126006 -138299
$$ packed form
0@%%%%%%%%%Nj3J6j6J6k3L1l3M0m8N6o8P8r0J05j20J37j58J80k04K30k59K92l28
33a74L68m11M59n12N69o30O98p75Q60r51J054j167J292j435J597j781J993k244
51a190K540k898L344l919M687n775P456j0423J7271o5008k6551N3178k0643k8482
65g6413n2935m3409l2576J8182N1280N9798J7599j9641l9739l2508k4847M961
77a70248M6712O9907M3129j376l2824l5468k4596k74K9514N8897N5847J4181l3810
90A9591m6150l2296j2046J0355L9695M9371K2323k3536n4567n0092k5146J214
102a01284K1264L8110L3386o986n0514n9523l4234m174J8944L6452L9082J4703
114e4774k7631n4396m2544l048K5911L8228M3579L4162k101m0193m3199j2293
$$ plain form
126 -138299 -115127 -71218 -25140 12584 26235 3850 -42280 -73672 -63506 -24456 18229 52119
138 52119 68214 51494 6843 -39372 -54209 -30985 9153 39311 48604 36987 53 -53385
150 -53385 -88417 -82480 -47216 -14542 930 -5520 -34151 -78832 -120066 -129713 -99898 -53968 -25967
163 -25967 -23839 -40043 -71387 -108559 -125373 -102858 -52666 -8927 8190 -677 -24348 -52258
175 -52258 -73394 -66854 -24445 28664 57562 53370 30691 989 -26655 -34350 -9659 36624 73468
188 73468 76297 48714 11452 -20298 -39598 -35328 -1216 38000 49781 27272 -12835 -50474
200 -50474 -74679 -77844 -56501 -19707 8244 2877 -33727 -73349 -95600 -100891 -85711 -48306 -9813
213 -9813 2585 -17384 -54919 -82284 -85808 -69680 -38783 1422 29706 25477 -7981 -40699 -50653
$$ packed form
126a38299K3172M3909M6078L7724J3651k2385m6130l1392J0166L9050M2685L3890
138E2119J6095j6720m4651m6215j4837K3224M0138L0158R293j1617l6934n3438
150e3385l5032N937L5264L2674J5472o450k8631m4681m1234r647K9815M5930K8001
163b5967K128j6204l1344l7172j6814K2515N0192M3739J7117q867k3671k7910
175e2258k1136O540M2409N3109K8898m192k2679k9702k7644p695K4691M6283L6844
188G3468K829k7583l7262l1750j9300M270L4112L9216J1781k2509m0107l7639
200e0474k4205l165K1343L6794K7951n367l6604l9622k2251n291J5180L7405L8493
213i813J2398j9969l7535k7365l524J6128L0897M0205K8284m229l3458l2718r954
$$ plain form
226 -50653 -40332 -14233 20987 52530 58914 34021 -6313 -33200 -31180 -9719 17265 44526
238 44526 58043 40635 -1882 -40696 -52716 -39107 -13353 12004 26240 19537 -12647 -56718
250 -56718 -82150 -74024 -47076 -19320 504 4424 -15841 -53095 -84452 -86912 -60935 -24141 2570
263 2570 12193 4069 -22807 -56254 -69561 -48857 -10666 21226 36650 33477 13032 -17454 -40019
276 -40019 -35389 -3614 33494 52642 50200 33066 4795 -25079 -35632 -15543 20104 46166
288 46166 47931 29996 2007 -27106 -46090 -40506 -9739 23954 34069 20489 -5054 -32749
300 -32749 -54596 -56409 -33379 2308 26212 23855 603 -26409 -46326 -52982 -39036 -3692 30588
313 30588 40158 22575 -4504 -27435 -36743 -27849 -467 34576 55758 47991 18293 -9155 -22046
$$ packed form
226e0653J0321K6099L5220L1543O384k4893m0334k6887K020K1461K6984K7261
238D4526J3517j7408m2517l8814j2020J3609K5754K5357J4236o703l2184m4071
250e6718k5432Q126K6948K7756J9824L920k0265l7254l1357k460K5977L6794K6711
263B570R623q124k6876l3447j3307K0704L8191L1892J5424l173k0445l0486k2565
276d0019M630L1775L7108J9148k442j7134k8271k9874j0553K0089L5647K6062
288D6166J765j7935k7989k9113j8984N584L0767L3693J0115j3580k5543k7695
300c2749k1847j813K3030L5687K3904k357k3252k7012j9917o656J3946L5344L4280
313C0588R570j7583k7079k2931r308Q894K7382L5043K1182p767k9698k7448j2891
$$ plain form
326 -22046 -20013 -1320 30262 56726 58556 34030 1450 -20764 -23258 -9557 14824 41668 54847
339 54847 38946 4082 -24550 -32177 -22727 -1861 24792 42507 38285 11138 -21937 -38816 -32256
352 -32256 -11109 13031 34009 40759 22818 -10291 -34669 -35205 -16729 9150 31689 42592 34029
365 34029 7083 -23669 -35376 -20254 6423 29238 42882 41228 20154 -11325 -31867 -27239
377 -27239 -3015 24667 40623 41489 27438 256 -27156 -34526 -15106 14770 35303 40358 30863
390 30863 6932 -20794 -36020 -26896 1077 28852 38794 30970 12137 -12815 -35004 -36118 -13146
403 -13146 16942 34680 32482 15036 -9047 -30646 -40149 -27887 1293 27385 31457 16860 -5792
416 -5792 -27627 -41814 -36840 -12821 15830 30607 22211 141 -22684 -36374 -37870 -21682 7650
$$ packed form
326b2046K033J8693L1582K6464J830k4526l2580k2214k494J3701K4381K6844J3179
339E4847j5901l4864k8632p627R450K0866K6653J7715m222k7147l3075j6879O560
352c2256K1147K4140K0978O750j7941l3109k4378n36J8476K5879K2539J0903q563
365C4029k6946l0752j1707J5122K6677K2815J3644j654k1074l1479k0542M628
377b7239K4224K7682J5956Q66j4051k7182k7412p370J9420K9876K0533N055r495
390C0863k3931k7726j5226R124K7973K7775R942p824j8833k4952k2189j114K2972
403a3146L0088J7738k198j7446k4083k1599r503J2262K9180K6092M072j4597k2652
416e792k1835j4187M974K4019K8651J4777q396k2070k2825j3690j496J6188K9332
$$ plain form
429 7650 31185 31414 12493 -11517 -28358 -33550 -22522 2728 29240 40600 27744 887 -20606
442 -20606 -28476 -22224 -3513 23165 40926 35735 10820 -15849 -30142 -27785 -12646 9681 29681
455 29681 33501 15523 -15121 -35923 -38141 -26444 -6368 15431 26089 17022 -9234 -36084 -44886
468 -44886 -34853 -14182 7348 22967 23262 3674 -23424 -39051 -32957 -13065 9779 28053 33802
481 33802 22958 -806 -22472 -26143 -8111 15525 34449 43464 37849 16492 -8870 -20782 -11943
494 -11943 10713 32045 41587 37554 20933 -4543 -25279 -26228 -7225 15462 28817 27528 14143
507 14143 -8965 -31705 -40777 -29270 -4021 16493 20414 10101 -8542 -29438 -43455 -37665 -13444
520 -13444 12982 25508 20704 4427 -14093 -28576 -28317 -10831 17683 38243 39105 24742 6704
$$ packed form
429G650K3535K29j8921k4010j6841n192J1028K5250K6512J1360j2856k6857k1493
442b0606p870O252J8711K6678J7761n191k4915k6669j4293K357J5139K2327K0000
455B9681L820j7978l0644k0802k218J1697K0076K1799J0658r067k6256k6850q802
468d4886J0033K0671K1530J5619K95j9588k7098j5627O094J9892K2844J8274N749
481C3802j0844k3764k1666l671J8032K3636J8924R015n615k1357k5362j1912Q839
494a1943K2656K1332R542m033j6621k5476k0736r49J9003K2687J3355j289j3385
507A4143k3108k2740r072J1507K5249K0514L921j0313j8643k0896j4017N790K4221
520a3444K6426J2526m804j6277j8520j4483K59J7486K8514K0560Q62j4363j8038
$$ plain form
533 6704 -9087 -15631 -5008 19851 43616 51441 40069 18097 -803 -10844 -7733 8355 32125
546 32125 46144 38108 16354 -5689 -19995 -22081 -10961 9068 26854 28620 11619 -13829 -30685
559 -30685 -33869 -26283 -7938 13973 25169 15773 -5924 -25642 -32288 -23891 -5827 15968 33611
572 33611 35055 17872 -4147 -14939 -8606 7857 28896 48047 55120 43924 21134 3255 1073
585 1073 14503 33883 50808 60340 54185 32404 8229 -2246 4258 21292 38526 48402 45606
598 45606 28168 2811 -15024 -15570 -431 18776 30037 32168 21579 319 -20725 -26916 -14445
611 -14445 7152 25455 32140 26249 11582 -7189 -18597 -11184 11586 34148 45146 44298 33346
624 33346 15257 2040 2178 18998 42947 58508 59587 48665 31273 14809 5939 14209 35391
$$ packed form
533F704j5791o544J0623K4859K3765P825j1372k1972j8900j0041L111J6088K3770
546C2125J4019q036k1754k2043j4306k086J1120K0029J7786J766j7001k5448j6856
559c0685l184P586J8345K1911J1196r396k1697j9718o646Q397J8064K1795J7643
572C3611J444j7183k2019j0792O333J6463K1039J9151P073j1196k2790j7879k182
585A073J3430J9380J6925R532o155k1781k4175j0475O504J7034J7234R876k796
598D5606j7438k5357j7835n46J5139J9207J1261K131j0589k1260k1044o191J2471
611a4445K1597J8303O685n891j4667j8771j1408P413K2770K2562J0998q48j0952
624C3346j8089j3217J38J6820K3949J5561J079j0922j7392j6464q870Q270K1182
$$ plain form
637 35391 53142 57351 46858 28118 7912 -5201 -4497 10076 30100 39958 31896 13083 -6414
650 -6414 -21520 -25931 -15013 4657 20419 21184 6449 -13373 -28446 -32975 -25867 -7470 14174
663 14174 24171 15532 -2085 -17265 -24157 -18898 -2869 19030 33826 33289 18286 -1120 -10871
676 -10871 -8793 2391 20137 37307 41663 28597 7487 -8743 -13286 -6299 8004 23301 30248
689 30248 23221 1656 -20649 -30442 -26586 -14782 -887 9891 7854 -8457 -29930 -45459 -45112
702 -45112 -32280 -16026 -2909 2039 -6853 -25533 -43300 -46144 -34600 -15829 980 10272 7328
715 7328 -6053 -24031 -32927 -25517 -6409 12656 23492 24019 13363 -4303 -18477 -18229 -4167
728 -4167 14468 27203 28367 19257 2268 -15212 -24145 -16708 1350 15475 19269 11851 -3468
$$ packed form
637C5391J7751M209j0493j8740k0206j3113P04J4573K0024R858q062j8813j9497
650f414j5106m411J0918J9670J5762P65j4735j9822j5073m529P108J8397K1644
663A4174R997q639j7617j5180o892N259J6029K1899J4796n37j5003j9406r751
676a0871K078J1184J7746J7170M356j3066k1110j6230m543O987J4303J5297O947
689C0248p027k1565k2305r793L856J1804J3895J0778k037j6311k1473j5529L47
702d5112J2832J6254J3117M948q892j8680j7767k844J1544J8771J6809R292k944
715G328j3381j7978q896P410J9108J9065J0836N27j0656j7666j4174K48J4062
728d167J8635J2735J164r110j6989j7480q933P437J8058J4125L794p418j5319
$$ plain form
741 -3468 -21917 -34830 -33504 -18819 -1545 7647 3395 -9694 -25426 -38618 -41706 -30301 -9950
754 -9950 4932 6546 -2174 -16203 -28547 -33749 -26226 -7576 11890 21062 15169 1566 -11352
767 -11352 -18617 -15913 -1795 18424 31345 29049 15627 -1003 -11207 -12476 -4163 11701 26717
780 26717 29770 16653 -1954 -16409 -22214 -17806 -4878 10730 17438 10567 -7870 -26516 -34544
793 -34544 -31789 -21243 -6079 5474 5368 -9177 -27436 -38618 -37910 -26448 -11572 2662 8129
806 8129 966 -15337 -29883 -31968 -22463 -8168 6904 16457 14338 185 -16199 -24251 -19461 -5505
820 -5505 9558 18878 19446 8996 -9190 -23185 -23782 -12785 943 11237 13801 5620 -10550 -27577
834 -27577 -34448 -28193 -13295 -45 3810 -431 -14066 -30896 -41918 -39387 -24630 -9366 -534
$$ packed form
741c468j8449j2913J326J4685J7274R192m252j3089j5732j3192l088J1405K0351
754i950J4882J614q720j4029j2344n202P523J8650J9466R172n893j3603j2918
767a1352p265K704J4118K0219J2921k296j3422j6630j0204j269Q313J5864J5016
780B6717L053j3117j8607j4455n805M408J2928J5608O708o871j8437j8646q028
793c4544K755J0546J5164J1553j06j4545j8259j1182P08J1462J4876J4234N467
806H129p163j6303j4546k085R505J4295J5072R553k119j4153j6384q052M790J3956
820e505J5063R320N68j0450j8186j3995n97J0997J3728J0294K564q181j6170j7027
834b7577o871O255J4898J3250L855m241j3635j6830j1022K531J4757J5264Q832
$$ plain form
847 -534 -1367 -11635 -25653 -38245 -39796 -27929 -9629 3082 5355 -859 -13161 -26198 -31532 -23825
861 -23825 -7766 8163 15189 9849 -1717 -14505 -23428 -22242 -9192 8126 17471 14716 3637
874 3637 -10377 -21974 -24715 -16478 -1350 11190 13306 2838 -11177 -23431 -28601 -25753 -12372
887 -12372 2809 9102 3539 -9721 -23068 -29980 -28800 -17548 -2491 9431 9299 -2588 -16665
900 -16665 -25296 -25371 -16866 -1984 11647 16813 9317 -4965 -17381 -19797 -13081 -1213 12710 21761
914 21761 18149 4423 -9905 -16809 -13902 -3093 10143 19974 20415 9866 -6804 -18239 -17631 -9512
928 -9512 3067 13773 18220 10935 -3918 -17657 -21964 -15770 -3457 8703 14143 12186 1072
941 1072 -13864 -22300 -18977 -6372 6447 15206 16006 7822 -5955 -16874 -17392 -7957 6050 16822
$$ packed form
847e34q33j0268j4018j2592j551J1867J8300J2711K273o214j2302j3037n334P707
861b3825J6059J5929P026n340j1566j2788q923J186J3050J7318R345k755j1079
874C637j4014j1597k741Q237J5128J2540K116j0468j4015j2254n170K848J3381
887a2372J5181O293n563j3260j3347o912J180J1252J5057J1922j32j1887j4077
900a6665q631p5Q505J4882J3631N166p496j4282j2416k416O716J1868J3923R051
914B1761l612j3726j4328o904K907J0809J3236R831M41j0549j6670j1435O08Q119
928i512J2579J0706M447p285j4853j3739m307O194J2313J2160N440j957j1114
941A072j4936q436L323J2605J2819Q759Q00q184j3777j0919n18R435J4007J0772
$$ plain form
955 16822 19559 14518 3117 -9739 -15860 -9118 4300 16444 21707 18275 8056 -5049 -13968
968 -13968 -12587 -1475 12675 20591 19304 10573 -1784 -13159 -15847 -7941 5967 17997 19388
981 19388 12089 -55 -10889 -16422 -12781 -389 14160 19621 15307 4118 -7265 -15014 -14107 -4399
995 -4399 9938 19105 18668 8530 -4017 -11957 -14083 -7991 5225 17758 20740 12988 694 -9779
1009 -9779 -13510 -10209 329 12666 20808 16833 4643 -7557 -13745 -12216 -4517 7599 17238 17975
1023 17975 8748 -5123 -14326 -14746 -7831 3091 13211 18487 12175 -751 -12781 -16066 -11077 -887
1037 -887 10237 16880 14810 3718 -9306 -17198 -14468 -4444 6048 13619 15166 6980 -5683 -16376
1051 -16376 -17437 -9982 1664 10723 14156 9418 -2726 -14372 -19573 -14020 -2568 7916 13272
$$ packed form
955A6822K737n041j1401j2856o121O742J3418J2144N263l432j0219j3105q919
968a3968J381J1112J4150P916j287q731j2357j1375k688P906J3908J2030J391
981A9388p299j2144j0834n533L641J2392J4549N461m314j1189j1383p749R07R708
995d399J4337R167m37j0138j2547p940k126O092J3216J2533K982p752j2294j0473
1009i779l731L301J0538J2337Q142l975j2190j2200o188J529P699J2116R639P37
1023A7975r227j3871r203m20O915J0922J0120N276o312j2926j2030l285M989J0190
1037h87J1124O643k070j1092j3024p892K730J0024J0492P571J547q186j2663j0693
1051a6376j061P455J1646R059L433m738j2144j1646n201N553J1452J0484N356
$$ plain form
1064 13272 11314 2367 -10469 -17982 -16736 -6400 5549 13548 13423 6044 -4644 -14608 -17251 -8984
1078 -8984 2778 12595 14794 9774 -282 -10521 -16737 -12969 -1762 9949 15099 11484 2809 -7402
1092 -7402 -15387 -16251 -7226 4850 12826 12306 4815 -5987 -14827 -18067 -12051 -182 10915 13081
1106 13081 7151 -2867 -11672 -16915 -14363 -3724 8012 14504 11529 2153 -8117 -13464 -13064 -5060
1120 -5060 6489 15661 16269 8348 -2442 -10841 -12556 -6794 3818 13520 18302 12923 1371 -8408
1134 -8408 -12174 -9425 -1445 8963 15821 13502 3724 -7969 -14340 -13672 -6183 3120 10847 12556 5576
1149 5576 -6115 -14785 -15471 -10390 -892 7717 11736 8196 -1656 -12132 -16443 -11885 -2559 6669 13144
1164 13144 12777 4891 -6477 -12797 -11200 -3157 6414 13790 15601 9539 -591 -9471 -12775 -5071
$$ packed form
1064A3272j958q947j2836p513J246J0336J1949P999j25p379j0688r964k643Q267
1078h984J1762R817K199n020j0056j0239o216L768J1207J1711N150l615q675j0211
1092g402p985q64R025J2076P976n20p491j0802q840l240O016J1869J1097K166
1106A3081n930j0018q805n243K552J0639J1736O492k975r376j0270n347M00Q004
1120e060J1549R172O08p921j0790q399j715N762J0612R702M782n379j1552r779
1134h408l766K749P980J0408O858k319r778j1693o371O68P489R303P727J709o980
1149E576j1691q670o86N081R498Q609M019l540r852j0476m311M558R326R228O475
1164A3144l67p886j1368o320J597Q043R571P376J811o062j0130q880l304P704
$$ plain form
1178 -5071 4393 12429 15141 11662 2085 -8440 -13837 -10767 -930 8270 12809 10492 2737 -7285
1192 -7285 -14425 -15304 -6832 3059 9781 10267 4329 -4996 -13681 -16478 -10990 32 9252 12063 8078
1207 8078 -30 -8259 -13092 -10400 -647 9770 15401 13570 6325 -2476 -8083 -8467 -1763 8848 16762
1222 16762 17710 10863 2294 -4890 -8079 -3922 5415 14698 17849 12521 3496 -4481 -9204 -7203 -406
1237 -406 9637 15538 13419 5070 -4899 -10647 -10696 -4575 4863 12870 14186 8099 -1663 -8744 -9568 -5727
1253 -5727 3174 12179 17201 13135 4260 -4008 -7384 -4353 3073 12296 18128 18439 10806 426 -5037
1268 -5037 -4578 1887 9934 16976 18274 12526 3929 -5301 -7076 -2866 6340 12746 15858 12981 3323
1283 3323 -5436 -10113 -7786 -437 7537 12177 11195 4571 -4198 -12021 -12182 -5391 4458 10246 11779
$$ packed form
1178e071R464Q036K712l479r577j0525n397L070R837R200M539k317p755j0022
1192g285p140q79Q472R891O722M86n938r325q685k797N488J1022R220K811l985
1207H078q108q229m833K692R753J0417N631j831p245q801n607l84O704J0611P914
1222A6762R48o847q569p184l189M157R337R283L151n328r025p977m723K001O797
1237d06J0043N901k119q349r969n748m9O121R438Q007J316o087r762p081q24L841
1253e727Q901R005N022m066q875q268l376L031P426R223N832L11p633j0380n463
1268e037M59O465Q047P042J298n748q597r230j775M210R206O406L112k877r658
1283C323q759m677K327P349P974M640r82o624q769p823j61O791R849N788J533
$$ plain form
1298 11779 7679 -1324 -8828 -11182 -6673 2019 10567 13760 10243 3528 -4578 -9325 -6897 828 9595
1313 9595 14770 13564 7156 -1998 -8006 -8745 -2865 6117 12827 13201 7513 -477 -8673 -11606 -8029
1328 -8029 370 8815 11097 7351 -674 -8077 -12607 -11358 -4373 4194 10045 8578 1506 -5568 -11000
1343 -11000 -12244 -6776 2250 9317 10494 5804 -1626 -7845 -9585 -6224 1300 10450 13825 11187 3806
1358 3806 -3875 -7510 -7125 1075 8341 14313 13893 6997 -2195 -6976 -7171 -2485 4514 11201 13069 8058
1374 8058 -248 -7509 -9548 -6140 1159 8204 12197 9491 1925 -6101 -10221 -8005 -1437 5662 11656
1389 11656 10906 4927 -3788 -8982 -8628 -3229 4686 10992 12693 9517 1731 -5947 -7707 -3766 2887
1404 2887 10233 13541 10996 4748 -2797 -7723 -6744 30 7555 11115 10525 6196 -2268 -8949 -9669 -5033
$$ packed form
1298A1779m100r003p504k354M509Q692Q548L193l517o715q106m747K428P725Q767
1313I595N175j206o408r154o008p39N880Q982O710L74n688p990q196k933L577
1328h029Q399Q445K282l746q025p403m530J249O985Q567N851j467p072p074n432
1343a1000j244N468R026P067J177m690p430o219j740L361P524R150L375k638p381
1358C806p681l635L85Q200P266N972m20o896r192m781j95M686O999O687J868n011
1374H058q306p261k039L408P299P045L993k706p566q026m120K216O568P099N994
1389A1656p50n979q715n194L54N399P915O306J701l176p786p678j760L941O653
1404B887P346L308k545o248p545m926R79O774P525L560n90m329q464o681p20M636
$$ plain form
1420 -5033 2572 8606 9215 4933 -1492 -8574 -12363 -9479 -1952 5251 8355 6224 -221 -7312 -12518
1435 -12518 -11488 -5021 3048 7678 6362 1975 -4879 -10469 -12372 -7220 1118 7082 8694 4612 -2443
1450 -2443 -9109 -11727 -9498 -1986 5029 8233 6389 -776 -7599 -11401 -11778 -6421 1765 6256 5608
1465 5608 446 -7182 -12772 -13387 -9931 -2441 3818 6114 1431 -5206 -11161 -13456 -11711 -5323 1911
1480 1911 5817 4712 -1932 -9325 -12526 -10701 -6358 931 6412 6152 2483 -4741 -10025 -10776 -6640
1495 -6640 38 5464 8425 5128 -2112 -8514 -10820 -8070 -1894 4321 8613 6948 726 -6766 -10668
1510 -10668 -9883 -3937 2724 6474 7023 3129 -3983 -10353 -11304 -5569 262 5432 7535 4883 -907
1525 -907 -7698 -10123 -7463 -31 6276 9070 8271 3065 -3873 -7476 -7090 -1736 5310 9626 9656 5303
$$ packed form
1420e033P605O034O09m282o425p082l789K884P527P203L104k131o445p091n206
1435a2518J030O467Q069M630j316m387o854n590j903N152Q338N964J612m082p055
1450b443o666k618K229P512P015L204j844p165o823l802l77N357Q186M491o48
1465E608n162p628n590o15L456P490O259K296m683o637n955k295J745O388P234
1480A911L906j105o644p393l201J825M343P289N481k60l669p224n284p51M136
1495f640O678N426K961l297p240o402k306K750O176O215M292j665o222p492l902
1510a0668P85N946O661L750N49l894p112o370r51N735N831N170K103k652n790
1525i07o791k425K660P432O307K794p99n206o938l603L86N354P046M316L0m353
$$ plain form
1541 5303 -696 -5937 -8040 -4553 3065 8963 10150 6622 1869 -5302 -8316 -6440 -468 6514 9980
1556 9980 7776 2679 -3983 -7971 -8136 -3112 3800 8017 8663 3637 -2550 -7380 -8649 -5873 560
1571 560 6929 8923 5755 -292 -5707 -8488 -7367 -1040 5705 9264 8134 2080 -4349 -7693 -7850
1586 -7850 -2720 3126 8452 8194 3994 -2546 -7298 -8909 -5761 776 5808 7965 5515 -1452 -7522
1601 -7522 -9759 -7580 -2529 2814 7110 6423 737 -6337 -9448 -9579 -4192 1019 5940 7207 2442
1616 2442 -3830 -8413 -9432 -5868 -137 5172 6708 5087 -1091 -6357 -9256 -7105 -1561 4998 6516
1631 6516 6746 2748 -3892 -8114 -8043 -3099 2611 6308 7205 4143 -1563 -7441 -8708 -5388 678 5794
1647 5794 6904 4806 -152 -5867 -8782 -6713 -1893 4465 7238 6691 1496 -3514 -7318 -7768 -3535
$$ packed form
1541E303n999n241k103L487P618N898J187l528m753p171l014J876N972O982L466
1556I980k204n097o662l988j65N024O912M217O46n026o187m830j269K776O433
1571E60O369J994l168o047n415k781J121O327O745L559j130o054o429l344j57
1586g850N130N846N326k58m200o540m752j611L148O537N032K157k450o967o070
1601g522k237K179N051N343M296o87n686p074l111j31N387N211M921J267m765
1616B442o272m583j019L564N731N309J536j621o178n266k899K151N544O559J518
1631F516K30l998o640m222P1M944N710L697Q97l062n706n878j267L320O066N116
1647E794J110k098m958n715k915K069M820O358K773n47n195n010l804m50M233
$$ plain form
1662 -3535 3408 7643 7470 4705 -789 -6205 -8019 -4429 1102 6567 8273 5967 697 -4169 -6912
1677 -6912 -5579 -1440 5487 8687 7382 3185 -2678 -6062 -6526 -2711 3080 8674 8646 3996 -1281 -5539
1693 -5539 -7439 -5148 1129 6589 8190 5397 512 -4398 -6958 -5967 -1589 3380 7922 7347 2186
1708 2186 -3406 -6782 -7409 -2664 2431 6770 8187 4548 -2363 -6108 -7542 -4681 103 5233 7239
1723 7239 5147 -160 -5357 -8282 -6095 -2486 2958 5963 6199 1659 -3822 -8115 -7720 -3495 565
1738 565 4763 6257 3015 -2425 -7141 -8592 -6456 -682 3638 5307 4812 48 -6257 -9194 -7669
1753 -7669 -1837 2372 5751 5151 342 -4032 -7958 -8375 -4659 644 4790 4778 1991 -2957 -7275 -8977
1769 -8977 -6448 -1357 3339 5329 3703 -1470 -5833 -8952 -8284 -3689 2301 4956 3970 -27 -3948
$$ packed form
1662c535O943M235j73k765n494n416j814L590N531N465J706k306n270m866k743
1677f912J333M139O927L200j305m197n863l384m64L815N791N594k8m650n277m258
1693e539j900K291O277N460J601k793m885m910k560R91M378M969M542n75n161
1708B186n592l376o27M745N095M339J417l639o911l745j434K861M784N130K006
1723G239k092n307n197k925K187L609N444L005K36m540n481m293L95M225M060
1738E65M198J494l242n440m716j451K136N774M320J669m95m764o305k937J525
1753g669N832M209L379o00m809m374l926m17L716N303M146j2k787m948m318j702
1769h977K529N091M696J990j626n173m363l119O68M595N990K655r86l997l921
$$ plain form
1784 -3948 -8054 -8619 -4700 1188 4762 5585 2468 -2387 -6741 -8183 -5715 -1326 4719 6459 4244
1799 4244 591 -4888 -7309 -6728 -3296 2313 6261 6243 977 -3537 -6370 -7362 -5120 175 4817 5479
1815 5479 2690 -2839 -6747 -7900 -5987 -1667 3051 7180 4090 3 -5157 -7403 -6368 -2613 2563
1830 2563 5985 5677 1688 -2769 -5848 -5745 -2933 1655 6831 7656 4888 206 -4926 -5861 -4150 937
1846 937 5657 7526 6648 1885 -2799 -6455 -5044 -1317 3488 6718 6885 3352 -1885 -6087 -6162 -3712
1862 -3712 1736 5481 6683 3980 91 -5040 -7017 -3904 49 4812 6404 5614 1796 -3029 -5432
1877 -5432 -4947 -1136 4362 7554 7290 4521 -621 -3983 -4774 -1410 3337 6623 8238 5849 1956 -2743
1893 -2743 -4875 -3976 1410 5460 7466 5981 2508 -2203 -5365 -5093 -1903 2738 5888 6522 2653 -2557
$$ packed form
1784c948m106n65L919N888L574Q23l117m855m354j442K468M389O045J740k215
1799D244l653n479k421N81L432N609L948j8n266m514k833r92K242N295M642O62
1815E479k789n529l908j153J913M320M718M129l090m087n160k246J035L755N176
1830B563L422l08l989m457l079J03K812M588N176Q25k768m682n132r35J711N087
1846I37M720J869q78m763m684l656J411L727M805L230J67l533n237m202p5K450
1862c712N448L745J202k703l889n131j977L113L953M763J592p90l818m825k403
1877e432M85L811N498L192k64k769n142l362p91L364M747L286J615k389l893m699
1893b743k132Q99N386M050K006j485l473m711l162K72L190M641L150O34l869n210
$$ plain form
1909 -2557 -5716 -6120 -4163 -208 4786 5952 3781 -511 -4667 -6376 -4369 -562 3886 6898 5903
1924 5903 1540 -1995 -5156 -4699 -1187 3915 7703 7519 4139 518 -3716 -4547 -1346 2779 6390 8315
1940 8315 5707 1200 -3277 -4696 -3646 378 4402 6272 5903 2342 -3120 -5889 -5344 -2423 1855
1955 1855 4266 5420 3509 -2194 -5216 -6034 -3813 268 3799 6096 4310 406 -4089 -5842 -3803
1970 -3803 146 4848 6390 6789 3027 -1526 -4194 -3452 138 4610 8053 7671 5453 1793 -2160 -2991
1986 -2991 -533 3433 7161 7988 6949 2549 -1895 -4273 -3268 1025 5049 7034 5852 2963 -1297
2001 -1297 -4720 -5258 -2163 3076 5431 5541 3622 -1024 -4892 -5062 -3637 1001 5857 6621 4839 1276
2017 1276 -2478 -3900 -2763 1213 5057 7753 7331 4126 86 -2904 -2212 379 4568 7953 8674 5678
$$ packed form
1909b557l159m04J957L955M994J166k171m292m156j709K007L807M448L012r95
1924E903m363l535l161M57L512N102L788j84l380l621m234q31L201M125L611J925
1940H315k608m507m477j419J050M024M024J870l69l561n462k769N45K921M278
1955A855K411J154j911n703l022q18K221M081L531K297j786l904m495j753K039
1970c803L949M702J542L99l762m553k668P42L590M472L443l82k218l660l953q31
1986b991K458L966L728Q27j039m400m444k378J005M293M024J985j182k889m260
2001a297l423n38L095N239K355J10j919m646l868j70J425M638M856P64j782l563
2017A276l754j422J137L976L844K696m22l205m040k990O92K591M189L385P21k996
$$ plain form
2033 5678 1732 -2092 -3113 -1479 2664 6484 7209 5784 805 -2817 -4326 -3862 -527 2783 5711
2048 5711 4311 939 -3083 -5999 -6127 -4255 305 3268 4061 1837 -2166 -5644 -6369 -4402 -129 3774
2064 3774 4946 3737 14 -3837 -5234 -3937 -532 3184 5639 4727 2237 -1662 -4967 -3908 -1429
2079 -1429 1846 5357 6095 3694 -762 -4526 -5514 -3910 348 3014 4101 3042 -426 -4616 -7476
2094 -7476 -7080 -3203 788 2904 2127 -915 -4617 -8373 -7457 -5210 -1215 1651 2547 1346 -2958 -6040
2110 -6040 -7520 -5555 -1143 2761 4401 2917 -471 -3178 -5061 -4776 -1497 3202 5502 5804 2682
2125 2682 -662 -3580 -4336 -1482 2363 4508 5820 3916 -300 -2475 -5171 -3730 -947 3520 5203
2140 5203 3761 -294 -3260 -5904 -5189 -2383 1159 4260 3026 498 -3122 -5451 -6304 -3619 -171
$$ packed form
2033E678l946l824j021J634M143L820P25j425m979l622j509M64L335L310K928
2048E711j400l372m022k916j28J872M560K963P93k224m003l478p25J967M273L903
2064C774J172j209l723l851j397J297L405L716K455r12k490l899l305J059K479
2079a429L275L511P38k401m456l764r88J604M258K666J087j059l468m190k860
2094g476L96L877L991K116p77l042l702l756R16K247L995K866Q96j201m304l082
2110f040j480J965M412L904J640j484l388k707j883K85L279M699K300L02l122
2125B682l344k918p56K854L845K145J312j904m216k175k696J441K783M467J683
2140E203j442m055k966k644P15K806L542L101j234k528l620k329q53K685L448
$$ plain form
2155 -171 3626 4441 3002 -637 -3822 -5118 -3649 110 3924 6761 4872 1634 -1314 -3215 -3218 1026
2171 1026 4219 6792 6400 4172 -525 -2612 -2878 -646 3069 6417 7092 4651 353 -3066 -4284 -3118
2187 -3118 -381 3406 4626 3744 128 -4432 -5888 -4822 -2728 1085 3088 3346 669 -2928 -5852
2202 -5852 -5792 -3472 -759 2149 3959 2145 -970 -4691 -5939 -3889 -399 3408 4042 4178 1661 -2307
2218 -2307 -4836 -4227 -1380 2857 4681 4803 2261 -852 -4199 -4725 -2750 497 3544 4304 2491 -1171
2234 -1171 -4956 -6007 -4857 -1562 1704 2467 1599 -1284 -4794 -7532 -6577 -4117 -257 2388 1821 -545
2250 -545 -3600 -6238 -7245 -5091 -1527 2002 2903 1198 -1402 -4971 -5363 -4532 -954 2858 4303 3386
2266 3386 1229 -2575 -4729 -4663 -1219 2631 4919 5298 2432 -398 -3364 -4281 -1896 305 3512 4534
$$ packed form
2155a71L797Q15j439l639l185j296J469L759L814K837j889l238k948j901lM244
2171A026L193K573l92k228m697k087k66K232L715L348O75k441m298l419j218J166
2187c118K737L787J220q82l616m560j456J066K094L813K003K58k677l597k924
2202e852O0K320K713K908J810j814l115l721j248K050L490L807O34J36k517l968
2218b307k529O09K847M237J824J22k542l113l347n26J975L247L047P60j813l662
2234a171l785j051J150L295L266P63q68k883l510k738R55K460L860K645n67k366
2250e45l055k638j007K154L564L529R01j705k600l569l92Q31L578L812J445r17
2266C386k157l804k154O6L444L850K288L79k866k830k966r17K385K201L207J022
$$ plain form
2282 4534 2488 -711 -3357 -4914 -4495 -936 2391 3438 3158 -687 -4503 -5573 -5553 -2970 754 2921
2298 2921 2949 1344 -2810 -5732 -6009 -2986 -479 3000 3916 3254 -97 -3713 -4494 -2554 -92 3467
2314 3467 5315 4879 1999 -1219 -3423 -3192 -653 3272 5418 5352 3559 172 -3230 -4045 -1797 1414
2330 1414 3465 4662 2698 -911 -2957 -5606 -4829 -1640 1503 2657 2128 -442 -4282 -6044 -6284 -4137
2346 -4137 668 1718 1996 404 -3308 -5858 -6810 -4638 -909 2151 3162 1844 -1062 -3862 -5384
2361 -5384 -4318 -1335 2622 3059 3321 772 -2344 -4437 -4378 -2236 1144 3494 3763 1920 -491 -4479
2377 -4479 -5165 -3156 -706 2205 2603 634 -2292 -4812 -6799 -6701 -2826 170 1780 761 -1393 -4901
2393 -4901 -6893 -6989 -4900 -1188 763 1069 -1063 -4055 -6453 -6393 -4552 -2262 1673 2802 1480 -979
$$ packed form
2282D534k046l199k646j557M19L559L327J047k80l845l816j070K0K583L724K167
2298B921K8j605m154k922k77L023K507L479R16o62l351l616p81J940K462L559
2314C467J848m36k880l218k204K31K539L925K146o6j793l387l402q15K248L211
2330A414K051J197j964l609k046k649P77L189L143J154n29k570l840j762k40K147
2346d137M805J050K78j592l712k550r52K172L729L060J011j318k906k800j522
2361e384J066K983L957M37K62k549l116k093N9K142L380K350K69j843k411l988
2377d479o86K009K450K911L98j969k926k520j987R8L875K996J610j019k154l508
2393d901j992r6K089L712J951L06k132k992k398O0J841K290L935J129j322k459
$$ plain form
2409 -979 -4400 -4755 -3841 -1100 1665 3597 3058 1042 -2334 -5109 -4497 -1706 1576 3647 4428 2120
2425 2120 -1440 -4872 -5289 -3661 -640 2013 3086 1849 -1264 -4435 -5794 -5630 -2706 207 2081
2440 2081 1433 -966 -5081 -6319 -5924 -4394 -494 1910 2228 473 -2396 -5270 -5271 -3866 -778 2426
2456 2426 3146 2530 -328 -3209 -4700 -3088 -692 2561 4888 4148 1779 -1136 -3524 -3967 -1888 1106
2472 1106 3736 4198 2301 -724 -4532 -3964 -3856 -468 2409 3082 1473 -904 -4243 -5886 -5488 -2863
2488 -2863 -189 2611 1085 -1269 -3198 -6107 -5918 -3678 -686 2537 2118 494 -2174 -4179 -4672 -3943
2504 -3943 -71 2040 4121 2819 1068 -2052 -3359 -2616 -130 2847 5060 4267 1705 -1398 -3163
2519 -3163 -2724 -1082 1482 4004 4444 2697 -426 -2840 -3801 -3226 -856 1920 3642 1957 -662 -3781
$$ packed form
2409i79l421l55R14K741K765J932n39k016l376k775O12K791L282K071P81k308
2425B120l560l432m17J628L021K653J073j237l113l171j359J64K924K913J874
2440B081o48k399m115j238L95J530L900K404L18j755k869k874jJ405L088L204
2456B426P20o16k858k881j491J612K396L253K327p40k369k915k388m43K079K994
2472A106K630M62j897l025l808N68J08L388K877O73j609k377l339j643L98K625
2488b863K674K800j526k354j929k909J89K240K992L223m19j624k668k005m93P29
2504c943L872K111K081j302j751l120j307P43K486K977K213p93k562l103j765
2519c163M39J642K564K522M40j747l123k414r61N75K370K776J722j685k619l119
$$ plain form
2535 -3781 -4523 -4347 -1925 1139 3259 3098 938 -2413 -4565 -4720 -2333 670 3219 3690 2258 -235
2551 -235 -2729 -3043 -1922 1114 3692 6270 4608 1583 -371 -1977 -2068 1217 3996 5810 5653 3193
2567 3193 13 -1664 -2591 -411 2747 4720 5289 3165 835 -2181 -3088 -2125 1092 2480 4275 3429
2583 3429 342 -2180 -4131 -3116 -1508 1851 4210 3809 1021 -976 -3374 -3079 -1859 2011 4129
2598 4129 4627 3300 663 -1506 -3059 -1374 1392 3997 6353 5080 2628 -72 -1510 -774 1368
2613 1368 4472 5814 5329 3203 523 -1570 -2598 -261 2431 4367 5275 3587 749 -2090 -2669 -2689
2629 -2689 -93 2376 4862 4032 649 -2344 -3894 -3420 -1515 1703 3319 3902 1719 -1927 -3655 -3287
2645 -3287 -1268 1898 4154 4849 2783 966 -2188 -2701 -1440 1235 3608 4641 4551 2111 -435 -2346
$$ packed form
2535c781p42J76K422L064K120j61k160l351k152j55K387L003K549M71j432k493
2551b35k494l14J121L036K578K578j662l025j954j606r1L285K779J814j57k460
2567C193l180j677r27K180L158J973N69k124k330l016r07R63L217J388J795q46
2583C429l087k522j951J015J608L359K359m01k788j997k398K95J220L870K118
2598D129M98j327k637k169j553J685K766K605K356j273k452k700j438P36K142
2613A368L104J342m85k126k680k093j028K337K692J936R08j688k838k839n79k0
2629b689K596K469K486q30l383k993j550M74J905L218J616N83k183l646j728L68
2645c287K019L166K256O95k066j817l154n13J261K675K373J033r0k440k546j911
$$ plain form
2661 -2346 -1330 787 2524 5168 5133 2894 26 -1992 -2623 -973 2061 3738 3780 2720 296 -1829
2677 -1829 -3756 -2701 148 2842 3499 2304 503 -2617 -4908 -4294 -1342 673 2736 2796 798 -1893
2693 -1893 -3782 -3772 -1842 406 3206 3716 2316 -243 -2948 -3068 -2151 670 3152 4796 3245 643
2709 643 -1147 -2875 -2649 -544 2784 3869 4169 2193 -728 -2392 -2737 -1712 726 3059 4268 2692
2725 2692 -1468 -3235 -3928 -2516 -451 1685 2508 2178 53 -3153 -4496 -4203 -2779 201 2381 2496
2741 2496 1021 -1989 -3402 -4387 -2507 481 2421 3656 2042 -626 -2498 -2764 -2591 377 3002 3838
2757 3838 4191 1550 -1264 -2178 -2217 444 2622 3611 4099 2442 -680 -2133 -2674 -1162 1002 3765 4045
2774 4045 2529 -150 -2607 -4046 -2720 -470 1825 2837 2317 -14 -2573 -4140 -3846 -2516 706
$$ packed form
2661b346J016K117J737K644l5k239k868k018o31J650L034J677M2j060k424k125
2677a829j927J055K849K694O57j195j801l120k291O14K952K015K063O0j998k691
2693a893j889J0J930K248K800N10j400k559k705j20R17K821K482J644j551k602
2709F43j790j728K26K105L328J085L00j976k921j664l45J025K438K333J209j576
2725B692m160j767o93J412K065K136Q23l30k125l206j343K93J424K980K180J15
2741B496j475l010j413r85J880K988J940J235j614k668j872k66J73K968K625Q36
2757C838L53k641k814r14l9K661K178R89M88j657l122j453n41J512K164K763K80
2774D045j516k679k457j439J326K250K295J012n20k331k559j567K94J330L222
$$ plain form
2789 706 2251 2518 653 -1825 -3986 -4377 -1783 376 2557 4326 2180 522 -2488 -3261 -2622 260
2805 260 2462 4893 3563 2232 -543 -2427 -1337 -700 2518 3982 3416 2121 -587 -2180 -3232 -1831
2821 -1831 80 2350 2812 2361 -608 -3411 -3857 -3522 -1430 694 2038 1819 -1083 -3761 -4718 -5378 -2805
2838 -2805 -424 1192 1471 -444 -3006 -4298 -4555 -2893 -254 1510 2856 1771 -606 -3049 -3691 -2619
2854 -2619 -1220 1439 3208 3000 1432 -1352 -3414 -2935 -1633 185 2208 2546 2045 -727 -3353 -4413
2870 -4413 -2872 -319 915 1867 551 -2089 -4239 -6241 -4628 -2859 -972 627 398 -1093 -3699
2885 -3699 -5171 -5298 -3354 -786 820 1178 -620 -2600 -4441 -4913 -3261 -643 1669 2560 1841 -252
2901 -252 -1864 -3564 -2513 -420 1598 3659 3175 2073 -961 -2596 -2624 -1296 2047 3165 2472 1692
$$ packed form
2789G06J545K67j865k478k161l91K594K159K181J769k146j658l010p73O39K882
2805B60K202K431j330j331k775j884J090O37L218J464n66j295k708j593j052J401
2821a831J911K270M62m51k969k803m46L35K092K124J344k19k902k678r57o60K573
2838b805K381J616K79j915k562j292k57J662K639J764J346j085k377k443o42J072
2854b619J399K659J769k08j568k784k062M79J302J818K023L38n01k772k626j060
2870d413J541K553J234R52j316k640k150k002J613J769J887J599k29j491k606
2885c699j472j27J944K568J606L58j798j980j841m72J652K618K312Q91p19k093
2901b52j612j700J051K093K018K061m84j102l034j635k8J328L343J118o93p80
$$ plain form
2917 1692 -510 -4084 -3847 -2726 -234 2008 2502 1161 -612 -3783 -4527 -4806 -1898 -301 1562 1588
2933 1588 -336 -2490 -4823 -4158 -2508 -488 1936 2735 1173 -1200 -2339 -2599 -1973 937 3126 4555
2949 4555 3128 996 -1451 -1636 -747 1030 2316 4567 4494 1628 -322 -1476 -1570 -677 1932 3121 3284
2966 3284 1307 -1177 -3013 -3074 -2295 -621 1003 3068 1295 -2259 -3596 -4552 -4120 -1783 167 1718
2982 1718 1573 -646 -3019 -4197 -3326 -1865 32 2776 2436 770 -1058 -2279 -3122 -1389 473 2318
2998 2318 3916 3311 919 -1682 -2687 -1684 243 2490 3282 3090 1947 -1258 -2447 -3104 -1603 47
3014 47 2828 1618 1068 -1300 -4235 -4309 -3893 -1757 614 1615 -322 -2013 -4031 -5447 -5239 -2852 -17
3031 -17 533 182 -1165 -3687 -4355 -4532 -3035 -1015 915 1976 468 -1241 -3097 -2996 -2064 493 2442
$$ packed form
2917A692k202l574K37J121K492K242M94j341j773l171p44k79K908J597J863K6
2933A588j924k154k333O65J650K020K424P99j562k373j139k60O26K910K189J429
2949D555j427k132k447j85Q89J777J286K251p3k866j950j154r4Q93K609J189J63
2966C284j977k484j836o1P79J674J624K065j773l554j337r56M32K337J950J551
2982A718j45k219k373j178Q71J461J897K744l40j666j828j221q43J733J862J845
2998B318J598o05k392k601j005J003J927K247P92j92j143l205j189o57J501J650
3014D7K781j210n50k368k935p4M16K136K371J001j937j691k018j416K08K387K835
3031a7N50l51j347k522o68j77J497K020J930J061j508j709j856J01R32K557J949
$$ plain form
3048 2442 3027 2327 358 -2656 -2469 -2483 -748 1116 2557 2220 401 -1923 -3231 -4050 -2632 -845 1001
3065 1001 1207 42 -1997 -4005 -4869 -4301 -2300 -442 707 -667 -2108 -3900 -5540 -4475 -2267 36
3081 36 631 1244 -578 -2670 -4286 -3711 -2156 -345 1623 2377 1158 -921 -2143 -3398 -1199 -236 2357
3098 2357 3474 2153 693 -1359 -3043 -2803 -786 1488 2745 1900 445 -1958 -3236 -4139 -2037 -70
3114 -70 985 2073 273 -2143 -3541 -4244 -3724 -938 283 1576 604 -681 -2658 -4459 -4039 -1934
3130 -1934 280 1636 1858 621 -1358 -3128 -3053 -1746 1170 2368 2796 2720 428 -1404 -2023 -1465 688
3147 688 2769 3527 2537 933 -1071 -3093 -2210 -337 2002 2533 1971 709 -1686 -2934 -3373 -2147 241
3164 241 1841 1597 69 -1398 -3472 -3625 -3061 -942 1136 2510 1643 -500 -2311 -2808 -2628 -874 960
$$ packed form
3048B442N85p00j969l014J87j4J735J864J441l37j819k324j308q19J418J787J846
3065A001K06j165k039k008q64N68K001J858J149j374j441j792j640J065K208K303
3081C6N95O13j822k092j616N75J555J811J968P54j219k079j222j255K199R63K593
3098B357J117j321j460k052j684K40K017K274J257q45j455k403j278r03K102J967
3114g0J055J088j800k416j398p03N20K786J221J293r72j285j977j801M20K105
3130a934K214J356K22j237j979j770P5J307K916J198M28p6k292j832o19N58K153
3147F88K081P58r90j604k004k022Q83J873K339N31n62j262k395j248m39J226K388
3164B41J600k44j528j467k074j53N64K119K078J374q67k143j811m97J80J754J834
$$ plain form
3181 960 2514 2112 660 -458 -2284 -2384 -1009 827 2833 3673 2428 477 -1296 -2271 -1053 710
3197 710 2350 3955 2577 1505 -1068 -2504 -1796 -189 1512 2459 2398 317 -1236 -2913 -2880 -1590 -392
3214 -392 1481 2757 981 -1177 -2947 -3218 -2692 97 711 2266 1636 -61 -2132 -3347 -2181 -664
3230 -664 886 1880 2628 1137 -575 -2651 -1827 -675 1178 2255 3087 1748 -164 -1812 -1921 -1687 96
3247 96 2242 3362 2291 1027 -1462 -2398 -2454 -740 1712 2791 2074 1116 -1051 -2355 -2928 -1970 -47
3264 -47 1717 2010 1109 -695 -2816 -2978 -2269 -491 1576 2025 2173 -686 -1934 -2762 -2629 -828 1518
3281 1518 2615 2180 787 -564 -1968 -2470 -1067 865 2203 2455 1676 -672 -1650 -2802 -1602 -79
3297 -79 1811 2690 2294 1001 -595 -2707 -2126 -699 1180 2448 2477 1115 -1139 -2401 -2289 -1066 247
$$ packed form
3181I60J554m02j452j118j826j00J375J836K006Q40j245j951j773r75J218J763
3197G10J640J605j378j072k573j436P08J607J701R47o1k081j553j677L3J290J198
3214c92J873J276j776k158j770k71N26K789O14J555o30j697k071j215J166J517
3230f64J550R94P48j491j712k076Q24J152J853J077Q32j339j912j648j09K34J783
3247I6K146J120j071j264k489r36n6J714K452J079p17r58k167j304n73R58J923
3264d7J764K93r01j804k121j62P09J778K067M49J48k859j248q28J33J801K346
3281A518J097m35j393j351j404n02J403J932J338K52p79k348r78j152J200J523
3297g9J890Q79l96j293j596k112N81J427J879J268K9j362k254j262J12J223J313
$$ plain form
3314 247 2443 2972 2014 200 -1930 -2863 -2730 -93 1835 2548 2292 491 -1024 -2542 -1532 -239 1108
3331 1108 3099 2819 1595 -456 -1343 -1919 -1115 726 2802 2926 1913 737 -1379 -1821 -1206 -79 2024
3348 2024 3376 2850 1740 -456 -1382 -995 -216 1890 3179 3014 2030 118 -1195 -1421 -690 1451 2560
3365 2560 2804 2592 223 -1774 -2138 -1312 635 1616 2749 2458 1755 -595 -1987 -1987 -531 1494 2728
3382 2728 2581 1753 -140 -1608 -2443 -413 838 2356 3192 2448 819 -1117 -1877 -1405 523 2244 3388
3399 3388 2352 1067 -719 -1445 -1794 -321 851 2736 2818 1224 203 -1315 -1748 -1579 150 2470
3415 2470 2536 1090 -655 -1786 -2769 -1778 -633 1046 1834 1474 117 -1429 -3015 -2832 -1757 405 1411
3432 1411 1527 766 -1329 -2636 -2331 -2089 -165 1307 2448 1114 -732 -1801 -2525 -1857 -1076 1143 1591
$$ packed form
3314B47K196N29r58j814k130r33J33K637J928P13k56j801j515j518J010J293J347
3331A108J991k80j224k051q87n76Q04J841K076J24j013j176k116m42O15J127K103
3348B024J352n26j110k196r26L87P79K106J289j65r84j912j313k26P31K141J109
3365B560K44k12k369j997l64Q26J947R81J133k91p03k350j392%J456K025J234
3382B728j47q28j893j468q35K030J251J518Q36p44j629j936p60M72J928J721J144
3399C388j036j285j786p26l49J473J172J885Q2j594j021j518m33J69J729K320
3415B470O6j446j745j131r83R91J145J679P88l60j357j546j586J83J075K162J006
3432A411J16p61k095j307L05K42J924J472J141j334j846j069p24O68P81K219M48
$$ plain form
3449 1591 1641 448 -1623 -2465 -2573 -953 627 1920 2017 1005 -1613 -2783 -3291 -2179 -484 1059 845
3466 845 594 -782 -2274 -3456 -3337 -1835 -156 939 463 -1042 -2439 -3358 -3770 -1986 -289 1068
3482 1068 607 724 -1025 -2309 -2223 -2045 -90 1339 1662 939 55 -1554 -2477 -2256 -293 1358 2548
3499 2548 1927 809 -864 -2250 -2451 -1286 755 1731 1475 765 -902 -2092 -2645 -2077 -1069 490 1738
3516 1738 511 -814 -2328 -3722 -3377 -1258 373 778 1140 451 -1844 -2810 -3193 -1392 -147 1708
3532 1708 1878 477 -398 -1926 -2206 -1131 329 2203 2255 2463 657 -512 -1531 -1228 76 1350 2415
3549 2415 2349 1451 -431 -1927 -1869 -899 998 2434 2121 1201 -966 -1313 -2507 -1809 -456 969 1693 282
3567 282 -1149 -2188 -3400 -2973 -1221 587 1435 1293 -392 -1193 -2652 -2328 -1069 557 1790 2366 1090
$$ packed form
3449A591N0j193k071q42j08J620J580J293R7j012k618j170n08J112J695J543k14
3466H45k51j376j492j182J19J502J679J095m76j505j397r19m12J784J697J357
3482A068m61J17j749j284Q6J78J955J429L23p23q84j609r23K21J963J651J190
3499B548o21j118j673j386k01J165K041R76k56p10j667j190n53N68J008J559J248
3516A738j227j325j514j394L45K119J631M05L62o89k295r66l83J801J245J855
3532A708J70j401q75j528k80J075J460J874N2K08j806j169j019L03J304J274J065
3549B415o6q98j882j496N8R70J897J436l13r20k167l47j194O98J353J425P24j411
3567B82j431j039j212M27J752J808Q48j42j685q01j459L24J259J626J233N76j276
$$ plain form
3584 1090 -72 -2036 -2700 -881 542 1848 2439 1627 464 -671 -1860 -1739 148 1582 1607 1863 1084
3601 1084 -1110 -2362 -2443 -1316 483 1487 1659 274 -1236 -2189 -2775 -2945 -1935 283 803 1036 -931
3618 -931 -2583 -3276 -2879 -1585 121 691 1106 -327 -1587 -1998 -2328 -1841 -170 762 2435 514 338
3635 338 -1397 -1908 -1706 183 1786 1939 1295 16 -685 -1706 -1855 -427 1019 1491 1915 553 -1254
3652 -1254 -2708 -2609 -1381 -160 849 790 210 -1495 -2991 -3356 -2285 -706 -189 1219 360 -486 -1792
3669 -1792 -2730 -2872 -1166 484 1064 1195 127 -715 -2047 -1892 -839 447 1994 2469 1137 489 -1523
3686 -1523 -2331 -749 -607 1527 2625 2387 460 -638 -1682 -1324 -109 1407 1701 1817 271 -1758
3702 -1758 -2111 -2420 -1205 -346 1233 1083 431 -832 -2654 -2016 -2288 -923 1389 1158 1079 12 -1126
$$ packed form
3584A090j162j964o64J819J423J306N91q12j163j135j189J21J887J434K5K56p79
3601A084k194j252q1J127J799J004J72j385j510r53n86j70J010K218N20K33j967
3618i31j652o93L97J294J706N70M15j433j260m11l30M87J671R32J673j921j76
3635C38j735n11K02J889J603J53o44j279p01j021j49J428J446M72M24j362j807
3652a254j454R9J228J221J009n9n80j705j496l65J071J579N17J408q59q46j306
3669a792r38j42J706J650N80J31j068q42j332J55J053J286J547M75j332o48k012
3686a523q08J582J42K134J098k38j927j098j044L58J215J516K94J16j546k029
3702a758l53l09J215Q59J579j50o52j263j822O38k72J365K312k31p9j067j138
$$ plain form
3719 -1126 -2319 -1456 -417 1028 2249 2219 712 59 -1336 -1466 -291 840 2602 2320 2232 828 -525
3736 -525 -1353 -1253 711 2293 2187 2085 1559 -411 -1262 -1504 -764 1092 1849 1570 531 -503 -2091 -1977
3754 -1977 -1582 778 1713 1509 1052 -324 -2157 -1718 -1418 -267 870 2547 1719 399 -591 -1898 -722
3771 -722 -675 1321 2023 2405 1013 -213 -1589 -1557 -401 857 2104 2754 2010 376 -1161 -1507 -992 157
3789 157 1320 1773 1438 894 -199 -2235 -1502 -288 842 1327 987 292 -1118 -1854 -2174 -1337 -402 1296
3807 1296 1193 474 -322 -1465 -1954 -1755 -484 1143 1626 1204 383 -818 -1255 -1476 -524 297 1494 1539
3825 1539 707 -363 -1663 -1504 -931 264 1579 2346 1137 -251 -1205 -1916 -1699 3 919 1703 596
3842 596 226 -1517 -2053 -2051 -1101 322 1361 800 -125 -842 -2373 -2492 -2038 -471 745 1702 519 -270
$$ packed form
3719a126j193Q63J039J445J221l0j507o53j395j30J175J131J762k82q8j404j353
3736e25q28J00J964J582j06j02n26j970q51k42P40J856P57k79j039j034j588J14
3754a977L95K360R35k04m57j376j833M39L00J151J137J677q28j320r90j307J176
3771g22M7J996P02L82j392j226j376L2J156J258J247O50p44j634j537l46N15J149
3789A57J163M53l35n44j093k036P33J214J130M85l40o95j410p36l20Q37R35J698
3807A296j03p19p96j143m89J99J271J627M83m22q21j201m37k21R52Q21J197M5
3825A539q32j070j300J59N73J195J315P67j209j388r54p11K17J702R16P84j107
3842E96l70j743n36KR50J423J039n61r25p17j531j19M54J567J216R57j183p89
$$ plain form
3860 -270 -2115 -2630 -1810 -868 800 1785 1251 464 -1261 -2029 -1292 -504 381 994 1419 -68 -1538 -1601 -1787
3879 -1787 -428 64 1081 1630 1040 -130 -1298 -1640 -1559 -357 1026 1352 1434 -179 -1287 -1783 -1793 -678
3897 -678 -185 1019 1189 742 -664 -1621 -1909 -1346 -250 801 1490 282 8 -1766 -1875 -1245 -690 1427
3915 1427 1417 1230 827 -673 -1774 -2032 -1079 681 1437 1632 336 -407 -1513 -1798 -1054 -229 1439 1807
3933 1807 1158 287 -1232 -2020 -1113 -247 1037 1363 765 -334 -1067 -1666 -1237 -647 588 1171 1474 695
3951 695 -248 -1652 -1487 -1290 606 1320 1242 786 -165 -1315 -1808 -1515 -167 1369 1360 1097 338 -451 -909
3970 -909 -1416 -216 1089 1905 1877 1079 237 -1892 -811 -829 349 1588 1877 1100 192 -498 -850 -1124 156
3989 156 1261 1410 1552 390 -254 -1263 -1396 113 819 1850 1874 1044 -229 -1437 -1195 -925 69 1877
$$ packed form
3860b70j845n15Q20R42J668R85n34p87j725p68P37P88Q85O13M25j487j470o3j86
3879a787J359M92J017N49n90j170j168l42Q1J202J383L26Q2j613j108m96j0J115
3897f78M93J204J70m47j406r57k88N63J096J051O89j208k74j774j09O30N55K117
3915A427j0j87m03j500j101k58R53J760P56J95j296p43j106k85P44Q25J668L68
3933A807o49q71j519p88R07Q66J284L26n98j099p33n99M29N90J235N83L03p79
3951F95r43j404J65J97J896P14p8m56r51j150m93K93J348J536rk63p59p89m58
3970i09n07J200J305Q16k8p98q42k129J081j8J178J239K89p77r08o90l52k74J280
3989A56J105J49J42j162o44j009j33J509P06J031K4q30j273j208K42K70R94J808
$$ plain form
4007 1877 1148 1213 -7 -647 -1190 -600 283 793 2100 1244 750 -1298 -1263 -960 -469 957 1905 1050 945
4026 945 -219 -502 -1054 -627 591 1084 2235 1381 159 -829 -1201 -1164 -90 1324 1761 1242 548 -779
4044 -779 -964 -1558 -656 738 1482 1390 804 -603 -1970 -1601 -1313 -67 1387 969 498 -259 -1491 -2301
4062 -2301 -1823 -402 381 1340 568 251 -1320 -1408 -1793 -853 169 1029 1845 643 -262 -1689 -1492 -1172
4080 -1172 20 1218 1408 719 404 -1216 -1666 -975 -464 530 1718 1316 -239 -458 -1918 -1570 -405
4097 -405 487 927 1037 24 -572 -1632 -1288 -1065 -360 883 1237 225 -115 -1777 -2283 -1297 89 413
4115 413 1132 914 621 -83 -1328 -909 -1110 882 1600 1728 1116 -129 -916 -1069 -370 1135 1722 1479 1827
4134 1827 789 -539 -636 -537 107 1403 2158 1615 460 -707 -1242 -1171 -757 249 1069 919 808 -478
$$ packed form
4007A877p29O5j220o40n43N90Q83N10J307q56m94k048L5L03M91J426R48q55j05
4026I45j164k83n52M27J218M93J151q54j222r88l72L7J074J414M37n19o94j327
4044g79j85n94R02J394P44r2n86j407j367L69K88J246J454m18m71p57j232q10
4062b301M78J421P83R59p72l17j571q8l85R40J022Q60Q16j202r05j427J97L20
4080a172J192J198J90o89l15j620m50O91N11R94J188m02j555k19j460L48J165
4097d05Q92M40J10j013n96j060L44K23P05J243L54j012l40j662n06R86J386L24
4115D13P19k18k93p04j245M19k01J992P18J28o12j245p87j53O99J505N87k43L48
4134A827j038j328r7R9O44J296P55n43j155j167n35P1M14J006Q20j50j11j286
$$ plain form
4152 -478 -1123 -1437 -740 -393 942 1080 1272 -215 -1177 -1798 -1219 -604 387 1313 998 420 -463 -1121 -1674
4171 -1674 -61 482 1459 1421 548 359 -869 -1545 -775 483 1443 1451 1339 105 0 -1607 -1416 -537 514
4190 514 1417 1424 234 -1116 -1991 -1621 -1647 -180 885 1125 359 -645 -1597 -2555 -1516 -666 -21 567 247
4209 247 -619 -1463 -1822 -1301 -840 390 634 861 -124 -606 -1707 -1669 -776 -2 914 1485 644 -83 -1076 -1703
4229 -1703 -862 -238 733 1297 754 -246 -1121 -1970 -1818 -1388 280 603 480 -378 -911 -2113 -1916 -1223 -171
4248 -171 535 537 -169 -785 -1778 -1917 -1616 -485 111 371 798 -505 -989 -2092 -1131 -349 -290 1106 996 479
4268 479 -266 -1072 -1306 -48 448 726 1432 388 206 -1077 -1024 -723 -7 1025 1149 222 53 -1204 -1788
4287 -1788 -1733 -1178 287 988 629 361 -657 -1771 -1775 -1933 -760 715 976 610 -503 -1375 -1740 -1294 -487
$$ packed form
4152d78o45l14O97L47J335J38J92j487r62o21N79O15R91R26l15n78q83o58n53
4171a674J613N43R77l8q73j89j228o76P70J258R60Qj12j234j05j607J91Q79J051
4190E14R03Pj190j350q75L70k6J467J065K40p66j004r52r58J039Q50O45N88l20
4209B47q66q44l59N21M61J230K44K27r85m82j101L8Q93P74R16N71q41p27r93o27
4229a703Q41O24R71N64n43j000q75q49J52M30J668L23j23q58n33j202J97O93J052
4248a71P06Kp06o16r93j39L01J131N96K60M27j303m84j103R61P82N9J396j10n17
4268D79p45q06k34J258M96K78P06j044j82j283N3L01P16J032J24r27j69j257n84
4287a788N5N55J465P01l59k68j018j114mj58J173J475K61l66j113q72l65M46Q07
$$ plain form
4306 -487 966 1150 1278 533 -779 -1363 -1059 -83 611 1703 989 1556 -656 -892 -958 -557 754 1262 1626
4325 1626 1001 544 -645 -725 -823 -333 772 1179 1466 194 -674 -1566 -1147 -1053 437 848 833 263 -345 -1050
4345 -1050 -1023 -999 -93 804 1192 1048 25 -913 -1631 -552 281 1043 1276 1495 946 161 -993 -721 203
4364 203 1070 1352 1781 1284 -102 -750 -1044 -257 797 1323 1811 1698 389 -220 -1033 -881 184 1107 1158
4383 1158 1089 -135 -525 -807 -946 90 478 1644 1230 380 -139 -1229 -1566 -1065 450 957 1076 1129 -77
4402 -77 -560 -845 -171 541 756 1241 1048 824 162 -622 -888 124 1234 2071 819 645 247 -449 -830
4421 -830 -378 291 1116 1620 1250 -353 -425 -915 -969 -760 486 1139 996 -169 -454 -1458 -1217 -507 -67
4440 -67 1515 1071 95 -341 -1369 -1119 -1126 7 578 999 638 -72 -831 -890 -494 -687 627 1090 1189 48
$$ packed form
4306d87J453J84J28p45j312n84L04R76O94J092p14N67k212k36o6M01J311N08L64
4325A626o25m57j189q0r8M90J105M07K87j272q68q92M19R4J490M11j5n70o08p05
4345a050K7K4R06Q97L88j44j023r38p18J079Q33P62K33K19n49p85j154K72R24
4364B03Q67K82M29m97j386o48k94P87J054N26M88j13j309o09q13J52J065R23N1
4383A158o9j224l90k82j39J036L88J166m14q50n19j090l37N01J515N07J19N3j206
4402g7m83k85O74P12K15M85j93k24o62p84k66J012J110Q37j252j74l98o96l81
4421h30M52O69Q25N04l70j603p2m90n4K09J246O53j43j165k85j004K41P10M40
4440f7J582m44r76m36j028K50pJ133N71M21l61p10p59n9L96j93J314M63R9j141
$$ plain form
4460 48 -534 -1003 -964 -505 503 835 1552 416 -537 -762 -1155 -603 -121 926 964 736 -63 -892 -997 -986
4480 -986 -628 857 706 1126 165 -640 -1290 -933 -158 -491 522 1263 992 -430 -1358 -1567 -698 407 529
4499 529 1040 968 258 -967 -1516 -1060 -418 605 1277 1335 766 -779 -780 -1199 -346 20 435 1342 380 -97
4519 -97 -1040 -986 -589 7 892 1468 842 486 -324 -1036 -919 -278 1229 1191 842 299 42 -1309 -798 -748 113
4540 113 1029 1091 418 -162 -759 -1182 -1480 -11 562 768 754 219 -807 -947 -511 130 333 988 1219 316
4560 316 -545 -886 -1137 -856 1078 298 1082 644 -62 -1115 -1124 -698 31 1001 700 1165 -421 -494 -1240 -1308
4580 -1308 -272 188 628 785 76 -1294 -1354 -658 -1002 395 1148 1379 388 -404 -857 -1779 -1496 -539 256
4599 256 978 401 119 -765 -1061 -1248 -688 -77 546 304 327 -1145 -1139 -1244 -655 534 1162 1232 726 -325
$$ packed form
4460D8n82m69L9M59J008L32P17j136r53k25l93N52M82J047L8k28p99q29j05J1
4480i86L58J485j51M20r61q05o50L57P75l33J013P41k71j422r28k09Q69J105J22
4499E29N11p2p10j225n49M56O42J023O72N8n69j545jm19Q53L66M15R07r62m77
4519i7r43N4L97N96Q85N76o26l56q10p12J17O41J507l8l49n43k57j351N11N0Q61
4540A13R16O2o73n80n97m23k98J469N73K06j4n35j026j40M36O41K03O55K31r03
4560C16q61l41k51K81J934p80P84m38p06j053rM26P29R70l01M65j586p3p46o8
4580a308J036M60M40J57p09j370o0O96l44J397P53K31r91p92m53r22K83R57P95
4599B56P22n77k82q84k96j87N60O11O23k42K3j472Oj05N89J189O28P0n06j051
$$ plain form
4619 -325 76 -775 -621 633 751 1919 31 418 -894 -1087 -1189 -204 437 325 1141 466 -732 -1281
4637 -1281 -767 -514 513 1613 497 218 -152 703 -1761 -507 263 165 942 976 442 -105 -1012 -1434 319
4656 319 60 267 1214 385 -935 -773 -1522 201 179 968 1201 798 642 -980 -1696 703 123 1348 1538
4675 1538 1138 364 -166 -662 -925 220 1562 788 -6 587 361 -682 -1135 205 456 1529 1520 52
4693 52 -776 -418 -1938 -1389 -403 -468 1468 1004 810 -1031 -1311 -852 242 18 1229 1868 912 -514 -785
4712 -785 -1108 -936 77 784 1094 555 293 -1375 -1186 -591 59 968 906 1352 154 -837 -1030 -709 -810
4731 -810 546 214 162 306 200 -687 -1291 -802 -280 1255 1493 550 -89 -256 -865 -299 -21 543 1845
4750 1845 983 226 322 -901 -661 133 851 893 1103 85 -400 -285 -789 -117 672 915 833 589 127 -1044
$$ packed form
4619c25M01q51J54J254J18J168j888L87j312j93j02R85O41j12Q16o75j198n49
4637a281N14K53J027J100j116k79l70Q55k464J254P70r8P77L4n34n47r07m22J753
4656C19k59K07R47q29j320J62p49J723k2P89K33m03j56j622p16K399n80J225J90
4675A538m00p74n30m96k63J145J342p74p94N93k26j043m53J340K51J073rj468
4693E2q28L58j520N49R86o5J936m64j94j841k80M59J094k24J211O39r56j426k71
4712g85l23J72J013P07L10n39k62j668J89N95O50R09o2M46j198r91j93L21j01
4731h10J356l32n2J44j06q87o04M89N22J535K38r43o39j67o09N66K78N64J302
4750A845q62p57R6j223K40P94P18M2K10j018m85J15n04O72P89K43q2k44m62j171
$$ plain form
4770 -1044 -487 -469 -132 839 381 701 997 -363 -944 -774 -462 639 883 1119 495 -368 -826 -680 -698 -284
4790 -284 662 980 668 313 -319 -1081 -645 -198 882 828 900 568 -423 -810 -1137 -285 775 1133 1468 725
4810 725 269 -412 -505 -716 79 621 539 535 -154 -1025 -1093 -731 -878 341 716 547 374 -914 -1425 -1178 -671
4831 -671 150 468 719 32 -232 -900 -1189 -538 179 435 1089 1048 -10 -558 -867 -912 -89 640 1018 1124
4851 1124 300 -243 -745 -742 -455 247 1014 918 334 -27 -771 -1335 -1056 -115 510 705 326 -358 -702 -1252 -1208
4872 -1208 -422 -51 642 297 347 -618 -1107 -791 -692 -75 742 757 85 -520 -1128 -1544 -435 135 598 860
4892 860 742 80 -185 -607 -365 -102 674 856 550 200 -301 -889 -580 -229 254 1405 749 419 -197 -1109
4912 -1109 -1154 -995 -434 383 816 645 -148 -969 -1236 -864 -384 -32 629 623 120 -349 -1049 -747 -315 76 651
$$ packed form
4770a044N57J8L37R71m58L20K96j360n81J70L12J101K44K36o24q63m58J46j8M14
4790b84R46L18l12l55o32p62M36M47J080n4P2l32r91l87l27Q52J060L58L35p43
4810G25m56o81r3k11P95N42q2mo89q71o8L62j47J219L75j69j73j288n11K47N07
4831f71Q21L18K51o87k64o68k89O51P17K56O54m1j058n48l09m5Q23P29L78J06
4851A124q24n43n02LK87P02P67r6n84l61p44n64K79R41O25J95l79o84l44n50M4
4872a208P86L71O93l45N0r65m89L16R9O17Q17J5o72o05o08m16J109N70M63K62
4892H60j18o62k65m22K42K63P76J82l06l50n01n88L09L51M83J151o56l30o16r12
4912a109m5J59N61Q17M33j71p93q21k67L72M80L52O61on03m69p00L02M32L91N75
$$ plain form
4933 651 918 675 -63 -749 -1018 -891 49 599 471 751 388 113 -614 -796 -283 599 883 619 308 -199
4953 -199 -794 -477 -539 68 809 703 458 -21 -869 -1183 -697 -352 208 387 405 -127 -680 -1483 -1606 -538
4973 -538 -335 773 194 109 -291 -712 -913 -338 324 768 1042 485 218 -308 -946 -257 298 430 897 790
4993 790 590 -302 -476 -740 -263 263 895 779 884 -385 -719 -903 -388 6 603 702 499 -256 -561 -897
5013 -897 -624 34 333 319 466 -97 -494 -841 -556 -262 264 1058 669 307 -250 -812 -434 -289 504 708
5033 708 1018 416 260 -221 -499 -230 68 748 886 711 597 -528 -772 -345 -253 318 938 799 741 -117
5053 -117 -660 -522 -209 85 241 300 406 -133 -612 -742 -880 -126 606 563 485 13 -98 -1022 -1111 -442 604
5074 604 924 951 774 -385 -649 -715 -243 48 778 770 615 254 -355 -439 -471 53 571 850 796 483 -340 -636
$$ packed form
4933F51K67k43p38o86k69J27R40N50j28K80l63k75p27j82N13Q82K84k64l11n07
4953a99n95L17o2O07P41j06k45m79q48l14M86L45N60J79J8n32n53q03j23J068
4973e38K03J108n79q5m00m21k01N75O62M44K74n57k67n26o38O89N55J32M67j07
4993G90k00q92j74k64M77N26O32j16J05j269l34j84N15L94N97R9k03p55l05l36
5013h97K73O58K99j4J47n63l97l47K85K94N26P94l89l62n57n62L78J45P93K04
5033G08L10o02j56m81k78K69K98O80J38j75j14j125k44M27R2N71O20j39n8q58
5053a17n43J38L13K94J56N9J06n39m79j30j38P54P32m3p8m72j11r24q9O69J046
5074F04L20K7j77j159k64o6M72K91P30qj55l61o09q4l2N24N18K79n4l13q23k96
$$ plain form
5096 -636 -499 -193 367 1035 638 421 -371 -432 -551 -799 -217 402 726 328 -104 -574 -444 -883 93 655
5116 655 833 408 400 -185 -669 -1054 -113 247 298 784 489 229 -367 -765 -775 274 982 837 736 197 -1011
5137 -1011 -717 -445 42 -221 1057 1275 75 -320 -908 -966 -138 -316 583 636 88 -274 -257 -919 -83 52
5157 52 287 766 358 -110 -622 -699 -497 255 421 703 772 -162 -224 -304 -1144 -579 399 211 467 154 401 -661
5179 -661 -498 -79 12 408 322 312 712 -540 -869 -791 -405 477 777 344 334 -321 -1035 -573 -530 -649 79 420
5201 420 -12 -101 -830 -785 -240 -418 401 781 604 161 -529 -664 -933 -279 169 1057 414 432 -267 -197 -618
5222 -618 -685 202 385 430 78 163 -734 -531 -876 -93 203 404 390 638 -665 -652 -589 -356 157 12 585 -78
5244 -78 -131 -641 -770 -363 31 318 524 -46 -208 -984 -912 -366 -163 167 501 531 195 -182 -491 -899 -239
$$ packed form
5096f36J37L06N60O68l97k17p92o1j19k48N82O19L24l98m32m70J30m39R76N62
5116F55J78m25qn85m84l85R41L60N1M86k95k60n96l98j0J049P08j45j01n39j208
5137a011K94K72M87k63J278K18j200l95n88n8Q28j78Q99N3n48l62J7o62Q36J35
5157E2K35M79m08m68n12p7K02P52J66K82O9r34o2q0q40N65R78j88K56l13K47j062
5179f61J63M19R1L96q6j0M00j252l29P8L86Q82L00m33j0o55p14M62M3j19P28L41
5201D20m32q9p29M5N45j78Q19L80j77m43o90j35k69O54M48Q88o43J8o99P0m21
5222f18o7Q87J83M5l52Q5q97K03l45P83K96K01j4K48j303J3O3K33N13j45N73o63
5244g8n3n10j29M07L94K87K06n70j62p76P2N46K03L30L34L0l36l77l09m08O60
$$ plain form
5265 -239 556 412 407 235 -410 -398 -601 -378 53 306 647 189 -387 -718 -749 -246 -130 330 -28 595 94
5286 94 -320 -610 -876 -134 476 786 668 -14 -604 -767 -337 -34 -434 798 875 -130 -41 -282 -505 -508 60
5307 60 493 1018 731 172 -741 -569 -450 -45 426 606 399 323 -280 -545 -808 -173 614 314 733 513 -212
5328 -212 -532 -812 -825 -24 377 1015 234 173 -347 -631 -694 -60 422 132 672 431 -329 -272 -487 -104 210
5349 210 261 467 537 102 -653 -834 -140 186 589 58 267 55 -455 -744 -457 -751 -44 347 562 424 -367
5370 -367 -538 -244 -216 234 331 816 505 -296 -507 -392 -28 -44 505 226 632 -469 -105 -521 -768 -64 809
5391 809 412 257 490 27 -364 -184 -404 -268 243 562 396 111 -555 -996 -101 13 376 344 300 245 -90
5412 -90 -452 -390 173 161 469 249 75 -256 -404 -396 -249 14 254 1063 427 209 -534 -517 -448 50 274 584
$$ packed form
5265b39P95j44nj72o45J2k03K23M31K53L41m58n76l31l1N03J16M60l58O23n01
5286I4m14k90k66P42O10L10j18o82n90j63M30L03m00J232P7j005Q9k41k23lN68
5307F0M33N25k87n59r13J72J19M05M71J80k07p6o03k65k63O35P87l00M19k20p25
5328b12l20k80j3Q01M01O38p81o1n20k84o3O34M82k90N40k41p60N7k15L83L14
5349B10N1K06P0m35p55j81O94L26M03n31K09k12n10k89K87k94P07L91K15j38p91
5370c67j71K94K8M50R7M85l11q01k11J15L64j6N49k79M06j101L64m16k47P04Q73
5391H09l97j55K33m63l91J80k20J36N11L19j66k85o66m41Q95J14L63l2m4n5l35
5412i0l62O2N63j2L08k20j74l31j48QJ47K63K40Q09o36k18p43J7O9M98K24L10
$$ plain form
5434 584 726 74 -368 -517 -973 58 214 416 386 366 332 -463 -600 -381 144 833 426 93 -139 -290 -674
5455 -674 -260 -177 559 426 773 346 -370 -415 -937 -583 179 296 213 372 -388 -872 -273 -205 -127 794 663 297
5477 297 738 -617 -477 -395 -38 508 632 428 51 -249 -512 -216 -629 131 776 55 472 -234 -449 -582
5497 -582 -656 209 488 1244 580 475 -666 -905 -853 -66 454 792 464 -37 -561 -91 -1116 -926 -218 145
5517 145 688 658 -5 -579 -517 -1148 340 224 756 581 -286 -403 -339 -237 -409 287 548 467 -142 -40 -549
5538 -549 -708 -70 -84 681 269 437 512 -482 -658 -329 -47 59 618 878 266 -745 -1154 -223 -509 924
5558 924 409 739 103 121 -468 -517 -392 430 179 -243 236 349 -416 -1020 -923 -404 908 391 687 -607
5578 -607 -344 -1117 -518 -44 -222 114 26 1057 -190 -85 134 -795 -110 340 442 111 -141 -546 -879 -705
$$ packed form
5434E84J42o52m42j49m56J031J56K02l0k0l4p95j37K19N25O89m07l33k32j51l84
5455f74M14Q3P36j33L47m27p16m5n22L54P62J17q3J59p60m84N99O8P8R21j31l66
5477B97M41j355J40Q2L57N46J24k04l77l00k63K96m13P60O45p21M17p06k15j33
5497e82p4Q65K79P56o64j05j141k39N2P87N20L38l28n01n24M70j025J90P08L63
5517A45N43l0o63n74O2o31J488j16N32j75q67j17O4J02j72O96K61q1o09J02n09
5538e49j59O38j4P65m12J68P5r94j76L29K82J06N59K60o12j011m09R31k86J433
5558I24n15L30o36J8n89m9J25Q22k51m22M79J13p65o04R7N19J312n17K96j294
5578f07K63p73N99M74j78L36q8J031j247J05K19r29O85M50J02l31k52m05l33J74
$$ plain form
5598 -705 203 -180 -69 96 -376 -121 -504 -629 -143 -491 -55 141 184 160 -1089 -682 -286 272 312 573 732
5619 732 -123 -559 -127 -131 290 509 109 244 84 -267 -834 -751 -1110 499 194 101 -273 -141 -321 -62 -269
5640 -269 135 542 597 666 148 -262 -701 -516 -185 433 394 591 -521 169 -23 -862 -554 208 -83 110 -275
5661 -275 -213 -667 -622 -735 111 712 235 -339 289 -870 -1205 -22 -371 344 -37 828 96 -567 -462 -1406
5681 -1406 4 -62 446 223 -89 20 -217 -363 -463 -147 -2 718 10 -480 -147 -579 -762 269 420
5700 420 603 605 583 -3 129 -270 -361 434 464 1183 355 -495 -822 -232 -435 115 646 1262 276 107 -491 -941
5722 -941 -872 -168 235 294 654 53 17 -487 -373 222 114 -106 -169 100 150 -353 -498 -573 -144 36 734 -43
5744 -43 236 -357 -641 -505 -137 135 498 892 51 -278 -599 -1113 -1006 -97 523 329 441 -103 -371 -417 -720
$$ packed form
5598g05R08l83J11J65m72K55l83j25M86l48M36J96M3k4j249M07L96N58M0K61J59
5619G32q55m36M32mM21K19m00J35j60l51n67Q3l59J609l05r3l74J32j80K59k07
5640b69M04M07N5O9n18m10m39J85L31O18l9J97j112O90j92q39L08P62k91J93l85
5661b75O2m54M5j13Q46O01m77n74O28j159l35J183l49P15l81Q65p32o63J05r44
5681a406J410o6N08k23l12J09k37j46j00L16J45P20p08m90L33m32j83J031J51
5700D20J83Kk2n86J32l99r1P95L0P19q28q50l27N90k03N50N31O16r86j69n98m50
5722i41O9P04M03N9L60o01l6n04J14N95j08k20o3K69N0n03j45p5M29J80O98p77
5744d3K79n93k84J36L68K72L63L94q41l29l21n14J07R09O20j94J12n44k68m6l03
$$ plain form
5765 -720 65 198 684 601 168 332 -844 -413 -204 117 602 905 -100 -436 -774 -708 67 -23 453 -5
5785 -5 439 -343 -99 -354 -177 205 754 454 854 -76 -303 -8 -246 -224 238 276 568 -170 -507 -504 -312 -290
5807 -290 758 889 545 -9 301 -368 -388 -19 -179 642 1057 501 427 -153 -582 -659 41 321 60 -77 187
5828 187 -498 -574 -80 327 121 253 551 153 -614 -507 -644 -822 391 129 239 153 -265 -243 -821 25 -316
5849 -316 418 557 478 174 10 -287 -511 -401 -3 227 455 223 -294 -525 -709 -323 -238 440 660 19 251
5870 251 -698 -1067 -337 -479 412 416 672 301 -464 -754 -725 -201 160 327 589 158 -200 -790 -587 -542 -473 -31
5892 -31 540 646 76 -212 -434 -275 -81 428 403 434 5 -187 -126 -604 145 420 85 214 12 -64 -118 -612
5914 -612 -465 -57 165 409 21 -273 -539 -302 -847 -533 -85 790 -155 -235 -415 -220 -687 -257 522 8
$$ packed form
5765g20P85J33M86q3m33J64j176M31K09L21M85L03j005l36l38O6P75r0M76m58
5785eM44p82K44k55J77L82N49l00M00r30k27K95k38K2M62L8K92p38l37LJ92K2
5807b90J048J31l44n54L10o69k0L69j60Q21M15n56p4n80m29p7P00K80k61j37K64
5828A87o85p6M94M07k06J32K98l98p67J07j37j78J213k62J10q6m18K2n78Q46l41
5849c16P34J39p9l04j64k97k24J10L98K30K28k32n17k31j84L86Q5O78K20o41K32
5870B51r49l69P30j42Q91MK56l71p65k90K9N24L61J67K62m31l58n90K03M5O9M42
5892c1N71J06n70k88k22J59J94N09k5L1m29j92O1m78P49K75l35J29k02p6n4m94
5914f12J47M08K22K44l88k94k66K37n45L14M48Q75r45q0j80J95m67M30P79n14
$$ plain form
5934 8 309 246 57 -23 -531 -44 343 651 540 585 164 186 -481 -224 -716 362 633 481 239 178 66 -716
5956 -716 -143 680 870 360 380 309 -349 -447 -243 282 713 757 375 32 239 -441 -709 -146 458 629 541 -27
5978 -27 369 -442 -301 -18 -271 -266 386 429 -110 -683 -829 -773 -266 144 358 63 1 84 96 -598 190 474 409
6001 409 10 316 0 -348 -353 -325 177 358 1126 -41 326 -107 -527 -354 386 -297 -12 495 205 3 -881
6022 -881 353 -284 -8 299 -164 -118 -709 103 -494 -664 -148 428 353 -186 -246 -404 -614 -520 329 255 701
6043 701 218 -78 -444 -533 -350 -583 253 287 353 253 83 -279 -121 -261 238 561 808 310 179 62 -235
6064 -235 55 -371 490 140 -44 55 37 -904 39 501 -277 510 83 530 -918 -711 -453 -183 363 223
6084 223 679 210 196 -124 -649 -125 -10 977 546 512 280 127 -547 -783 -50 134 347 985 -174 542
$$ packed form
5934HL01o3j89q0n08M87L87L08j11M5m21K2o67K57m92J078K71j52k42o1j12p82
5956g16N73Q23J90n10K0p1o58r8K04N25M31M4l82l43K07o80k68N63O04J71q8n68
5978b7L96q11J41K83k53NO52M3n39n73j46N6N07M10K14k95o2Q3J2o94P88K84o5
6001D09l99L06l16l48nK8N02J81P68j167L67m33m20J73P40o83K85N07k90k02q84
6022h81J234o37K76L07m63M6n91Q12n97j70N16N76p5n39o0j58k10R4Q49p4M46
6043G01m83k96l66q9J83k33Q36L4O6j00j70l62J58j40M99L23K47m98j31j17k97
6064b35K90m26Q61l50j84R9j8r41R43M62p78P87m27M47j448K07K58K70N46j40
6084B23M56m69j4l20n25N24J15R87m31l4k32j53o74k36P33J84K13O38j159P16
$$ plain form
6104 542 -268 -1089 -283 249 630 595 420 -448 -125 -38 -408 -157 -86 334 163 191 -556 -150 -428 -397 -340 301
6126 301 593 -36 -73 298 -309 367 -396 -89 219 -688 30 -996 -89 209 334 -178 271 -93 411 -171
6146 -171 -297 -332 -190 -397 143 283 -145 -477 -198 -333 -758 -382 422 -5 93 334 -822 -460 -136 22
6166 22 129 247 -179 25 87 -796 -324 -222 408 -223 772 219 31 -421 -132 -879 -226 463 303 243 -284
6187 -284 -231 -187 -564 -899 82 -323 232 307 -72 -524 -260 -202 -444 384 731 -65 117 -541 -888 -437 -137
6208 -137 -289 -716 198 -691 -159 -826 -779 232 390 186 -410 -572 -89 -726 -740 7 -79 -93 435 446 83
6229 83 -152 -723 -852 433 281 260 -352 24 -150 -498 -256 -258 -98 9 139 289 117 -265 -297 -446 -354 103
6251 103 447 146 -476 -445 0 -246 -45 -4 251 381 138 -487 -415 -544 617 88 222 269 75 -1081 -550
$$ packed form
6104E42q10q21Q06N32L81l5j75q68L23Q7l70K51P1M20j71K8p47M06k78L1N7O41
6126C01K92o29l7L71o07O76p63L07L08r07P18j026R07K98J25n12M49l64N04n82
6146a71j26l5J42k07N40J40m28l32K79j35m25L76Q04m27R8K41j156L62L24J58
6166B2J07J18m26K04O2q83M72J02O30o31R95n53j88m52K89p47O53O89j60o0n27
6187b84N3M4l77l35R81m05N55P5l79m52K64N8k42Q28L47p96J82o58l47M51L00
6208a37j52m27R14q89N32o67M7J011J58k04n96j62M83o37j4P47q6j4N28J1l63
6229H3k35n71j29J285j52k1o12L76j74l48K42kJ60J07J30J50j72l82l2j49R2M57
6251A03L44l01o22L1M45k46K01M1K55J30k43o25P2j29J161n29J34M7j94j156N31
$$ plain form
6272 -550 -789 -576 -927 872 -333 -396 -579 31 -706 -579 165 -201 -211 -61 46 134 -950 4 134 30
6292 30 267 696 -151 307 -178 -272 -50 -58 -199 1022 652 504 122 -174 -50 141 1043 342 407 350 -304 -392
6314 -392 -600 -330 916 440 748 234 -311 -448 -64 65 512 22 389 73 -348 -48 62 -251 -132 81
6334 81 -202 374 -237 -504 -338 -760 -221 67 499 278 -126 -404 -483 -680 -355 144 -31 451 314 -1005
6354 -1005 -283 -220 -264 -95 169 317 241 618 -96 -571 -278 -287 497 149 108 277 -441 -340 481 167 671 603
6376 603 503 643 -123 -365 -181 -265 -78 752 806 180 186 -626 -413 -477 -301 -130 1290 129 24 -140 -274
6397 -274 -725 -776 48 184 -68 -282 -65 -731 -701 -283 62 61 -683 276 505 157 -140 -317 -472 162 2
6418 2 -147 31 -636 -66 -431 226 241 478 479 -68 -104 -619 -1194 -92 435 416 -217 -249 -421 286 38 -375
$$ packed form
6272e50k39K13l51J799j205o3j83O10p37J27P44l66j0J50J07Q8j084R54J30j04
6292C0K37M29q47M58m85r4K22qj41J221l70j48l82k96J24J91R02p01O5n7o54q8
6314c92k08K70J246m76L08n14n45j37L84J29M47m90L67l16m21L00J10l13J19K13
6334H1k83N76o11k67J66m22N39K88M32k21m04k78p9j97L25M99j75M82j37j319
6354a005P22O3m4J69K64J48p6L77p14m75K93rP84l48m1J69p18J01Q21l14N04o8
6376F03j00J40p66k42J84q4J87Q30N4o26Oq12K13o4J76J71J420j161j05j64j34
6397b74m51n1Q24J36k52k14K17o66L0M18L45jp44R59K29l48k97j77j55O34j60
6418Bj49J78o67N70l65O57J5K37Jn47l6n15n75J102N27j9o33l2j72P07k48m13
$$ plain form
6440 -375 -738 -531 -7 689 -141 -785 -1026 -107 -56 55 -10 -708 919 584 -151 -334 -945 -112 25 -234
6460 -234 424 58 -142 -792 -687 -2 -59 -147 -16 -105 -312 -827 -451 -583 258 87 192 1060 -58 -409 -552
6481 -552 -459 -168 -106 -123 145 106 97 -697 -399 -315 -150 -201 505 310 231 -800 -257 240 224 518 658 48 217
6504 217 -261 -316 137 -148 376 511 -88 -320 -292 -140 -451 -231 186 206 -91 -208 44 -150 72 -144 431
6525 431 486 -203 -199 -116 -451 -362 -92 91 176 114 53 -68 -92 253 -630 -905 302 375 239 -82 141 -285 23
6548 23 750 72 80 1014 83 703 145 -613 49 83 186 679 572 -648 -649 22 -439 18 250 173 220 -4
6570 -4 -240 -509 -257 -377 -1049 -124 312 207 201 -208 -9 -525 523 -79 775 315 541 -111 -194 3 281
6591 281 29 352 -339 -137 40 193 -118 23 643 361 392 252 75 -445 -429 -477 -7 337 434 107 -58
$$ packed form
6440c75l63K07N24O96q30o44k41R19N1J11o5o98J627l35p35j83o11Q33J37k59
6460b34O58l66k00o50J05O85n7q8J31q9k07n15L76j32Q41j71J05Q68j118l51j43
6481e52R3K91O2j7K68l9rp94K98Q4J65n1P06j95p9j031N43M97j6K94J40o10J69
6504B17m78n5M53k85N24J35n99k32K8J52l11K20M17K0k97j17K52j94K22k16N75
6525D31N5o89MQ3l35Q9K70J83Q5o2o1j21k4L45q83k75J207P3j36l21K23m26L08
6548B3P27o78QR34r31O20n58p58O62L4J03M93j07j220jO71m61M57K32p7M7k24
6570dk36k69K52j20o72R25M36j05om09J99n16J048o02Q54m60K26o52q3J97K78
6591B81k52L23o91K02J77J53l11J41O20k82L1j40j77n20J6m8M70L44R7l27j65
$$ plain form
6612 -58 137 281 2 -366 -5 41 421 245 -434 -694 -510 -82 -398 -436 301 -550 -387 -995 192 -504 -184
6633 -184 -95 233 715 321 -20 -327 -255 217 883 511 360 -207 -183 -454 -260 -303 -18 252 101 70 161 -747
6655 -747 -612 151 -493 -271 305 -124 -33 -135 -416 -442 -239 76 199 -263 -362 311 -254 -913 -377 -90 367
6676 367 -48 96 -194 -175 80 -868 -211 -222 98 483 -98 92 -24 220 199 469 191 388 111 331 -495
6697 -495 -362 -466 213 487 456 341 586 74 -276 -78 -44 -259 308 19 247 -208 -764 206 -94 297 -128
6718 -128 28 182 614 -521 -320 154 256 290 482 115 235 -751 -448 -9 539 531 761 503 46 364 -576
6739 -576 -10 43 571 856 517 -149 -169 -176 -107 -456 154 488 610 886 -134 260 -111 6 155 234 753 459
6761 459 165 -375 -144 -399 -139 360 104 57 210 -346 -316 -138 -298 -337 297 46 -313 126 -498 -596 88
$$ packed form
6612e8J95J44k79l68L61M6L80j76o79k60J84M28l16l8P37q51J63o08J187o96L20
6633a84Q9L28M82l94l41l07P2M72O66l72j51n67K4k71J94m3K85K70j51l1R1r08
6655g47J35P63o44K22N76m29R1j02k81k6K03L15J23m62r9O73n65o59N36K87M57
6676C67m15J44k90J9K55r48O57j1L20L85n81J90j16K44k1K70k78J97k77K20q26
6697d95J33j04O79K74l1j15K45n12l50J98L4k15N67k89K28m55n56R70l00L91m25
6718a28J56J54M32j135K01M74J02L4J92l67J20r86L03M39N48qK30k58m57L18r40
6739e76N66N3N28K85l39o66k0pO9l49O10L34J22K76j020L94l71J17J49P9N19k94
6761D59k94n40K31k55K60M99k56m7J53n56L0J78j60l9O34k51l59M39o24r8O84
$$ plain form
6782 88 181 108 330 427 362 59 392 288 -401 -354 -49 -641 135 20 -27 -229 28 73 85 657 395 -687 26
6805 26 -279 -569 -432 -577 -52 298 -28 -412 -698 -187 -450 -366 160 207 79 -130 -573 -729 546 433 289
6826 289 982 152 -203 325 -587 -490 -354 256 425 269 5 -379 -405 -90 -108 -754 187 587 -101 236 -214
6847 -214 -1119 -851 -139 -68 86 -142 91 -109 -867 -956 9 646 -48 302 -301 -836 -975 -243 21 33 371
6868 371 -141 740 296 -858 -188 386 25 32 -370 436 -174 -170 -482 -568 286 110 -93 334 637 -221 -101
6889 -101 148 -489 -710 248 252 560 -176 -220 -538 -1089 320 47 166 40 -13 -302 -142 -224 -96 261 -309
6910 -309 116 142 -410 -268 -937 61 -427 60 -23 253 -305 -828 163 -214 -321 89 -134 467 -368 26 -324
6931 -324 -422 -131 -222 -4 -319 39 64 227 -390 111 -268 -313 267 277 -347 33 343 -28 90 72 -83 95
$$ packed form
6782H8R3p3K22R7o5l03L33j04o89M7L05n92P76j15m7k02K57M5J2N72k62j082P13
6805B6l05k90J37j45N25L50l26l84k86N11k63Q4N26M7j28k09m43j56J275j13j44
6826B89O93q30l55N28r12R7J36O10J69j56k64l84k6L15j8o46R41M00o88L37m50
6847b14r05K68P12P1J54k28K33k00p58q9R65O37o94L50o03n35j39P32K64J2L38
6868C71n12Q81m44j154O70N74l61Pm02Q06o10Ml12q6Q54j76k03M27L03q58J20
6889a01K49o37k21R58ML08p36m4l18n51J409k73J19j26n3k89J60q2J28L57n70
6910c09M25K6n52J42o69R98m88M87q3K76n58n23R91l77j07M10k23O01q35L94l50
6931c24r8K91r1K18l15L58K5J63o17N01l79m5N80J0o24L80L10l71J18j8j55J78
$$ plain form
6953 95 -93 -427 -13 125 -32 -167 -114 -48 115 -44 -156 298 -383 161 361 663 23 -385 385 -278 0
6974 0 163 -291 57 124 560 -153 408 -597 766 494 -15 -228 -277 47 -145 47 -550 154 96 236 -47
6995 -47 543 284 -675 -453 392 451 394 434 292 -223 319 -185 170 91 479 163 252 -487 -23 -346 93 414
7017 414 321 428 163 -2 -19 -495 -476 25 287 580 132 -254 335 -132 -160 206 -189 403 182 154 12 50
7039 50 -538 20 -190 -27 -89 247 63 -229 -54 292 226 246 401 -253 576 69 -328 -267 -482 291 -59 391
7061 391 23 398 -639 -313 -102 179 346 294 468 -784 -761 -653 -498 42 396 168 458 273 189 -184
7081 -184 258 -138 -189 244 -193 -166 -520 203 -699 -624 208 557 62 481 208 72 -197 -105 -85 -29 172 376
7103 376 -34 -248 325 -159 116 -335 -107 832 -113 -701 -178 -305 -559 -366 157 -72 327 293 -64 -978
$$ packed form
6953I5j88l34M14J38j57j35N3O6J63j59j12M54o81N44K00L02o40m08P70o63K78
6974@J63m54L48O7M36p13N61j005J363k72n09k13m9L24j92J92n97P04n8J40k83
6995d7N90k59r59K22Q45N9n7M0j42n15N42n04L55p9L88l16Q9p39M64l23M39L21
7017D14r3J07k65j65j7m76J9N01K62K93m48l86N89m67k8L66l95N92k21k8j42L8
7039E0n88N58k10J63o2L36j84k92J75L46o6K0J55o54Q29n07l97O1k15P73l50M50
7061C91l68L75j037L26K11K81J67n2J74j252K3J08J55N40L54k28K90j85q4l73
7081a84M42l96n1M33m37K7l54P23r02P5Q32L49m95M19k73j36k69R2K0N6K01K04
7103C76m10k14N73m84K75m51K28R39r45n88N23j27k54J93N23k29L99l4l57r14
$$ plain form
7123 -978 -42 303 193 -14 377 552 -93 -311 397 -269 188 390 127 -195 148 -25 -38 -288 183 -235
7143 -235 -355 63 -301 -347 -61 -364 -360 -100 206 166 -8 57 -73 445 -11 -495 -177 427 -419 -392 -20 -357
7165 -357 163 -210 141 207 432 -394 -379 -234 -700 114 487 131 293 -139 -218 -558 -273 265 -396 -257 414
7186 414 -4 138 -352 28 -259 57 97 443 -193 -157 -256 -16 -323 373 81 89 -49 -259 -552 -377 -476 -394
7208 -394 -58 360 -622 385 217 20 40 -315 -146 365 349 -3 118 -898 182 232 -44 4 -35 326 -80
7229 -80 -466 -233 -202 352 402 239 668 309 -109 -91 -185 3 -69 540 913 111 -1011 148 -288 -257 -103 413
7251 413 227 513 -834 -143 169 -131 107 -245 269 -59 175 -576 30 285 109 328 17 380 -451 443
7271 443 -118 -81 -369 623 394 -407 449 -253 -338 -24 -98 194 -451 104 -607 -338 -210 130 -686 46 -119
$$ packed form
7123i78R36L45j10k07L91J75o45k18P08o66M57K02k63l22L43j73j3k50M71m18
7143b35j20M18l64m6K86l03MK60L06m0j74O5j30N18m56m84L18O04q46K7L72l37
7165c57N20l73L51O6K25q26J5J45m66Q14L73l56J62m32p9l40K85N38o61J39O71
7186D14m18J42m90L80k87L16M0L46o36L6r9K40l07O96k92Qj38k10k93J75r9Q2
7208c94L36M18r82J007j68j97K0l55J69N11j6l52J21j016J080N0k76M8l9L61m06
7229h0l86K33L1N54N0j63M29l59m18J8r4J88p2O09L73q02j122J159m36L1J54N16
7251D13j86K86j347O91L12l00K38l52N14l28K34p51O06K55j76K19l11L63q31Q94
7271D43n61L7k88R92k29q01Q56p02q5L14p4K92o45N55p11K69J28L40q16P32j65
$$ plain form
7292 -119 -376 216 -289 -631 -263 -482 -187 -440 -102 396 205 -224 -718 -352 -677 -203 247 146 -81 -645
7312 -645 -518 -560 -268 -586 35 505 -327 146 -291 34 -118 -33 415 534 254 -421 155 -523 -240 -256 537
7333 537 285 156 723 281 16 -502 -198 -135 -614 176 -69 47 -330 -418 -478 414 178 -60 112 456 -638
7354 -638 117 188 -517 -701 59 220 253 244 -215 -304 362 -107 65 417 -398 -249 202 546 -74 125 30 339
7376 339 785 41 237 -395 568 342 424 -138 -45 325 257 -423 -323 -43 -319 548 -85 639 -108 -28 -315
7397 -315 -662 -562 383 -104 412 -4 -526 -162 -258 -123 -389 -259 256 -107 -418 -73 -178 -47 -404 -270
7417 -270 314 182 245 -22 -374 -235 -205 -93 119 317 110 78 -325 155 -672 -487 147 -546 453 55 114
7438 114 -248 -488 51 -45 411 172 -396 -278 -242 -488 299 396 280 -372 587 698 -457 -435 77 156 105 7
$$ packed form
7292a19k57N92n05l42L68k19K95k53L38M98j91m29m94L66l25M74M50j01k27n64
7312f45J27m2K92l18O21M70q32M73m37L25j52Q5M48J19k80o75N76o78K83j6P93
7333E37k52j29N67m42k65n18L04O3m79P90k45J16l77q8o0Q92k36k38J72L44j094
7354f38P55P1p05j84P60J61L3rm59q9O66m69J72L52q15J49M51L44o20J99r5L09
7376C39M46p44J96o32R63k26Q2n62R3L70o8o80J00K80k76Q67o33P24p47Q0k87
7397c15l47J00R45m87N16m16n22L64r6J35k66J30N15l63l11L45j05J31l57J34
7417b70N84j32O3k67l52J39L0J12K12J98k07l2m03M80q27J85O34o93R99l98N9
7438A14l62k40N39r6M56k39n68J18L6k46P87R7j16o52R59J11j155K2N12P9n1r8
$$ plain form
7460 7 279 -484 -463 -251 -810 -804 -451 6 229 391 133 -32 -168 252 369 69 103 324 244 -2 -118 -154 -16
7483 -16 151 360 153 -22 -245 252 -6 -126 511 168 -187 266 -566 -8 631 -89 -310 138 -8 -216
7503 -216 -624 125 244 -559 -195 163 -415 275 -430 142 -992 -283 -239 -134 -60 -71 508 -238 3 -318 -207
7524 -207 -264 -158 25 630 -164 -327 -225 124 110 418 425 383 388 154 -180 363 484 -614 351 193 288 -36
7546 -36 -421 83 163 -133 608 442 200 353 -328 -529 -632 142 340 179 1004 113 -731 -406 -231 -155 364
7567 364 -3 77 -685 -383 -228 -158 -72 255 -88 1031 109 -718 249 -124 -313 -494 -268 297 403 -36 341
7588 341 -501 -309 106 -53 30 6 -617 139 -251 -94 -28 420 72 -171 -155 260 -34 5 -357 138 -57 290
7610 290 570 -139 -728 -42 -344 249 -264 -290 34 -186 653 511 -898 -18 159 533 42 -422 -290 6
$$ packed form
7460GK72p63K1K12n59OL53M57K23J62k58j65j36M20J17l00L4K21q0k46j16l6J38
7483a6J67K09k07j75k23M97k58j20O37l43l55M53q32N58O39p20k21M48j46k08
7503b16m08P49J19q03L64L58n78O90p05N72j134P09M4J05P4j1N79p46K41l21J11
7524b07n7J06J83O05p94j63J02L49j4L08Pm2Nk34l34N43J21j098R65j58R5l24
7546c6l85N04Q0k96P41j66k42J53o81k01j03P74J98j61Q25q91q44L25J75P6N19
7567C64l67Q0p62L02J55P0Q6L27l43J119r22q27R67l73j89j81K26N65J06m39L77
7588C41q42J92M15j59Q3k4o23P56l90J57O6M48l48k43J6M15k94L9l62M95j95L47
7610B90K80p09n89O86l02N93n13k6L24k20Q39j42j409Q80J77L74m91m64J32K96
$$ plain form
7630 6 -63 -53 246 -373 205 -224 80 -74 -336 -145 -321 171 480 778 199 -46 -89 -304 541 210 976 -66
7652 -66 84 28 75 455 -36 -110 76 -164 193 24 45 -696 -285 -267 60 899 298 664 113 -891 -443 -84
7674 -84 440 176 259 118 323 -545 -424 -139 -155 -1216 541 45 267 181 -618 -515 -265 317 9 -105 -455
7695 -455 289 -1084 -203 -384 -711 -81 -392 400 -149 450 441 439 698 -344 600 197 811 303 -471 285 250
7716 250 -443 -373 -9 484 -109 9 -187 356 405 -156 53 -75 61 -308 -457 -100 -515 -93 479 37 327
7737 327 411 -537 -485 -374 537 639 170 430 -116 -473 -684 -234 171 259 -494 -38 438 409 -375 -226 -135 -339
7759 -339 283 8 -976 -291 -211 -146 -544 181 73 -95 77 69 820 254 -376 105 498 592 -418 -140 -299
7780 -299 -127 -436 -231 169 583 -143 -534 41 201 -304 20 363 28 488 -560 -1034 274 196 -267 -224
$$ packed form
7630Fo9J0K99o19N78m29L04j54k62J91j76M92L09K98n79k45m3k15Q45l31P66j042
7652f6J50n6M7L80m91p4J86k40L57j69K1p41M11J8L27Q39o01L66n51j004M48L59
7674h4N24k64Q3j41K05q68J21K85j6j061J757m96K22q6p99J03K50N82l08j14l50
7695d55P44j373Q81j81l27O30l11P92n49N99rkK59j042R44m03O14n08p74P56l5
7716B50o93P0L64M93n93J18j96N43M9n61K09j28J36l69j49L57m15M22N72m42K90
7737C27Q4r48N2J11R11J02m69K60n46l57k11M50M05Q8p53M56M76k9p84J49R1k04
7759c39O22k75r84O85Q0O5l98P25j08j68J72qP51n66o30M81L93R4j010K78j59
7780b99J72l09K05M00M14p26l91N75J60n05L24L43l35M60j048m74J308p8m63M3
$$ plain form
7800 -224 -347 -68 -380 136 180 -440 123 -214 -651 433 7 280 -434 359 -216 27 225 74 -673 747
7820 747 213 181 345 -761 584 456 490 232 -697 -467 -673 -462 -388 175 -223 -203 498 -223 524 -3 214
7841 214 21 107 61 -80 -150 -63 -178 -571 -982 73 349 -12 126 -92 -719 103 102 37 270 1047 193 -801
7863 -801 52 -64 -259 568 585 71 266 190 -209 23 -964 191 -40 -286 74 60 -397 -117 -211 -240 280
7884 280 230 1028 -664 149 -761 -397 244 241 -330 -364 -243 47 -619 -354 25 -192 -252 -168 -40 -342 2 263
7906 263 18 48 -115 434 118 658 438 -128 537 -723 67 148 391 216 -161 -210 -431 -275 -521 -295 -189
7927 -189 198 303 -170 -419 -43 -123 233 596 -584 -122 -889 -407 -625 87 80 582 -528 -553 405 -404 186
7948 186 -291 501 395 321 170 -225 156 -448 -425 -555 429 354 -77 282 106 18 -692 -277 -168 8 -378
$$ packed form
7800b24j23K79l12N16M4o20N63l37m37J084m26K73p14P93n75K43J98j51p47J420
7820G47n34l2J64j106J345j28L4k58r29K30k06K11P4N63l98K0P01p21P47n27K17
7841B14j93Q6m6j41p0Q7j15l93m11J055K76l61J38k18o27Q22jo5K33P77q54r94
7863h01Q53j16j95Q27J7n14J95p6l99K32r87J155k31k46L60j4m57K80r4k9N20
7884B80n0P98j692Q13r10L64O41ln71l4J21K90o66K65L79k17o0Q4J28l02L44K61
7906B63k45L0j63N49l16N40k20n66O65j260P90Q1K43j75l77m9k21J56k46K26J06
7927a89L87J05m73k49L76q0L56L63j180M62p67M82k18P12pN02j110k5R58q09N90
7948A86m77P92j06p4j51l95L81o04K3j30R84p5m31L59j76q8p10M15J09J76l86
$$ plain form
7969 -378 419 -310 191 95 70 69 483 407 -328 481 250 579 1228 149 -112 230 107 783 332 -92 232
7990 232 939 -353 -361 319 -615 -95 1021 -532 53 -133 340 -289 -573 -428 277 -418 948 711 -597
8009 -597 502 47 -541 208 -401 -750 162 761 -202 12 -661 255 -527 -65 -732 69 -269 298 302 -775
8029 -775 443 -6 -262 141 75 -920 52 4 -618 247 -541 -710 -248 -476 -371 111 171 322 -252 -530 97
8050 97 516 -111 107 713 -400 -352 -353 24 -185 125 -50 -87 57 -695 458 146 77 428 223 -64 -83 255
8072 255 140 426 -636 429 370 20 250 -632 348 441 -702 27 609 -126 -341 -1039 -202 -10 370 -233
8092 -233 -491 -479 7 120 22 -46 334 -1025 -775 69 -239 -87 -89 -507 -83 -875 -716 41 1101 -800 154
8113 154 417 344 713 -988 307 407 -189 -399 48 -918 -818 -223 646 348 242 962 -445 -454 -692 64
$$ packed form
7969c78P97p29N01r6k5jM14p6p35Q09k31L29O49j079k61L42j23O76m51m24L24
7990B32P07j292qO80r34N20J116j553N85j86M73o29k84J45P05o95J366k37j308
8009e97J099m55n88P49o09l49R12N99r63K14o73R16p82M62o67Q01l38N67Mj077
8029g75J218m49k56M03o6r95R72m8o22Q65p88j69M62k28J05M82O0J51n74k78O27
8050I7M19o27K18O06j113M8jL77k09L10j75l7J44p52J153l12o9L51k05k87j9L38
8072B55j15K86j062J065n9l50K30q82R80R3j143P29N82p35k15o98Q37J92L80o03
8092b33k58J2M86J13r8o8L80j359K50Q44l08J52km18M24p92J59P57J060j901R54
8113A54K63p3L69j701J295J00n96k10M47r66J00N95Q69k98j06P20j407rk38P56
$$ plain form
8133 64 -473 -155 0 -357 -80 -461 25 -561 -586 -173 -531 -196 190 271 -920 -707 348 -471 -53 -158
8153 -158 -178 -495 -14 -592 214 -707 481 -349 233 -500 17 454 -196 98 -133 563 158 -1213 -885 302
8173 302 418 342 605 -83 63 259 197 -568 -531 170 502 565 674 164 -665 630 -60 -490
$$ packed form
8133F4n37L18J55l57K77l81M86n86k5M13l58L35L86Q1j191K13J055q19M18j05
8153a58k0l17M81n78Q06r21J188q30N82p33N17M37o50K94k31O96m05j371L28J187
8173C02J16p6K63o88J46J96o2p65L7P01L32O3J09n10q29J295o90m30
8191d90
$$ Imaginary data points
##PAGE= N=2
##DATA TABLE= (X++(I..I)), XYDATA
$$ plain form
0 0 0 0 0 0 0 0 8 -8 8 -8 8 -16 16 -17 24 -32 35 -41 49 -58 67 -81 93 -107 124 -140 163 -183 207 -236
30 -236 265 -297 334 -372 416 -465 517 -573 636 -705 780 -865 957 -1060 1176 -1304 1449
47 1449 -1613 1806 -2026 2286 -2599 2984 -3470 4107 -4981 6271 -8352 12320 -22667 110401
61 110401 257713 168727 128491 70651 60703 56940 99921 138231 159604 120128 58332 -776
73 -776 -22196 -24329 2825 44426 82747 72008 22482 -35671 -63648 -61054 -30322 14510 60641
86 60641 79583 54796 63 -36679 -33079 -540 42411 90622 123109 116001 71364 24854 8063
99 8063 31176 72212 112124 140542 144846 108767 48973 8427 11277 42972 77437 101434 104496
112 104496 75801 18525 -39315 -61248 -38815 -374 24165 29270 13065 -30952 -89185 -123184
$$ packed form
0@%%%%%%Qj6J6j6J6k4L2l3M1n6O7p6R0j07J25j48J74k00K31k64L03l46L90m43
30b36N01n62O31p06P88q81R82j090J209j341J485j645J822k017K236k480K753
47A449l062L419l832M312m885N583o454P577r088J1252j4623K0672l4987J33068
61A10401J47312q8986m0236n7840r948l763M2981L8310K1373l9476o1796n9108
73g76k1420k133K7154M1601L8321j0739m9526n8153k7977K594L0732M4832M6131
86F0641J8942k4787n4733l6742L600L2539M2951M8211L2487p108m4637m6510j6791
99H063K3113M1036L9912K8418M304l6079n9794m0546K850L1695L4465K3997L062
112A04496k8695n7276n7840k1933K2433L8441K4539N105j6205m4017n8233l3999
$$ plain form
124 -123184 -110956 -69281 -29727 -10786 -16132 -42562 -85175 -122186 -122814 -79493 -24350 9082
136 9082 15471 1689 -29434 -64362 -74873 -45145 10528 57462 72294 57678 30757 -1897
148 -1897 -25884 -19376 23516 72473 93658 80708 48394 10089 -22169 -33164 -12103 30867
160 30867 62880 57267 20879 -20663 -55166 -75986 -68500 -32192 8261 18765 -5617 -46764
172 -46764 -81761 -99046 -95415 -66596 -21091 12350 7441 -26672 -60873 -77324 -74343 -49039 -3643
185 -3643 40055 55018 33040 -5095 -29559 -28953 -8799 25946 68333 94238 81858 42022 5247
198 5247 -8260 1662 27797 60524 85334 84317 50225 1138 -29278 -28321 -8993 16722 41230
211 41230 49144 25158 -21534 -61586 -72595 -55332 -25946 -579 13464 6749 -26356 -69058
$$ packed form
124a23184J2228M1675L9554J8941n346k6430m2613l7011o28M3321N5143L3432
136I082O389j3782l1123l4928j0511K9728N5673M6934J4832j4616k6921l2654
148a897k3987O508M2892M8957K1185j2950l2314l8305l2258j0995K1061M2970
160C0867L2013n613l6388m1542l4503k0820P486L6308M0453J0504k4382m1147
172d6764l4997j7285L631K8819M5505L3441m909l4113l4201j6451K981K5304M5396
185c643M3698J4963k1978l8135k4464O06K0154L4745M2387K5905j2380l9836l6775
198E247j3507R922K6135L2727K4810j017l4092m9087l0416R57J9328K5715K4508
211D1230P914k3986m6692m0052j1009J7263K9386K5367J4043o715l3105m2702
$$ plain form
223 -69058 -88993 -74502 -41594 -10027 12260 17120 -2129 -37712 -66020 -63147 -30065 8719
235 8719 35148 44074 35214 5131 -29729 -41193 -19187 18907 49674 60790 51008 24975 -10460
248 -10460 -36381 -33578 -1606 32817 46500 38321 14667 -20282 -53688 -64442 -43840 -7657
260 -7657 16975 15430 -6728 -37615 -67626 -86055 -76459 -40235 -4830 5723 -8624 -34762 -61367
273 -61367 -79197 -76306 -48561 -8296 17942 14587 -9811 -35016 -52267 -57036 -38171 -248 34055
286 34055 40998 22186 -8011 -30418 -38442 -28771 -1765 33007 51379 37821 4192 -24080 -38252
299 -38252 -36183 -17152 13017 36833 34575 6385 -29291 -51008 -52341 -37388 -12354 15416 26704
312 26704 8130 -28259 -55993 -61686 -48877 -23329 5105 23453 19000 -9629 -43244 -57166
$$ packed form
223f9058j9935J4491L2908L1567K2287M860j9249l5583k8308K873L3082L8784
235H719K6429Q926q860l0083l4860j1464K2006L8094L0767J1116r782k6033l5435
248a0460k5921K803L1972L4423J3683q179k3654l4949l3406j0754K0602L6183
260g657K4632j545k2158l0887l0011j8429R596L6224L5405J0553j4347k6138k6605
273f1367j7830K891K7745M0265K6238l355k4398k5205j7251m769J8865L7923L4303
286C4055O943j8812l0197k2407q024R671K7006L4772J8372j3558l3629k8272j4172
299c8252K069J9031L0169K3816k258k8190l5676k1717j333J4953K5034K7770J1288
312B6704j8574l6389k7734n693J2809K5548K8434J8348m453k8629l3615j3922
$$ plain form
324 -57166 -44795 -20716 6316 29386 35576 15503 -18004 -40876 -38884 -16594 12308 34874
336 34874 44431 34744 5102 -26885 -36659 -19516 7916 31603 43829 38995 15251 -17765 -37918
349 -37918 -32272 -5498 21134 34872 33559 18027 -11570 -39078 -44074 -22328 7070 27506 31263
362 31263 19162 -5355 -32451 -46277 -35265 -3865 23637 32774 23891 4628 -21735 -41127
374 -41127 -39076 -13465 18552 36328 32457 12986 -10777 -30978 -38687 -22611 9764 35509 38686
387 38686 22613 -1335 -23812 -35500 -28078 -1328 29188 42893 31912 6623 -16048 -29904
399 -29904 -29928 -11097 20153 41958 39176 17319 -8003 -25929 -29414 -16514 8376 34879 44051
412 44051 26561 -2123 -23133 -30191 -23612 -2927 23547 39036 32138 5493 -21943 -34694 -29950
$$ packed form
324e7166J2371K4079K7032K3070O190k0073l3507k2872J992K2290K8902K2566
336C4874R557r687k9642l1987r774J7143K7432K3687J2226m834k3744l3016k0153
349c7918N646K6774K6632J3738j313j5532k9597k7508m996K1746K9398K0436L757
362C1263j2101k4517k7096j3826J1012L1400K7502R137q883j9263k6363j9392
374d1127K051K5611L2017J7776l871j9471k3763k0201p709J6076L2375K5745L177
387C8686j6073k3948k2477j1688P422K6750L0516J3705j0981k5289k2671j3856
399b9904k4J8831L1250K1805k782k1857k5322j7926l485J2900K4890K6503R172
412D4051j7490k8684k1010p058O579K0685K6474J5489o898k6645k7436j2751M744
$$ plain form
425 -29950 -13508 8987 29561 33089 12483 -16939 -35443 -35720 -21534 691 23024 33381 23655
438 23655 -3376 -29150 -35615 -22389 -676 21608 37352 35790 14177 -14348 -29386 -22366 -1191
451 -1191 22688 39015 41301 27591 1169 -23136 -25634 -7547 16438 33978 40053 30403 5869
464 5869 -21384 -34392 -24189 -318 20601 28572 22366 4039 -22738 -42773 -40950 -19662 4701
477 4701 18033 16942 2940 -19490 -40605 -47225 -31615 -4187 17416 21003 10817 -7075 -27383
490 -27383 -38662 -30539 -4656 21837 33410 26682 9356 -10307 -24222 -24266 -6132 22078 39726
503 39726 36954 20049 -1033 -18744 -25437 -15490 7737 29624 34803 18477 -5860 -26106 -36588
516 -36588 -33815 -15710 8937 20827 11451 -11752 -35041 -47866 -46846 -32429 -9820 9807 11842
$$ packed form
425b9950J6442K2495K0574L528k0606k9422j8504k77J4186K2225K2333J0357r726
438B3655k7031k5774o465J3226K1713K2284J5744j562k1613k8525j5038P020K1175
451a191K3879J6327K286j3710k6422k4305k498J8087K3985J7540O075r650k4534
464E869k7253j3008J0203K3871K0919P971o206j8327k6777k0035J823K1288K4363
477D701J3332j091j4002k2430k1115o620J5610K7428K1603L587j0186j7892k0308
490b7383j1279Q123K5883K6493J1573o728j7326j9663j3915m4J8134K8210J7648
503C9726k772j6905k1082j7711o693R947K3227K1887N179j6326k4337k0246j0482
516c6588K773J8105K4647J1890r376k3203k3289j2825J020J4417K2609J9627K035
$$ plain form
529 11842 -7027 -30997 -44877 -46222 -34307 -12558 11008 21760 11884 -9688 -29099 -33780 -23439
542 -23439 -3626 18180 34359 32842 13485 -9994 -20931 -15509 -280 19499 35846 38941 24275
555 24275 -1372 -21520 -24184 -11447 5659 20273 27056 18706 -6285 -31278 -41518 -33020 -15510
568 -15510 1880 10851 7802 -9224 -33462 -50429 -46665 -27610 -6271 7450 11112 634 -19875
581 -19875 -38270 -40041 -23998 667 20142 26783 21623 6530 -12705 -23382 -12622 10789 33542
594 33542 43427 39817 25672 5863 -8944 -8868 7776 31359 44631 41663 27350 8364 -10425
607 -10425 -18871 -9504 11301 28610 30775 19156 -729 -19523 -30626 -28413 -10980 11315 21940
620 21940 14731 -1302 -19209 -31231 -30929 -16091 7544 26010 28019 15128 -2465 -13349 -14700
$$ packed form
529A1842j8869k3970j3880j345J1915K1749K3566J0752r876k1572j9411m681J0341
542b3439J9813K1806J6179j517j9357k3479j0937N422J5229J9779J6347L095j4666
555B4275k5647k0148k664J2737J7106J4614O783q350k4991k4993j0240Q498J7510
568a5510J7390Q971l049j7026k4238j6967L764J9055K1339J3721L662j0478k0509
581a9875j8395j771J6043K4665J9475O641n160j5093j9235j0677J0760K3411K2753
594C3542R885l610j4145j9809j4807P6J6644K3583J3272k968j4313j8986j8789
607a0425q446R367K0805J7309K165j1619j9885j8794j1103K213J7433K2295J0625
620B1940p209j6033j7907j2022L02J4838K3635J8466K009j2891j7593j0884j351
$$ plain form
633 -14700 -4669 17118 40324 50292 40652 22878 8123 2965 9337 26209 47676 61562 58543
646 58543 39404 17898 7636 9430 20547 37830 53165 54661 38900 14976 -2153 -6007 2500
659 2500 17330 32501 39202 30776 8496 -12802 -19899 -13181 1590 18853 30559 29146 14097
672 14097 -6665 -18448 -13747 2887 21610 35787 41493 33658 14537 -681 -1254 12298 32001
685 32001 48143 55975 51767 36010 17397 8175 15355 33641 50132 57464 54611 41502 20317
698 20317 4227 3702 16333 33985 43686 41945 30218 10661 -8051 -16361 -8030 10374 24259
711 24259 27312 18568 2801 -15369 -26380 -22798 -5263 14597 24333 20565 7708 -7577 -19106
724 -19106 -19389 -4783 17432 32309 34572 24415 9365 -2676 -6553 1993 20900 40587 46888
$$ packed form
633a4700J0031K1787K3206R968r640j7774j4755n158O372J6872K1467J3886l019
646E8543j9139k1506j0262J794J1117J7283J5335J496j5761k3924j7129l854Q507
659B500J4830J5171O701q426k2280k1298p097O718J4771J7263J1706j413j5049
672A4097k0762j1783M701J6634J8723J4177N706p835j9121j5218n73J3552J9703
685C2001J6142P832m208j5757j8613r222P180J8286J6491P332k853j3109k1185
698B0317j6090n25J2631J7652R701j741j1727j9557j8712q310Q331J8404J3885
711B4259L053q744j5767j8170j1011L582J7535J9860R736l768j2857j5285j1529
724a9106k83J4606K2215J4877K263j0157j5050j2041l877Q546J8907J9687O301
$$ plain form
737 46888 37634 21842 7372 -908 896 15104 33195 43345 38005 21566 2684 -8575 -10510
750 -10510 -2437 12796 26850 26643 12574 -6358 -20625 -25155 -19492 -5154 10448 17698 10404
763 10404 -7578 -23506 -29518 -23803 -10701 6624 20190 20244 6118 -10671 -19112 -15967 -2806
776 -2806 13961 28838 34379 26194 8285 -5807 -6510 3645 18486 33490 41278 36479 20086
789 20086 2003 -6791 -1238 13006 26064 34411 33312 19667 -224 -14430 -14043 -2453 11598
802 11598 21905 23138 13964 -3165 -19498 -25259 -15463 1377 13688 18201 14877 1569 -14017
815 -14017 -22769 -17312 -1375 15511 25073 23552 13806 338 -11172 -11835 1988 20420 32582
828 32582 33400 25857 12257 -1405 -6552 695 16346 31991 36346 28383 14329 115 -10031
$$ packed form
737D6888r254j5792j4470q280J804J4208J8091J0150n340j6439j8882j1259j935
750a0510Q073J5233J4054k07j4069j8932j4267m530N663J4338J5602P250p294
763A0404j7982j5928o012N715J3102J7325J3566N4j4126j6789q441L145J3161
776b806J6767J4877N541q185j7909j4092p03J0155J4841J5004P788m799j6393
789B0086j8083q794N553J4244J3058Q347j099j3645j9891j4206L87J1590J4051
802A1598J0307J233r174j7129j6333n761R796J6840J2311M513l324j3308j5586
815a4017q752N457J5937J6886R562j521r746j3468j1510o63J3823J8432J2162
828C2582Q18p543j3600j3662n147P247J5651J5645M355p963j4054j4214j0146
$$ plain form
841 -10031 -8898 4451 19702 28035 23520 9328 -5868 -17881 -19995 -11833 3691 16701 16529
854 16529 4847 -10050 -21716 -26946 -21706 -6502 8835 15413 9123 -5252 -18708 -24460 -21248
867 -21248 -9448 7072 18750 17801 4605 -9204 -18345 -17937 -8219 6330 19479 22611 13454 -2611
881 -2611 -15283 -17875 -11429 -108 12878 19753 13944 -874 -16606 -24026 -20980 -9915 2015
894 2015 11016 10517 -1701 -19678 -30283 -29400 -19978 -6952 3801 6621 -959 -16215 -29731 -32917
908 -32917 -25150 -10152 1520 7289 4570 -6979 -22440 -29432 -23607 -10592 3208 11609 11868 2041
922 2041 -11804 -22649 -23051 -11208 3679 13275 15197 9125 -4291 -17860 -23038 -16368 -1549 10856
936 10856 14669 9790 -1628 -14833 -23385 -22140 -9573 4586 12065 10156 654 -12576 -23051
$$ packed form
841a0031J133J3349J5251Q333m515j4192j5196j2013k114Q162J5524J3010j72
854A6529j1682j4897j1666n230N240J5204J5337O578o290j4375j3456n752L212
867b1248J1800J6520J1678r49j3196j3809r141M08R718J4549J3149L132r157j6065
881b611j2672k592O446J1321J2986O875n809j4818j5732p420L046J1065J1930
894B015R001m99j2218j7977j0605Q83R422J3026J0753K820p580j5256j3516l186
908c2917P767J4998J1672N769k719j1549j5461o992N825J3015J3800Q401K59r827
922B041j3845j0845m02J1843J4887R596J922o072j3416j3569n178O670J4819J2405
936A0856L813m879j1418j3205q552J245J2567J4159P479j909r502j3230j0475
$$ plain form
949 -23051 -24201 -14982 -763 11477 12646 4412 -7473 -17885 -22834 -17693 -3068 10791 16521
962 16521 10860 183 -11814 -18040 -15723 -5476 9789 19670 17366 6398 -5631 -14099 -15315
975 -15315 -7575 6367 18401 20331 11775 -1403 -12115 -15501 -10709 648 13699 20489 14893
988 14893 2042 -10431 -16644 -14214 -4601 8345 17505 17431 7085 -7344 -16390 -15676 -8149 3222
1002 3222 14269 18372 11245 -2565 -13541 -16457 -9988 213 11698 17670 15050 4077 -10242
1015 -10242 -16154 -12197 -2542 8140 16078 17082 8372 -5452 -15157 -15729 -6705 5009 14063 16578
1029 16578 11100 -654 -13044 -17572 -10849 458 11353 16465 13752 3793 -9171 -16687 -14548
1042 -14548 -2740 9146 15635 15066 7690 -4318 -14762 -16157 -7482 5537 14610 16112 10030 -1595
$$ packed form
949b3051j150R219J4219J2240J169q234j1885j0412m949N141J4625J3859N730
962A6521n661j0677j1997o226K317J0247J5265R881k304j0968j2029q468j216
975a5315P740J3942J2034J930q556j3178j0712l386M792J1357J3051O790n596
988A4893j2851j2473o213K430R613J2946R160p4j0346j4429r046P14P527J1371
1002C222J1047M103p127j3810j0976k916O469J0201J1485N972k620j0973j4319
1015a0242n912L957R655J0682P938J004q710j3824r705n72R024J1714R054K515
1029A6578n478j1754j2390m528O723J1307J0895N112k713r959j2964p516K139
1042a4548J1808J1886O489n69p376j2008j0444j395Q675J3019R073J502o082j1625
$$ plain form
1056 -1595 -11839 -16901 -12094 449 11409 15228 10956 1609 -8863 -16017 -15255 -5478 7198 14817
1070 14817 13059 4485 -6507 -13918 -16594 -9527 2934 13977 15416 8961 -1419 -10722 -14811 -10800
1084 -10800 -124 11880 17808 13765 3554 -6112 -12050 -11493 -3218 8820 17571 16859 7825 -3493
1098 -3493 -11727 -12216 -6428 3687 14088 17163 10150 -1730 -12126 -14692 -11064 -1718 8919 15120
1112 15120 11386 615 -10876 -16239 -13628 -6150 4170 12257 13341 5253 -7320 -14774 -15332 -8175
1126 -8175 2052 11110 15096 10279 19 -11495 -14566 -8832 550 10188 15537 13870 5108 -6483
1140 -6483 -13160 -11420 -3158 7337 13762 13579 7730 -3634 -13578 -15400 -7914 2323 9192 11607
1154 11607 6263 -2902 -13460 -18943 -14886 -4548 4925 8922 6317 -1484 -11794 -18854 -17625 -8843
$$ packed form
1056a595j0244n062M807J2543J0960L819m272r347j0472p154P62R777J2676P619
1070A4817j758q574j0992p411k676P067J2461J1043J439o455j0380r303m089M011
1084a0800J0676J2004N928m043j0211r666n938N57Q275J2038Q751p12r034j1318
1098c493q234m89N788J0115J0401L075p013j1880j0396k566L628R346J0637O201
1112A5120l734j0771j1491n363K611P478J0320Q087J084q088j2573p454n58P157
1126h175J0227R058L986m817j0260j1514l071N734R382R638N349j667q762j1591
1140f483o677J740Q262J0495O425j83n849j1364r944j822P486J0237O869K415
1154A1607n344r165j0558n483M057J0338R473L997k605p801j0310p060J229Q782
$$ plain form
1168 -8843 2067 8744 8522 2395 -7519 -14794 -17048 -11198 1140 10009 12019 7387 -1427 -10174 -14501
1183 -14501 -11234 -1637 9387 14630 11232 2532 -6579 -12702 -12879 -5643 4782 12034 11516 3698 -6196
1198 -6196 -13791 -15622 -10765 -1532 7776 9938 4209 -5502 -13913 -17099 -15405 -6910 3167 8863 6271
1213 6271 -2446 -11636 -16240 -14857 -8285 1217 9518 10463 4487 -5594 -12368 -12948 -7618 1343 10770
1228 10770 14666 9816 575 -8363 -11595 -7279 229 8572 14950 13672 5124 -5573 -11418 -9914
1242 -9914 -3513 5414 11426 12545 6161 -4396 -12726 -14333 -8714 543 7746 11198 6864 -1991 -11334
1257 -11334 -15515 -11530 -3565 6018 10226 8903 2483 -6882 -13135 -11386 -3796 6210 12013 12484 8259
1272 8259 -502 -8006 -10095 -4204 5199 13245 15193 12541 4199 -4135 -8530 -6223 2056 10757 14399
$$ packed form
1168h843J0910O677k22o127r914p275k254N850J2338Q869K010m632q814q747m327
1183a4501L267R597J1024N243l398q700r111o123j77P236J0425P252n18p818r894
1198f196p595j831M857R233R308K162n729r711q411l186J694Q495J0077N696k592
1213F271q717r190m604J383O572R502Q301R45n976j0081o774n80N330Q961R427
1228A0770L896m850r241q938l232M316P508Q343O378j278q548j0697n845J504
1242i914O401Q927O012J119o384j0557q330j607N619R257P203L452m334q855r343
1257a1334m181L985P965R583M208j323o420r365o253J749P590J0006N803M71m225
1272H259q761p504k089N891R403Q046J948k652q342q334m395K307Q279Q701L642
$$ plain form
1287 14399 13076 5931 -2800 -9006 -9688 -3977 5592 12070 11784 6025 -2769 -9794 -12841 -8148 1365
1302 1365 8619 11306 6664 -998 -8433 -12373 -10367 -2260 7404 12342 10069 3804 -4225 -10048 -9408
1317 -9408 -2637 6225 12920 14765 8847 103 -5697 -7440 -3839 4684 13215 16020 11349 3591 -4173
1332 -4173 -8445 -5942 332 8745 13274 12293 4734 -4496 -9126 -8966 -4505 3464 10226 11173 5914 -2503
1348 -2503 -9628 -11308 -6685 394 7497 11464 9092 564 -7510 -9899 -7194 -381 6767 12611 11984
1363 11984 6269 -2614 -8650 -7534 -1319 7198 12732 13846 10063 1291 -6069 -7611 -2649 4998 11948
1378 11948 14592 11095 3776 -3931 -8380 -6292 1527 8735 12159 11118 5442 -3144 -8344 -9476 -3521
$$ packed form
1287A4399j323p145q731o206o82N711R569O478k86n759q794p025l047M693R513
1302A365P254K687m642p662p435l940K006Q107R664M938k273o265q029n823O40
1317i408O771Q862O695J845n918q744n800j743L601Q523Q531K805m671p758p764
1332d173m272K503O274Q413M529r81p559r230m630J60M461P969O762R47n259q417
1348b503p125j680M623P079P103L967k372q528q074k389K705O813P148N844o27
1363A1984n715q883o036J116O215Q517N534J114l783q772p360j542M962P647O950
1378A1948K644l497p319p707m449K088P819P208L424j041n676q586n200j132N955
$$ [...]
8191A39
##END NTUPLES=NMR FID
##END=
