##TITLE=1H_SA_Phacet
 CDCl3
 8 sc, 
 14.04.2022
##JCAMPDX= 6.0         $$ Bruker NMR JCAMP-DX V2.0
##DATA TYPE= NMR FID
##DATA CLASS= NTUPLES
##ORIGIN= UXNMR, Bruker Analytische Messtechnik GmbH
##OWNER= root
$$ XWIN-NMR		Version 3.5
$$ Thu Apr 14 10:21:23 2022 Russian Standard Time (UT+4h)  she@DPX200
##.OBSERVE FREQUENCY= 200.13135
##.OBSERVE NUCLEUS= ^1H
##.DELAY= (6, 6)
##.ACQUISITION MODE= SIMULTANEOUS
##.ACQUISITION SCHEME= undefined
##.AVERAGES= 8
##.DIGITISER RES= 18
##SPECTROMETER/DATA SYSTEM= spect
##.PULSE SEQUENCE= zg30
##.SOLVENT NAME= CDCl3
##.SHIFT REFERENCE= (INTERNAL, CDCl3, 0, 15.7039)
##AUDIT TRAIL= $$ (NUMBER, WHEN, WHO, WHERE, WHAT)
$$ ##TITLE= Audit trail, XWIN-NMR		Version 3.5
$$ ##JCAMPDX= 5.01
$$ ##ORIGIN= Bruker BioSpin GmbH
$$ ##OWNER= she
$$ F:/spectra/data/she/nmr/H-F/1/audita.txt
$$ ##AUDIT TRAIL=  $$ (NUMBER, WHEN, WHO, WHERE, WHAT)
(   1,<2022-04-14 10:20:15.37 +0400>,<she>,<DPX200>,
      <created by zg, POWCHK disabled, PULCHK disabled
       configuration hash MD5:
       00 E9 B6 7A A2 85 ED C7 34 08 36 98 17 FE 4E 26
       data hash MD5: 16K
       42 DE 7C FF 53 D8 6F 7C 4A 3F 0A CF 07 98 F2 CB>)
$$ ##END=
$$ 
$$ hash MD5
$$ EC 76 BD 68 A9 19 6A 7B 2C 2F 56 BF 78 08 BB D8
##$RELAX= 
##$RELAX= 
##$RELAX= 
##$RELAX= 
##$RELAX= 
##$RELAX= 
$$ Bruker specific parameters
$$ --------------------------
##$DU= <F:/spectra>
##$EXPNO= 1
##$NAME= <H-F>
##$PROCNO= 1
##$TYPE= <nmr>
##$USER= <she>
##$AMP= (0..31)
100 100 100 100 100 100 100 100 100 100 100 100 100 100 100 100 100 100 
100 100 100 100 100 100 100 100 100 100 100 100 100 100 
##$AQSEQ= 0
##$AQ_mod= 1
##$AUNM= <au_zg>
##$AUTOPOS= <>
##$BF1= 200.13
##$BF2= 200.13
##$BF3= 200.13
##$BF4= 200.13
##$BF5= 200.13
##$BF6= 200.13
##$BF7= 200.13
##$BF8= 200.13
##$BYTORDA= 1
##$CFDGTYP= 0
##$CFRGTYP= 5
##$CHEMSTR= <none>
##$CNST= (0..31)
1 1 145 1 1 1 1 1 1 1 1 1 1 1 1 1 1 1 1 1 1 1 1 1 1 1 1 1 1 1 1 1 
##$CPDPRG= <>
##$CPDPRG1= <>
##$CPDPRG2= <>
##$CPDPRG3= <>
##$CPDPRG4= <mlev>
##$CPDPRG5= <mlev>
##$CPDPRG6= <mlev>
##$CPDPRG7= <mlev>
##$CPDPRG8= <mlev>
##$CPDPRGB= <>
##$CPDPRGT= <>
##$D= (0..31)
0 1.2 0 0 0 0 0 0 0 0.06 0 0.03 0 0 0 0 0.0002 0 0 0 0 0 0 0 0 0 0 0 0 
0 0 0 
##$DATE= 1649917214
##$DBL= (0..7)
120 120 120 120 120 120 120 120 
##$DBP= (0..7)
150 150 150 150 150 150 150 150 
##$DBP07= 0
##$DBPNAM0= <>
##$DBPNAM1= <>
##$DBPNAM2= <>
##$DBPNAM3= <>
##$DBPNAM4= <>
##$DBPNAM5= <>
##$DBPNAM6= <>
##$DBPNAM7= <>
##$DBPOAL= (0..7)
0.5 0.5 0.5 0.5 0.5 0.5 0.5 0.5 
##$DBPOFFS= (0..7)
0 0 0 0 0 0 0 0 
##$DE= 6
##$DECBNUC= <off>
##$DECIM= 32
##$DECNUC= <off>
##$DECSTAT= 4
##$DIGMOD= 1
##$DIGTYP= 9
##$DL= (0..7)
0 120 120 120 120 120 120 120 
##$DP= (0..7)
150 150 150 150 150 150 150 150 
##$DP07= 0
##$DPNAME0= <>
##$DPNAME1= <>
##$DPNAME2= <>
##$DPNAME3= <>
##$DPNAME4= <>
##$DPNAME5= <>
##$DPNAME6= <>
##$DPNAME7= <>
##$DPOAL= (0..7)
0.5 0.5 0.5 0.5 0.5 0.5 0.5 0.5 
##$DPOFFS= (0..7)
0 0 0 0 0 0 0 0 
##$DQDMODE= 0
##$DR= 18
##$DS= 0
##$DSLIST= <SSSSSSSSSSSSSSS>
$$ [...]
##$SUBNAM2= <"">
##$SUBNAM3= <"">
##$SUBNAM4= <"">
##$SUBNAM5= <"">
##$SUBNAM6= <"">
##$SUBNAM7= <"">
##$SUBNAM8= <"">
##$SUBNAM9= <"">
##$SW= 18.05172834244
##$SWIBOX= (0..15)
0 0 2 0 0 0 0 0 0 0 0 0 0 0 0 0 
##$SW_h= 3612.71676300578
##$TD= 16384
##$TD0= 1
##$TE= 0
##$TE2= 300
##$TE3= 300
##$TEG= 300
##$TL= (0..7)
0 120 120 120 120 120 120 120 
##$TP= (0..7)
150 150 150 150 150 150 150 150 
##$TP07= 0
##$TPNAME0= <>
##$TPNAME1= <>
##$TPNAME2= <>
##$TPNAME3= <>
##$TPNAME4= <>
##$TPNAME5= <>
##$TPNAME6= <>
##$TPNAME7= <>
##$TPOAL= (0..7)
0.5 0.5 0.5 0.5 0.5 0.5 0.5 0.5 
##$TPOFFS= (0..7)
0 0 0 0 0 0 0 0 
##$TUNHIN= 0
##$TUNHOUT= 0
##$TUNXOUT= 0
##$USERA1= <user>
##$USERA2= <user>
##$USERA3= <user>
##$USERA4= <user>
##$USERA5= <user>
##$V9= 5
##$VALIST= <valist>
##$VCLIST= <CCCCCCCCCCCCCCC>
##$VD= 0
##$VDLIST= <DDDDDDDDDDDDDDD>
##$VPLIST= <PPPPPPPPPPPPPPP>
##$VTLIST= <TTTTTTTTTTTTTTT>
##$WBST= 1024
##$WBSW= 4
##$XGAIN= (0..3)
0 0 0 0 
##$XL= 0
##$YL= 0
##$YMAX_a= 414447
##$YMIN_a= -359593
##$ZGOPTNS= <>
##$ZL1= 120
##$ZL2= 120
##$ZL3= 120
##$ZL4= 120
##$ABSF1= 10
##$ABSF2= 0
##$ABSG= 5
##$ABSL= 3
##$ALPHA= 0
##$AQORDER= 0
##$ASSFAC= 0
##$ASSFACI= 0
##$ASSFACX= 0
##$ASSWID= 0
##$AUNMP= <proc_1d>
##$AZFE= 0.1
##$AZFW= 0.1
##$BCFW= 1
##$BC_mod= 2
##$BYTORDP= 1
##$COROFFS= 0
##$CY= 11.3945322036743
##$DATMOD= 1
##$DC= 2
##$DFILT= <>
##$DTYPP= 0
##$F1P= 2.36226072786647
##$F2P= -0.459571619588291
##$FCOR= 0.5
##$FTSIZE= 0
##$FT_mod= 4
##$GAMMA= 1
##$GB= 0.15
##$INTBC= 1
##$INTSCL= 1
##$ISEN= 128
##$LB= 0.24
##$LEV0= 0
##$LPBIN= 0
##$MAXI= 10000
##$MC2= 0
##$MEAN= 0
##$ME_mod= 0
##$MI= 1.114404
##$NCOEF= 0
##$NC_proc= 0
##$NLEV= 6
##$NOISF1= 3.799351
##$NOISF2= 2.8
##$NSP= 1
##$NTH_PI= 0
##$NZP= 0
##$OFFSET= 15.70392
##$PC= 1
##$PHC0= -18748.06
##$PHC1= 13.60078
##$PH_mod= 1
##$PKNL= yes
##$PPARMOD= 0
##$PSCAL= 0
##$PSIGN= 0
##$REVERSE= no
##$SF= 200.130013532006
##$SI= 16384
##$SIGF1= 3
##$SIGF2= 2
##$SINO= 400
##$SIOLD= 16384
##$SREGLST= <1H.CDCl3>
##$SSB= 0
##$STSI= 0
##$STSR= 0
##$SW_p= 3612.71676300578
##$SYMM= 0
##$S_DEV= 0
##$TDeff= 0
##$TDoff= 0
##$TI= <>
##$TILT= no
##$TM1= 0
##$TM2= 0
##$TOPLEV= 0
##$USERP1= <user>
##$USERP2= <user>
##$USERP3= <user>
##$USERP4= <user>
##$USERP5= <user>
##$WDW= 1
##$XDIM= 8192
##$YMAX_p= 0
##$YMIN_p= 0
$$ End of Bruker specific parameters
$$ ---------------------------------
##NTUPLES= NMR FID
##VAR_NAME=  TIME,          FID/REAL,        FID/IMAG
##SYMBOL=    X,             R,               I
##VAR_TYPE=  INDEPENDENT,   DEPENDENT,       DEPENDENT
##VAR_FORM=  AFFN,          ASDF,            ASDF
##VAR_DIM=   8192,          8192,            8192
##UNITS=     SECONDS,       ARBITRARY UNITS, ARBITRARY UNITS
##FACTOR=    0.0002768,     1,               1
##FIRST=     0,             0,               0
##LAST=      2.2672688,     0,               0
##MIN=       0,             -359593,         0
##MAX=       2.2672688,     414447,          0
$$ Real data points
##PAGE= N=1
##DATA TABLE= (X++(R..R)), XYDATA
$$ [...]
2379D31K979j670l911j218L053L106j501m071j150L460K921j299l667o91L666
2394D38L132p77l804o63L687K965j792l883j594K995K828j969m576j581L019K733
2410A158j241l851j245L566L668p99l330q44L966L727p05l670r82L004K916j948
2426C390l938k188K516K605k043m203j492K781K783n75l721j085L905L991l19
2441B407l232n58L166L507p13l493j537K431K671j411m334k358K418K268r48m334
2457d050j548K543L302m27l109r36K895L771Q6k906j251L087L562m70l662j618
2473g31K254K771p32m012k297K141K678j062m038j649K172K907k05l242j608K599
2489b054L662L8l144j137K589L531R8l533j367K132L522k36l442k436K572K887
$$ y = [431, 3410, 1740, -2171, -3389, -336, 2770, 1269, -2802, -3952, -492, 2429, 1130, -2537, -3228, 438, 3570, 2793, -1011, -1674, 2013, 4978, 3186, -697, -2291, 704, 3532, 1563, -3013, -4594, -1575, 1158, -83, -3934, -5179, -1613, 2055, 1256, -2074, -2918, 1048, 4775, 4070, 400, -582, 2422, 5338, 3390, -548, -2736, -220, 2385, 342, -3861, -5353, -2572, 211, -364, -4085, -5170, -1265, 2726, 2407, -825, -1383, 1783, 5290, 4577, 1084, -453, 1978, 4649, 3238, -1096, -3454, -1036, 1232, 284, -4050, -5598, -3055, 247, -180, -3289, -4225, -1330, 2441, 2527, -379, -1630, 1457, 5019, 4549, 887, -731, 1523, 4294, 3562, -450, -2747, -606, 2072, 1010, -3028, -4677, -2505, 402, 197, -3045, -4653, -2054, 1608, 1646, -1498, -2635, -46, 3485, 3583, 50, -1317, 815, 4337, 4101, 659, -1777, 795, 3682]
2505C682r29l686k193J639K945m87l567k384K538L073l70l127j565K105L541Q29
2521B044l097j465K678L517N79k939j976K032L169K01l721k321J385K602n35l682
2537a529k425J471K623k19l134k091K018L352L97k546j681K442L664Q05k440j959
2553a252K246L791K23l268k147J310K917j17l430k985J197K847j49l596k117J053
2569c477L232N09k763k083J951L630J004k553j697J749L753Q73k702k164J671
2584I33K978N51l332k692J080K693K42k969k910J010K764P55l396k141J569K891
2600B6J042k119k179J213L549J160k303j762J467K998R06k260k585P23L126N38
2616C540l078k852P69K616N33k770k761Q80L161O70k181k395J389L862P33k408
$$ y = [3682, 2753, -933, -3126, -1487, 1458, 971, -2596, -4980, -2442, 631, 261, -2866, -4431, -2326, 1215, 2044, -1053, -2518, 160, 3677, 4256, 1317, -659, 1373, 4542, 4743, 1022, -1299, 86, 2688, 2153, -1529, -3954, -2483, 140, -79, -3213, -5304, -3286, 66, 463, -2083, -3764, -1322, 2342, 3147, 707, -1252, 994, 4785, 5008, 1740, -407, 903, 3820, 3703, 273, -2712, -1515, 1332, 1183, -2413, -4530, -3477, -245, 264, -2499, -4582, -2631, 999, 2003, -550, -2247, -498, 3255, 4128, 1426, -738, 933, 3911, 4462, 1130, -1562, -482, 2211, 2453, -516, -3426, -2416, 348, 1103, -2293, -4434, -2865, 26, 1068, -1051, -3230, -2017, 1532, 2692, 389, -1373, 94, 3092, 3998, 1738, -847, -124, 3002, 3540, 462, -2390, -1621, 995, 1528, -1242, -4003, -3123, 38, 708, -1473, -3868, -2479, 1383, 2116, -292]
2632b92j956J555K926J390k295k781J158K988O85k388k758O27K510J158k825k519
2648b817J53L026P75k138k256Q19L259J263k052k453J040L151J251k579k350J090
2664h18L018O86j865l183O05L144J120k467k564O95K620R94j901k630J9L535J200
2681B208k133k350L33K715J730k078k885O17L270J138k304k579M32L172J504j894
2697H96k710L19K985J415j770k949J39K939J662k341k975K63K567J475j836k759
2713b680j7L006J341j781k189L58K659J768j515k410K61K581J536j774k479r8
2729a433L097J571k502k734j87K784J341j691k879j11K903J458j105k738M53K313
2745E40J779j159k594q9K464J474j496k520j00K560J379j922k500o5K584J668
$$ y = [-292, -2248, -693, 2233, 3623, 1328, -1453, -295, 2693, 3378, 990, -1768, -1141, 1369, 2527, -298, -2817, -2664, 362, 1137, -1001, -3257, -2438, 821, 2084, 32, -2421, -1381, 1770, 3021, 442, -1908, -818, 2200, 2886, 1021, -2162, -1557, 1587, 2707, 240, -2324, -1629, 991, 1985, 84, -2546, -2527, 1008, 2208, 75, -2275, -1942, 773, 2503, 425, -2460, -1843, 1427, 2565, 261, -2318, -1886, 1286, 2790, 896, -1814, -1495, 1490, 2905, 1135, -1814, -1675, 1264, 2926, 585, -2390, -2127, 440, 1915, 79, -2680, -2697, 309, 1650, -131, -2320, -1962, 697, 2465, 950, -1460, -1199, 1382, 2918, 1144, -1335, -1433, 1664, 3235, 733, -2001, -2188, 596, 1937, 246, -2633, -2744, 159, 1617, 512, -2226, -1773, 540, 2319, 1160, -1434, -1523, 941, 2415, 919, -1601, -1701, 859, 2238, 316, -2184, -2249, 335, 2003]
2761B003j418k543l48L022J878j345k422r3K510J808j316l025l95K152J372j243
2777E97l006n24K208J501j356k067j27K460K345j495j891K51K894J831j301k075
2793B45o02K310K072j748l540o67K000J512j658k997j010K328K049j249k306j03
2809c364K624K263l95k023O3K561K182q73k297o57K020J497j525l182q47J835
2825a18J474j430k958r48K554K055j041k180n11K589K539l03k353o61K332K236
2841C276p03k851n93J844J539j105k700r85J699J955j124k442p33K750J935p27
2857A035k416l32K035K303o70k824r76K111J548p75k849j100J716K166m34k442
2873a904q56K039K396k35j906o69K249K294l72k647o48J412J620j136k848j306
$$ y = [2003, 585, -1958, -2306, 716, 2594, 1249, -1173, -1266, 1244, 3052, 1736, -1289, -1684, 468, 1840, 597, -2409, -2933, -725, 776, -580, -2647, -2774, -314, 2031, 536, -1355, -1104, 1790, 3621, 2320, 245, -357, 1953, 4025, 2277, -1263, -1930, 70, 1582, -76, -3073, -4083, -1755, 294, -955, -3261, -3364, -740, 1523, 1128, -895, -832, 1729, 3911, 3038, 741, 84, 2104, 3601, 2076, -1106, -1953, -118, 1356, -74, -3032, -3980, -1426, 629, -412, -2592, -3103, -514, 2025, 1722, -631, -1292, 1040, 3276, 2573, -278, -871, 973, 2512, 1407, -1293, -2278, -579, 1376, 252, -2190, -2923, -173, 1762, 1035, -1381, -1713, 322, 2625, 1955, -869, -1845, 266, 1814, 1039, -1810, -2910, -1194, 972, 538, -1904, -2760, -721, 1675, 1440, -466, -1135, 1114, 3408, 3036, 389, -259, 1153, 2773, 1637, -1211, -2517]
2889b517J629J290r82k311j089J655K355K69k266p45K551K848J19j948r82J744
2905A620K553n59k701j387J052J195p28k696j840J157K202r02j933j156K152K546
2921E75K75j913l33K050K557p5j999r76J562J964p51k650k059J288J497n15k511
2938b014j777J478J892K52k056q01K089K367P49k290n04J510K327l98k386j047
2954f09R78J916l86k865j581R71J916J42k119j460J589K570J57j772o75J071K439
2971B282L36k526r57Q75K315o28k431j341Q51K163m91k154j538J294K754N3j371
2988e14j042J364K723K41j873j134R75J976L10k754j989P36J765k47k361j408
3004c232R67J918O12k156r23J450K850M12j549r46J422K146M58j850j513L64J963
$$ y = [-2517, -888, 402, -580, -2891, -3980, -2325, 30, 299, -1967, -2712, -161, 2687, 2806, 858, -124, 1620, 4173, 3614, 913, -474, 578, 1773, 1045, -1651, -3491, -2334, -132, -1034, -2967, -4123, -1971, 575, 850, -1063, -1396, 654, 3211, 3136, 1137, 161, 1723, 3687, 2936, 286, -1773, -485, 1012, 497, -2014, -3791, -2313, -421, -169, -2225, -3026, -937, 1430, 2179, -111, -615, 895, 3222, 2824, 438, -609, 369, 2285, 1899, -966, -2547, -1576, 340, 482, -1637, -3097, -1508, 1062, 1219, -553, -1228, -157, 2282, 2618, 92, -865, 10, 2325, 1697, -734, -2075, -1224, 939, 448, -1706, -3244, -1950, 804, 857, -514, -1556, -192, 2531, 2772, 899, -235, 740, 2716, 3026, 272, -1717, -981, 784, 537, -1824, -3232, -2265, -347, 265, -1891, -2814, -1364, 1486, 1898, 349, -597, 825, 2971, 3429, 1579, 66, 430, 2393]
3021B393l53k377j904P03J420M09k198j470R86K331K34j446r55J289K350J003
3037B415j574j476J371J539N14j893j704L25K187r3k065j843P22J855M73j755
3053a002j271J294J733O63j024j646N77K194N97j853j678Q48J644K71j591j794
3069b038M29J985O21j553j405Q03K240R44j582j491Q46K378K67j445j786N01J692
3086A406M51k177j639L35J772N19j635j930P77K238L93j264j057Q73K327J112
3102B501j319j621P75J866O19j325k020J88J598O49k140j910K69K024M58j809
3118a197j892N84K339Q67j207j473N93K107J135r10j579M03J910P02j080j917
3134f15L23J555P15j556j834J78J810O20j541j732J82K183O36j077j851M06K261
$$ y = [2393, 2040, -337, -2241, -1538, -118, 291, -1907, -3377, -2391, -60, 174, -1272, -2227, -938, 1412, 2415, 841, -635, 736, 2275, 2789, 896, -808, -483, 1704, 1611, -454, -2297, -1575, 280, 753, -1002, -2273, -979, 754, 1417, 393, -1253, -676, 1518, 2115, 262, -1416, -568, 1076, 1347, -244, -2038, -1609, 376, 997, -556, -1961, -1158, 1082, 2026, 444, -1047, -201, 2177, 2444, 999, -787, -286, 1406, 1857, -320, -1959, -1624, 148, 667, -968, -2898, -2121, 117, 510, -754, -1811, -938, 1389, 2501, 1182, -439, 336, 2202, 2821, 1496, -524, -336, 1262, 1911, -229, -2139, -1870, 154, 612, -1197, -3089, -2505, -166, 701, -506, -1979, -1386, 721, 1856, 946, -633, -230, 1680, 2382, 1302, -615, -292, 1263, 1978, 422, -1412, -1234, 576, 1196, -345, -2077, -1895, 288, 924, -153, -2004, -1598, 663]
3151F63Q47j256j929O48J868J053j417j729M49J946P75r47j699K45J803N38j162
3168F96j813J31J448J171j477j738K2J395J151j174j567p4J881J208j194j815
3184a749J99K010J268q60j741K00J845J270j346j698M0J638J143j270j839L8J200
3201C48J051j454k049J45J286J094j119j560P1J661J412p28j632M24J796J252
3217A998k88j869K69J551J329r05k130q4J107Q28j232k316m19J391R34j258j702
3234b796oJ657J346m83j541L57J894J697o10j402N5K068J143r71k070l37J114
3251A115Q57q38k397o04J257R92r52k040k40J435J362l60j448L13J473J528n12
3268I41j249l45J886J160o78j751m18J364R14o88j860o41J570J186j008j621k68
$$ y = [663, 1510, 254, -1675, -1027, 841, 1894, 477, -1252, -803, 1143, 1918, 971, -728, -483, 1320, 1858, 696, -1117, -986, 462, 1633, 156, -1582, -1560, -165, 986, -188, -1755, -1829, 52, 1260, 66, -1749, -1550, 460, 1728, 868, -873, -673, 1172, 2442, 1096, -602, -562, 1076, 2219, 949, -890, -852, 348, 1399, -55, -2104, -1959, -673, 421, -698, -2258, -2187, -526, 886, 158, -1474, -1050, 746, 1998, 1710, -159, 110, 1661, 2990, 2085, -45, -129, 978, 1806, 574, -1742, -2161, -770, 164, -1094, -2796, -2802, -1145, 201, -282, -1823, -1466, 428, 2125, 1515, 113, 168, 2236, 3379, 2408, 338, 1, 1115, 1972, 1134, -1263, -1867, -610, 382, -570, -2610, -2850, -1415, -53, -413, -1861, -1548, -75, 1453, 941, -308, -653, 1233, 2393, 1715, -36, -454, 910, 1824, 1136, -724, -1365, 205, 1391, 383, -1238, -1506]
3285a506R87J704l08k001l14J089J385n05j510q40J289J225o17j405m38J419J359
3302A013Nj601l65J865J667p04j351n22J396J516q43k430p14R45J323j519j663
3319a982q73J016J583r03j345k30J466J790Q4r42k53J607J640K38j383n95R01
3336A819J117l81k183j105O29O84n89k267q09J240J240n14j217k12J426J879L13
3353A070j118p83J317J797K28j458q75P50J012k11j842q73O06Q65k72j243j039
3370b069J158J511l60j295o23J572R88L45j585j014J032J518j4j871q63O93J834
3387I57k01j606p26R75J663J11j199n32J036J481J26j771n56R07P60j15j880r98
3405a568M09J122r7j652j088R80J856q2j142p59J688J786N44j110r14J085J808
$$ y = [-1506, -519, 1185, 877, -1124, -1438, -349, 1036, 531, -979, -1819, -530, 695, 78, -1327, -1765, -346, 1013, 1018, -583, -948, 917, 2584, 1880, 529, 7, 1403, 2919, 2076, -354, -1068, -123, 1200, -319, -1982, -2855, -1839, -256, -1159, -2504, -2734, -1268, 522, 606, -336, -589, 1018, 2658, 2896, 1513, 918, 1819, 2936, 2555, 372, -733, -104, 580, -9, -2276, -3085, -1845, -605, -1119, -2336, -2548, -1122, 757, 1070, -48, -831, 486, 2283, 2511, 1053, 178, 928, 1940, 1729, -113, -986, -380, 485, 213, -1030, -2069, -911, 600, 240, -1055, -1678, -106, 882, 1227, -358, -1372, -340, 1178, 1164, -707, -1570, -877, 957, 756, -850, -1576, -601, 1062, 1173, -26, -558, 478, 1959, 2085, 314, -242, 665, 1425, 1310, -570, -1568, -1159, -37, -134, -1786, -2874, -1894, -38, -120, -1262, -2021, -333, 1453, 1997, 887, -27, 1058, 2866]
3422B866L19j865j005M26J103p74j814j035K45Q89n55j013p73J000J179N98j097
3439a306m61J359J697P44j146p43P76J645K37j603j280P88Q48K5j764j308K36
3456a256J194J66j490j146P81J505N03j055q34J081J479J94j041o91Q63J203Q2
3473A538j117j146J005J003J15j021j387O81J478K62j539j066P84J120N22j383
3489a51j117L31J183J24j186j147N25J609P5r67q96P58J615Q08j097o79L79J560
3507A727O54j218j130M63J152Lj260j595K79Q21L78j329j037O1J069N29o44j090
3525b167O21J579J013q26n69N14J500P47r07j088M92J157K74j132j549P8P31K10
3543F78j414j179mJ447N7p57j205M91J106J050o51r24O75J729P31j002p55J68
$$ y = [2866, 3185, 1320, 315, 741, 1844, 1070, -744, -1779, -1534, -645, -1200, -2213, -2986, -1986, -807, -209, -1306, -1767, -408, 1289, 2033, 887, 144, 920, 2565, 2802, 1199, -81, 707, 1555, 1580, -184, -1492, -1256, -62, 104, -1386, -2532, -1751, -246, 257, -798, -1632, -551, 928, 1122, 81, -610, 253, 1456, 1538, 421, -725, 280, 1283, 1398, 377, -1010, -329, 1149, 1411, -128, -1194, -410, 710, 1232, -151, -1268, -937, 246, 370, -816, -1963, -1438, 171, 246, -721, -1617, -859, 756, 1564, 467, -212, 167, 1727, 2381, 1163, 33, 496, 1648, 1651, 391, -1204, -925, -104, 274, -1055, -2092, -2031, -962, -433, -1077, -2167, -1546, 33, 1046, 220, -349, 165, 1665, 2412, 1505, 417, 909, 2066, 2340, 1208, -341, -263, 468, 678, -736, -1915, -1919, -472, -415, -1172, -2377, -1886, -780, 270, -381, -1305, -630, 1099, 1830, 828, 73, 241]
3561B41J402M59r57r98O2P22O30j079j557J27R20M82j072j229J38R24Q75p69r91
3580a670K6J886P33q12r32N09J299N09p54p48J2J015R73j221j511L20R85M73j072
3599B0j176J80J161L02p98j143j4J387O91q98r10J54J140J104q18j322L07J045
3617D12P50n44j137k6J291Q07n47j227L4J072K87n78j475PQ23P59p41j314j28
3636a475P46J014p93q19m03J625R15n07r98L24J234Q09l99j081j2P75Q13n82j594
3655d08k88R98L34o61j460k62R68P20o32r31J69J284O97k0q97K92R33J233k36
3674A833j437N3P99L39p37j071p02P78L91n43j189l67Q75P91j09r83j50J394Q54
3693H19l9q07p0J135O93l24j209l62J082J89l95j604m04J127K13k37r68l38Q94
$$ y = [241, 1643, 2102, 1145, 147, 209, 931, 1561, 482, -1075, -948, -28, 454, -618, -1847, -1709, -785, 90, -679, -1670, -1644, 242, 975, 163, -769, -260, 1039, 1548, 794, 46, 58, 1073, 2046, 825, -686, -366, 619, 1092, 20, -1156, -976, 185, 487, -311, -1454, -1468, -81, 610, -288, -1198, -1044, 96, 1200, 382, -940, -633, 412, 1162, 618, -519, -545, 746, 1553, 1006, -221, -187, 885, 1172, 594, -881, -874, -51, 708, -33, -1347, -1475, -729, 285, -508, -1327, -1730, -105, 810, 303, -695, -371, 863, 1672, 1273, 192, 180, 955, 1768, 1186, -408, -696, 302, 636, -25, -1485, -1747, -779, -59, -691, -1622, -1453, -169, 528, 508, -389, -97, 836, 2069, 1833, 396, 449, 1248, 1587, 850, -221, -923, -145, 246, -297, -1486, -1853, -978, -187, -296, -1279, -1429, -35, 819, 780, -27, -97, 1038, 1731, 1407, 198, -164, 918, 1107, 712, -892, -1296, -169, 44, -193, -1161, -1499, -605]
3712f05Q62m30q63J39R72Q42k21p43l12Q91O15l22j292j28N12P28k93j144l22
3731a114J014O90j56r85J4R24R09l80j248k84R22K48j3j201p06O07Q76l0j250
3750a163m17Q15R57O8q64mJ024Q81J72q40l53Q87O55l79j373o46P39M00n66j090
3770a097r34N58Q40K5r00l44Q65J383K98r65Q3J037Q31N5p27m59M35P58l89j286
3790F7q06M78M85l33j086q43O47Q50J29r48J85L00J356J99o42l67R36P46K74j014
3810F13q55M93Q58j99j300m91L31P98j69r28l72P38N87J27o03m74N97J163J06
3829A020j184k25O92P08j42n95j117O03O66n1j058l00L52P86K68p73n17P19R63
3848H15K19p20n46M44N79J61j141n75K35J027j79r29n27L16R33J94p96l70L38
$$ y = [-605, 257, -173, -1036, -897, 75, 917, 696, -47, -359, 532, 1147, 825, -467, -595, -83, 645, 352, -792, -1114, -100, 590, 434, -551, -537, 387, 1296, 916, -332, -616, 306, 554, 541, -660, -1366, -759, 117, 87, -1163, -1580, -765, 192, 260, -604, -608, 416, 1297, 1469, 629, 276, 1163, 1818, 1439, 66, -580, 159, 559, -7, -1097, -2031, -1473, -633, -608, -1508, -1852, -987, 396, 694, -271, -188, 849, 1680, 1735, 1008, 549, 984, 1742, 1353, 67, -739, -261, 224, -109, -1195, -2038, -1391, -541, -412, -1360, -1175, -875, 481, 680, 38, -329, 607, 1353, 1627, 613, -242, 251, 1109, 910, -390, -881, -550, 248, 79, -849, -1221, -483, 104, 231, -372, -846, -249, 914, 1020, -164, -389, 303, 1011, 869, 274, -843, -240, 426, 375, -683, -983, -631, 155, 423, -350, -867, -148, 815, 1034, 314, -232, 212, 791, 952, -189, -764, -529, 498, 319, -610, -1137, -821, 112, 306, -490, -860, -522]
3867e22J198J10m68q46L49J277M14j373m51K04M70J11q31q85L99P81J47p24l16
3886i56R2J028J85n52l18O97N52M66p48o31M68N84L45j174p52J19Q73M7j098n16
3906a289l5J088L36n29m35K86J299K91p16l92N46Q31J92r96m87J41O49j09q95
3925b24p19J85R12j57q34o68M27R59K01m16m92L65J041K04l07n58L12Q04J41p17
3945D59o76J47L83N78q98o66j44P19K00p30n90L76R49Q4n33n40M26R27O02n09
3965E64r29M52O66L83q46n42K50M57J69n80o10K48L19L49m13q07L09Q59J49m12
3985C5p80K39O85L74l42p65J54R23K97p28m25l2J036K53m74p55k39Q72N17n42
4005C03r05J8R23Q8n10p26P0P98m1p6j023j2Q23N96n33l06J32P78O01p22m79L41
$$ y = [-522, 676, 786, 318, -528, -179, 1098, 1512, 139, -312, -108, 362, 473, -358, -1243, -844, -63, 84, -640, -956, -864, 164, 349, -203, -521, 176, 728, 1194, 446, -185, 283, 867, 1212, 38, -714, -595, 278, 325, -773, -1289, -1324, -236, 100, -429, -864, -578, 721, 1012, 296, -96, 450, 1281, 1473, 477, -10, 131, 780, 671, -224, -943, -758, 154, -3, -837, -1505, -1078, -119, 82, -334, -826, -461, 580, 784, 477, -81, 231, 1035, 1176, 459, -217, -70, 313, 891, -7, -673, -817, -98, 102, -628, -1218, -842, 107, 191, -342, -882, -456, 471, 1073, 564, -365, 87, 753, 1136, 290, -252, -2, 455, 624, 44, -566, -318, 1, 350, -63, -870, -561, 298, 447, 35, -745, -506, 179, 553, 211, -554, -400, 523, 820, 92, -333, -365, 671, 924, 450, -305, -544, 328, 845, 303, -602, -584, 339, 427, -83, -809, -739, 59, 18, -58, -1081, -1093, -270, 326, -207, -513, -381, 397, 998, 276, -203, 138]
4027A38N68N80o18p50J9M76K53o47j004L01R7O70o49p43J40M53J007n39o53m0
4047i41J050O55j17n11K63M25P38n53p87KL24N61q38p01m62P59p1j40j118K04
4067a258K16O53O3r37K13Q99N88O3p32J99Q64L27m2p11l06P52J32n35m52k03K09
4088BM86q61n79k01Q09O3o9p43k22J112M30J25j104M28P89N00m53n08KN90M70
4109A066k20r54kM44M65l66q14k60P37K10k65o30k51O34L00l82m64N9O36L71p6
4130B38n52l48J106L21k20n70l08R21L11k90m94j84M05M08k56o46m30M68L04m48
4150b64o53n9K31O47r6p14q4P47N44j59l23j92Q86M55j72o74K2M61L26j78n80
4171A71m57J87K89N6r04k22L45M01j30p91J31M73R85n49k30m0N34P83l07m82j82
$$ y = [138, 706, 1286, 668, -82, -63, 413, 666, 19, -985, -684, -587, 83, -566, -1309, -1169, -716, 291, -248, -901, -941, 109, 764, 647, 136, 399, 824, 1562, 1009, 222, 224, 548, 1109, 271, -430, -892, -133, -204, -344, -1462, -1258, -1042, -389, -326, -1263, -1050, -151, 437, 500, -232, -33, 831, 1158, 1116, 405, 99, 851, 983, 448, -4, -207, 2, 488, -373, -952, -1153, -344, -281, -350, -1093, -1315, -203, 227, 352, -752, -324, 465, 965, 512, 4, 6, 596, 1066, 846, -108, -110, 334, 799, 433, -381, -641, 96, 306, 41, -589, -840, -206, 94, -288, -752, -693, -57, 314, 238, -314, -662, 444, 765, 545, -25, -333, 588, 899, 609, 115, -69, 336, 744, 488, -158, -588, -120, 184, -264, -917, -976, -745, -98, -194, -908, -992, -245, 299, 140, -183, -375, 511, 966, 794, 120, 142, 603, 929, 751, 171, -286, -99, 190, 246, -658, -880, -535, -134, -264, -1055, -924, -451, 534, -15, -245, -285, 249, 1032, 725, 243, 61]
4192F1N51N60l15p05l10J73M88j84q16o33N62L55K72q78n6K1Q02K36n96j05N81
4213F4P74mn54m30N44N24M7o14m12K23O48j52o39p46Q25N7R2p46k67L17N09Mp49
4236f85k97O23O87j41l27j16N04M74k7n68k84M02N81j71m18m00k5Q15r8p63l77
4257f11L78J67O6m57m59L34N18K53p37k30P94J65M73m70n77Q83l6K98n18l15N64
4278D83K46p7o02m51J02R19o87k03m27K74O21p1o75k92L21M73P7j96n77O55P17
4299F30l7o06l77K97Q78Np04j59L05L94L18q09n15J76N46j85m43k44j19K44O91
4320B86p40m56K16O92L2k14l58N0O88O32q13j39M41L38M53o44m31J7M13K25p84
4341i6m67K45J12O9m20l78K40O26N6k20k56K78K08Q11m49l26J19N96O2l49l46
$$ y = [61, 612, 1172, 857, 152, -158, 15, 503, 319, -497, -1130, -568, -213, 59, -819, -875, -854, -52, 184, -412, -517, 64, 838, 834, 280, -150, 394, 918, 965, 351, -61, 162, 810, 658, 19, -727, 98, 155, 247, -499, -766, -449, 60, 64, -685, -982, -359, 328, 187, -140, -256, 248, 722, 695, 127, -157, 245, 826, 655, 237, -163, -188, 627, 529, -234, -611, -233, -66, 0, -457, -916, -582, -64, 189, -548, -778, 16, 181, 654, 184, -393, 490, 454, 752, 234, -81, 483, 729, 652, 50, -401, -299, 620, -67, -270, -697, -423, 198, 127, -548, -840, -519, -46, 31, -165, -742, -87, 630, 593, -13, -390, -93, 785, 790, 86, -73, 232, 626, 944, 135, -380, -204, 342, 157, -286, -530, -649, -405, 286, -454, -910, -694, -2, 30, -184, -542, -492, 196, 828, 15, -124, 317, 655, 1108, 464, 33, 50, 463, 688, -96, -563, -318, -206, -137, -557, -935, -695, -69, -13, -233, -489, -211, -3, 808, 359, 33, 152, 748, 810, 461, 115]
4362A15P3L16J87o00p31L92K68q0l10l42j44Q54K13m08l50L80M80J65l10k38N4
4383a6L21K85l38l27l52Q37J5m35l87K03K07M13k64n30k1R24q7m80j80k56O91
4404B23r5k29m33J15L82K29l01l06P1N73K34l10j25K67K18K47r3n41j85O35J7
4425E93l22o04k32K06P5j32o20K64J85K45L5k35n4O10P06k59K3O4L09K67o8p62
4447B94N9L62K40o82m78n43L48J76l40l13k97N23K28m2j94J2M65O25R2k84J35
4468C86K80M58j62q24J66J35M29n11m09n81O74J20n58m22O8K18K95r3o41L16N18
4489a38N84j86o74L60K22L11Nm88J07K81K35k54m13q6N25J37j43n50K22nL77m54
4511b5m59Q0J03K83n42q6l74O64L45o8m48QM37M66j18k35M52J19L12J06l67k47
$$ y = [115, 188, 504, 691, 91, -640, -248, 20, -60, -370, -712, -856, -2, 211, -197, -547, -167, 313, 478, 168, -70, -16, 305, 590, 252, -75, -427, 410, 425, -10, -397, -194, 13, 426, 162, -368, -389, 535, 448, -32, -212, -468, 223, 128, -101, -534, -419, -37, 192, -109, -415, -344, 229, 463, 153, 28, 295, 513, 760, 667, 126, -59, 576, 593, 271, -333, -565, -359, -284, -416, -1036, -772, -587, -342, -307, -542, -596, 14, 720, 461, 484, 548, 857, 1124, 1056, 294, 353, 715, 955, 273, -205, -748, -400, -224, -564, -877, -1174, -651, -423, -465, -659, -647, -182, 443, 535, 251, 386, 666, 1124, 962, 138, 304, 439, 868, 357, -52, -633, 41, 161, -397, -819, -751, -533, -238, -331, -972, -656, -138, 446, 260, -414, -54, 168, 479, 484, -4, 103, 384, 619, 365, -48, -134, 391, 528, 385, -165, 57, 52, 429, -25, -484, -404, -301, -18, -560, -646, -1020, -356, -11, -79, -527, -519, -82, 384, 266, 31, 483, 602, 914, 1020, 653, 406]
4533D06Q1J31m9r64l0n7K92l46m38j31L05L59j44l15L59J27O76L8r4p7N69L72
4555A070k3n24J73j19L28l35m78m64J85K20l47l36n97N61K03j7m21J07M24O37
4575B47j52k99J91M92K89k54m5j38K34j54J0r8n76K71J41k41l60j21K26R0q0j41
4597d68j25K52K27j9K2j03M06L67m7n26J12L34J83k74n03K54m9N48m16k63j24
4618b12K58J21j94l53j13K12J85j6k65k65K94K28L27k82j90M79K37J01l44P8J83
4639D69Q8P7l92m70M80K19j67m42m30L52J86m86l23K11L39K4m6j26J5J60M99M59
4661F96k27j56K27K02J68k15l63j1L2K29o49K4m33L81k18n06QjL07J43J54l47
4683e55J00M95J18j09k4L02L14r4J70o06R9L87Q0m19l64M1P9q2j95n97Q6O05m7
$$ y = [406, 487, 618, 569, -395, -425, -482, -190, -536, -974, -1105, -800, -441, -585, -900, -541, -414, 262, 300, 206, 129, 698, 1070, 1047, 523, 696, 577, 905, 570, 92, -372, -187, 33, -314, -650, -1247, -686, -483, -500, -921, -814, -390, 247, 95, -204, -13, 479, 768, 514, 469, 331, 565, 411, 421, 323, -253, 18, 159, -82, -442, -563, -337, -247, -327, -468, -593, -341, -114, -133, -111, -214, 192, 559, 512, -14, 98, 432, 615, 341, -162, 92, 43, 591, 175, -88, -212, 46, 167, -27, -380, -493, -281, -96, -112, -377, -642, -348, -120, 207, -75, -265, 214, 451, 552, 208, 286, 469, 557, 634, 242, -228, 252, 471, 304, -138, -568, -216, -30, -516, -839, -628, -289, -265, -311, -437, -422, -262, 237, 696, 469, 313, 540, 742, 910, 695, 332, 321, 353, 582, -67, -43, -476, -95, -313, -819, -811, -812, -505, -362, -208, -555, -455, 40, 158, 49, 25, 327, 641, 547, 717, 111, 210, 597, 677, 258, -106, -65, 14, -68, -263, -860, -774, -169, -216]
4706b16k82k13pN58M26k14P5J37L89j00j3p4M6L76j23o92m6m8K63L2n45k34J29
4729c76K39l7k42k73L70L20k29J60k70L55L28J49k20j68oM34j35k30k27Q8qL75
4751C97m01l87L29J81j0k81j70j02N61K9l21l09K36J01K25j01l07l3N42J73j99
4772A53j52K44N1K26j81k87L1N93l72m10j25o8L84j83m93J1o1K35J31k75o8L9
4794e77M70L37j63M3K10L21K71r8m59J44L89j64o16j72k82J51J47l13j60m56J01
4815h76M19k29j97O03R3K57m6l27M85M33K96k86oj07K85j58j79m53Q8k08r9m4
4837b56k90l1PJ61l10J34R3K08M94j89L8J1M61Lo4r7k54M57j6l79j04l93N16j88
4861A2o3l18p5M21q7j85j94K42J14K44Kk46j07N37k94N5m40M1J73N96k13l48J03
$$ y = [-216, -498, -711, -718, -160, 266, 52, 127, 264, 653, 553, 540, 466, 512, 888, 765, 73, 27, -21, 242, 274, -271, -505, -376, -137, -174, -416, -689, -319, 1, -228, -68, -338, 17, 345, 494, 274, 106, 100, 534, 399, 169, -58, 30, 22, 397, -4, -391, -62, 119, 109, -172, -342, -444, 117, 146, -175, -484, -248, -147, 78, -23, -330, -363, 179, 352, 153, 1, 245, 296, 522, 341, 54, 85, 678, 306, -104, -229, -297, 87, -96, -589, -578, -639, -404, -273, -548, -616, -577, -107, 230, 67, 110, 320, 641, 912, 814, 355, 499, 888, 724, 108, -64, -346, -195, -48, -361, -521, -977, -876, -457, -686, -883, -280, -187, 70, 24, -303, 182, 615, 911, 625, 619, 512, 797, 639, 460, 7, 95, -113, -212, -256, -546, -577, -570, -409, -719, -585, -492, -284, 210, 21, 59, 70, 531, 534, 470, 373, 119, 576, 560, 181, 77, -316, 200, 12, -51, -369, -444, -23, -110, -295, -489, -247, -133, 111, 113, -133, -240, 297, 3, 58, -382, -341, -168, 428, 215, -133, -30]
4884c0J42J24N0l07k0L72K74n24n0r2J17Q0j97m51l3K87J78m92k76n4Q30K77k30
4907b5K1l46P73j9J00k65J73K8K56m07j55l32K38J34k45l31r9J41J77k57j61j14
4929g15M04K95J60mk32M78K00L8k10m6N1J59j98l96k03J55K49j86o25J56j33K27
4951c76K24M5m32K46N89K91n10K7Q3K86k02j45j22K16O6l29k68J51J38n1Q0n33
4973e26J53N15m1J11l31m1K92L00j27m21J40j9L22l03j61j09n1N36k07j44N6r0
4995a46J80l1r6K8J21K67j8k60K2J88j21j25j88j67K83j51K31l55R0J23K1K94
5017A90m20J87J38J93J63j90j73L16m5P7m39J28k09K22j68k49k40J37J87p8m8
5038c21o5K86NJ20K5j34K39J5N6L9LkQ1j09r4k37J54k08J52k49j06L47k51J66
$$ y = [-30, 112, 236, 286, -21, -41, 331, 605, 81, 31, -61, 56, 136, -61, -512, -545, -258, -80, -572, -848, -902, -72, 205, -25, -4, -350, 423, 404, 504, 239, 412, 440, 696, 289, 134, -198, 40, 174, -71, -402, -501, -360, -183, -440, -601, -715, -311, -16, 144, 140, -92, 386, 586, 624, 414, 368, 419, 578, 380, -16, -219, -64, 185, -1, -626, -470, -603, -376, -152, -107, -539, -293, 296, 587, 77, 104, 187, 473, 271, 126, 4, 220, 286, -43, -311, -160, -22, -73, 7, -526, -373, 142, 101, 212, -119, -160, 132, 432, 305, -116, 24, 5, 327, 24, -137, -246, -297, 239, 32, -112, -56, -146, 34, 3, -93, -65, 56, 323, 305, 45, 67, 255, 134, 9, -179, -346, -63, -214, 17, -338, -248, -125, -104, 190, -230, -43, 95, 288, 451, 261, 88, 404, 359, 436, -3, 125, -84, 138, -30, -279, -519, -382, -195, -273, -321, -386, -100, -95, 25, 50, -84, 155, 170, 226, 265, 268, 266, 347, 238, 144, -93, 61, -147, 5, -244, -350, -3, -254, -88]
5062h8l36K18L92Om4r4o6L32R7o6l24k54K45J65J1r4j05j21M12l12k46J49O2l2
5086i3J18N0k09K68j84M08m87P9J75J6J7j44j24J07O5J12k83r1P2L06j63J37m07
5109b55J89M41k97j07j90J79K57j70j09j71Q4l9R1K02n09K77J77Lj44o7p7M44
5131B09k1j28qK85k81J86L0n62P4O89o01j9j43O9M06j1k96r5N4Q8K25k75k0J38
5155gL49K6m02K41j04J45K43m84mJ8L36k67j72j06l9R0K94l16j17l3L85J86m55
5178a93l6L28L3M6q8j14m3K06O9J4j33j5J27J23n08M23l50J66j86j49L7K4K10
5201il9l7l15R1J62L61j27J34k10J50J25j92k4J85o7J43m65L44r6L3q0p8l12R
5225c14K57j1O8l85oO25k71j91Q3L1L32k59K24l42j44L28j7P5j15K0K69p9n3P3
$$ y = [-88, -424, -206, 186, 192, 148, 54, -12, 320, 417, 351, 27, -227, 18, 183, 194, 100, -5, -126, 286, -26, -272, -123, -61, -93, 25, 75, -134, 134, -50, 358, -129, -50, 125, 141, 158, 14, -110, -3, 62, 174, -109, -200, -128, 178, 15, 152, -255, -66, 375, 78, -29, -219, -40, 217, 47, -62, -233, -149, -188, -97, 105, -404, -127, 50, 53, -91, -158, -235, 209, 188, 60, 52, 337, 56, 242, 272, -290, -216, 473, -128, -147, -290, -221, 185, 174, -122, -217, -163, -75, 150, -125, -145, -7, 342, 368, -34, 207, 103, 248, 491, 7, 3, 21, 357, 90, -82, -188, -227, -137, 157, -159, -276, -309, 76, 262, -193, -229, 99, 132, 178, 90, -24, -67, 139, 208, 222, 89, 74, 201, 324, -184, 239, -111, 55, -131, -280, -243, -219, -9, -48, -85, -400, -309, -147, 214, 87, 221, 11, 161, 286, 94, 70, 255, 188, 331, -134, 210, 114, 147, 67, -11, -323, -314, -57, -68, 0, -385, -391, 234, -37, -228, -145, -114, 218, -41, 183, -159, -303, 25, 8, 83, -32, -12, 257, 178, 125, 198]
5249A98k00N0K12r9j72k17J14K09k80p8k31L68K82j65j50k3J19M0J26p2l5n8J06
5272D4p8N9K61k39L15j50j06j03J07k78J53m33K25O5O3j60m3J01Q0K31k85K5J3
5295a33n4K73J27k81L04j67K99r0k82N6j23K87j13j76k02L38q7j68J03k8K25j88
5317h0J12k81J21J88R1J07n8k61J17J27k67L6j80K02J44l36J14KJ30J17l6l14
5339b05J67Q0J40j06JL0n8K07k0j05k20K11k5j75J65n43L29N8J72j88k35K99N
5362a6J17l20K92J67p6j43j18j26J97K62J07k38j03L00j25K4j80j79K38O5j02
5383D3j72J82j52J51n7p3J1l2r2J05j44q9J99O2J70k57J02L5K10j96j59K88r6
5406C9J06j21j48J37j4K38l55N8k76J38m5p2J06M5K97j06J64k31k81L64L20j54
$$ y = [198, -2, 48, 260, 161, -11, -228, -114, 95, -185, -263, -494, -126, 156, -9, -159, -182, -63, -23, 103, 31, -4, -62, 44, -34, 25, 286, 47, 362, 212, 106, 3, 110, -168, -15, -448, -223, -158, -95, -255, -298, -197, -117, 114, -171, -146, -133, -187, 86, 213, -68, 236, 69, 368, 278, -4, 52, -71, 216, 103, -73, -275, 63, -24, -192, -89, -117, 108, -80, 32, -249, -128, 60, 151, 258, 200, -61, 56, 183, -84, -48, -228, -26, 118, -218, -104, -102, 28, 145, 109, -205, -38, 42, 182, 76, 77, 107, 49, 256, 236, 131, -89, 122, 97, -78, 87, -456, -127, -69, 103, -85, -320, -21, -16, 101, -219, 73, 240, 164, 21, -97, -223, -26, 236, 343, 105, 2, 302, 177, 201, 21, -158, 80, 145, 43, -129, 53, -99, 52, -5, -78, -67, -99, -191, -86, -230, -319, -120, -58, 112, -145, -43, -8, 202, 6, -153, 135, 39, 145, 24, -124, 13, -1, 237, -118, -60, -336, -198, -243, -315, -209, -164, 133, 27, 191, -40, -321, 43, 363, 209]
5428B09j5l77N44j24M2l02nJ18J16j83J08l02J65j27J20k04j27K91L7j35k11N41
5450A79j4j93J79l12L01P1J2O3m30QL11j03K3k16J36J5j62J75j41L4n2J45k7n0
5474d8j45J3J94k77J18Q6K39K7j07O0j51J8M79m32k27k30L84J90k37l4r7J43j8
5497e2R8k05j79L81M6j56m2K1J01J64m5j70j42L58j0J89n27J71o5J86j92K0l5
5520h5j22J08J65j32j2O3J76j80j20K2J25J45O4r8l71N38P9M9m43O3JJ61j55l35
5544b94K04J51j65O8%j64J05K3N5n3l75J20J68r5Q3J35r7J51J05j74o0M62l57
5567dJ56j94P2J53l8m5ok94K63k46J95j54PJ03K03k18j00j17J05L74n44O31l70
5590f8j23K36kq1k07K58K56j97k43R6J15J09m8k44j20M34n10L55j15o8M1N6K7
$$ y = [209, 194, -183, 361, 237, 279, -23, -28, 90, 206, 23, 131, -171, -6, -133, -13, -217, -344, -53, -16, -151, -362, 179, 165, -28, 151, -161, 140, 211, 223, 286, -144, -136, 175, 72, 95, -121, 15, 30, -132, 43, -98, -64, -116, 29, 2, -48, -193, -180, 14, -263, -145, -59, 180, 207, 100, 160, 9, 27, 506, 74, -153, -383, 1, 191, -46, -80, -177, -34, -52, 46, -159, -338, 43, 89, -67, -109, -88, 13, 177, 132, -38, -180, 178, 168, 357, -170, 1, -64, 122, -70, -50, -85, -207, -99, 66, -66, -78, -15, 161, -19, -139, -117, 8, 153, 217, 119, -252, 286, 365, 414, -29, 34, 35, 196, 41, -294, -90, 61, -104, -36, -36, -200, -95, -72, -17, -70, -445, -325, -157, -252, -169, -34, -131, 20, 125, -49, -109, 353, -4, 152, -42, 30, 183, 145, 100, 94, -200, 63, -183, 12, -142, -135, -32, 171, -47, -147, -264, -159, 215, -329, 302, -68, -191, 45, 43, -38, -245, 13, 269, 72, -171, -75, 40, 149, 101, -143, -263, 171, -339, 16, -99, -167, -126, -70, -43]
5613d3j81J20M5L66k75k52L20m5N1J26l58M17m38Q1Lj31O2Q4J91j25o3j5j47j11
5637c18L94m3j1k5J11j00L7q2N3J84J65l22J2l2P3j00k12N9L0J82k9q0j50J82
5661b2K09l00N8K3j17K12J92k39j8K08j90K89J04l33J88m33M56k60j91J31J44
5682A11k15mo0L0K01J9q3n3n8J98j19K00m2M7n9O8J28l32k08L41k5k1L1m6j76
5707a27J47l7k84P6Q3j21K48m16L25J00j39k1N2K2J97J60j80l9m3J98rJ3l69J52
5731a2l5K35k42j0j3l6J46j22l51K25k2P7K33m15K91K8Q8J02r4j82L55j17Q1k2
5755A88j03J28j04j57j00J33k7J6M7j14M2o5j19J65O9k50K29L8k20J04K09R8j0
5778A97j09R1m4K36j89j43j21J51L7N6jk90K17j84j16np9J53J48j62J41l1j70
$$ y = [-43, -224, -104, -59, 307, 32, -220, 100, 55, 106, 232, -126, 291, -147, -66, -63, -194, -132, -48, 143, 18, -45, -60, -207, -318, 76, 33, 22, -3, 108, 8, 45, -37, 16, 200, 365, 43, 55, 23, 96, -4, -216, -157, -127, 55, 26, -54, -204, -22, 187, -113, -55, -32, -149, 63, 255, 16, -2, 206, 16, 305, 409, 76, 264, -169, 287, 27, -164, -33, 111, -104, -108, -168, -138, 63, 82, -1, -54, -112, 86, -33, 167, 125, 172, 113, 181, 309, -23, -231, 110, 85, 64, 95, 49, -127, 20, -17, -301, -225, -142, -263, -15, -431, -106, -6, -145, -166, -114, -92, 105, 265, 85, 46, 3, 201, 192, 205, -164, -12, -47, 188, -54, -64, -77, -113, 33, -89, -440, -215, -237, -160, 73, -342, -51, -23, 65, 167, 73, -109, 246, 129, 210, 188, 85, 213, 109, -48, -148, -15, -42, -26, 21, -93, -51, -116, -235, -70, -1, -251, -22, 16, -204, -100, 109, 207, 197, 88, 179, 135, 371, 182, 39, -82, 69, 106, 162, 161, -129, 88, -96, -212, -217, -296, -143, 5, -157, -16, -47, -217]
5801b17O3L94m8j90j4m4L25k33K28m0lR3k60J50j39j23P2n5j92J06j84K76k03
5824b38k04K96j23K28K09n5k08M55R6k73q1J11l2J90j72q8j53J40p1J78q8k13
5846i6k3l6J63m48j08L25K55k93PL35k87J22K49k0k1j68J11J29k71K54J06p5l7
5869A73j48L7k75L62k58K1O3n0n8m8j90K48Q1k25qNK72L0J37J25l36K15K17m3
5893C47o0j77J88q1L6l3l09k63L41j01j46j18L1J66J3K25k29L5J35O5Q4j21L47
5916C75q5j22N1J0o3RJ17j43j95j5l5K15k47l9o4j31J71K21l04k34N39k89J00
5939a58M1J22K5J64Q2Pj50k20L41j41j51j2PJ06m2J49m80K41j86K01J28k03q6
5962b15k01L19j10j26K63K04O0l65J36K06j2m2j09J61k16P2kR1n2p3K41n2n35
$$ y = [-217, -154, 240, 192, 2, -12, -56, 269, 36, 264, 224, 221, 314, 54, 204, 65, -58, 14, -41, -233, -127, -311, -35, -238, -442, -146, -269, -41, 168, 113, -95, 360, 456, 183, 102, 213, 181, 371, 199, 111, -42, 98, 27, 205, 117, -96, -119, -155, 8, -440, -548, -223, 32, -261, -254, 81, -206, -84, 165, 145, 124, -44, 67, 196, -75, 179, 285, 210, 173, 25, 62, -213, 149, -109, -88, -25, -75, -133, -181, -371, -123, -42, -267, -275, -270, 2, 32, 169, 294, -42, 173, 390, 347, 287, 110, 298, 217, 253, 220, -89, -352, -11, -112, -258, -376, -345, -179, -166, 59, -170, -135, 0, 65, 149, 28, 375, 290, 168, 219, 229, 166, 175, 292, 149, -46, -61, -96, 119, -128, -167, -231, -362, -191, 30, -274, -508, 31, -258, -158, -117, 5, 30, 194, 276, 283, 133, -87, 254, 113, -38, -50, -43, 63, 21, 170, -310, -69, -255, -54, 74, -129, -215, -416, -97, -207, -333, -70, 134, 194, -171, -35, 171, 159, 117, 8, 169, -47, 25, 23, 114, 62, -11, 230, 178, -357]
5985c57K49j43R7q9nQ8J9J20K9Q7j18J47j37J53J81p3l38K96k3n8k04L08P9j59
6009A49k09P1k26n1q0K8J82L8pk23J94j83p5O11Q6l18O5J16L5N0P6m73M67l3j58
6034A32j86P3L5j40j57J44l15N1K87k39K61O2j30J74j33J04O4j61L93k21M23k48
6056B73l7P5j72N7M4m9k7k94Q6m6q7j22R9P2j33P6qJ54k30lK58K35l10RR8J66
6082A84J59j20j03L02l47M24p6n03K28m1qj65J27k91J5p4J02K61l09j51M59j62
6104h9J9j39J30K25J24r9k02L48M0Ok82L7J47l31K95k7l95J45j13jj29J46o6l5
6128b46J53N1j02n0K48pL8J48k53J1J70K6l0L52k18K1J03l82lK52Rn68j28M85
6152H0k14j95q1K95pJ84L3k49J61K80l19K23j83K8K02O8l60J41j16J07o6J13j07
$$ y = [-357, -108, -251, -154, -243, -248, -160, -141, -21, 8, 95, -23, 124, -13, 140, 321, 248, -90, 206, 183, 125, -79, 229, 308, 149, -60, 11, -215, -266, -346, -318, -136, -98, -105, -328, -134, -317, -392, 219, 305, -13, 52, 168, 203, 253, 329, -144, 323, 290, 132, -54, 19, 54, -86, -243, -99, -414, -363, -76, -315, -54, 8, -122, 52, -81, 23, 87, -74, 319, 98, 521, 273, 236, 311, 139, 196, 240, 191, 164, -130, -44, -90, -177, -299, -200, -128, -261, -185, -193, -39, -269, -272, -14, 221, -89, -80, 18, 184, 343, 223, 120, 422, 75, 499, 423, -80, 148, 107, 99, -66, 61, -230, -215, -289, -187, 74, -235, -386, 73, -89, -70, -209, -79, 146, 270, 171, -31, 317, 357, 363, 81, 118, 265, -66, 229, 202, -193, -48, -161, -162, -291, -145, -211, -246, -93, -42, -144, -194, 54, 47, 85, 233, -20, -9, 161, 187, 157, 509, 291, 312, 415, 33, 30, 282, 291, -277, -405, 80, -134, -329, -410, -115, -122, 62, 95, -154, 7, 287, -32, 191, 8, 36, 238, 306, -54, 87, -29, 78, 12, 125, 18]
6175A8j63L9PJ64l10r0J75j3K87j97l61M46O0j0k24J28R5L52k28p0k6N8j11J37
6199A63j95n7R1J77k10Q5j41k61K54k37K84l6RK37j9j62Q6L2k86K80J03j09k9
6222E9M05k36q2k48J97l08M28k13l14L5J43K81k05k20O6P2Q7j64n7K27K07J6k11
6245c5M0l8K96r6J13r9n6j32K51j22p8r8l1lN9k28J75p6R0O8k42r5J29J54q3J07
6271c0J8j27N65k7k47j79K18R9k94j05j3J33O7r0m06L50J21R8k23M4k49J97N1
6294b9r3K76j89J7J66Q3l98K68k2R3J80n39L83j29j6J97n73L14j63K79l07j68
6316c70K09K78Q9m02J08n5J39K93k90J32k60K9L36j90K30k99J25L2k87r1K59p8
6338f3L4Oj12j54K99J23o8j55j09K40p7r2J98N9p4M1l36L27k01J52R3p6N2k22
$$ y = [18, -145, -106, -99, 65, -245, -335, -160, -173, 114, -83, -444, 2, 62, 52, -172, -44, 51, 403, 175, 105, 79, 137, 26, 163, -32, -89, 2, 179, -31, 54, -87, -348, -94, -331, -47, -83, -74, 163, 144, -18, 68, 100, -186, 94, 197, 88, 59, 464, 228, 146, -102, 95, -213, 215, 2, -312, -277, -134, 147, -58, -278, -212, -140, -53, -217, -274, -47, 160, 176, -35, 5, -33, 263, 167, 280, 181, 125, -7, 244, 122, 44, -54, -85, -88, -29, -257, -82, -158, -68, 0, -242, -337, -208, -54, -137, -30, -12, -139, 426, 399, 152, -27, 191, 290, -4, -109, -122, 11, 78, -12, -418, -68, 53, 151, -72, -28, -277, -80, -29, -122, 154, -35, -18, 148, 231, -167, 101, 79, 172, 352, -187, 196, 67, 51, 248, -325, -11, -174, 105, -202, -370, -161, 117, 206, -196, -88, -143, -4, 289, -1, 131, -129, -100, 236, 46, 276, -23, 102, 134, -153, -244, 15, -63, -29, -23, -135, -289, 10, 133, 65, -90, -199, 41, -36, -128, 70, 129, 55, 96, -240, 87, -114, 38, 131, 55, 107, -115]
6362a15L18k0j35j07J8j33j7rQ9j46L60j14P8o5j37K78m91K34J68nJ20k20J48
6385I7J66Jj96J24k1j47j40M2R4j05p0Q4O0k3k7p5N1p2K4j1P4J7J55J00K11m27
6411a4N5MP4n5R5R4q9J06j93K6m40L88j04J98q6k47J37R7q1o2j67L67M3k12J57
6436I1l1R0k1j36j25L49l36L24n2j2j62J55j62O0j8J61k81j30K34q3j34M0m1J0
6460b10J65J48o3J63N2k78J73l7P1k74M11m39J1J07K68k62j05j24J20K11j85j
6482g8p4p6L03j79J34j11J59q5P6m1k78M22k37M13l40j33Q6n3N7l05L9L05J54
6505A58k4j56j77L20r6l81J67QR2JJ78l11J11J27K33m79M1J48K53j14K70l57j3
6528aJ04kM8j26q3Q4j2M9j00oj10J49J18l23K12N7N3j10r8Q5J41k32Q5j61J46
$$ y = [-115, 203, 183, 48, -59, -41, -174, -191, -200, -111, -257, 103, -11, 67, 2, -135, 143, -348, -114, 54, 49, 169, -51, 97, 263, 264, 68, 192, 171, 24, -116, -74, 20, -85, -155, -71, -11, -34, -61, -136, -85, -157, -133, -144, -70, -53, 102, 202, 413, -14, 41, 45, 119, 64, 159, 253, 164, 270, 77, 103, -337, 51, -53, 145, 59, -188, -51, 46, -35, -97, -264, 103, 146, -66, 91, 60, 150, 129, -7, -132, 217, -119, 205, 153, 141, -21, 134, -28, 32, 14, 175, -106, -236, -2, -85, -219, -179, -220, -210, -45, 103, 40, 203, 255, -23, 150, 113, 184, -90, 321, -118, -107, 0, 268, 6, -99, -223, -103, 108, -77, -78, -152, -228, 75, -104, 30, -81, 78, -7, 69, 28, -250, 172, -65, 348, 8, -125, -39, -92, -35, -340, -301, 4, 158, 134, -22, -199, 121, 25, -356, -189, -181, -89, -88, 90, -221, -110, 17, 250, -229, -188, -40, 213, 99, 369, 12, -1, 103, 101, 149, 23, -60, 24, 12, 61, -39, -45, -155, -6, 112, -211, 1, 58, 111, 1, -97, -12, 129, -103, -18, -179, -33]
6553c3K2Q7K2J48k06J9K30n1p4j51R4r7Llk37K23l2n5o1M4K82lj83o1K34j73J55
6580A43r9J56n0j73O0q4K65j51L8j74J04j08p3J78j20n7l5J51OJ45k33J03N6N7
6604A05J89j47J22j78o8J25q3j61J50m8P3o0O5j62K70k09O3n9p7Q5N0r6p5o8L04
6629A10p7k19O0J30j7mJ85l06L18j20j02K86j09q0K6K49k12k25l4J15j08l83M51
6652f6n5P9q4n4JK56j0k62K27M0k05J24J73k0J28n3j01l3j36L21j39K1n0k99L2
6677a65n0M6p8J94j98L6L18k31N3OR5N3J45q7j01J65j59J2j38J37j7L3J36k41
6701c6r3QJ71j97J24l29J03K57m8P0q3Q9j61K98K5l77L97p9J7k25J21o8j40K38
6725H2j27q2p7Q2O8K01j18k6q6J45r6J21k10K13m5k68K8J85pJ89k03M6J65k21
$$ y = [-33, -11, 76, 98, 246, 40, 59, 289, 238, 164, 13, 107, 10, 13, 10, -227, -4, -36, -91, -152, -108, 174, 171, -12, -73, 161, -12, 143, 44, 200, 150, -23, 37, -47, 218, 67, 105, -69, 35, -73, -146, 32, -88, -145, -180, -29, -23, 122, -111, -8, 48, 105, 294, 147, 269, 91, 23, 148, 65, -96, 54, 6, 79, 19, 84, -78, 192, -17, 46, -13, -90, -5, 45, -51, -126, -194, 110, 33, -186, -126, 4, -13, -17, 168, -138, 180, 60, -42, 244, 135, 55, 81, 330, 118, -107, -141, -26, -134, -517, -66, -121, -42, -126, -180, -179, 77, 67, -195, 32, 72, -133, -9, 164, 144, 272, 219, 118, 85, -51, 270, 131, 152, 102, -197, -165, -215, -169, -247, -53, -251, -215, 103, -128, -75, -69, 26, 79, 224, 137, 36, 201, 42, 54, -84, 53, 36, 69, 205, -36, -129, -121, 50, -147, -23, -352, -249, 8, -40, 30, -53, 36, -125, 173, 198, -179, 218, 139, 156, -69, 52, -16, -156, 82, -45, -127, -204, -122, -54, 147, 29, 3, -83, 62, -34, 87, -123, 90, 45, -223, -195, -10, -17, 172, -31, 15, 180, -41]
6749d1K66j71N1l15K51L4m8J19O6j71j9Q3k40k0m1K37r6j01k34L03P6m5J55k06
6773a07R6J07J1l7jL12k62P5m2r7J84l82L4J85n7j63K81j80j05k0R7L6j34K15
6797D6J13p1L58m20j54P4M67k13k15r2J96j30J06j14L5j70J55O7K01l01P3O8O9
6820A48j50m9R8R1k14K39p9j71NK45k6j10J3j48M4K4j33K05J01J19l23j94J91
6843g4K19l9O6Q0l37J49J24j34J2k60L55j69l20J86l0J97Q9k36Q1j0j68K89m7
6866B3K63l62k4L68j25j4l10J76J24j63L8q5m9J81k30M6P4J0l1J87k35m3J35L4
6890a2l3K3j15K82Q7l35K70k08Q4R2N5m55M07j57P9j4l2L9r6K89k00K1K3k06J0
6915a02P6j65K1n3K3J31j93R0r6L80k09J50l9K3K97k77j19N0K39j37k5j86kL7
$$ y = [-41, 225, 54, 105, -210, 41, 75, 27, 146, 212, 41, 22, 105, -135, -155, -196, 41, -55, -156, -390, -87, -11, -56, 99, -107, -11, 96, 107, 70, 69, 381, 119, 194, 152, 55, 239, -143, -109, 76, 19, -144, 137, -43, -148, -168, -71, -35, -169, 46, 159, 88, 446, 26, -128, -54, 413, 200, -15, -107, 89, -41, 65, -49, -14, -184, -29, 38, 239, -62, 11, 79, 148, -2, -51, 47, 138, -76, 163, 84, -87, -82, 163, 137, 27, 40, -108, -64, -40, -173, 32, 133, 252, -71, -265, -74, 145, 106, 172, 252, -85, 64, 188, 54, 66, -194, 161, -8, -328, -142, -172, 25, 114, -122, -41, -51, -219, 70, 23, 286, -76, -100, 268, 143, 129, -181, -5, 119, -44, -6, -91, -140, 41, -189, -143, -69, -59, -90, 97, -138, -181, -46, -12, -45, -22, -137, 145, 232, -103, 167, -41, 43, 135, 190, -265, 142, -15, 64, 50, 18, 57, -39, 250, 50, 71, 94, -112, -102, -26, -191, -170, -223, -200, -69, -262, -172, -268, 112, -97, 53, 14, 37, 334, 57, -62, -12, 227, 90, 65, -121, -123, -86]
6939h6K19M2k37j5j50R5J35k19l0M60k07K0k07o1L84M1j87J8Q1O8j06M06m26k3
6963A5n0l4K8r6J81j74k4K67k33KN6P3k7m8J10J0m5J27J08r4M5k47P5oM5j23K31
6990A72j76j4J18m6J48l22J5JJ80k56L07j79K03j11M3p1J38k50n4L80k54K42j11
7013A03k08p5J01J46k08kJ88J11j47O1P0l1l3q4q6J43l66K99k0k92M97j0l78Q2
7037a39J90n5L4J6K4k98L39k9J77jj05k79L08l2j44k38J05L6r1J27j41M5J10N4
7061A3J61j21k4J09k1O5l02L60n6l3k97J3J25N3Jj97K47j73L54j81j17j06Rj94
7085c12N25L2l00Q2j48K59j16P4L7j44rj50N2n4J65J6j16k96L40J06j22Q4K1J66
7109A92l02J27n2j00L7J86l9Jl54J57K53k10P1l0j3k6K90j67oj13P4K7K9M6J30
$$ y = [-86, 133, 175, -62, -77, -227, -132, 3, -216, -246, 214, 7, 27, -180, -241, 143, 184, -3, 15, 96, 164, 58, 464, 38, 15, -35, -69, -41, -137, 44, -130, -154, 113, -120, -118, -62, 11, -16, -64, 46, 56, 11, 138, 246, 152, 197, -50, 25, 19, 64, -59, 172, -4, -18, 100, 54, 202, -120, -105, -104, 76, -180, 127, -52, 151, 40, 83, 12, 150, -100, -154, 226, -28, 214, 103, -105, -180, -79, 67, -141, -143, 45, 156, 9, 70, 140, 109, 76, -8, -94, 49, -317, -18, -38, -330, 167, 157, -221, -139, 51, -4, 30, 46, 70, -228, 111, 82, 259, 258, 153, -126, 182, 150, 6, -232, -127, -91, -182, -55, -196, -151, -41, 13, 174, 53, 29, 138, 117, 182, -120, 240, 184, 151, -146, -133, -8, 45, 46, -151, 96, -77, 277, 96, -21, -127, -118, -312, 213, 245, -55, 27, -121, 138, 22, 96, 133, -11, -20, -170, -118, -172, -7, 9, -107, -403, -63, 43, -79, 5, 26, 192, -110, 17, -35, -135, -98, 88, 49, 50, -304, -147, 106, -104, -33, -63, -76, -102, 188, 21, 15, -98, -24, 3, 32, 78, 208]
7134B08j03k00K30k13P0J14j39J2mm7M6J28R9m22J76j02L63l06j40J37L6K28j87
7157a6j54J2p3J94l5n8k63M96l1j1J1M4j65K70%m6k41J83J70l42K0r6L14l93P0
7182a40Q4J69j17j76L54k4j0k33K08j66j5L21k54J50l8k45J89m5p1L06k91M4R2
7205I2k90J64j38r2qK28j36Q2K02l0q5M4J6J8J64j96K00k73J20l9J15Q4p7l05
7229a40m9J40J5Q9Q5m11M4K11j3j29MK70j11j7K07j01N8j74K54l64L58j58K09
7252B77km02K50j68m3qJ26J18o9n6M9k06Q0R7j15k29oK23O4N5n1l10M14m1P8k61
7278a36L12l8o3l2O2r3K13j42K39m31J14P9l46J11l52n2Q7L91l16K45k76M06J01
7301H3k34j63M19K67p7m3k10M07l14J22M7Ml80K2K3J65l05j00M13m31K04r0L35
$$ y = [208, 105, -95, 135, -78, -8, 106, -33, -21, -25, -72, -26, 102, 201, -221, -45, -147, 216, -90, -230, -93, -57, 171, -16, -170, -158, -231, -37, -72, -130, -393, 103, 72, 61, 72, 116, -49, 221, 221, 175, -66, 117, 287, -55, -35, -131, 183, -210, -140, -56, 113, -4, -180, 174, 150, 140, -93, 115, -51, -66, 255, 1, 151, 113, -132, 57, 12, -59, 247, -44, 0, 92, -198, -34, -172, -264, -272, -44, -180, -98, 104, 74, -11, 33, 49, 67, 231, 35, 235, -38, 82, 43, 158, 242, 165, -140, -189, -49, -34, 55, 140, -271, -227, -16, -29, -158, -154, 116, 5, -12, 195, 94, 152, -22, 232, -132, 226, 68, 277, 275, -127, 123, -45, -88, -96, 30, 148, 79, 23, 72, -134, -54, 43, -72, -301, -307, -84, -20, 35, -16, -326, 88, 47, 125, -136, 176, 138, 75, 43, 105, 12, 225, 83, 322, -109, 5, 84, -262, -151, -503, -555, -468, -77, -393, -148, -424, -18, 83, -151, -314, 105, 372, 295, 252, 42, 449, 135, 257, 304, 308, -72, -50, -27, 138, -167, -267, 146, -285, -81, -171, 164]
7324A64k96Q3J66j56o1j0J82j64K02oJ24p2kk47k2J17N1j71J13N8j0M3J13j41
7348E8l28L33j98J55p6n3L9K42j64k37J30J13l0j13J06J07q7R9P9k54J47K7M4
7371A39j28J46k29K76j87n9q6JK23j36k86K32N0J37l5j05j12J92P8k10K13L9l42
7394a89K68N3l31L23j68j54K93l46J33l0M0j69L86j33K39k09m3J3n4J71j77M37
7416C53k60j4j26K17q7NR8m11J51MJ3j06j59K38l6R1Qk99J63L18j65J29l02J50
7440b7NO1j74K66J87l13Q1J41l39k5K22L9J5k05l0K62K4j67q2j76J00L63m09Q9
7464i2R2k47K20j14L55k39K39k19m8K30m2J08l13J50k2Q1r8K00l22K04q9J30m08
7487b44J52k12J47J95j75j18q3m4K79J17j94L13j73K20n5O5n7N4k27j90L25o6
$$ y = [164, -132, -49, 117, -39, -100, -110, 72, -92, 110, 104, 228, 156, 154, -93, -115, 2, 53, -118, -5, 53, 43, 86, 199, 58, -270, 63, -135, 20, -56, -109, -70, 172, 8, -229, -99, 14, -16, -129, -23, 84, -3, 96, 175, -79, 68, 95, 139, 11, 157, -72, 204, 17, -42, -128, -127, 96, -40, -326, -94, -44, 93, 58, -47, -159, 33, 111, -99, 114, 153, -189, 79, 132, -199, 124, -44, -198, 95, -251, -118, -148, -108, -277, 109, -24, 215, 6, -37, -24, -78, 93, -84, 353, 93, 79, -47, 170, 83, 88, 186, -225, -74, -70, -57, -163, -322, -84, -120, -29, -21, -320, -157, 161, -4, 125, -177, -27, -22, 39, -135, 131, 318, 5, 86, 227, -112, -137, 85, 124, 139, -66, -96, 166, 190, 23, -59, -235, -135, 228, -181, -92, 0, -247, -27, -141, 214, -25, 214, -5, -53, 177, 135, 243, -70, 80, 58, 139, 41, 241, -81, 123, 34, 164, -244, -92, -304, -157, 38, -137, -255, -338, -382, -103, 14, -180, 133, -40, 180, 125, 190, 133, 187, -40, -230, 95, 29]
7509B9k5J05j71R6k92L03n7q2J6j7R3P6Lj88j39K65M31k77j57K8j15L41L1j54
7533A43k0J63j65N4k64K38m2p8K77k03l57J13J7L4n3L1L1O4J66j82j48J23j33
7556a91M05j23j24J10l31M44k43K1M3J91k81Q1m5J23n5j26J01k85M00j16j99L52
7578A52k48O4J70q9J20k83K30Q1k22J69l8l04K78J16k48J56j63o1j75R4N9R5j21
7601a68J76lK4Q2o3J1R4m6O4k20J10q5m9J42J19r2k9M1j50l42N49p7k16lJ21P2
7627F2k31J89O6m91N79k64m3O9K45m83J94L65Mk4R5m21J09J41m06N96m08J81k41
7650a17Q0N3j79l6J40j24K06K4l61O1K14qK2J77l34l2K63M5J73l34p0L48J7k65
7674c7J7J29j81K42l29K19P3O3j03k17R1j0M8P3n6n9Q9J31j25l2K77n75K57l30
$$ y = [29, 4, 109, -62, 34, -258, 45, -12, -94, -78, -95, -2, 74, 77, -111, -250, 15, 446, 169, 12, 40, -75, 266, 297, 143, 123, 286, 121, 175, -89, 149, 107, 29, 306, 103, -254, -141, -124, -90, -143, -112, -81, -17, 149, -33, -181, -58, -191, 214, 91, -33, 77, -254, 190, -53, -32, 11, 202, -79, 2, -43, 80, 25, -101, 0, -285, 115, -1, -200, 152, -96, -32, 138, 49, 169, -114, 116, 197, -25, 144, 106, -198, 80, 196, -52, 104, -59, -120, -295, -201, -142, -47, -168, 8, 5, 29, 111, 48, 59, 153, 107, 171, -49, 61, -24, -73, 69, 188, 96, 67, 108, -42, -384, 165, 88, -128, -131, -10, 62, -169, 20, 86, -405, 174, -90, -133, -64, 181, -302, -108, 257, 261, 237, 332, -89, 20, 161, -245, 351, -57, 124, -117, -37, 16, -163, -199, -59, -183, 23, 47, -314, -253, -39, -47, -25, 152, -182, -214, 49, 94, 267, -67, -137, 211, 228, -37, -20, 109, -72, 170, -159, 60, 133, 196, 93, -124, -33, -43, 5, 78, 22, -37, 52, 183, 58, 26, 303, -272, -15, -345]
7698c45N59k3j00m6J39j97R8J46Mr1k50n3Q2J35j82L25l29R7L08m10J20j74J72
7721a5O8K7p3k59Q4K28j12K03l44J88r7JM1L2P5j46J63q1m3l3K76n5k79R7j10
7746a64K61oj94J43O6j44k03K50P7l83M19k88Q8j1J79q9k09L1r3J96O8n2K0J14
7770G6Q3l29L97k26j61K61q1p3O6J47k03K04l42J9J36m0m6k9p2M76j22k16K56
7793A81n04K01J00N61m32k42J18J87k84J69qk65N73n36K98j94K7j66J73p7j03
7814b23L63l80K06N3J3j05p6K51j68L0J10Q6l82M23j6%R9k06L54l80r7o3RM30
7838C31k42k24K98k12j8N8pK9M09m83K00j86J05P2k01j03L18j06J99j47j52K56
7860A94qR2k69Q2k40L28M9l29p6N7K01k32M3o0q7J20K59k23l9J82J20j39L20j29
$$ y = [-345, 214, 191, 91, 45, 184, -13, 85, 231, 235, 144, -106, -159, -77, 58, -124, 201, -128, -31, 277, -133, -13, -187, -15, 53, 80, 7, -252, -168, 60, -52, 151, -193, -5, -102, -101, -60, -28, 47, -99, 64, -17, -60, -93, 183, 128, -151, -54, -164, 97, 91, -103, 40, 106, -38, -241, 9, 86, -297, 122, -166, -78, -89, 90, 1, -208, -177, -270, -74, -6, -58, -38, 76, 159, -170, 227, 1, -160, 101, 20, -53, 13, 160, -43, 161, -181, -162, -26, -66, -112, -141, -213, 263, 141, -75, 181, -323, -122, -22, 539, 107, -135, -17, 170, -114, 55, 47, -218, 355, -181, 117, -77, -50, -216, -43, -120, -223, 140, -240, -34, 19, 32, -73, -149, 102, -66, -36, 74, 160, -222, 201, 185, 185, 284, 78, 432, 52, -45, -108, -99, 331, 89, -135, 163, -49, -67, -9, -16, 13, 422, -61, 139, -47, 58, 130, -71, -174, 144, 38, 237, 90, -62, 194, 186, 278, 9, 91, -149, 179, 228, -101, -177, -120, 81, -151, -108, -168, -255, -135, 124, -99, -138, 44, 164, 25, 345, 216]
7884B16j50K03l2j71J53l55J87J0nj33J0N1j19M3nk30L95r8j19J62%J18k76J89
7908D4q3K99k74O7k32J66J09l53L55K46l20R3J80l39K16k70j1J17J58l00j48J39
7930a41j4R8K52k06j85J23J07Km3JNM7K38m06J14J24n3O5pk12J84J54m1l28J6
7955a06L7r4J17j71k12J82L32l63L98j18M5m0J59p7L1J05O4J37j57j78k32J70
7977B9K89l62J57k07N8k32j8L22l10K72r0o2J31K98k90N8p7K24k2j24J08j5j28
8000IJ07p5j09L0k4K25k26J20o5j06m6O4J74j6k51Rk5L19k6r1pP1J00j22p9j43
8026a83M30M3j95J13m5k51K26o3m6j02K44k27p8L53n21N41l26J19m8l3J78l24
8048a95Q6RK14J49j82k29M15j78K53j21J02q6j61k1P8n7j23Q2j74J86j96k05J00
$$ y = [216, 66, 269, 237, 66, 219, -136, 51, 61, 56, -77, -67, -16, -135, -92, -97, -327, 68, -30, -149, 13, 13, 131, -145, 44, -39, 260, -14, 53, -179, -13, 96, -257, 98, 344, 24, 117, 297, -42, 174, -96, -107, 10, 168, -132, -280, -141, -155, -57, 195, -11, -196, -73, 34, 36, -7, -6, -1, 46, 284, -122, -8, 116, 63, 128, 121, -91, 93, 247, 206, -122, -106, -69, -163, -46, -217, -429, -247, 85, -278, 120, 2, 47, 7, 166, 89, 120, 225, 289, 426, 269, 91, -141, 29, 318, -44, 113, -94, -36, -268, -286, 36, -274, -2, -92, -154, -23, 275, -15, 43, -34, 190, 168, 44, 152, 137, 9, 116, 41, -68, -38, -62, 163, -63, 57, -8, -114, -160, -96, 78, 62, -189, -180, -205, 114, 88, -3, -10, 61, 161, 39, -40, -183, 247, 290, 95, 208, 163, -88, 138, 75, 29, -73, 171, -56, -134, 219, -302, 239, -87, 32, -16, -49, 129, -195, -109, -100, 114, 263, 81, -148, 267, 89, 342, 221, 323, 237, 76, 55, 133, 76, -47, 35, -139, 47, -149, -354, -254]
8071b54J93j49J22K77j68n3R0j9J2Km02N92j7k03J37j50m9L3j49J54M6J30j20
8094E5k82K35k99l8K14P6r1K31k84R3Q6j07J0J70r1J99j05o4K7q9m1K63P7k60
8118a5jJ84j30M7J37r7j24k41L19N3J48l71J41j84O9J63m37M95q0l6k34L5K01
8141D2j33K40j85j3oQ2J37N6k75O9N0j0k32J11j23J10J58m00M99k62Mj19K91j40
8165d9J36L47j46k55k4L8j15J07p6o0J1P4q5m6n0J22J10l2R7r7k13J86PJ51j52
8190a4J44
$$ y = [-254, -61, -210, -88, 189, 21, -32, 58, 39, 51, 53, -349, 243, 226, 23, 160, 10, -39, -6, -155, -1, 45, 175, 55, -227, 8, -291, -329, -115, -39, -130, 101, -183, -90, -4, -111, -101, 69, -22, 177, 72, 8, 35, -54, -95, 168, 245, -15, -16, 168, 38, 85, 222, 125, 1, -240, 79, 132, 280, -91, 50, -134, -65, 98, -339, 156, 76, 40, -194, -159, 42, -91, 149, -36, -49, -55, 27, 164, 220, -55, 14, 64, 54, -178, -67, -190, -80, 78, -322, 177, -85, -81, -200, 91, -49, 87, 434, 288, 33, 9, 47, -68, 39, -37, -97, -86, -12, -97, -143, -193, -71, 39, 7, 104, 7, -206, -20, -13, 138, -14, 130]
8191A30
$$ Imaginary data points
##PAGE= N=2
##DATA TABLE= (X++(I..I)), XYDATA
0@%%%%%%%%%%%%%qQqJ6j6J6k4L2l2M0m8N6o6P5q7J00j16J32j50J72j96K20k48
36a32K79l13L49l89M35m85N37n93O59p30Q04q86R77j077J186j304J440j590J755
55I22j943K156k398K678l012L411l895M503n292O363p905J0324j4703K5126r4496
70g8161p8361K15624J53886N4511P943J3765K0949Q3091P802j25747j23175j6705
82A35422j2414p8593j35898j14073k7491L2389j8746p4809l7947O5808J10467
93a55885N1171j6619K0153R5911J13501O2120k0174m6924M4206R6257p715j01807
105A34195o2369k22J8301p009q0791r4634R564O1169r317n6529l3249J1815O4088
118d4988M0263n8347n4293N3690O8918o348m0786k6266J6937O7383L6720m8118
$$ y = [0, 0, 0, 0, 0, 0, 0, 0, 0, 0, 0, 0, 0, 0, -8, 0, -8, 8, -8, 8, -16, 16, -16, 24, -24, 32, -34, 41, -46, 54, -62, 70, -80, 92, -104, 116, -132, 147, -166, 183, -206, 229, -256, 281, -312, 347, -383, 421, -465, 512, -565, 621, -683, 757, -833, 922, -1021, 1135, -1263, 1415, -1597, 1814, -2081, 2422, -2870, 3493, -4412, 5912, -8791, 16335, -78161, -156522, 59102, 212988, 267499, 275442, 289207, 310156, 393247, 401049, 275302, 152127, 135422, 123008, 44415, -91483, -205556, -233047, -200658, -219404, -294213, -332160, -266352, -155885, -104714, -121333, -101180, -5269, 108232, 170352, 150178, 103254, 147460, 243717, 236002, 134195, 71826, 71604, 89905, 82896, 2105, -92529, -82965, -21796, -31113, -87642, -120891, -109076, -44988, -4725, -63072, -117365, -63675, 5243, -1105, -41891, -68157, -51220, 16163, 52883, 4765]
130D765m3425M6005Q3886K7939m0944l6475L1456O3720J4061n3201o6315j1712
142A9760L7673o385q8545p7203o317J9432k630m2404n6854J4189Q9597M2513k9166
155h6340N095P2446Q3250N7353N494k5574K8234P6633J5125o8482o8357j7084
167G7793J0428k2340q7947r4723k5354K2493k064m8192m7015J6012P4847N3556
179g2506l657m200N1715Q9977O2319o417k5928K9921N9826R306n0630n9566k3414
192E6746J6114n752p4737q2708j2726K9200K242l9268m3793Q967O6356M6914j7551
205d9996k0801L4252O5808M3551q886l3847P307N4006K4762m0787n1704m466L3906
218E3105J0269m4386n3970m053L5562J6845l2504m7698M13M9558K6160l2889l9212
$$ y = [4765, -38660, 7345, 91231, 119170, 78226, 41751, 73207, 136927, 150988, 97787, 31472, 19760, 57433, 51048, -37497, -114700, -121017, -101585, -104215, -146619, -203473, -189284, -99687, -57174, -86340, -81245, -8799, 74451, 131804, 137298, 111724, 139958, 216591, 231716, 163234, 94877, 77793, 88221, 65881, -22066, -116789, -142143, -119650, -121714, -169906, -216921, -200909, -126062, -72506, -76163, -80363, -28648, 61329, 123648, 117231, 91303, 121224, 181050, 190356, 139726, 80160, 56746, 72860, 67108, -7629, -90337, -103063, -73863, -71621, -110889, -154682, -145715, -79359, -32445, -49996, -70797, -36545, 29263, 72814, 63928, 30081, 37388, 91394, 116156, 75369, 23665, 19199, 53105, 63374, 18988, -34982, -39035, -3473, 13372, -19132, -66830, -66417, -16859, 9301, -23588, -62800]
231f2800P126M4471K9428k3008m4125N093N3304K8509k3226l1728N420M5489L6800
244G0753j8754m2633L062M5590K1650l1599m6353j0285K8160J4346l7580n4510
256e8153j2598L0489J9777k7428m3200J633M8885L7049j0985k6147J2936N6094
268B8352M3775j0894l1293N874M0821K4675k3940m9402j8942K5027J2907m0173
280F787n6310j5965K2993J6217k2660m1500m444M3675L7521r316k5172J0398N0548
293A2772M3358n177l0721P97M2187K9649k2208m5811j4324K5282J6354k9891n2144
306b9877j9282K4529K1378k2640m3523p708L7050L1688j0307k9286N17M2265L9774
319C4578n615l1235q06L8446L2307j3039l9296j3305K8597K5751k2294m7371j5737
$$ y = [-62800, -55674, -11203, 18225, -4783, -48908, -43815, 9489, 37998, 14772, -16956, -11536, 33953, 70753, 51999, 9366, 12428, 58018, 79668, 48069, 1716, -8569, 19591, 33937, -3643, -58153, -70751, -40262, -20485, -47913, -91113, -89480, -40595, -3546, -14531, -40678, -27742, 28352, 72127, 61233, 29940, 35814, 76635, 101310, 77370, 27968, 9026, 34053, 46960, 6787, -49523, -65488, -42495, -26278, -48938, -90438, -94882, -51207, -13686, -23002, -48174, -37776, 12772, 56130, 50953, 20232, 21029, 63216, 92865, 70657, 24846, 10522, 35804, 52158, 22267, -29877, -49159, -24630, -3252, -25892, -69415, -77123, -40073, -8385, -18692, -47978, -47461, -5196, 34578, 28963, -2272, -3078, 35368, 67675, 54636, 15340, 2035, 30632, 56383, 34089, -13282, -29019]
332b9019K4970K2050j9043m2860j4407L0051L0299j2699l5967o078L6414L5275
344A8986o374l1316m493L7075L4296q672l4437j0463K9737K8394j3993m1167j6533
357a8960K5148K5922j5967m2500j6811K6098K7505j2177l6430j2922K9810L3771
369A2487n148l2614q595L3088L4282m450l2127j2098K9217L2006r800l7183j4335
382a5270K4603K7245j0158l8489j8341K3799K7971j0679l7252j5750K4336K9993
394A2008n920l2919j3859K6874L2960k930l0252j2539K6083L3505k161l1304j4281
407a4735K4524L1600m020l4431j7622K1580K6542q197l6566k1183J7420K7314
419A2226o988l6832j7985K2127K9924j008k8426j3952K5976L7167L806k6077j0783
$$ y = [-29019, -4049, 18001, -1042, -43902, -58309, -28258, 2041, -10658, -46625, -52703, -16289, 18986, 12612, -18704, -23197, 13878, 48174, 39502, 5065, -5398, 24339, 52733, 38740, -2427, -18960, 6188, 32110, 16143, -26357, -43168, -17070, 10435, -1742, -38172, -51094, -21284, 12487, 7339, -25275, -33870, -782, 33500, 29050, -3077, -15175, 14042, 46048, 36248, -935, -15270, 9333, 36578, 26420, -12069, -30410, -6611, 21360, 10681, -26571, -42321, -17985, 12008, 6088, -26831, -40690, -13816, 19144, 16214, -14038, -26577, -494, 33011, 30850, -454, -14735, 9789, 41389, 37369, 2938, -14684, 6896, 33438, 25241, -11325, -32508, -15088, 12226, 5238, -31594, -49579, -27452, 2472, 1464, -26962, -40914, -14938, 22229, 26035, -42, -10825]
432a0825K5293L2749K143k9808k0342J6893K6677p059l7518k5464J1867K2746
444G352o209l5701k1487J8004L0161J821k6681j3852K5931L8267O900k2508j0991
457h993K3934L4901M408k9136k1678J4835K5974o200l5953k7723P106K3811k756
470B530l4764k2848J6301L0007M880k2809j5157K1577L6926Q143k3012j3197K0499
483I076L2222M844k8375k2581J3833K7289j702l3553k6229R693K7092P51l1139
496a8779k3281J3833L0098P224k4064k0950J6125L3588P264k4265j6926J3640
508f493K8377P769k5011k2438J3506K9563K621k6092k0556J1709K8694O906k7449
521A106k4214J2203K9816M849k8087k5690Q513K8513N891k6287k3884Q837K9130
$$ y = [-10825, 14468, 47217, 49360, 19552, -790, 16103, 42780, 35721, -1797, -27261, -15394, 7352, 1143, -34558, -56045, -38041, -7880, -6059, -32740, -46592, -20661, 17606, 24506, 1998, -8993, 14941, 49842, 54250, 25114, 3436, 18271, 44245, 38045, 2092, -25631, -18525, 5286, 2530, -32234, -55082, -38781, -8774, -3894, -26703, -41860, -20283, 16643, 24786, 1774, -11423, 9076, 41298, 46142, 17767, -4814, 9019, 36308, 34606, 1053, -25176, -15483, 11609, 12360, -18779, -42060, -28227, 1871, 9095, -14969, -35919, -19794, 13794, 21058, -3207, -20133, -6493, 21884, 29653, 4642, -17796, -4290, 25273, 27894, 1802, -18754, -7045, 21649, 28555, 1106, -23108, -10905, 18911, 23760, -4327, -30017, -21504, 7009, 12900, -13387, -37271, -28434, 696]
534F96J0817k1438k0277J4197L1910J0105j6886j6738J1112K9718J0227k3592
546A9851k2408Q916K3213K465k7710k9608K924K4453L332k8587k6149P499K8564
559a3245J3823j8564k0922J3907L5790J5832j3981j6228J0245K9868J3654k0447
571B9732k3750M694K1041L203k5173k8291O3K0433K707k5552k4470N140K6563
584a3660J2907j8923k2177J2541L4359J5347j3757j8269P226L0682J8154j8279
596B6151k5080M053K3711Q553j9759k6874k188K0738Q233k2132k5558J800K2429
609e923J0021j8717k2567O730K7589J2425j5958k0257O339L1114J7267j6890k1938
622a0765O832K6603J4480j4211k4778j395K4903J2859j9650k5936k460J8221J0834
$$ y = [696, 11513, -9925, -30202, -16005, 15905, 26010, 9124, -7614, 3498, 33216, 43443, 19851, -2557, 6359, 29572, 32037, 4327, -25281, -22357, 2096, 5428, -23159, -49308, -41809, -13245, 578, -17986, -38908, -25001, 10789, 26621, 12640, -3588, 6657, 36525, 50179, 29732, 5982, 10676, 31717, 34920, 9747, -18544, -18481, 1952, 4659, -20893, -45363, -40223, -13660, -753, -19676, -41853, -29312, 5047, 20394, 6637, -11632, -4406, 26276, 44430, 26151, 1071, 5124, 28835, 37388, 17629, -9245, -11433, 9305, 17538, -4594, -30152, -28352, -5923, 4098, -14619, -37186, -30456, -2867, 9558, -6400, -26657, -20318, 10796, 28063, 11173, -10765, -3933, 22670, 37150, 22939, -1839, -3234, 21669, 34528, 14878, -11058, -13518, 4703, 15537]
635A5537j7818k7560j457K2833J0508j6219k1195K576K6750J7430j3586k0567
647b2768P786K9964J6980j2369k1131J975K6947J5577j7173k6336l144J9174J1682
660B7164j8036k9329n764J8312J1374j4102k4185k812K2735J7800j1375j9866
672b8084M406K5806J7803p758j9205J326K6891J7162j4421k2537o23K0458J3107
685C4331j5073k8551n686J9436J2080j5670k5786o350J8899J6404j1746k2934
697c0646j544K1803J7368o567j8899n39K5109J9717q300j8665L19K1534J6799
710C7489r892k4244m917J8953J2759j5018k6896q617J5871J3670j3961k6927o680
723c8410J8875J6857o941k0261k852K4385K2352l909j5785K51K2141K0336n034
$$ y = [15537, -2281, -29841, -31298, -8465, 2043, -14176, -35371, -32795, -6045, 11385, -2201, -22768, -14982, 14982, 31962, 19593, -1538, 437, 27384, 42961, 25788, -548, -3692, 15482, 27164, 9128, -20201, -25965, -7653, 3721, -10381, -34566, -37378, -14643, 3157, -8218, -28084, -23678, 2128, 19931, 12173, -7032, -5706, 21185, 38347, 23926, 1389, 766, 21224, 34331, 19258, -9293, -14979, 4457, 16537, 867, -24919, -31269, -12370, 4034, -7712, -30646, -32190, -10387, 6981, 414, -18485, -19024, 6085, 25802, 17502, -1163, -844, 20690, 37489, 27597, 3353, -1564, 17389, 30148, 15130, -11766, -20383, -4512, 9158, -4803, -31730, -38410, -19535, -2678, -9619, -29880, -32732, -8347, 14005, 10096, -5689, -5438, 16703, 37039, 32005]
736C2005k1090m946J7633J3414j2501k4888j0478J2004J2572j3647k6824q918
748c5664J6280J5631p393k1398m299K1806K3053k846j7387j443K2056K1852l654
761B6594k0018o118J7710J6224q553k3464r975J3010J4176r747k4804r194J4567
774i592J5002o449k1490p616J7590J9894m519j9605n357J7920K0638k806k1001
787g391p453J8443J9216m208k0020q092J5757J8872m121k1791q962J4783J6118
800B1151o028k1813j0902J2679J5569o337k2395j0625J3510J7458l958k0007p605
813b9303J6717K0963K40j6520n721J8434K2663M2j8215q116J4048J7170m087k2293
827F022j4265R202J3830o871k3882j3753R735J5544k591j9138r214J5660K1701
$$ y = [32005, 10915, 5969, 23602, 37016, 24515, -373, -10851, 1153, 13725, 78, -26746, -35664, -19384, -3753, -11146, -32544, -36843, -15037, 8016, 5170, -12217, -13660, 8396, 30248, 26594, 6576, 458, 18168, 34392, 25839, 2375, -7600, 5410, 19586, 9839, -14965, -24159, -9592, 5410, -1039, -22529, -30145, -12555, 7339, 2820, -16785, -22142, -4222, 16416, 13610, -7391, -14844, 3599, 22815, 18607, -1413, -9505, 6252, 25124, 21003, -788, -9750, 5033, 21151, 15123, -6690, -17592, -4913, 10656, 4319, -18076, -28701, -15191, 2267, -1691, -21698, -29303, -12586, 8377, 8617, -7903, -13624, 4810, 27473, 27515, 9300, 1184, 15232, 32402, 28315, 6022, -8243, 959, 14789, 7918, -15964, -29717, -19982, -4438, -7029, -26167, -35381, -19721, 1980]
840A980J916j4537n372J7334K2733K186j6286q645J2919J7553k948k1204j4369
853f740P666J4044m810k1827j4075Q741J6237m70j7795j0117J3431K0110L055
866G450j4585q183J3734K0481K116j7463j0419J1111J7152j749j9385j3047Q696
879d091J6257j207j8720j2332R973J8041J298j5931j0669J0589J9005J886j5487
892a388j1417Q795J7855O88j7755j2700Q003J6924J120j7146j2798R510J9193
905H884K639j5942j0583J0784J8861M199j5179j2451R038J7860J197j7674j4025
918a2392O559J5047P92j7357j4458O954J7306K829j5580j1191R681J9610N088
931A2888j2682j1137R313J9601M838j5861j3066O885J5903J585j6985j6068L982
$$ y = [1980, 3896, -10641, -16013, 1321, 24054, 26240, 9954, 1309, 14228, 31781, 28833, 7629, -6740, 926, 14970, 10160, -11667, -25742, -17001, -764, -1234, -19029, -29146, -15715, 4395, 7450, -7135, -15318, -1584, 18897, 21013, 3550, -6869, 4242, 21394, 19645, 260, -12787, -4091, 12166, 10959, -7761, -20093, -10120, 7921, 9219, -6712, -17381, -6792, 12213, 14099, -1388, -12805, -4010, 13845, 14533, -3222, -15922, -7919, 9005, 10125, -7021, -19819, -10309, 8884, 11523, -4419, -15002, -4218, 14643, 18842, 3663, -8788, 250, 18110, 19307, 1633, -12392, -5833, 9214, 10006, -7351, -21809, -14855, 2451, 5280, -10300, -21491, -11810, 7800, 12888, 206, -10931, -1618, 17983, 22821, 6960, -6106, 779, 16682, 18267, 1282, -14786, -10804]
944a0804J5975K375j7401j4141P647J7075N056j1847j1745Q208K0507O558j2975
957D488j1634P654J6863L932j4659j4624L915J5025K369j6559j5270M343J5492
970A335M188j3664j2657O042J8587Q114j1699j2059P148J8858O063j2693j3297
983e734L226J5708N305j5504j6462L397J4622L103j2610j4385L272J6815P171
996G924j1611j1998O873J7474P292r733j2313L957J6135O749j3760j5406J825
1009f592J4371M333j3737j5523J599J5139O764j1056j4037L827J8129Q561r591
1022B187j1170M287J6318Q368r668j4296J871J4873M141j3296j4285o2J2067N953
1036G288j2213j5314K618J6554P598r300j1899L533J7502J0519q837j3486K559
$$ y = [-10804, 5171, 7546, -9855, -23996, -16349, 726, 5782, -6065, -17810, -9602, 10905, 17463, 4488, -7146, 508, 17371, 21303, 6644, -7980, -4065, 10960, 13329, -3230, -18500, -14157, 1335, 5523, -8141, -20798, -14756, 3831, 11945, 246, -11813, -4665, 14193, 20256, 7563, -5734, -2508, 13200, 18505, 3001, -13461, -10064, 4558, 7661, -4949, -19334, -16062, 753, 7924, -3687, -15685, -8812, 8662, 15954, 6221, -6092, -2135, 14000, 20749, 6989, -8417, -6592, 7779, 12112, -1625, -17148, -15549, -410, 6354, -4702, -18739, -14912, 3217, 11778, 2187, -8983, -4696, 11622, 19990, 10322, -3974, -2103, 12770, 16911, 3615, -10670, -10732, 1335, 7288, -4925, -20239, -17621, -1067, 6531, -2769, -14668, -11135, 6367, 16886, 8049, -5437, -2878]
1049b878J6054P949j0633j5653m13J2974N711j1343j5868j076J3252P697j0038
1062d265j3830K988J5669Q876p229j2276K204J7188R585j0340j4338J681J3700
1075I613P666j0036j7000j990J3758Q414j0884j4769k14J3361J0315o511j3550
1088a1827O73J5354J0343p030j2991O66J2378Q076q940j4748j516J2422P480r577
1102G63j5874k76J4712Q685p575j2942l15J5502J2505o557j4410M68J3901Q811
1116A7398o592j3818m546J0511R125q783j5979k589J0975P685o053j2475j208
1129a6349J4016J1431n363j1980J319J5123J0867o328j3543j603J2503Q532q120
1142A0505j6801n139J0390Q699q182j5303m049J1322J0447l454j2193j344J4247
$$ y = [-2878, 13176, 21125, 10492, -5161, -5574, 7400, 13111, 1768, -14100, -15176, -1924, 5773, -4265, -18095, -15107, 562, 9438, 2209, -10067, -7863, 9325, 18910, 8570, -5768, -4087, 9613, 17279, 7243, -9757, -11747, 2011, 10425, -459, -15228, -15442, -2081, 8234, 1723, -11827, -11154, 4200, 14543, 7513, -5478, -4812, 7566, 15642, 6702, -8046, -9562, 2860, 10340, 763, -15111, -15387, -675, 8010, 435, -12507, -12822, 2680, 15185, 8628, -5782, -5314, 8587, 17398, 10806, -3012, -7558, 2953, 12078, 3295, -12684, -15273, -4298, 3387, -2666, -15141, -16349, -2333, 9098, 3735, -8245, -6926, 8197, 19064, 12736, -807, -2410, 10093, 18625, 10505, -6296, -11435, -1045, 7654, -528, -15831, -19880, -8558, 1889, -1565, -13758, -15102, -855]
1155h55J2133k962j0177p76J1884J0918n234j4324l045J0509P209q195j5476n429
1169a3820R450R545o723j5528l090J2773J1680k678j1708k719J3252J3032k270
1182A1196j1836l628J1002J0821m569j3641m719Q759P980n305j3615n488R832
1195c211R660n129j3015k681J0721J1074k873j2706m039J2070J2126m156j3106
1208e265m392J0082J1379k890j3595n531J0405J1102k882j2467m616R850J0851
1221A2031k972j2372m695Q849R891l600j3706n911R281R432m192j2916n451R581
1235f750J1454j476j2527m222J1671J3021p70j0667m757J0067J2754j439j3137
1248C222o190P314R493l205j4266q286O394R054m128j2664o158Q028J0653n61
$$ y = [-855, 11278, 8316, -1861, -2637, 9247, 20165, 14931, 607, -2438, 8071, 15280, 7085, -8391, -13820, -4370, 5175, -1548, -17076, -20166, -7393, 4287, 1609, -10099, -12818, 434, 13466, 11196, -640, -4268, 6734, 17555, 12986, -655, -5374, 3385, 11365, 6060, -7555, -13043, -3211, 6449, 1320, -11695, -14376, -3655, 7419, 4546, -8160, -12199, -129, 11997, 7841, -5265, -9657, 425, 11804, 8914, -4681, -10212, 193, 11295, 8413, -4054, -8670, 1180, 12031, 9059, -3313, -8008, 841, 10732, 7132, -6574, -12485, -3204, 6228, 2036, -10880, -16331, -6750, 4704, 3228, -9299, -13521, -1850, 11171, 10401, -266, -5023, 5044, 17798, 16359, 3222, -2968, 4346, 13839, 10634, -3632, -11918, -5524, 3530, -598, -13262, -19420, -11392, -739, -1300]
1262a300j0633l521J0919J3256M81r780m175J0601J2414n74j2238o443P249R974
1276A6230k077j3920r418N673R225l056j2706p768N846J0624K69j1096n757R051
1290h880J2299J036q851m400R075J3027J135j0402n258P548J1207p97j2507p867
1304c635N563R593k123j3067q931M416R592r20j2047p327O032J1044J443q908
1318i275n475Q237J3039K719q357m595P958J2224J463j0305p236N610R844r83
1332A4868j3353r182L991Q365j113j2693q989N146J0256J044r457o572O985J3045
1346B341L384p490n567P228J2163L351q898p311N334J0632O34j1131q830L409
1360g51R284J69j1680r499M162J0160Q71j0804q090N086J1569K011q777p036N622
$$ y = [-1300, -11933, -15454, -4535, 8721, 9202, -578, -4753, 5848, 18262, 17688, 5450, -993, 6256, 16230, 14153, 233, -9185, -3512, 5713, 2657, -10049, -17817, -11971, -1347, -1078, -12174, -17931, -8880, 3419, 4455, -4396, -8796, 279, 13306, 14441, 4039, -1219, 6329, 17536, 16739, 4232, -3635, 1928, 11521, 9398, -3669, -12600, -8184, 1408, 488, -11559, -18886, -12854, -1810, -367, -9275, -14750, -6513, 6526, 9245, 888, -3707, 4251, 16475, 17938, 7633, 397, 6007, 15851, 14868, 1515, -7667, -3676, 4689, 3576, -9117, -18106, -12960, -2704, -1660, -11117, -17689, -10704, 2341, 5725, -1765, -7332, -104, 12059, 15410, 6512, -799, 4535, 15167, 15801, 4670, -4160, -751, 8533, 8702, -2978, -12477, -8315, 1845, 2716, -8088, -16178, -11092, 477, 2488, -6289, -13325, -7703]
1375g703J1995L512q442o703N885J1630L375q180p041M754J1124K374j0363q865
1389b648L474Q907O53j1509j0599J963Q835P22j1242q953L583J0891L727p263
1403i459o235O430J3615O179n672m823O322J2878M395q099q825K403Q114p1j1872
1418E280j2473o12O261q37j1660j0141J636R951M337o435o082O662J4343P665
1432G895l393m369N933J3226O027p081r174J794P646L54j1076j2584j580O121
1446b61N60j1214j0569J572R410M517o634o383N051J2927O921l928n795M480J1880
1461A2534N527o870q318J444Q345K867q312j0895m35Q683K506q235r512Q63Q985
1476h23M394o849q614J442R897M355o550q507J512J0024M911o051p925K247J0646
$$ y = [-7703, 4292, 7804, -638, -7341, -1456, 10174, 13549, 5369, -1672, 3082, 14206, 16580, 6217, -2648, 826, 9733, 10386, -1123, -11722, -9759, -924, -202, -11444, -20397, -16814, -5923, -2196, -9459, -15694, -9264, 4351, 10530, 4858, 35, 6357, 19235, 23630, 15531, 6706, 9109, 17223, 17152, 5280, -7193, -7805, -1544, -2381, -14041, -24182, -22546, -12595, -8258, -14693, -20775, -14113, 230, 7895, 4502, 133, 6066, 19292, 25319, 18238, 9064, 10858, 18504, 18858, 7782, -4802, -6382, -261, 299, -10915, -21484, -19912, -10502, -5985, -12619, -19002, -13951, -1024, 5897, 1969, -3826, 654, 12534, 18061, 11191, 2873, 4317, 12662, 15529, 7217, -3678, -4113, 4570, 7076, -1159, -10671, -9808, -823, 3571, -3278, -11892, -10450, -553, 3802, -2748, -11255, -9743, 281, 5192, -859, -8784, -6537, 4109]
1491D109O035m894p481K483J0816N534n777q132j15P909M409r030j1860j591O464
1506a121J986q571j0708j432Q665O006n643p364L657J2426Q545j737n049L872
1520C532J2357P517m455q663j48P125K929r462j3164l984M594J654r349j2240
1534b1757j723Q272N822m307o298K994J2230R857o34m753L002J2144P760m131
1548A8478p925j297O279L661p700j3215l788N388J997p991j0605k262P712O504
1562d764l972p820J717J1372P902j930o041J049R404P874l424q637j256P327N112
1577A3913m830j0003k294O427M532m764r290k435P628N690n385q999j033P724
1591c119N593l870q697j950Q718P187l871p544j6Q502Q143j522p396p81Q901P126
$$ y = [4109, 10144, 5250, -2231, 252, 11068, 16602, 10825, 2693, 2578, 10487, 14896, 5866, -5994, -7585, -1121, 865, -7706, -18414, -19846, -11181, -5175, -10818, -18182, -14525, -2099, 6446, 4709, -340, 3532, 15889, 23406, 18951, 10288, 10140, 17265, 20194, 10732, -2432, -6416, -1822, -168, -9517, -21757, -23480, -15208, -9386, -13693, -19991, -16997, -4767, 5090, 4456, -297, 2705, 14849, 22609, 18478, 10553, 9256, 15535, 19196, 11496, -1719, -5507, -119, 1878, -6113, -16718, -18980, -11268, -4764, -8736, -16556, -14839, -3467, 4435, 2505, -3536, -2487, 6917, 14791, 11367, 2730, 1474, 8801, 13913, 9083, -920, -3214, 3213, 7745, 2981, -6309, -8744, -1116, 4574, -811, -9810, -10843, -3119, 2474, -1396, -10093, -12043, -3325, 3862, -9, -7553, -7569, 933, 9076, 7554, 158, -623, 8278, 15404]
1607A5404k989q051k254N523M818n015j0445m409M480L758n726j0074k850O938
1621a0892O441k706p129J52J0233R843k80o045P75J0042Q218j778q015l338N439
1636A0960N528n183j1628n092L277L039m424j0021m617N909O723k317o733n4R130
1651e503Q625N72n658m9R287Q326j695q197k885N922O506m241j0483n132M368
1666b37N099l120r908m969N422O940k221p263k191O525P735l54o743j649P823
1681H89P272j364o424k428O017P620k129q846l127N715N960k297q576n121M974
1696a865O796j974q941m767M696O873p87p798l466N945P649P7o245k222O511Q179
1712H661j83o866k134N932O395j814p835m939M152O069k884r443n054L688O338
$$ y = [15404, 12415, 4364, 2110, 7633, 12451, 7436, -3009, -7418, -2938, 820, -4906, -14980, -17830, -10892, -4451, -7157, -14286, -14134, -3901, 5942, 5662, -383, 392, 10434, 18652, 16874, 8859, 5521, 10960, 16488, 11305, -323, -5415, -2138, 901, -3523, -13544, -18161, -12252, -5529, -7846, -14579, -14633, -5503, 3122, 3694, -1964, -2013, 7274, 15600, 13905, 5708, 2823, 8745, 15251, 11010, 527, -4605, -237, 4862, 1742, -8166, -13135, -7713, -773, -2994, -10257, -12448, -5923, 1812, 1458, -5285, -6934, 889, 8161, 6797, 373, -2055, 3962, 11582, 9453, 607, -2520, 3195, 9155, 6858, -1718, -6839, -1865, 4931, 2957, -5984, -10751, -6055, 818, 31, -7767, -11233, -5288, 2361, 2438, -3807, -6029, 482, 8661, 8478, 1612, -522, 5410, 11805, 9991, 2156, -2783, 1369, 7438, 4554, -4889, -9943, -6255, 83]
1727H3j012p865m356N634Q203N30n743k180N774Q838J233o311l179N164O491n42
1743A0762p566n261L436N011k260q335m632L270O183q64p738m145N791P551O60
1758A863n890l340N466Q488J091o523m022M679P258J34o460n730L049O641l64
1773F340p458n044L196N801j82p142n025M479O692j69o410m229M329P670R50o696
1789b898l754M955P758J699o122m546M561P737Q56p087m786K563N727J68p228
1804c97o542K254N254k18o966n116L034O757J451n614l340N250Q244K399m347
1819B103l836N033Q282J449o596n199J933N901J52q211p245J069M937j00p211
1834g539n541K019P144K279m944l418M486Q281L366l882l201L641P956J575n693
$$ y = [83, -929, -8794, -13150, -7516, 687, 1217, -4526, -6706, -932, 7906, 9139, 2828, -351, 4813, 11304, 10762, 3196, -2065, 1371, 6382, 4122, -4213, -8845, -5575, 608, -256, -7994, -12139, -6348, 1203, 1863, -4027, -7367, -1901, 6587, 7678, 1155, -2867, 1812, 9070, 9204, 2744, -2986, 63, 6704, 6340, -1118, -6162, -2966, 2835, 2653, -4489, -9514, -5035, 1657, 1488, -4922, -9151, -4822, 2848, 3798, -2898, -6652, -1697, 6061, 7760, 1638, -2908, 1653, 9390, 10246, 3159, -1627, 936, 6663, 6831, -397, -6939, -4685, 569, 351, -6615, -11731, -8697, -1940, -489, -6103, -9443, -4193, 4051, 6450, 2103, -1733, 3300, 11582, 13031, 6435, 1236, 3169, 9070, 9222, 1011, -6234, -5165, -228, -328, -7539, -13080, -11061, -3917, -1638, -6582, -10000, -5514, 2767, 6133, 2251, -950, 2691, 10647, 12222, 6529]
1849F529n517J856N549M30p632o971J082N266O44o164o009K035O782K812n031
1864d339m052L198P838K823m096m184K440O977K037n517n140J611O071J692n935
1879A424o096J910O234J481n399n428J490O410K137n416n819J514O323K584m920
1894a571n733J750O809K730m531m397J836O848L458l899m936K088O736K058m576
1909D670n754R54N217J523o300p079L76M763J545n449n721Q43P015L487l124m007
1925g041K549P578N173k944m281K037O787L323m883o369m09M732R88o341p616
1940f717p21M596J355n017n960O41P093L454k576l536J972P785N080k248m250
1955I51J486O593L165l962o221p01M346K062n152p594o64M212K381m242o265L15
$$ y = [6529, 1012, 2868, 8417, 8847, 1215, -5756, -4674, 592, 1236, -4928, -10937, -8902, -2120, 692, -4339, -8391, -5193, 2645, 5468, 1372, -2812, -372, 6605, 8642, 3125, -2015, -404, 5667, 7359, 1424, -4672, -2762, 3472, 4953, -446, -5874, -4384, 2026, 4163, -1253, -7072, -5558, 765, 3349, -1571, -7304, -5554, 1255, 3985, -546, -4943, -3107, 3741, 7199, 3300, -1636, 452, 7188, 9246, 4670, -1084, -130, 5087, 6610, 310, -6769, -6393, -1630, -85, -5534, -11255, -10412, -3397, 90, -3034, -7041, -4492, 3086, 8259, 5315, 1034, 3071, 9858, 13181, 8298, 1929, 1520, 6252, 7240, 899, -6717, -7438, -2842, -1487, -6504, -12464, -11823, -4730, -1276, -3852, -7388, -5416, 2369, 7449, 5201, 951, 2437, 9030, 12195, 8233, 2012, 1311, 5657, 7719, 2567, -5027, -5691, -1479, 902, -3340, -9605, -9290]
1971i290N964L576k855m848R02O955M454k666n202J081O359L610k722n886j71
1986g39N784L210l667o063l12M800K896l493o393r87N108K598m070n831l62M885
2002b636L403l052n576K31O167M344k141l940L38O471N141j913n227q1N424L736
2018A0689l472o434j414L497K175m269o834k037L903K865l324n656l21N710M309
2033f13j182l833N50O457N767r55m429N7N348M186k434o251k121L684K894m043
2049C082p043k435L484K983k864o236j067M936M279j572m052m17O076N193j067
2064C280m371n1N284M605j589n398j312M366L554k574n942k470L588L341k936
2079A375o643k164M026L485j994n564j442M667M923j039m885l49N465M978j00
$$ y = [-9290, -3326, 250, -2605, -7453, -6551, 404, 4858, 2192, -3010, -1929, 4430, 8040, 5318, -568, -739, 5045, 8255, 4588, -1475, -1787, 3013, 5909, 2416, -3977, -4964, 144, 2742, -1328, -7159, -7521, -2636, 767, -2285, -7861, -7630, -1463, 2881, 740, -3200, -2862, 3609, 8750, 6837, 1610, 1529, 6953, 10689, 7217, 783, -631, 2866, 5041, 772, -6062, -8099, -4196, -1331, -4655, -10311, -10632, -4922, -613, -1795, -5628, -5078, 1379, 7146, 6191, 1762, 1819, 7167, 11353, 8919, 2668, 547, 4231, 7125, 3082, -3961, -6396, -2912, 71, -2793, -9029, -10096, -5160, -881, -2453, -6505, -6922, -846, 4347, 3280, -1091, -1142, 4142, 8747, 7158, 1760, 448, 4814, 8368, 5794, -148, -2618, 970, 4311, 1375, -5268, -7432, -3406, 79, -1915, -7479, -8921, -4254, 669, -370, -5255, -5604, -139, 4839, 4739]
2094D739m240q77M872N108j364n161k019L535L645k620o734k999L080K585k799
2109a249o153k769L787M673j518m801o47N021N835N15l718o67N442N299k09m638
2125D203k023L412L686j471o586l364K270K648k496o022k917L095M157j218m718
2140g344j617M486N255L11m162j007M492N766l96m062j925L193M758m20n309l224
2156a205K936L669j039n131l483K502L923j238n119k694K825M031m67m823k232
2171g545L378N308k46m215j477L748N877L78l801k082L850N235P0m407l410K274
2187B935L646q14n787m200J211K979j039n422l464K014M441l2l603j076M033N817
2203A639J832k934j150M702N753N74m210k889K031M002j570o347m474P69K771
$$ y = [4739, 499, -378, 4494, 9602, 8238, 3077, 1058, 4593, 8238, 5618, -1116, -4115, -1035, 1550, -1249, -7402, -10171, -6384, -1711, -3229, -8030, -8677, -3656, 2179, 2694, -1024, -1691, 3751, 9050, 8841, 4203, 2180, 5592, 9278, 7807, 1221, -2143, 127, 2775, 279, -5743, -8660, -5565, -1408, -2626, -7344, -8961, -4475, 780, 1091, -3071, -4078, 414, 6180, 5784, 1722, -203, 2990, 7748, 7328, 2019, -1205, 1731, 5400, 4361, -770, -4253, -1751, 2172, 934, -4185, -6879, -4054, -23, -490, -5313, -7545, -4167, 1141, 895, -3320, -4797, -1049, 4828, 5206, 1405, -677, 3173, 8408, 8478, 4071, 661, 2935, 6581, 5767, -20, -4220, -3009, -30, -1069, -6491, -9955, -7941, -3500, -3532, -7135, -8211, -4178, 1639, 3471, 537, -613, 4089, 9842, 10416, 6206, 3317, 5348, 9350, 7780, 1433, -3041, -2272, 499]
2218D99j262n348m248J628M685P46l774j658L498N822K405k757j379L599N456
2233G912N05l850k673K002L452n60n279m497J086L816n96m969l885J846M992N61
2249a37l519k797K701N286J574l658k592K292M371J209l796l285J700M161P33
2264D243l866l025K017M127Q01l648l336K028M534O00m368l735J398M208M04m652
2280b270l856J417M021J177l360l424J835N218K240k648k359K267N065J912k867
2295D368k818J163L594L46m315m326R5K885J99m977m323Q25M029J709l528k793
2311g867K073O211K651k189k006K265N100K429k797l755O15L479N52m594m341
2326b174p58K597K66l520m308Q65M019J563k599k317K205N198K796k114k844J825
$$ y = [499, -763, -6111, -10359, -8731, -4046, -3300, -7074, -8732, -5234, 588, 2993, 236, -1143, 2456, 7912, 8417, 4567, 1894, 3896, 7348, 6788, 1509, -2988, -1902, 1914, 1318, -3651, -7536, -5690, -698, -137, -3656, -6453, -3752, 1534, 3108, -550, -3142, -850, 3521, 4730, 934, -2351, -651, 3510, 4243, 377, -2648, -631, 3496, 4297, 649, -2687, -659, 3875, 4475, 107, -3628, -2230, 1978, 2382, -2270, -6126, -4709, -688, 489, -2871, -6295, -4460, 758, 2998, 350, -2009, 258, 5323, 7235, 4368, 1550, 2713, 6307, 6653, 2338, -1988, -1893, 992, 1191, -3786, -8109, -7284, -3255, -1546, -5074, -7867, -5794, 417, 3068, 879, -1127, 1138, 6238, 8667, 5870, 2115, 2730, 6209, 6761, 2167, -2174, -2932, -335, -69, -3589, -7897, -7032, -3013, -1450, -4049, -6366, -4161, 1037, 3833, 1719, -1125, 700]
2342G00M698K257l239m298K53L867R02l548m831j36L304J355k946l928O22L990
2358i78K352k095l169Q28M538K155k377l572J067L975J626k945l996O52L826J655
2374C542l142l704O22M054J987k277l634K14L674K427k353l944l18L964J843k958
2390cm027N38L451J966k453l440O18M247K214k400k587M44M209K567k658l668
2406i82M4L674J651k818m194n02L139J738k794l745l54L975K328j675l250O01
2422c164M374K406j326l019M25L776K233k339l863k50K692J541k805l922r97K941
2438a297K096k485l443j81L815L242j508k894J26L993L149j371l049k64L460K379
2454E768k061m068j176K983J571k270m314j042K849K304j773l267l42L215L247
$$ y = [700, 5398, 7655, 4416, 118, 371, 4238, 5140, 1592, -3239, -3375, -71, 1284, -1662, -5590, -4968, -978, 1374, -721, -3890, -3062, 1476, 3631, 1254, -2318, -1251, 2724, 4350, 1405, -2591, -1939, 1887, 3542, 400, -3304, -2682, 1372, 3359, 1082, -2552, -2338, 1336, 3763, 1410, -2534, -2852, 1112, 2955, -3, -4030, -3492, -41, 1925, -528, -3968, -3350, 897, 3111, 711, -1876, -1432, 2777, 5344, 2686, -982, -938, 2736, 4387, 1569, -2625, -3127, 12, 1750, -1044, -4789, -5143, -1168, 1160, -515, -3765, -3164, 1210, 3616, 2290, -729, -304, 3472, 5705, 3366, -497, -747, 1945, 3486, 681, -3241, -4238, -1297, 799, -1686, -5129, -5310, -1495, 1747, 239, -2655, -2529, 1464, 4613, 3242, 193, -71, 3389, 5768, 3707, -361, -1537, 1446, 3017, 747, -3567, -4609, -1760, 544, -1229, -4496, -4838, -1623, 1624]
2469A624j248l088J62L517L003q58l170m31K874K746j639l989p13K631J951j683
2485A689m070r64K500K389j751l689m87K557K890j435l076l74L151L033q41l089
2501a567n98L408L214j518l177p05K777K769r82m057j384K808K025j418l978j365
2517c748K487K391j315l849j094L089K799p89k911r29L311L577q13k938o63L264
2533A869L279j048l131j428K575K648j722l701j800K011K324j202m019j483K471
2548b357K500r12l300q88K947L326m50k771m56K997L205j96l087j081K470K958
2564D905j110l309j526J857K272q64l780k003J893K471q09l263j550K170L034
2579C88m18k454j192K635L516k7k729j387K751L163m58k787j584J629K857o54
$$ y = [1624, 376, -2712, -2550, 967, 3970, 3112, -58, -489, 2385, 5131, 3492, -497, -1210, 1421, 3372, 1689, -2381, -3345, -845, 1544, -207, -3896, -4383, -1826, 1064, -371, -3447, -3821, -670, 2363, 1522, -1567, -2165, 1243, 4457, 2939, -238, -943, 1834, 4603, 3621, -436, -1820, 988, 3013, 1595, -2383, -3748, -1261, 1130, -185, -4034, -5128, -2039, 760, -29, -2940, -3869, -558, 3019, 2206, -732, -1395, 1869, 5148, 4100, 969, -459, 2116, 4764, 3042, -659, -2459, -448, 1876, 674, -3345, -4828, -2357, 143, -769, -4069, -4957, -2010, 1316, 866, -1905, -2361, 636, 3841, 3645, 558, -523, 1947, 4905, 3795, 486, -1040, 817, 3089, 2225, -1555, -3558, -1665, 806, -3, -3266, -4816, -2646, 388, -30, -2484, -3676, -1041, 2475, 2448, -281, -1668, 1083, 4246, 3788, 1001, -583, 1046, 3903, 3249]
2595C249l648j809J702K335o01l519j963J815L058l13l322j393K374L087K39k577
2611a286j422K518L348K5k868j415J943K860K0l266j929J896K015l98l294j887
2627c140J486K694l66k932j762J808L139K65l010j375K267L231J32k442j721J745
2643A9L012K25k661k191J574K586j75k897k075J353K456L51l204j701J742K793
2659A207K30k597k136J869L194J56k271k081J715L043N43l036k034J467L125L13
2675B707k595k380J266K967M05l100j666J432K509N48k542j905Q19K918M67k855
2691a005j661J674K714L42k745k307J609L048O23k288k546J427L145P66k535k297
2707b036J073K770J017k560k365J016K666M91k450k387J078K438P95k519j820
$$ y = [3249, -399, -2208, -506, 1829, 1228, -2291, -4254, -2439, 619, 306, -3016, -4409, -2035, 1052, 1291, -1286, -2708, -190, 3158, 3183, 315, -1100, 843, 3703, 3723, 457, -1472, 424, 2439, 2041, -1253, -3140, -1654, 1040, 674, -2258, -4020, -2212, 927, 1192, -1818, -3193, -926, 2305, 2437, -5, -1726, 19, 3031, 3256, 595, -1596, -22, 2564, 2389, -508, -2583, -1230, 1226, 1577, -1627, -3328, -1586, 1207, 1437, -1160, -3296, -1427, 1767, 1923, -348, -2429, -714, 2329, 2872, -164, -2198, -731, 2394, 2707, 112, -2268, -1002, 1965, 2370, -730, -2396, -964, 1545, 2093, -449, -2354, -1535, 1383, 1850, -1005, -2666, -992, 1722, 2064, -681, -2988, -1379, 1669, 2292, 4, -2542, -1115, 2030, 2796, 261, -2036, -963, 1807, 2824, 264, -2101, -1085, 1581, 2072, -378, -2765, -1687, 751, 1546, -973, -2793]
2722b793P43K864J207k407k072J185L213Q96k107k656J070L200M36k412k208N40
2738a301K791Q49k470k286M47K652R95k218j936P74K680P33j677j880R63K553
2754A669J047k511k055O70K776N57k197k593O10K770J131k010k464O86K982J472
2770B540j860k277N50L004J248j881k253J93K324P96k334k358J40K381O59k355
2786a483k234N71K911J203j829j795J043L247J646j915j921R72K662J199j641
2801B636l107LK390Q86k419l006j40J844J163j611k739M51K575J553j346j930
2817b797J405K776J717j273k041O63K609J187k407k585k2K319R80k145l150j34
2833b898K271J536j924k331K2K878K022j363j974L65K740J751j445k319q1K344
$$ y = [-2793, -2050, 814, 2021, -386, -2458, -1273, 1940, 2836, 729, -1927, -857, 2343, 2779, 367, -1841, -1301, 1490, 2339, -131, -2417, -1970, 682, 1677, -541, -2477, -1703, 977, 1710, 33, -1847, -884, 1669, 2716, 205, -1850, -1180, 1596, 2153, -44, -2637, -2027, 743, 1874, -136, -2600, -1914, 1068, 2540, 680, -1597, -1047, 1957, 3205, 1324, -929, -736, 1588, 2384, 50, -2308, -2168, 213, 872, -1483, -3717, -3146, -235, 968, -861, -2656, -1613, 1634, 3280, 1365, -556, 416, 3078, 4277, 2636, -471, -468, 1922, 2808, 389, -2617, -2757, -913, 250, -1361, -4100, -3649, -1074, 479, -867, -2797, -1392, 1384, 3101, 1828, -213, 450, 3059, 4246, 1839, -746, -768, 1551, 2531, 386, -2764, -2898, -627, 909, -1015, -3346, -3324, -446, 1576, 213, -1761, -1396, 1344, 3095, 1650, -669, -750, 1594]
2849A594R28j439k527k22K207J119j594k836O70K460J638j224k740N25K511J654
2865B724j367k214l09J985J600j544k904l56J626J884j511k405k76K298J960p63
2881D28j720j34K805J763j083k029R7K338J319j607k822q52K001J122j796k854
2897c024o94J940J540j080j786j79K665J940l29j551L06K203J810p34k148r17
2913c8K173J071j786k581j016J663J132j744k473m52K298J947q26j764n5K466
2929A5K542m22j818l67K333J705j011k392j282J872P17j244k720o71J507J241
2945Ej029k003q6K147K071n00j739k94K607J884m67k642k60J799J439r30k984
2962i82j087J586J653q03k459q06J857J850k00j855n06K039K142m24j748r01J469
$$ y = [1594, 2522, 1083, -1444, -1666, 541, 1660, 66, -2770, -2100, 360, 1998, 774, -1966, -1441, 1070, 2724, 1357, -857, -1166, 819, 2419, 875, -2029, -2385, -759, 1125, -386, -2791, -3067, -769, 1191, 428, -1292, -1426, 1379, 3142, 2059, 30, 127, 2465, 3784, 2177, -645, -1497, 504, 1626, -170, -3024, -3718, -1778, -238, -1318, -3104, -3283, -618, 1322, 993, -558, -252, 1951, 3761, 3027, 879, -38, 2135, 3206, 1420, -1161, -2177, -514, 618, -1126, -3599, -4051, -1753, 194, -632, -2396, -2451, 15, 2557, 2135, 317, -50, 2283, 3988, 2977, 585, -697, 1175, 1892, 648, -2072, -2743, -1236, 5, -1024, -3027, -3113, -966, 1105, 605, -1134, -1428, 1179, 3063, 2596, -46, -306, 1493, 2932, 2002, -982, -2069, -483, 1170, 367, -2092, -2898, -1041, 809, 609, -1246, -1752, 287, 2429, 2005, 257, -644, 825]
2979H25J942r98k665q84J396J313n77k633r41J914K169o53j747q34K279K406l04
2996B008j908m39J731J964m77k385j273J299J282q74k657j276J110J593l96k030
3012b728o60J903K311O1j812p38K369K305l5j902j045J608J737p57k498j262R75
3029a68J283k90k702j530J605K012k72k135o00J535K733l60j481q96J524K190
3045B448K6k212j335J521J823n15k231j500J324J472j56k043r26J571J723K05
3061A195j669o23J234J698J38k010j099O57J952K9k101j585J272J665j40j573
3077i60j633J354K151K81j554j176J685K180Q8j666j141R79J833m12j874j559
3093a424M66J850l00k147j341R99K116Rj904j080J233K602L93j753q93J435K356
$$ y = [825, 2767, 1769, -896, -1780, -384, 929, 352, -2281, -3222, -1308, 861, 208, -1539, -2373, -94, 2312, 2008, 100, -339, 1392, 3356, 2879, 494, -779, 520, 1802, 928, -1729, -3005, -1895, -302, -698, -2728, -3388, -1485, 826, 887, -925, -1663, 706, 3011, 2976, 1074, 29, 1637, 3374, 2617, 119, -1143, -168, 1115, 825, -1877, -3407, -1802, 210, -62, -2197, -2797, -1262, 1471, 1111, -370, -1266, 258, 2448, 2474, 262, -1073, 448, 2271, 1756, -475, -1975, -651, 821, 665, -1378, -2304, -733, 990, 1195, -474, -1097, 137, 1835, 1973, -37, -1136, -479, 1473, 1502, -599, -2184, -912, 753, 613, -960, -2593, -1239, 912, 1193, -361, -1537, 148, 2328, 2416, 750, -391, 588, 2421, 2009, 135, -1424, -958, 892, 592, -1555, -2896, -1897, 219, 228, -1676, -2756, -1523, 1079, 1472, -281, -1174, 261, 2617]
3110B617J90j899j333J132J602j40k103j475P95J833k45k094j398O01K034K95
3126D12j633j391J255J883M10j422r79J056K147M96j756j443J113J819K63j850
3142C80j330M00K168K25k035j475O17J844L13j757j496P21J901M69j675j162O39
3159a253K026P27j621j474J214J676L93j429j303P40J908K03j379j514P39J903
3175A556K06j655j704O49J903K74j685j612M75K069M75j622j604O57K195L31j073
3192a65j461J044J914N96j590j137P15J674M87j112j816N71J787M35j337k049
3208a444K62J450M01j444j829L73J809O65j333j220N41K107J202r10j601Q77J959
3225A865O75p12j662J02J955J51j493j765M8J454J67j812j800L11J615O13j276
$$ y = [2617, 2807, 908, -425, 707, 2309, 2169, 66, -1409, -614, 1219, 974, -1120, -2518, -1917, 117, 412, -1221, -2612, -1357, 526, 936, -486, -1465, -409, 1738, 2234, 478, -965, 148, 1967, 2230, 380, -950, -550, 1618, 1843, -192, -1667, -1050, 794, 1107, -650, -2146, -1425, 476, 945, -730, -1892, -1253, 773, 1500, -121, -1595, -381, 1295, 1688, 259, -1044, -304, 1604, 1807, 428, -1086, -347, 1556, 1762, 107, -1597, -948, 955, 1229, -456, -2068, -1593, 476, 951, -671, -2275, -1618, 577, 908, -165, -1626, -582, 1332, 1928, 338, -799, -84, 1590, 2077, 965, -851, -280, 1507, 1942, 605, -1444, -1182, 268, 669, -775, -2604, -2231, -422, 243, -1090, -2310, -1769, 338, 1540, 630, -971, -94, 1865, 2540, 1828, 166, 268, 2223, 2374, 881, -884, -836, 618, 785, -1027, -2827, -2516, -901, -288, -1564]
3242a564j448R56J907J005o26j559J032K006J019q45j554J95J797M57j414j886
3258e22k43J522K82j481j876L3J838O53r97j436M28J631J247j323j113N56J787
3275I86J135j386j265J43J562Q71j316j773K43J677Q29j174j570j52J948Q61r19
3292G00j540j93J529O45o76j947N1J250O26j016j542M5J822Q94r55j130K97J875
3310G35J525q86j325J71J769J016j052j600j90J223M92r72k385o21J115Q31j075
3327a229j563m06J600J269m81r97L33J881J431l46r62J19J802R77r34j918j37
3344D39J190K82j035k334l61R92P03j116j270k47J462J319l74j236K20J602J398
3361A634l72j063m37J528R31q23j287n76R29R76r79j444n29J137J250n56j602
$$ y = [-1564, -3012, -2056, -149, 856, 230, -1329, -297, 1709, 2728, 1883, 329, 524, 2321, 2778, 1364, -522, -765, 757, 1039, -442, -2318, -2285, -447, 206, -791, -2227, -1799, -168, 1079, -244, -1357, -801, 986, 2121, 735, -530, -387, 1175, 2046, 730, -1043, -800, 877, 1706, 532, -1038, -1190, 758, 1619, 700, -840, -1033, 496, 1141, 465, -1482, -1431, -181, 445, -571, -2113, -2068, -246, 648, -307, -1437, -1140, 735, 2260, 1374, 49, 220, 1989, 3005, 1953, 353, 163, 1386, 1878, 906, -1479, -2100, -985, -154, -1229, -2792, -3198, -1598, -329, -810, -1807, -1474, 407, 1838, 1492, 530, 649, 2451, 3428, 2494, 576, 439, 1629, 1911, 876, -1458, -1819, -827, -124, -1240, -2510, -2757, -1295, 24, -350, -1586, -1366, 236, 1634, 1262, 199, -238, 1290, 2221, 1398, 111, -465, 464, 1440, 461, -983, -1512, -375, 875, 319, -1283]
3378a283o1J434J184m78j716kJ092J302p73j861m40J249O85m02j197m63J246J350
3396H66l62j148PJ190J309j11j320l11J197J096q06j898l82P47N96o96j872r66
3414b864J244J236n47j440m29J689J747J61j245J8J613J602k79j226p97J077J147
3431B707o40j797j064O58O94q13j800p56R60J083l32j027l93J304J854j47r67
3448d76m17J575J676k69j079q06P67J428n87j770q04O32R45n20j380r41J253R54
3466A81k74j248m36R56J437j35j255l04Q71J353l05j380l12Q23J267J38j171r72
3484g66Q70J211K41j416p37Q76J157k16j413o99N44J324o57j474q75R78Q18lj341
3503a578o12J185J285M09j382k00J007J429O00j328n71R01J314j8j618j026L54
$$ y = [-1283, -1344, 90, 1274, 796, -920, -922, 170, 1472, 699, -1162, -1602, -353, 332, -70, -1267, -1730, -484, 866, 504, -644, -637, 553, 1862, 1751, 431, 120, 1317, 2413, 1607, -291, -673, 74, 670, -26, -1898, -2864, -1620, -384, -931, -2371, -2800, -1111, 636, 797, -448, -430, 1183, 2785, 2506, 1280, 483, 1560, 2707, 2067, 270, -794, -136, 558, -255, -2055, -2811, -1851, -768, -1100, -2127, -2520, -1216, 638, 491, -476, -893, 682, 2358, 2089, 1010, 204, 971, 2399, 1812, 42, -762, -130, 815, 295, -1085, -2026, -773, 181, -93, -1341, -1777, -821, 616, 481, -774, -1078, -207, 1146, 841, -539, -851, -28, 1239, 1377, 206, -766, 104, 1315, 1556, 140, -597, 279, 1436, 1220, -193, -892, -348, 976, 319, -1155, -2030, -1052, -234, -237, -1578, -2190, -1005, 280, 689, -693, -893, 114, 1543, 2143, 815, 244, 1145, 2459, 2441, 823, -203, 151]
3520A51J093l93j735j060L06J284m44j092o49O20J556L99r44m34J043J582M55
3537A738j125o64J073J167O0j306q63L21J022P9j711r13N56Q17j71j332r04K73
3555a883J472J42j240m28J003J182N83q49p74O66J688N62j327o24K13J458K21
3572B065j392q80J81R35Q5j180j127L47Q41J75j067o57K78J023P04r94p63M79
3590i47J614J77n27p63N93R74O67j312p22M29J039L95j345j082L98J059L44j277
3608b86j026N06J404l44o09j130N59J335J18r34p87L60J201L16m88r82O00R76
3626G89M25n08r77L96J259J96p54j081J12P61M06r77j206L29P94R4q76o16k38
3645a672J316N70o90r52N21J487P51p00p80N23J161L80q31r97J29R25J40j338
$$ y = [151, 1244, 851, -884, -1944, -1638, -354, -798, -1890, -2539, -1919, -363, 36, -908, -1342, -299, 1283, 1738, 613, -51, 1022, 2189, 2249, 943, 80, 401, 1423, 1502, -209, -1122, -566, 251, 80, -1252, -2156, -1883, -411, -269, -1509, -1937, -934, 248, 831, -18, -792, -126, 1562, 2124, 797, 173, 386, 1844, 2065, 673, -207, -26, 909, 994, -186, -1313, -966, -125, 50, -1017, -1674, -1396, -373, 331, -663, -1426, -947, 667, 844, 317, -446, 147, 1121, 1788, 476, -246, 183, 1222, 1617, 272, -810, -412, 647, 991, -286, -1312, -806, 598, 254, -355, -1485, -926, 409, 527, -407, -1194, -834, 367, 683, 195, -787, -187, 789, 1214, 706, -271, 125, 1384, 1580, 826, -255, -143, 618, 1024, 47, -1159, -830, -36, 58, -818, -1434, -1672, -356, 214, -476, -1428, -907, 580, 1331, 631, -149, 374, 1535, 1915, 1084, 87, 216, 1141, 1281, -57]
3663e7j231K0Q34M25q27j113RJ356N30m37o68J66J742R85r46o83M69R89M94r34
3683A123j291l5J088j11r17j265k15J195O24j040p44m7J438P90n60p23K33J246
3701G89N89m07r94N2J095J60q01j077j47Q01N56p54j177R0J385O3n10p76R3J230
3721B60L84l60r00J38Q11P37n36j144k79J433M97r17j167M61O23N99k72j052K42
3740d42J087P14p15p59j76Q98Q07q40j387k41J018L43n72j272l63J081R91l87
3758b15j030K02J055J108m07o15J54J188L38k58q93n20P23N67j076j228n31P74
3776f64K28o87q62k53J157O70J53q50K52J000J069R3r88L15Q80M94m86q98o20
3795CO21K54n98j650j48O81O36n74j112K58R54J074m08p49L2J367O73k9j039j62
$$ y = [-57, -1288, -1268, -434, -9, -836, -1949, -1940, -584, -54, -491, -1159, -993, 749, 1734, 788, 105, 574, 1563, 2057, 1123, -168, -203, 885, 774, -143, -1408, -1623, -428, 196, -844, -1588, -1635, -197, 593, 33, -690, -457, 789, 1378, 971, -23, 29, 1124, 1284, 483, -594, -741, 60, 616, -138, -1315, -1225, 160, 223, -287, -1063, -970, 260, 644, 284, -616, -478, 333, 1070, 534, -610, -889, 544, 1041, 124, -1043, -582, 41, 640, 368, -684, -442, 645, 1359, 644, -115, -291, 607, 1414, 574, -813, -1054, -36, 307, -265, -1537, -1900, -819, 172, -215, -1245, -1043, 12, 1120, 713, 98, 252, 1440, 1778, 1520, 627, 107, 830, 1397, 321, -907, -1438, -664, -436, -1123, -1985, -2238, -1081, -411, -258, -1108, -856, 144, 1213, 1306, 318, 633, 1513, 2007, 1521, 623, 3, 624, 878, 280, -1370, -1518, -837, -201, -775, -1887, -1629, -675, 399, -9, -758, -726, 641, 1314, 1285, 246, 84]
3815H4O88R66o52j153k56M13N14m93r66k73O96O11m72m00j90R88R37j67j217j92
3835e34Q34R63k87j376m64P91R41l62j057m33P44N03l00q07J47N31R00m1r54k63
3855e24Q21Q50q4j189n79Q83M62k63j046o94Q75O06r6q04l42R01Q62K28j067j31
3875c31O60Q87j09r21o23O15P43l51q06r46P10N60k44j063k92P83O87j22o09j16
3895h88Q08J152rp30l07N55R78k46r45j046O31P26k89j055p64N13P09J9q31j68
3915a187N69Q61K24p25q2O59J077j58q65k27N31L81k52o80p99L88O93k27r75o84
3935a478O73R70j39p08o68N88J299M5m55m15N07P71j0n98n55M27M93J84r73n35
3955e77K43Q53k71j093n62Q17Q25j44n66l25N63Q22j64l64o27L13R45K59q39o45
$$ y = [84, 772, 1738, 1086, -67, -323, 90, 604, 111, -855, -1128, -432, 179, -293, -693, -883, 105, 1042, 875, -342, -534, 300, 1263, 976, -400, -864, -73, 868, 506, -551, -984, -240, 263, -37, -844, -697, -166, 734, 693, -261, -524, 297, 1147, 1063, -126, -705, 178, 640, 377, -669, -1363, -488, 118, 22, -782, -1124, -223, 639, 867, -200, -331, 329, 1216, 1107, 186, -437, 178, 921, 570, -236, -1182, -472, 88, -156, -1219, -1511, -728, -41, -163, -772, -888, -80, 1072, 1063, 333, 26, 581, 1559, 1313, 368, -678, -47, 679, 390, -665, -1429, -916, -207, -188, -1019, -1187, -618, 243, 467, -258, -340, 319, 1396, 1238, 373, 146, 677, 1058, 806, 126, -673, -285, 408, 181, -794, -1478, -805, 165, 26, -682, -1350, -762, 537, 582, 127, -288, 219, 990, 980, 382, -173, 254, 747, 931, -42, -577, -334, 519, 248, -845, -1407, -590, 235, 91, -475, -800, -237, 585, 421, 57, -570, -257, 688, 947, 108, -537]
3975e37O31M79J44l93p03J66R26k01o15n63L99N71k6q02k03M16P35j55n13o39
3995h83N11Q13J41p77n46N31O75K03k34q50K49R92K36q56m54J72N47L15o60p56
4015f31j49J142k29o33o22M42O62k0n77m04L60P76O46o25k79K98P75K92q94k74
4035E6J49Q65K7o37q21mN14J64n89p72j01N64L60o37l90N25N92L64l68o53N71
4056b21R19O16p43l37M83M77M09q58m99j72N48j30p51n01j55N25K15n78o91L84
4076a060M74N84k21m67J29Q17Q14m81o52L21O36K26m88m62m7M01L17q24m97j32
4096f12K31L74m40p86K65O63L76n54m70J44R58K87l43m73N49M02L69n39n04K23
4116A20O89J04o27m60Q6M46L24o90m74o5K76N81m81p59K42P14o0j97k63l48P20
$$ y = [-537, 94, 573, 717, 324, -379, -213, 713, 512, -103, -666, -267, 304, 278, -524, -727, -311, 424, 269, -244, -883, -372, 441, 582, -195, -741, -210, 465, 668, 434, -416, -167, 825, 1061, 205, -249, -77, 470, 785, 125, -631, -780, 362, 133, -500, -1122, -680, -18, -38, -615, -1019, -659, 117, 763, 138, -141, 157, 932, 1224, 330, 56, 205, 1070, 1097, 460, -361, -365, 149, 313, -276, -1048, -1149, -585, -225, -862, -1252, -727, -135, 229, -139, -792, -221, 698, 1314, 571, 234, 717, 1194, 1603, 745, 246, 74, 622, 492, -259, -760, -915, -390, -175, -753, -1444, -1060, -586, -2, -223, -690, -561, 256, 1070, 589, -63, 258, 894, 1120, 632, 170, 123, 524, 841, 17, -480, -612, -381, -7, -447, -1233, -968, -305, 71, -483, -953, -809, 149, 436, 93, -380, 169, 571, 940, 401, -103, 120, 809, 913, 286, -174, -88, 358, 682, -8, -482, -547, -271, 310, -171, -930, -688, 26, -34, -231, -494, -842, -122]
4137a22L66l40l97M32N80M16l56l81L0M17P47q51n80j91Q98O1m67p76l11N82K30
4158a3l00o63O9L48O96k74k90J67P47K24k32m04j52O34M44k24q31K22M27K28n34
4179B89r28q0M96M42m35p06j06L82P25m30k25K24M99M33m2m02O0N84J87q2o25
4200B60l2K86M74o28o57k75L65J82j71l51n66O05M03n7p78K51M77M87L9q31J21
4221c96P90M68m50j65k27L37O97m69n20j48J43N14k30q01j93L89N95n21m98j96
4241h81M17M38m6m34J48J33Q91l62k26k79O37L16k05o44rJ80P02o8m04p11K49
4262a58L86oo84n18N04N26k78j92l62M32O63o94p7j14P16L58n4m93M3N02M66l98
4284E68n57k6J21L09j43n38l60N58L35j18m60m73L21M90m5o75mK44M81O2m83j49
$$ y = [-122, 244, -96, -493, -61, 519, 935, 579, 198, 228, 645, 1392, 541, -39, -230, 668, 729, 262, -514, -825, -243, -13, -313, -976, -907, -559, 137, -137, -427, -260, 487, 711, 479, 75, -77, 557, 1001, 777, -54, 168, 595, 823, 289, -639, -719, -223, 219, -216, -922, -1028, -646, 79, -351, -576, -352, 147, 580, 538, 136, 196, 780, 967, 885, 260, 228, 514, 988, 360, -297, -572, -207, -25, -196, -547, -1113, -508, -105, -162, -940, -689, -212, 275, 314, -517, -396, 394, 862, 412, 247, 20, 357, 1054, 585, 65, -83, 60, 574, 344, -457, -650, -261, 334, -187, -685, -881, -464, -26, -72, -506, -358, -225, 666, 304, 78, -201, 436, 752, 547, -97, -106, 74, 776, 708, 304, -407, -158, 228, 222, -462, -980, -476, 50, -228, -420, -782, -350, 313, -381, -458, -572, 144, 502, 448, -45, -2, 500, 966, 568, 11, -15, 106, 415, 272, -266, -626, -68, 267, 149, -311, -784, -463, 27, -18, -693, -697, -453, 28, 90, -393, -542]
4306e42P25N67l46l64P5K6O14k78j14j62R8M49j84o74l73K64L28k2l64n22L55
4327d44O03nn57l30L35O79J59p35J15K62N28N4k92l08M89J21O0o11p2j64M06l65
4349g2n98l56L78M81N6n44j07K48P45O7l70j85LQ19j83J9n81L82M72k82l36k91
4371b35N0M47L3n82m36M53O03k41n15J23J2O54k72p0m00K13N27m0k25p04O19M38
4393D52j68k33m00O7N99M3l46o0k08P35o8j58n79K11M41l50k0p95L55O58k18l88
4415d30l09J52N98J69k82k44L20O51K90m21m10L73Q9K92n37l89j81M33R8o12m22
4436g72j91P86k29k97m56M20O21J33p7k15O28N39J29l57k58K31M27Q1n40p49R
4457a37M32k0m77o78k38O61J87n63j74K18N34L36m23K0L09O57J14m15M0j03Q18
$$ y = [-542, 183, 750, 404, 40, 115, 141, 755, 477, 363, 201, 299, 748, 564, -110, -483, -219, 109, 87, -277, -799, -444, 159, 154, -403, -733, -398, 281, 440, -295, -180, 82, 610, 664, 372, 64, 553, 674, 734, 123, 51, -113, 293, -72, -670, -1026, -648, -167, -111, -655, -762, -514, 231, 298, -72, -257, -254, 565, 382, 401, -180, 202, 674, 392, 56, -235, -185, 262, 295, -287, -723, -270, 333, 92, -423, -300, -288, 366, 94, 24, -376, -163, 364, 324, 99, -605, 14, 452, 284, 51, -349, -282, 317, 360, 14, -46, -254, 481, 413, 255, -324, -113, 328, -22, -42, -837, -482, 176, -42, -430, -739, -587, 11, 180, -102, -346, -26, 625, 915, 494, 84, 457, 546, 838, 301, -88, -269, 164, 262, -350, -772, -963, -177, -406, -703, -1159, -739, -118, 15, -62, -277, 351, 890, 1019, 662, 404, 635, 1062, 1143, 603, -146, -137, 295, 275, -202, -880, -1118, -457, -270, -833, -1007, -789, -255, 81, -342, -322, -13, 644, 758, 343, 383, 280, 1098]
4478A098j76n97j67o6K75K9k44n89K08J72M2l99k42j92N36L79n70Q5l18O86K28
4499A78l50n2J36N33q1N1o41M09O76l3l48p2k18K11M05l28p17O1K38K3l25l75
4521f19m82P09K60k22r73M17M24M22P1k50L75N45L37j78j82k8N83l43r2n62o5
4542A47j16J38l95m51l09L70L7m03K8k03N30N04q2q7J41N54K85N2j66j19M22J56
4564A033k86m88j49L95j93n29l34j38K83J09j15n37K59K14J03L15o34L13O68L34
$$ y = [1098, 922, 325, 158, 92, 367, 396, 152, -437, -229, -57, -15, -414, -656, -848, -312, 67, -503, -418, -736, -50, 178, -172, -224, -88, 445, 364, 415, -226, 183, 859, 826, 478, 406, 188, 399, 804, 476, -241, -180, 58, 81, -244, -619, -1101, -392, -132, -354, -1327, -910, -486, -64, 7, -243, 132, 677, 1014, 836, 654, 626, 1209, 866, 774, 212, 147, 31, 169, -226, -677, -986, -616, -579, -982, -954, -1157, -627, -123, -205, -292, -151, 403, 688, 740, 574, 455, 877, 1033, 747, 259, 110, 505, 312, -217, -551, -689, -406, -297, -412, -949, -690, -476, -373, -58, -692, -379, 289, 623]
$$ [...]
8191H4
##END NTUPLES=NMR FID
##END=
