##TITLE=1H_SA_PPhvCl(toulene)
 CDCl3, 8 sc, 
 16.9.2019
##JCAMPDX= 6.0         $$ Bruker NMR JCAMP-DX V2.0
##DATA TYPE= NMR FID
##DATA CLASS= NTUPLES
##ORIGIN= UXNMR, Bruker Analytische Messtechnik GmbH
##OWNER= root
$$ XWIN-NMR		Version 3.5
$$ Mon Sep 16 14:17:44 2019 Russian Standard Time (UT+4h)  she@DPX200
##.OBSERVE FREQUENCY= 200.13155
##.OBSERVE NUCLEUS= ^1H
##.DELAY= (6, 6)
##.ACQUISITION MODE= SIMULTANEOUS
##.ACQUISITION SCHEME= undefined
##.AVERAGES= 8
##.DIGITISER RES= 18
##SPECTROMETER/DATA SYSTEM= spect
##.PULSE SEQUENCE= zg30
##.SOLVENT NAME= CDCl3
##.SHIFT REFERENCE= (INTERNAL, CDCl3, 0, 15.7039)
##AUDIT TRAIL= $$ (NUMBER, WHEN, WHO, WHERE, WHAT)
$$ ##TITLE= Audit trail, XWIN-NMR		Version 3.5
$$ ##JCAMPDX= 5.01
$$ ##ORIGIN= Bruker BioSpin GmbH
$$ ##OWNER= she
$$ F:/spectra/data/she/nmr/H-F/1/audita.txt
$$ ##AUDIT TRAIL=  $$ (NUMBER, WHEN, WHO, WHERE, WHAT)
(   1,<2019-09-16 14:16:28.06 +0400>,<she>,<DPX200>,
      <created by zg, POWCHK disabled, PULCHK disabled
       configuration hash MD5:
       00 E9 B6 7A A2 85 ED C7 34 08 36 98 17 FE 4E 26
       data hash MD5: 16K
       0A A3 36 EA 10 07 26 19 9D C1 83 A1 B9 49 82 F6>)
$$ ##END=
$$ 
$$ hash MD5
$$ 51 3A 75 7A 2E 9D 75 E0 2E CB 17 19 DE 33 ED 92
##$RELAX= 
##$RELAX= 
##$RELAX= 
##$RELAX= 
##$RELAX= 
##$RELAX= 
$$ Bruker specific parameters
$$ --------------------------
##$DU= <F:/spectra>
##$EXPNO= 1
##$NAME= <H-F>
##$PROCNO= 1
##$TYPE= <nmr>
##$USER= <she>
##$AMP= (0..31)
100 100 100 100 100 100 100 100 100 100 100 100 100 100 100 100 100 100 
100 100 100 100 100 100 100 100 100 100 100 100 100 100 
##$AQSEQ= 0
##$AQ_mod= 1
##$AUNM= <au_zg>
##$AUTOPOS= <>
##$BF1= 200.13
##$BF2= 200.13
##$BF3= 200.13
##$BF4= 200.13
##$BF5= 200.13
##$BF6= 200.13
##$BF7= 200.13
##$BF8= 200.13
##$BYTORDA= 1
##$CFDGTYP= 0
##$CFRGTYP= 5
##$CHEMSTR= <none>
##$CNST= (0..31)
1 1 145 1 1 1 1 1 1 1 1 1 1 1 1 1 1 1 1 1 1 1 1 1 1 1 1 1 1 1 1 1 
##$CPDPRG= <>
##$CPDPRG1= <>
##$CPDPRG2= <>
##$CPDPRG3= <>
##$CPDPRG4= <mlev>
##$CPDPRG5= <mlev>
##$CPDPRG6= <mlev>
##$CPDPRG7= <mlev>
##$CPDPRG8= <mlev>
##$CPDPRGB= <>
##$CPDPRGT= <>
##$D= (0..31)
0 1.2 0 0 0 0 0 0 0 0 0 0.03 0 0 0 0 0 0 0 0 0 0 0 0 0 0 0 0 0 0 0 0 
##$DATE= 1568628987
##$DBL= (0..7)
120 120 120 120 120 120 120 120 
##$DBP= (0..7)
150 150 150 150 150 150 150 150 
##$DBP07= 0
##$DBPNAM0= <>
##$DBPNAM1= <>
##$DBPNAM2= <>
##$DBPNAM3= <>
##$DBPNAM4= <>
##$DBPNAM5= <>
##$DBPNAM6= <>
##$DBPNAM7= <>
##$DBPOAL= (0..7)
0.5 0.5 0.5 0.5 0.5 0.5 0.5 0.5 
##$DBPOFFS= (0..7)
0 0 0 0 0 0 0 0 
##$DE= 6
##$DECBNUC= <off>
##$DECIM= 24
##$DECNUC= <off>
##$DECSTAT= 4
##$DIGMOD= 1
##$DIGTYP= 9
##$DL= (0..7)
0 120 120 120 120 120 120 120 
##$DP= (0..7)
150 150 150 150 150 150 150 150 
##$DP07= 0
##$DPNAME0= <>
##$DPNAME1= <>
##$DPNAME2= <>
##$DPNAME3= <>
##$DPNAME4= <>
##$DPNAME5= <>
##$DPNAME6= <>
##$DPNAME7= <>
##$DPOAL= (0..7)
0.5 0.5 0.5 0.5 0.5 0.5 0.5 0.5 
##$DPOFFS= (0..7)
0 0 0 0 0 0 0 0 
##$DQDMODE= 0
##$DR= 18
##$DS= 0
##$DSLIST= <SSSSSSSSSSSSSSS>
$$ [...]
##$SUBNAM2= <"">
##$SUBNAM3= <"">
##$SUBNAM4= <"">
##$SUBNAM5= <"">
##$SUBNAM6= <"">
##$SUBNAM7= <"">
##$SUBNAM8= <"">
##$SUBNAM9= <"">
##$SW= 24.9336996594482
##$SWIBOX= (0..15)
0 0 2 0 0 0 0 0 0 0 0 0 0 0 0 0 
##$SW_h= 4990.01996007984
##$TD= 16384
##$TD0= 1
##$TE= 0
##$TE2= 300
##$TE3= 300
##$TEG= 300
##$TL= (0..7)
0 120 120 120 120 120 120 120 
##$TP= (0..7)
150 150 150 150 150 150 150 150 
##$TP07= 0
##$TPNAME0= <>
##$TPNAME1= <>
##$TPNAME2= <>
##$TPNAME3= <>
##$TPNAME4= <>
##$TPNAME5= <>
##$TPNAME6= <>
##$TPNAME7= <>
##$TPOAL= (0..7)
0.5 0.5 0.5 0.5 0.5 0.5 0.5 0.5 
##$TPOFFS= (0..7)
0 0 0 0 0 0 0 0 
##$TUNHIN= 0
##$TUNHOUT= 0
##$TUNXOUT= 0
##$USERA1= <user>
##$USERA2= <user>
##$USERA3= <user>
##$USERA4= <user>
##$USERA5= <user>
##$V9= 5
##$VALIST= <valist>
##$VCLIST= <CCCCCCCCCCCCCCC>
##$VD= 0
##$VDLIST= <DDDDDDDDDDDDDDD>
##$VPLIST= <PPPPPPPPPPPPPPP>
##$VTLIST= <TTTTTTTTTTTTTTT>
##$WBST= 1024
##$WBSW= 4
##$XGAIN= (0..3)
0 0 0 0 
##$XL= 0
##$YL= 0
##$YMAX_a= 102024
##$YMIN_a= -77987
##$ZGOPTNS= <>
##$ZL1= 120
##$ZL2= 120
##$ZL3= 120
##$ZL4= 120
##$ABSF1= 10
##$ABSF2= 0
##$ABSG= 5
##$ABSL= 3
##$ALPHA= 0
##$AQORDER= 0
##$ASSFAC= 0
##$ASSFACI= 0
##$ASSFACX= 0
##$ASSWID= 0
##$AUNMP= <proc_1d>
##$AZFE= 0.1
##$AZFW= 0.1
##$BCFW= 1
##$BC_mod= 2
##$BYTORDP= 1
##$COROFFS= 0
##$CY= 11.3945322036743
##$DATMOD= 1
##$DC= 2
##$DFILT= <>
##$DTYPP= 0
##$F1P= 20.1720416913024
##$F2P= 0.152960286110954
##$FCOR= 0.5
##$FTSIZE= 0
##$FT_mod= 4
##$GAMMA= 1
##$GB= 0.15
##$INTBC= 1
##$INTSCL= 1
##$ISEN= 128
##$LB= 0.24
##$LEV0= 0
##$LPBIN= 0
##$MAXI= 10000
##$MC2= 0
##$MEAN= 0
##$ME_mod= 0
##$MI= 1.114404
##$NCOEF= 0
##$NC_proc= 0
##$NLEV= 6
##$NOISF1= 3.799351
##$NOISF2= 2.8
##$NSP= 1
##$NTH_PI= 0
##$NZP= 0
##$OFFSET= 15.70392
##$PC= 1
##$PHC0= -9576.399
##$PHC1= 18.80096
##$PH_mod= 1
##$PKNL= yes
##$PPARMOD= 0
##$PSCAL= 0
##$PSIGN= 0
##$REVERSE= no
##$SF= 200.130013532006
##$SI= 16384
##$SIGF1= 3
##$SIGF2= 2
##$SINO= 400
##$SIOLD= 16384
##$SREGLST= <1H.CDCl3>
##$SSB= 0
##$STSI= 0
##$STSR= 0
##$SW_p= 3612.71676300578
##$SYMM= 0
##$S_DEV= 0
##$TDeff= 0
##$TDoff= 0
##$TI= <>
##$TILT= no
##$TM1= 0
##$TM2= 0
##$TOPLEV= 0
##$USERP1= <user>
##$USERP2= <user>
##$USERP3= <user>
##$USERP4= <user>
##$USERP5= <user>
##$WDW= 1
##$XDIM= 8192
##$YMAX_p= 0
##$YMIN_p= 0
$$ End of Bruker specific parameters
$$ ---------------------------------
##NTUPLES= NMR FID
##VAR_NAME=  TIME,          FID/REAL,        FID/IMAG
##SYMBOL=    X,             R,               I
##VAR_TYPE=  INDEPENDENT,   DEPENDENT,       DEPENDENT
##VAR_FORM=  AFFN,          ASDF,            ASDF
##VAR_DIM=   8192,          8192,            8192
##UNITS=     SECONDS,       ARBITRARY UNITS, ARBITRARY UNITS
##FACTOR=    0.0002004,     1,               1
##FIRST=     0,             0,               0
##LAST=      1.6414764,     0,               0
##MIN=       0,             -77987,          0
##MAX=       1.6414764,     102024,          0
$$ Real data points
##PAGE= N=1
##DATA TABLE= (X++(R..R)), XYDATA
0 0 0 0 0 0 0 0 0 0 1 -8 8 -8 8 -8 16 -16 20 -24 28 -32 40 -46 52 -60 70 -80 90 -104 116 -132 149 -168 189
33 189 -209 233 -262 290 -323 357 -397 439 -487 538 -596 660 -733 815 -908 1014 -1137 1284
51 1284 -1459 1672 -1943 2295 -2779 3484 -4617 6751 -12211 59996 101895 60401 97096 102024
65 102024 83005 63610 85589 87966 69913 55641 69248 71522 60623 49334 52818 51976 47643
78 47643 40380 36661 33967 35923 32062 22242 17155 23021 21926 10546 5413 11928 12256 1410 -5856
93 -5856 -155 3729 -2933 -12429 -10903 -3532 -6132 -17991 -18126 -7739 -7189 -20704 -23923 -11526 -8417
108 -8417 -22086 -25233 -11903 -8295 -21821 -25233 -12226 -8349 -19054 -20659 -10744 -9055 -15254 -14721
122 -14721 -8900 -8782 -9578 -6665 -5848 -7487 -3946 198 -2432 -4010 3110 7415 1813 -511 8819 14440
138 14440 7207 5439 15369 19956 12725 11200 20121 24877 19868 17473 23530 28587 25787 22932 27116
153 27116 32196 31731 27603 28280 34147 35040 31575 30694 34914 36395 32428 30507 33604 35908 32827 30272
169 30272 31107 31791 30365 28105 26910 27163 27696 26213 20781 19737 22881 22256 15171 13240 17890 16776
185 16776 8541 6487 11852 11360 2650 636 5438 5028 -2340 -4228 603 143 -5853 -7578 -4496 -5105
201 -5105 -8293 -9191 -7846 -8167 -9125 -10425 -10717 -10458 -8716 -9584 -11566 -11547 -8947 -8817 -10816 -11419 -8322 -7213
219 -7213 -10382 -11133 -7830 -5865 -8264 -9602 -6463 -4418 -6911 -8808 -5953 -3265 -4821 -7667 -5484
234 -5484 -2884 -4229 -6606 -4850 -2137 -2733 -5046 -4333 -2098 -2576 -3324 -2747 -1766 -2035 -2553 -2323 -1572 -1675
252 -1675 -953 -645 -931 -698 388 252 -445 85 2657 2309 272 801 3834 3800 1700 2620 5070 4971 2726
271 2726 3029 5770 6211 4094 4515 6651 6287 4289 4385 6756 6301 4792 4890 5687 4984 4322 4266 4455 4124
290 4124 3813 3587 2848 2052 2715 2948 1423 137 1042 1440 -114 -1635 -201 769 -1342 -2664 -1457
307 -1457 -74 -2181 -3167 -1633 36 -2230 -3731 -1839 -86 -1872 -2748 -1176 310 -1228 -1794 -205
323 -205 662 367 -279 870 1289 803 1019 2302 2190 1695 2396 3091 2393 1939 3519 3968 2619 2173 3519
342 3519 3743 1681 1828 3909 3757 1178 1178 2806 2895 527 283 2191 2194 -525 -826 1282 841 -981 -1029
361 -1029 408 -123 -2068 -1494 81 -452 -1786 -1471 -310 -927 -1549 -832 245 -813 -1203 297 155
378 155 -537 -202 1249 1283 11 567 1946 1549 922 1655 2954 2433 1152 1657 2991 2799 1074 2325
396 2325 3597 2409 496 2111 3193 1273 160 1646 2374 395 -584 516 1261 -302 -1485 -401
412 -401 -206 -2083 -2411 -1302 -1764 -3185 -3045 -1538 -2572 -3975 -2952 -2275 -3513 -3925 -2993 -2336 -3554
429 -3554 -4091 -2824 -2323 -3144 -3913 -1979 -1711 -2813 -3540 -1418 -923 -2534 -2421 -854 -949 -1810 -1729 -509
447 -509 -162 -1560 -1325 -357 -567 -1479 -1082 -408 -868 -2174 -1909 -1165 -1968 -2984 -2056 -2258 -3264 -3937 -2567
466 -2567 -2896 -4554 -4661 -4036 -3963 -5380 -6050 -4216 -4715 -6462 -6287 -5207 -5747 -7334 -6746 -5386 -6058 -7431
484 -7431 -6380 -5765 -5974 -7011 -5814 -4835 -5391 -6063 -5181 -4034 -4887 -5344 -3933 -3574 -4462 -4307 -3111 -2831
502 -2831 -3934 -2967 -1921 -2407 -3170 -2624 -1713 -1923 -2548 -2179 -1151 -2032 -2499 -1755 -1271 -2460 -3079 -2018
520 -2018 -1603 -2587 -2993 -2443 -1704 -2961 -2978 -2239 -1935 -2965 -3164 -2329 -2444 -3177 -2968 -2048 -1999 -2856 -2485 -1615
540 -1615 -1615 -2262 -1560 -528 -699 -1284 -552 89 176 303 1058 1853 1269 1125 2201 2804 2052 2099 3232 3417
560 3417 2459 3146 3878 3842 3294 3184 3930 3639 2893 3211 3846 3246 2298 3001 3321 2158 1514 2090 2480 1068
580 1068 767 1074 1181 -16 -52 585 -43 -890 -914 -38 -825 -1600 -1373 -833 -1242 -1797 -1287 -687 -1442 -1944
600 -1944 -1085 -906 -1326 -1627 -475 -255 -1107 -820 -6 497 13 59 641 621 394 730 1763 1056 1127 1586
620 1586 1855 1485 1336 1811 2095 1843 1387 1502 1866 1604 1210 1513 1746 994 439 1106 1278 501 -36 643
640 643 651 -504 -372 742 49 -800 -524 155 190 -808 -315 755 -18 -953 89 789 37 -199 796 1614
660 1614 817 168 1879 1764 1275 1474 2290 2248 1736 1982 3087 3069 1719 2553 3153 2656 1969 2592 3429 2543
680 2543 2349 2783 2596 1958 1880 2199 1934 1349 904 1346 1240 517 9 371 210 -557 -1049 -768 -643 -1335
700 -1335 -1390 -1260 -1627 -2174 -2006 -1661 -1454 -2137 -2062 -1635 -1310 -2491 -2064 -989 -941 -2329 -1234 -371 -1048 -969
720 -969 -113 143 -219 -348 496 1540 190 361 1304 1688 1128 783 1962 1878 997 1374 2222 1512 694 1524
740 1524 1512 763 575 1311 845 364 110 651 474 -293 -309 -51 -561 -1316 -1104 -879 -1512 -2100 -1764 -1597 -1979
761 -1979 -2831 -2439 -2552 -2758 -2622 -2613 -2931 -2999 -3075 -2772 -2299 -2579 -2811 -2745 -2624 -2567 -2864 -2612 -2092 -2767 -2947 -2283
783 -2283 -1994 -2412 -2581 -2503 -2015 -2588 -2748 -1967 -1973 -3052 -2777 -2020 -2633 -3791 -3459 -2496 -3443 -3890 -3261 -3243 -4226
804 -4226 -4923 -3918 -4182 -4729 -4800 -4763 -4600 -5561 -5603 -4249 -4589 -5620 -5544 -4252 -5142 -5611 -4740 -4058 -4914 -5112
824 -5112 -4249 -3811 -4069 -3863 -3068 -2567 -2958 -2531 -2117 -1789 -1774 -1628 -930 -261 -975 -357 556 465 700 607 1328
845 1328 1377 1086 1522 2144 2206 1778 1872 2710 2397 1800 2248 2667 2698 1831 1910 2271 1738 1520 1610 2026 1925 830
867 830 1376 1739 939 818 1529 1005 510 337 1372 989 683 574 1647 1026 555 955 1563 1423 592 1519
887 1519 1784 1625 1401 1899 2558 2081 1892 2684 2575 1801 2170 2750 2855 2279 2512 2670 2608 2090 2451 2805
907 2805 2462 2169 2106 1963 1922 1764 1737 1720 1079 732 1280 953 463 127 461 279 53 -413 -576 -565 -1030 -716
929 -716 -667 -677 -970 -1329 -838 -618 -1259 -936 -600 -1056 -1154 -663 -216 -152 -515 -290 419 4 -69 687 850 825
951 825 787 955 1103 1074 1429 1725 1641 1541 1746 2065 1823 1795 1736 2042 2016 1660 1506 1717 1203 1124 1548 1328 795
974 795 737 842 641 428 513 583 397 -269 -227 286 202 -402 -474 -219 -353 -540 -206 180 -390 -777 61 -47
996 -47 -159 185 587 556 463 86 594 769 1087 987 1026 1395 978 1107 1488 1704 1416 1631 2178 1740 1771 1931
1018 1931 2179 2260 1670 1940 2076 1849 1510 1755 1661 1184 957 1234 1000 637 530 576 555 -184 -206 19 18 -402
1040 -402 -649 -325 -724 -1010 -767 -595 -529 -1102 -900 -191 -1061 -1130 -895 -495 -717 -914 -309 75 44 -15 348
1061 348 364 379 495 892 961 378 621 903 1203 842 1306 1339 916 559 976 1251 857 941 990 939 936 314 455
1084 455 533 449 36 -242 58 -353 -1063 -650 -205 -922 -948 -810 -957 -1381 -1422 -715 -1193 -1354 -1548 -1146 -1287
1105 -1287 -1486 -1148 -687 -1094 -1283 -1165 -454 -1002 -1104 -257 -77 -477 -293 24 3 -117 46 802 655 471
1125 471 594 893 1340 526 849 1350 1056 842 881 1243 1013 593 576 470 657 553 375 549 265 323 445
1146 445 -151 -90 -496 -299 -276 -688 -643 -266 -224 -730 -896 -658 -456 -950 -597 -530 -301 -719 -397 -23 -103 -531
1168 -531 -110 340 494 117 673 1061 905 929 1433 1351 1214 1541 1657 1836 1410 1736 2416 2314 2173 2277 2444
1189 2444 2562 1891 2021 2392 1925 1930 2095 2097 1532 1361 1512 1274 1444 1268 1411 867 1241 642 620 503 647
1210 647 697 499 437 85 159 37 -8 -127 -98 -80 -195 -47 13 217 349 -72 86 664 490 291 451 321
1232 321 298 407 463 895 471 779 1055 893 802 514 882 738 530 377 858 452 230 373 579 284 47
1253 47 -32 -160 -389 -746 -263 -637 -1035 -901 -757 -1369 -1611 -1661 -1400 -1412 -1876 -1720 -1354 -1815 -2030 -1689 -1475
1274 -1475 -1594 -1809 -1561 -1480 -1352 -1103 -1035 -978 -801 -691 -645 -767 -42 -109 108 295 349 108 532 694 948 834
1296 834 1298 1285 1167 895 963 1344 1074 1084 1537 1278 955 912 1335 1069 580 931 943 722 242 403 445 277
1318 277 -66 -15 -17 -527 -461 -365 -631 -905 -803 -530 -1114 -978 -739 -524 -1118 -1353 -794 -712 -1221 -1199 -710 -817
1340 -817 -1238 -944 -740 -828 -716 -528 -438 -496 -423 -389 -269 -104 -534 -435 -276 -509 -572 -296 -515 -258 -445 -786
1362 -786 -353 -814 -634 -860 -1181 -1194 -1236 -1453 -1179 -1553 -1787 -1706 -1627 -1800 -1856 -1784 -1787 -1671 -2135 -1953 -2081 -2075 -2201
1385 -2201 -1400 -1814 -1802 -1821 -1154 -1334 -1343 -912 -700 -843 -794 -222 -150 -247 -139 513 598 463 664 942 891 990 802
1408 802 1341 1330 1053 1580 1533 1387 1566 1405 1802 1046 1732 1785 1434 1394 1332 1279 1381 1027 1098 511 839 515
1430 515 467 330 277 29 -64 -180 -193 -390 -452 -220 -572 -502 -1078 -650 -599 -1150 -873 -952 -808 -1014 -1030 -732 -721
1453 -721 -1106 -535 -546 -424 -682 -119 -89 -463 -501 -490 -234 -719 -331 -64 274 -264 -432 -133 -303 -362 -45 154
1475 154 -302 -446 -442 -430 -884 -750 -324 -563 -915 -1177 -801 -841 -1199 -1256 -896 -961 -1210 -1213 -1010 -1120 -1247 -1224 -803
1498 -803 -1091 -1120 -794 -716 -896 -878 -579 -172 10 -91 129 335 141 380 632 907 928 852 1026 1045 1309 1408
1520 1408 1559 1445 1505 1430 1667 2094 1625 1307 1715 1626 1265 1592 1522 1443 1330 1408 1276 1001 1002 982 794 615 214
1543 214 390 707 97 -183 -102 317 -252 -298 -75 -364 -539 -458 -611 -647 -1196 -827 -707 -910 -665 -730 -785 -911
1565 -911 -444 -741 -412 -540 -580 -483 -467 17 -212 -323 26 84 -203 105 36 -210 239 165 67 101 33 -54 595
1588 595 238 217 -44 33 -396 -87 136 -224 -227 -417 41 -453 -206 -410 -296 -617 -207 -365 -297 -694 -684 -372
1610 -372 -354 -652 -353 -497 -590 -386 -27 139 54 -160 113 140 -18 270 345 598 584 530 643 1168 1136 992 996
1633 996 1330 1455 1189 1252 1264 1413 1358 1325 1499 1278 1017 1306 933 938 845 948 869 766 697 521 258 62 112
1656 112 31 -74 -63 -204 -261 -444 -227 -473 -582 -574 -368 -622 -585 -811 -648 -611 -558 -379 -295 -279 -148 -272 -60
1679 -60 -94 170 344 369 145 271 272 482 582 595 817 864 884 893 1211 1094 1103 887 818 943 871 781 1066 926 947
1704 947 740 763 925 769 393 551 664 -27 64 -15 -324 -310 -417 -571 -13 -165 -500 -305 -504 -624 -365
1725 -365 -531 -555 -700 -328 -486 -728 -595 -502 -659 -321 -249 -62 -116 -313 -110 59 -233 21 146 366 357 264
1747 264 369 565 309 115 329 260 335 538 480 432 366 69 284 349 25 222 -150 -142 -28 -118 -161 -116 -436 -505
1771 -505 -614 -196 -328 -670 -403 -512 -539 -686 -513 -198 -535 -646 -449 -462 -603 -304 -475 -182 -369 26 377
1792 377 -208 -107 385 247 134 336 269 645 752 708 677 998 801 610 847 840 454 701 549 736 278 314
1814 314 649 226 377 510 316 321 -132 -116 7 -339 -359 -511 -383 -651 -1062 -1197 -712 -1081 -1094 -986 -1139 -1215
1836 -1215 -1219 -1105 -1471 -1176 -1373 -1548 -1135 -1330 -1204 -1228 -1162 -1329 -921 -441 -877 -657 -763 -631 -480 -454 -329
1857 -329 -312 -356 -619 -10 -176 -146 -71 -99 -235 -16 -436 113 -332 -272 80 -118 -370 -92 -92 -475 -615 -573 -452
1880 -452 -389 -570 -369 -557 -450 -924 -549 -381 -527 -537 -863 -494 -660 -894 -747 -589 -441 -540 -533 -553 -391 -364
1902 -364 -551 7 -38 -381 -142 -66 -2 -18 218 487 406 45 489 287 421 382 648 775 514 283 433 496
1924 496 602 194 280 164 87 351 261 16 -137 3 -174 -376 -343 -384 -176 -649 -638 -514 -596 -709 -777 -794 -996
1947 -996 -916 -1178 -1002 -1082 -1145 -757 -1068 -960 -446 -1005 -683 -716 -589 -977 -393 -359 -534 -494 -157 -169 -503 143
1969 143 27 215 -57 202 278 106 159 150 76 250 282 247 283 312 341 105 362 141 -307 -167 -240 -237 -50 -165
1993 -165 -142 -260 -210 -455 -470 -544 -697 -363 -768 -356 -775 -806 -791 -1021 -539 -694 -633 -626 -537 -501 -857 -413 -638 -748
2017 -748 -130 -282 -85 -316 -182 -16 -67 62 -26 156 227 69 231 -101 554 176 288 327 15 411 -68
2038 -68 -155 25 237 -75 -45 -255 -102 -83 -84 -453 -833 -552 -577 -745 -841 -696 -1122 -901 -1362 -1088 -983 -1176 -1206
2061 -1206 -1356 -1104 -1349 -1255 -1449 -1143 -1749 -1253 -1099 -881 -1060 -950 -870 -1229 -770 -558 -693 -649 -721 -496 -332
2082 -332 -461 -362 -34 -246 -480 -356 -85 -293 -319 -122 -129 -405 -479 -226 -315 -231 -443 -362 -377 -518 -560 -393 -554
2105 -554 -374 -553 -883 -604 -823 -928 -829 -881 -763 -621 -893 -776 -804 -1020 -1060 -617 -740 -1003 -503 -722 -614
2126 -614 -262 -616 -534 -285 -23 -129 177 -167 -32 340 82 284 229 490 310 423 586 839 637 780 980
2147 980 873 525 716 858 636 733 583 597 128 555 442 623 90 231 -10 -271 -115 -13 -17 -460 -73
2168 -73 -347 -322 -316 -753 -534 -487 -955 -567 -478 -730 -820 -682 -890 -674 -650 -644 -599 -821 -523 -407 -256 -344 -261 -84
2192 -84 -269 -387 -137 -249 -268 66 -56 -82 100 196 67 -12 14 134 47 167 89 121 -24 223 -26 -168 -266
2215 -266 -220 -111 2 -186 -501 -86 -250 -618 -305 -145 -517 -202 -144 -170 -274 -562 -128 -420 -139 -19 193
2236 193 194 -99 -149 130 384 291 198 639 892 936 909 920 810 906 1010 1465 1155 1470 1208 1142 1309 1281 1515 1562
2260 1562 1530 1344 1361 1255 1358 1561 1744 1446 1132 1319 997 744 812 1152 898 1164 718 607 897 409 231
2281 231 266 224 272 197 563 483 201 93 369 203 81 11 81 358 47 161 403 382 104 547 546 157 368
2304 368 639 719 373 380 629 653 714 873 549 618 632 337 706 453 730 340 438 225 605 312 214 446 -7
2327 -7 -16 155 93 -147 165 -82 -227 -122 -212 -356 -606 -578 -316 -659 -537 -1028 -699 -531 -910 -387 -494 -609
2349 -609 -674 -284 -831 -692 -648 -693 -448 -38 -104 -252 -146 -23 -98 73 266 210 40 131 441 438 370 578 452
2372 452 445 374 349 628 308 553 689 301 496 348 443 839 351 235 425 519 92 402 87 98 124 281 243
2395 243 270 150 182 245 86 -82 356 307 211 298 373 423 317 420 596 542 849 1028 337 618 460 718 911
2418 911 772 722 1025 798 885 808 838 1075 841 726 1102 696 563 681 900 615 847 628 562 439 457 153
2440 153 360 138 5 0 -50 -180 -222 -55 -209 -587 -628 -569 -392 -447 -316 -326 -541 -464 -647 -755 -791 -822 -892 -435
2464 -435 -675 -637 -465 -388 -472 -458 -236 -95 1 146 -53 78 418 365 603 106 587 328 390 335 798 647 835
2487 835 609 582 816 559 761 701 829 437 568 774 654 532 639 503 585 270 575 631 401 429 303 386
2509 386 670 458 554 568 617 605 510 515 477 625 696 666 514 643 829 962 855 852 820 978 885 962 911 1141 1060 1490
2535 1490 1546 1262 1334 1129 1316 1655 1212 1088 1234 1348 1195 945 1163 1365 988 1060 1157 800 960 678 473
2556 473 585 716 599 385 314 447 205 251 385 -105 21 144 57 -196 35 220 -15 120 -40 119 -33
2577 -33 -134 5 81 378 331 89 206 177 533 289 495 627 678 371 598 678 540 533 606 562 776 455 643
2600 643 435 631 595 406 404 443 756 250 393 184 413 159 259 286 62 114 134 -43 -184 12 -237 -708
2622 -708 -288 -331 -184 -465 -309 -384 -412 -133 -103 -176 62 146 -24 -98 257 65 4 107 133 384 291 279 118 399
2646 399 309 470 435 347 673 430 691 478 630 479 486 282 417 550 91 446 671 430 152 514 -93 18
2668 18 -31 -80 -440 -171 -227 52 -244 -289 -282 -608 -444 -601 -331 -774 -532 -648 -638 -688 -719 -745 -766 -751 -520 -683
2692 -683 -515 -736 -610 -424 -393 -180 -230 -393 -452 -60 -249 -22 10 140 -218 -339 -102 -180 -95 -4 -201 -87
2714 -87 -227 -387 -254 -270 -224 -322 -568 -344 -284 -543 -251 -777 -456 -467 -615 -688 -757 -553 -819 -758 -816 -859 -1172 -1144
2738 -1144 -901 -715 -996 -1010 -999 -891 -620 -730 -695 -493 -343 -417 -523 -683 -181 -234 -341 -209 -494 29 187
2759 187 48 138 354 359 343 79 81 359 364 231 -13 476 504 365 547 573 453 453 357 14 164 432 195 304
2783 304 169 375 211 287 236 11 -174 221 298 -99 -47 -81 73 1 333 -78 -31 240 319 72 -117 167 111
2806 111 343 183 105 242 474 396 390 342 421 558 371 440 298 407 608 195 414 542 515 688 500 590 338
2829 338 417 307 182 317 -166 105 -28 38 38 -118 -222 -387 -184 -328 -324 -601 -706 -831 -628 -615 -828 -714
2851 -714 -669 -330 -778 -992 -825 -862 -740 -787 -428 -440 -771 -650 -590 -548 -374 -310 -161 -129 124 -360 -239 68 -75
2874 -75 -129 -31 366 349 -77 -9 -19 414 2 37 55 311 225 54 205 50 -135 -103 40 194 -83 -232 -29
2897 -29 -91 -164 -580 -31 -182 -135 -193 -59 -307 -211 -203 -257 -532 -438 -475 -142 -451 -443 -480 -312 -347 -293 -89 -28 -102 161
2923 161 142 31 -149 -61 285 51 240 187 505 15 209 96 402 302 285 256 335 106 268 405 173 279
2945 279 211 -22 114 -53 56 83 -341 -190 -420 -322 -228 -316 -493 -415 -657 -452 -721 -412 -262 -561 -409 -129
2967 -129 -479 -460 -324 -462 -237 -484 -485 -556 -406 -48 -298 -111 -143 -390 113 -186 -240 -290 -180 250 -59 58
2989 58 -92 119 -164 93 110 -54 163 42 107 185 61 -3 -5 -354 -294 -4 -276 -228 -381 -479 -555 -402 -788 -501
3013 -501 -880 -589 -530 -986 -990 -777 -653 -838 -878 -811 -1006 -1066 -763 -631 -372 -1058 -740 -619 -498 -558 -355 -394 -387
3036 -387 -420 -598 -534 -244 5 -497 -30 150 -19 -25 196 42 92 385 389 410 52 265 307 412 22 146 320
3059 320 -60 27 132 -27 -150 35 -61 -40 28 -167 -75 -178 -39 -35 94 -81 -245 -115 -149 -107 352 -37 219
3082 219 2 63 -97 176 -256 -107 73 266 208 306 126 341 610 402 354 556 543 398 644 550 498 594 239
3105 239 324 471 282 436 351 143 239 294 338 184 87 53 -23 97 2 -126 -19 -11 -211 -172 -405 -148 -388 -372
3129 -372 -366 -711 -472 -341 -255 -558 -413 -781 -471 -494 -484 -577 -540 -222 -238 -78 -215 -284 -410 -214 -134 -126 -414 578
3153 578 -6 88 -23 449 424 253 317 286 109 330 429 172 640 383 324 340 -203 225 171 -127 42 144 88
3176 88 -209 100 -147 377 126 53 -204 -102 16 -91 124 -243 -58 -13 -285 -128 99 -210 45 -194 -330
3197 -330 171 203 40 227 -39 230 95 200 61 47 -53 80 163 239 284 523 394 367 661 554 411 410 670
3220 670 521 181 299 78 290 325 238 126 112 -105 77 -57 -27 99 -258 -126 -304 -75 -193 -190 -392 -110
3242 -110 -396 -691 -437 -418 -477 -225 -609 -410 -650 -403 -291 -585 -495 -311 -223 -479 -401 -291 -211 -484 -254 -186
3264 -186 -11 -117 -65 -78 71 -19 153 18 114 81 111 21 -40 -99 -195 157 40 -4 -10 -297 -323 -264 -366 -53 -441
3289 -441 -151 -151 -314 -310 -463 -508 -301 -660 -376 -748 -431 -585 -557 -473 -875 -645 -600 -747 -222 -237 -533 -487 -458 -398
3313 -398 -230 -318 -317 -625 -187 -341 -221 -135 -308 102 32 6 -154 225 41 71 88 92 152 207 16 40 414 64
3337 64 -109 14 173 293 -126 98 31 -22 -44 -168 -360 -223 -366 -127 -373 -177 -361 -576 -545 -266 -492 -622
3359 -622 -254 -63 -625 -299 -214 -483 -233 -549 -455 -556 -546 -317 -491 -552 -344 33 -247 -132 -65 -94 -233 36
3381 36 107 65 -169 268 13 1 91 184 205 40 322 138 -61 77 112 -115 1 131 -34 -243 -251 -127 -72 -286
3405 -286 -143 -100 -495 -557 -17 -438 -700 -291 -364 -465 200 -370 -149 -132 -254 -304 -186 -248 -302 -11 47 -33 -218
3428 -218 23 170 -89 -167 -152 304 101 -69 306 64 282 187 443 498 285 112 456 221 567 236 356
3449 356 349 584 214 -30 174 -117 205 14 -242 -88 68 -10 -26 -319 -396 -168 -262 -126 6 -214 -203 -439
3471 -439 -509 -250 -244 -17 -386 -261 -564 -256 -252 -206 -197 -113 -27 55 27 71 -204 -107 96 312 264 17 -196 471 329
3496 329 82 186 585 352 68 469 118 266 210 229 638 -59 112 117 110 396 154 -122 213 188 373 19
3518 19 -99 -100 -175 -189 -195 -61 -106 24 -367 -241 -358 -631 -492 -79 -196 -455 15 -594 -356 -89 -487 -370 -269
3541 -269 -265 -291 -319 -274 -438 -270 -102 -241 -151 114 -49 17 -43 -329 -325 -280 21 -14 -62 93 -321 131 -110 -153 125
3566 125 38 -145 -337 -181 -261 -120 -18 -118 -225 -82 -104 -222 -491 -297 -312 -9 -316 -121 -555 -245 -293 -224
3588 -224 -187 -329 -275 -250 -22 -247 -16 371 226 236 405 460 360 177 541 296 406 643 772 561 681 720
3610 720 728 195 575 292 469 494 646 596 839 500 499 674 489 350 179 257 141 -53 68 190 40 53 -283
3633 -283 -105 -204 108 -231 -18 43 -186 -105 -186 -150 -321 54 -484 -455 -207 -267 -93 -105 -364 -298 -432 -318 -291
3656 -291 -15 -101 -17 0 -105 -18 -82 -56 333 13 -5 -533 17 76 109 202 -108 2 43 100 -187 117 -182 173
3680 173 36 -222 -144 -369 -249 -32 -285 -271 -285 18 -168 -180 -67 -522 -123 -32 -416 -236 -335 -74 -49 -174
3702 -174 -210 -32 -234 73 152 -254 -238 204 172 -285 -4 513 286 344 273 79 447 454 261 479 631 345 478
3725 478 356 318 182 513 405 538 358 363 446 252 159 295 318 -100 67 193 133 186 104 -49 -95 -214 -98
3748 -98 -46 -72 -316 -77 -130 -298 -186 -454 -320 29 -65 -379 -611 -209 -173 -40 -562 -376 -101 -129 -124 66 -176
3771 -176 -12 -65 -21 -12 -361 108 -217 -259 -36 -4 -139 70 53 103 -82 -104 84 -85 87 -95 -89 -146 -210 -164 -108
3796 -108 -194 -66 -368 -267 -438 -339 -43 -237 -396 -306 -277 -500 -817 -341 -568 -426 -452 -443 -488 -351 -357 -403 -357 -300
3820 -300 -389 -405 -376 16 -308 13 106 -76 -32 173 -191 128 175 92 -49 125 219 168 409 223 277 215 -149 131
3844 131 -120 343 157 60 20 -256 -16 84 -227 -362 -83 -148 -33 -312 -160 -107 -291 -332 -304 -198 -319 -415
3866 -415 -414 -407 -604 -344 -435 -415 -241 -451 -337 -541 -420 -444 -567 -74 -145 -190 -291 -15 20 -321 -174 141 -228
3889 -228 -155 47 -98 67 74 207 174 81 225 74 308 76 317 326 270 148 -24 -27 93 129 -329 65 137 -44
3913 -44 -55 -190 -344 -389 -210 -232 -283 99 -186 -348 -156 -152 -246 38 -417 -569 -173 124 -201 -212 54 -217 155
3936 155 -137 84 280 417 90 46 167 150 99 299 210 392 169 109 286 256 188 -71 38 -20 127 394 38
3959 38 121 90 249 19 210 95 -62 -83 -7 -189 29 15 -523 -331 -174 -74 -351 -248 -111 -423 -106 -286
3981 -286 -438 -176 -320 -263 -378 -143 -259 99 -360 -20 138 -30 91 -80 -268 -63 107 360 -22 43 -43
4002 -43 38 11 245 224 -114 340 291 354 70 286 206 272 250 189 32 -63 339 -193 -35 109 49 153 82 -261
4026 -261 -178 -7 -37 15 -222 -212 -121 -213 -240 -106 -263 -397 -132 75 -202 -193 -24 -57 -309 -20 -134 112 -62
4049 -62 -32 115 218 -74 9 20 100 -156 195 330 293 148 315 278 71 469 -14 336 348 496 229 344 285
4072 285 -43 149 81 189 110 15 186 220 -194 -287 -127 -111 -10 77 -262 -281 -287 -422 -135 -39 -193 -208 -346 -360
4096 -360 -408 -328 -24 -475 -211 -2 103 -217 90 -209 -322 387 280 89 -101 -53 165 75 -111 85 433
4117 433 287 284 -6 171 187 142 -100 285 -91 -10 253 180 122 -53 193 258 -41 -53 -24 95 -165 -161 -20 10
4141 10 164 -184 -252 -286 -467 -428 -444 -217 -120 -464 -436 -106 3 -262 -185 -64 69 -199 196 -342 -12 -12 -274
4164 -274 187 81 -18 -85 131 171 410 -75 115 142 104 59 33 168 312 179 158 63 163 371 -45 243 89
4187 89 411 158 80 129 233 164 152 -14 -128 -59 92 -31 21 75 53 25 -338 68 -163 80 -241 -212 -440 -126
4211 -126 -58 -288 -23 -116 116 -356 85 225 -141 43 107 -78 -135 199 218 254 243 421 228 142 182 300 -6
4234 -6 -72 297 281 270 250 289 478 474 348 274 314 149 138 208 42 -7 -63 118 -97 -149 65 -174 -14 -145 -90 -140
4260 -140 -251 -306 123 240 40 103 -190 -123 -3 -258 -413 87 -157 -174 -121 221 -168 166 -167 -77 33 -83
4282 -83 219 111 224 224 246 -45 99 -170 162 346 47 201 256 321 48 204 547 130 129 175 -20 8 -90 197
4306 197 -3 34 -2 104 -319 -299 66 6 45 -143 227 -76 -220 -18 -188 87 -161 -134 -180 -276 -188 -101 -173 191
4330 191 -203 -59 68 -198 187 19 149 317 31 237 171 164 172 170 484 416 235 51 304 162 292 266 397
4353 397 39 180 78 -111 243 174 -184 76 49 -67 -101 59 323 134 8 -378 -271 32 -2 -147 -260
4374 -260 -177 -25 38 -330 -169 -407 -125 -218 82 -161 -402 31 -147 -214 -317 -200 -50 134 80 24 45 88 232
4397 232 274 -35 61 334 -92 -63 7 173 160 134 150 156 14 176 141 48 308 92 99 241 68 55 -60 206 -86
4422 -86 -42 -57 -147 -257 220 -76 -2 -274 -329 -50 -307 -465 -241 -244 117 -136 -62 -110 -206 83 97 78 -145 -85 -341
4447 -341 287 -36 11 -35 21 -61 -60 13 -106 254 361 -41 291 240 277 287 -36 123 213 -38 -112 58 -20 82
4471 82 255 285 162 -221 79 -147 -106 -95 47 -332 -213 -110 -112 -304 -467 -102 -367 -93 -402 -266 -20 -351
4493 -351 -97 -211 -396 -6 50 -355 -167 -226 24 -155 -120 -43 -155 196 186 266 113 18 104 291 135 78 -83
4516 -83 241 243 227 349 155 239 61 -67 120 234 27 -80 -215 -53 -15 237 -175 7 -1 154 101 -193 9
4539 9 -192 -297 -108 -150 -304 -174 -289 -108 -138 -324 -270 51 -305 20 -274 107 54 98 -210 4 -2 79 -105
4562 -105 -80 15 131 344 61 266 35 152 -20 110 78 90 103 100 314 87 228 -8 356 107 -114 188
4584 188 115 -237 128 34 189 30 -58 -79 -398 61 -288 -208 -220 -421 115 -132 -113 -110 -239 -172 -362 -43 -327
4607 -327 -69 -173 -231 -220 -30 -286 -366 -92 -132 140 248 -15 -36 2 91 -213 -98 208 266 -165 146 56 175
4630 175 66 187 103 -41 240 363 192 44 88 202 -94 71 251 110 -101 -55 170 5 -253 -134 -136 -2
4652 -2 -285 -462 84 112 -52 -166 -54 -113 -548 -411 -130 43 -358 -146 -294 -111 -43 -177 -37 -111 228 -97
4674 -97 -112 -16 -36 -103 56 320 126 120 15 -88 225 273 255 218 89 -51 62 15 141 -182 -265 205 -22 -58
4698 -58 5 -237 -109 218 -68 -431 -25 -164 -32 18 -133 -61 -126 154 -97 -92 -351 -364 -480 -275 -146 -60 -284
4721 -284 264 -193 60 56 -40 -109 126 85 113 106 59 88 -2 178 -182 423 328 153 116 72 377 374 160 295 247 442
4747 442 -15 202 213 215 239 96 405 269 261 -63 19 -26 -278 -235 36 179 -141 -440 69 -30 -198 -149 -50 -38
4771 -38 3 -114 72 -58 -108 55 84 -248 -68 -215 -166 -180 -121 -226 152 -71 -96 -85 62 196 260 -66 -67 -289
4795 -289 429 -139 -81 -95 159 237 -11 45 367 -82 -37 -122 -102 -35 -78 29 -27 -57 -282 109 253 -290 -235 -551
4819 -551 -507 59 -25 -165 -207 -173 -345 -187 -62 -62 -296 -300 -204 -175 -48 -89 -53 -26 -204 -117 37 -201 316 55 151
4844 151 174 102 75 304 128 -42 215 320 216 171 207 -159 -16 311 262 187 90 141 247 327 192 -60 268
4867 268 -101 19 85 -150 -197 -189 4 -136 95 -101 235 -52 -222 4 -204 -390 13 -223 -222 -401 -65 -242
4889 -242 -44 -299 -115 -170 -369 173 -81 -262 -417 -93 154 -335 -404 165 -13 -86 18 -81 108 58 -65 175
4911 175 -94 3 134 -350 -17 -63 -224 -51 87 180 -143 -110 -24 -113 185 -257 -188 114 -164 90 169 100 -241
4934 -241 -93 -304 -317 315 -167 -197 -313 2 222 -226 -248 -120 31 -224 -84 -266 -169 -11 78 -446 -173 14
4956 14 45 302 218 135 204 -21 382 61 -20 395 224 -92 61 206 -22 337 260 239 100 6 236 17 -107
4979 -107 144 -5 53 136 -126 28 38 235 148 -209 -224 -193 149 -84 -217 42 -280 -134 -44 -382 -263 -280 -124
5002 -124 68 148 -198 -257 28 -181 -145 20 152 19 -55 69 -66 -59 24 -114 87 105 69 205 303 148 221 20
5026 20 -36 130 227 -108 128 -29 -28 103 61 -28 -150 -101 5 -72 3 -5 -146 91 -63 148 -188 -7 -204 -207 -408
5051 -408 14 -276 -185 -184 -220 -170 -42 -300 -322 -184 -210 -304 165 -50 -188 -11 -86 119 -58 202 254 209 -6 191
5075 191 186 261 157 220 364 203 83 262 238 -70 150 283 91 424 99 328 -222 222 166 231 -63 57
5097 57 173 -40 170 58 79 40 79 -94 -187 123 -451 -52 76 -541 -100 2 -113 83 41 -169 -92 -4 -120
5120 -120 -80 112 -92 18 -182 38 183 -73 40 104 101 150 22 -158 41 258 260 76 213 -91 13 367
5142 367 14 -200 1 114 -197 97 -108 -8 -84 -50 42 -424 -106 -321 349 -116 65 -123 -15 -140 20
5163 20 201 -158 -422 -114 -214 -51 -262 65 -256 -44 -75 -119 89 -365 -24 -23 236 -4 84 115 325 243 -61
5186 -61 -10 444 205 132 208 68 122 116 262 26 113 235 218 319 54 362 155 -57 137 124 -90 131 182 -165
5210 -165 178 -261 245 -95 -382 -190 -326 -90 -178 22 10 -105 -48 -218 -95 -47 -193 -119 -215 -56 -115 234
5232 234 -73 148 0 -39 52 -190 36 85 -33 53 116 199 -181 43 63 206 68 -30 192 89 245 -126 -16
5255 -16 273 95 252 -158 90 -30 125 174 22 -44 -76 86 -157 -135 -60 31 -34 -358 -277 -126 -92 -164 -45 -194
5279 -194 39 -305 -75 -188 3 -250 -77 213 -80 -152 45 108 -207 232 80 253 68 57 -106 251 188
5300 188 -111 -36 123 98 154 42 367 207 100 305 186 192 399 -75 -142 -42 224 226 110 280 214 149 -63
5323 -63 -409 -7 -294 126 69 -43 12 -137 -408 95 113 -62 -86 45 -82 -163 114 96 -24 -109 -216 -75 161
5346 161 -253 -62 -103 66 -33 152 217 -28 51 -110 -173 176 -78 185 115 -132 93 87 -3 192 -170 134 176
5369 176 141 262 229 114 404 -96 -4 -159 -69 215 134 92 -134 -228 -158 -284 -125 -125 -104 -178 -80 -97 29 -138 190
5394 190 -103 16 -133 -174 -17 135 -75 -106 -334 73 255 189 78 -113 -71 78 339 97 -13 186 341
5415 341 183 330 138 135 28 167 135 -52 226 247 91 -171 -146 164 -54 53 -131 -40 -96 -91 101 183 -306
5438 -306 34 -27 57 31 -143 -14 -187 -126 -362 -82 -324 -258 -298 -289 -166 -253 54 -306 -187 -259 -261 34 -96 -76
5462 -76 -371 -66 -138 -39 -109 -324 -103 -113 36 -139 103 -121 36 87 296 150 320 -29 -239 64 64 268 -300
5485 -300 -29 192 -231 -66 153 -150 -195 -350 -114 -198 -78 -10 -39 -243 -290 -220 -272 -222 -354 -276 -191 -198 -178 -353
5509 -353 -175 -329 -162 -302 -174 34 -250 -156 7 -27 136 108 -142 -170 -214 183 -76 60 179 177 20 -7 107
5532 107 -29 29 -41 -71 494 196 -279 356 246 -19 61 -307 35 -152 10 147 -284 133 -82 -13 91 -104
5554 -104 -76 -48 267 112 -20 -74 -314 -294 -174 -183 -373 -276 167 -288 -284 -141 -381 6 271 -20 36 -92 102
5577 102 -65 -194 -44 -197 491 -125 145 85 3 48 236 164 207 -10 5 273 66 34 277 155 294 -341
5599 -341 -104 -338 -130 -213 -371 -175 32 141 11 -181 -234 -489 -195 -157 50 148 -515 107 -68 -199 -194 -132
5621 -132 -211 -446 -402 -135 -352 77 -156 -336 105 -189 -358 -212 4 -60 -144 258 244 -4 298 359 168 197
5643 197 303 -80 -18 153 -282 397 13 15 -47 87 90 137 -32 -47 143 289 244 -26 -118 -243 13 358 116
5666 116 -131 -351 -225 -62 213 -50 -258 16 -160 167 -7 134 -184 -123 29 -124 -160 21 1 -131 -133 -12
5688 -12 336 183 283 54 -106 272 182 374 299 204 110 352 144 15 27 216 229 150 556 7 151 133 -179
5711 -179 102 -13 -3 25 136 178 63 -123 -74 -251 31 -333 -111 -120 -361 -202 -152 -52 2 -217 -151 -19 28
5734 28 47 -106 -325 -48 35 -122 -239 -41 -60 105 -123 -518 8 -294 -218 -100 -46 45 109 -93 294 -9 111
5757 111 30 43 422 -14 194 -80 -377 9 -267 138 6 -162 -10 -98 -40 -286 168 9 48 -6 99 -531
5779 -531 37 -104 -235 -109 -151 -67 -308 89 -71 -132 -169 -189 -166 -11 -254 76 -288 -274 -168 -122 22 166 -193
5802 -193 -155 116 77 189 -46 61 128 68 282 222 352 -51 307 55 -72 39 -8 49 108 41 -23 305 215 -191
5826 -191 147 252 -136 -71 -195 -193 -42 -180 -256 -277 -5 29 -237 216 -361 -412 46 -18 -369 -174 35 -61 -135
5849 -135 -182 -310 -162 -2 26 144 -147 39 -375 49 131 295 -137 -65 345 2 -1 203 72 1 279 -142
5871 -142 231 20 -107 168 -25 70 20 109 -140 53 -67 205 486 -65 -171 59 -167 -230 -144 -184 -74 -277
5893 -277 -89 -54 -153 -241 -308 -226 -239 161 -140 31 -123 -237 4 -200 -451 -243 -88 129 -63 -50 -275 141
5915 141 66 9 -247 48 316 127 56 163 154 28 124 323 147 159 176 162 300 -125 139 131 325 10 -28 -31 154
5940 154 272 245 54 87 35 -112 -231 -278 -223 162 -30 -18 132 -234 96 -47 -13 140 -272 52 125 -22 -61
5963 -61 262 -60 -197 148 72 -198 13 79 -258 73 127 26 146 -226 364 191 129 116 28 565 149 336
5985 336 462 70 -307 58 36 120 29 -325 64 269 -190 -155 197 -272 63 -249 -190 -39 -57 230 -95 -74
6007 -74 -95 -197 -104 -206 -245 -106 -344 34 -142 -351 93 25 -254 -142 3 -194 -4 -217 -165 -198 -259 -8 -78
6030 -78 2 43 -38 238 -228 20 162 -44 46 78 152 58 20 72 236 235 -72 53 -412 -317 25 -10 94 11 18 50
6056 50 -288 -301 -221 -41 -33 -260 -127 57 -164 -155 -87 -86 -63 -354 -340 -97 103 -3 -176 143 -179 69 -15 -144
6080 -144 -133 -105 -118 47 361 -66 -120 97 6 137 -50 298 -79 235 -365 -58 -11 96 239 84 70 316
6102 316 306 53 -131 38 208 84 -1 -214 -287 42 -61 -324 -58 -258 -201 -200 -140 -271 -78 40 -39 -174 -63
6125 -63 -96 -378 -457 31 8 95 -246 -185 -144 -265 -144 107 -118 -325 -8 -10 -42 -159 -178 -52 -157 -95 -69 49
6149 49 85 58 -5 176 108 -86 -57 -129 51 264 179 -24 30 376 -284 62 375 -71 -147 -221 -158 41 56 110 -408
6174 -408 17 -211 148 -4 -336 -31 -72 7 -48 -108 -42 -106 -68 -244 -153 20 73 142 78 -68 -210 169 79 17
6198 17 227 277 -287 78 131 -120 296 71 -13 177 -66 -70 96 -76 184 -82 222 87 266 -163 -300 -98
6220 -98 -17 19 90 141 -58 -37 83 -42 -119 -82 -76 -172 -72 -191 -87 -256 -63 11 -191 -56 -121 -192 73 71 39 63
6246 63 35 34 -108 65 -171 4 121 183 191 -1 -138 23 -153 151 378 133 117 87 178 99 253 -45 161 239
6270 239 -110 100 136 157 247 -220 -58 103 49 -95 -120 -154 -20 -163 -52 -59 -22 12 -157 -52 -176 -82 -100 145
6294 145 -212 -309 -161 -215 -200 -5 -145 78 -45 -258 57 -149 93 -131 -264 -2 -100 -57 175 23 -135 163
6316 163 66 -6 285 83 266 520 39 -183 -2 382 167 -53 56 -10 -8 91 191 28 108 5 -28 -147 236
6339 236 25 152 -241 -276 145 70 -225 89 21 2 70 -76 -108 -101 233 32 -34 -334 168 27 32 100 -23 -23 39
6364 39 310 -68 -26 -123 50 -140 117 4 63 122 2 120 -46 166 -244 -44 51 259 292 148 -30 358
6386 358 158 59 62 -60 -281 -308 9 218 -208 -264 72 -69 -97 22 -47 -173 -48 -150 -215 111 -51 -109 -259
6409 -259 -135 -62 -181 -158 -44 -49 -178 219 32 104 243 132 -77 -167 -105 -244 171 13 222 177 -30 -31 -54 -72
6433 -72 207 -138 56 250 7 40 67 -208 -191 134 68 95 -160 307 15 181 216 -35 44 140 -502 -273 -29
6456 -29 5 -62 187 -179 -94 -64 -38 -46 -151 -4 -35 -140 -274 -22 -61 -10 213 209 79 69 -228 155 -189 109 -142
6481 -142 -161 170 404 39 -235 -69 114 -162 -124 116 -197 93 103 103 88 491 -238 122 130 76 278 -60 -85
6504 -85 -158 -97 -31 -238 -181 -69 -45 -41 -159 -307 -144 222 -197 -235 86 -54 -248 -399 -96 263 -313 -66 7
6527 7 -198 -114 38 173 -125 85 -16 -27 81 -159 -128 70 -145 -70 -17 -127 444 -155 -93 284 100 199 46
6550 46 198 236 -15 335 57 577 83 -102 147 -288 3 -5 -261 55 -128 -60 -74 -257 -117 -189 -163 -237 -99
6573 -99 -36 6 307 -402 -282 -77 -47 33 130 -385 -203 -365 -107 -152 -140 17 -122 58 269 -26 -55 25 -7 -57
6597 -57 207 90 55 349 -94 162 -111 432 -179 130 204 84 -175 -40 99 7 -129 51 -36 14 -404 -32
6619 -32 165 280 73 -9 -20 -150 40 -205 -227 -81 -122 -15 109 -138 29 -51 9 30 -236 -152 37 -275 -260
6642 -260 -49 196 97 -473 -21 143 -69 20 103 88 -108 -2 125 -198 50 80 238 68 249 117 449 57
6664 57 193 207 93 33 323 -168 200 30 -67 -5 7 227 212 82 126 28 -121 -68 -93 86 -266 -26 -147 101
6688 101 -3 119 106 50 154 -53 -188 -142 -39 -49 102 53 -7 -89 3 -54 49 -157 131 113 70 247 21 187
6712 187 102 -128 71 331 -66 -115 186 -245 -245 92 255 -91 54 50 113 -147 -198 172 208 -41 185 -13 -166
6735 -166 131 156 -63 -151 -114 -302 -21 81 -156 -141 175 -88 -474 12 69 4 -160 -164 66 143 127 61 167 97
6759 97 104 -216 -17 16 64 -3 -172 271 64 -81 -137 -166 -213 233 180 290 345 -23 75 193 -59 -124 472 -88
6783 -88 74 -16 96 -144 -185 -33 104 -212 368 18 -369 -118 94 -251 -81 -304 -125 -178 5 -65 -100 32
6805 32 -121 125 -277 101 -223 99 -206 -23 -20 -224 -162 -245 119 -145 -5 -34 -259 -87 -44 -376 -45 311
6827 311 -163 -29 -206 146 83 52 -47 66 -16 36 176 49 -154 3 -105 83 165 -282 -115 -47 -129 13 182
6850 182 -219 -247 -145 -173 -59 -25 -28 -145 -59 -25 -95 -254 91 -106 -229 45 -279 69 184 -248 50 304 -71
6873 -71 56 -160 102 -30 53 63 -283 99 84 -187 235 -314 48 -15 34 193 107 28 -143 19 -63 -12 -9 125
6897 125 186 119 -297 -58 -12 -350 243 -57 89 -221 -234 -94 102 -62 -12 -213 -311 -112 -36 -27 -121 22 -28 -250
6921 -250 197 20 -307 -75 -35 -323 -81 79 -207 158 -163 -134 273 -7 -38 -184 -14 85 -189 153 100 52
6943 52 -59 22 69 194 -329 46 188 35 -30 184 114 -155 159 79 -14 -218 65 -317 103 -68 170 -75
6965 -75 -269 -117 202 132 -117 -81 -298 -212 -86 -215 -351 -215 246 -243 -71 -165 271 -40 226 -145 -223 -107
6987 -107 270 64 200 -146 -243 -27 -127 69 -200 49 179 -148 172 111 78 -109 108 106 56 -301 169 294
7009 294 33 107 108 237 -206 99 -33 -22 -153 -128 -172 50 -90 55 -19 -34 -302 83 -2 60 -130 6 -153
7032 -153 90 -109 -164 -275 -23 29 -308 86 295 -87 -158 11 131 214 107 254 167 -177 42 -94 84 23
7054 23 20 -243 -126 296 35 359 -79 -15 -6 284 -159 -113 -312 -289 -13 -136 -34 113 9 22 247 152 -101
7077 -101 -353 -107 226 -47 -190 -260 -379 -67 -451 -241 34 225 195 18 -129 113 -96 -131 -260 28 -142
7098 -142 80 69 44 193 35 -49 -48 166 -59 -157 10 -231 -31 -27 33 -23 103 136 186 429 111 47 -3 -39 173
7123 173 -259 -65 137 0 10 161 46 180 71 102 -156 30 -321 -370 -183 118 193 -106 -43 -127 -163 76
7145 76 -68 -37 -172 -139 -42 152 0 -48 144 -117 -18 43 143 -220 153 -236 -8 -57 250 124 -86 -86 -143 -74
7169 -74 34 -33 73 144 36 -48 82 105 116 -78 -196 -69 -116 -353 129 222 -253 -124 -89 -322 329 -8 66
7192 66 -106 -83 -269 3 -52 -284 -193 -236 47 136 139 26 152 -66 -116 -33 146 108 -31 182 -139 -113 140 125
7216 125 60 -18 143 216 -107 53 7 297 -41 325 117 214 -37 57 133 -8 23 86 108 134 296 -189 -20 176
7240 176 52 -23 -250 18 -154 78 195 -286 99 10 -395 46 -298 -322 -250 -290 -309 -15 25 -317 -11 21 1
7263 1 -108 -194 -154 -1 165 -35 -175 239 -212 -179 152 135 -68 -40 129 -120 43 71 -119 340 54 -11 118
7286 118 55 -27 -12 200 306 -22 94 49 328 108 -14 -207 39 -192 -166 -236 28 -307 -99 -99 113 70 -137
7309 -137 80 -72 66 -181 -23 -243 149 -44 33 -21 -162 -124 -155 -38 -105 -12 -458 131 184 -80 -50 54 -149
7332 -149 57 192 -136 245 -115 100 472 200 8 240 -161 -57 125 217 -7 25 51 106 166 -291 -30 21
7354 21 -151 -330 -301 -238 256 -48 -278 -30 -133 50 108 -284 -135 48 -132 81 -83 -169 71 -121 8 155
7376 155 126 -118 -82 359 -374 -92 -137 -138 -213 -39 -94 -4 -124 45 100 297 61 41 235 -196 -25 -41 -53 251
7400 251 77 -48 323 91 -9 -3 -127 210 -110 363 -5 -15 413 -70 -70 -56 -157 179 51 163 -26 -436
7422 -436 15 -319 -143 2 161 247 -95 -245 -15 31 -89 -211 37 283 -133 372 -30 -4 -17 39 42 159
7444 159 60 399 215 341 47 -1 39 -3 242 -47 185 -209 -104 -61 280 -134 -193 348 -27 -38 -109 -58 148
7467 148 319 47 -68 66 437 26 -51 -100 -340 -109 -63 -55 -191 -215 -42 -7 -303 -24 121 48 44 -68 -7 -53
7491 -53 213 99 234 117 194 14 -146 139 -179 -108 181 130 315 261 56 69 153 317 126 137 150 -24 302
7514 302 -205 87 -182 -37 -215 -23 -66 219 69 -105 -23 -81 256 -176 -301 101 -152 11 -275 11 4 -256
7536 -256 115 -217 16 -239 -109 248 115 -267 16 -191 -136 -43 -274 -144 70 97 82 -133 199 197 23 55
7558 55 122 166 -518 14 119 333 -114 -144 193 -61 239 -165 147 -29 227 120 81 111 -160 -63 -127 -44 366
7581 366 -154 -194 -276 24 -242 -241 -105 -98 158 173 -115 -109 -102 18 -70 58 -257 31 113 244 103 -156 213 -477
7605 -477 12 55 -47 169 -191 -172 -187 55 -77 -137 -102 62 107 -177 237 161 299 78 113 -74 14 -2 353
7628 353 138 103 -1 40 52 -233 -116 111 132 110 -4 -367 -4 -87 186 -162 -186 -121 99 25 65 -174 -105 124
7652 124 -29 -204 31 -148 -84 124 28 16 129 -189 173 207 -131 -105 -58 -211 212 15 36 -21 105 58 111
7675 111 181 176 526 66 25 201 -19 184 0 -87 -9 -16 -37 3 -103 248 14 38 -75 -96 97 2 172 -240
7699 -240 -222 -30 65 -182 -346 -32 15 -77 -269 219 43 -48 -63 -148 173 62 55 -242 187 -114 109 -23 310
7722 310 -70 -142 146 -207 168 366 57 136 148 77 -106 268 -249 -13 1 39 -231 129 83 78 -108 -144 -164 -25
7746 -25 148 191 -26 331 356 -149 264 -182 35 -91 -167 13 90 -85 -150 -258 108 -183 -281 18 -199 79
7768 79 29 -131 -124 85 -63 -132 331 141 -36 121 -93 168 21 -161 83 -117 -77 102 34 95 -163 152 34
7791 34 202 235 -10 114 89 346 164 58 16 73 -90 134 309 -167 108 -92 -10 -172 58 -179 22 -216
7813 -216 34 48 -347 -262 182 57 -259 -238 -100 -95 -299 -113 -310 171 -170 54 -94 79 145 92 11 -79 -33
7836 -33 229 169 75 2 -109 53 -57 -252 102 56 -141 -25 81 118 -211 256 -167 -65 -149 35 51 40 83
7859 83 264 -89 -16 90 111 15 -117 -2 74 -260 -161 21 -478 215 -320 288 23 141 -121 130 -73 95
7881 95 65 162 -103 -90 91 83 90 -95 -78 269 -102 328 -154 -68 16 181 121 -108 267 161 -7 -328 -70 233
7905 233 -11 -244 396 -214 215 230 -23 279 -24 150 144 -71 -125 93 95 127 46 -73 -150 -355 -163 -3 -350
7928 -350 93 278 -291 67 -26 259 -79 339 28 163 -43 -221 7 -40 -90 -99 -37 -161 -29 101 78 -126
7950 -126 6 153 17 -186 -142 -218 487 -133 -374 -42 324 -178 -26 21 -124 87 -164 -99 -20 378 -81 244
7972 244 35 133 -205 -130 -116 16 -286 26 161 -138 -280 -29 138 -160 -390 -46 -338 130 -191 76 -243
7993 -243 -138 -91 142 1 -136 -200 79 151 -5 473 233 60 -146 60 -110 248 204 212 -8 -5 -130 -65 155
8016 155 250 186 123 -115 -117 84 -54 -89 -237 -66 264 1 -44 -166 32 126 -3 -135 -88 121 165 -176 -167 -56
8040 -56 -258 -24 108 -295 170 116 73 26 157 225 197 -253 -166 239 -58 -19 300 -74 -155 -288 99 -57 126
8063 126 -29 -5 -2 -138 -16 236 246 161 135 -164 172 45 99 124 473 -8 125 -235 84 175 3 119 -278
8086 -278 68 -306 -304 -344 0 -97 -270 -27 197 -114 -111 -16 -363 -273 12 -20 130 -237 -126 109 -107 -168 -148 89
8110 89 -56 79 89 173 113 -81 148 -160 -147 46 45 44 -145 34 70 268 -86 -64 289 -62 151 -127 55 -356
8134 -356 -174 102 238 48 -193 92 87 88 223 -8 121 48 -15 -49 11 -29 -350 -262 43 20 85 79 -8 225 6
8159 6 -100 -34 22 -55 -31 -180 75 67 201 156 69 61 -34 182 -167 79 -257 -70 125 -298 -43 -126 -23 16 15 -155
8185 -155 196 25 -249 204 48 163
8191A63
$$ Imaginary data points
##PAGE= N=2
##DATA TABLE= (X++(I..I)), XYDATA
0 0 0 0 0 0 0 0 0 0 0 0 0 0 -7 8 -8 8 -8 8 -14 16 -16 18 -23 24 -31 33 -39 45 -49 56 -64 72 -81 90 -100 110
36 110 -124 139 -152 168 -187 207 -230 254 -281 312 -347 387 -433 487 -550 625 -719 837 -994
55 -994 1213 -1532 2058 -3071 5749 -26122 -76078 -40176 -30655 -54627 -73141 -51946 -45741 -65906
69 -65906 -77987 -62021 -56518 -68978 -77961 -71018 -67736 -71566 -75364 -74826 -72966 -69182 -70121 -75296 -75637
84 -75637 -66389 -63577 -70702 -71781 -61377 -57341 -64783 -66820 -56927 -49609 -53650 -58753 -52685 -42339 -42144
99 -42144 -50026 -46439 -33275 -30271 -40765 -40431 -25309 -19907 -30611 -32083 -16595 -11203 -22703 -24304
113 -24304 -9190 -3509 -13507 -14517 -2529 776 -6202 -5035 2650 3858 1933 4190 6509 5357
127 5357 7885 11400 9479 7171 13332 17049 10625 7873 16279 20570 11981 8493 16957 20648 11999
142 11999 8379 16384 19523 11705 7628 13181 15600 10187 6149 8299 11568 8216 2030 1652 5343
157 5343 4075 -1409 -3839 -1315 -1971 -7025 -10167 -7851 -7521 -11838 -15784 -15193 -14895 -17456 -20230 -21102
173 -21102 -21355 -21153 -23280 -27327 -28021 -24282 -24375 -30350 -31660 -26113 -26152 -32672 -33284 -26393 -25260 -32336 -32839
190 -32839 -25751 -24651 -30107 -30421 -23470 -22557 -27169 -26825 -21910 -19997 -22210 -21544 -18832 -17111 -17370 -17021
206 -17021 -16130 -13823 -11653 -11562 -12381 -11492 -8395 -7094 -8794 -8434 -4879 -4190 -6403 -6815 -2629 -887 -3317
223 -3317 -4414 -972 408 -1979 -3065 -487 2078 522 -2366 -576 2832 1335 -922 429 3018
238 3018 2158 -453 635 3215 2437 1436 1712 2999 2498 2184 2398 3255 3429 3420 3531 3152 3227 3901 4157
257 4157 3048 3156 5270 4931 2629 3172 5626 4879 2191 2460 4887 4491 1481 1427 4219 3491 890
274 890 792 2798 1969 -814 -621 1184 450 -1612 -1796 -994 -1709 -3107 -2826 -2181 -2786 -3274 -3963 -4022 -4527
293 -4527 -3731 -3514 -4294 -4928 -4247 -3025 -4717 -5421 -3548 -2238 -4183 -4917 -2885 -1347 -2751 -3627 -1747
310 -1747 194 -1520 -2727 -629 1588 -64 -1322 604 2155 740 -224 1623 2526 1482 1005 1547
326 1547 2003 1150 1063 2010 1829 751 1192 1409 325 49 819 1144 -665 -1336 -426 -94 -2290 -2407 -635
345 -635 -1091 -3186 -3600 -1309 -1258 -4017 -4042 -1715 -1539 -4059 -4337 -1748 -1798 -3615 -3538 -1322 -1887 -3101 -2288
364 -2288 -879 -1160 -2534 -1431 -467 -558 -1288 -371 581 11 -452 466 1082 147 76 1960 1167 -255 265
383 265 1517 1031 -228 328 1099 390 -1239 -568 408 -714 -2015 -1302 -384 -1747 -3198 -2187 -768
400 -768 -2677 -4189 -2781 -1985 -3589 -4442 -3256 -2566 -3680 -4200 -3410 -2766 -4205 -4200 -2537 -2690 -3705 -3353
418 -3353 -1742 -2037 -3258 -2205 -1016 -1260 -2121 -559 223 -996 -1279 135 1066 -97 -230 1152 1571
435 1571 115 -163 1846 2125 922 683 1816 1951 574 756 1563 1549 354 256 865 762 -451 -238
453 -238 1187 64 -1187 -855 -38 -678 -1546 -672 -367 -1255 -1620 -634 -326 -1545 -1591 70 243 -1153 -940
472 -940 921 1020 -353 181 1780 1894 957 1741 3155 2905 1966 3172 4658 4107 3400 4632 5605 5227
490 5227 4745 5932 6647 5659 5409 6487 6929 6321 6012 7105 7001 6101 6129 7057 6779 5837 6066 6765 6497
509 6497 5466 5921 6186 5740 5057 5909 6024 4967 4842 5726 6235 5330 4721 5876 5897 5182 4928 6221 6320
528 6320 5572 5655 6676 6939 6363 6307 7569 7498 6580 7250 8499 8325 7282 8040 8466 8741 7735 8458 8980
547 8980 8572 7972 8496 8809 8049 7675 8439 8431 7376 7016 7571 7470 6241 5953 6435 6049 5292 4706 5364 4907
567 4907 3742 3652 4258 3543 2200 2636 3119 2647 1718 2246 2341 1292 1104 1912 1818 1123 1154 1695 1824 1104
587 1104 1455 2035 1725 1553 1866 2575 2358 2055 3031 3781 3110 2557 3856 3977 3668 3616 4517 4503 4233 4070
607 4070 4785 4918 4475 4073 4198 4795 3949 4034 4588 4274 3539 3831 3814 3523 2838 3320 3176 2754 2375 2413 2412 2147
629 2147 1594 1494 2117 1259 1006 1739 1830 853 417 1375 1545 596 1115 1640 1668 1014 1256 2235 2064 985
649 985 1455 2628 2096 1271 2422 3059 2267 1562 2429 3117 2285 1709 3205 3368 1864 1750 2551 2463 1410
668 1410 1475 2186 1841 642 953 1355 744 -91 382 704 -580 -975 -841 -595 -1454 -1594 -973 -1603 -2081 -2356
688 -2356 -2013 -1871 -2485 -2578 -2013 -2189 -2688 -2791 -1955 -1377 -2230 -2317 -1659 -1657 -1791 -1446 -772 -312 -952 -1111 154
709 154 0 -342 -25 977 1051 -1 283 1379 1072 261 1490 1714 898 471 1343 1731 482 278 855
728 855 867 -227 -226 334 176 -781 -648 -279 -1025 -1973 -1494 -722 -2146 -2464 -1566 -1592 -2738 -3000 -2258 -2487 -2935
749 -2935 -3129 -2728 -2845 -3479 -3282 -2515 -2960 -3443 -2910 -2680 -2912 -3124 -2377 -2045 -2428 -2467 -2033 -1848 -1610 -1408
769 -1408 -1119 -1188 -1297 -1389 -895 -596 -1010 -880 -598 -381 -868 -1091 -598 -66 -546 -862 -372 -272 -842 -997 -96
790 -96 -135 -1077 -926 -407 -450 -1428 -937 167 -909 -1322 -389 -118 -1110 -894 268 598 -229 -294 1008 1042 369
811 369 658 1863 2027 1407 1791 3251 2616 2680 3230 4158 3921 3575 4283 4961 4710 4706 5633 5827 5326 5272 6048
832 6048 6269 6068 6006 6151 6253 6112 6321 6289 6601 5717 5555 5738 5755 5163 4907 5315 5212 4266 4019 4555 4163
853 4163 3560 3316 3742 3275 2760 2821 3104 2511 1877 2679 2685 2190 1306 2038 2512 2046 1770 2481 2490 2213 1878 2595
875 2595 2397 1924 2034 2712 2532 1966 2377 3188 2642 2140 2844 3239 2655 2380 2736 2933 2292 2352 2671 2547
895 2547 1616 1623 2420 1976 1406 1500 1591 1359 653 630 1069 612 259 422 133 -15 -325 98 130 -124 -363 -624
917 -624 -402 -402 -526 -184 -425 -483 -504 -279 203 25 398 659 300 63 712 1194 1287 1044 1315 1824 1773 1502
939 1502 2079 2397 2295 1779 2247 2887 2076 1909 2704 3029 2282 1957 2427 2221 2492 1988 2154 2072 1693 1474
959 1474 2176 1492 1026 1421 1470 929 363 590 696 379 284 281 279 -308 -424 22 36 -510 -182 -32 -345 -378 -265
982 -265 280 403 -11 249 574 534 463 579 1197 989 441 1178 1247 1056 1313 1731 1708 1622 1681 1715 1922 1769 1446
1005 1446 1984 1682 1256 1164 1570 1296 1022 739 1013 967 334 553 124 233 -172 -202 -205 -746 -786 -803 -760 -1026
1027 -1026 -1304 -957 -819 -1250 -1455 -1036 -881 -1394 -1686 -937 -827 -1325 -1184 -870 -667 -915 -804 -200 -170 -497
1047 -497 -331 292 60 -46 445 911 274 120 832 819 518 691 958 906 373 759 816 607 633 108 257
1068 257 521 -183 90 170 -335 -373 -315 165 -423 -751 -826 -640 -824 -1171 -968 -1065 -1306 -1638 -1251 -1188 -1192 -985 -1180
1091 -1180 -1158 -1169 -1443 -940 -822 -835 -1128 -557 -237 -552 -464 63 138 -174 -26 527 417 475 822 1001 783 855
1113 855 1081 1181 851 522 1526 1341 819 652 1438 981 593 586 1048 743 224 80 431 449 25 -29 364
1134 364 -212 -833 -387 -225 -554 -811 -629 -609 -622 -864 -489 -595 -842 -1028 -634 -487 -531 -919 -296 7 -329
1155 -329 -298 159 527 467 348 677 827 427 862 1130 1251 777 996 1246 1491 898 1413 1743 1446 1282 1491
1176 1491 1735 1055 957 1413 1195 458 572 890 914 103 276 484 32 -341 -484 -72 -573 -642 -693 -879 -1321
1197 -1321 -1399 -816 -1358 -1381 -1331 -1831 -1602 -1773 -1439 -1756 -1217 -1480 -1554 -1343 -1294 -1174 -1377 -1081 -1083 -1398 -1291 -883
1219 -883 -765 -730 -932 -758 -502 -707 -627 -485 -624 -802 -637 -84 -472 -678 -500 -447 -743 -966 -541 -714 -1119
1240 -1119 -795 -986 -839 -1309 -1539 -1312 -1591 -1837 -1765 -1704 -1841 -2132 -1709 -1759 -2140 -1966 -1776 -1727 -1800 -1544 -1453 -1387
1262 -1387 -1279 -1300 -1245 -1221 -1110 -979 -643 -881 -734 -541 -50 -369 24 372 218 571 585 879 739 897 905 1245
1284 1245 1250 1173 957 1241 1321 1136 999 1032 1037 790 651 573 529 403 479 169 285 -195 -386 -240 -518 -440 -864
1307 -864 -714 -975 -1497 -1346 -1088 -1363 -1804 -1579 -1383 -1826 -1794 -1560 -1639 -1636 -2083 -1107 -1330 -1877 -1577 -1120 -1212 -1233
1329 -1233 -1237 -846 -872 -1213 -663 -512 -941 -535 -120 -596 -580 -579 -135 -280 -427 -147 -551 -219 -110 -471 -252 -221
1351 -221 -449 -283 -619 -357 -704 -576 -698 -806 -674 -857 -1013 -759 -908 -1174 -986 -938 -725 -1115 -703 -331
1371 -331 -1019 -728 -411 -593 -597 -97 98 16 77 240 712 528 578 943 982 959 1102 1355 1472 1430 1486 1807 1660
1394 1660 1788 1867 2088 1890 1714 2028 1887 1344 1588 1719 1767 1380 1067 1475 1106 1032 728 1063 412 233 507
1415 507 217 80 -77 118 -628 -612 -624 -870 -753 -893 -1068 -1305 -1229 -1398 -1247 -985 -1345 -1326 -1505 -1100 -1361
1436 -1361 -1490 -1712 -1041 -1065 -1206 -757 -933 -461 -519 -696 -499 -437 -641 -490 -204 -311 -417 12 265 -88 -179
1457 -179 313 355 193 -165 69 113 -271 -245 123 102 -376 -449 -40 -289 -598 -610 -192 -347 -774 -514 -306 -275
1479 -275 -554 -298 -165 -280 -588 -327 -238 -144 -178 242 249 114 318 452 528 186 602 871 1016 963 1253 1287 1140
1502 1140 1509 1552 1513 1699 1567 1594 1668 1826 1572 1641 1676 1632 1555 1475 1655 1316 1306 1508 955 1134 698 613 876
1525 876 564 116 375 101 -8 -330 -128 -576 -733 -618 -946 -719 -1084 -983 -1180 -1200 -1240 -1445 -1183 -1381 -1544
1546 -1544 -1126 -971 -1126 -1295 -1142 -1078 -952 -771 -635 -818 -516 -374 -69 -149 -412 65 -68 14 87 515 450
1567 450 301 325 168 467 183 579 664 439 734 365 492 429 465 237 342 635 20 150 253 236 103 35
1589 35 84 -162 -100 164 -114 -313 -221 -60 -142 -117 37 160 51 -102 50 363 622 170 370 723 408 292
1611 292 836 811 1060 879 964 1088 1004 916 1034 1157 1300 1070 1334 1365 1281 1056 1142 1037 791 603 798 1057
1633 1057 465 705 641 405 259 228 -102 -193 -161 -396 -117 -598 -742 -756 18 -805 -982 -719 -1127 -1090 -1222 -771
1655 -771 -589 -791 -1214 -701 -825 -818 -651 -512 -411 -386 -162 16 -283 -73 -64 372 14 316 452 524 218 428
1677 428 690 557 512 751 623 623 540 336 739 805 756 524 530 650 427 4 196 212 -323 -159 300 -95 -160
1700 -160 -111 -379 -848 -395 -640 -770 -1014 -762 -741 -810 -1220 -1041 -531 -1021 -966 -1010 -698 -644 -932 -754 -763 -679 -723
1723 -723 -500 -561 -230 -248 -361 71 -394 -73 80 355 111 -34 112 253 112 430 591 277 222 287 269 204
1745 204 -172 47 225 90 -263 65 78 -242 -406 -626 -453 -750 -366 -898 -694 -491 -566 -926 -434 -688 -898
1766 -898 -527 -461 -719 -597 -450 -362 -505 -373 -504 -214 -85 -16 -138 -190 -93 -22 225 328 405 280 643 373
1788 373 64 395 696 322 547 561 603 791 525 501 332 103 318 184 -122 28 -228 203 -216 -726 -753
1809 -753 -843 -774 -910 -601 -739 -1216 -1207 -926 -1242 -870 -1121 -1399 -1185 -1209 -1490 -1195 -1185 -1288 -1346 -1320 -1260 -1022 -979
1832 -979 -1123 -651 -545 -576 -550 -755 -406 -465 -190 -96 -124 -328 208 166 262 566 675 358 360 678 759 298 516
1855 516 578 938 398 396 760 509 -22 213 377 519 351 -126 304 -75 -58 -40 6 -252 -251 -387 -151 -57 -454
1878 -454 -282 -170 -406 -135 -178 -94 -344 -231 -71 181 -160 -124 41 109 85 -46 260 47 369 503 680 309
1900 309 464 456 926 777 741 756 627 637 415 639 572 388 360 710 283 56 -105 256 147 -172 -346 19
1922 19 30 -197 -446 -645 -379 -785 -611 -532 -632 -661 -745 -818 -1150 -786 -797 -860 -933 -1024 -516 -741 -867 -663 -583 -665
1946 -665 -559 -490 -239 -432 -392 -224 192 119 451 135 56 -10 137 59 526 326 356 302 723 581 492 413 271
1969 271 262 371 350 522 198 -121 225 -15 -142 -571 -144 -314 -370 -265 -191 109 -775 -539 -578 -804 -489 -1011
1991 -1011 -323 -580 -982 -708 -389 -547 -472 -524 -775 -680 -243 -367 -324 -467 -603 -283 -276 -314 59 -101 33 91
2013 91 91 247 -161 263 171 50 322 260 83 -127 255 -55 221 -142 134 -192 -130 -208 11 -406 -279 -465
2035 -465 -776 -747 -554 -882 -591 -1019 -1066 -796 -880 -989 -1068 -902 -895 -1202 -1143 -834 -1024 -1081 -862 -862 -818 -818 -848 -708 -569
2060 -569 -322 -284 -385 -421 -78 -366 28 -350 444 109 -90 141 211 -59 49 431 426 225 263 309 399 299 432
2083 432 565 196 81 331 327 106 309 167 520 39 139 -18 -329 -309 37 27 -2 -255 -62 -124 -5 -125
2105 -125 -303 -205 -352 -84 110 166 -58 289 438 312 297 482 147 484 655 552 706 465 945 804 900
2126 900 997 1289 1144 867 970 1103 852 887 1044 1192 1104 743 1135 906 366 700 665 512 491 532 412 155
2148 155 -58 148 -212 -222 -343 -424 -321 -504 -287 -419 -464 -772 -634 -685 -443 -484 -461 -637 -519 -596 -399 -705
2170 -705 -353 -427 -249 -266 -90 -127 -182 -221 169 160 218 83 540 308 426 665 356 581 453 549 431 765 805
2193 805 672 672 614 733 632 451 638 474 306 464 299 693 610 273 354 151 199 224 223 120 294 437 451
2216 451 441 267 363 496 367 492 243 428 265 317 556 809 653 773 1009 906 948 972 1269 1041 1093 1184
2238 1184 1388 1074 1253 1320 1298 1315 1398 1017 1162 1457 1078 1080 1158 930 1213 961 858 927 731 603 542 461 771
2261 771 324 -50 -10 -106 -135 -23 -8 -284 -433 -283 -604 -449 -352 -494 -541 -797 -411 -355 -746 -535 -600 -619 -570
2284 -570 -683 -625 -882 -437 -133 -139 -704 -343 -60 -417 -17 228 -268 -37 75 -136 -181 -78 -44 -117 -42 -411
2306 -411 -292 86 -261 -321 -113 -300 -343 -571 -683 -418 -436 -703 -770 -508 -660 -794 -1053 -844 -982 -833 -740 -759
2328 -759 -708 -704 -850 -954 -960 -850 -721 -746 -640 -680 -457 -458 -347 -574 -222 203 -310 -256 296 295 113 274 369 202
2352 202 396 453 734 919 306 579 652 737 695 778 1004 424 638 701 755 645 792 660 634 410 426 476 544 408
2376 408 223 71 171 -54 549 357 20 176 123 -108 38 -96 31 -154 -76 161 117 40 204 31 79 305
2398 305 490 152 275 591 527 336 427 304 309 452 565 480 480 436 530 415 400 440 303 432 181 240 357 -96
2422 -96 152 99 152 -194 -259 138 -223 -451 -583 -361 -467 -415 -689 -329 -435 -415 -727 -539 -797 -551 -480 -833
2444 -833 -802 -612 -667 -268 -713 -204 -315 -457 -113 -306 -410 -133 100 208 -46 181 410 377 528 611 688 751
2466 751 611 452 1156 811 802 931 895 836 1307 1071 760 880 853 842 1020 994 942 797 678 764 804 679 791
2489 791 739 621 721 473 518 736 317 587 461 272 339 499 497 332 385 385 573 70 589 761 676 514 400
2512 400 448 391 257 490 884 661 866 431 755 671 614 741 702 577 627 787 897 526 437 843 753 536 181
2535 181 416 286 -50 388 192 -26 0 -247 -21 -216 -327 -493 -328 -656 -593 -461 -521 -425 -900 -614 -714
2556 -714 -704 -712 -783 -566 -654 -661 -573 -608 -609 -437 -92 -81 -488 -455 -208 -340 -273 -186 -73 -12 77 94 290 144 -68 94
2582 94 123 -9 67 304 124 138 158 268 268 -23 73 -88 29 -6 -229 -229 -361 -148 -435 -250 -114 -387 -475 -514
2606 -514 -685 -474 -344 -300 -664 -716 -613 -566 -782 -936 -578 -476 -571 -501 -390 -305 -593 -29 -41 -229 -313 -158 58
2629 58 67 77 103 -49 129 40 -92 -300 321 175 207 233 -114 -93 -275 -11 124 -56 -52 -202 -178 -71 -491 -163
2653 -163 -306 -365 -455 -537 -765 -711 -800 -594 -735 -956 -616 -814 -725 -889 -803 -964 -1091 -1134 -858 -712 -833 -709 -1099
2676 -1099 -854 -892 -792 -729 -532 -777 -574 -701 -524 -493 -327 -576 -581 -580 -332 -659 -336 -357 -142 119 98 -349 -57
2699 -57 -171 -109 -634 -295 -276 -484 -136 -87 -188 -180 -244 -365 -227 -371 -413 -414 -541 -432 -607 -403 -419 -524 -234 -968
2723 -968 -674 -557 -671 -726 -517 -447 -414 -548 -310 -283 -134 -436 -149 99 -105 164 315 52 281 94 635
2744 635 354 622 328 239 702 512 712 815 489 518 728 357 843 403 645 474 950 546 560 441 369
2765 369 260 455 262 35 307 131 263 -89 -70 -12 -11 94 -404 -126 -266 -237 -352 -519 78 -464 -322 -180
2787 -180 -219 -542 -351 97 -233 -382 255 -114 43 24 -18 1 -129 60 31 291 17 94 306 307 131 -57 236
2810 236 -57 -27 67 -175 -62 -255 -139 -50 -290 -62 -581 -197 -291 -577 -647 -307 -665 -901 -586 -847 -789 -846
2832 -846 -631 -852 -1017 -1180 -803 -664 -923 -941 -738 -820 -834 -804 -574 -930 -915 -546 -516 -645 -453 -29 -166 -248
2854 -248 112 151 153 41 227 141 262 507 169 241 270 306 379 395 298 464 462 490 174 603 350 212 279 126 -113
2879 -113 211 217 280 115 107 -77 -82 46 50 -171 -233 -216 -219 -137 -427 -389 -248 -278 -486 -187 -44 -323 -158 -129 24 -336
2905 -336 -238 116 169 -93 -100 -32 45 382 311 292 223 230 293 146 294 163 480 699 600 244 217 373 97 10 162
2930 162 32 289 338 52 350 52 185 -231 264 149 -33 -194 -210 -297 -689 -205 -385 -74 -422 -460 -237
2951 -237 -278 -301 -493 -277 -183 -587 -77 -162 -278 -254 134 -111 -119 -212 16 -67 430 9 125 83 65 260 187 299
2975 299 203 197 585 377 15 309 288 200 615 288 196 443 92 -37 170 85 170 -9 -132 -11 -116 -293 -258
2998 -258 -188 -178 -263 -260 -126 -218 -363 -179 -281 -166 -161 -282 -179 -314 -462 -163 127 -385 -227 281 -106 102 25
3021 25 102 124 340 94 560 532 408 547 509 751 758 571 460 610 797 659 429 701 1008 643 666 925 526
3044 526 420 699 630 387 479 544 437 374 342 484 704 131 -64 290 171 87 177 309 432 54 311 220 211
3067 211 -199 250 183 -91 -1 344 130 -132 320 -191 316 432 548 489 160 445 284 406 264 365 482
3088 482 402 450 550 387 476 206 316 149 268 182 242 128 -95 -39 -12 280 -208 -233 -498 -459 -62 -529 -580
3111 -580 -292 -276 -291 -504 -802 -399 -556 -739 -510 -701 -655 -374 -630 -397 -407 -187 -170 -367 -565 -167 -154 -218
3133 -218 -137 8 -193 19 -44 398 110 366 52 234 236 399 415 448 407 619 349 341 616 345 579 411 682
3156 682 67 133 240 17 84 331 239 37 72 170 257 70 -8 -231 401 170 -92 -317 -191 -57 -426 -121
3178 -121 -80 -180 -209 -257 -98 -295 -202 -243 -309 -420 -45 -65 -17 -136 -195 19 133 -275 269 169 385 286 236 309
3202 309 -4 346 275 -7 137 -67 80 59 154 126 27 269 289 13 134 -149 -21 -136 -369 -146 -297 -431
3224 -431 -323 -382 -475 -175 -195 -572 -453 -353 -360 -855 -414 -513 -681 -414 -429 -485 -667 -190 -271 -330 -27 -229 -226 -499
3248 -499 118 -451 10 -55 -56 189 82 104 225 217 32 239 326 -145 215 3 166 277 127 65 154 290 61
3271 61 238 -85 19 55 27 -187 -140 -171 -158 -280 -124 -118 -550 -168 -128 -339 -440 12 -82 -586 -236 -324 -192 -162
3295 -162 -328 87 21 254 198 30 219 279 208 152 342 376 611 392 569 499 487 570 620 503 546 627 625 495 644
3320 644 699 600 605 586 325 355 653 414 503 574 134 322 401 434 446 75 273 58 -79 280 -114 328 6 123
3344 123 91 -235 12 55 -80 -172 -14 -169 -45 -363 -16 42 -11 73 -90 179 198 199 133 221 125 193 450 344
3368 344 252 492 407 400 349 665 299 398 496 386 524 246 414 248 218 405 634 327 88 285 145 328 150
3391 150 52 -34 45 -142 179 120 -25 -253 -131 171 -193 45 130 129 -199 -129 -212 -66 -236 23 32 289 179 166
3415 166 -64 0 161 164 151 314 216 178 523 48 558 543 450 560 123 334 392 624 139 382 61 586 531
3438 531 334 347 304 193 252 484 48 -99 28 -115 -532 -12 -342 -121 -165 -295 -370 -379 -93 -432 -318 -63
3460 -63 -264 -183 -70 -194 -268 -175 -164 -365 -3 -101 -269 -151 -89 1 39 -98 288 -125 320 192 184 410 257 48
3484 48 122 304 374 272 122 135 358 63 404 398 384 -7 67 30 44 -12 -27 14 -111 -102 -388 -274 -249 -276 -382 -31
3510 -31 -326 -495 -447 -391 -429 -784 -293 -431 -456 -229 -426 -327 -435 -458 -207 -310 -362 -477 -309 -374 -148 8 -34
3533 -34 -17 -103 16 -59 60 -266 47 215 -58 -34 284 212 -21 161 -18 195 240 -125 -1 45 -27 38 190
3556 190 227 -99 20 72 -80 88 23 -17 91 -47 -148 39 -41 -142 156 -76 -20 155 -40 106 -151 170
3578 170 250 243 141 -104 592 237 505 259 251 431 823 358 566 477 295 446 665 709 571 731 426 575
3600 575 171 454 215 338 345 226 410 199 79 220 31 24 210 59 336 133 -272 -118 -161 -364 -293 -66
3622 -66 -387 -46 -243 -527 -409 -636 -356 -289 -438 -733 -247 -238 -306 -416 -549 -720 -516 -474 -158 -412 -279 -683
3644 -683 -474 -240 -92 -128 48 -66 -172 79 72 -99 159 68 84 -16 -97 74 -326 -218 287 -85 -190 52
3666 52 19 72 -248 -74 -32 159 109 -49 27 -165 -494 -146 3 -198 -365 -274 -252 -142 -175 -98 -271 -260 206 -140
3690 -140 -42 -325 -51 151 25 25 318 116 107 0 295 19 -41 487 425 224 89 325 406 453 171 152 281
3713 281 410 193 198 435 96 30 183 210 168 112 -58 3 247 -340 52 -4 -259 127 -197 -122 -399 -318 -517
3736 -517 -271 -381 -497 -218 -424 -204 -285 -695 -484 -884 -499 -648 -603 -909 -246 -531 -583 -80 -397 -307 -244 -297
3758 -297 -281 -249 -171 351 22 -48 -98 -45 109 -174 -28 37 -47 6 64 -25 -323 -47 -225 -314 180 171 -84 -268 -146
3783 -146 -269 -278 -350 -155 -386 -399 -63 -64 -309 -508 -508 -336 -250 -721 -519 -325 -349 -247 -256 -192 -240 -122 -309 -206 -418
3808 -418 34 -106 -106 -380 64 211 237 229 -20 3 107 -231 117 279 -10 80 -247 379 -24 56 389 195 -97
3831 -97 20 273 233 -137 -121 -331 46 64 -81 -447 -109 -218 24 -68 7 -344 -369 -239 -227 -346 -489 -379 -153
3854 -153 -470 -711 -313 -587 -363 -597 -232 -415 -415 -268 -200 -503 -229 -15 -189 17 -166 -322 26 407 155
3875 155 267 142 -41 78 354 265 197 -110 -81 297 123 285 73 14 249 198 553 316 161 138 46 5 -463
3898 -463 107 115 -39 147 -182 11 -95 -186 114 96 -60 -272 -303 -172 -164 -123 -167 -115 -178 73 -55 -209 -116 387
3922 387 -148 24 -204 -6 64 4 129 159 116 238 297 25 64 35 242 125 -36 170 -62 184 70 271
3944 271 105 -235 261 -23 -1 7 -113 -33 44 -298 -160 0 -281 -82 -302 -246 -316 -406 -323 -355 -57 -370 -380 -428
3968 -428 -334 -369 -489 -224 -617 -330 1 -122 -184 -149 -28 -189 -13 -23 -152 357 153 37 179 -127 407 287
3990 287 -122 202 200 191 383 258 185 190 212 476 293 244 468 196 317 134 -20 180 359 25 462 51 33
4013 33 142 -44 137 -50 -138 -280 -414 -93 -42 -7 -200 -346 145 -108 -66 37 88 158 43 -62 -287 61
4035 61 -96 -14 -222 -357 296 204 55 -14 -54 126 -121 332 254 138 188 256 522 305 257 333 89 115 -148 91
4059 91 34 224 -62 -13 -135 123 -7 12 -31 -96 -53 -117 -384 41 -226 -243 30 -517 -249 -272 -285 -197 -317 -363
4083 -363 -109 -351 -270 -36 -22 -262 40 -19 22 -41 -8 -4 -137 55 -59 -104 37 -92 -131 227 198 172 122 392
4107 392 40 23 108 176 396 59 228 208 10 -85 -26 185 20 -170 -100 -250 -74 -268 -90 -11 -401 -98 -131
4130 -131 -372 -255 -167 -223 -387 -283 -240 -139 -132 -300 34 -454 -271 -260 -501 27 -232 -263 78 -173 303 180
4152 180 8 98 -244 50 129 -36 170 264 239 268 206 234 98 335 127 277 174 66 216 204 -87 102 -49
4175 -49 346 184 182 -83 -176 8 -418 -337 135 -11 -274 -70 -370 -126 -372 -242 -224 -299 -599 -18 -145 -207 232
4198 232 -484 -119 -222 -133 204 -75 -62 -20 -7 -345 -27 107 144 -50 113 220 20 -204 91 365 199 239
4220 239 232 232 287 -88 170 81 107 264 40 -131 190 167 236 46 165 -230 -208 -140 11 -251 -150 -127 -353 -43
4244 -43 -331 -123 -538 -139 -331 -315 -406 -358 -162 -389 -145 -169 -15 -236 -233 -260 -79 111 107 96 -37 45 -125 185
4268 185 -34 -13 131 -8 432 22 264 177 254 166 46 73 -194 101 10 229 79 514 171 200 50 -101
4290 -101 222 138 16 194 -118 -274 172 195 -374 -97 114 -68 -165 -565 -484 -464 242 -132 -344 -67 -28 -105
4312 -105 50 -148 -236 -226 -19 -39 -114 -121 80 75 -143 9 136 56 45 111 167 157 419 194 156 252 174 47 215
4337 215 164 53 137 -23 -18 60 4 375 125 13 165 2 77 200 105 -270 -409 207 -244 -420 -1 -364 -11
4360 -11 -168 -132 -129 -465 -86 -153 -134 -325 -304 207 -70 -180 -43 -236 -94 47 -95 -94 34 77 -110 258 83
4383 83 170 7 77 82 53 137 191 280 180 289 37 -4 -89 -20 94 440 158 -54 187 255 114 0 140 -165
4407 -165 -301 16 289 164 -206 104 -124 -414 -357 -100 0 -187 -182 104 -117 -383 -124 -106 -284 -186 188 -128
4429 -128 57 1 -374 188 164 82 30 128 -47 190 257 228 156 512 386 77 109 298 82 58 -31 33 -5 24 440
4454 440 114 4 250 169 119 100 224 69 -147 -182 -160 -5 -303 -253 -30 -353 -226 -158 2 -108 -374 48
4476 48 -303 -144 -79 135 -206 44 33 284 50 14 -208 82 -271 -96 11 108 159 -202 151 0 64 145 85
4499 85 131 228 212 228 -199 -128 3 322 270 394 -126 48 141 131 -60 320 183 -134 -134 -29 19 -174 -181 54 69
4524 69 -276 -96 75 -71 0 -324 -183 -176 -12 -144 -156 -116 -106 -292 -35 -96 -90 243 -56 65 -110 -278 298
4547 298 -83 108 122 82 374 287 252 51 105 263 90 203 239 416 41 210 298 260 88 261 177 52 210
4570 210 -55 -164 -236 -265 27 -282 -19 -129 76 31 -227 -148 -164 -212 -229 -213 -134 -455 -208 -57 -373 25 -332
4593 -332 -220 -254 95 313 6 -160 100 -210 -96 100 279 -96 181 258 124 -91 260 326 254 -54 -32 139
4615 139 197 656 289 -40 2 119 189 247 165 288 19 5 454 38 126 63 -278 37 22 61 -18 -115 116 -19
4639 -19 -282 100 -128 -158 181 109 -176 -378 -167 -308 -145 20 7 -449 -324 -283 132 -128 -103 -330 -128 241
4661 241 -196 12 60 144 41 110 133 288 65 286 18 111 346 -40 -210 195 146 194 373 43 272 289 79
4684 79 368 49 -42 -103 -126 -143 -130 237 193 -115 -95 -288 -323 -260 -310 -58 -169 -180 115 -114 -583 -129 -270 -413
4708 -413 78 -158 -141 144 -35 58 83 143 -5 378 305 85 -19 274 102 308 288 477 527 90 307 308 348
4731 348 -57 490 337 141 30 425 322 151 242 299 3 -26 -63 -40 -255 -61 118 -140 207 -208 -446 -131
4753 -131 -317 -480 216 -248 -83 -507 -271 63 -39 -199 -123 57 -39 -228 -126 21 33 -93 -89 -191 7 -191
4775 -191 240 -39 -129 -191 73 56 -14 200 -147 -5 388 0 -41 -22 -7 313 131 118 347 17 136 -182 123
4798 123 -16 290 172 -88 -92 -16 57 -73 -125 -169 -329 -163 198 -174 -255 152 -61 -201 -26 -78 -212 -136 -290
4821 -290 -212 -17 165 49 217 181 -43 68 119 143 264 231 342 113 361 147 189 618 206 91 -18 233
4843 233 -23 192 32 124 77 167 -30 65 -294 314 -48 3 -47 -60 -10 -28 39 -142 -3 -66 -300 -125 -161 -378
4867 -378 -341 -115 -340 -235 -308 -444 -37 -313 -538 -404 125 131 41 -375 -83 238 -279 -197 -203 -254 -99 -28 -36 219
4891 219 132 96 217 -140 171 311 13 -29 136 -135 -176 62 329 415 91 166 -88 70 40 109 107 -61 -282
4914 -282 428 -126 -184 123 -334 -59 -154 -59 -246 -255 39 -114 -102 -396 -445 -286 -72 -121 149 113 -75 191 -80
4937 -80 207 -248 -167 186 257 -154 -75 105 248 240 132 -8 324 147 252 376 325 184 95 196 187 287 274 315
4961 315 239 -94 34 54 51 -231 -116 131 -80 145 193 -148 -43 -252 70 -174 -361 -89 -226 -2 20 -128
4983 -128 -230 -6 -230 -66 -132 147 -90 -96 -218 139 -138 -72 191 -150 -166 169 -89 84 117 38 344 149
5005 149 236 141 -37 133 154 324 26 386 57 442 123 205 -124 219 -172 70 174 40 78 -109 -120 -278
5027 -278 -129 -120 220 -387 -160 -152 -34 -414 -154 -80 58 -271 26 97 -48 -43 -124 -346 -200 -221 -206 177 82 40
5051 40 -23 -24 130 280 216 -10 88 126 -66 84 220 403 117 32 42 -314 61 323 104 -64 79 198 15
5074 15 181 -50 20 -243 83 152 152 -2 -156 209 91 -120 -153 73 -354 25 205 -15 -170 62 -380 -135
5096 -135 -198 -103 -185 -324 -60 -121 -181 -196 135 -78 -116 -164 -162 -70 -49 79 -6 -153 -185 62 -36 -158 -454 -78 17
5121 17 35 268 35 33 -3 4 201 -17 -217 141 110 94 66 -334 -30 70 -295 -198 64 77 -127 138 53 -463
5145 -463 11 -340 -300 -75 -182 -105 -182 -256 10 -44 -192 -216 66 -257 -226 -215 -252 216 44 -295 124 -147 155
5168 155 122 124 208 513 88 283 138 208 216 242 -127 -62 -3 133 401 273 238 125 188 -5 158 34 -71 -5
5192 -5 -20 -91 -13 -46 -274 -201 -289 -143 73 -200 -85 -144 -95 -137 -315 -106 -63 -183 -83 -46 -22 -317 -182 65 -353
5217 -353 -153 -207 61 -15 88 -133 -231 46 -108 -84 -109 33 -104 -95 215 241 158 293 28 -46 332 198 130 302
5241 302 -400 -89 -19 86 105 304 123 -50 63 7 279 -341 -294 -55 85 -123 -39 -71 -6 172 -30 -193
5263 -193 -85 -87 -162 -269 -69 152 -225 -164 -178 14 -2 25 -295 -30 -312 -86 111 390 -153 102 95 187 173 174
5287 174 -111 47 201 237 466 54 17 161 -33 -245 294 47 32 -40 145 65 -412 -25 92 -181 -65 -237
5309 -237 -56 -82 120 1 -142 -203 -247 -370 -254 -174 -221 -216 -199 -253 -271 -101 49 17 -262 -472 -461 20 -229 -9
5333 -9 -328 -55 -135 -214 77 45 -64 -85 308 -229 -129 131 166 -107 21 -214 50 -109 168 -38 84 83 -33
5356 -33 -47 -3 135 38 -106 -102 -6 265 -5 89 121 83 93 -360 -342 94 -280 -372 -73 -266 -157 -247 -272 -136 -294
5381 -294 -292 -411 -90 -82 -293 -210 -223 -160 45 -2 10 -8 -101 -100 106 -83 11 165 241 178 100 145 11 -109 399 75
5407 75 504 50 211 231 -210 62 -146 14 -36 69 120 214 165 76 -172 164 -287 -13 121 -152 -405 -136
5429 -136 60 -240 33 -92 -141 -54 18 -310 44 -333 -336 -149 -262 -276 -228 -126 15 52 -136 -26 -223 -42 66
5452 66 -161 285 8 188 42 -31 8 -100 2 334 80 46 -56 155 53 -63 -2 -31 -98 28 -122 2
5474 2 147 -116 -192 258 -26 284 -240 -250 -235 -274 -190 -15 -113 -97 240 -329 -347 -14 -286 -218 -31 270 23 -347
5498 -347 -8 -76 217 -216 64 81 -212 117 328 56 4 259 -31 -137 208 173 112 45 162 -23 291 422
5520 422 0 264 184 224 181 144 290 216 355 474 152 170 -113 26 355 -60 -144 71 -203 0 6 -271 7
5543 7 -278 -213 67 -70 -196 -115 73 97 -104 40 -42 -162 -54 146 139 85 -222 14 333 -28 77 1 338
5566 338 -44 74 16 305 -184 50 -33 -103 163 -91 314 308 -123 153 83 -110 142 5 -71 227 -182 -108 56
5589 56 146 29 268 105 135 136 -227 25 96 -200 -243 1 -280 -126 271 -72 -232 82 -85 -97 -51 32 -213
5612 -213 -16 128 130 -43 -33 -33 61 197 72 346 218 57 225 64 407 289 193 420 130 188 155 79 215
5635 215 321 255 77 282 -36 59 177 290 235 152 253 98 347 129 82 33 -96 -256 -104 -51 -292 -11
5657 -11 -177 -19 -171 -200 -60 54 -148 247 4 26 -124 -225 155 -1 11 -56 175 100 -40 -111 -38 136 237
5680 237 23 94 291 286 139 381 424 137 241 138 105 120 144 4 118 225 51 -150 -15 -210 -253 -86 -33
5703 -33 138 -101 36 -104 81 109 -201 -175 -281 -498 -151 -119 -42 37 -320 -225 -224 -172 -192 -303 -139 -165 171 -194
5727 -194 -41 78 214 -194 -65 76 57 -17 -92 -262 236 28 117 426 52 -231 -38 149 11 25 312 4
5749 4 204 209 239 150 51 280 165 62 56 83 -149 148 278 262 164 -58 44 -140 148 201 -152 -20 367 -30
5773 -30 60 -324 172 -148 -380 -11 303 217 -31 248 62 -161 -1 232 26 137 -105 -64 -44 109 274 369
5795 369 438 76 264 315 209 197 243 296 -48 255 -88 150 118 12 92 154 103 -54 -9 -8 253 -398 -148 -339
5819 -339 -219 170 13 -164 -130 -465 -327 11 -134 -164 -8 -40 -3 -290 17 -313 -108 39 283 -92 -153 212
5841 212 18 52 33 415 -158 222 -22 99 326 259 130 186 63 24 312 -11 -156 354 160 -151 239 -131
5863 -131 117 -119 115 312 69 -33 71 189 -45 239 150 -228 165 -72 -118 -67 32 -232 4 -5 -216 -222 -123
5886 -123 -66 86 22 -119 -27 -147 27 130 -360 -29 -132 190 335 282 126 120 95 -6 47 212 74 508 160
5909 160 26 169 2 241 222 157 34 94 152 -224 204 203 227 23 164 -104 79 92 -41 38 87 -126 120
5932 120 -229 129 -123 -231 116 -289 -270 -6 -389 -169 -127 -608 -149 67 259 -27 -159 -99 -49 8 -188 -163
5954 -163 138 -321 -165 29 -325 21 118 -186 375 -201 -89 -192 -66 342 -288 182 -150 -126 62 38 -189
5975 -189 87 -71 -66 81 -291 -153 -224 178 77 169 28 337 -181 -214 -9 -361 -62 71 -90 21 -258 -140
5997 -140 -147 -152 -137 -265 -229 -158 391 -78 -252 29 -423 -29 -8 -48 -84 -229 48 -162 86 249 378 5 121
6020 121 191 -99 53 85 454 271 79 205 148 169 313 -77 -184 60 196 -10 185 -278 -279 58 -287 198
6042 198 50 15 128 -315 92 46 -53 -14 4 212 -95 -76 -258 -161 310 -175 57 282 191 43 -242 0 195
6065 195 -23 -95 -36 15 -141 98 362 0 -111 266 -12 -9 -13 24 300 -43 -31 6 47 196 261 11 53 279
6089 279 -35 104 -223 174 46 25 387 31 66 149 -72 -109 -91 -147 -212 91 -237 274 72 129 -207 -314 -171
6112 -171 -191 -185 -96 -109 4 119 -312 -45 -235 -67 37 -155 -382 -111 52 -327 -70 100 371 -47 354 147
6134 147 0 230 -31 -48 69 119 112 107 124 -98 -75 270 16 80 72 39 -119 0 175 -13 -42 -29 -205 -36 288
6159 288 -168 253 78 -283 4 -211 -237 -168 72 -163 -120 156 -216 -43 -13 128 -200 -220 -273 -452 75 -92
6181 -92 -41 -178 -38 13 95 -75 -69 -62 50 420 -53 29 -159 22 98 213 -342 37 -12 -45 -145 165 -4 44
6205 44 -57 -127 -91 -2 304 -101 -100 -137 58 -331 16 98 -81 -130 2 -333 92 -202 -169 76 -51 -281 20
6228 20 -56 334 109 -112 184 -260 63 -196 -31 201 182 -17 275 -149 -51 112 172 15 316 -164 7 -194
6250 -194 135 129 -26 37 -4 57 171 377 142 -96 -261 217 -21 125 127 -159 233 -138 -66 -115 -183 -241 -126 111
6274 111 -201 -239 -100 -111 -119 -28 -77 -125 65 -201 200 -33 -99 -442 20 61 -193 166 29 105 166 13 125 -142
6298 -142 -22 142 -42 56 -88 -139 161 -34 84 145 134 495 -125 40 -16 86 96 -82 241 185 327 101
6320 101 95 -98 -39 175 -65 -213 -103 10 -246 -46 44 -62 -371 -28 -455 134 234 -220 -87 -295 -350 -241
6342 -241 -228 -98 -74 -7 36 -83 -20 -167 -131 -88 95 -74 -36 -154 -66 -2 107 139 -112 7 111 -182 53 241
6366 241 14 -36 -5 181 476 72 222 -53 -62 -16 113 182 -99 -311 229 7 -158 -27 -406 161 -161 89
6388 89 -112 -125 -160 -169 -114 -112 -255 -254 91 -60 63 174 -139 44 164 98 -216 91 293 -120 141 -97 0 128
6412 128 293 -260 55 332 348 -70 308 145 58 52 186 -7 -80 -136 163 188 155 59 202 79 -2 -286 188
6435 188 139 -122 -156 3 127 109 -39 -70 -27 -92 102 -136 62 -155 -70 -102 21 15 379 -36 -55 -147 -206 -206 -129
6460 -129 -148 41 49 -86 168 -206 190 -87 -57 61 -47 105 233 4 69 285 85 110 -182 276 90 -57
6482 -57 78 228 -186 91 -1 -6 160 -76 44 25 38 241 -309 -29 -53 -34 -47 -176 -230 -103 -83 141 -15 10
6506 10 -203 -244 9 40 69 263 353 124 -249 4 -231 -91 -224 174 9 -176 -76 -52 -42 384 91 -149
6528 -149 170 74 -168 191 151 -16 220 102 268 102 65 -199 34 83 100 -81 264 133 102 46 -66 -18 348
6551 348 92 -410 265 -7 23 30 -94 3 -161 -431 -81 -66 -5 -198 -194 -83 -43 -146 -152 -294 -90 -208 -126 -224
6575 -224 -94 -70 131 104 -61 111 -165 -15 345 159 -277 165 72 363 145 -161 76 -35 -233 -76 37
6596 37 117 -174 -16 -223 103 98 -45 42 -8 18 -177 -27 -51 -208 -97 -276 -310 -326 -164 -42 -23 -386 -248 -89
6620 -89 -235 -17 -192 -220 124 -265 146 176 -113 99 -286 84 -69 -284 315 14 18 296 161 95 -170 208
6642 208 235 143 -160 218 30 109 261 416 158 -45 -12 -59 -42 34 32 144 79 -27 104 -87 -90 320 -129 -144
6666 -144 -49 -141 324 57 -108 224 47 -128 -252 -355 45 -20 108 -136 16 -376 -13 -46 -61 118 10 -142
6688 -142 -166 151 -334 -79 -178 64 215 261 -207 51 154 -26 121 -78 -29 117 -16 88 -16 7 165 370
6710 370 33 88 34 18 309 -200 -112 -231 19 171 -49 105 -88 -212 -293 215 -49 76 59 14 322 49
6732 49 -100 -314 -372 -319 145 127 76 -26 -239 219 246 149 -24 178 418 53 -74 37 424 302 128 161 180
6755 180 328 -30 28 29 174 8 248 250 79 233 257 123 227 276 153 -196 152 166 19 148 13 140 -164
6778 -164 217 229 -81 -380 -181 26 -96 -74 -200 -132 -5 -90 149 -37 -17 290 -29 -90 -80 -20 281 -37 167
6801 167 12 223 213 239 169 -203 373 38 -17 -31 312 234 120 269 270 340 -113 140 -119 191 91 6 309
6824 309 245 18 -242 126 -149 114 45 -63 201 -265 -174 -31 32 196 5 44 -142 -257 -177 -399 -23 88
6846 88 -288 13 -75 45 -173 -280 -34 -21 188 37 246 -53 -3 61 37 252 133 4 -95 106 166 -115 261
6869 261 189 -214 -78 325 -113 154 -26 112 124 69 271 -111 214 86 -337 467 85 211 -281 71 -389
6890 -389 -191 -101 66 42 -9 44 -80 128 -72 -95 -292 351 -265 -15 -30 -259 -71 -325 99 -311 -52 252
6912 252 32 -55 121 -34 -177 285 69 76 -29 246 143 177 212 349 244 293 329 214 172 129 286 32 62
6935 62 -7 167 166 288 99 -24 -61 108 51 -68 -107 -104 140 -154 92 -73 -332 -78 -236 -354 60 -224 -179
6958 -179 -205 85 14 -32 -5 45 104 -74 -89 -224 -118 -4 -335 -67 19 26 204 -156 -33 99 -14 237 124
6981 124 334 -26 26 305 122 126 460 87 -126 371 -18 -171 38 52 -124 27 19 10 -62 -252 4 -109 -102 -91
7005 -91 -302 136 -29 -200 65 100 -91 415 -179 -187 145 76 -86 -149 74 -64 61 -68 86 -85 -26 -7 121
7028 121 211 117 88 372 -109 202 -125 85 91 155 130 167 -111 -62 83 419 302 169 85 138 171 -137 104 159
7052 159 255 -160 138 7 -115 32 -275 -18 213 -44 -14 95 155 -251 -202 75 -312 19 33 -267 -56 -184
7074 -184 -102 -266 107 -34 -32 26 209 82 1 -217 -234 40 -56 252 254 33 -51 -17 174 154 196 -3 154 -43
7098 -43 15 94 -28 311 162 227 439 148 178 393 59 47 -4 -259 34 179 -235 -29 294 -251 -147 -150 -31
7121 -31 120 -2 310 32 -66 -131 -258 8 124 226 -322 -254 -147 4 -144 133 -159 153 -40 50 73 -54
7143 -54 -92 40 172 277 213 176 -55 348 3 28 199 153 2 87 -22 210 -67 80 164 115 93 -52 -125 79
7167 79 11 123 -349 64 92 217 -152 -115 235 67 -15 240 73 -134 110 36 -300 169 -274 32 -41 -65 -173
7190 -173 33 -151 296 115 -236 67 100 -120 -17 330 -163 -101 -84 -17 -40 187 127 176 21 248 47 229
7212 229 -191 213 -109 265 354 134 28 -109 118 84 172 236 26 102 -69 -39 -90 -16 -10 125 196 136 -13 -34
7236 -34 184 -3 99 -68 -50 52 -119 97 -50 -16 242 -135 -112 92 -21 -294 -243 -257 112 -95 -162 325
7258 325 104 80 168 59 336 163 -130 194 109 148 -89 -166 167 151 79 181 425 -351 75 -345 -131 -103 104
7281 104 145 123 488 -271 147 67 -39 116 -320 -188 76 9 -296 -45 23 -215 -19 -40 -61 -100 -125 184 84
7304 84 -166 140 37 140 136 88 -239 368 317 -126 -1 -78 -209 7 267 305 61 98 -199 67 -84 228 233
7327 233 -66 82 95 22 -129 113 -75 143 148 -76 354 -40 -195 62 -240 162 -121 90 -228 168 -169
7348 -169 -203 370 -149 -80 -64 -170 -186 221 -47 217 -85 11 -156 43 118 -49 -38 -275 182 307 241 -14 110
7371 110 78 240 -59 183 116 -112 22 374 93 210 278 -58 -255 89 -248 198 14 81 192 -174 -8
7392 -8 334 -346 245 -77 107 2 173 161 -277 122 -126 96 -142 -108 -108 -40 -82 16 -69 9 -184 -251 -143 100
7416 100 43 -191 -170 88 81 141 61 -311 -118 377 -30 138 -78 408 133 -69 41 -92 203 55 -9 228
7438 228 -178 271 -110 23 -127 69 61 273 -149 -30 -70 46 302 52 48 -121 -59 -147 -152 -205 256 -156 47
7461 47 7 96 86 87 -104 -84 -110 -361 -72 -26 173 -124 -138 -128 42 34 219 -161 -61 -176 4 -85 33 197 47
7486 47 211 17 269 -43 202 -74 100 -151 10 327 252 63 205 105 159 95 -206 76 -267 -12 13 -93
7508 -93 69 87 -99 -207 -45 60 -114 32 52 -285 -26 -139 -158 -14 -176 -58 29 19 -4 127 -100 -163 -116
7531 -116 -23 -151 -221 -90 48 -217 32 -199 122 54 54 118 27 220 -1 114 35 170 58 118 296 116 -147
7554 -147 7 -51 129 198 162 -106 131 75 114 -14 122 173 -277 22 29 -133 171 -7 -54 -158 -281 104 -58
7577 -58 -131 93 -11 196 -166 -96 -245 -109 -115 -90 -159 139 54 -84 -157 174 100 -168 -340 -70 140 98 222 -62
7601 -62 80 45 130 24 216 101 152 74 -49 127 -284 -5 -213 -20 19 200 -118 307 -90 296 193 37
7623 37 -105 -107 -224 -105 -217 -144 -69 60 -86 -202 55 58 -157 -18 -183 -122 14 42 100 -217 -197 -188 101 -118
7647 -118 178 10 39 -173 120 200 184 124 218 90 -97 181 -1 -108 -249 193 302 162 -22 88 -84 86
7669 86 -9 172 144 38 121 -66 -101 -267 19 102 -192 -187 131 -207 340 -18 -232 78 -80 271 35 30 27 -108
7693 -108 -36 -87 -270 24 -251 -195 -126 172 -47 -279 109 2 76 -58 34 25 -144 -236 -200 -11 266 45 248
7716 248 35 3 288 154 66 229 125 -114 79 189 -77 -46 33 -265 -201 196 304 -43 -56 -407 -152 41
7738 41 -294 253 -36 24 25 -35 2 -171 -170 58 19 -138 -68 -367 -164 -131 -96 -115 112 -34 -135 -209 289 231 -124
7763 -124 -94 112 51 -143 -10 59 -2 -83 115 -174 -44 -73 -79 -73 201 65 122 -29 222 29 -94 28 53 240
7787 240 243 -133 -130 -319 -39 108 49 -4 325 99 -94 62 -54 -220 74 -68 -84 -93 -23 -67 131 137 -65 58
7811 58 -93 83 -275 152 248 -322 -193 -172 -444 245 24 305 99 129 113 7 140 217 -282 82 -91 290
7833 290 272 35 123 123 295 -54 -65 89 -212 -5 42 -261 89 -25 -143 -117 116 -265 -120 -27 67 124 131 56
7857 56 288 105 16 -264 -238 -111 75 -60 81 59 -147 -73 -193 42 -167 34 -59 -64 75 105 -8 -9 -292 298
7881 298 7 -140 82 227 -296 96 16 97 -33 70 129 -73 133 211 157 76 410 -106 -26 195 170 190 296
7904 296 -44 137 -319 -63 305 92 -26 -55 -67 -128 -161 173 58 -9 55 -88 -365 18 -61 -75 40 270 -65
7927 -65 -16 204 -7 224 -33 153 2 -90 -125 51 92 16 192 78 -36 -231 -145 -89 -263 77 -130 53 95
7950 95 -1 -110 -21 -217 -102 165 -61 -2 -147 86 164 -180 -114 -109 160 -189 159 147 -211 -173 -2 -192 -313
7973 -313 84 -106 166 -211 -101 -32 -187 253 17 131 266 14 83 128 -136 329 233 91 70 -88 -75 35
7995 35 -74 291 37 97 279 -105 66 27 6 29 190 29 -78 -410 128 106 -275 50 -62 176 -47 -250
8017 -250 -86 -6 9 -112 60 -27 -454 19 -9 20 -109 -323 69 184 22 -17 12 199 -39 -177 85 28 -74
8040 -74 111 -134 -72 -136 -153 152 -388 78 180 -306 -27 123 -165 370 160 52 90 65 -222 248 -410 126
8062 126 141 -47 298 171 19 122 -4 -273 -275 -67 19 185 313 -84 41 129 -34 -169 -262 -5 -205 53
8084 53 45 -154 -172 -232 -100 210 53 -143 -113 19 -19 123 -194 -37 -111 -20 -169 -12 -60 -128 284 -91 -31 -116
8108 -116 202 -143 92 -50 154 -135 215 121 -165 -12 257 -176 13 -99 72 284 -47 -88 -162 93 136
8129 136 99 56 -190 -36 -26 -28 157 189 -31 -78 74 322 -268 70 88 -110 -107 -196 -233 -63 130 -3 -110 -113 -296
8154 -296 -124 265 204 102 149 81 34 -194 -11 172 -352 -198 51 31 9 -231 113 217 289 91 49 -47 51
8177 51 -187 373 184 -118 226 89 -126 -45 92 -344 170 71 -2 -52
8191e2
##END NTUPLES=NMR FID
##END=
