##TITLE=1H_SA_PPhvCl(H2O)Cl
 CDCl3, 8 sc, 
 20.9.2019
##JCAMPDX= 6.0         $$ Bruker NMR JCAMP-DX V2.0
##DATA TYPE= NMR FID
##DATA CLASS= NTUPLES
##ORIGIN= UXNMR, Bruker Analytische Messtechnik GmbH
##OWNER= root
$$ XWIN-NMR		Version 3.5
$$ Fri Sep 20 14:25:57 2019 Russian Standard Time (UT+4h)  she@DPX200
##.OBSERVE FREQUENCY= 200.1315
##.OBSERVE NUCLEUS= ^1H
##.DELAY= (6, 6)
##.ACQUISITION MODE= SIMULTANEOUS
##.ACQUISITION SCHEME= undefined
##.AVERAGES= 8
##.DIGITISER RES= 18
##SPECTROMETER/DATA SYSTEM= spect
##.PULSE SEQUENCE= zg30
##.SOLVENT NAME= CDCl3
##.SHIFT REFERENCE= (INTERNAL, CDCl3, 0, 15.7039)
##AUDIT TRAIL= $$ (NUMBER, WHEN, WHO, WHERE, WHAT)
$$ ##TITLE= Audit trail, XWIN-NMR		Version 3.5
$$ ##JCAMPDX= 5.01
$$ ##ORIGIN= Bruker BioSpin GmbH
$$ ##OWNER= she
$$ F:/spectra/data/she/nmr/H-F/1/audita.txt
$$ ##AUDIT TRAIL=  $$ (NUMBER, WHEN, WHO, WHERE, WHAT)
(   1,<2019-09-20 14:24:41.21 +0400>,<she>,<DPX200>,
      <created by zg, POWCHK disabled, PULCHK disabled
       configuration hash MD5:
       00 E9 B6 7A A2 85 ED C7 34 08 36 98 17 FE 4E 26
       data hash MD5: 16K
       DF 2E 57 B1 7C 90 3D 1B 1B 3F C2 2A 5D 76 92 20>)
$$ ##END=
$$ 
$$ hash MD5
$$ AA 61 E3 0A 0B 2F 26 99 5E 09 B5 D7 8C 2C 82 03
##$RELAX= 
##$RELAX= 
##$RELAX= 
##$RELAX= 
##$RELAX= 
##$RELAX= 
$$ Bruker specific parameters
$$ --------------------------
##$DU= <F:/spectra>
##$EXPNO= 1
##$NAME= <H-F>
##$PROCNO= 1
##$TYPE= <nmr>
##$USER= <she>
##$AMP= (0..31)
100 100 100 100 100 100 100 100 100 100 100 100 100 100 100 100 100 100 
100 100 100 100 100 100 100 100 100 100 100 100 100 100 
##$AQSEQ= 0
##$AQ_mod= 1
##$AUNM= <au_zg>
##$AUTOPOS= <>
##$BF1= 200.13
##$BF2= 200.13
##$BF3= 200.13
##$BF4= 200.13
##$BF5= 200.13
##$BF6= 200.13
##$BF7= 200.13
##$BF8= 200.13
##$BYTORDA= 1
##$CFDGTYP= 0
##$CFRGTYP= 5
##$CHEMSTR= <none>
##$CNST= (0..31)
1 1 145 1 1 1 1 1 1 1 1 1 1 1 1 1 1 1 1 1 1 1 1 1 1 1 1 1 1 1 1 1 
##$CPDPRG= <>
##$CPDPRG1= <>
##$CPDPRG2= <>
##$CPDPRG3= <>
##$CPDPRG4= <mlev>
##$CPDPRG5= <mlev>
##$CPDPRG6= <mlev>
##$CPDPRG7= <mlev>
##$CPDPRG8= <mlev>
##$CPDPRGB= <>
##$CPDPRGT= <>
##$D= (0..31)
0 1.2 0 0 0 0 0 0 0 0.06 0 0.03 0 0 0 0 0.0002 0 0 0 0 0 0 0 0 0 0 0 0 
0 0 0 
##$DATE= 1568975080
##$DBL= (0..7)
120 120 120 120 120 120 120 120 
##$DBP= (0..7)
150 150 150 150 150 150 150 150 
##$DBP07= 0
##$DBPNAM0= <>
##$DBPNAM1= <>
##$DBPNAM2= <>
##$DBPNAM3= <>
##$DBPNAM4= <>
##$DBPNAM5= <>
##$DBPNAM6= <>
##$DBPNAM7= <>
##$DBPOAL= (0..7)
0.5 0.5 0.5 0.5 0.5 0.5 0.5 0.5 
##$DBPOFFS= (0..7)
0 0 0 0 0 0 0 0 
##$DE= 6
##$DECBNUC= <off>
##$DECIM= 24
##$DECNUC= <off>
##$DECSTAT= 4
##$DIGMOD= 1
##$DIGTYP= 9
##$DL= (0..7)
0 120 120 120 120 120 120 120 
##$DP= (0..7)
150 150 150 150 150 150 150 150 
##$DP07= 0
##$DPNAME0= <>
##$DPNAME1= <>
##$DPNAME2= <>
##$DPNAME3= <>
##$DPNAME4= <>
##$DPNAME5= <>
##$DPNAME6= <>
##$DPNAME7= <>
##$DPOAL= (0..7)
0.5 0.5 0.5 0.5 0.5 0.5 0.5 0.5 
##$DPOFFS= (0..7)
0 0 0 0 0 0 0 0 
##$DQDMODE= 0
##$DR= 18
##$DS= 0
##$DSLIST= <SSSSSSSSSSSSSSS>
$$ [...]
##$SUBNAM2= <"">
##$SUBNAM3= <"">
##$SUBNAM4= <"">
##$SUBNAM5= <"">
##$SUBNAM6= <"">
##$SUBNAM7= <"">
##$SUBNAM8= <"">
##$SUBNAM9= <"">
##$SW= 24.0689530833862
##$SWIBOX= (0..15)
0 0 2 0 0 0 0 0 0 0 0 0 0 0 0 0 
##$SW_h= 4816.95568400771
##$TD= 16384
##$TD0= 1
##$TE= 0
##$TE2= 300
##$TE3= 300
##$TEG= 300
##$TL= (0..7)
0 120 120 120 120 120 120 120 
##$TP= (0..7)
150 150 150 150 150 150 150 150 
##$TP07= 0
##$TPNAME0= <>
##$TPNAME1= <>
##$TPNAME2= <>
##$TPNAME3= <>
##$TPNAME4= <>
##$TPNAME5= <>
##$TPNAME6= <>
##$TPNAME7= <>
##$TPOAL= (0..7)
0.5 0.5 0.5 0.5 0.5 0.5 0.5 0.5 
##$TPOFFS= (0..7)
0 0 0 0 0 0 0 0 
##$TUNHIN= 0
##$TUNHOUT= 0
##$TUNXOUT= 0
##$USERA1= <user>
##$USERA2= <user>
##$USERA3= <user>
##$USERA4= <user>
##$USERA5= <user>
##$V9= 5
##$VALIST= <valist>
##$VCLIST= <CCCCCCCCCCCCCCC>
##$VD= 0
##$VDLIST= <DDDDDDDDDDDDDDD>
##$VPLIST= <PPPPPPPPPPPPPPP>
##$VTLIST= <TTTTTTTTTTTTTTT>
##$WBST= 1024
##$WBSW= 4
##$XGAIN= (0..3)
0 0 0 0 
##$XL= 0
##$YL= 0
##$YMAX_a= 188638
##$YMIN_a= -75621
##$ZGOPTNS= <>
##$ZL1= 120
##$ZL2= 120
##$ZL3= 120
##$ZL4= 120
##$ABSF1= 10
##$ABSF2= 0
##$ABSG= 5
##$ABSL= 3
##$ALPHA= 0
##$AQORDER= 0
##$ASSFAC= 0
##$ASSFACI= 0
##$ASSFACX= 0
##$ASSWID= 0
##$AUNMP= <proc_1d>
##$AZFE= 0.1
##$AZFW= 0.1
##$BCFW= 1
##$BC_mod= 2
##$BYTORDP= 1
##$COROFFS= 0
##$CY= 11.3945322036743
##$DATMOD= 1
##$DC= 2
##$DFILT= <>
##$DTYPP= 0
##$F1P= 20.1720416913024
##$F2P= 0.152960286110954
##$FCOR= 0.5
##$FTSIZE= 0
##$FT_mod= 4
##$GAMMA= 1
##$GB= 0.15
##$INTBC= 1
##$INTSCL= 1
##$ISEN= 128
##$LB= 0.24
##$LEV0= 0
##$LPBIN= 0
##$MAXI= 10000
##$MC2= 0
##$MEAN= 0
##$ME_mod= 0
##$MI= 1.114404
##$NCOEF= 0
##$NC_proc= 0
##$NLEV= 6
##$NOISF1= 3.799351
##$NOISF2= 2.8
##$NSP= 1
##$NTH_PI= 0
##$NZP= 0
##$OFFSET= 15.70392
##$PC= 1
##$PHC0= -9479.723
##$PHC1= 4.600965
##$PH_mod= 1
##$PKNL= yes
##$PPARMOD= 0
##$PSCAL= 0
##$PSIGN= 0
##$REVERSE= no
##$SF= 200.130013532006
##$SI= 16384
##$SIGF1= 3
##$SIGF2= 2
##$SINO= 400
##$SIOLD= 16384
##$SREGLST= <1H.CDCl3>
##$SSB= 0
##$STSI= 0
##$STSR= 0
##$SW_p= 3612.71676300578
##$SYMM= 0
##$S_DEV= 0
##$TDeff= 0
##$TDoff= 0
##$TI= <>
##$TILT= no
##$TM1= 0
##$TM2= 0
##$TOPLEV= 0
##$USERP1= <user>
##$USERP2= <user>
##$USERP3= <user>
##$USERP4= <user>
##$USERP5= <user>
##$WDW= 1
##$XDIM= 8192
##$YMAX_p= 0
##$YMIN_p= 0
$$ End of Bruker specific parameters
$$ ---------------------------------
##NTUPLES= NMR FID
##VAR_NAME=  TIME,          FID/REAL,        FID/IMAG
##SYMBOL=    X,             R,               I
##VAR_TYPE=  INDEPENDENT,   DEPENDENT,       DEPENDENT
##VAR_FORM=  AFFN,          ASDF,            ASDF
##VAR_DIM=   8192,          8192,            8192
##UNITS=     SECONDS,       ARBITRARY UNITS, ARBITRARY UNITS
##FACTOR=    0.0002076,     1,               1
##FIRST=     0,             0,               0
##LAST=      1.7004516,     0,               0
##MIN=       0,             -75621,          0
##MAX=       1.7004516,     188638,          0
$$ Real data points
##PAGE= N=1
##DATA TABLE= (X++(R..R)), XYDATA
$$ [...]
196A1114j432p056q863n267J991P762P850L676k078p069q530m272L067P895P310
211F098K825l019p183p468l302L291P905P079K009l427o791p184k920M183Q239
226C35O238R41m089p234o447j242M971P751N918O04m803p031n232p27M588P465
242B006N254l35n036o335m632K0N486P461M679r43n510o855m166R09N531O928
258D462M051j365n602n975l045J569N680O525L119k363n842n913k802K221O103
273H23O224K569k443n739n531k016K694N787N406J653l144n783m948j357L105
288b700N994N237J047l704n869m715r54L364N792M585L12m079n716l921j63L723
304a767N557L934m64m540n543l415L05L922N419L498q78m619n369k909Q85M093
$$ y = [11114, 9682, 2626, -6237, -11504, -9513, -1751, 6099, 9775, 7697, 628, -7902, -12174, -9107, -1212, 6098, 8923, 5904, -1279, -8747, -12049, -8758, -853, 6226, 8235, 4808, -1983, -9167, -12087, -7904, 335, 6573, 7514, 3425, -3809, -10256, -11498, -6527, 1224, 7142, 7746, 2943, -4088, -9320, -10047, -5459, 2006, 7260, 6925, 1889, -4446, -9078, -9058, -3572, 3889, 8568, 7625, 2115, -4740, -8906, -7997, -2466, 4462, 8513, 7148, 1546, -4429, -7474, -5905, -225, 6300, 9419, 7056, 1214, -4699, -7501, -5280, 823, 7047, 9616, 7173, 1434, -4097, -6113, -3419, 2368, 7774, 9427, 6283, 500, -4448, -5805, -2700, 3294, 8531, 9578, 5874, 5, -4710, -5664, -2300, 3492, 8077, 8389, 4310, -1406, -5327, -5490, -1767, 3790, 7724, 7260, 2720, -2823, -6238, -5933, -2011, 3408, 6906, 6028, 1409, -3960, -6869, -5984, -1891]
320a891N029K872j316m834n051k165J653M303M826K439j702m977m798j654K040
335e226M403M392J875k042m890m486j130K567M456L932J334k292m846m056n55
350f564L031M542L632Q40k482m546l645j63L420M587L227L07k649m453l336J62
366d090L583M357K590l83l088m260k896N43L743M392K234q84l294l944k457P22
382c132L712M141J816j311l359l528j874J205L865M025J397j824l777l566j528
397c738J373L678L668J062k128l731k995q12J725L606L234O19k562l890k807m38
413d136J959L425L020M92k515l857k540L5K134L121K475Lk932l950k290M98K532
430b526L111K170j62k845l679j983R51K723K903J679m41k750l447j547J286K973
$$ y = [-1891, 3138, 6010, 4694, -140, -5191, -7356, -5703, -1400, 3426, 5865, 4163, -814, -5612, -7266, -5226, -823, 3569, 5444, 3402, -1488, -5974, -7104, -4537, -81, 3851, 5185, 2893, -1953, -6009, -6564, -3533, 1009, 4641, 5481, 2999, -1547, -5192, -5355, -1935, 2652, 5879, 6186, 3537, -916, -4252, -4090, -507, 3850, 6440, 6057, 2969, -1291, -4187, -3644, 99, 4491, 6725, 5841, 2547, -1397, -3854, -3132, 580, 4721, 6537, 5226, 1867, -1661, -3535, -2330, 1535, 5560, 6957, 5133, 1356, -2210, -3738, -2365, 1313, 4981, 6043, 3915, 184, -2811, -3623, -1898, 1708, 4942, 5561, 2999, -891, -3698, -4136, -2177, 1248, 4268, 4760, 2245, -1612, -4152, -4117, -1983, 1138, 3613, 3616, 684, -3266, -5556, -5058, -2526, 585, 2755, 2593, -252, -3931, -5914, -4963, -2240, 663, 2342, 1901, -849, -4296, -5843, -4557, -1584]
446a584K860J403p10k781l253j389J455L024K617R15j138k848k972j042J617L117
462g09K485M92j414k697k603p19J821L251K287L04j655k606k239l29J988L168
478H25K212n4j826k588j874q5K115L054J853m82k051k485j733J77K215K898J575
495C746n09k092k450j358N14K223K638J342p86k358k352j058P67K285K570J035
511D157j012k360k233q79R74K288K186O21j191k325k062n37J270K321K022N77
527C817j322k380j870k51J345K299J815J76j519k216j637k32J504K295J533j78
543C179j678k197j524O2J621K152J286l33j811k114j268K72J660K127J215o10
559B039j850j910r55M73J712K025R00p91j951j848p21O63J730J939P37r06j963
$$ y = [-1584, 1276, 2679, 1969, -812, -4065, -5454, -3999, -975, 1642, 2557, 1419, -1429, -4401, -5443, -3826, -709, 1776, 2268, 854, -1843, -4446, -5165, -3344, -93, 2194, 2498, 843, -1763, -4002, -4331, -2343, 825, 3037, 2983, 1157, -1431, -3305, -3390, -1275, 1779, 3632, 3150, 1099, -1386, -3119, -2942, -727, 2171, 3746, 3237, 1145, -1305, -2663, -2149, 74, 2712, 4054, 3268, 910, -1442, -2500, -1733, 552, 3122, 4157, 3145, 785, -1448, -2327, -1353, 935, 3121, 3742, 2551, 226, -1836, -2373, -1103, 1218, 3240, 3817, 2495, 115, -1755, -2006, -661, 1638, 3453, 3629, 2110, -106, -1743, -1975, -471, 1824, 3357, 3179, 1501, -696, -2220, -2158, -537, 1615, 2901, 2568, 757, -1357, -2625, -2353, -693, 1434, 2649, 2039, 189, -1721, -2676, -2203, -491, 1534, 2434, 1643, -308, -2156, -2877, -2214, -484, 1455, 2192, 1286, -677]
576f77j652n08P83J700J729N97j035k018j489k33J012J742J569M21j151j957j353
593b520k5J134J676J368K60j228j926j201J67J303J632J137N8j273j830j080M34
610a914J420J462R79j31j375j796q79M83J422J561Q31l89j390j554p19O14J527
627A52J368M87n25j359j604o05Q71J590J307L99n99j469j352l67P60J457J163
644A674K14q64j400j157j94J011J670J005m5q71j363j161r6J062J318Q87M3r73
662G60j485q56K81J065J331Q14l02j177j230p79J17J157J396O35l83j060j215
679i31o44M46J201J075M23m29j176j222m98N38J214J154L74p03j138r88l44N54
697a094J197R63J29o35j018j052k83P88J285Q24O1p94j109q56l6P29J134Q92q3
$$ y = [-677, -2329, -2837, -2054, -354, 1375, 1972, 937, -1081, -2570, -2803, -1791, -49, 1520, 1941, 790, -1167, -2520, -2545, -1411, 265, 1633, 1893, 665, -1261, -2462, -2295, -992, 640, 1777, 1835, 562, -1268, -2348, -1914, -494, 968, 1947, 1816, 441, -1355, -2234, -1751, -329, 1232, 2063, 1674, 284, -1270, -1989, -1375, 152, 1520, 2007, 1482, 123, -1481, -2086, -1215, 375, 1682, 2081, 1482, 13, -1339, -1706, -946, 511, 1674, 1888, 1024, -376, -1533, -1727, -716, 954, 1959, 1914, 1043, -320, -1481, -1577, -515, 803, 1690, 1733, 760, -725, -1581, -1300, -235, 1096, 1910, 1608, 431, -799, -1578, -1461, -304, 1092, 1727, 1344, 284, -931, -1575, -1129, 72, 1147, 1570, 1141, -35, -1257, -1755, -1217, -3, 1151, 1525, 822, -316, -1304, -1648, -1094, 103, 1066, 1195, 560, -458, -1510, -1793, -1005, 280, 1104, 1165, 371, -738, -1594, -1630, -901, 233, 1125, 1042]
716A042q65j053o35L5Q37J222O84k53q03r34n97J06Q81J128O36k77r78r39l77
735a140K15Q51J069N03m25r36q52l49L16R53R19M12m67r74q01k00M43Q69Q25L63
755A594n72j030o93j50N35Q23P62J30o26r58o82r3O05Q17O06R5n96r65o52J09
775i41O27P94N38n7p03q70n09J44O49Q60M88k44p07p78m68J72P90P34K92j58o57
796dp94l27L89P70O87K97l41p64p07j32K64P03P34K51l99p02n80j81M36P34N66
817I00N6m63p32n34PM71P13O18J53n19p53m08N3M64O29M30o5n39o97l42Q9N40
839G1O61L94j03o27p71l98K22M94N09K54o1n80o85k14K93N55M93K48k48n75o76
860g44k30L37N48M89J02j57n37n71k09M02N90L91j0l12m99n81q8M05O55L94m5
$$ y = [1042, 177, -876, -1511, -1476, -639, 583, 1267, 1014, 211, -723, -1320, -1214, -333, 795, 1431, 1154, 176, -763, -1140, -925, -74, 995, 1498, 1073, 137, -715, -1064, -748, 205, 1124, 1536, 1069, 95, -706, -906, -463, 406, 1231, 1594, 1022, -8, -701, -851, -316, 507, 1269, 1399, 773, -185, -867, -960, -355, 462, 1068, 1163, 567, -398, -1050, -941, -314, 480, 1018, 961, 258, -612, -1121, -977, -328, 532, 1020, 776, 69, -709, -1177, -1005, -215, 519, 811, 653, -4, -798, -1125, -736, 34, 721, 1018, 677, -87, -794, -926, -662, 41, 775, 1026, 627, -75, -655, -836, -400, 334, 900, 956, 493, -239, -773, -766, -295, 418, 1036, 1189, 670, -83, -491, -438, 26, 655, 1085, 1020, 481, -216, -558, -469, 71, 732, 1126, 1023, 396, -375, -773, -551, -57, 452, 706, 645, 65, -620, -834, -541, 14, 507, 755, 507, -68, -744, -974, -637, -89, 400, 502, 345, -192, -763, -972, -570, 20, 411, 401, 89, -410, -991, -1079, -674, -19, 375, 330]
881C30k85n06m71q1N23N59K77p7l16m74l82j4N00O48K44j35l53m47l80P2N28O26
903C86J80k15l65m22k42J30M86N74J91l20l74l83j38J02N29N15J36l21m18k84
923b53j55J20N12N07J04l44m82k88l8J80M29M67M4m17n08j92K4J81L88M01l6l62
945B82m41k12N9K51L63L44j6l81m89j71J06K79L72K80k6m62m22j40J22L55L54
966D07J47j57l66l94j46K29L13K98J18j07l35l91j04K24L85K73Q7j84l57l66p6
987e02K80L44K97Mk17l17k66p0K32L98K00k5j94l20k51k7K72L63K35p1k69l08
1009b12j83N6K23L44J98r8l10k99j22P3K16K88J86r7l20l00q3J26K45K65J28j24
1031B00l84k60l1J60K51K43J40j37l10k66j7J51K14J86Q2j49l05k18KK44K61J83
$$ y = [330, 45, -461, -932, -1013, -490, 69, 346, 269, -47, -521, -903, -917, -417, 231, 475, 340, -13, -460, -840, -768, -240, 386, 566, 351, -14, -436, -678, -548, -62, 512, 703, 383, 9, -374, -512, -410, 119, 634, 770, 449, 31, -253, -408, -288, 224, 731, 835, 491, 9, -279, -317, -137, 292, 759, 803, 386, -122, -314, -290, -109, 279, 680, 644, 282, -159, -371, -312, -61, 302, 646, 630, 249, -240, -411, -305, -26, 346, 626, 600, 138, -284, -424, -302, 53, 407, 554, 397, 31, -363, -509, -280, 33, 331, 449, 342, 7, -384, -488, -264, 121, 394, 481, 297, -60, -426, -502, -222, 122, 419, 423, 206, -111, -377, -447, -215, 183, 383, 358, 164, -156, -407, -434, -162, 201, 436, 365, 96, -212, -395, -339, -116, 228, 426, 328, 18, -281, -403, -330, -114, 174, 360, 263, -57, -357, -440, -314, -69, 196, 324, 200, -184, -444, -475, -315, -64, 179, 319, 182, -128, -394, -411, -260, -46, 140, 222, 73, -232, -450, -448, -204, 57, 240]
1053B40P4j68l33k24K8K32K07J30j6j36k63k04R1K45K50J21p0j65k57k37P1L16
1075f8K13O6n7j40k35j30J02L00K36Kj14j91k05j63J06L21K11L9j42j26k31o3
1097b69Q7K99K17n2j47j56k04o5J72K98J65p6j43j48j65l1R5K57J79o6j59k03
1119a15j03o8J82K73J18j15j61j65r8qJ67K55J41j13k45j08o4kJ36K43J15q7k54
1142g6j12l9O1J26K30R7j68k34q3k8M6J20J98J00j64k26n8M4O5R1K40K6j94k08
1166a46p8J3J00J31J60M6j43k06r7J03P2R6J45K1k00k50m1J31J06Q5J11P3k07
1189B5j98j9J30J06P4Q1j5j96j88J2J39J14O3P2K9j29k24m8J25J40oO3j9j60j73
1214b02J1J79J48L7Lrj37j88JJ77J75J4k2k4j08j35J8J33J71m1l2l3j21j38oJ76
$$ y = [240, 314, 146, -187, -411, -383, -151, 56, 186, 170, 34, -229, -433, -342, -97, 153, 274, 204, 39, -218, -455, -384, -68, 145, 211, 154, 14, -221, -351, -249, 51, 287, 289, 175, -16, -221, -384, -278, 43, 254, 293, 151, 25, -206, -269, -182, 117, 334, 282, 135, -21, -225, -290, -118, 180, 345, 269, 126, -22, -187, -218, -123, 134, 313, 247, 88, -115, -218, -286, -104, 169, 287, 172, 11, -154, -252, -260, -93, 162, 303, 190, -55, -163, -227, -229, -93, 150, 265, 178, -76, -188, -227, -166, -40, 190, 287, 119, -115, -198, -226, -180, -60, 138, 238, 74, -152, -210, -166, -101, -10, 230, 256, 62, -146, -224, -211, -111, 20, 180, 226, 83, -123, -220, -117, -45, 51, 196, 217, 17, -233, -274, -143, -37, 48, 159, 232, 25, -173, -192, -62, 44, 118, 199, 184, -12, -200, -188, -49, 65, 128, 200, 229, 100, -124, -172, -47, 93, 87, 150, 131, -29, -202, -191, -12, 136, 173, 176, 167, 30, -158, -157, 20, 195, 209, 187, 163, 55, -80, -62, 71, 242, 201, 169, 136, 15, -123, -129, 47]
1240D7J47mr2j3r3j11K7J61J49lj14n4o1r4M1J18J67j6r7o5o5k2o3J79J40o5j15
1267B9p9l1n0N5J04J23k4p1r4r2lMJ27J27l2j23j40Rl3K0J24J02m1j06j19l2M
1294b42R2J16L6lj06j24K8K8O5O9R8J1j93j23M7KO8Q8L1n5r2r8lK5Q5R5K3k1q5
1323a38j53J02R0O4N7P4k5j63l1L7N8R4J05Jj04m5m8jJ03O5Ol5J6j62q1P5J13
1350G4P4M7M1j00j23J8M1K3N8K1k8m0k9o3L6J61R6q5j9m7j13q2Q1M9K2N0Rp1o2
1379C9L7M3J15M0p2j36l3p0n5L1J08P6Jl7o2m7OM1K1l0l5p8j09J0J3M5J18Q7k
1408F5j54n3K1m8kM0J0qm2r1MR0N6L9L8k0j22j04N3J9J6L2Q3k8n6k1k2Q5R3k1
1438d8l5Lo3o6L4O8M7N0J9J3m9p6K9P1N0L3k3j4j6n3rJ18P5Qm5Rn3p7L6L2P7K
$$ y = [47, 194, 190, 98, 85, -8, -119, -92, 69, 218, 215, 101, 47, -14, -108, -67, 51, 218, 202, 105, 40, -25, -47, -110, 69, 209, 144, 29, -50, -81, -131, -76, 28, 151, 127, 56, -38, -130, -133, -129, -2, 125, 93, -30, -170, -161, -194, -174, -50, 52, 11, -95, -214, -246, -242, -150, -34, 2, -1, -107, -231, -203, -175, -110, -41, 57, 68, -125, -248, -201, -199, -131, -43, -12, -67, -159, -257, -260, -235, -150, -55, -32, -53, -138, -291, -189, -99, -35, 22, 96, 71, -92, -123, -86, -28, 66, 171, 172, 68, 23, -25, -26, 77, 142, 148, 113, 129, -33, -114, -39, 74, 148, 195, 236, 136, 13, 31, 72, 95, 153, 174, 146, 106, 77, 14, 50, 211, 307, 222, 203, 156, 43, -39, 42, 91, 113, 163, 172, 101, 39, 76, 119, 234, 274, 202, 66, 33, -37, -92, -61, 47, 123, 124, 87, 25, -22, -16, 25, 46, 16, -19, -97, -206, -196, -183, -138, -20, 67, 65, -89, -142, -121, -169, -171, -131, -121, -129, -171, -262, -258, -168, -112, -73, -35, -55, -177, -281, -228, -209, -193, -161, -78, -106, -162, -183, -205, -120, -27, -48, -83, -80, -143, -209, -175, -107, -60, -10, 9, 22, -27, -103, -74, -3, 47, 80, 57, 43, 27, -26, -35, 83, 158, 166, 121, 130, 77, 0, 36, 68, 145, 147]
1470A47lk1rm0QM3J28Qj13m7K5l4m2R4O5l3p1J1q1RMQ5L2K5j06r0M1M0j3J7R4
1501A73j6p3n0L3j5K6pN6pq1m0m0M6l6N7j8J3m6r3J1N1K8j2M2%r8k7QK2K3J3J7
1533d0Mm9k2l4P7M1j5k2J0l5p1kM0L4L2Ol5k3k7rK3O3M0%p1J6l5k1N0O9J7n4j
1566d4k5m8j9R7L2K2m5j2k3j0k7L1N7K2m4l5K3J7qoR2J8n3l9j0K1j8J9N0L7n8
1597A4l2j2N1oK3J7M1p4m9lQM0j8M3L6l9p3J4Q9oj4K4J7j6q0J2N5LNK9M0l0q0
1630B9J8K1L0n7PO0n1q3k1P5M2j2m9L7J4p2k6K8N8l7j7L4j2q8LN5P4l1j9K5m4
1661il4l1J6J11m2m0MLn5k5J00N9m5j6J0Pn5j4M9N0k7l6j0O7n5l1N7P9o7p0J1
1692c9L4k6n8O2L9Pl4l8qJ5k8O1M5J1j01k8O6K2l7%Q0Mp6l5L5Joj8P1M2p7o5M4
$$ y = [147, 144, 123, 114, 74, 82, 125, 253, 261, 148, 101, 126, 92, 50, 144, 209, 176, 105, 116, 35, 44, 48, 133, 165, 190, 84, -6, 35, 75, 62, 79, 173, 157, 84, 34, 67, 52, 78, 71, 127, 120, 39, -1, -41, 5, -31, 26, 8, 21, -25, -118, -107, -56, -28, -40, 2, 2, -96, -123, -115, -93, -70, -57, -40, -36, -85, -107, -141, -64, -23, -38, -60, -50, -85, -156, -158, -118, -84, -52, -46, -81, -104, -131, -140, -117, -54, -14, -14, -85, -69, -104, -125, -75, -6, 11, -43, -44, -69, -117, -136, -39, -7, 15, -30, -42, -65, -75, -102, -71, -14, 8, -36, -71, -48, -31, -39, -45, 47, 65, 12, -27, -37, -16, -34, -15, 35, 72, 14, -18, -30, 21, 15, 38, 55, 96, 22, -27, -30, -22, 18, 0, 43, 79, 40, -33, -19, 70, 64, 50, 74, 91, 75, -5, 7, 62, 65, 70, 99, 139, 109, 29, 47, 68, 98, 41, 48, 108, 57, -26, -47, 28, 70, 58, 9, 46, 60, -12, -38, -10, 48, 11, -6, 28, 16, -72, -69, -14, 60, 29, 10, 35, -9, -43, -74, -58, 53, 11, -29, -25, -22, -77, -102, -2, 57, 12, -4, 6, 13, -42, -56, -7, 43, 16, -20, -30, 37, -18, -49, 8, 87, 20, -50, -39, -5, -31, -89, -27, 12, 19, -15, -53, -61, -46, -74, -13, 32, 43, -58, -86, -20, 2, -35, -35, 45, 49, -27, -62, -27, -26, -32, -50, 21, 63, -14, -79, -35]
1725c5jk2MJ2L4l2o1K5N8rK0J5J7o6k7M0lL9k7K9J8m0m8J5M9J7nQPk4o8J0L1K6
1759Fl2j3M4k7MK0M2Nl5J8pk8k9M6LK2J4pmm9mM2K3j4ROm3k4J2L7KJJ5j5Lk1j
1796B1J5K2J7j9jqm5L1j4K7j5j0M9l4l1j9K2J4Ok8kJ5o1lK7qL6l9ML0l5l6mP0
1830fj5k3k3kj3k2K9M4kl7J2L1k3m0K4M8km9k0N3k7k6M6N4k6pp0O1Qp9L9L5jk1
1864e0J1j1J6oK3J0K6l6o1K7J0k9nN6K8n3k4M2Kk8J4J8N9l2n7L9L9Qk7kO9n0l5
1897iJ3N9lLk7M0j8m0J1jmkJ4k1l7k0J2J0O6JrpRj7mML9n0MPl6J2LL0K0PK6p7
1935Hmk0k1J2jJ2ok1jM4k7J2J4k3j2no2M2qk7L5qPK1K7k0Llrl9J7j5l6J0QK7Q
1972f1K5rk5L3k8lK5j2m8M0k4k1J1J7L3k5%NJ2m1j7ON0mkK6k1K7k8PJ7Jk9K8J7
$$ y = [-35, -36, -58, -54, -42, -8, -40, -101, -76, -18, -27, -7, 8, 25, -41, -68, -28, -31, 8, -19, 10, 28, -12, -60, -45, 4, 21, 16, 24, 31, 7, -61, -51, -20, 6, -26, -39, 5, -22, -18, 2, 44, 49, 14, 32, 25, -3, -32, 14, 17, 39, 53, 46, 42, -7, -11, 31, 54, 40, 49, 55, 12, -12, 0, 37, 39, 40, 55, 40, 43, 22, 21, 36, 58, 75, 56, 55, 47, 2, 33, 19, 46, 31, 21, 70, 36, 5, -14, 8, 22, 28, 0, -2, 13, -48, -51, -24, -32, 4, -35, -31, -1, -36, -72, -76, -6, -21, -44, -67, -69, -82, -104, -75, -31, -33, -70, -58, -27, -50, -90, -66, -18, -20, -69, -89, -36, -63, -89, -43, 11, -15, -22, -92, -31, -23, -102, -63, -28, -29, -50, -39, -50, -34, -40, -17, -7, 19, -17, -78, -51, -41, -70, -75, -19, 9, -44, -68, -26, -24, -52, -38, -20, 39, 7, -50, -11, 28, 36, 9, 7, 76, 26, -9, 4, 63, 60, 63, 36, 76, 58, 18, 29, 28, 24, 22, 36, 15, -22, -42, -30, -20, 46, 47, 38, 31, 40, 23, 19, 23, 62, 12, 16, 23, -13, -1, 2, 32, 52, 59, 85, 8, 4, -16, -37, -25, -26, -14, -20, -41, -42, 2, -25, -13, 1, -22, -34, -39, -101, -59, -67, -94, -59, -67, -60, -39, -12, -32, -29, -32, -41, -80, -63, -78, -114, -104, -96, -69, -61, -36, -45, -70, -37, -65, -68, -43, -55, -103, -63, -87, -108, -97, -80, -47, -72, -72, -67, -55, -96, -113, -107, -57, -61, -63, -37, -58, -31, -59, -52, -35, -34, -63, -35, -18]
2007a8m3J1K7jJ5j7Mk3J1J6J1J8J5lLj3%l1O3J1J0k7l4K2lK2L7l0j1L4k6j5QR
2041E2rK1K3j0l2L8kj4JK7m1J5J5l2OQpm1L5J1k5l1K6Qj3j1M1k5J9j6K0k6L6J9
2075H6m7M5l1j2l2N8pJ3p4M0nj9J8n4J9Qj0k8J8Jl3J6J4k1k5m3N1j6LK8J0kk6
2108e7j7J0L4jk9J8K9k6l1MK9pl0M0J7k2j3jM7l5j8J3M7l4LQL7Nj7L0l4j5k2M3
2142EL1j8j3mK8J3l0lL6j1Nj5l7J2rK3nRj6j4K4Pl6QlJ1Lm5oJ3J6j9lK3Nj5k3
2179e3J2opm7J4K3j2mJ5l2M7n%K2l8K7j8JJ1j4mM8k8rj1PL9m7J8J0K0k0OoJ8J1
2215a2j3j3K1lj3L1J3J1j5L2k3j5J4oM3j7k9M2Pnj4K5L2k0k0k6M5nl0M0jmkl1
2249C9L3K0m1j2K8J8Jk9OJ5n1K6L3j3k5j0K7ok9j3J7J5Mnk3O%j8J6K7n0j8J3L3
$$ y = [-18, -61, -50, -23, -24, -9, -26, -22, -45, -34, -18, -7, 11, 26, 23, 26, 13, 13, -18, 45, 56, 66, 39, 5, 27, 24, 46, 83, 53, 42, 76, 50, 35, 43, 52, 43, 64, 87, 77, 45, 83, 81, 67, 68, 95, 54, 69, 84, 52, 58, 66, 59, 18, 53, 64, 39, 8, 34, 42, 29, 18, 59, 34, 53, 37, 57, 31, 67, 86, 39, 84, 53, 41, 9, 67, 60, 73, -1, 39, 34, 15, 33, -21, -2, 6, -4, -32, -14, -13, -46, -30, -16, -37, -62, -105, -54, -70, -67, -39, -29, -31, -57, -74, -64, -30, -31, -60, -42, -13, -39, -70, -66, -37, -44, -74, -34, -17, -39, -52, -53, -6, -41, -59, -46, 1, -33, -30, -22, 15, 20, 3, 33, -1, -16, -38, 5, 36, 18, 5, 1, 29, 42, 12, 9, 45, 34, 39, 24, -13, -1, -10, 13, 8, 17, 1, -13, 11, 18, -18, -10, -13, -2, 1, -44, -50, -37, -21, -40, -43, -20, -15, -30, -53, -41, -47, -54, -101, -87, -64, -76, -80, -65, -97, -50, -55, -55, -33, -71, -44, -62, -61, -50, -64, -68, -20, -48, -57, -68, -61, -22, -69, -51, -41, -21, -41, -35, -41, -23, -12, -25, -38, -17, -20, -33, -2, 11, 22, 7, 39, 16, 1, 15, 9, 52, 35, 6, 48, 55, 50, 36, 61, 93, 73, 53, 27, 72, 67, 37, 77, 76, 72, 70, 39, 72, 92, 51, 39, 67, 85, 86, 57, 63, 78, 27, 53, 86, 73, 48, 38, 65, 59, 30, 17, 34, 49, 53, 48, 25, 31, 31, 13, 29, 56, 6, -12, 1, 34]
2283C4k8LOrj9OJOm7ML0k3lj1jK3m4J5J3PJ4rmJ3k1jK2J4j8n4L1mM9k8j2K4k6
2320d7jJ8nMKL2nm6%K9k4pK5K1J8o3J9Oj1J0RJ4K1m0K1JJ2j9K4J5kjk6pN4Kn0
2357CRM2J3n0J5N7l3jJ4J1k8j7J5M3j5l1J2K1l0n3M9K3k2l0rM2J3q5%O8j8m9j9
2390d0J7J1on3L2K8n1K7MK0m6pJ5N6o5m%M1l3kL1J5m6J7k3L5pl3KN1Ml6lJ2kr
2426d8nP0J2l6Nk9Om3M9jK9k7m3O0rPj1L1lj7j1jL9l8k8L8%QLLj2K9m0MN4%n6
2463a1J5PK0j6Mk5%J1j9nK2Qj6MJ9jk6K4k6K7j3jmM6n4J9K1k7J4j2jJ7nk3L4N
2499C2k7j0K0k5K4j3K2K5k1m4J5J7jo5J1N0l9J0pL9pkqL9j7l8K0K1j7j0l8M2K6
2532B4l4OJ2KJ1k5J1Jj8k9M7Jj4k9M7J0k4k2J3J1j4M4k3Jj3k7J6j0KqK0J0m4m
$$ y = [34, 6, 9, 15, 6, -13, -7, -6, 0, -47, -43, -13, -36, -39, -50, -51, -28, -72, -57, -44, -37, -23, -32, -36, -23, -44, -45, -23, -9, -27, -81, -50, -54, -5, -33, -45, -21, -47, -48, -30, -35, -31, -29, 3, -2, -48, -48, -19, -43, -50, -25, -4, 14, -49, -30, -24, -35, -25, -16, -2, 19, -21, 0, 1, 13, -6, 18, 33, 31, 30, 4, -3, 51, 53, 3, 12, 54, 67, 17, 32, 89, 56, 55, 69, 80, 52, 35, 50, 93, 78, 47, 59, 80, 50, -3, 46, 69, 47, 17, 8, 50, 63, -22, -22, 46, 28, -21, -40, -23, -12, -18, -71, -39, -11, -62, -35, -31, -11, -57, -64, -49, 7, -58, -62, -62, -21, -54, -56, -25, -10, -56, -39, -62, -27, -34, -67, -65, -14, -10, -46, -49, -37, -39, -48, -53, 17, 29, -7, -2, -31, -25, -68, -19, -20, 9, -18, -61, -1, -10, -3, -14, 17, 14, -3, -14, -15, 24, -14, -42, -4, -4, 4, 7, 10, -2, 27, -13, -9, 45, 45, -11, 4, 11, 31, 15, 19, -6, -6, 5, -14, -19, 3, 11, -5, -1, 18, 17, -9, 15, -11, 16, 3, 2, -2, 44, -10, 9, 30, 3, 17, 5, 4, 21, 16, -7, 27, 32, 5, -5, 15, -10, 14, 1, 23, 48, 27, -17, -2, 15, 14, -51, -40, 10, -29, -19, -26, 13, 6, 4, -4, 35, 18, -20, 0, 21, 4, -6, -44, -2, 24, -10, -4, 8, 10, 21, -4, 7, 8, -10, -39, 8, 9, -5, -34, 13, 23, -1, -23, -10, 1, -13, 31, 8, 9, -4, -31, -15, -25, -23, -31, -11, -1, -45, -49]
2566d9M5lj0j2k3KL4j5lQj6k1M7j3j4k5J6J4qROk7K0k4mK7Ok3L7RJl3K8lj6Mq
2603c7K2j7nlJ1OJJ8pJ3j8NK6j4k8J2RK1n9K1K1jm1L2KO%Kk3L6kMj6K7J1k5K4
2640C4l6K4m3N1J6j9Mok5J5L3j6j2J0K2k3L4j3nk6K1L1l7J2j2K2pNj7J8pK3mk2
2674D5m0K6NlJl4Qkl3L3MRk3j0N0m1j6mK4mL4J0n8L0JlJQj5j9L1n0PM0qnM2Qq
2713D1k9J5k8%J2k3j4J4qK0PL9%j0m7qL0JrK2oj0j6pM0k1nK6j8qJ9k9oK5l9%M9
2750A9l8PK5nNJ3nOj3j5j8J9j2L5k7L0K1j7j7J1J4qrJLj1k4L4J1l4M0jOL7l0k1
2786C2L7lj2j9J2qK1pPqrQj9J2K9l0j4oJ4l2K8K4Nl4j6J5J0l1M8l6mM2o0Qk9M5
2822B0k6J1j5j8K4JK6m3k6N8k8kjj5k3J6k3M6k1K0j3j5OpK5m6j2j6L7j3L8j9j1
$$ y = [-49, -4, -7, -17, -29, -52, -50, -16, -31, -34, -26, -42, -63, -16, -29, -43, -68, -52, -38, -46, -37, -31, -58, -38, -62, -66, -39, -33, -56, -19, -10, -9, -42, -14, -17, -33, -29, -37, -15, -32, -37, -40, -29, -23, -22, -4, -11, 2, -16, -11, 15, 1, -27, -15, -6, 15, -44, -23, -2, -3, -44, -12, -10, -4, -4, -2, -25, 11, 9, 13, -3, 24, 35, 10, 34, -2, 22, -21, 30, 46, 27, 31, 25, 0, 15, 48, 32, 20, 30, 52, 29, 63, 50, 45, 19, 40, 71, 34, 46, 34, 56, 49, 54, 37, 55, 48, 71, 67, 45, 5, 31, 36, 33, 34, 0, 8, 6, -27, 6, 10, 19, -4, -14, 36, -5, -21, -25, -1, -5, 29, 39, -19, 11, 12, 9, 10, 18, 3, -16, 15, -35, -28, 12, 4, -1, 41, 49, 41, 12, 27, -1, -1, 11, -12, -26, -12, -20, 0, 7, 46, 46, 36, -11, -19, 11, 12, 3, 25, 19, 9, -7, -14, 26, 5, 0, 26, 8, 0, 19, -10, -16, 9, -30, -30, 19, -19, -12, 13, 8, 13, 26, 21, 27, 14, -1, -19, 0, -12, 23, -4, 26, 47, 30, 13, 24, 38, 30, 21, 22, 25, 14, -10, 24, 35, 1, 41, 40, 46, 83, 53, 32, 69, 66, 54, 35, 47, 39, 60, 53, 60, 52, 43, 51, 32, 44, 73, 43, 29, 23, 37, 5, 33, 57, 62, 28, 12, 27, 37, 6, 54, 18, 14, 56, -4, 4, -25, 20, -6, 5, -10, -28, -4, -3, 23, -20, -46, 12, -16, -18, -19, -34, -57, -41, -64, -18, -39, -19, -32, -47, -41, -48, -23, -69, -81, -97, -60, -73, -35, -54, -65]
2855f5Jj3kK7k4L0j9LqPQJ0J2j4kJ6j6J6j7J6N6l0k1L4Rj0Rj1K5nJ0j3jK7l5M0
2891E0%j2k5L7lj7J4%J8Ljk7QJ4n%RJ1j7l2K0nj7J1Lk3L2n2M5Kj6j9J6jOk6M9
2928E0l6L5l7J1J2k5J1k0J7j4M3n1J2qj%K2j6j7QJ2Pqm3M4J3j9j3LNjj8J8J0r
2963cJ2Mj9J6j7nkJ1k6M8m4J7j1K0J2k5QJ3k6J3J2k6mJ9l8L1j1K5K4l8JQoqNj9
2999b9N6l1qNJ4jjj2pkJ8j5jqoL2j7j7PM0j6K9j7j9J5j3kRrj6rJ3RjJ5k7J9j1
3037a4m7O3l2K7j9OL5k6%Qknj3K4J0k2J6j8J7j1ONJkpOqj1J6Pm4O3j9o%l2O6k4
3075A4J8m5J7J1k8NPQj2J4KJLoJj3%jJ0j3L8n3K9LjOJ2k6J4L6o7N1orj9M3jj9
3113B4mJ1%KJ1k6rJ4J4j1QKMj3J2m7OK2LpJ1m8K1kjK4m7LJ3J9l8J1Mj5J4j9J4
$$ y = [-65, -64, -77, -79, -52, -76, -46, -65, -62, -70, -63, -55, -45, -33, -47, -49, -33, -49, -33, -50, -34, 22, -8, -29, 5, 14, 4, 13, 2, 27, 22, 32, 19, 18, 45, 10, 50, 50, 38, 13, 50, 47, 30, 44, 44, 62, 65, 64, 37, 45, 59, 54, 54, 63, 74, 57, 25, 45, 40, 23, 34, 37, 14, 46, -6, 39, 41, 25, 6, 22, 21, 27, 1, 50, 14, 49, 12, 23, 35, 10, 21, 1, 18, 4, 47, -4, 8, 0, -1, -1, 21, 5, -12, -4, 8, 15, 7, -36, 8, 21, 2, -11, -8, -3, -4, -22, -4, 6, -3, 9, 13, -6, 10, -7, -12, -14, -3, -29, 19, -25, -8, -19, 1, 13, -12, -4, 9, -17, -4, 8, -18, -22, -3, -41, -10, -21, 4, 28, -10, -9, -1, -7, -15, -10, -29, 27, -4, -12, -7, 7, 6, 5, -7, -14, -16, 2, -13, -14, -22, -28, 4, -13, -30, -23, 17, 1, 30, 13, -6, 9, -4, -6, 3, -6, -22, -31, -18, -9, -10, 5, -22, -3, -14, -61, 2, -30, -3, -22, -16, 19, -7, -7, 1, -1, -6, -19, 5, 15, -7, 9, -9, 8, -3, 3, 8, 9, 7, 0, 6, -2, -13, 3, 10, -34, 29, 10, 4, 4, -28, 38, 14, 32, -13, 4, 15, -13, -8, -1, 7, -5, 9, 11, 12, 15, 9, 10, -3, -3, -4, 6, -7, 31, -22, 7, 10, 9, 15, 27, 1, 15, 51, -16, 35, 29, 20, 1, 44, 43, 24, 20, 31, 31, 33, 44, 18, 9, 23, 37, 26, 34, 36, 40, 27, 39, -8, -2, 20, 23, 16, 27, -21, 0, -2, -3, 21, -26, -23, -10, 9, -29, -18, -14, -29, -15, -34, -20]
3150b0J7l4J6qplJ5qrQK0rj4mj1L5J6kj7k2Oj9NM5k6J4k7L1k7J4j2KK8j7J0K1
3186Gj0jk8NL2qmj1L7j5Pl0KM6k5lJ8k7L1k0J7Ml1L7MJ%j3J6k2lj8K2nLJJ6Mj
3225C5j5mKK8k3kN4j7l7k2L3%qk4M9Mm0k6N2Mj9j3J8k9K3l5JK4pj2mj3oPNOk6
3262c7MRj1J2oK1l2Rk8J6K5l1L0l7K6J0Rj3J1k5K0m4N6Nm1QnL5j8J4rOj8J2Rk9
3298c7M6Qk6lj2J1J2L0nn4M7qk3K1Lj0%j5K2nMj7M8l7RJk2J9J3ok4K1Joj6J6%
3335FMOj7K6k4J2j6K6Nj6K1k2Pqj4L0Qk0K1m4K7Jk0K0J3l9M8k0ml0J2J2k7M6l8
3370hPJ7j3Rpj7RqJ3pQl9KN4rk4qK7L2o2L3Ok3J6k6k0N1j4J2rj4K8Qk7KKj5RL5
3409C0l2%LmL2m8oL8j9j6K3K5k0k3L0J2j9lk3L5l2j4JK4Ok4J7J6k3Rl1J6M4l7
$$ y = [-20, -3, -37, -21, -29, -36, -39, -24, -32, -41, -33, -13, -22, -36, -40, -51, -16, 0, -2, -19, -41, -35, -54, -49, -4, -30, -16, -43, -12, -39, -25, -37, -35, -7, -24, -14, 7, -3, -4, -32, -27, 5, -3, -7, -18, 19, 4, 11, -19, -17, 29, 4, 1, 19, -8, 23, 3, 20, 24, -7, 30, 34, 35, 35, 22, 38, 16, 13, -5, 17, 12, 15, 16, 32, 36, 35, 20, 16, 18, 46, 23, 21, 75, 58, 21, -1, 32, 32, 24, 0, 49, 53, 13, -13, 39, 43, 24, 11, 29, 0, 23, -12, -11, 13, 6, -6, -10, -23, -29, -22, -17, -11, -37, -33, -24, -35, -23, -29, -8, -40, -31, -59, -43, -18, -49, -19, -56, -30, -20, -11, -24, -13, -38, -18, -62, -6, -1, -42, -34, -39, -4, -22, -8, -17, -11, -29, -17, -8, -37, 9, 17, -9, -12, -24, -13, -1, 29, 24, -30, 17, 9, -14, 7, 10, 0, 0, -15, 7, 2, 6, -11, 37, 0, 9, 10, -12, 7, 20, 14, -10, 11, 12, 6, -10, 6, 6, 10, 16, -1, 25, 1, 13, -3, 23, 28, 12, 33, 11, 18, 10, -4, 26, 34, 14, 35, -9, 18, 19, -1, 19, 32, -7, 41, 21, 17, -13, -1, 11, -16, 30, -8, -1, 16, 3, 12, 5, -12, -3, -11, 2, -5, 3, -36, -34, 20, 11, -13, -21, 6, 38, -24, 9, 15, -8, 8, -18, -38, 13, -1, 11, 2, -12, 16, 24, -3, -1, 1, -14, -5, 30, -2, -2, 1, -3, 29, -19, -25, 13, -6, -22, 1, 26, 6, -17, 13, 25, 6, 3, -20, 15, -17, -31, -30, -6, 0, -24, -7, 9, -14, -5, -36, -20, 24, -13]
3443a3J0j1j2LlK7J4k7k0L1L0k9j2JJ9l8L5kJ5j7J2jJ3kl%K9l0jK7k5L0l2MJ3
3478C5l6NJ1jQj8J1J5Km3LnK5j1RJ1nk7K0lk0J2J4moK1j8K0j7j6J1j2K5L%k4K9
3515B4K3o8K8J7k0nRk0J7J0k5L3m4J6J7l9K8Nj5Mkn4O5%o0L9K1k8J6ll4K8l5L7
3549a5rrJ3j7KL9l3oNK0j8j7K6LKj0POkKK6m6J3K8j9oK2mj0j6J2OL2k2Lj2L2j3
3587A5k5N1o2K9j3Jj4L6j7k3JK7m%j4M2l3j0nM1om8J7J6j1nOl0L6rj5kML2k2L6
3623B2mlm7K5%J1J0j7K9j2Kl2NMrN0k0o%kj3pL2J5j3rJ5j5j6J0j8J0J1j5j4J2
3659iRJ2k9%J2K4l4K7k1J7J3Ql4J5pJ0j0m%j8kL6j2j1jjK6j9oJ3J1k6L3%l5J8
3695El0NK3mlpj4L2k4rK9j9J1mK5n2K2pj6J2K0k3M2ql7j0pK2rJ1pjOQMk7l2M3
$$ y = [-13, -3, -14, -26, -23, -26, 1, 15, -12, -32, -1, 29, 0, -12, -11, 8, -30, 5, 3, 18, 1, 13, 12, 25, 23, 20, 20, 49, 19, 18, 45, 20, 50, 18, 22, 35, -1, 4, 15, 14, 22, 4, 15, 30, 32, -11, -8, -13, 12, 1, 10, 21, 16, -11, 9, 6, -14, -2, 12, 8, 2, 23, 5, 25, 8, -8, 3, -9, 16, 19, 19, -5, 24, 47, -21, 7, 24, 4, -1, 8, -12, 5, 15, -10, 23, -21, -5, 12, -27, 1, 6, -9, -5, -7, -61, 4, 4, -56, -17, 4, -24, -8, -11, -45, -17, -52, -15, -24, -33, -20, -37, -35, 4, -29, -35, -30, -10, -28, -45, -19, -16, -14, -24, -17, -11, -13, -11, 15, -31, -18, 10, -9, -15, 7, 3, -7, -23, -11, -5, 27, 5, 8, -4, 28, 15, -10, 41, -21, 8, -5, -4, -18, 18, 1, -22, -21, 6, 2, 2, -12, 30, -3, -13, -18, 23, 17, -31, -14, 2, -9, -14, -8, -38, -2, -11, -26, -28, -24, 8, -14, 22, 18, 15, -32, -7, -7, 4, 14, -3, 26, 14, 16, -16, -11, -7, -16, 34, 14, 8, 8, 6, -7, -14, 18, 33, 20, 11, 26, 11, -5, 5, -13, -3, 8, -7, -21, -9, 0, 12, -17, -17, -5, 19, -15, 12, -9, 8, 21, 29, -5, 10, 3, 13, 3, -1, -1, -19, -21, 15, 3, -8, -9, -10, 16, -3, -9, 4, 15, -11, 22, 22, -13, 5, -25, -20, 3, -1, -4, -11, -25, 7, -17, -26, 3, -16, -5, -9, 16, -36, -14, -21, -37, -25, -5, -28, 14, 6, -31, -41, -48, -26, -35, -24, -31, -32, -26, -18, -14, -41, -73, -30]
3733c0M1l6qM0n2M1m3K7jjJ2K2l6K4mJ5k0l3N2pm1O0m7K8Jj6jM4l5j8M4j5J2j8
3767AK6l1M4l2jK7l2K1m5L9j3J0k8M8m3jK7jOj7PLj8K7Nmj6J4RL1l9l4L5jj1J
3803A4J6k5J8pj7K6k8R%j1J3j3OM4l9K1%m3K2j0J2Rj6j1rJ6j2PjpnK0J1k4lJp
3840b3K7Ql4lj1L7k8k%K6j7K9k3J3k1j1LNoJ6J1k8L6pk4N8k2pRk3PK2nj6J9mr
3877Bj4J4K8k2J0J4n1L1k9mL5l4PJ1Oj8K4k8K6Mk8pkL0oOk4K7l1K7Nk5pJ7OoJ6
3914A0pJ3opjnNqJ5kJ1j5nL3k5j3J5j7L9jnk5K4Rk4j1M2k2roJ8j2Nl4LJ1J7k5
3952a5pJ1%J3m9NM5%Oqj9OKJPj3L2J9n2J5l2J4M0n4L9M0l7k9K1J4kk6LK4K1Kn3
3989a6K5J9m8J3QJ3l3J5pL0n2lK3jJj6K1J2nnnj2J0j5M2j6l9J3RK1k2j7%K4K3
$$ y = [-30, 11, -25, -33, 7, -45, -4, -47, -20, -21, -22, -10, 12, -24, 0, -4, 11, -9, -42, 10, 3, -38, 22, -25, 3, 4, -12, -13, 31, -4, -22, 22, 7, 19, 1, 27, -4, 40, 8, 7, 34, 2, 23, -22, 17, 4, 14, -14, 34, -9, -10, 17, 16, 22, 5, 12, 15, -3, 24, 29, 25, 9, 23, 32, 63, 24, -10, 25, 24, 13, 14, 30, 5, 23, 16, -1, 25, -3, 6, 6, -5, 8, -5, 1, 45, 6, 27, 27, -16, 6, -4, 8, 17, 1, -10, -19, -3, -15, -8, -9, -16, -21, -1, 10, -14, -17, -16, -23, 4, 12, -22, -25, -36, 1, -27, -29, -29, -3, -20, 9, -14, -1, -22, -33, -30, -25, -31, -15, -4, -32, 4, -3, -27, 31, 9, 2, 11, -12, -5, 17, 12, -4, 15, 11, 2, -12, 2, 30, 8, 18, 32, -19, 12, -17, -21, 14, -20, -13, -2, 4, -14, 10, -18, 8, 12, -16, -23, -25, 5, -1, 5, -19, 8, -23, 4, 9, -16, -23, -6, 0, -6, 10, 3, 16, 10, 3, 2, -3, 2, -6, 9, 7, 18, 3, -2, 31, 6, -7, 8, -9, 30, 29, 24, -1, 23, 32, 8, -3, 39, 17, 8, 2, 20, 8, 13, -21, -18, -7, 10, -15, -22, -11, -11, 2, -47, -42, 3, 3, 9, 1, -18, -12, -10, -9, -2, -15, 17, 36, -16, -1, -33, -19, 21, -33, 6, 46, 9, -20, 1, 15, 13, -13, -10, 14, 35, 37, -16, 9, 28, -20, -7, 1, 14, -19, -4, -11, 19, -33, -36, -13, -14, -13, -29, -8, 4, -1, -6, -11, -23, -13, -28, 14, -2, -41, -28, -19, 2, -20, -37, -37, -13, 10]
4024A0j6j7L1Om0N6k0j8J1MK1mk6mK0JkOl2J1L5j9RK5k0n6K5J1K2l5PL1j7rkJ1
4060A6j4K7Mm2K0j0QLk1L3k8J6k7J2K3k3pJ6l3K3NOnNJ9l8K7j1L0k2K6m2kj1K3
4095FOl0nK7NoK3Jj2J2n4J0O0l9Jk3Qj0J3Jm2M0J6m2NM0l0j6J9j%Qj3J1l0J8j4
4132c7K8J2l2mJ8lJ6k7mJ8KRj0J4J3n4PL3Kk1L1k6%K0k1J2J0pK3k5pK4l6J8rL0
4168A7l4J4oj6J6K3l1KJ1j9K4K6j7k2J5J6j6k3K4Pn5N0j2mJ4KMj4j1RK0k2L4j3
4202A3j5nJ3Pk2K3L2n1J7J5kmRj0Nk2OJ4j9k7L6JMJ9j4k0kJ2j1OJ7Kk6j5L3l6
4238a7J6pJk1J1K0ok2qkL5%k5K9Pj8j7QK3l2PK6k5%j3L2l3M6m6K9J4Nl6K4k0Q
4274gNJ3k1J7Kk4mpK6k9J4j8J3J7Lm9L2j6L6m5M1k9qNK2j4jkPj2J5k8J4J7j3K6
$$ y = [10, -6, -23, 8, 14, -26, 30, 10, -8, 3, 7, 28, 24, -2, -6, 14, 15, 13, 19, -13, -2, 33, 14, 23, 48, 28, -28, -3, 8, 30, -5, 2, 33, 16, 7, 5, 16, 2, 29, 33, -9, 11, 1, 9, 12, -9, 24, -4, 12, -15, -3, 20, -3, -10, 6, -27, -4, 1, 7, 2, 7, 26, -12, 15, 4, 34, 12, 38, -4, -6, -17, 6, 12, -18, -23, 4, 9, 3, 26, 27, 15, 27, -27, -17, 43, 4, 5, -18, -10, -20, -7, -6, -48, -8, 8, -34, -29, 11, -19, -35, -16, -17, -17, -9, -22, -11, -41, -23, -37, -9, 3, -29, -33, -15, -18, -2, -29, -33, -15, -13, -4, -14, 0, 13, -41, -34, -1, 1, -20, 11, -15, -15, 5, -16, -4, 6, -1, 22, -3, -10, 14, -22, -4, -13, 17, -17, -3, -9, -25, -9, 14, -17, -15, -4, -23, 1, 27, 10, -12, 3, 19, 3, -20, 4, 11, -44, 6, -6, -10, 4, 6, 10, -4, -15, -6, 14, -8, 26, 13, -2, -7, 6, 13, -9, 14, 46, -5, 12, 27, 25, 21, 30, 20, 25, 3, 9, 23, 4, -23, 13, 14, 18, 37, 23, 3, 1, 13, 2, 8, 25, 27, 1, -14, 19, -17, -1, -8, -7, -28, -17, 3, -3, -25, -33, -35, 0, 0, -25, 4, 11, -7, -24, -16, 7, -25, -18, 8, -17, -17, -30, 2, -31, 15, -31, -2, 12, 17, -19, 5, -15, -7, -2, 11, -10, 7, 9, -15, -19, -26, 0, -29, -15, -33, -20, -3, 0, -49, -17, -33, 3, -42, -1, -30, -38, -33, -11, -25, -26, -28, -21, -33, -18, -46, -32, -15, -28, -2]
4310bqK3j0m5L0J5n1N8Mn%J2Jj5J2j6J2oJ5%m3J3LOk2L4j0K0k0LJ8l7J0L4j6j8
4346aJ9j0J6k7L0k0KK2k5%%Kpk3L1j5L0ok0oJ4oRJ8j0j0K2k5rJK2l5QK6j1Jj1
4383dnj6K4J5l3K0JLk3qK4J1k3J2kJ4j9lqPmnJ2pj1L1k7l1L5J4j0k3LJ8j7LK7
4420ek8Kj5LOM0OK6m2lJ0k2J7Pj4LJ1qJ5l9OJ1L9j8mk1m1N0J3j2LJ4j3k0N8l8
4456cJmL5m0j8K9j6QJL7k8Mj3mR%K2j9J8l8J5J1n9M8j5K3%k8K0oNpK2K1l2J3l2
4493b0K0K5k1lmJ5MQk3N3n6mL5l5J7j0JQj3J5rj1J4RLk8j0%M0k1lK1qJ1oj1lj6
4531a6J1qJ6%j8pkj1L7NLj5l%qK8Ll9J0K2l6J1J6mK1rk1N6m5K0%j6J2j2nmK4j8
4569bj4JKK8j9rjK2jJ2j4qkJ4l2J2J0J5kJl8lL3pj2K3J6m5j3M2l2J9kK6l0QK0
$$ y = [-2, -10, 13, 3, -42, -12, 3, -48, 10, 14, 9, 9, 21, 22, 7, 19, 3, 15, 9, 24, 24, -19, -6, -3, 3, -19, 15, 5, 25, 5, 8, 26, -11, -1, 33, 17, -1, 18, 8, 24, -3, 27, 7, 9, 31, 6, 6, 6, 8, 1, -22, 9, -6, 24, 18, -2, -8, 6, 0, 9, 27, 17, 7, 29, 4, -5, -4, 18, -17, -9, 17, 6, 7, -4, -9, -25, -1, 14, -19, 1, 2, 5, -18, -26, -2, 9, -14, -2, -4, 10, -9, -12, -20, -13, -17, -22, -10, -17, -28, 3, -24, -55, -20, -6, -16, -39, -36, -18, -35, -32, -5, -33, -31, -46, -43, -37, 3, 9, 35, -7, -10, 0, -22, -5, 2, -12, -9, 2, -6, 9, -30, -24, -13, 26, 8, 4, -17, -58, -8, 5, -7, -4, 10, -3, -23, 35, -3, -2, -6, 29, -11, -29, 0, -16, -8, -7, 30, 2, 6, -7, -11, -2, -2, 20, 1, 19, -19, -4, 7, -52, -4, -19, 4, 4, -24, -4, -10, -5, -12, 10, 31, -1, 12, -20, 0, 25, 4, 1, -3, 12, 16, 24, 1, 54, -2, -6, 29, -6, 11, 1, 2, 10, -3, 12, 3, -8, 6, 15, 18, -10, -20, -20, 20, -1, -4, 17, 9, 20, 14, 3, 0, -16, -5, -13, 3, 3, -15, -22, -24, -35, 2, 7, 10, -5, -8, -8, -16, 12, 15, -24, -14, 8, -28, -17, -1, -5, 16, 7, -14, 42, -3, 17, 17, 1, 13, 1, -4, -8, 16, -2, -16, -15, -13, 15, -4, -13, -14, 8, 7, 19, 5, -3, -5, 9, -23, -11, -1, 14, 12, 13, -25, -28, 5, -2, -14, 9, 25, -20, -33, 9, -23, -4, -6, 20, -10, -2, 18]
4606A8mrMPl1K3LJ5JjJ6m1lK4j1QKk4QJ5l9K9K7l4QJ9Jk9%LJ7k2mJ5j0r%K3j0
4645Ej5J4Pjnj2J3L4nNm4NK3Km5J4K0J8k6Jl3K6K1lk1J0rK3NqRRk4qM2j6l0pL2
4684B6j8Lj5j2jJ4k0RjL4l6K0j0Jj3K1m0L5j1mlJ0oK5K0p3%N2Lj2OK0j5j8rJ0
4720hnj5K1LJ0k6K8oj6L3m1RJ0j3M0l1J3M0o6OL3kJ5j1k8K5nl4J8Ll1L2oJ1nj8
4756a7K8Rrl0qK6l5L2j9L2j4qk1K2K6Nl8j5LL0oj3L5k0QJk2j4N2lmk5PJ0%J0p
4793HKk1jNNrJ4Ll1J1L5l3Lk0M8l0OL4k5oJ5j3k7K9l4m2O5jRk4K9l2K2NJJ3l1
4830a8L8k6j4JOJ9Kj9KK3j0KJ5l5K9MpMJ3l0j2J5lK3j8%K1m5K6qOl1N0m3K3J6
4866A9m0J7rkJ3QKl7L1%j0K4qpj5K2m6L5j2PJ9J7n1kK3J4nJ8l0K7j3j6%j0L1L1
$$ y = [18, 14, 5, 9, 16, -15, 8, 11, 26, 27, 26, 42, 1, -2, 22, 11, 19, 21, -3, 5, 20, -19, 10, 37, 3, 11, 30, 31, 2, 2, 5, 22, 0, -4, 11, 1, -8, -8, 15, 5, -10, 4, 11, 10, 5, -7, 6, 40, 35, 40, -4, 1, 24, 26, -19, -5, 15, 33, 7, 8, -25, 1, 22, 19, -2, 8, -1, 22, 27, 19, 28, 37, 13, 5, 47, 31, 1, -6, 26, 8, 11, -4, -16, -17, -3, -23, -14, -15, 19, -17, 3, -7, -6, -19, 2, -38, -3, -14, -18, -21, -11, -17, 8, 28, -45, -45, 7, 10, -2, 4, 24, 9, -9, -18, -8, -13, -28, -7, -4, 6, -20, 8, 2, -14, 19, -22, -13, -3, -16, 24, -7, 6, 46, -20, -14, 19, 17, 32, 21, -7, 18, 13, -21, -3, 0, -31, 1, -5, 6, 1, -17, 11, 20, 11, -19, -27, -1, -36, -4, -23, 9, -5, -13, -34, -12, 14, 19, -19, -34, -31, -1, -7, -20, 15, -5, 3, 4, -18, -32, 20, 17, 13, -12, -5, 5, 5, 15, 8, 10, -11, -12, -7, -2, -11, 3, 6, -25, -14, 21, -12, -9, -29, 19, -11, -5, 29, 4, -2, 13, 0, -27, 2, -32, -74, -9, -10, -1, -25, 4, -28, -6, -1, 0, 13, -18, 20, -6, -20, -19, -13, 6, 8, -11, -9, 14, 4, 6, 21, -14, 15, 19, 12, 16, 29, -1, -13, 2, -1, 22, 4, 4, 25, -20, 6, -2, 4, -27, 23, -20, 3, 19, -21, -4, -13, -15, -2, 6, 8, -29, 2, 2, -8, 16, 8, 1, -14, 8, -38, -3, -15, -8, 11, 28, -23, -25, -2, 12, 7, 25, -5, 22, 9, -7, -7, -17, 14, 45]
4902D5m8J9J3j9lk2K8%%Lk3J4J2l3K0Nq%J1J6k3j6J2j3k7L0L1l8L2l0oOJ9k0j0
4937b3j6L4K1m1L0k3K9j3jJ1m5K7J0Qj5K2pj3K0l2J5J2kknnJ8j9LL5k1mRk3Nk
4973cJ1k1J4lJ5k8K5J5j5oj9K5l7J6QRlQk7k1J2L3k3l2M6kk8qK8J9j6K3j0l2K3
5008dl5J9l5N8K5k2pqj9OJ2kOJ6J8k3Qm5J2K7J7l7PjL0k6l5L1K2l2LMN%j2J2J7
5045A2k9j2MK4Pl9K6K2j5kRj4rK1j7J6Loj5M9l8JJ9l7K6k5K4J9j1lJ2j6j0j1K
5080a3K5l1K5qL7k9%pqK9lk0QMJj3pRJ5k1RK8o0J3JJ0joROl4L3lj6NPK7l0Q%Q
5121GJk5J7qj1PK0j0j0oJ5LLrNj4M6rk6l3L6jj9J4LJj7J4nk1JJ8J3j4L7l3Ll4
5159d1L3kJkOqj5J1k9M0j5j1L2Lj2MJ4j2l5L4J4K9j9k7j4K2KNrj1K2Nk3L8k4O
$$ y = [45, -3, 16, 29, 10, 7, -15, 13, 13, 13, 16, -7, 7, 19, -14, 6, 11, 3, 3, 14, 30, 7, -9, 3, -10, -37, -7, 24, -14, 18, -12, -18, -12, 7, -13, -23, -39, -5, 16, -25, 5, -18, 11, -2, -3, 8, -37, -10, 0, 8, -7, 15, 8, -5, 15, -17, -2, 10, 8, 6, 1, -4, 14, -5, -2, 33, 12, 8, 17, -6, -1, -3, 8, -13, 1, -2, 13, -15, 10, 25, 10, 4, -15, 10, -27, -11, -3, 6, 3, 11, -16, -37, -25, 8, -15, -47, -1, -3, -31, -39, -11, 8, -8, 15, 5, -27, -4, -39, -20, -55, 3, 28, 6, -1, -9, -28, -22, -10, -12, -6, 10, 28, 5, 13, -32, -20, 7, 24, -13, -6, -7, 23, -3, -38, -7, 15, -17, -14, -10, -5, -5, -17, -5, 12, -17, -29, -25, -1, 6, -33, -7, 15, 0, -2, 7, -7, -16, 5, -12, 4, 7, 1, -14, 35, -3, -2, 17, -20, 6, -19, 5, 24, 13, 10, 22, 6, -4, -15, -13, 12, -19, 6, -2, 35, 6, 6, -1, -9, 20, 17, -3, 5, 9, 10, -3, -10, -1, 14, -7, 2, 30, -30, -17, -16, -6, -7, -13, -4, 2, -32, 1, -2, -18, -13, -6, 21, -9, -1, -1, 7, 8, -17, 0, -8, -19, -12, 8, -2, -12, -18, -3, 0, 3, -6, -1, -15, 31, 22, -4, -37, -1, -2, -21, -7, -4, -3, -20, -6, -11, -32, -31, -13, 0, -14, 23, -10, -7, -41, -8, -10, -9, -11, -5, -13, -28, -17, -46, -6, -21, -32, 0, 3, -9, -5, 9, -3, -38, -4, 10, 39, 20, -7, -21, 1, 3, 8, -1, -12, 10, 15, -8, 30, 6, 12]
5195A2qk3O2o5K0J6j1J8k8MK5rj8j4J0L7k7J9j9M%j1K2j7j2J3j8K7l4K0k0L6J
5228A2k3j0J5l9L1pmK8j2RQj0ONl2K2J5j9pNlJ6Oj4Rj0J1j0jJ8j2Jk4J7J8l4J1
5265hrOl0L5J0k1Nj6lj7N4o1K5oL0j3j9M6l8j1K4Ok6M6n9K4J8kK5l4j4NJ1J3L
5300ajk5PjK3%j6JmJ7j2M5k2j9L6l8mPJ1J0qml2PL0jj7k4K9j1qpK3nJ2j8K8j7
5338ik0K5Prj8K4J8k1PMj5k0N0l3MK3kk0K1qJ8k5J0jj4MJ0j6J5J9k7J6j5J4nq
5374CK7k3l0M9j5J9k7J4ll1LmkoMJ0jQj3L7k8j3j9K6K1m5M4n0J9J7jj1N8l2k1
5409a6JOj1M1k4j9J8%LJ4k6OJ2j8QK5j6okK0k9K0k4K0JL7o1j1J2oK1Oj5j7L0r
5445ij8K0l9K0J0J5m8N2k9L2j7jj0K2oj5rj5L0k6N3k5LNK1j1mqMmJRK9rl9L1M
$$ y = [12, 4, -19, 43, -22, -2, 14, 3, 21, -7, -3, 22, 13, -5, -19, -9, 28, 1, 20, 1, 5, 5, -6, 16, -1, -13, 0, -18, 9, -25, -5, -25, 11, 12, -11, -21, -6, -45, -14, -21, -25, 3, -9, 0, 8, -2, 4, 9, -23, -1, 14, -5, -12, -7, -10, 6, 12, -2, 7, -3, 8, -2, -3, 15, 3, 4, -20, -3, 15, -19, -8, -17, -11, -41, -6, 4, -17, -12, -28, -31, -48, 6, -55, -30, -36, -6, -19, -38, 8, -30, -41, -17, -11, -37, 9, -50, -26, -8, -10, 15, -19, -33, -28, -17, -4, -1, -2, -27, -20, -21, 2, 2, -14, -13, -17, 0, -12, 33, 11, -8, 28, -10, -14, -7, 4, 14, 6, 2, -30, -23, 7, 6, -11, -35, -6, -17, -25, -32, -9, -14, -2, -20, 8, -9, -29, -4, 3, -6, -24, 0, 18, -3, 4, 8, -7, -27, 23, -10, -6, 17, 15, -5, 16, 8, 26, 1, 11, 10, -4, 0, 10, -6, 9, 28, 1, 17, 2, 16, 11, 3, 30, 7, -23, 26, 11, 30, 3, 17, 14, -17, -14, -18, -20, -26, -22, -12, -13, -5, -18, 19, -9, -22, -41, -15, 6, -39, 5, -45, -26, -9, -10, -21, 37, 5, -16, -15, -9, -20, 21, -3, -22, -4, -4, -1, 13, -13, -7, 5, -13, -5, 20, 4, -2, -4, 16, -13, 7, -17, 3, 4, 41, -20, -31, -19, -25, -4, 2, -13, -30, 0, -9, -27, -7, -46, -26, -16, -1, -49, 3, -26, 6, -11, -12, -22, 0, -6, -21, -30, -45, -15, -41, 12, -13, -10, -5, 16, 5, 1, -7, -3, -7, -6, 3, 32, 23, -16, 15, 19]
5482A9j6K0k4j2L6k4QPK8n2K9j4OJ4n5K2K3J1k3j0j1J7oJ6j0LJ7rj7Nk7QPJ2J4
5517A2j4qJ0Rk0J0j9K5j8J9rJ6ormk1L0lmLj5N3n2MORjqr%j7L9j1j2k8L4Qk4J2
5556a3j0kJ0k3K1Qkpj0rPmL0l9J7JK8k2J4Pk8K3j9qK2L3l1lj3O2m6K2l4K3j1l4
5592d0M0rK3j4mK2k6M3m0J2j0J5l3N0j5j9PJ2k7K4k1JN4j7k2KL1k8qoKLk3qL6
5627Gj4JQoj4L2j2j1K8J3n0K3K7j0k7K6omJ2Oj3j2JJ1oRJ2k0lk1K7k%J7m9L9j0
5664IL6l6rj9L1k2opK1j7pK0k5QJ8j1kKj3oJ9J2jJ2j7Kk8L0rJ3%m%j7K6o%j2J9
5703Dj5J9K0k2J5oj8j3oM3j9J6j0J1k2jL7n7L4qj4PJ0LrMj8K4j2j8M5k0l5MJ1
5738a6%j6J0j6K7j5Rk1ML0j3LnJ4k2MJ0K4lj1j9M1l1j1K7J7j6Npj0K1kk5JJ8k
$$ y = [19, 3, 23, -1, -13, 23, -1, 7, 14, 42, -10, 19, 5, 11, 25, -30, -8, 15, 26, 3, -7, -18, -1, -7, 9, -1, 2, 19, 10, -7, -2, -29, -21, -14, -2, 12, -2, -10, 0, 9, -11, -1, -20, 5, -13, 6, -3, 13, 7, -2, -6, -27, 3, 0, -4, -1, -16, 37, -15, -11, -5, 4, 3, -5, -14, -14, -31, 8, -3, -15, -43, -9, -1, -25, -13, -23, -25, -15, -38, -17, -9, -11, -18, -28, -37, -30, -34, -4, -43, -26, -25, 3, -19, -5, 2, -26, -3, -22, -30, -8, 25, -6, -9, -22, 40, -6, 16, -18, 5, -6, -40, 0, -9, 14, 0, -4, 18, -8, 35, -5, 7, -3, 12, -21, 29, 14, -5, 2, 14, -13, 11, -10, -9, 45, 28, 6, 8, 39, 11, 3, -3, -1, 2, -21, -29, 7, -7, -6, 2, -4, -18, 14, 2, -9, 19, 32, -18, 5, 32, 22, -5, 21, 15, 11, 23, 29, 16, 4, 5, 16, 10, 19, 31, 11, 8, -13, 14, 12, 12, 29, -20, 19, 9, 45, 9, 0, -19, 12, -10, -16, -23, -2, -19, -26, -6, -31, -23, -5, -16, -18, -16, -29, -35, -16, -4, -5, 7, -10, -8, -36, -6, -15, -2, -2, -6, -6, -23, 3, -3, -3, -15, 4, -11, 8, 28, 6, 21, 15, -3, -16, -22, 21, 2, 18, 8, 19, -3, -4, 33, -24, 10, 2, -12, -5, 5, 8, -1, 3, -15, 9, -3, -21, 24, 4, -31, -27, -16, -16, -32, -22, -38, -11, -26, -17, -38, -34, -4, -17, -14, -19, -5, -27, -23, -13, 11, 8, -3, -22, 19, -12, -23, 4, 21, 5, 10, 3, -7, 14, 12, -13, -12, 6, 4]
5774DrK0j5J0l8N6l2OJ9l5Nj4kj0M5J2k3MNj9K0kqJ9k2L5mk1j1k0lK4nN8m1j4
5810fK0Ok3pj7L1J2qk1J9lnK6j9rL5k1J3j5j1J1l1J6MK4ql5J1pPLj1J1k5qRMj
5848b9J5j5J5lj6JL5j6Pj8Ml6K2K0jj1J6k8J5pL4k2j5J8K0j6K5j5%J0l1M9o3N
5882c1K8k3L0LLMOj6j3J0J1J2k6K4l3LJ0mj1J3j1L0J0m3j1l1O0Rl5K6k5J3rO0
5916D3n0j0J9k3MLK2j4J7qRj3J2j1J3j2ooJ7J4k0k3K3rK1k3K1qj2k1M5j7j2L1
5950A6Jj6J1k4Kj7L2j7K8l0K2k5L7kk6QlJ3nnj8jQj3J8k6LJ6qJ6qJ5jnqJj6J0
5988a7k3L0J7mjjoj3M8m6K1J2J4J4l9pj0nJ6mK3m4J0J2k1J9J8m4K6k0J8pj3L8
6022A1k2jM4l7mOj5M0k2j6J4nk2PK4j7J8K3l8JRJK7j9J0j7j2K0J6j0j8J9j0J3
$$ y = [4, -5, 15, 0, 10, -28, 28, -4, 2, 21, -14, -9, -23, -25, -35, 10, 22, -1, 3, 8, -11, 9, 7, -1, 18, -4, 31, 27, 6, -5, -25, -28, -4, -9, 49, 8, -6, 14, 20, -3, -10, -27, 4, 16, 8, -13, 6, 3, -2, 24, 5, -4, 31, 10, 23, 8, -3, 8, -23, -7, -3, 21, 13, -22, -11, -18, -11, -8, -19, -8, -33, -41, -32, -28, -29, -14, -29, -14, -17, -33, -32, 3, -13, -6, -24, -20, -56, -34, -14, -15, -26, -10, -38, -23, -30, 4, -18, -33, -15, 5, -11, 14, -1, -1, 9, -22, 27, -36, -31, -3, -26, 4, 7, 10, 14, 20, 4, -9, 1, 12, 24, -2, 22, -11, -8, 2, -2, -13, 0, -11, 19, 29, -14, -25, -56, 4, 13, -22, 4, -21, -8, -17, 43, -7, -17, 2, -21, -17, -14, 8, -6, 11, 3, 12, -1, 11, 0, 13, 1, -5, -11, 6, 20, 0, -23, 0, -9, 12, -11, 10, 2, -10, -31, 14, -3, -15, 16, 17, 1, 12, -12, -10, -27, 5, -12, 16, -14, 8, -17, 20, 18, -8, 0, -3, 10, 5, 0, -18, -19, -11, -24, -6, -32, -29, -13, -21, -5, -13, 2, 1, -4, -12, -11, -27, -17, -40, -10, 7, 3, 2, 1, -5, -18, 30, -16, 5, 17, 31, 45, 6, -1, -11, -16, 0, -4, 19, -25, -15, -3, -24, -5, 13, -31, -5, -25, -7, -14, -27, 11, -11, -12, 32, -5, -9, -3, -18, 22, 0, -16, -2, -7, -29, -22, 2, -15, 3, 26, -12, -11, -2, -1, 26, 7, 17, 0, -12, 8, 24, 14, -4, 15, 5, 18]
6056A8j6Pj0J8lK8j0m6J4J8kpj0mJ4Pn0M3J4l2KjLk0KM8j8k0J1kqk1K5PRl6j1
6093c9J8L6m4L2j7LOk3L2j4JJK6j2l2K4k6M3k8K3l3L6n2M0OPp4N0pOK4j5J6ro
6128aOk0K3k0J9rk8K7k1j5M6o0L0kpK8k2K4l1j1K8j5L1rl0K6j0Rk1J4jJ5K2k4
6162ioJ9lOpj5JK5K3m0K3lj4Ll9J4J1j5L8j4PJ0j9oK1k5j6J0o%J0%pK6pRlj0k7
6201c5J8oJ8j0jPOK8k7NJ3j0J7qj1J3J4k3k4K4Qj2rJ9m4L0k1J2L4l9k6L8j8L6
6235A6NrrL4qk0J2mKl1J5Mrj6L9l9L0k2j2N0n0k0K9J0%MoK0j3j8pj2K8j7J3J0
6271ak4J1K4J5j3jj8K0lj5J9k5J5Pk3MK0NmoK1j0k9rkN1k8k7K7j0rK4k3K5k3j2
6307b7K7J5m1J4kJ2j7jj3PLPq%J6%K0j3lnK1k5j9LK8QnmJJ0Pj6jJ5J9j6j6J7l7
$$ y = [18, 2, 9, -1, 17, 14, 42, 32, -14, 0, 18, 16, 9, -1, -5, 9, 16, -34, 9, 23, -9, -7, -8, -5, -25, -23, 25, 7, -13, -2, -4, -12, -33, -8, -1, 8, -28, -39, -21, 15, -29, 3, -14, -11, -5, -28, 4, -10, -9, -8, 18, 6, -26, -2, -28, 15, -13, 10, -23, 13, -39, 1, 7, 14, -60, -10, -17, -11, 13, -2, 14, 5, -1, 5, -15, 8, -12, 7, -2, -30, -3, -24, -39, 7, -53, -23, -25, -32, -4, -26, -2, -33, -44, -16, -31, 0, -9, -39, -13, -23, -14, -35, -21, -22, -7, 15, -9, -15, 4, 1, 7, 0, -15, -14, 11, 34, -6, 17, 14, 0, 3, -36, -22, -11, -26, 12, -2, 5, 15, -4, -10, 11, -14, -30, -20, -26, -26, -16, -16, -23, 3, -4, 5, 2, -8, -35, -17, -23, -5, -15, -16, -9, -3, 25, -2, 3, 16, 6, 23, 15, 4, 17, 31, 8, -16, 8, 16, 4, -5, 14, -30, 0, -21, -9, 25, -14, -40, -2, -20, 16, 21, 12, 3, 37, 29, 9, 21, 17, 19, -12, 3, 7, -2, -18, 21, -18, 12, -10, -22, 28, -22, -42, -13, -3, -3, 1, -5, 15, 2, -16, -23, -35, -7, -24, -11, -1, -25, -14, 10, 25, 12, 11, -7, 13, 10, -5, 14, -11, 4, 11, -12, -8, 12, 17, 13, 7, 28, 18, -11, -20, -22, 29, 1, -26, 1, -9, -18, 6, -17, 8, -15, -27, 0, 15, -26, -12, -14, -2, -19, -20, -33, -26, -23, -16, -24, -24, -8, -8, 12, -1, -4, -9, 12, -13, -32, -29, -1, 7, 2, -2, -1, 9, 16, 0, -1, 14, 33, 17, 1, 18, -19]
6346a9M4m9L2J4l3LK8n0J5qK9Nj3MKk4K7Nk6J8kj3K7oKk1K0j4j2rJ4RJol2M6j
6383Gj5PJR%j3j1L0lLNJj0j6OOJ5%j1j0K5mj8Lk2NPNK7ll8K0%j5OJ6j6K9m2j6
6423c0J8J2k5L1j4rK7rl2J6k1RM3j2l5J9JQj0mJJ2Nn6N3K4l9QL3k0j6NPrJ4J8
6459B3pk2P%K5l9L1m3KK7PJ0jopMj9J4pj9J8j1J4K1l6J1lkNj3K8l0J8pK4k4J4
6496GK0m6J7pjM1l2LJ1k8L5k8J6kj8K2OpLj5rK3J9k3kPmoK7j8oJ2k6kkJ9prJ3
6535Cj8%kj4J7J3l0Kqj6L9pK2j9K5m4K1Ml2J3K1K1k3KL0qj9J4k7%J9j6oK8j0K5
6571B0j9noJ0oK8l8K4j2pRK1j1Jl0J6kKK0pk1oM1l4JJ2j1mJ9l3PK7kjj8J8m7L5
6609iJ2qj3PK7mj6j5M6n2J5NkJ2J8k4JK7Qql2Qj5NK6j5KkmJ5k6OL4j8mkl5M5n
$$ y = [-19, 25, -24, 8, 22, -11, -8, 20, -30, -15, -23, 6, 11, -2, 2, 4, -20, 7, 12, -14, 4, 2, -11, 16, 10, 12, -9, 11, -3, -15, -24, -10, -1, 0, -6, -38, 8, 7, -8, -1, 0, 9, 9, -4, -15, 15, 12, 15, 20, 21, 11, -5, 1, 7, 22, 22, 11, 1, 26, 22, 4, 7, -15, -10, -3, 2, 29, 26, -12, 8, 8, -7, -1, 15, -1, 28, -14, -30, -12, 0, -25, 6, -8, -17, 10, 1, -31, -15, -36, -27, 16, 4, -31, -12, -11, -3, -13, -17, -16, -4, 1, -55, -2, 22, -17, -9, 24, 4, -12, -7, 0, -9, 5, 23, 16, -6, 1, 1, 26, -13, 18, -25, -23, 4, 11, 21, 20, 14, 7, 11, -8, 6, -1, -20, -2, -13, 1, 22, -14, -3, -6, -8, -3, -16, 12, -18, 0, -7, 17, -7, 7, 27, -19, -2, -9, -10, 31, -1, 2, 13, -15, 20, -8, 8, 6, -12, 10, 16, 9, 12, -3, -12, 11, 30, 7, 5, 12, 8, 2, 29, 11, 5, 17, -9, -11, -13, 6, -1, -10, 3, -15, -15, -17, -31, -14, -1, -31, -29, -37, -53, -14, -21, 1, -18, 7, -37, -16, -12, -44, -31, -10, 11, -12, -10, 20, 12, -7, 7, -20, -20, -1, -17, -23, 5, -5, 20, 1, -4, -10, 0, -6, 22, -16, 8, -4, -11, -2, 19, 8, 9, -21, -5, -7, -5, 15, 8, -13, -19, 22, -12, -11, 1, -10, -14, 5, -28, -21, 6, 4, 3, -15, 3, -44, -9, 3, -5, -18, -11, 16, 12, -4, -19, 27, -25, -10, -5, -7, 5, 23, -1, 0, 27, 35, 27, -5, 3, -12, -7, 19, 4, 6, 4, 0, 15, -11, -5, 29, 11, 7, 5, -30, 15, 10]
6648A0j5j5k2L7j0MqPJ5l1PnK8J6j6poj5N1l1Mqj7K4Pk8L1j3j2K3lm%lRj0j7M
6686a9L0QLk1qK9j1Pj2Pjj1lljQrL4n4J5oNPk6J1oOmJ1j8J8NJ0k0OJ1qkj5J2j1
6727b6LJJ4m%L0l2k0K7OJ1n4N0K1k8K0k9K8k1QJ2nKnl1K5J4J0Jj5K8l1j7K5m4
6762b6M0j5nL3j1k3PJ4m4J3J1K4l7lL1k3Mj3K1l2QK8J2j8k9N1m3K4j1J0K0olk8
6796a9K5qPj4M2m0qJ2lJ7Mj1J4jj5M5n1J9k9L8k7NLj0LJJ4j5pj4L7k2lLk7M7m8
6833c6pN4j2k2mL0qQRPj6j9ROj8J6K3m4L0nJ4jQ%j7KqqJ3j1L1j8l6J7J5J7K3m6
6871dN7k7Jl1lNK5k9rJ0Nk2K2j1KJ9j3j2J1K4j3l3M9ml6K5j9JJ4ok0K5lP%kPJ
6909A3k2L2k8J8L8p4N2k5OJ1k2PJ2%Pj9ojJ2Lj5M2k7Nj2nmJ8k2rK6Jj6KnLplJ7
$$ y = [10, -5, -20, -42, -5, -15, -11, -19, -12, 3, -28, -21, -26, 2, 18, 2, -5, -11, -26, 25, -6, -2, -10, -27, -3, 4, -24, 7, -6, -18, 5, 2, -2, -2, -5, 4, -6, -23, -19, 11, 19, 22, 1, -7, 22, 11, 18, 6, 13, 12, 1, -2, -5, -6, 2, -7, 27, -27, -12, -18, -13, -6, -32, -21, -27, -21, -25, -14, -32, -14, -9, 1, -19, -13, -2, -10, -12, -27, -15, -26, -23, -22, -8, -12, -12, 18, -14, -34, -7, -1, 10, -44, 6, 27, -1, 19, -10, 18, -3, 5, 17, 12, 14, 9, -22, 3, 17, 27, 28, 13, 41, 10, -7, 18, -26, 14, -1, -6, 27, 16, -7, 0, 14, -30, -17, -6, 18, -19, -22, 9, -14, -10, -23, -2, -34, -26, 2, 14, -4, -33, 18, -25, -1, -12, -2, 18, 12, 9, -19, 6, -2, 5, -9, 33, -7, -15, -3, -6, 11, 15, 4, 18, 17, 2, 47, -4, 15, -14, 24, -3, 2, 5, -5, -2, -1, 13, -2, -9, -23, 14, -8, -11, -8, -35, 12, -36, -43, 11, -1, -23, -27, 3, -5, 3, 12, 19, 3, -16, -7, -1, -19, -3, 20, -24, 6, 1, 15, 14, 22, 22, 5, 7, -1, -9, 4, -7, 24, 6, -30, -13, 2, 19, 42, -4, 53, 26, 27, -4, -7, -2, 23, -6, -15, -5, 0, -22, 0, -11, -9, 10, -3, -15, -4, 20, 7, -26, 23, 19, -17, 8, -11, -10, 4, -2, -22, 3, 0, 7, 7, 5, 12, 13, -9, 23, -5, 13, 51, -23, 29, 4, 10, 21, -1, 6, 18, 18, 25, 6, 0, -1, 11, 14, -1, 41, 14, 19, 7, 2, -2, 16, -6, -15, 11, 12, -4, -2, -7, -4, -11, -14, 3]
6948Clj3J3rqK8j8NJ4l7K4mMl0N4k7oJ5j3J3pRj1L1k4PJ5j2kk8JK5k0M2m4mK2
6985EK7l6pJ4j5M5j1J1nk0m2OJK1J0Ok6rLJ3oJ9k3K0pj0J8Jl8K5l2ON1j4J4j8
7021cJ5orJ3mk3K6j3nJ5K3k7oj0NL1mj5J9r%plK8k0k1K8lk0M3m7Pk7J5K3k1NJ3
7059FpnJ0Jrj1L4j9j3J3Jlk2J4K5NlOk8L0l2L7j9n1N0J3Mj4K3l7QnJ5J3j5KKl5
7097a6RL3k3%lj3K1k%j4J6k7QJ0j2J3k1RqOK7m7N2%k7lLrj3K9nJ2%J0k4J6%k4
7135a7NJ4KL6n2%j1K2Jj9J4L0l4J6j3QJ2l2M5j7j3%LJ6k8NkJ7KlqJ2pOnJ2l3K
7173a4M6m7K4Jm0K8j4j6K5qL1m3J8J5lOK4j6Jj8QJ0mOj9J2oJOLnRQk2Nk0M7j8
7211B1k3K9j1k5J4J3Nj1%J0qJ6k6j1J0Mj8J4Lk3OPk8M1j8J3j4j5lK0NRoQJ3j9
$$ y = [3, 0, -13, 0, -9, -17, 11, -7, -2, 12, -25, -1, -5, -1, -31, 23, -4, -10, 5, -8, 5, -2, 7, -4, 27, 3, 10, 25, 13, 11, -17, -16, 9, -11, 31, -13, -17, 5, 32, -4, -11, 3, -12, 33, 22, 33, 28, 8, -34, -28, -27, -6, 4, 10, -16, -25, -22, -9, -15, 4, -19, 1, -6, -16, 2, 3, -35, -10, -42, -36, 15, 1, 15, -3, 12, 6, -3, 10, 6, -17, 9, -4, -9, 6, 29, 2, -4, -14, -9, 22, 18, 3, 22, 13, 13, 6, 3, 31, 11, -10, 18, 15, -5, 38, -9, -2, -29, -14, 9, -12, -7, 6, -1, -6, 4, 5, -4, -15, 19, 0, -13, 0, 1, -2, -24, -10, 15, 20, 17, 23, -5, 25, -7, 30, 11, -40, 10, 23, 27, 13, 36, -1, 7, 2, 17, 30, 15, 17, 19, -16, -7, 26, 3, 3, 0, -13, 8, 6, 6, -8, 8, -19, -11, -1, -13, 0, -21, -12, -20, -14, 13, -34, 18, 18, -9, -12, -9, -18, -31, -2, -7, 5, 5, 15, -9, 7, 7, -17, -12, 2, 4, 40, -12, -12, -23, -1, 0, -19, -5, 25, -9, 7, -6, 2, 14, -18, 27, 10, -3, -3, 0, 16, -12, -7, -9, 8, 10, 7, -1, 11, 4, 10, 5, 17, -16, -14, 32, -15, 9, 10, -30, -2, -16, -32, -7, -15, 16, -27, -9, 6, 3, 9, 33, 17, 18, 0, 8, 18, 14, 20, 1, 13, 7, 8, 14, 17, 12, 21, 29, 7, 12, -8, 39, 21, -2, 27, 16, -9, 5, 18, 23, 12, 12, 22, 14, 30, 4, -7, 3, 7, -11, 3, 6, -17, -11, -4, -32, 9, -9, 4, -10, -25, -28, -8, -3, 6, 0, 8, 21, 2]
7247BnkK3l7K3RRq%qQL1l7j4Nj5M7m3K9Qmk7L6k5NK1n0L6J9l0ljNl4K5J9Pm2K3
7286Ej3j9O2n2oK3J3k4K0l9K1Jl1K7lJ0j4Qk8J8Rj3M4l0L0K4j7j7mOMj%l3K5j0
7322dK9rj0%J4k7K9j1j0J6k4K5J5ok0J1j8QMkMk2JJ8j4K0l0QRKrL1k8K4j9kL1
7359C4j4k3N%Qj1K1k5J6J5J2k9JJ4olqkJ6j3J7j2jj2lJ1j0K9k7JJ3Qk1lMQr%j
7398@rK1m6L8j1j6qJ5J3Mk8L4l6%L6l6J2mJk6L6J8kRl2M2j8Oj8K0j4Mk9QK8q%
7435Dk3L5j3J5k6j2K0%K0k5L3n7N3nk2J4J3l7Rq%M6o5L9j0J5mj6J3oj1K2J0ol6
7470b1RK2l3L7j1J4jk2J0j4N1j9pnrLK2l7%J2K2k4J7J1j2Jk6J6jMl1N8m8K1oj5
7506a2K1j2oj1L7J4l7L8k9j8J4PQl8L4k1OmQnqK3J0j9K1oj1Lkj1j7K4j3mj3nN5
$$ y = [2, -3, -5, 18, -19, 4, 13, 22, 14, 14, 6, 14, 45, 8, -6, -1, -16, 31, -12, 17, 25, 21, -6, 30, 5, 10, 31, -19, 17, 36, 6, 3, 2, 7, -27, -2, 17, 24, -18, 5, -8, -27, 35, -17, -23, 0, 13, -11, 9, -30, -9, -8, -39, -12, -15, -5, -19, -11, -39, -21, -12, -25, 19, -11, 19, 43, 26, 9, 5, 11, 15, 14, 14, -19, 6, -4, 25, 16, 6, 6, 20, -7, 22, 11, 1, 17, -7, 18, 33, 27, 7, 18, 0, 8, 12, 10, 14, -8, -7, 11, -3, 17, -13, -5, 4, 6, -3, 28, 0, 24, 5, 3, 34, 20, -3, 2, 2, 10, -1, 20, -5, 11, 26, 38, 9, 10, 24, 18, 15, 7, 5, 21, 8, 25, 13, 12, 0, -3, 8, -2, 27, 0, 1, 14, 22, 1, -2, 2, 10, 1, 1, 0, -9, 12, -34, 4, -7, -23, -31, -16, -3, 1, -27, 7, -29, -29, 7, -29, -17, -21, -20, -46, -10, 8, 6, 15, -17, 25, 7, 13, -5, 15, 1, 5, -24, -16, 12, 4, 4, -19, 16, 3, 18, -8, -20, 0, 0, 20, -5, 28, -29, 24, 19, -3, 11, 24, -13, -4, -12, -12, 34, -31, 8, -2, 13, 9, -7, 6, 0, -11, 11, 21, 15, -21, -12, 10, -23, 14, 3, 17, 16, -6, 4, -10, 41, 22, 15, 10, 1, 4, 26, -11, -11, 1, 23, -1, 16, 27, 15, 16, -10, 6, 5, 9, -22, 36, -12, 9, 3, -12, 9, -3, -9, -20, 17, 31, -6, 32, 3, -15, -1, 6, 14, -24, 10, -11, -5, -9, -1, -6, -14, 9, 19, 0, 21, 15, 4, 7, 5, -6, -23, 1, -12, -16, -29, -34, 21]
7543B1j1k0K4j0j1L6k5K2k1Rl6K0J5j2j6L6k2k3L9j7J8nJ9j9k6J2K8j6m6M7J0
7574B0k0Jj4mrJ1J8%pk8OK2k5K0klJK1qoJ2k7ML1Lmk1MK7j7jNLj5NJ9jm1J6K2
7614A8Jm9O7k4mnj4M9m9K1k7K6J3nKmok6MKOKnLj1j3M5j7j0qL2j7rJ9KkJ1mmj2
7654bkK4l4pL8j4j0oJ8j1L9mRm4J4j8M5Lj6l4pMNK1k2j0N2n4N0k1rj8J9j3RL0
7690B4k3mk5J7%kL1ro%j8pKJ7Lo%nJ0K8n8J3K5Kj5RnJ5Kj2L5k6jKMj1Qk6K9m0
7730b3L6pj6K8j1Rl0J1J1J5k7K3l0K0j4jj2NJ5j8nKJ7J0k0%K5l4K8Jj9K1lj1k5
7765b9J2J9j6K4j0oK2j2lL5k5l1J6N8l8J0j7NJ1j9K1lm3M0kj6oJ8m3L3QJJ7j4
7799A7K8l8j0K1pnj4J3l5J7NOK1n5L2lPMJ3Mk8OK1j3oj8J7k9OJ8J5j8L0j2K4k4
$$ y = [21, 10, -10, 14, 4, -7, 29, 4, 26, 5, 14, -22, -2, 13, 1, -15, 21, -1, -24, 15, -2, 16, 11, 30, 11, -15, -3, 25, 9, -37, 10, 20, 0, 1, -13, -17, -26, -15, 3, 3, -4, -32, -26, -4, -29, -9, -11, -14, -13, 8, 0, -6, 6, -21, -17, 14, 17, 13, -8, -4, 23, 6, 5, 10, 13, -2, 3, 22, 21, -20, -4, 18, 19, -30, 37, 13, 9, 4, -10, 39, -10, 11, -16, 10, 23, 18, 20, 16, 10, -16, -12, -10, -4, -2, -7, -4, -15, -28, 17, 0, -10, -18, 14, -3, -12, 7, 9, 7, 18, 14, 10, -2, -4, 20, -14, -21, 17, 3, -7, -13, 5, -6, 33, 29, 38, -6, 8, -10, 35, 38, 22, -12, -19, -15, -10, 11, -11, -21, 31, -23, 27, 6, -3, -21, -2, -15, -6, 24, 1, -3, -28, -11, -11, -13, 18, 9, 3, 3, -15, -22, -20, -3, 0, -6, -6, -11, -1, 27, -31, -18, 7, 9, -6, 3, -2, 13, 15, 3, 38, 12, 11, 13, 17, 6, 14, -12, 17, -23, 13, 6, -10, 18, 7, 16, -14, -3, 8, 23, -4, 19, -11, 9, -5, -6, -18, -13, 2, -16, -21, -19, -2, 8, -12, -12, 13, -21, 7, 8, -11, 10, 7, -4, -29, -17, 2, -14, 10, 0, -6, 16, 4, 1, 36, 11, -20, -4, 54, 16, 26, 9, 14, 25, 6, 27, 24, -19, 21, 19, 3, -3, 15, -28, 5, 13, 14, 31, 17, 45, 7, -3, 18, 11, 6, -8, 5, -30, -13, -8, -2, 19, -36, -4, -7, 0, 4, 17, 21, -7, -1, 20, 7, 1, -17, 0, -29, -23, -5, 10, -8, 22, 10, 34, 10]
7835A0K5k8mN2p0K1J0mkL0n3K7oj1PJ8j5k3K8jj2j0oKoJ4l1M0j3Nj5J1Kk0K7k2
7871b3K0qjK1Qj3qMj2KJ6l3J0J9j4Qk5K3nM0j6j0omloL7pJ2ll%qJ6m7K0Lj7K0
7910GKJ3j6j7NL0l8j2L1j3k2J5j7L0%j4J7J6j5k5K1pkJ0J1Kk0J7k0NrK8qj4k5
7945c4O7k2pL3k4J%k4J8j6N0k1kNnP%k0K2j5nnk1J8Pk0K5Ok6L9l5j4j4K9PPj6
7982eNjj1Pj2PJ1kmmMJ5kOk4kL1l2J1j0M0Lm0j0K0oM6k8joNK4J0j8j1J3m8N0k3
8021HJ8k9NLK7l5jL2JK3o3KJ0k4L9l1J8j1J2ll5L7j7J3k0J8j2MkMPOj8L2j2j2
8057fJj4jJ7J7k4L5qj7L1j9j1RRjl1kM2n2M8l8K7j5M5m4j1j0K0k4M2j2m8K7kL5
8092A5mJ8k8j4jNK0mnpl6M9k0j5QjK7Lll0RK3m4L3Ok7J9kJ4J5k3J1kOk9L0Qj2
$$ y = [10, 35, 7, 3, 55, -15, 6, 16, 12, 10, 40, -13, 14, 8, -3, 4, 22, 7, -16, 12, 11, -1, -11, -17, -15, -21, -7, -38, 2, -11, -6, -21, -10, -8, -28, -1, -23, -3, -11, -12, 9, 17, 4, -4, 0, -12, -10, 6, -27, -17, 2, -12, -4, -29, -6, -11, 29, 13, 3, -3, -7, -10, -16, 21, 14, 26, 23, 20, 20, 12, 28, -19, 1, 4, -13, 7, 9, 22, 6, -11, -6, 24, -14, -26, 5, -8, -30, -15, -32, -2, -2, -16, 1, 17, 2, -23, -2, -9, -11, -1, 10, 12, -8, 9, -11, -6, -15, 13, 5, -9, -34, 33, 11, 4, 37, 13, 14, 14, -10, 8, -8, 42, 21, 19, 24, 19, 26, 26, 6, 28, 13, 8, 3, -18, 0, 7, -13, 12, 18, -8, 31, -4, -18, -32, -3, 4, 11, -5, 0, -1, -12, -5, -17, -10, 1, -1, -5, -9, -5, 10, 8, 14, -10, -12, 19, -13, -2, -12, 28, 31, -9, -19, 1, -5, 41, 13, 12, 6, 11, 35, 45, 27, 16, 29, -19, 31, 8, 26, -3, 2, 5, 32, -3, -4, 28, 29, 52, -11, -9, 1, -23, 16, -15, 3, -8, 4, 1, -34, 3, -14, -1, -21, -3, -15, -11, -13, -9, -2, 4, -14, 18, 6, -6, -5, -19, -20, -3, 14, -10, 25, 17, 0, 31, 12, 1, 10, 19, 18, -13, -15, 27, -25, 23, -15, 12, -3, 42, -2, -13, -23, -3, -27, 15, 3, -45, -18, -20, 15, 11, 29, 1, -13, -14, -9, 11, 7, 2, -5, -41, 8, -12, -27, -19, -20, 7, 10, 7, -23, -14, 9, -35, -2, 4, -23, -4, -6, 8, 23, 0, 11, 9, 15, -14, 16, 24, 12]
8130A2j6K4k6J0MKmj0j1j1L9l0L4j8k1J8MK9n4J7ORk3Nj1K3k0NJ2Oj0J6l7J6k0
8165c1K7J6k1L1l1Roj4Rj9K5LRj1rlJ7j7L3lqJ4k3J3J4k0
$$ y = [12, -4, 20, -6, 4, 8, 10, 6, -4, -15, -26, 13, -17, 17, -1, -22, -4, 0, 29, -25, -8, -2, 7, -16, -11, -22, 1, -19, -14, -2, 4, -6, 10, -27, -11, -31, -4, 12, -9, 22, -9, 0, -6, -20, -11, -30, -5, -2, 7, -4, -13, -16, 1, -16, 17, 14, 6, 20, -3, 10, 24, 4]
8191D
$$ Imaginary data points
##PAGE= N=2
##DATA TABLE= (X++(I..I)), XYDATA
0@%%%%%%%%Qj6J6j6K4l2M0m8N6o4P2q8J04j20J44j68J92k24K56k88L28l73M19
31B22m70N28n92O61p38Q20r10J012j124J245j379J526j690J874k076K305k565
48a351K862l206L607m086M670n396O328p584R376j2158J7117k8719J05654J01524
62A88638p0590J2839r353Q198J265J1825k0578j4635j4906n999r076O575J667
75H5870J296r315j8658k8900j1156k47J148K963J4000O49j9863k5547j1651P32
89a8679J0204O509m291j3384j6932j9440p363J0010J0923J858M241R55j7300k1452
103g4141j480J0032O068O220O313n331j3510q184J63P478J4942J2932J658o661
117d3501j0356j1048j241J3409J5626P322J604l073r302p392L698J2578J4208
$$ y = [0, 0, 0, 0, 0, 0, 0, 0, 0, 8, -8, 8, -8, 16, -16, 24, -24, 32, -32, 40, -48, 56, -64, 80, -88, 104, -120, 136, -152, 176, -197, 222, -248, 280, -312, 349, -389, 431, -479, 533, -591, 654, -725, 801, -889, 985, -1091, 1214, -1351, 1511, -1695, 1912, -2174, 2496, -2900, 3428, -4156, 5220, -6938, 10179, -18540, 87114, 188638, 118048, 130887, 121534, 129732, 130997, 142822, 122244, 107609, 92703, 86704, 77628, 84203, 85870, 87166, 77851, 59193, 30293, 19137, 18890, 20038, 23001, 37001, 37650, 17787, -7760, -19411, -18679, -8475, -1966, -6257, -19641, -36573, -56013, -63376, -53366, -42443, -40585, -36344, -35389, -52689, -74141, -75621, -65589, -59521, -53301, -46988, -52319, -65829, -74013, -73850, -66372, -51430, -38498, -36840, -43501, -53857, -64905, -66146, -52737, -37111, -29789, -28185, -31258, -40560, -47952, -44254, -31676, -17468]
130a7468R670j1q157q532l900K835J1530J4330O526k465n805p830p137K465J2609
145a340J2089M173l157q668j0196m000N282J0043R331M186l915r647q726k844
159g389M325R712R435K787n293r516q536k730N029R587Q028J524n986j0235q359
174g617j334O169R306O813k9o627r459p094m00O661R146N683p00o462q985o318
190a1247N92P108Q771N183j372p035q539n183J347P479Q901M264k631p031p642
205g035m372K155P956Q311L218l300p210p130l072K985P503P712K851l862p316
220f06o352k549L033P844P552J650m745p203n821j423M406P934O330Q21m857p408
236a394n447m01M549O955N658N17n230p047m292K93M693P050N081n56n860p127
$$ y = [-17468, -7798, -7809, -15966, -24498, -28398, -25563, -14033, 297, 6823, 4358, -1447, -9277, -16414, -13949, -1340, 10749, 14922, 11765, 3097, -7099, -11099, -5817, 4226, 13557, 17743, 13828, 4181, -4545, -7389, -3064, 6648, 16083, 18870, 13577, 4061, -4475, -7205, -2176, 7411, 15439, 16963, 10977, 742, -7617, -8951, -2782, 6524, 13337, 13308, 6681, -2778, -9872, -10272, -3611, 5535, 11218, 10518, 4056, -4929, -11247, -10655, -3547, 5224, 10407, 9035, 2000, -6539, -11722, -10375, -2896, 6005, 10269, 7638, 607, -7035, -11407, -9252, -1296, 7015, 10233, 6933, -277, -7407, -10479, -7494, 9, 7721, 10572, 6710, -606, -6958, -9507, -6474, 1370, 8922, 10572, 5827, -1376, -7197, -8620, -4214, 3720, 10050, 10871, 6014, -1394, -6841, -7242, -2693, 4262, 9920, 10437, 5207, -1840, -6132, -5839, -1146, 5904, 10985, 10429, 4569, -2558]
252b558m243Q79N475O866M274j029n687o635l322J629N284O064L326j930o139
267B254o260k657K125N695O201K808k505o029n876k369K457N631N332J863l005
282E665n979n259j376L037N615N002J358l553o236m971r70L367N643M628P33l794
298B910n979m263n9L802N363L922P8m213n889l606O48M177N249L560l79m325n545
315d549l183J109M385N038K946q55m305n266k540J846M714M657K295j286m535
330D71n044k134K186M790M429J709j757m434m613j597K558M931M017J113k200
345D425m313m186j070K925M969L715N65k558m359l690o78L017M827L327l8l045
361C833m293l423l95L081M603K860o56l344m150k747J98L349M475K552r65l658
$$ y = [-2558, -6801, -5922, -447, 6419, 10693, 9664, 3977, -2658, -5980, -4351, 933, 6997, 10323, 8393, 2254, -4006, -6663, -4538, 1157, 7358, 10166, 7661, 1632, -4244, -6613, -4156, 1475, 6807, 8670, 5665, -314, -5573, -6949, -3912, 1703, 6705, 8063, 4510, -1726, -6697, -7667, -4300, 1343, 5971, 6704, 2910, -3069, -7332, -7391, -3589, 1774, 5696, 5774, 1561, -4328, -7934, -7286, -3109, 2140, 5700, 5321, 996, -4549, -7732, -6623, -2238, 2800, 5746, 4891, 586, -4680, -7220, -5374, -660, 3997, 6292, 5006, 471, -4573, -6707, -4521, 269, 4698, 6407, 4650, 216, -4397, -5994, -3436, 1495, 5512, 6625, 4425, 112, -4074, -5144, -2219, 2750, 6465, 7030, 4472, 113, -3577, -4255, -1238, 3589, 6916, 6878, 3833, -460, -3883, -4278, -1197, 3406, 6266, 5610, 2266, -1884, -4631, -4433, -1084, 3391, 5943, 4978, 1320]
377A320m106k249O06L266M212K217j208l763l712j668J007L321L880J724j688
392C159m144l781j341J465L442L610J507j728l997l399p20J935L413K998R27k095
408A251m020l152k66K386L438K763P09k119l798k988o9K559L263K296J46k255
424A44l661k547M02L066L514K086j80k327l398k252O61L172L351J566o42k316
440F39l101j810Q59L238L225J206j021k584k959j636R52L155L058R00j363k683
456G5k658j169J275L162K961O75j634k693k316p03J519L136K705M61j880k723
472A93k067m19J702K997K386J65k083k802j860K5J730K784K042k01k282k818j525
489b033K75J919K725J802m10k249k623j430M74K099K446J393o47k371k603j172
$$ y = [1320, -2786, -5035, -4429, -1163, 3049, 5266, 4058, 295, -3417, -5085, -4078, -757, 3123, 4847, 3159, -985, -4766, -6107, -4642, -1200, 2410, 3917, 2189, -1808, -5207, -5927, -3992, -579, 2419, 3346, 1251, -2769, -5921, -6187, -3801, -363, 2400, 3109, 990, -2808, -5796, -5865, -3306, -43, 2253, 2399, 144, -3517, -6064, -5662, -2596, 918, 3004, 2824, 497, -2901, -5153, -4492, -1320, 2031, 3597, 2955, 639, -2462, -4272, -3413, -175, 3050, 4256, 3235, 651, -2308, -3944, -2992, 163, 3221, 4121, 2758, 75, -2583, -3752, -2477, 685, 3646, 4321, 2687, -6, -2322, -3025, -1506, 1630, 4335, 4796, 2916, 193, -1874, -2293, -591, 2406, 4792, 4957, 2874, 72, -1788, -1763, -33, 2751, 4793, 4592, 2310, -508, -2033, -1758, 161, 2886, 4688, 4278, 2029, -594, -2024, -1550, 549, 2995, 4388, 3741, 1370, -1233, -2405]
505b405Q29K205K316J112q85k467k488r14R44K188K210P63j138k351k152o55J245
522a643K320J979N12j242k387k085m08J345K230J763K90j487k423j743j64J333
538a810K218J682m1j727k251j487P1J584K172J422j82j714k140j258L89J695K096
555G19J274k82j865k084r30O19J676J900J070n53j926j952p46Q24J783J810Q47
572B184o84j874j887n44R62J794J551O41p90j841j726l35J199J851J394L71q93
589A373j872j644j47J291J808J252J63j028j841j403K2J375J784J041q6j124j740
606g76j243J64J500J739P95l03j237j662j096L42J591J624P33l75j372j553q11
623a940M66J440J580N05o82j369j315o54N25J678J537L27p75j406j331n24P52
$$ y = [-2405, -1576, 629, 2945, 4057, 3172, 705, -1783, -2697, -1753, 435, 2645, 3408, 2270, -81, -2233, -2888, -1643, 677, 2656, 3168, 1926, -461, -2546, -2954, -1609, 621, 2384, 2674, 1187, -1236, -2979, -3143, -1810, 408, 2090, 2049, 322, -1929, -3416, -3345, -1761, 411, 1833, 1651, -63, -2203, -3461, -3072, -1377, 719, 1993, 1711, -154, -2238, -3168, -2549, -873, 1027, 2097, 1544, -382, -2334, -3080, -2256, -473, 1337, 2184, 1500, -374, -2261, -2805, -1843, -49, 1502, 2143, 1353, -488, -2214, -2549, -1350, 501, 1895, 2266, 1373, -499, -2143, -2290, -999, 809, 2061, 2224, 1196, -645, -2048, -2026, -651, 1133, 2174, 2088, 964, -776, -2019, -1855, -355, 1384, 2179, 1876, 639, -1023, -2119, -1777, -186, 1438, 2171, 1796, 424, -1129, -1940, -1474, -34, 1546, 2051, 1369, 0, -1315, -1969, -1444, 234, 1771, 2098, 1323, -83, -1414, -1938, -1186]
640a186J484J205K70q05j444j085k26Q31J550J243lj126j370j001j97Q56J530
657E26R93q5q88j313j031J31J130J336P69k46j135j385p35K79J019J331Q60l29
675A227j233j188o00K76J157J262M39n32j055j161n23M80J229J168M67n60j268
692d15j050k43N89J099J077K86p13j126q04k76O08J264J039P3q00j088q34m7P81
711e80J112Q39J49q60j154o66J40P33J116P88q0r87j007m97J56P65J024O30j69
730A452r46j091n12L40Q40R15N26k51j044r76k94L64Q19Q68M41m11r85q88k84
749a117M61Q87P33K73m15r91q93j86N98Q47O73J72n27j016o92j03N85Q90O58K5
769H62n34q85o87k0P41Q61M81n0n75q60n69J62P27Q28N30j10p78p98m15K08O79
$$ y = [-1186, 298, 1503, 1773, 968, -476, -1561, -1787, -956, 594, 1837, 1834, 708, -662, -1663, -1860, -1004, 526, 1519, 1434, 546, -767, -1798, -1667, -537, 799, 1568, 1322, 187, -1198, -1933, -1654, -635, 696, 1556, 1227, -6, -1194, -1794, -1518, -361, 901, 1340, 808, -247, -1408, -1931, -1451, -222, 946, 1413, 853, -415, -1465, -1708, -1119, -20, 1057, 1343, 630, -496, -1300, -1576, -968, 296, 1335, 1408, 608, -480, -1314, -1361, -580, 532, 1371, 1520, 660, -494, -1160, -1020, -287, 829, 1617, 1537, 550, -457, -954, -798, -33, 991, 1621, 1452, 506, -585, -1097, -757, 83, 998, 1524, 1273, 229, -747, -1041, -677, 142, 1010, 1451, 1040, 55, -833, -1117, -656, 231, 964, 1237, 822, -169, -1062, -1248, -650, 197, 870, 1042, 515, -501, -1193, -1296, -711, 179, 837, 862, 328, -557, -1244, -1264, -523, 338, 819, 769, 194, -666, -1235, -1073, -346, 482, 1012, 902, 124, -674, -1089, -881, -202]
790b02Q80M30k73o20p05l75K36Q28P54K15k50p63p91k43M45O86O42K98l29p75
810H8n88j73L88O93N70J01m67o46o06o7N31P32N17O3l99p97o12l6N39N57L90k1
832G57m89p36m27M4N20O50L57j40o04o89m78J13O05O45K27j31m18o44l17K26O45
853b84N68J76k77n36n94l06K84O73N77J24k90m35m97k83K87O78N09Ll49m75m05
874h52j33L78O90M93jl81m63l73q7L54O36M03l7m51m51k48K1L36O20M59j46n06
896B61m60k08K4L95N69L73j81n47m44j61J29M01N06K75j70n99m04o1J61L31M37
917F27K91k82n44m25k0J97L39M43J64k88n39m05m1L19L56L23J33k89n45l81Q6
938d81K92L28K86J18l16n15k87Q0L50L58K48Pl21m66l02R6M03L64J36lk97m80
$$ y = [-202, 678, 1108, 835, 215, -490, -865, -629, 199, 953, 1168, 918, 155, -636, -879, -434, 252, 894, 1192, 863, 88, -500, -673, -285, 408, 978, 1079, 612, -34, -640, -707, -176, 556, 1073, 1136, 737, -60, -672, -708, -169, 388, 778, 757, 268, -468, -895, -851, -331, 319, 676, 536, -68, -757, -1235, -1122, -517, 128, 355, 224, -194, -838, -1155, -929, -284, 284, 460, 183, -353, -947, -1253, -969, -296, 281, 405, 115, -320, -817, -1100, -813, -135, 374, 377, 28, -447, -852, -985, -607, 83, 576, 575, 194, -269, -642, -729, -375, 261, 664, 627, 176, -275, -523, -502, -166, 454, 913, 767, 261, -199, -407, -383, 12, 581, 954, 773, 226, -218, -379, -250, 151, 657, 932, 762, 163, -241, -302, -141, 190, 627, 918, 636, 92, -333, -353, -156, 183, 626, 790, 502, -37, -442, -483, -164, 192, 515, 648, 359, -186, -567, -481, -189, 139, 425, 543, 227, -288, -575, -495, -145, 213, 461, 468, 147, -319, -621, -525, -122, 242, 378, 375, 78, -402]
960d02k41J68L74L65J00j22l04l90j95J60M05L76J03j80l10k98j94J72M26K71
980B84O5j63l31l58p5K27L75L27N9k63l60k25l6J70L83K88L6k94l14k40J7J97
1002b31L49K47%k61l67k04O5K66K89J97l6l10l69j20Q0K71K92J52m7k40l19j78
1024d74J29L17K08J08p1k68l12j06K02L20J91J02q9k52l28q0J80K91J97K2j32
1045A55k40k05o0K42L55J58l8j42k55k16q8K43K94J50m9j58j92j78KK51K94J26
1067D49j12k07k20j90K8K11L38J15j01k00j88r7k1K43K94N3j69k51j45j07L2K94
1089D9K57P6j31k67j57k2pK28K66K9j99k30j25lR0J96K35L4k05k58q1l8R4J97
1113B8J93O2k46k00j28O0J06J79K42p7j88k23l7P4J14J83J57n1k22k14m3J04J18
$$ y = [-402, -643, -475, -101, 264, 364, 242, -62, -452, -647, -487, -82, 294, 397, 217, -93, -391, -585, -413, 13, 284, 349, 186, -145, -503, -578, -351, 24, 351, 410, 147, -213, -438, -474, -304, 79, 367, 403, 109, -205, -445, -428, -231, 118, 365, 365, 104, -263, -467, -402, -136, 153, 350, 314, 4, -365, -485, -405, -134, 158, 310, 263, 23, -296, -474, -345, -28, 180, 288, 217, -51, -363, -469, -267, 53, 244, 346, 257, 5, -323, -403, -223, 68, 265, 287, 155, -85, -290, -350, -108, 247, 405, 367, 225, -30, -246, -334, -91, 203, 353, 304, 146, -46, -224, -222, 29, 323, 449, 337, 130, -90, -280, -252, -41, 297, 412, 311, 111, -77, -174, -195, 48, 342, 395, 226, -25, -170, -277, -245, 49, 306, 382, 251, -16, -173, -195, -202, 26, 292, 321, 122, -108, -233, -236, -146, 50, 285, 319, 114, -144, -225, -263, -169, 28, 221, 283, 37, -163, -291, -231, -125, 54, 296, 219, 31, -192, -229, -155, -41, 142, 299, 248, 26, -188, -231, -127, -9]
1136iJ67Q6k2k12j95k0Q5J42J35J17r2k58k03M9J13J33J46O5o5j67k52L1J92R5
1160F1J12P0r5k34j47K0J87R9P3R3o9k32j69Q8J48J05P8kq8j99j68Q5K38J33N
1185A92J4l7k06j52N5K05R6mk6o6j75j23J23K29J11j0o3m4k15j33R2K11J22l7
1209A59m5j13r3r2J08K57R0o0j08o1q1r1O8K37J00j07r4l8r2p2O2K14M1p1j50
1234c2n8j03l5Q9K01J38p2j99q4L0o6R4J51J03r2j76m4o1K4R6J49Q2j42j62n7
1259b26J2M2qJ56P9r9j44p3L6J4P0J61J6j06j39n5pJ05P8R8J1o5j80p4J08P0M5
1286g5J01N1j16j30l2M2P0J18Q5j1r6j06l4M4J33K9K9on0j84p3J35J04QO1J7j50
1313c6n9oO6P1J10K9k9o9p9l6J42J26K2l4j3l5j54J5J12P0N4Pm0j13q1%O6R9Q
$$ y = [-9, 158, 244, 222, 10, -185, -205, -120, 22, 157, 274, 182, -76, -279, -230, -117, 16, 162, 227, 162, -5, -257, -226, -34, 61, 173, 243, 148, -86, -233, -213, -26, 73, 146, 239, 170, -62, -231, -143, 5, 110, 188, 186, 98, -101, -269, -184, 54, 187, 192, 206, 169, -37, -189, -134, 71, 167, 163, 137, 71, -104, -227, -104, 125, 236, 226, 163, 119, -96, -229, -137, 74, 196, 159, 114, 1, -92, -184, -76, 181, 271, 211, 103, 42, -39, -130, -62, 175, 275, 168, 74, 36, -56, -128, -66, 148, 189, 118, -32, -90, -193, -228, -139, 62, 200, 128, -71, -155, -125, -191, -97, 54, 157, 65, -111, -155, -216, -192, -96, 53, 135, -7, -169, -226, -214, -172, -180, -24, 55, -44, -188, -261, -225, -211, -141, 20, 36, -70, -209, -264, -271, -166, -88, 10, 21, -44, -224, -298, -190, -120, -75, 26, 77, -39, -169, -201, -159, -89, 29, 114, 103, 7, -99, -133, -89, 44, 73, 102, 96, 46, -138, -211, -76, 28, 36, 97, 114, -36, -95, -101, -35, 36, 146, 175, 146, 77, -2, -38, 104, 230, 252, 218, 205, 170, 16, 31, 143, 213, 267, 274, 234, 121, 40, 40, 106, 205, 213]
1342B13j01K5n2j19J4J32J36l2j5m5j00r0L8N2L5lN1p9r2KrN7J45k2j18j23l0
1369a30m9j7O5J10L5k6o1q6J7J0P7M5o2j10q7m5O0m2R7J17L4m3q3o7j5K9Q2j0
1397a55jp4p1nR6R5N3K5P4j00j37k6L5L5O9%K9k3m8%L8J25K1Qk8n8o7n2Q5P0K6
1428C9L9P1o4o3JK4J08M8o4r6om3J3jJ82L7l8Mm7o2k0O7P1j5j8p7L1l9J9k6P5
1459A50R6o8r0mk3m0O6R0Oo5m2m5jJ9L2M0L3n4j52j7L2Oj4M5O0m9o0k9l2J6M2
1490e2P2k1m5o0k7L2M7j7OP6l3j21m6N3O4pk4N1l6n4n8M0J3O8pj9J0p9m3M1J04
1521g2L2m5oN7p8k8M6M8N3pm0Lk4j4QN7K3rl2rj0m0nJ12N6p0m0J1k9K1k1Q2K5
1554E5M0p5m5K7j8J3J7J03n2m9m3L9nPO9J7j4m3l5mK2K5L1O4j3q1n2M1L7k3M5
$$ y = [213, 112, 137, 85, -34, -20, 112, 248, 216, 201, 156, 56, -34, 4, 56, 91, 88, 139, 60, -32, -30, -39, 18, 163, 141, 23, -100, -130, -179, -196, -131, -21, 14, -12, -73, -159, -142, -132, -55, -10, -72, -182, -269, -314, -254, -296, -199, -82, -48, -91, -174, -241, -256, -227, -145, -155, -156, -230, -301, -306, -210, -115, -62, -37, 37, -63, -200, -226, -191, -156, -87, -87, -58, -81, -129, -129, -91, 34, 55, 63, 35, -23, -90, -142, -57, 13, 39, 78, 149, 85, 22, 23, 47, 155, 203, 139, 43, 37, -6, 7, 6, 188, 225, 187, 191, 144, 82, 62, 129, 200, 185, 167, 90, 121, 82, 101, 75, 150, 246, 178, 88, 84, 61, 21, 87, 177, 183, 118, 76, 31, 30, 49, 81, 121, 154, 100, -52, -69, -37, -31, -45, 0, 60, 11, -49, -78, -110, -94, -52, 20, -1, -46, -106, -133, -101, -54, -71, -65, 11, -22, -143, -189, -136, -72, -79, -103, -52, -88, -142, -200, -160, -147, -79, -86, -105, -95, -174, -217, -176, -72, -40, -85, -91, -34, -112, -140, -94, -46, 7, 0, -40, -37, -61, -75, -67, -10, 13, 4, -28, -37, -47, -87, -92, 20, 76, 6, -34, -23, -52, -31, -52, 30, 55, 95, 20, -25, 2, -16, -3, 14, 117, 65, 16, -27, 12, 7, 14, 83, 100, 86, 43, 8, 4, 26, 51, 82, 146, 133, 52, 0, 41, 78, 55, 100]
1585A00K3J5j10k6J8rK9J6K6m6j0o0J1K0L5j9j1N0o6j07L1P5L4j2qO3p8n4L4M3
1615GN6n7J4j7j2q7L2R7jl6j2M0n4m8RP0L0q5M2l6l6%K9O4N6n7l5K5K1q6j4R5
1647A4L2o8k2N8l6k0K5O0L9l7m1qK9p7j3Q7N2l0o3J0K4l0nN7N8k4p0KK5l1l3P6
1679D0N3n4l4m1K9K7m3M3L9j7p4k4M4Mn5O0L4j9l5j5N2Ok3K5N9Ko0p1Q0J4m6L
1711CN4lq9j2K3N4m3j8N3rj2p3K0O1j8J2j6O6p8m8N7O0K5pk7J9n1k2OM5%l7L4
1744B9N4m8m8M7M5K1k6J8m6k5l1NO4Mj3ROj8l4O8J5j8j8k2n0PpJ7M4j4J0k2k3
1777@Jmql0M1J6k9j2R%J1J5K2j7Jj7n7K3J9K4k7j0PJ0m6j5N1M8m7j0Kl0j1qK7
1812e1L7rll0J3l9j6O7Qj3l0Pl8L1m1P3K3l7m1lK6rJ6KN5Mn8oL2kj9NO6Mn9o5
$$ y = [100, 123, 138, 28, 2, 20, 11, 40, 56, 82, 36, 26, -34, -23, -3, 32, 13, 2, 52, -14, -121, -90, -15, 19, 7, -1, 62, -16, -70, -36, 7, 63, 6, 20, 3, -9, -96, -64, 33, 32, -4, -16, 24, -30, -78, -69, 1, 31, -54, -12, -48, -84, -84, -55, 9, 65, 8, -27, -2, 19, -67, -81, 14, 46, -22, -44, 14, -22, -42, -17, 43, 82, 45, 4, -4, 25, -52, -65, 22, 74, 44, -19, -9, 15, -15, -20, 37, 95, 71, 1, 3, 28, -3, -36, 40, 93, 39, 5, -36, -7, 20, -23, 20, 59, 42, -32, -56, -12, -8, -63, -3, 31, 12, -23, -38, 14, 20, -3, 22, 81, 83, 23, -48, 32, 46, 0, 3, 57, 54, -35, -47, -24, 30, -13, -31, 22, 13, 1, -72, -52, 9, -9, 3, -13, 53, -25, -73, -16, 44, 69, 62, 35, 54, 3, -19, -13, 32, 32, -5, 29, 83, 35, -13, 34, 79, 100, 74, 92, 46, 21, -10, -5, 59, 63, 50, 59, 65, 47, 13, 81, 96, 78, 60, 38, -12, -5, -12, 5, 49, 35, 45, 23, 0, 1, -3, -11, -41, 0, 16, -13, -25, -16, -16, -5, 10, 32, 15, 16, -1, -58, -35, -16, 8, -19, -29, -22, -12, -58, -73, -22, 26, -21, -31, -29, -59, -70, -78, -51, -14, -23, -26, -56, -43, -82, -98, -31, -23, -36, -66, -59, -97, -66, -107, -34, -11, -48, -89, -92, -66, -75, -59, -57, -2, 2, -56, -62, -30, -32, -51, -46, 20, 24, -35, -100]
1848a00R0J2k6QP2l0k4m1O6K8m2QL3Ql4k7J8L7l4PL6Lm5l5L5L4L3o9N7jk9j2K1
1881E7K2Rm5J2Pj0k6K7M0Jrm3M1l3l4J6L9k3n0J7K6m2l8J0O5m0j7K2k0pJQK2M4
1915D9oo1M5J2j5k5mKK2l9L5k1k1J8M3k0m5J2K1m0l0oL2MK6oJ2Ql2J2lpJ0k1k9
1950f8LJ3jL6J9K5k2k1jJ6l1J2KqK2n6K3K8L8j1L5%k9j8k3J0K2mpMj6OJL7K4m
1986E6j2l0MJ6l7K4J1J7j3L4m6pL1k4J3LJm5J6Qj2J6K8J9jl0Rkk9N0rJ1L1j0n2
2021C9rL1J1nK0j9pJ5jLj7Pj2L0J1l8j2J6K7l6kj4kqj0N6l1L4k3ll4j9PPj2L0
2057C0m7J4Ol2j0LK5K0j2j5j4K1oJ2Ql8L2l4J3J3n0J1M2j7o5j6K6MlqK5Qj3j8
2091h5J0k3M4j8L4K4k4j0LN2j1j2j4O8l6l5M1k5J8nk3M1j8j2k0K3jJ5oL2J4m0
$$ y = [-100, -10, 2, -24, -16, 56, 26, 2, -39, 27, 55, 13, 21, 54, 62, 28, 1, 19, 56, 22, 29, 65, 68, 23, -12, 23, 57, 90, 21, 78, 77, 48, 36, 57, 79, 88, 43, 55, 62, 52, 26, 53, 93, 94, 85, 42, 83, 50, 16, 32, 71, 48, -2, 15, 41, -1, -39, -29, 36, -4, -21, 1, -19, -26, -25, -17, 5, 49, 43, -18, 27, 39, 24, -1, -5, -3, 19, -20, 15, -6, -27, -9, 34, 14, -31, -19, 2, -38, -68, -74, -42, -38, -12, -18, -6, 2, -30, -18, -21, -28, -18, -39, -68, -65, -52, -53, -17, 2, 27, 5, -16, -17, -1, -32, -20, -18, -26, -4, -60, -37, -9, 29, 18, 53, 53, 24, 6, -17, -7, 15, 11, 4, 8, -8, -2, -1, 36, 60, 56, 44, 14, 18, 34, -3, 21, 32, 49, 36, 70, 24, 17, 48, 24, 37, 40, 41, -4, 12, 20, 8, 24, 52, 71, 70, 40, 49, 47, 18, 68, 59, 70, 101, 91, 39, 30, 61, 72, 67, 87, 68, 61, 76, 75, 78, 61, 68, 56, 86, 97, 59, 47, 63, 90, 54, 52, 38, 36, 28, 18, 74, 43, 77, 54, 51, 17, -2, 5, 12, 0, 30, -17, -3, 3, -29, -39, -36, -11, 9, -3, -18, -32, -11, -17, -5, 3, -35, -3, -37, -24, -11, -61, -50, -8, -25, -90, -106, -80, -76, -79, -87, -62, -54, -67, -85, -75, -98, -54, -72, -38, -14, -38, -48, -45, 7, -4, -16, -30, 38, 2, -33, 8, -17, 1, -4, -27, 14, -4, -16, -36, -13, -14, 1, -5, 27, 41, 1]
2123AjJL7l4JJ1K8jm1L2k0K4k4lJ9j6k2k2M4K3j5j2M3j8n2K4L0pl8Nk0J5J3Jk1
2158a5L0mo9K3J5K0l1lK0Ml8J8j3JLJ3K7j4Ql0NJ8Mk1j1M8k0j6K2M3pm3K9J1r
2193A8J8k3K7K6l6K6Nnk6J2K4K2j7mM6k3k8PL1K7m3LrK8lj0j1L2j9l0RO0o2j7
2227E5L8K6no8PM2j4l4K4L9j6m9J1oQn3L9OK6m9j0L6k5l5J6J0K9o8KL0k1mNJ6
2261Hj1l5J8mL7j9l8K4J1j9qJ5K1rl5LM2l6j2J8lk5j5K2J4J9m4LJ0J9j3Kj3k3
2295g6k7M1J8j3Pj4J7JJ9Rj1K3j7J5moK3j7K5rJ0J3k3j2j2L0L1l8NLL1l9RM8n8
2330BJ0oN1J6k5k0L2Pk6njK1l1k4K0M5l1k9L5l9KjL7M1n8j7J1J0j9JM0j5oj1o
2365A1K8j9k6J4K0k0rmj6k9KLK1lj4rlL4o5K4N0m7j6PJ9L5n4k9O2J9l4pK6K8k1
$$ y = [1, 0, 1, 38, 4, 5, 16, 44, 43, 2, 34, 14, 38, 14, 11, 30, 14, -8, -30, 14, 37, 22, 10, 53, 35, -17, 7, 37, 30, -8, -3, -23, -8, 5, 6, -15, 15, 11, -58, -35, -20, 0, -31, -34, -14, -10, -48, -30, -43, -42, -39, -26, 1, -13, -5, -35, -30, -12, -8, -29, -40, 8, -12, -28, -6, 37, 30, -13, 16, 27, 18, 36, 13, 40, 66, 30, 56, 61, 56, 30, 42, 66, 88, 71, 67, 113, 90, 62, 69, 100, 127, 84, 87, 78, 106, 103, 93, 82, 114, 95, 65, 74, 134, 72, 55, 93, 119, 114, 46, 53, 95, 81, 47, 71, 110, 94, 45, 56, 50, 58, 5, 44, 50, 76, 27, 17, 53, 28, -7, 9, 19, 48, -20, -18, 12, -9, -13, -8, 8, -3, -38, -20, -24, 13, -6, -44, -20, -9, -28, -36, -21, 0, -9, -44, -41, 1, -35, -47, -29, -32, -57, -72, -50, -36, -17, -61, -58, -48, -29, -42, -40, -53, -76, -103, -62, -44, -57, -50, -64, -47, -46, -27, -18, -29, -6, -23, -8, -12, -18, 5, -12, 13, 4, 14, 27, 4, -8, -20, 10, 41, 3, 8, 11, 42, 3, 12, 60, 2, 12, 6, 57, 73, 48, 28, 60, 67, 41, 36, 35, 56, 25, 1, 21, 66, 35, 6, 41, 2, 4, 3, 40, 81, 23, 6, 17, 27, 8, 9, 49, 34, 28, 17, 11, 39, 20, -6, 8, 28, 8, -1, -5, -21, -50, -48, -45, -24, -27, -41, -50, -53, -19, -84, -60, -10, -57, -73, -66, -47, -12, -66, -95, -33, -14, -48, -55, -29, -1, -22]
2400b2k0K3j4k3k7M7K5j3l0K8K9k4l9L2K5k2k0J1L9l0KLP3n3Mj2L5Lm9K3J5kj0
2433GnRK8j3k9L0L4j0k9L0j2j2l4L1J6k5j4K6L4m3K6l7K1K8l1oj4K8j8MK1j1n
2466B5l7K3J1k3l5L7jOrqJ0mRj9JnJJ3kK1j7Q%J6j4kPL0nm1K6j4Mj9J4J9l6M6
2504C6j7lj8J5mRjk0l0N9rm2K9L1po6K5LL5m4j2J9nj1mOK4j8K6qk0Ok2M7k6qk5
2541e0M0jL7l0l0K9j7k1PJ7l5L0K5Pk2J6j9K2j1l%M0k0o8K3N2j6J9k4qL0m1J2
2574a0K2pk8NPpK3j2J8m2j1O3pj6oL0Jj4jjj1L2ok1L4Ml0k1O9k7j4J4J3j1k5J0
2610A7QK8J5n3P0k9k2noL6j0k3K0J3J1k4lK4k3k4jj0L8J6l6K9k8j6kM1k3qLk0
2644CK7krK3k9j1J2oJ0j1K5k7j2JJ0L7l1j1QL1k1mqj8L6knk0j4Rk7K2kJ1l4N8
$$ y = [-22, -42, -19, -33, -56, -83, -36, -11, -24, -54, -26, 3, -21, -60, -28, -3, -25, -45, -34, 5, -25, -23, -20, 53, 0, 4, -8, 27, 30, -19, 4, 19, 17, 7, 2, 11, 39, 26, -3, 27, 61, 51, 22, 52, 40, 28, -6, 25, 41, 16, 2, 28, 62, 19, 45, 8, 29, 57, 26, 20, 6, 34, 16, 20, 41, 30, 25, -12, 11, 22, -1, -36, 1, 0, 6, -3, -11, -1, -5, 4, -15, -14, -19, -18, -5, -7, 14, -3, 5, 5, 21, 7, 5, 12, 42, 37, -4, 22, 8, 12, -7, 7, 26, -10, 36, 19, 16, -2, 13, 9, 18, 17, -3, -33, 26, 17, -25, 4, 35, 28, -38, -13, -10, 25, -19, -31, -12, -17, -28, -32, -26, -2, -20, 6, -2, -22, -16, -38, 9, -17, -25, -50, -10, -11, 26, -4, -34, -5, -22, -43, -36, -19, -54, -24, 1, 8, -14, 2, -17, 5, -6, -9, -9, 31, 11, -57, -34, 18, 2, 21, -3, -11, 19, -22, -10, 12, 5, -23, -18, -11, -18, 5, -7, 11, -31, -42, 21, 14, -2, -8, 22, 23, 9, 8, 7, -4, 28, 22, 1, 35, 39, 9, -12, 57, 30, 16, 30, 43, 32, 7, 17, 25, 53, 68, 15, 85, 56, 34, 29, 23, 59, 49, 26, 46, 59, 70, 46, 43, 67, 44, 20, 19, 9, 47, 63, 27, 56, 28, 12, 10, 51, 28, 20, 23, 3, 30, 28, 19, 42, 13, 2, 14, 8, 18, 7, 32, 5, -7, -6, 4, 41, 10, -1, 7, 38, 17, 13, 5, -13, 23, 21, 16, -4, -18, -9, -36, -14, -16, -5, -39, 19]
2680A9k2oJ7j0Lj6j3L9k0LK6J8j8j9oJ1k7J0Nj1MK1m9QJ3j5K3nJ5nj7J7Jj3K0
2715Ak9L1m9J6K0K6m4K9L5j7qrj7OJ6l6L6K3m4N2Mj2k6ML7n2M7n8J0qL8k0k9O4
2749C7J9l4l7N4lk0k5J3J5l4LRQj7mK0K3k6j2L0j7j4j5J3Ql1J0QJ2J3QK3k1kn
2784Ij9J4J3j4k5J5K4m0kJ9J5k8kLnl7K9j4OLrJ5rJ6j1k2J1oj5J6Kj4kmMO0q2
2821h6J7J3PPk8L1L8n4j8K2J9l6M9J4m4j0L5%Pmj5M5J4n0j4N1j2k6M7j8j2kK4
2854A1L2l5NoL1j0L3l6lL6K2m6L5qk5j0L7nk0J6K0Pj2qJ3ok6J6%L0m4mj1K1P%
2890E7j7L7l1j8J0K1qLj6Pj1j5K8Qj7m0M0l0K9n4L5pKj8L5l5m2QJ6J1jjj4K2K0
2925A4m6K5pj%l5L8j1K2k1J1Ml6pN0l4NJ3J3k7k0L6P%j1NJ2j7J5k9L1J0k4mL1
$$ y = [19, -3, -9, 8, -2, 1, -15, -28, 11, -9, -6, 20, 38, 20, 1, -5, 6, -21, -11, -6, -17, -13, 8, -41, -33, -20, -35, -12, -17, -2, -7, -24, -7, -6, -19, 1, -28, 3, -46, -30, -10, 16, -28, 1, 36, 19, 11, 2, -15, -9, 7, -29, 7, 30, -14, 38, 42, 30, 4, 8, 45, -7, 40, -18, -8, -16, 22, 2, -27, 37, 56, 22, -15, 39, 36, 16, -9, 4, 19, -15, -12, -3, 5, -12, -16, 4, 27, 1, -11, 19, 2, -12, -27, -14, -6, -37, -27, -19, -7, 6, 14, 37, 16, 14, 9, -10, 4, 17, 3, -22, -7, 17, -23, -25, -6, 9, -19, -21, -18, -23, -60, -31, -45, -39, -36, -45, -30, -39, -23, -34, -56, -45, -51, -66, -50, -48, -62, -64, -68, -64, -4, -86, -69, -56, -49, -42, -70, -39, -1, -55, -73, -51, -32, -68, -19, -5, -49, -59, -24, -24, -17, -21, -36, 9, 23, -27, -41, 10, -2, -28, 19, 1, -11, -13, 11, 43, 8, 13, 7, 38, 28, 61, 25, 22, 58, 80, 34, 69, 61, 36, 26, 63, 58, 38, 54, 74, 81, 69, 61, 74, 68, 42, 58, 58, 88, 44, 40, 29, 50, 57, 57, 40, 77, 46, 28, 38, 59, 51, 54, 38, 45, 34, 19, 47, 55, 38, -2, 38, 8, 37, -17, 18, 11, 13, -5, 30, -5, -47, -39, -23, -12, -13, -14, -28, -6, 14, -32, -7, -14, -15, -15, -50, -12, -23, -1, -22, -11, -7, -43, -50, 0, -34, -29, -16, -3, -30, -50, -14, -7, -7, -18, -13, -1, -18, -3, -32, -1, 9, -15, -19, 12]
2960A2m0lM3nnnm%koj4J9J5k6lL8k3Jk8L8Noj5j0M4j6j4kJj1NOK9k2j8J1oJJ2
2999drK4jk2k6N2l4%jLJ4j7J2J6Mj3Kj0%PJ6mk4%M2j9%j1J8oOJ0J4k4K3l8L2%
3037C2k0l0mR%M5k3RnqPKj1k8K3J7JMk5omQJ3jK3kj8J2k3J1J2k2K1pPqMJk1L8
3077C3qK0kl3j2J0rK9k7RL0k8j0J9l0J4MrJ1mOKl7M1j9k4oK2%pJ1Pk5L2m5J9K4
3114Hl9J9J2RrL0m5L8o5L0j4j0M1k7%pK9j2J5k8mRprK0m4L7Pk6J2j1M0ll1J9N
3150a1OJ6k8Rk2M7m9K0j5QRJ0j5jJ4j9j0K5l3N2l7lL0J4m6L4J4Kj8nJ5M4k3j3
3184B1J0lK6o0K8K1j7lk3L7ok4K8j0pqNJL3k4j6K7k7nK2j3J6k5rK6k2Nj8J3j3
3219a4%J2jMl7lL8Qml9j1L0J7J0nj7Kk8J8pJ7k4j3N1k5J3j5J9j7k8J2R%k4M5k3
$$ y = [12, -28, -31, 12, 7, 2, -3, -7, -7, -9, -15, -29, -10, 5, -21, -24, 14, -9, -8, -36, 2, 7, 1, -14, -24, 20, 4, -10, -12, -11, -22, -17, -11, 18, -4, -22, -11, -17, -16, -4, -13, 11, 10, -12, -38, 14, -20, -20, -21, -18, -4, -21, -9, 7, 11, -2, 0, -10, -10, -3, 13, 9, -15, -15, 27, 8, 8, -3, 15, 9, 15, 25, 39, 15, 38, 0, 32, 32, 12, -18, -22, -13, -13, 32, 9, 18, 13, 5, 12, 14, 3, -25, -2, 15, 16, 20, -5, -11, -15, -7, 6, 5, 28, 26, 8, 20, -3, 8, 20, -2, 19, 12, 19, 11, 15, 16, -5, 33, 25, 45, 43, 10, -2, 8, -1, 28, 1, 10, 40, 12, 2, 21, -9, 5, 9, 0, 11, 7, 13, 15, -22, 19, 0, -24, -30, -8, -8, -15, -4, 3, -22, 10, -35, -16, 8, -31, -12, 0, 9, 0, 30, -15, 23, -42, -12, -26, -36, 5, -22, -22, -29, 0, -12, 3, -25, -29, -20, -27, -36, -16, -60, -23, -16, -42, -30, -41, -1, -4, -35, -16, -11, -5, 11, -17, -8, -30, 17, -32, -12, -27, -19, -10, 0, -15, -16, -2, -21, -31, -6, -39, 13, -24, -27, 3, 17, -29, 5, 19, 21, 3, -2, 13, 57, 34, 21, 31, 28, 54, -6, 22, 43, 26, 23, 0, 37, 31, 7, 35, 25, 18, 10, 15, 16, 49, 25, 9, 36, 9, 4, 26, 13, 29, 4, -5, 21, -1, 4, -14, -1, -14, -14, -2, -3, 1, -36, -39, -1, 7, 3, -36, -47, -17, 0, 10, 5, -12, -10, -38, -20, -27, -10, -34, -47, 4, -21, -8, -23, -4, -21, -49, -37, -28, -28, -52, -7, -30]
3255c0K1j4pL6l6K3j4j0J3Mj8k3K2J1J1j5J9Kj9JmnJ8kPJ7k6mlL7k4JL8l9K5R
3291B2l5L3Kk2j3J8K8jrK1k5J2j8L0j0PQj1Mm1M2J7m9L3j0jm2L0j5J4Nj2J8j6
3325A4J2k4J3j3k3KL2pK5l6Oj5L7qj7j2M6n0J8j5J4KpkJNmj3K5k7L1l7K6J3j4
3360bK0j2L0m8k0OL4ql5L2J2k7J1LPok1M0l1J2K5o5L7kj1NQQl9L4mj5j5K5J0k4
3396b6L4jk9M4k3l6N8k0rqj2N1j2n0LL9k0Nk6M7kLmj9L0j2l1L9Nm2J4L1pl7J9
3431dJ5%ll6L8j5L6j9J6kn7K2J4J%k1K5M2o2%RK2j8JkNJ7k6J%L5j5k2LM4n1kK9
3469B0kj8pQ%j0K3jQj8k9N1Lk1j1Opj0K0K5j9l2j7M1j0k2J0nJ1rrOLOj8L0j3k5
3507d2j0M8j3m9M9j4M1k9%J2rk3J9mKMNK1m1L1l3%K8j1K1j2K2k5JL2j8J5l9N0
$$ y = [-30, -9, -23, -30, 6, -30, -7, -21, -31, -18, -14, -32, -55, -33, -22, -11, -26, -7, -5, -24, -23, -27, -32, -14, -16, -9, 8, -18, -22, -25, 12, -12, -11, 27, -12, 13, 22, -13, 20, 22, 0, -13, 5, 33, 32, 23, 44, 19, 31, 13, 43, 33, 40, 48, 37, 41, 0, 42, 59, 10, 43, 33, 32, -10, 20, 5, 19, 24, 12, 30, 14, 26, 2, 15, 2, -21, -19, 13, 6, 31, -5, 1, -14, 23, 15, -2, -14, 32, -18, 0, -15, -1, 1, -6, -8, -7, -2, -6, -19, 6, -21, 10, -27, -1, 12, -2, 18, 6, 36, -12, -32, -26, 8, 0, -35, -3, 9, -18, -7, -4, 3, -3, -24, 16, -15, -3, 22, -43, -6, -8, -19, -14, -6, 2, -37, -3, -7, -22, -37, -12, -2, -26, 8, 7, -22, 22, -1, -37, 21, 1, -8, -16, -28, 23, 11, -39, -36, 3, -17, -12, -38, 9, 7, 10, 6, -13, 17, 5, -26, 13, 18, -24, -10, 21, 14, -23, -4, 11, 11, 8, -28, 10, -5, 31, 12, 28, 26, -31, -9, 5, 6, 6, -15, 10, 52, -10, -10, -1, 21, 3, 4, 2, 7, 24, -2, -1, -1, 34, 19, -3, 0, 44, -7, -9, 20, 18, 0, -7, 1, 1, -9, 14, 13, 21, 3, -26, 25, 28, 7, -4, 2, -5, -15, 5, 30, 11, -21, -38, 3, -7, -29, -19, -24, -13, -22, -31, -25, -22, -16, -34, -4, -17, -42, -52, -4, -17, -66, -17, -31, 10, -19, -19, -7, -16, -39, -20, -24, -22, -18, -13, 8, -33, -2, -35, -35, -7, -18, 3, -9, 13, -12, -11, 21, 3, 18, -21, 29]
3541B9j4l4N2m3Jj7J3L2J4l9J1j4Lj5L0oK4%l1J3j9K8k6j2K2Qj6LL2k6k8L5j8
3574hpqRM1l5j2J2K5k6j7OM3%o8M7j3L5k4%M7k9rPRk2OnPQj5KnK9j0JnmLOj5J
3615Gk7MK3mMj8K7Jj2lj0jj4K5J2j6NpK8J3p5J9J1PomK3mkK5j2J0l4mK8LJ6km7
3654a1J0oLL7l0J3k9KK0j5J4k9J5j4J0k3M4rj3pK1k6K5rLk1K2j0j2j2KJ0M1n2
3688c6J9K0k3J9%J2k9J3J3kj3mj3J7j2JMK4j4l4J2PK1j0lj4NJ7J7oKL2l1k7MR
3724ck6K7j6J9L3k3k5J2nj1J3oj1K4jPRj5Oj5J5K4Pm0kj2J4J9qNOQJ0k9K0J0m7
3761gL3k7L2j8lJ9J6l5J3knj2kMJ1%k7K5l1K1j1Rl2K2K0j4jMMJJ4k1j5j2J9Pj6
3798a7Qk6L0mk8J0L3k5MkJNk0K3MqkK3k8M4l1j0OK3k7kL9m0L2l9M0j3j0MJ9n7
$$ y = [29, 15, -19, 33, -10, -9, -26, -13, 19, 33, -6, 5, -9, -6, -21, 9, 3, 27, 27, -4, 9, -10, 18, -8, -20, 2, 10, -6, -3, 29, 3, -25, 10, -8, -15, -23, -14, 27, -8, -20, -8, 17, -9, -26, -20, 23, 23, -45, 2, -11, 24, 0, 0, 47, 18, 9, 16, 25, 3, 9, 4, 11, 19, 4, 6, 1, 30, 20, 21, 16, 12, 15, 21, 6, 7, -20, -16, 7, 3, 7, -11, 16, 17, 5, 2, -8, -9, -23, 2, 14, -2, 3, -4, 24, 37, -38, -19, -8, -1, -7, -11, 12, 8, 6, 31, 19, 29, -5, -9, 19, 22, 38, 36, -11, -1, -7, -4, 33, 3, 16, -13, -11, 9, -6, 8, -21, -6, -20, -10, -33, 11, 2, -11, -18, 3, -23, 2, -7, -4, -25, -3, -13, -25, -37, -35, -25, 16, -36, -17, 3, -20, -1, -1, 11, -18, -5, 8, 6, -7, -11, -24, -7, -19, -18, -14, 10, -4, -38, -26, -19, 2, -8, -11, -25, -20, -3, 14, 8, 10, 42, 11, -16, -12, -3, -29, -2, -18, 1, 34, 11, -14, -2, -7, -18, -5, -11, -22, 2, 1, 8, 17, 2, 8, -7, 8, 32, 39, -1, -3, -15, -1, 18, 10, 15, 21, 29, 39, 10, 30, 40, -7, 26, -1, 31, 13, 10, 29, 45, 10, 23, 21, 16, 4, 2, 6, 17, 17, -10, 15, -16, 5, -6, 3, -29, -7, 13, -1, -2, 2, 6, 7, 21, 0, -15, -27, -8, -1, -17, -9, -35, -5, -9, -37, -27, 6, -19, -15, -17, -16, -11, -31, -8, -4, -12, -14, 9, -19, 25, -6, -16, -10, 13, -14, -16, 23, -17, 15, -24, 16, 3, -7, -3, 16, -41]
3834d1J6J2j3L0k5kJ5mj0J4L0l1J2JLk0K8l3J4pj2J6l5P0l7k4L5JpOJ4m7N3l0
3868hk3J9oN0m7lL6rJ0m9M3%Nj4K0Poj4K%kKj0N%p%LNJ3k5kkJ7L9m4K4Pm0QJ6
3909B0j6pjpNqK1rj1J2K0l3L5k1L5m0J0j9K9J7lm3J9J8j5j5nN0j7l3L4j0j3J4
3943A3J4m6NoJ9J5ol5J2K3k4k3K1Rj7K7oK2%k8m3L6J3k7NM4l7j9J2L0mNMk5K7
3978A0l9L1K6m0J7k3J0L2m1jJ4L2m9J5rJ7j7J9J1oj5j8K1%M4l9J5J6m4j9M0Lj1
4011BJ0j0qJ5K2j2jRm2L6%k6kJ6LJ0j5j5J4J1k8K1Prj9nL7Lm0K6j9M6l6j1J4K7
4047C1j6L3om6K3jj9O2k9j3J3n0L6k2L0Oj0k9nJ9nj7J7J1rlkRj1K4nk4JJ1j1K9
4083B2m3%K0kqlK0l7K4Qm1M1LMj4j1KMj5j7L3Jk0J4J5k9%RMj2M4n0J7L3l4K4q
$$ y = [-41, -25, -13, -26, 4, -21, -23, -8, -12, -22, -8, 22, -9, 3, 4, 7, -13, 15, -18, -4, -11, -23, -7, -42, 28, -9, -33, 2, 3, -4, 2, 16, -31, 22, -8, -31, -12, -18, 32, -15, -18, 18, 9, 19, -30, 13, 13, 18, 4, 24, 31, 25, 11, 13, 13, 11, 13, 3, 8, 8, 1, 1, 4, 9, 22, -3, -5, -7, 10, 49, 5, 29, 36, -4, 4, 20, 4, -3, -4, -11, -6, -14, 7, -2, -13, -1, 19, -14, 21, 0, 35, -5, 5, -14, 15, 32, 29, -14, 5, 23, 8, -7, -12, 38, 21, -12, 22, 12, -1, 13, 27, -19, -14, -20, -1, 14, 8, -27, -15, 8, -16, -39, -18, -9, -26, 1, -5, 17, 17, -11, -54, -18, -5, -32, -27, 17, -20, -39, -27, 3, -1, 4, 8, -17, 10, -29, 2, 28, -12, 5, -18, -8, 24, -17, -18, -4, 28, -21, -6, -15, 2, -15, 4, 15, 9, -6, -24, -3, -3, 41, 2, 17, 33, -11, -30, 10, 13, 2, 12, 2, -6, 9, 31, 19, 18, 27, -15, 21, 21, -5, -7, 9, 12, 22, 7, -8, 6, 17, -11, 10, 17, 8, -11, -16, 21, 24, -16, 10, -9, 37, 1, -10, 4, 31, 15, 48, 42, -4, 19, 18, -1, 61, 32, 19, 32, -18, 18, -4, 26, 32, 22, -7, -12, 7, 2, -15, 2, 13, 4, 1, -1, 8, -3, 21, 16, -8, -7, 4, -7, 22, -21, -21, -1, -3, -11, -14, 6, -31, -7, 1, -40, 1, 4, 8, -6, -17, -15, -11, -26, -43, -10, -9, -29, -15, 0, -29, -29, -20, -16, -28, 16, -34, -17, 16, -18, 6, -2]
4120boJ6k2%j3k0O4j2J3qj0k0NJ3l6K8J2J7m7K1l3M3K1l7NJ3Lk7J9mKj1K6J8j2
4155A9j3Nj6j5K8J2j3kJ9j1j3j3L6%J7l8RJ0L0o1M1j9j5L0m8N0j8mjK4pJ2m9l
4189a7J6J9m4K0K9k6K4poj6J3jj7N2j0mJ2l0j8J9k%j2K3m3M4j4j9J6k4K1Qj3l
4223a0%J6mLm5O6pnKmnj5j0M7l1j2j2lL2%l2J6jMj7%OKrK2l1j0L1qoK0n4N2rK9
4263Hj6m8K3KN4l6NNoK4l0oQnK5j0MK5l0J0nj1J0L3Pm0k0L5j4rK0Qj7oK4nk4O
4301bJ9k2L2l0L0k7OJ2l6K9J4k2J3K8l9J7k8lM1l3K7MJk5lK6k8J6pNLNkl0K4R
4337B4k1%ML9l1J2J1j8J4%mk6J1j4rJ5mJ1m4RK3JJ0k3jJKL5j7pPlolrk1J0%J5
4376gmj7QoPPjK2k5OQJ3l2J2J4LNk4j2mJ5nJ1nKJ0l1OM1qnk5RJ9Op%J0Pl1j1L9
$$ y = [-2, -8, 8, -14, -14, -27, -47, 17, 5, 18, 10, 0, -20, -15, -2, -38, -10, 2, 19, -28, -7, -40, 3, 24, -13, -8, 5, 8, -19, 0, -4, -2, -13, 13, 31, 19, 6, 11, -5, -20, 8, 20, 7, 5, 24, 13, 0, -13, 23, 23, 40, 2, 11, 21, 51, -10, 31, 12, -3, 27, -21, 29, 11, 7, 6, 30, 23, 35, -14, -17, -1, 18, -26, -6, 23, -3, 21, 14, 8, -8, 5, 4, -13, 39, 29, 25, 37, 7, -11, 8, 6, 6, -6, 17, -26, 18, 4, -15, 1, -23, -2, 6, -7, -10, -10, 6, 2, 5, -40, 26, 19, 14, 16, 12, 7, -8, -18, 29, -2, -14, -26, -29, 3, 3, -29, -13, -14, -10, -27, -27, -21, -19, -28, -6, -37, -47, -16, -24, -30, -10, -64, -12, -21, 8, -8, -56, -33, -31, 23, -13, -8, -3, -9, 15, -15, -21, -13, -18, 7, -3, 1, 26, -4, 6, 1, -10, 0, 33, 40, 0, -20, 15, 1, -8, 12, 20, 3, -3, 21, 16, -8, -2, 17, -5, 27, -3, 27, 0, 6, 18, -18, 11, 25, 3, 16, 44, 5, 22, -6, -9, 32, -1, 26, 30, 31, 6, 3, 29, 1, 17, 10, 15, 18, 23, 21, -9, 15, 24, 3, 3, 7, 46, 15, 27, 38, 20, 34, 34, 30, 4, 15, 1, -8, 7, 3, 14, -30, -21, 2, 3, 13, -10, -11, -10, -8, 27, 10, 3, 10, 7, 1, -2, -11, -32, -22, -22, -7, -11, -28, -20, -26, -19, -12, -13, 9, -16, -10, -2, 11, -21, -9, 5, 8, 13, -11, -23, -27, -12, -17, -6, -11, -9, 1, -30, -24, 17, 9, 4, -21, -12, 7, 13, 6, 6, 16, 23, -8, -19, 20]
4418B0j6KNoPj6rL5k8L7m7K8J6l5L0m4L1k3QpL0Mk4MNknjK4j6j2k2M4kk6L1j0
4455A0J8l8J8KqJ9J5l8rK8k6K8jJ0k1j7J9Rk2j1L7mk0j0Oj0K9j7PnJ9k7JRNjk
4492BqNj1RK4k3K5l5K7J8l0OoK1Nn7J0L7n0K2J5j4JRK1Lk8NJJ4ll9M1k2%oLJ9
4530A1ql4NJ8k2J8Rkj8k0K9J1k3J8l5J4J3l4QN0k3Rj5L4nl2K5K7j7j3j9J0Qj6
4564a9N3l3j0J0j7M6l2J8k5rK0J0J2j9nLJ9j1pj9PK9lJ0k8j3K5kk5L5k5L2lj1
4598A3jqo%Rj7L2l4M0k6Rj2j0L1nNk1RnRj5kL3l0RL1j7l6OJ9jK6k6J6pj5L4l7
4636@L0m2K4Pll6K0K4K0m6K2%Jmk4kpJ2k2L4k9L4rrj1l8N4k4M2k3NOk1L0k4J8
4672Ik7LL6k6JK7k6lJ9j3oOJ8k7J9k2J6J9j8K2k8Rjl5K4J1j2J5k1J2Ok1K2j6N
$$ y = [20, 4, 6, 11, 5, 12, -4, -13, 22, -6, 31, -16, 12, 28, -7, 23, -21, 10, -13, -5, -12, 18, 22, -2, 2, 7, 5, 0, -1, 23, 7, -5, -27, 17, 15, -11, 20, 10, 28, -10, 8, 10, 2, 21, 36, -2, -11, 17, -9, 19, 18, 28, 7, -10, 9, 18, -4, -15, 22, 18, -2, -12, -6, -16, 13, -4, 3, -2, 17, -10, -9, 0, 5, 4, 2, -6, -1, -12, -3, 21, -2, 23, -12, 15, 33, 3, 9, 3, 24, 29, -28, -18, 19, -31, -9, 6, -8, -7, 2, 23, 26, -2, 3, 4, 18, 15, -24, 17, -5, -5, -11, -8, 11, 3, -31, -26, -8, -30, -12, -3, -5, -23, -43, -14, -3, -26, -8, -43, -29, -16, -50, -42, 8, -15, -6, -21, 13, 8, -24, 1, 28, 11, -2, -21, -11, -3, -19, 34, 1, -9, 1, -16, 30, -2, 16, -9, -18, 2, 12, 24, 5, 0, 3, 22, 11, 4, -15, -8, 21, 18, 28, 0, -13, 12, 10, -15, 20, -5, 27, 24, 13, 12, 4, -2, -2, 7, -10, 22, -12, 28, 2, 11, -1, -11, 20, 15, 20, -1, 8, 3, 12, -3, -5, 28, -2, 7, 38, 21, -15, -9, 10, 9, 35, 9, 25, 18, 3, 37, 0, 30, -12, 12, 19, 16, -20, 0, 24, 44, -2, 20, 20, 21, 17, -7, -9, -16, -4, -26, 8, -21, 13, 4, -5, -16, -54, 0, -24, 18, -5, 0, 6, -15, 15, -9, 9, -18, -15, 21, -5, -4, 23, -3, -6, 13, 0, -6, 0, 18, -9, 10, -12, 4, 23, 5, 27, -1, 8, 7, -28, -4, 7, -5, 10, -11, 1, 7, -14, 8, -8, -3]
4707crPJ1k8K4Lj0J2nl0QkNj7K0k9M1K8m2k5N1j3L1l9j0M3j9K1k0k6K5jQMJ2n
4743B1J4l5K3k5j1j2O1pj3Pl2RpK0k3qL8j1j3K0m8L7Kj3J8j4JKL%K6k8l9L0j0
4778a7K8oJ4j3lLK4l5L4l6K7l0nOJ6K5k9K9o3L5J1j7RNNk0j3N2lpJj4nMJ6k9K8
4815B7k3pK3m4J7KK2j7npK7n5L7K5%k9nJ7Kk3K0k1jJ5j6K1k0%O1l6Ll3K3MqJ0
4851FLqj4K2oJ7%Pl0MKNj1QkL4l0oKK3j3Pl6j3K7nKj7L0j9K5krrK1k0J5l7J1L4
4891A8m1K2Ok7OK1J6k1kQMqK4o0M4m4N9on2K4L8j7qmJ1Kj1J2j0J5j8j9L8rj9J7
4927IL4j8l1J0j3L0j0ojj3J2pJ4qrPoJ5%l2KK7rj0Nj0J5jk5N7j0j2j1J7j2mk6
4964c0K0K0nl1K3p%K6k4K0l3J9k0K6k3K0j2J2J7j7J1k6JJ2k4L7k4OJ7j7j6JK3
$$ y = [-3, -12, -5, 6, -22, 2, 5, -5, 7, 2, -28, -20, -22, -17, -34, -14, -43, -2, 26, -16, -41, 10, -3, 28, -11, -21, 22, 3, 24, 4, -22, 3, 2, 10, 14, 26, 21, 35, 0, 23, -2, -13, -25, 36, 29, 16, 23, -9, 0, -7, 13, -10, -18, 20, 9, -4, 16, -32, 5, 7, -6, 12, -2, -1, 1, 4, 4, 30, 2, -37, -7, -17, 11, 5, 19, 6, 3, 6, 30, -5, 29, -7, 20, -10, -15, -9, 7, 32, 3, 32, -31, 4, 15, -2, 7, 12, 17, -3, -16, 36, 33, 26, 27, 13, 8, 12, 28, -1, 27, 4, -3, 20, -24, -7, -5, 17, 0, -5, -12, 15, -40, -3, 22, 22, -7, -12, 5, 7, -16, 4, -17, -18, -3, -19, 2, -18, -18, 43, 7, 10, -23, 0, 4, -4, 6, 9, 1, -13, 9, 3, 20, 20, 27, -3, 1, 3, 8, -3, 5, 3, 37, 7, 1, 3, 26, 13, 20, -16, -29, -2, -7, -5, -22, 8, -11, 14, 12, 3, -6, 15, -5, 10, -27, -16, 18, -23, -1, 5, -22, -16, 5, 21, 0, -2, 6, 10, 2, 26, -34, 10, -34, 25, 19, -33, -9, 29, 12, 4, 0, 11, 13, 2, 14, 4, 19, 1, -18, 20, 11, -8, 9, 43, 25, -6, 4, -9, 21, 11, 5, 4, -9, 3, -4, 10, 2, -7, 0, -6, 9, 9, -23, -21, 6, -3, -13, -8, -18, -3, -4, -29, 28, 18, 6, -5, 12, 0, -4, -30, -10, 10, 5, -26, -3, -10, -10, 16, -8, 12, -21, -2, -22, 4, -19, 1, -11, 1, 18, 1, 12, -14, -13, -1, -25, 12, -12, -6, 11, -6, -22, -21, 2]
4997Bj1mL0l0k2K6J8l4RJ3j7rJ4j0M9k0Prk0OM4m0PJ1j8J7K1k0K2j7Nnk7Pj5J1
5033iK7J5k2%k6M5mj6OJ4J5m7K8m0M2j4Lj7J2j6j0K8j9J2jkrk3J1RL5k0l9M4j3
5068aj1j0kK9mjRmrJ0J0%j4J7k4M5n6K1%k%k1M4m6POK6k3K3k4k8N2k9oLJ1j0j0
5106b2JJ1j5J9Lj6qK0Oj7J7k2JLN1m1j3K4NqKJ1k2OJ6j1J4k8NJ3K8k6k1L1%j9
5142bmJ1Lrk3M0j6mMjL5l3J6l0K5rJ2k2KJ0lJ3j8J8kMJ4k6kJ8oj9mPJ8k1koL1
5181A9j6%Mj0J9rl0L2q%QrJ2k5K8J1m8L3k0J6k3K6j0PmK8km0J5j2j0J7J2j9kj5
5217b5M5k7k4J6QolkJ1qj5ONj3NK4j0J1nj0j6J7k0K9Ll7K4Jj3J5kLJ8ooj5L4q
5255Dj6QJ4j5l2M5Mj6Ml1J3L6k9J1J5rJlK4k3j8J4mMk2pJ9j0rjK4Nj7L6l3Roj
$$ y = [2, -9, -13, 17, -13, -35, -9, 9, -25, -16, -3, -20, -29, -15, -25, 24, 4, 11, 2, -18, -12, 32, -8, -1, 10, -8, 9, 30, 10, 32, 15, 20, 15, -12, -5, -20, -9, 18, 33, 11, 11, -15, 30, 26, 10, 16, 30, 45, -2, 26, -14, 28, 14, 17, 0, 12, -4, -14, 14, -5, 7, 6, 4, -5, -28, -17, -8, 27, 7, -32, 12, -1, -12, -22, -24, 5, 1, 0, 9, 5, -4, 6, 16, 16, 2, 19, -5, 40, -16, 5, 5, 3, 3, -18, 26, -20, -13, -7, 19, -4, 19, -5, -33, 19, -10, -16, -13, -2, -12, -22, -21, -10, -25, -6, -3, -19, -27, -7, -1, -18, -1, -23, -22, -19, 32, -9, -22, 2, 7, -1, 1, 12, -10, -4, 12, 1, 15, -13, -8, 5, 33, 7, -14, 17, 17, -2, -6, 5, 8, -1, -24, 16, 0, -4, 0, -1, 34, 1, 17, -13, 12, 3, 15, -7, -5, 5, 2, 15, -3, 15, 13, 17, 31, 5, 3, 21, 15, -4, -8, -1, 17, -4, -6, -12, 19, 3, 3, 7, -3, 16, 7, -23, 9, 1, 1, 9, 0, 12, -13, 15, 26, -22, 11, -9, 7, -16, 10, 0, 7, 3, 31, 29, -11, 4, -8, -18, -1, 11, -8, -10, -25, 20, -7, -31, -15, -7, -13, -16, -18, -7, -15, -30, -24, -19, -32, -27, -3, -13, -2, -7, -17, -33, -16, -36, -7, -4, -41, -17, -16, -29, -14, -16, -13, 5, -1, -7, -22, 12, 4, -12, -4, 10, -5, -37, 8, 12, -4, 0, -31, -18, 18, -11, 0, 15, 6, 7, 4, 28, 5, -13, 1, -3, 1, -21, -28, -9, -19, -28, -29, -5, 0, -17, 19, -14, -5, -11, -12]
5293a2J2j3PJK7l7LK3j9k9M7J9j3j9J5j5k4NL8k1M7k0Kj4J9l9O1m2J9l3K4Rk1
5326GNqj0K1J7k0Mj2K9Mm4oK6j3NkKJ2plJ7l9K4pj4Jj2L2j5QMj3j5O2m4J3l2M5
5364B2m6M0Jj1JjK1rj9J2j9j1J9PRk8L0m4J8J9Kj1l2M5j8ol0K5J7j7PPNk0kK4
5400G%Lj9j1Lk5K9pK8pn0O0j5k1KK1Kj2J2Mk2K5j6l3L5K3Mm4J1K8k5J6rPMk0J4
5437Bk0lL6mk5K7J2j5kj5RLj8JRMJ1j8j3L1J2j5mK8nm6K3K9k1j3J5k1k1M2j7m
5473flj3M5j0M6o0j1%N4m0J0j8K0k4K0Nj4K8k6%OJ7m3K7j6J0kj4J7rK1l0K1J%
5508Ikj8kNnj3K1LKqOj5j9L9Ql8J4KnM8m4Jj8L4j6j5K7l5N1j1l3J1pqM3Pk9L1
5546B1k4J4j5lk0L1k2POmJ3Kj0RM0n1P%K6k8j6L4j5K1n4K8j1J5j6MkK3mKllj2
$$ y = [-12, 0, -13, -6, -5, 22, -15, -12, 11, -8, -37, 10, 29, 16, -3, 12, -3, -27, -22, 16, -5, 42, 22, 24, 10, 29, -10, 51, 9, 28, -5, 19, 28, 7, 12, 4, -6, 15, 32, 12, 16, 4, 33, 37, -7, -13, 13, 0, 5, 3, 5, 17, 10, 7, 24, -15, 9, 2, -12, -11, -23, 9, -6, 2, 6, -7, -22, 40, -4, 9, -23, 22, -24, 16, 17, 6, 7, 6, 27, 18, -1, 11, -8, -19, 0, 7, 16, -12, 18, -26, -8, 11, 13, 2, -30, 15, -3, -9, -39, -14, 3, -14, -7, 0, 5, -15, -17, 7, 7, 10, -9, -20, -17, -42, -13, -20, 8, 1, -49, 11, -4, -25, -23, -2, 0, -12, 0, 4, -18, 7, -9, -42, -7, 16, 20, -24, -13, 15, -10, 6, -3, 4, 8, -12, 2, -18, -21, 15, 11, -14, 13, 25, 10, 8, -7, 2, 5, -13, -12, -3, 1, 12, -6, -19, 12, 24, 9, 5, 33, 28, -18, 5, 34, 13, 0, 15, -6, -27, 15, -2, -6, -9, -22, 23, 13, 59, -1, -12, -12, 42, 2, 12, -6, 14, -10, 10, 15, 1, 29, 3, 3, 9, 26, -17, 10, -6, 4, 2, -12, 5, -4, 17, -13, 8, 9, 9, 7, -11, -13, -8, -13, -26, -5, -2, 0, -8, -2, -17, -36, 3, 11, -27, -13, -11, -16, 32, -12, -11, -29, 5, -11, -26, 1, -34, 17, 6, -27, -16, -23, -31, 12, 19, -10, 21, -3, 11, -4, -7, -27, 4, -18, -11, -5, -9, 4, 6, -4, 5, 45, -6, 1, 1, 27, -1, -17, 17, 2, 23, -31, -3, -14, 1, -15, -11, -13, 10, 6, 8, 5, 2, -10]
5583a0PL8k6k8L2k7K5j8k5L4j7K7L0j9nL0k4j4L5Qj3k5orPL4k6LJJ1j9K7k1J3
5617C0l4K1qK%Nj7Qj8K9k1J2Lk5J1J4pkPnRJ0m1J4J5k1Kj0N9l4l1M6j7kjqL8k1
5655A2ok1L6m5K6m6P3j9j8J3j3J1oK0l9K0J7oJ7qMok6Kj0K6j9j7K3J9j7j0J0j7
5689b0kK7r%K0j0k1JqMJlL1j8l4K0K0k1K6pJ6k1ONk2loL9mL1k9j7mK7o9O3qoJ1
5728Fnj4nL8Kqj3j3OJ9j5j7L7j3j5L0Pl3J5prJ7rNpJ8Jm1L9k2K3m2pL5j4K7j7
5765aJ7j9L2j0l1J4j0KK1j5J0J5Rrm7K3J9n3J6J4lK8k5lJ7j4k3L3Qk8K4k4Qk2
5799b7nK3j6M3k7m2J9K1j4KK0j8K6k6%J7j5PoKj0K2J5qk1J8lj3%rPkK3PlqqK5
5837A6l9L0J0j6J5j8J7k3pM7l3Oj1k0L1koLK4k8Rq%l5N9j9onN1n1j4M5l9K0J2
$$ y = [-10, -3, 35, 9, -19, 13, -14, 11, -7, -32, 2, -15, 12, 42, 23, 18, 48, 24, 10, 45, 53, 40, 15, 9, 0, 7, 41, 15, 18, 19, 30, 11, 38, 17, 30, -4, 17, 9, 11, 11, 16, -1, 7, -11, 18, -3, 9, 12, -13, -2, 12, 5, 3, 10, 5, 14, 24, -17, -3, 12, -9, -7, -17, 42, 8, -23, 23, 6, 4, 3, -5, 33, 12, 6, -15, 21, -24, 2, -44, 29, 10, -8, 5, -8, 3, -3, 17, -22, -2, 15, 9, 26, 18, 22, 16, -10, -8, -18, 8, -11, -28, -5, 14, -3, -13, -3, -20, -22, 5, -4, -4, 16, 6, -15, -14, -22, -18, -17, -20, 11, -7, -41, -21, -1, -22, 4, -3, 13, -8, -2, 3, -19, -22, -28, 11, 7, 38, 9, -8, -12, 15, -54, 9, 1, -5, 6, 1, -13, -18, 20, 22, 14, 1, -12, -6, 13, -2, -19, 18, 5, -10, 20, 27, -6, 9, 2, -7, 10, 1, 6, -1, 17, 18, -23, 16, -6, 17, -25, -32, 3, -11, 16, -1, 16, -3, 29, 19, -12, 2, -8, -6, 15, 0, 10, 25, 34, 25, -22, 1, 20, -33, -17, -3, -6, 22, -3, -6, 11, -3, -26, 7, 15, -13, 11, -13, -5, -27, -32, -9, -25, 18, -9, -51, -32, -11, -25, -23, -3, -21, 5, -21, -21, -4, -19, -12, -18, -16, -26, -4, 11, 3, -18, 0, -3, -16, -16, -25, -18, -20, 3, 10, 7, -1, -9, 16, -23, 7, 17, 1, 16, -2, 15, -8, -15, 32, -1, 5, -6, -26, 5, 3, -3, 0, 24, -4, 5, -3, -3, -38, 21, 2, -4, -9, 42, -9, -23, 22, -17, 3, 15]
5872A5k5J7k9J5K5rj6Nl2O9m3J7mJ0lk0K8l7L1j3nK8k2jKlj7J3J0J0j8j2NPn%
5908gJ2j6L4o3O9l1J4k0k9K7kokJ6Kj6pJ2K1j7j1k2J9L2j7k0J5J3K1l1J1J7jk7
5942a0MJ2K3n1J3jj3K1kqK9k5Lj6K2l4RK5J4j1j2J4j4J1j0J7Lj5OLkj6rJ2pJ1
5978dj1Rj2LMJ0k0J3J2j2jKJ5k7L3k0JK8q%l3K5l5K2jNj4%K2k5J5RK6j5lk2J7
6015Hj3M5m1Qj3J2mL7l4J6j8k2J5j5K9lLk1J2r%lJ3kpj1L7j1RK3m8nK3j4k2M8
6051B2k2j3kK7l5OK7j4K3j9Pl0O0l3k8K3J6k4K8n2K5OlJ0j2QmnNNqoJ8k0Pj1n
6088b3J7nNK1j8j1jQj4%J1klK0k6J8k3L0krJ1rJ2mlj3lJ3k8PM3l0K4j2L3j4l6
6125a6J4J3j2nj4K2K5k2K4k2j6J3K0k7j3L5k3PPk9J4rJ2M0n3ON2k4j7J6mLj3l
$$ y = [15, -10, 7, -22, -7, 18, 9, -7, -2, -34, 35, -8, 9, 5, 15, 12, -8, 20, -17, 14, 1, -4, 24, 2, 1, 3, 0, -17, -4, 6, 16, -2, -14, -9, -2, -7, -7, 5, -11, 23, -40, 29, -2, 12, -8, -37, -10, -12, -18, -20, -4, -2, -18, -25, -13, 8, -9, -20, -42, -23, 9, -8, -28, -13, 0, 21, -10, 1, 18, 17, -10, -6, 6, 29, -22, -9, -10, -23, -2, -4, -12, 17, -8, -5, -21, 1, -33, -24, 1, 15, 4, -8, 6, -8, 3, -7, 10, 13, -2, 4, 7, 5, -11, -20, -8, -15, -4, -15, -6, -18, -15, -11, -1, -21, -8, 4, -8, -9, -7, 8, -19, 14, -6, -5, 23, 15, 15, -18, 7, -28, -6, -7, -2, -16, -16, 6, -19, -4, 5, 31, 16, 13, -9, 8, -5, 40, -1, 7, -6, 6, 2, 39, 5, 21, 3, -19, -4, -19, 10, 7, 10, -11, 1, -8, -8, -11, 2, 0, -7, -18, 19, 8, 17, 40, -8, -13, 10, -4, -26, 22, 0, -13, -15, 12, -23, -17, 10, -4, 19, 0, 7, -23, 37, 4, -24, -1, 15, -9, 19, -33, -8, -2, -5, 5, -7, 1, -3, -8, -3, 2, -6, -12, 6, -14, -7, -18, -23, -6, -11, -6, 15, -3, -14, -15, -7, -21, -21, -10, -12, -15, 5, -21, -3, -26, 4, 2, -7, 4, -5, 7, 3, 0, -13, -16, -3, -31, -24, 19, -11, 13, 1, 34, 20, -16, -2, 11, -1, -6, -20, 2, 27, 5, 29, 7, -9, 4, 24, -3, -16, 19, -4, 3, 10, -19, -5, -14, -2, 38, -15, -9, 43, 19, 2, 18, 14, 17, 4, 1]
6159Aj1jJ4kqJj3NK1Mlnj5kJj4L5j1J9rJ7j7KmQk3j0J4J9J5Jlqj9L2J2l3K6l1
6198Ejj7RJ5mjl0K1k0kJ9J8Lm4K2J6j1jL6m0K2l2J7j5L4j4j4lK7j7K8jl5pJ7M
6234Dj5J6pJ1nj0NPo%Nkpjj5K0mjJ5%rJ2l7L0Kkj7j3J4j2LQj1k0J5%pM6j2J5j2
6275CMJ0k2J0mQl2L0m5K5J0j8K0K7l3QK4j4LJj9j0QRj5L8l0Rpqlk0L9k1NkK4m9
6313c7L7K0oNk4Pll4RL4nkj7J4ONk2K9j8oNJ8l6PJ9Qj1j2nJ7j5K8lm3L7J2j8m
6351dj5K2m2N2k9K8ok0QmJ3j7KJ7j3j1j0J9J1%Lj8K2nj9L1l0j0K6J3k6m3N6m4
6385d3M5k2Oj5L8k1KPKNOl1JQJ6rj2QJ4k1K3J4j5mj3j4J3pM7l6K2kJ1j1qNk7p
6423b5j5M2jQk7MlK2JJ1m4M6l1K2j8K0j2J2k5K6j0NQk1J6K0k8J7k4J3k2mJ1J5
$$ y = [1, -10, -11, 3, 1, -7, -6, -19, -14, 7, 11, 8, 3, -12, -14, -13, -27, 8, -3, 16, 7, 24, 7, 9, 5, 13, -10, -20, -6, 13, 28, 29, 26, 18, -1, 31, 43, 10, 36, 5, 4, -13, -4, 11, 7, 6, -24, -3, -23, -25, -6, 12, 15, -29, -7, 9, -2, -3, 33, -7, 15, -17, 0, -15, 19, 5, -9, -12, 15, -2, 26, 25, -10, -17, 0, 4, -11, 5, -2, 9, 4, -6, -1, 6, 0, 0, 5, 3, -4, -5, -20, 0, -4, -5, 10, 10, 1, 13, -24, 6, 8, 6, -11, -24, -10, -22, -19, -11, -22, -42, -27, -27, -34, 12, 0, 15, 3, 7, 17, -5, 5, 1, 9, -23, 7, -38, -13, -3, -21, -1, 26, -7, 1, 25, 11, 14, 15, -4, -14, -6, 3, -12, 26, -4, 5, -2, -10, -13, -33, 6, -15, -10, -12, 12, -37, 0, 20, 14, 19, -5, 2, -1, -35, -26, 8, 3, 1, -16, -2, 4, 9, -13, 16, -2, -8, -3, 15, -21, -14, 5, 13, 2, -10, -15, 2, -13, 15, 12, -31, 6, 18, 0, -4, -19, 3, -39, 13, -16, 12, 6, -14, -6, -10, 3, -14, -12, 5, -8, -19, -29, -10, 1, 1, 4, -14, 8, 3, -16, 15, -15, -25, 1, 14, -12, -55, 1, -43, 2, -20, -14, -29, 9, -12, -10, -3, -1, 4, 10, -21, -20, -12, 4, -5, -17, -9, 5, -16, 7, 21, 6, 2, -11, -25, -12, -19, 28, -8, 14, 12, 23, 12, 4, 9, -18, -25, -40, 2, 1, 9, -18, -14, -17, 5, 6, 17, -27, 19, -12, 10, -8, 12, 0, 12, -13, 13, 3, 8, 16, -5, 11, 31, 3, 20, -4, 9, -13, -17, -6, 9]
6457Ij9J4NoLNml0Q0m6J8ml7N1k9qK0l2J7j0oJ2LJ6j6O%j1k8N2j1j8J7pRk0Jq
6495a2J6lK2k6MNJ3l9PJ6Pjj0oJ3Kj3L9m9K2j7PQOl8N8j5m7M9mj6J%J0l9K6J9
6532A5j7j3K2j7Lkoj0%L5k5PJ0l2K7j5k5J4K5jlK6l5L1mkj8rNNk8L2pQnL0n7K8
6570hQm6J6P1l8nQNj2%j1JK3k3NK8Oj6j6jk4J5K2k6J3jK8l8M0l2K8l1QPK2k4%
6607Bk6M0oj9LL3k0qqMJ4l3J2oOQkj0K3J2l1jK0j1J7l2pL6j3K6l5M3Klj9j4J4
6644A1prpK8kk1j1K1MMJ8k5j7oK9k6M2qm5J5Kk0LM6l7K2k6J9Rj4Pk7L4k9j6L3
6680fj8OL0m1J3kK7j1j0MM3l3kK0j0K0k8j8k2L3K2pJj9JRj1L1Mn4OL4kj0LjK0
6717B2j3J5J9l5Qk4J7j1N0k3l2J0mJ9j3%Oj9j2K2j4K3k4J4mMj4%lL0rnnJ5%K1
$$ y = [9, -10, 4, 9, 3, 6, 11, 7, -23, 57, 11, 29, 25, -12, 39, 10, 2, 22, -10, 7, -3, -9, 3, 6, 22, 6, 12, 12, 1, -27, 25, 14, -4, 13, 6, 15, -5, -4, -12, 4, 1, 23, -3, 1, 6, 19, -20, -13, 3, 10, 9, -1, -7, 6, 8, -5, 34, -15, 7, -10, -3, 5, 11, -27, 31, 16, -31, 18, 14, -2, -1, -1, 9, -30, -4, 15, -2, -15, 7, -10, -7, -9, -15, -25, -25, 10, -15, -8, 2, -30, -3, -18, -43, -29, -4, -5, -8, 18, -17, 14, 10, 8, -10, -19, -14, -9, -37, -5, -12, -4, -9, 21, -36, -8, 0, -46, -30, 41, 3, -2, 6, 11, -1, -1, -12, -11, 12, -11, -6, 22, 28, 12, -4, -5, -29, -14, 8, -18, -5, -6, 22, -16, 24, -8, 20, -11, -3, 4, 26, 2, 2, -24, 16, 10, -9, -6, 27, 7, -1, -9, -5, 9, -24, -12, -18, -12, -4, -6, -16, 7, 19, -12, -13, 7, -4, 13, -19, -26, 10, -3, 23, -12, 31, 33, 30, 11, -3, 11, 4, -5, -12, 16, 14, -7, -18, 3, 7, 11, 29, 4, -13, -19, 10, -16, 26, 18, -27, -12, -10, -30, -27, 19, -18, 4, -22, -3, 6, -8, -1, -28, 6, -23, -39, -6, -24, -18, 12, -29, -16, -18, 9, -2, -12, -8, 35, 2, 0, 20, 10, 30, 2, -16, -38, -5, 17, 10, 11, -8, -7, 2, -9, 22, 26, -28, -22, 12, 10, 0, 3, 2, 22, 9, 24, 43, 8, 16, -8, 9, -2, 48, 25, -7, 3, -1, 18, 5, 5, 11, -8, -20, 2, -12, 11, -13, 1, -3, 1, -13, -13, -16, 14, 5, 0, -5, 10, 10, 31]
6753C1lJ1k5k%J4j6j9J7j9L2Jk6kJ0J8l6K6K5n5J6jmOJl0RJ0j2K7pk2J8MK2l5
6789a6L2k2n0M6rN0j4nK1m7J0J4k6mL7K3n2K5J9rK0k7k2K1oJ3j2J5k7lL1j3Pr
6823A1K9n1J8qK5k6J1k3rJ6LkjK0k5KNRk2j4L9oqJ8Ml4K7l6M4j3lJ2qj5Lk1J1
6860a8J8k6K3k3L6K1l5j6K0K0l0J8pPNoO%jj9j0K9j2l0Q0p0J9Pl8N1Pj6Jj5L0
6895B6rOj4l7K4K1qj2j2LnOMK0j0J7j1r%j0J8j0K2j6l0K6mJ0qJj0J2j3K6%j6m
6932fnkOk9K3J4K3k7rJk2L5J1j8NL0m0J3j2MpKMJ3l0O2l1k3K0oq%%j1j8L7J9n0
6970c2M4j1k1L7j4j1nnJ7j9J7J6pnJ6k5L7k6J7l1k7N2knj1K5qNj4L4j7m8L1JJ2
7005A7j6j4QQpj0L1k8OJ1j9K4qkk4J3J7pK1k2rmJ4j1J5j9Lj0K1L0rOk4PkL1k4
$$ y = [31, 28, 39, 14, 12, 12, 26, 10, -9, 8, -11, 21, 22, -4, -6, 4, 22, -14, 12, 37, -18, -2, -3, -7, -1, 0, -30, -21, -11, -23, 4, -3, -25, -7, -3, 19, -16, 16, -6, -56, -10, -19, 31, 17, 12, 33, -14, -4, 10, -16, -20, 17, 40, -12, 13, 32, 23, 43, 16, -6, 15, 9, 22, 10, 25, -2, -5, 26, 13, 20, 11, 40, -11, 7, -1, 24, -2, 9, -14, -23, -7, -4, -6, -7, 13, -12, -10, -5, 4, -18, -32, 7, 1, -7, 11, 15, -19, 8, -28, 16, 3, 0, 12, 4, -11, -8, -29, -18, 0, -26, -3, -26, 10, 31, -4, -20, 0, 20, -10, 8, 1, 8, 13, 7, 13, 13, 12, -7, -17, 12, 0, -30, 50, -20, -1, 6, -32, 19, 26, 10, 11, -4, 26, 17, 23, 9, -28, -4, 17, 9, -3, -15, -12, -17, -11, -7, 13, 3, 20, 9, 0, 0, -10, 8, -2, 20, 4, -26, 0, -4, 6, -2, -1, -11, 1, -12, 14, 14, -2, -6, -11, -13, -7, -36, -13, 1, 24, -3, -12, -11, -33, 2, 13, -5, 0, 30, -10, 3, -9, -5, -12, -10, -6, 7, -23, 39, 8, -15, 5, -1, -9, -9, -9, -20, -38, -1, 18, -32, 12, 1, -20, 17, 3, -8, -13, -18, -1, -20, -3, 13, 6, 1, 17, -8, 29, 3, 20, -11, -38, 14, 12, 7, -4, 21, 13, 18, 4, 38, 21, -27, 4, 5, 17, 1, -13, -5, 3, -4, -14, 17, -11, -5, 6, -13, 11, 3, 1, -23, -10, 7, 0, 21, -1, -10, -14, 0, -11, 4, -15, -12, -22, -1, 29, 20, 26, 2, 9, 7, 38, 14]
7042A4l9K4JJJ2j9%L8k0Mjk5NJ5k6J7j7J1j9L8j2J5k7J0Kkj9pOMj4LL7l5RL4j9
7079aJ5nql0L6pk8L5olj2Nj0J3J0j1rJ2K8k4pK2k4M2k0k8K0n2K8J5Q%Pkj0j5j9
7116c5K2J7J8m8KL9j3j7Pk8j6M1KknkJ6j6j0K0k2L2j3Mj7L2OqMkk2j8K0j%RnL0
7154B1nk2J7QlPl7LJ9JPl7L4j0J5k0JJ3j9RLj4ON0m8J4j1k4kJ9J8rl9M0Kn%j0
7192hK2j2j5K7Ol3Oj0L9j0n0L4J8Nj6K9n5J1K0KNj4J6jk9LM2k1qJ5j7j3MJ7j7
7227hJ2j1kOj6Pk2M0j7NJ5rLMJk3J5j2j8L3Jk5j4J8lK0l%l5K0J3LJ6j0j3J8j1
7264bk2J7%LJ5oj4K1J5j9mN%l5O7k7lj0rJ5Lj1Ok1J9Lj7K4j4J7j8Pj8jmrM0Mk0
7303cOL0m6K9nk3J7%KJ7k7jJ6j4J9j5Jj6J2J7Kj2PK2l5J7OroJ1j2JPk1K8j9mk8
$$ y = [14, -25, -1, 0, 1, 13, -6, -6, 32, 12, 16, 15, -10, -5, 10, -16, 1, -16, -5, -24, 14, 2, 17, -10, 0, 2, 0, -19, -26, -20, -16, -30, -27, 10, -25, -16, 18, -1, 14, 9, 1, -29, 7, 0, -28, 7, 1, -2, -14, -9, -19, -6, 4, -7, -16, -4, 24, 0, -7, 15, -9, 33, 13, -15, 5, -47, -19, -4, 4, 4, 11, 9, -1, -16, -35, -13, 4, 22, -26, -24, 15, 2, -15, -8, -36, -52, -11, -9, -11, -16, -18, -2, -18, -28, -8, -30, 2, -11, -7, -24, 8, 14, 6, 10, 8, -14, -32, -12, -13, -13, -4, -9, 21, 16, -6, 11, 19, 16, 23, -14, -11, 8, 9, 16, -21, 13, 3, 18, -2, -1, 12, -7, 2, 5, -9, -3, 47, -1, 13, 2, -22, -24, -5, 13, 4, -35, 5, 7, 2, 2, -8, 14, 2, -13, 14, 20, -13, -7, -17, 22, 12, -38, -4, 14, 19, 3, 32, -23, -12, 8, 10, 15, 1, 17, 16, -13, -10, 32, 11, 3, 18, 1, -12, -8, 9, -8, 4, -7, -9, -3, -19, -12, -34, 6, -11, -6, 9, 0, 3, 7, 8, -15, 0, -12, -30, 3, 4, -21, -35, -17, -20, 0, -3, -3, -38, -18, -5, -2, 14, 4, -9, 9, -2, -24, -7, -7, -4, 11, 5, -9, 12, 27, 8, 4, 9, 9, -26, 41, 14, 11, 1, -8, 7, 10, -1, 5, -16, 3, 6, -11, 13, -1, 16, -2, 5, -13, -14, -18, -27, 13, 17, -3, 3, 33, -13, 16, 11, -12, 5, 5, 7, 24, -3, -4, 12, -2, 17, 2, 3, -13, -1, 16, 18, 6, 13, 35, 0, 17, 23, 14, 8, 19, 7, 8, 15, -6, 22, 3, -1, -29]
7341b9J4K8k2RKK9k3j1lJ2Qjj2j5J3k7NK4j0L0k4LOk0J9nj2kK1Ml9L4pKJ4l5L4
7378A4jRl8pK9k0LRmqL4l4L9l5MJ1J3k0kPK1ql4K8j8J3l5L4j4pj0N8o1Lj3K5j2
7415b7j0N3rj9J5JLJk1l0M0RqkNj9J4QK0k2J3j6J9j8l7N4l1J4NkpJL6j4l6M0j1
7452A2mLnj1nmkPL2k9NK8k3qpJ4Ok0oLJ8J6l0K6k8mJ2k4K6K2j0k4kK2j4Pk1K0
7490bpnK0j3MJ6Jj1K6l4rK5KJ2j2rqpJ8l4L7J5l8l0L2J2mK2j1kjoqPj7J2%j6q
7529c1L8m5M4J5m0j1J4QNkk6M6k8KLJ0K5m3L9j4k5J4j3OoL2jl5N2j9J0m8J8%k2
7564b8M0rQj0JJ9l7RPJ9nk8K5l7K2K4Mj3J0k2K1n0J5K1Kpj8K1lj7J1j0K3Oj7J2
7600IjrKk0K2j5RKRlJ1j7jJ8mK5k4j2k9K5J6J7n1RJ9j1K5l5mJ5KrJ8kJ1Pqkj6
$$ y = [-29, -15, 13, -9, 0, 2, 31, 8, -3, -6, 6, 14, 13, 1, -14, -1, -28, -23, 1, -9, 21, -3, 0, 6, -14, 5, 0, -12, -14, 7, 11, -28, 6, -1, 1, 15, -20, 14, 13, 22, -16, -23, 6, -14, -11, -2, -6, -14, 20, -14, 25, -10, -6, 5, 18, -2, -4, 3, 24, 16, -18, 10, -8, 5, -30, 4, -10, -17, -27, 31, -30, -27, -40, -15, -27, -37, 16, 7, -12, 3, 4, 7, 8, -13, -43, -3, 6, -2, -4, 1, -18, -4, 4, 24, 2, 15, -1, 18, 0, -37, 17, -14, 0, 5, 3, -4, -3, 33, 19, -17, 23, 12, 8, 11, 6, -5, -10, -14, -16, -9, 23, -6, -1, 27, 4, -4, -11, 3, 9, -11, -17, -14, 4, 20, -10, 16, -12, -16, -4, -28, -2, 20, 10, -14, -16, 6, -8, -1, -22, -2, -9, -14, 6, -7, -3, 13, 14, 3, 29, -5, -14, 11, 13, 25, 13, 4, -4, -11, 7, -27, 10, 25, -13, -43, -11, 1, -3, 19, 8, 6, 5, -1, -9, -2, -19, -7, -7, -23, -31, 7, -38, 6, 21, -19, -30, -16, -8, -3, -5, -31, 15, -13, -11, -8, 2, 27, -16, 23, 9, -16, -2, -15, -9, -15, 17, 16, -19, 33, 14, 24, -24, -6, -6, -28, 12, 3, 11, 1, 2, 21, -16, -7, 0, 19, 14, -14, 11, -26, -4, 20, 24, 11, 21, -1, 20, -30, -15, 6, 8, 1, -17, 4, 1, -16, -5, -15, 8, 14, -3, 9, 8, -1, 1, -19, 3, -12, -3, -1, 8, 5, 16, -1, -2, 16, 12, 37, 13, 1, -28, -3, 13, 30, -21, -12, 7, -4, 21, -14, -18, -3, -1, -10, 8, 6, 17, 24, 16, 14, -2]
7639bJ6rk1Jroj3M3j4K9Nl5J1K8n5L5LJ0m4K0J1OlJK3m6J9rJ7J4j6j3J6m2K9m
7675djJ5rlk2M0J7k7Ok9J8J7j9lnJ2j5k6N3l1J1Rj1JQj7j2K5%j3Qk4J2mJ2J%K3
7713A3m6L2Nl0K6Rk2K0L7n0j5L%K8mKPkj1J0j7Jj1M2Nm0K6k7L0k0pLK0mOl4M2
7750B7j1j4l0K4Kl4K8j3K1j2J4j0j2PK0%J0LkJ0j9Q%k4L2j9k5RK3jj4Pj4lJ8%
7786FmJ0QPk2oQJ1j8K1j5K2j8QJ5m0K1j6J1qj3PJj2RL4m2j4J2QPK6m1K0k4%J6
7823eJ0pk9K0nJJ5K4j7Qpk7QJ7Qj8j6K1j2K0qkpqJ8Lj8K0Ok3K4k2KK6k6j9J1M6
7861C2k6Rj8J6k5j4M0k2K1k8Mj2L0%Loqj3JL4k4%mNKlJ0k8M7k0rj3K1J1n2M8k
7898GoRrpLM9o6J7qK0okmQJ7k5L4n0M0m4OK4oJlJ5j9K1l3nK4k0K0J4k5j4L8k1
$$ y = [-2, 14, 5, -16, -15, -24, -30, -43, 0, -14, 15, 20, -15, -4, 24, -31, 4, 7, 17, -27, -7, 4, 10, 7, 8, 31, -15, 4, -5, 12, 26, 10, -3, 13, -29, 0, -4, -5, 10, 1, -2, -24, 16, 33, 6, 12, -17, 1, 18, -1, -4, -9, 3, -12, -38, 15, -16, -5, 4, -7, -6, 2, -15, -27, -2, -2, -15, -7, -31, -19, -23, -11, -10, -10, 13, -33, -1, 4, -26, 0, 9, -13, 7, 44, -6, -21, -18, -18, 10, 6, 8, 15, 13, 2, 12, -5, -4, -15, 27, 32, -8, 18, -9, 21, 1, -6, -3, 17, 13, 19, -15, 27, 16, 2, -28, -4, -2, -36, -8, -21, 0, -12, 2, -8, -20, -13, 7, 7, 17, 20, 18, 28, 9, 17, 17, -7, 25, 6, -19, -10, 13, 12, -2, 5, -9, -12, 6, 6, 2, 12, 20, 27, 5, -1, 7, 18, 0, 21, 6, 28, 10, 18, 33, -7, 14, -2, 9, 1, -12, -5, -4, -16, -7, 27, -15, -29, -17, -9, -2, 24, -17, 3, -21, -21, -5, 5, -2, -31, -11, -16, -15, 0, 24, 7, 15, 8, -19, -11, 6, 14, -4, -20, 1, -11, 9, 1, -1, -8, -16, 2, 5, -13, 7, 13, -10, 14, -8, -6, 20, -6, -25, -14, 32, 6, 15, -3, 13, -12, -26, 14, -8, 13, -15, -11, -23, 7, 7, 10, 4, -4, -17, -16, 18, -6, -6, -10, -5, -3, -6, 4, -24, 23, 3, -6, -19, 2, 13, -39, 9, 7, 1, 10, 1, -6, -3, 46, -20, -3, -11, 9, 3, 1, -3, 5, 22, -3, 31, -19, 21, -23, -17, 7, 1, 2, -1, 14, -5, 16, -17, -22, 2, -18, 2, 16, -9, -23, 15, -6]
7936fOj3RPj5j2L1Ok7j2J8j3K7m2J7J8Rk2PPK6l2j0K1Kj8NJ7j0oJ4jqJ2l4Rj3
7973b6kM7nj2rK1l5K2J0k3JJ8l2L3ql0L4k6J1j4JJ6J0j0l6K7J7j9jj0J8K8krP
8008A2l4J7J6J2Jk7j0L0Kj8j1K3k2J3J0j5K0k6rK5j3kNj2M5J2n6QJ0k2lNL4j7
8042Cl1L4j2PJ8j4%J7l9pQK6k6J3j3J0Qk0K5NkQKj5j8j1NK3qJ1k3L5j4K9k7k1
8078a4J2NK1Pl2RJ9l4lkQpl5M5K2m5j8M0J8l0l0L2NJ6l2kJ7K1k6olJ5j8J7J4j8
$$ y = [-6, 0, -13, -4, 3, -12, -24, 7, 13, -14, -26, -8, -21, 6, -36, -19, -1, 8, -14, -7, 0, 26, -6, -16, 5, 7, -11, -6, 11, 1, -5, 9, 8, 0, 12, -22, -13, -26, -28, 19, 14, 2, -7, 14, -21, 1, 11, -12, -11, 7, -25, 8, 0, -30, 4, -22, -11, -25, -24, -8, 2, -8, -44, -17, 0, -19, -20, -30, -12, 16, 14, 5, 12, -22, -5, 11, 23, 24, -3, -13, 17, 19, 1, -10, 13, -9, 4, 14, -1, 19, -7, -16, 9, -4, -6, -1, -13, 32, 44, -12, -4, 6, -16, -19, -14, 20, 3, -28, 6, -6, 1, 19, 5, 5, 22, -17, -24, -16, 10, -16, -3, -16, -6, 2, -18, 7, 12, 10, 18, 20, 5, -13, -24, -19, 4, -4, 7, -16, 19, 5, 34, 7, -14, -2, 3, 24, 31, -1, 8, 27, -7, -10, -12, -4, -11, -46, -1, 21, -24, -42, -2, 16, -14, -44, -12, -7, 9, -23, -25, -8, 13, -13, -19, -22, -7, -25, -8, 6, -12]
$$ [...]
8191B8
##END NTUPLES=NMR FID
##END=
