##TITLE=1H_SA_PPhvCl(CH2Cl2)Cl
 CDCl3, 8 sc, 
 20.9.2019
##JCAMPDX= 6.0         $$ Bruker NMR JCAMP-DX V2.0
##DATA TYPE= NMR FID
##DATA CLASS= NTUPLES
##ORIGIN= UXNMR, Bruker Analytische Messtechnik GmbH
##OWNER= root
$$ XWIN-NMR		Version 3.5
$$ Fri Sep 20 14:14:49 2019 Russian Standard Time (UT+4h)  she@DPX200
##.OBSERVE FREQUENCY= 200.1315
##.OBSERVE NUCLEUS= ^1H
##.DELAY= (6, 6)
##.ACQUISITION MODE= SIMULTANEOUS
##.ACQUISITION SCHEME= undefined
##.AVERAGES= 8
##.DIGITISER RES= 18
##SPECTROMETER/DATA SYSTEM= spect
##.PULSE SEQUENCE= zg30
##.SOLVENT NAME= CDCl3
##.SHIFT REFERENCE= (INTERNAL, CDCl3, 0, 15.7039)
##AUDIT TRAIL= $$ (NUMBER, WHEN, WHO, WHERE, WHAT)
$$ ##TITLE= Audit trail, XWIN-NMR		Version 3.5
$$ ##JCAMPDX= 5.01
$$ ##ORIGIN= Bruker BioSpin GmbH
$$ ##OWNER= she
$$ F:/spectra/data/she/nmr/H-F/1/audita.txt
$$ ##AUDIT TRAIL=  $$ (NUMBER, WHEN, WHO, WHERE, WHAT)
(   1,<2019-09-20 14:13:47.28 +0400>,<she>,<DPX200>,
      <created by zg, POWCHK disabled, PULCHK disabled
       configuration hash MD5:
       00 E9 B6 7A A2 85 ED C7 34 08 36 98 17 FE 4E 26
       data hash MD5: 16K
       B9 C8 9C A2 AD 78 99 E4 28 97 A0 02 FF 53 BA 1B>)
$$ ##END=
$$ 
$$ hash MD5
$$ 98 A1 04 A6 32 B5 3A B7 E4 5F D5 BA 1D 4B BA 8F
##$RELAX= 
##$RELAX= 
##$RELAX= 
##$RELAX= 
##$RELAX= 
##$RELAX= 
$$ Bruker specific parameters
$$ --------------------------
##$DU= <F:/spectra>
##$EXPNO= 1
##$NAME= <H-F>
##$PROCNO= 1
##$TYPE= <nmr>
##$USER= <she>
##$AMP= (0..31)
100 100 100 100 100 100 100 100 100 100 100 100 100 100 100 100 100 100 
100 100 100 100 100 100 100 100 100 100 100 100 100 100 
##$AQSEQ= 0
##$AQ_mod= 1
##$AUNM= <au_zg>
##$AUTOPOS= <>
##$BF1= 200.13
##$BF2= 200.13
##$BF3= 200.13
##$BF4= 200.13
##$BF5= 200.13
##$BF6= 200.13
##$BF7= 200.13
##$BF8= 200.13
##$BYTORDA= 1
##$CFDGTYP= 0
##$CFRGTYP= 5
##$CHEMSTR= <none>
##$CNST= (0..31)
1 1 145 1 1 1 1 1 1 1 1 1 1 1 1 1 1 1 1 1 1 1 1 1 1 1 1 1 1 1 1 1 
##$CPDPRG= <>
##$CPDPRG1= <>
##$CPDPRG2= <>
##$CPDPRG3= <>
##$CPDPRG4= <mlev>
##$CPDPRG5= <mlev>
##$CPDPRG6= <mlev>
##$CPDPRG7= <mlev>
##$CPDPRG8= <mlev>
##$CPDPRGB= <>
##$CPDPRGT= <>
##$D= (0..31)
0 1.2 0 0 0 0 0 0 0 0.06 0 0.03 0 0 0 0 0.0002 0 0 0 0 0 0 0 0 0 0 0 0 
0 0 0 
##$DATE= 1568974426
##$DBL= (0..7)
120 120 120 120 120 120 120 120 
##$DBP= (0..7)
150 150 150 150 150 150 150 150 
##$DBP07= 0
##$DBPNAM0= <>
##$DBPNAM1= <>
##$DBPNAM2= <>
##$DBPNAM3= <>
##$DBPNAM4= <>
##$DBPNAM5= <>
##$DBPNAM6= <>
##$DBPNAM7= <>
##$DBPOAL= (0..7)
0.5 0.5 0.5 0.5 0.5 0.5 0.5 0.5 
##$DBPOFFS= (0..7)
0 0 0 0 0 0 0 0 
##$DE= 6
##$DECBNUC= <off>
##$DECIM= 24
##$DECNUC= <off>
##$DECSTAT= 4
##$DIGMOD= 1
##$DIGTYP= 9
##$DL= (0..7)
0 120 120 120 120 120 120 120 
##$DP= (0..7)
150 150 150 150 150 150 150 150 
##$DP07= 0
##$DPNAME0= <>
##$DPNAME1= <>
##$DPNAME2= <>
##$DPNAME3= <>
##$DPNAME4= <>
##$DPNAME5= <>
##$DPNAME6= <>
##$DPNAME7= <>
##$DPOAL= (0..7)
0.5 0.5 0.5 0.5 0.5 0.5 0.5 0.5 
##$DPOFFS= (0..7)
0 0 0 0 0 0 0 0 
##$DQDMODE= 0
##$DR= 18
##$DS= 0
$$ [...]
##$SUBNAM2= <"">
##$SUBNAM3= <"">
##$SUBNAM4= <"">
##$SUBNAM5= <"">
##$SUBNAM6= <"">
##$SUBNAM7= <"">
##$SUBNAM8= <"">
##$SUBNAM9= <"">
##$SW= 24.0689530833862
##$SWIBOX= (0..15)
0 0 2 0 0 0 0 0 0 0 0 0 0 0 0 0 
##$SW_h= 4816.95568400771
##$TD= 16384
##$TD0= 1
##$TE= 0
##$TE2= 300
##$TE3= 300
##$TEG= 300
##$TL= (0..7)
0 120 120 120 120 120 120 120 
##$TP= (0..7)
150 150 150 150 150 150 150 150 
##$TP07= 0
##$TPNAME0= <>
##$TPNAME1= <>
##$TPNAME2= <>
##$TPNAME3= <>
##$TPNAME4= <>
##$TPNAME5= <>
##$TPNAME6= <>
##$TPNAME7= <>
##$TPOAL= (0..7)
0.5 0.5 0.5 0.5 0.5 0.5 0.5 0.5 
##$TPOFFS= (0..7)
0 0 0 0 0 0 0 0 
##$TUNHIN= 0
##$TUNHOUT= 0
##$TUNXOUT= 0
##$USERA1= <user>
##$USERA2= <user>
##$USERA3= <user>
##$USERA4= <user>
##$USERA5= <user>
##$V9= 5
##$VALIST= <valist>
##$VCLIST= <CCCCCCCCCCCCCCC>
##$VD= 0
##$VDLIST= <DDDDDDDDDDDDDDD>
##$VPLIST= <PPPPPPPPPPPPPPP>
##$VTLIST= <TTTTTTTTTTTTTTT>
##$WBST= 1024
##$WBSW= 4
##$XGAIN= (0..3)
0 0 0 0 
##$XL= 0
##$YL= 0
##$YMAX_a= 441937
##$YMIN_a= -356432
##$ZGOPTNS= <>
##$ZL1= 120
##$ZL2= 120
##$ZL3= 120
##$ZL4= 120
##$ABSF1= 10
##$ABSF2= 0
##$ABSG= 5
##$ABSL= 3
##$ALPHA= 0
##$AQORDER= 0
##$ASSFAC= 0
##$ASSFACI= 0
##$ASSFACX= 0
##$ASSWID= 0
##$AUNMP= <proc_1d>
##$AZFE= 0.1
##$AZFW= 0.1
##$BCFW= 1
##$BC_mod= 2
##$BYTORDP= 1
##$COROFFS= 0
##$CY= 11.3945322036743
##$DATMOD= 1
##$DC= 2
##$DFILT= <>
##$DTYPP= 0
##$F1P= 20.1720416913024
##$F2P= 0.152960286110954
##$FCOR= 0.5
##$FTSIZE= 0
##$FT_mod= 4
##$GAMMA= 1
##$GB= 0.15
##$INTBC= 1
##$INTSCL= 1
##$ISEN= 128
##$LB= 0.24
##$LEV0= 0
##$LPBIN= 0
##$MAXI= 10000
##$MC2= 0
##$MEAN= 0
##$ME_mod= 0
##$MI= 1.114404
##$NCOEF= 0
##$NC_proc= 0
##$NLEV= 6
##$NOISF1= 3.799351
##$NOISF2= 2.8
##$NSP= 1
##$NTH_PI= 0
##$NZP= 0
##$OFFSET= 15.70392
##$PC= 1
##$PHC0= -9575.053
##$PHC1= 19.20096
##$PH_mod= 1
##$PKNL= yes
##$PPARMOD= 0
##$PSCAL= 0
##$PSIGN= 0
##$REVERSE= no
##$SF= 200.130013532006
##$SI= 16384
##$SIGF1= 3
##$SIGF2= 2
##$SINO= 400
##$SIOLD= 16384
##$SREGLST= <1H.CDCl3>
##$SSB= 0
##$STSI= 0
##$STSR= 0
##$SW_p= 3612.71676300578
##$SYMM= 0
##$S_DEV= 0
##$TDeff= 0
##$TDoff= 0
##$TI= <>
##$TILT= no
##$TM1= 0
##$TM2= 0
##$TOPLEV= 0
##$USERP1= <user>
##$USERP2= <user>
##$USERP3= <user>
##$USERP4= <user>
##$USERP5= <user>
##$WDW= 1
##$XDIM= 8192
##$YMAX_p= 0
##$YMIN_p= 0
$$ End of Bruker specific parameters
$$ ---------------------------------
##NTUPLES= NMR FID
##VAR_NAME=  TIME,          FID/REAL,        FID/IMAG
##SYMBOL=    X,             R,               I
##VAR_TYPE=  INDEPENDENT,   DEPENDENT,       DEPENDENT
##VAR_FORM=  AFFN,          ASDF,            ASDF
##VAR_DIM=   8192,          8192,            8192
##UNITS=     SECONDS,       ARBITRARY UNITS, ARBITRARY UNITS
##FACTOR=    0.0002076,     1,               1
##FIRST=     0,             0,               0
##LAST=      1.7004516,     0,               0
##MIN=       0,             -356432,         0
##MAX=       1.7004516,     441937,          0
$$ Real data points
##PAGE= N=1
##DATA TABLE= (X++(R..R)), XYDATA
0@%%%qJ6j6J6j6K4l2M0n6P2q8J05j29J60j91K24k64L12l62M18m82N55o39P32q33
28d42R46j072J209j358J522j705J905k126K366k628K919l238L589l976M402m874
44b561N396n983O643p390Q245r233J0391j1767J3440j5524J8204k1803K6914l4815
58a9843M8811q1108K90001J82855k53030J50926P1913J946r305N8771j13932r6710
70B31295O5403J21235o0668p3656J4740J4882o4815j022L1445l2311o1202K7821
82B13147K3685o1719p6370O095L1155O205k2894l9168m3953j1035Q222L476J361
95C8207j1004n6625m6249K8639L4051m1419l9532K5187K50n7735m450M8761j5868
108i7787m8291K8943L2706o0299l8276O6651K9547o6162j1078O3966j3734o4489
$$ y = [0, 0, 0, 0, -8, 8, -8, 8, -8, 16, -16, 24, -32, 40, -48, 57, -72, 88, -103, 121, -143, 169, -193, 225, -257, 298, -341, 391, -442, 504, -568, 641, -717, 805, -900, 1005, -1121, 1245, -1383, 1536, -1702, 1887, -2089, 2313, -2561, 2835, -3148, 3495, -3895, 4350, -4883, 5508, -6259, 7181, -8343, 9861, -11942, 14972, -19843, 28968, -52140, 237861, 420716, 167686, 318612, 390525, 392471, 383166, 441937, 328005, 231295, 296698, 417933, 357265, 283609, 298349, 313231, 248416, 247394, 278839, 246528, 185326, 213147, 236832, 175113, 98743, 104838, 135993, 142198, 119304, 80136, 36183, 25148, 33370, 36846, 38207, 27203, -29422, -75671, -47032, -12981, -54400, -93932, -68745, -68495, -126230, -130680, -81919, -97787, -146078, -117135, -84429, -144728, -183004, -116353, -86806, -152968, -164046, -100080, -113814, -178303]
120a78303L4795O8088l9811n2600N4418M6783m8911k4151N3651J7232l3424J4578
132h7655L5233k7216k8888M3176L7735k4223j4943K2898k52j6371K1177L1098
144h231j0486k1664P203J5381N654L302l412m356J3482R777j8055o958K7095J0121
158A8853k3600P71K4288j3002k5808K3782K9276k3528k2096K3700P241k6788J0428
171C517L2539k1824l5460K8418L2957l3658k6008L7056J7186l7778o164L5529
183B6310p906l6232J6819L7089j7641l1074J4481J7496j3201j587J8177r316k2958
196i543J1152K2682q316j7085P022Q371n368j212N970l611q010K496R197N220
210A8965n031j5663o325J9593J8158j4751k0182O607R304p908L953J8107r270
$$ y = [-178303, -143508, -75420, -115231, -167831, -113413, -66630, -115541, -139692, -86041, -68809, -102233, -87655, -52422, -79638, -108526, -65350, -27615, -51838, -66781, -43883, -44135, -60506, -39329, -8231, -18717, -40381, -33178, -17797, -12143, -8841, -12253, -16609, -3127, 6650, -11405, -18363, 8732, 18853, -4747, -3976, 20312, 7310, -18498, 5284, 34560, 11032, -11064, 12636, 19877, -6911, 3517, 36056, 14232, -21228, 7190, 40147, 6489, -19519, 17537, 34723, -3055, -9219, 26310, 18404, -17828, -1009, 36080, 18439, -12635, 1846, 19342, 6141, 4554, 22731, 13415, -9543, 1609, 24291, 15975, -1110, 5912, 14283, 8915, 7703, 13673, 10062, 2052, 4548, 13745, 18965, 13934, -1729, -8054, 11539, 29697, 14946, -5236, 1371, 10675, 2767, 6720, 24827, 15557]
223A5557k7949L264K3445k990j2795R017J042k1658P77K8486k214k7343O331K4453
237A7423j4413k5830J6565K4425j6410j9382J2948Q600j7732m412K0345M541j6346
250i678m868P969N26p22Q835J643j2625o071R218N542n484j817M919r7q167k535
266a3412J1199J0150n771j0474L966J0424m378o390J0245J0235j3386j3856J1097
279c51J3607o937o924P832m0r914N576J5377l205j2065O133P594j0341m091J6318
294A8569M476j9615o270J7498L907j6087p08J6085k168j6744J107J4479R85r482
308F032Q5M158m559m664M801L318o292l883L378j023n361K069Q131l094j1406
323h310R96J0801q26j1849J041J1886k335j4101OJ2175l66j0565Q72Q351m157
$$ y = [15557, -12392, -9128, 14317, 11327, -1468, 7549, 8591, -13067, -12290, 16196, 13982, -13361, -7030, 17423, 3010, -22820, -6255, 18170, 1760, -17622, -4674, 3926, -13806, -18218, 2127, 6668, -9678, -14546, -6577, -6051, -6773, 2062, 3705, -8920, -14991, -5773, -231, -5715, -7532, -2613, -2710, -10877, -13412, -2213, 7937, 2166, -8308, -4342, 6082, 1704, -4686, 5559, 15794, 2408, -11448, -351, 13256, 6319, -605, 7227, 7187, -2727, 2849, 18226, 15021, 2956, 9089, 16683, 6342, 2251, 18569, 23045, 3430, -2840, 14658, 18565, 2478, 1770, 17855, 15687, -1057, 50, 14529, 15514, 6032, 6117, 10275, 5716, 1052, 5853, 9171, 2879, -1004, 2374, 1351, -4010, -1941, 6190, 3096, -8310, -7314, 3487, 2661, -9188, -8147, 3739, 1404, -12697, -12691, -516, -882, -11447, -10575, -2224, -6381]
338f381p472N615P477m420n655M211J525o113J864Q636l519j0245L764J0098m121
353d736r130O070R026o975q996P417Q798p609p370P959P225o900o444O737N265
368C37m593k415N294J103o127P97O902j000n986K042L989m366k728Q100M834q264
384b081n054R164O204q209l771R217L927r681l284R321L014q277j683P642J254
399G703o324O89N564q76k775L508K398n112j439O436J673p478j722O673l46p714
415H58J104R514p61j0304r8R488Q97p743O81O080j843o368K184N618k384n282
431A641J981K379l041j302M100N09m522K59N591j619o725K096O994k845q017K305
447b16O507l341p185M254O691n385q324M748O408m346n421L788K527m737k158
$$ y = [-6381, -13853, -8238, -761, -5181, -10836, -6625, -5100, -11213, -9349, -713, -4232, -14477, -10713, -615, -4736, -13866, -7796, 1230, -5745, -14741, -7324, 1474, -6135, -13505, -5546, 1679, -5221, -11665, -4928, 337, -4256, -6671, -1377, -274, -6401, -5604, 1298, 298, -5688, -3646, 343, -4023, -6751, 1349, 6183, -2081, -7135, 2029, 8233, 24, -3747, 5470, 9397, -284, -3568, 5753, 8767, 490, -1193, 6449, 7703, 1379, 2068, 7632, 6756, 3981, 7489, 9887, 4775, 3336, 9772, 11445, 3967, 2245, 8918, 8572, 858, 1962, 11476, 10715, 411, 313, 9801, 10698, 2955, 3636, 9716, 7873, 1505, 3689, 9307, 6923, 1641, 3622, 6001, 2960, 1658, 5758, 6267, 1745, 2004, 7595, 5976, -749, 1347, 8341, 5496, -2521, -216, 6291, 2950, -4235, 19, 6710, 1325, -6999, -2251, 4157, -189, -5610, -1822, 705, -4032, -6190]
462f190M673R1n434J019L346l393l446M734L511o273l848O078L241p198k401P384
478d106K108p077k636O590L610n045k410M099K296k435j450K297Q62o75l9J274
494b737n59n97J766J514j478r47L645J466m058k101O962L348p696l851P112L706
510E495o948k462O657J085o726j55P629r47o516J840M900l586k556M359M55o200
526c676R44O657l143p004L625O454l832o317M352M353m568k791M425J502m129
541c148j708L140J510j185j316m90Q61K371k13l041J7K022K72r11N08n43k059
558c913K855K700l039k092L439R24m331K616O765m355r027M850J0023m589r062
573f236L913N892n093j758O769l21p368K689P930l098n440M354K753o167nP776
$$ y = [-6190, -1517, -1426, -6860, -5841, -2495, -5888, -9334, -4600, -1089, -7362, -11210, -5132, -1891, -9089, -11490, -4106, -1998, -9075, -11711, -5121, -1511, -6556, -8966, -4867, -2571, -5006, -6456, -4159, -3297, -3972, -4011, -2737, -3296, -3893, -2127, -613, -2091, -3038, 607, 2073, -1985, -4086, 2876, 6224, -1472, -5323, 1789, 5495, -1453, -3915, 2742, 3827, -2899, -3054, 4575, 3628, -2888, -1048, 3852, 266, -2290, 2069, 2524, -3676, -2732, 3925, 782, -6222, -2597, 3857, 25, -6292, -1940, 2413, -2155, -4946, -521, 981, -3148, -4856, -1716, -206, -1391, -2707, -3197, -2336, 35, -178, -3219, -3202, -1180, -908, -1819, -1311, -1854, -3913, -1058, 1642, -1397, -3489, -50, 874, -3457, -841, 5924, 1569, -7458, -2608, 7415, 2826, -6236, -2323, 3569, -1524, -3282, 3487, 3166, -4202, -1513, 6417, 3319, -2121, 2233, 4986, -1181, -1186, 6590]
589F590k504r248K894R172k819o976K281M426j518M96K794j322l456K675J930
604E415j864m07M53k917j103N315R15n851j084N308K35k573K624J026n296J205
620A401O984k196q210K934N680n346l662O942M94r698J353J1963j970j1773L087
635b017R609l792m871N178N18q906K120R569l630r735L146O288m315j943O744
650C963j261q979K698J0349j526q792P10L715n08j71J070l927k981M616K883m184
666b325n74L054k559k041O014K174q498k180P893J620o301R92J626n216J010Q925
682C614k226j2247K889J1914l219q140N390L923j0074j096J2869N13j3940j80
696a0010J0993j840o728M498K473p796M61J0409k558j0474L887R817l964o479
$$ y = [6590, 4086, -5162, -2268, 6904, 4085, -2891, -610, 3816, 2298, 2794, 5588, 4266, 810, 3485, 5415, 3551, 3144, 3597, 680, -423, 4892, 5807, -44, -1128, 4180, 4415, 1842, 4466, 5492, 196, 1401, 8385, 6189, -2021, 913, 6593, 1247, -2415, 4527, 5021, -4677, -3324, 8639, 6669, -5104, -2017, 7592, 3800, -1071, 4107, 4625, -4281, -2161, 7408, 3778, -5957, -2811, 3477, -838, -2781, 3963, 2702, -6277, -3579, 6770, 5244, -3548, -2838, 877, 369, 198, 1268, -2659, -5640, -1024, 1859, -2325, -2899, 155, -2404, -4445, 1569, 3743, -4755, -6935, 958, 2578, -3723, -2731, -1105, -6321, -5311, 3614, 1388, -10859, -7970, 3944, 725, -7415, -2025, 1898, -8176, -9272, 3597, 4110, -9830, -10010, 983, -857, -7585, -3087, -614, -8410, -7949, 2460, -98, -10572, -6685, 3132, -832, -7311]
710g311M731J751n775K280P862k283q721J541O404J036L10k9n053k287P890N181
726G527n951l053M099n60k340N484L166p124k413P664J306o205K341M129m573
741C497j174R050j403j2132J954J3956j843j2659K285P427n052k539R440J69j2807
756a831p35J1046m81p025K457K236p099l59J0003j200j1890Q92R660k190p472
771c988K454L190m108k14N092k183n749J748L814j087j458J361l961k032N805
786a316L484o820l638M824J554j997K370R96n635p34Q037J406p453J86M707l117
802c146k463P054J568j0153q96J1541J317r184R67P343k794l779N668J814p604
817b747J96Q860j373p585J845M968l579j154O319r1q022P65R158K6o080K18K525
$$ y = [-7311, -2580, -829, -6604, -4324, 3538, 1255, -7466, -5925, 479, 1515, 1825, 1796, -3257, -5544, 2346, 7527, 1576, -1477, 2622, 2062, -278, 5206, 8372, 1248, -1165, 6499, 7805, 1600, 3941, 8070, 3497, 2323, 11373, 9970, -2162, -208, 13748, 11905, -754, 1531, 8958, 3906, 1367, 10807, 10976, -1831, -2566, 8480, 7999, 974, 3431, 5667, -1432, -1791, 8212, 7012, -4878, -3986, 5674, 3484, -3988, -1534, 1656, -2452, -2666, 2426, 243, -5506, -3758, 56, -1031, -2489, -1128, -5089, -7121, -1316, 2168, -4652, -8290, -3466, -1912, -3909, -1539, -543, -6178, -6912, 1125, 2531, -4922, -4736, -29, -3146, -5609, 1445, 3013, -7140, -8036, 3505, 4822, -4362, -3395, 3948, 1154, -2625, 3043, 4857, -2747, -2551, 6309, 4936, -2649, -804, 4164, 585, -569, 5750, 5659, -2363, -1598, 7560, 7586, 1506, 1724, 4249]
834D249j115J36K988k597l507K410K893k524q20K581j944k134M247L451m678l426
850B10L968J472l100O33Q53l816j521N185m8o348N83N976j688n291K805K797n164
867b494j615P008N58q525j377N836Q45l740J187L14n287q6O997O19n776J04L251
884b181k171j869M370J231n281j359L724O9k824M02K137j25r99p6j539m11M271
901b631J254k828k169J735n9q19L268K023m395l249L092K378k38Q03M94l488j068
918e897M991J942m217k72M401o14m534K066N031j887l315K477K340l030p49L799
934B532J235k241l5P37j615L54M120L51m016r20L423J036j578P33J485j486j710
951B405J511J274K15j077j103K97J442L60j551k24J842Q8k005j63J967j14j613
$$ y = [4249, 3134, 3270, 6258, 3661, 154, 2564, 5457, 2933, 2113, 4694, 2750, 616, 4863, 8314, 3636, 210, 4178, 5650, 2550, 3183, 4036, 220, -1301, 3884, 3836, -2512, -1929, 4047, 2359, -2932, -127, 2670, -2494, -4109, 2899, 3457, -5068, -6445, -609, 236, -3504, -2317, -2003, -7290, -7376, -379, 240, -5536, -5432, -2181, -4352, -6221, -1851, -620, -5901, -7260, -3536, -3467, -6291, -5889, -3752, -3877, -4876, -4952, -6491, -6902, -2631, -1377, -4205, -6374, -4639, -4698, -5517, -2249, -226, -4621, -7870, -4778, -2400, -2638, -1835, -1341, -4829, -5897, -906, 1036, -3181, -3453, 948, 334, -4200, -2134, 2897, 1010, -2305, 172, 2512, -518, -1267, 2532, 3767, 1526, 1491, 2228, 613, 967, 5087, 5438, 1422, 502, 3925, 4961, 3383, 4116, 5601, 4115, 2405, 3916, 5190, 5405, 4328, 3225, 3522, 4964, 5324, 3773, 3549, 5391, 5479, 3474, 3311, 5278, 5164, 3551]
968C551K57P66j210k43J673p06k032J037J190j506j412K899Q66l645j619L670
984C536J110l732m34K229L1k452Q8K098o19j675Q8N29j117j09J647q62j485K1
1002a108P09p30q31J428O63j776k487J368K275O0k368n98Q72L98r38Q9J203q76
1020b647j363j16J202P52r90l1L55n95q7Q17k74j289L64J809p23j973R99J913
1038a877j286j116J133J863r77j754J711J317j214j210J295Q65j031n14R21O4
1054a810q6KJ101j74n50L84J165p02K43Q73L17j746k92K014R44j376j164J740
1072H83K72r09L6J832N04j688o25J526R56r28k24Q49l70n94K74P92j93k96N12
1091B609n11p64J034J446j97j547J18J299k71j284M51J836r08k133R8K119P9j022
$$ y = [3551, 3808, 4574, 3364, 3121, 4794, 4088, 2056, 3093, 4283, 2777, 1365, 4264, 5130, 1485, -134, 3536, 4646, 914, 480, 2709, 2740, 288, 376, 2474, 1855, 180, 268, 797, -320, -429, 1218, 356, -1129, -1108, -399, -1129, -1960, -532, 131, -1645, -4132, -2764, -489, -429, -2797, -3395, -2523, -2125, -3063, -2974, -1771, -2647, -4010, -4126, -2924, -2172, -3162, -3193, -2838, -3433, -3520, -2703, -2977, -4266, -3902, -2093, -2816, -4789, -3790, -1877, -3163, -4279, -3146, -1283, -2260, -4014, -2303, -986, -2200, -3410, -2115, -1250, -2281, -2795, -1874, -1810, -1896, -1894, -793, -967, -1517, -1133, 32, -670, -427, 446, 763, -983, -1275, 739, 1683, 307, -857, 883, 1155, 246, 282, 2114, 2618, 930, 305, 1831, 2787, 1859, 1635, 2484, 2114, 1520, 1794, 2586, 2393, 2097, 2609, 2098, 1334, 2368, 3814, 3617, 2070, 2188, 3487, 3216, 1932, 2383, 4219, 3311, 1178, 1276, 3395, 3474, 2452]
1109B452R0k3m38k67N61Q23r46p73M03J47l28M29L39q12j376O89J443j437r04
1128G2N18O93j004j153P44J176j074j503N52J365j061r48L15J151p84j256K24
1145a973J00k28q3N82j187q93L80R44l15j021J625p2j748k40K705O54k616q53
1163d239J980M87j523k23J349j30j115K5J387j43L82Q13n18j35L62Q09j65m62
1181a059M48Q55q22o48Q52R10M20p83k54R28P61n50k21J211J133j213q51Q02J062
1200B981j254j76J133j24j426N40J203m25n93J098j37j835P27K332p61k506O87
1217A464K131j424j756J370J185j851q12J823K85j775M9J381j92l96M84r07j043
1234A6O24J374q12j969M75J004n08m32P19l67j026L71N81K4l81j3r02MJ190j1
$$ y = [2452, 2542, 2519, 2081, 1814, 2375, 3198, 2252, 1479, 1882, 2029, 1701, 2130, 2469, 1657, 281, 970, 2413, 976, 72, 590, 1283, 279, -874, -130, 1046, -28, -1531, -979, 386, -675, -1623, -1308, -157, -941, -2197, -1973, -1873, -2101, -2184, -1602, -2789, -3682, -3302, -2358, -2673, -3694, -2069, -2141, -3889, -4129, -1424, -770, -3386, -4239, -2259, -1772, -3295, -3518, -2169, -2299, -3414, -3389, -2002, -2145, -1763, -950, -1468, -1603, -1241, -432, -597, -1059, -611, 244, -578, -1226, -374, 536, 956, 173, -81, 847, 1608, 1058, 837, 2048, 3181, 1968, 1117, 1919, 2981, 1727, 1551, 2684, 2560, 1134, 1674, 2877, 2452, 1859, 2957, 2820, 985, 1712, 4044, 3283, 777, 1464, 3595, 2171, 415, 1785, 2970, 1119, 307, 2130, 2415, 640, 689, 2070, 1878, 1482, 1966, 1059, 16, 640, 2014, 1202, -767, -292, 712, 204, -228, 491, 124, -902, -531, 50, 74, -307, -320, -1222, -1218, -28, -39]
1254c9j693p1J719J50k107M04J312q11p98J772L81k563j01K135j62j227J053R10
1272B64j984q07K961P93l789L19K955n88k170J674J473k044n48J783M24j967j48
1289a399K127n00q73J033k72j612R52K260j369k099Q13J319o42M23P97j051j687
1306a780J697J453j745n05J106o59q93K127J091l219j251L678J097l121m41K612
1322A247j299j570K161J610l606r06L693J40k781O42J962k146r66L591N93m113
1338a748q16L753N49k803J65J243j199j003K551k0k315L6K304o36j224J183l87
1355c67j758J376K428j428k950R98J816r73m39J160j202j642K514K075k943p31
1371b066K574m41k153K022J676l280j864L943K007l884j490K669K02j545K204
$$ y = [-39, -1732, -1803, -84, 66, -2041, -1637, -325, -1136, -1934, -162, 219, -2344, -2445, -310, -472, -1699, -646, 264, -1720, -2527, 434, 1227, -2562, -2243, 712, 124, -2046, -372, 1101, -943, -1491, 292, 716, -1251, -1399, 728, 228, -645, 388, 116, -1496, -544, 1716, 347, -1752, -939, 380, -262, 161, 958, -93, -1780, -83, 1370, -375, -880, 226, -433, -1326, 801, 1892, -1327, -2578, 1100, 2197, -924, -1365, 1247, -52, -1622, 539, 2149, -1457, -2363, 1330, 1470, -1311, -669, 1293, -853, -1819, 1772, 2365, -1748, -2564, 1189, 1738, -1065, -900, 343, -856, -1859, 692, 672, -1643, -1607, 697, 61, -1163, 20, -367, -2125, -749, 1679, 251, -2699, -1701, 115, -858, -1297, -137, -1339, -2981, -467, 1608, -1335, -2066, 508, 67, -2086, -64, 1612, -1668, -3532, 411, 2418, -1466, -2956, -287, -85, -1630, 574]
1386E74J519l349q87L837J015l535l30K764j101k547L291J573m398r14L895J215
1402B622k860m56J613k02j77J762l43k537K66K492n3k211J211o8j814P04K840
1419B789j118k767J205K080m38o19J015j414j095K058J531l469j248K983P70k887
1435f24L19K543k281j721L376J606l308j328L083j19j897J345Q92l101j150L971
1451A606J092m414l42L195k95k020J489J592k914q79L101J019l226q52K048l7
1467A63p43J420m83k655P03L418r04k476O43J476j511L85J815j315k322J322K077
1484A013q69q60L09l58r93J875J610k956j738K748J534k283n92K096j066k016
1500b546K238J931k576j739K437M12j673J163J125k305r31K980P90l316n95L288
$$ y = [574, 2093, -1256, -2143, 1694, 2709, -826, -1156, 1608, 507, -2040, 1251, 2824, -1574, -2488, 1407, 2622, -238, -694, 919, 717, 540, 2302, 1959, -578, -312, 2180, 2127, -84, 1127, 1059, -755, -51, 2789, 1671, -1096, 109, 2189, 1751, 1132, 2147, 733, -362, 1696, 3227, -242, -1490, 1493, 2263, -624, -305, 2238, -43, -1764, 1612, 3218, -90, -1418, 1665, 1546, -351, 994, 1886, -1215, -2365, 1606, 2698, -1716, -2058, 1137, 842, -1178, 311, 1903, -1011, -1890, 1211, 2230, -996, -1848, 200, 163, -580, 840, 357, -2298, -1595, 1823, 919, -1557, -914, 562, -949, -564, 1251, -64, -2386, -1064, 1013, 144, -716, -407, -765, -1758, 117, 1727, -1229, -2967, -219, 1315, -968, -1560, 536, -530, -2546, -308, 1623, -953, -2692, -255, 157, -1516, -353, 772, -1533, -2464, 516, 1306, -2010, -2605, 683]
1516F83l64k390J043J555j463p24K044L51k396J63J608m31q63J608p13j688O72
1533a305K505o55k429O97J322j91o97J393o75j241Q86J257o80q41J394p61q53
1550h74J374J263j620j622K501J018j939r44J632M55j602J058J421j648q78J855
1566A450O65j477j71R03q35p23J795J572k662j217K273L83j165l53J277o12n67
1583E36O23J55q60P27M83j140k25O01L35j234L51J279o30j557L56J559j54m39
1601G66l60P3n89P17N48j189n30J056J60j554M76J332q72j350J189J461j380j029
1619a075P56M10l32K58%q62m03R86J18q98j62J082k78j252J042Q72p46n93M27
1638f50R18k94j111M6L52N53K67o68o50M22M12kl67N92J71j055j14Q50O24l49
$$ y = [683, 319, -2071, -1028, 527, -936, -1660, 384, 735, -1661, -1498, 110, -321, -1184, 424, -289, -1977, -1305, 1200, 545, -1884, -1187, 135, -56, -753, 640, -35, -1276, -390, 867, 187, -654, 740, -21, -874, 500, 1763, 143, -1479, 1022, 2040, 101, -843, 789, 1244, -358, 700, 2121, 473, -405, 1450, 2115, 638, 467, 1370, 535, -188, 1607, 3179, 517, -700, 1573, 1956, 791, 438, 1715, 1103, 536, 1159, 1314, 454, 1181, 1664, 524, 299, 900, 1235, 1, 352, 1631, 1001, -556, -200, 1359, 1205, 766, 406, 479, -110, 607, 1155, -34, -564, 492, 652, -902, -426, 906, 34, -1316, -127, 1334, -46, -1075, -319, 91, -241, 17, 17, -845, -1248, -262, -144, -1042, -1204, -122, -400, -1652, -610, 262, -484, -1077, -650, 268, -26, -1137, -1091, -739, -186, 81, -587, -1237, -815, -403, -405, -772, -180, -9, -1064, -1178, -328, 296, -53]
1658e3o87J59l33N68q8l32RM92J5r46J16J306J68j023k21J114k51r90O97Q56o77
1679a01n36M98l83K14K42J11l98q36J168K87q98j35J109j02n51m20N40L63n66
1698c94j77N27M91n68k62o1P10K13m31j70K13Q32p09n07P50J11k62K85n3n9K40
1719G19M93p74J80N62k52o61K14N78M36p20l86N11L34m84J86P9L51n55k45N67
1739A133k03J78l19j34n51L40K58j82K36j02N0n96l13O23R99n96j136N02M87m01
1759B73m68L03N01l63o51j91O93L02o68J56j9r7M3m10N59j89K42l35l72k36O61
1780b66M30n16p07L75O00m01l41P00J13n13n15K02R42n62q2l90J57P5o7J08J08
1801e50k2L2j67p8K68L16m98m22L73P98q8j163N13N86j54l55k08P39J69n33l41
$$ y = [-53, -740, -581, -914, -346, -434, -766, -757, -265, -250, -1196, -1080, 226, 394, -629, -850, 264, 13, -977, -280, 576, -101, -637, -139, -522, -308, -66, 45, -353, -1189, -21, 266, -632, -767, 342, 240, -311, -731, -191, 172, -394, -571, -44, 447, -121, -383, -444, 266, 479, 48, -122, 91, 923, 214, -293, 457, 568, 306, 591, 538, 479, 719, 1212, 438, 618, 1180, 928, 267, 481, 1059, 1495, 775, 389, 900, 1234, 750, 936, 1015, 1366, 811, 566, 1133, 930, 1108, 789, 655, 104, 444, 702, 520, 756, 654, 704, 108, -205, 418, 1417, 821, -315, 187, 674, 273, -195, 108, 609, 246, -405, -596, 97, 399, -269, -113, -132, -229, -186, -596, -37, -226, 16, -319, -691, -927, -266, 164, -352, -1059, -684, -84, -485, -826, -126, -13, -526, -1041, -839, 103, -459, -541, -931, -774, -699, -766, -658, -550, -572, -540, -707, -785, -517, -201, -699, -1121, -748, 50, -38, -1201, -688, -102, -256, -611, -819, -80, 89, -444, -785]
1822g85O75J38J26o44J07K03K42j85l67O24J6J17n10J65J06N43l97j54K00L55
1842E75q1o55N83P67p7j002K0P65M06j049M57P49p18k47K1L38n0lM0l21k48J250
1864A520j11q74l02J048j96r21k0O56L99r07k19L80M52m74P0m56M89J7j40m01
1884A0N9N05q19O4J51L78k75q46M33Q0K08J08o10l43N50J90o38r6L50L97n98n23
1906a265Q54M74j008n22J016K78n89j97O55o54l7L66k26m5l30P38j42q59P38L60
1926c95q79l65J538J31j125l90J110J00k93k51rl60M87K56m98k01R05K70r45j13
1946a027J264k06q30P19N42n95n25R02J74n91L02l22p93M10J883l29j433K04R82
1965G31N5p81P70O22j385m59J429M43r79m54P61m78o5J108m95r16N15J395k49
$$ y = [-785, -110, 28, 154, -490, -383, -180, 62, -123, -490, 134, 150, 267, -243, -78, 28, 571, 174, 20, 220, 575, 494, -161, 422, 1189, 1112, 110, 130, 895, 1301, 252, 709, 1458, 740, 493, 514, 852, 802, 799, 839, 518, 270, 1520, 1409, 535, 233, 1281, 1085, 164, 144, 800, 1199, 292, 73, 453, 905, 431, 501, 45, 534, 551, 411, 10, 69, 574, -245, -181, -30, 348, 73, -773, -340, -260, -52, 56, -554, -897, -347, -157, -795, -891, -541, -144, -742, -1265, -411, 63, -945, -1467, -451, -173, -762, -959, -304, -958, -995, -629, -855, -900, -1230, -492, -634, -1493, -755, -395, -1274, -1639, -101, 30, -1095, -1485, -375, -275, -568, -819, -828, -1188, -701, -445, -943, -1144, -239, 31, -914, -1027, 237, 31, -799, -80, 462, -133, -658, 244, 418, -173, 129, -193, -986, -576, 1307, 978, -455, -251, 731, 786, 5, 775, 1397, 12, -447, 982, 1425, 446, -8, 753, 275, 210, 1318, 823, -93, 422, 1817, 1568]
1984A568j299J84J141p85m37J026k86j198J2J163J15j77j4q03n2J071N34j169
2002E94r90J299M59j087J51R00l82j378P71Q00r23m77P31M03q42M87N51j157k20
2021c10J366M46k358n51J993K83j510M33O76q04o44Q52N43j348OR07j57m75O94
2040D2k04j201J61J526j78j865L06J397m48m32O16m69p54M88R77l30q63Q85n55
2059i01q27J631O26j656j362J991R74j445p40R96K01p31R46O25j301p86J442N23
2077B06j305J25R88q21r63K284O98k307r79K070R42j481J0N94p23l3J411r0j735
2096a109M05J537l47j089Q67K58j090K26J940K70k381P5J306L05l51K11q42m87
2114b96J247O84j008o60R99J45r95O55J107j363o64J240Q20r41p09N53k19k42
$$ y = [1568, 269, 453, 1594, 809, 372, 1398, 1112, -86, -74, 1089, 1204, 1027, 1013, 210, 158, 1229, 1763, 594, -396, 903, 1362, 275, 426, 1326, 944, -434, 337, 1137, 214, -263, 468, 871, 29, 516, 1067, -90, -310, 1056, 1502, -856, -1407, 586, 869, -641, -208, 468, -336, -980, -128, 415, -933, -927, -20, -177, -652, 42, -162, -1363, -1202, 324, 146, -1719, -1413, -16, -464, -896, -280, -749, -1503, -1015, -38, -368, -1231, -346, -901, -1728, -97, 529, -1127, -2489, -498, 476, -969, -1709, -713, -512, -1243, -297, 328, -973, -1759, -317, 206, -1099, -974, 14, -807, -1770, 514, 1212, -1095, -2074, -4, 938, -543, -533, 61, -662, -695, 716, 626, -1109, -704, 833, 486, -603, 264, 522, -568, -342, 1598, 1868, -513, -438, 868, 1173, 822, 1033, 191, -296, 951, 1635, 627, -33, 966, 1111, 116, 771, 1878, 515, -149, 1091, 1911, 970, 261, 814, 595, 353]
2132C53J010L26k034j54K101L84j748j37J187o73j285J932P85k123r19J432R48
2149A385j309l71O76n95n06J661l7j906k38K007R8j614M47O11j062l42J441j12
2167B34j340n29J400j32k45J13l70m29P87R38j314j141J499L75r31j68Q53o35
2185a035q80J131P86r89r98J013J10j62N77N11j517n80K072O44k069j9J691n76
2203b90q86O81Q93j314l40J565O69j542K05P46l00j47R37j5j445l7J995q3j407
2222a15K31L85l21l02J169K77j204M69M48j0k43K70k28m39N00P01o41j046M91
2241C92J076q13l74O80n06m74Q59O97j292k81N51m6n54P72J06j342l73J288O76
2260A042j632n66J110L27o36K42K55p26k8O75q7o00q2N87n20k18Q30k2j252Q0
$$ y = [353, 1363, 1689, -345, -499, 1602, 1986, 238, 101, 1288, 615, -670, 1262, 2047, -76, -995, 437, 1385, 76, -295, 381, -214, -720, 941, 904, -1002, -1240, 767, 865, -749, -302, 309, -753, -1095, 346, 234, -1106, -1635, -235, -367, -612, -499, -869, -1298, -511, 427, -887, -2028, -529, -154, -1085, -1253, -400, -1035, -1915, -784, 2, -987, -1985, -972, -862, -1024, -447, 64, -1453, -2033, 39, 683, -1386, -1405, 286, -290, -1176, -495, 398, -916, -1256, 309, 978, -564, -359, 387, 87, -60, 877, 862, -583, -620, 1375, 1292, -115, 116, 501, 180, -122, 1047, 1324, 120, 589, 1037, 1027, 784, 1054, 826, 387, 887, 1588, 947, -99, 392, 1468, 655, 281, 961, 455, -19, 840, 1537, 245, -36, 515, 469, -85, 687, 793, -549, -922, 366, 1042, -590, -1156, -46, 281, -355, -113, 142, -584, -612, 63, -24, -624, -706, -119, -639, -857, -27, -49, -1301, -1221]
2280a221J553m21p87k58O79M7l7l6J85o48Q37l18J30j66Q20o13m76L85R93n09
2300A39r21P52N65l44n21K71l20N12L54K07p10p4P47o8p08N30O87o85p99Q98O65
2321A177q75n38Q91K01k94j69J33j47K56J52q7o43J97L95R4m76L37J23n78q5L91
2342D55J68m73J91j57K29J6o5p4l18L79K38m18q3L44J46o41O5O21l56l92N5M60
2364C90l32j05K71l59jK25M05q57L1L23M02n33l10Q03k84j88l69Q32m93j13L7
2385b25L90J69m57J17l2j58J75J03k92J71R6K79n61j90M48j76k92j92L25K2k6
2406c06L5pO0j99o13O76J44n1n34O9Q4L69n29K06R4l6k60j6K96Ql30M53n43n9
2430i89R2j17j88o0K29M39m66j93L78M54q57K61L7K27m46p9N17j49k03J95k4J29
$$ y = [-1221, 332, -89, -876, -1134, -455, -408, -445, -481, -296, -944, -107, -425, -295, -461, 359, -254, -730, -345, 648, 139, -782, -30, 535, 191, -330, -59, -379, 133, 487, 694, -16, -90, 657, 589, -119, 411, 1098, 413, -386, 512, 1177, 302, -236, 655, 856, 562, 393, 526, 379, 635, 787, 700, 57, 254, 649, 743, 267, 604, 727, 149, 64, 455, 623, 150, 341, 184, 413, 429, 364, 290, -28, 351, 589, 171, 88, 432, 578, -63, 2, 623, 267, -125, -70, 390, 58, -47, 224, -135, -136, 89, 494, -363, -332, -9, 393, -140, -450, 353, 69, -119, -488, 344, -149, -262, -225, 165, 334, -123, -6, -38, -196, -21, 82, -210, -39, 57, 336, -225, -415, 33, -143, -435, -627, -302, -280, -306, -271, -278, -218, -417, -1030, -354, -210, -261, -795, -726, -642, -273, -802, -596, -502, -538, -798, -814, -518, -510, -840, -387, -930, -989, -897, -1014, -1202, -1262, -1033, -594, -1060, -1253, -875, -421, -1278, -1017, -980, -753, -1199, -1278, -761, -910, -1113, -918, -942, -813]
2452h13J04k14L96m13M40M7o6j16K47O9J02l05j20M91J4r7K23R7K62k46J4pN54
2475F63p57J9M71M01m06k52M78NL20l65J70q4K63K78P4o21L26M81p12l24M46L77
2497A251j84n19K74O10n46j6r1N25m80L6j15P7r0J86k52j06j39L49j48j64n7K53
2519F54J38l28j36K16L1k54j55j22M40n07p4K53L19j94o07NN01n7m44K96m13J77
2541b61l58J03N39l21j09L0k98K8J17K43n29M1N54n7l33m86Q58K19n48n1J82k79
2563g16m2M30j98r4p3K0j80j12O82j89k51K61L81r0o05M58K24j32J09r9m0K3O8
2586a65K21l33L00L35n56k94O91M10l12n06L28J81l20L4M02m7l38M30K89p79K97
2607B68L60j60m18O32j7n51J45M51M25j030oM46J80m48K98K27r60K43N58J01o47
$$ y = [-813, -709, -923, -527, -940, -500, -453, -519, -635, -388, -319, -217, -522, -642, -151, -137, -234, -11, 86, 348, 102, 116, 109, 663, -94, -75, 396, 797, 391, 139, 617, 622, 942, 577, 747, 663, 926, 1204, 1278, 657, 983, 1464, 752, 428, 874, 1251, 1067, 548, 822, 1432, 886, 870, 779, 1304, 824, 860, 745, 822, 732, 918, 666, 560, 421, 770, 622, 458, 401, 654, 792, 464, 328, 544, 575, 321, 166, 44, 484, -23, -97, 156, 475, 281, -326, -321, 180, 123, -321, -25, -438, -261, -619, -516, 23, -298, -407, -377, -675, -647, -530, -287, -816, -775, -221, -278, -611, -1097, -239, -20, -568, -619, -437, -716, -758, -328, -526, -620, -693, -673, -853, -965, -283, -472, -723, -462, -81, -171, -776, -318, -94, -226, -117, -216, -256, -233, -165, 56, -277, 23, 358, -198, -492, 199, 609, 297, -209, 119, 300, -20, 14, 416, 369, 31, 461, 750, -29, 268, 628, 468, 50, 682, 665, 114, 259, 710, 1135, 105, 99, 545, 725, 277, 575, 802, -158, 85, 643, 744, 97]
2628I7o3M17n36J1P17l23n20K53M02l78k51L40k24p3J80K72n00k72O00Q9m60j07
2650c29N11l98o05R13M82q16m07Q67L42o94m92P30j64l56M56N25q90m3M31m7n05
2671d89N96L83p38l62Q84M07j275J14N49J52k37J85l8q16L39R46j97q75L58O39
2691E25o10k76O99l76q02M39Q83l20q48N42J63n61M38K28o91p12J016R58j182
2710d87n50P36K11p42J72J269j093o62P58P49p95l62O21n99p2P52M98j343j31
2729a070J068K36r40k8P93o92j39O27O53j185l7Q22k85k82K16o8p69M44J186j26
2749D24j101J71R72k97m99N62K18j014L32P46m56n92O37N58o66K88N53r23r89
2768a076J428R32p43j316R64N97r49K12P33n13j089R27P74q16o72P52N5n55O11
$$ y = [97, 34, 451, -85, -74, 643, 320, -200, 53, 455, 77, -174, 166, -58, -131, 49, 321, -179, -451, 149, 238, -222, -329, 182, -216, -821, 92, 574, -242, -649, 218, 560, -134, -626, 104, -60, -416, 40, 565, -325, -368, 63, 16, -489, 107, 490, -248, -610, 274, 681, -594, -480, 69, 221, -16, 169, 131, -685, -346, 600, 403, -472, -114, 525, -85, -361, 338, -38, -840, -401, 482, 162, -686, -144, 19, -542, -104, 124, -567, -1279, -263, 695, -487, -1037, -301, -90, -832, -660, 609, -484, -1146, -388, 361, -434, -796, -175, -774, -846, -94, 404, -939, -1070, -2, 234, -706, -734, 59, -633, -772, -145, 508, -677, -714, 108, -177, -459, -243, -311, -1080, -636, 550, 424, -677, -506, 466, 169, -330, 232, 450, -564, -232, 514, 58, -534, 103, 661, -5, 283, 836, -87, -1076, 352, 1284, 541, -775, 189, 786, -163, 49, 782, 269, -820, 107, 881, 65, -607, 145, 200, -355, 256]
2787B56P49j344n74J415M77j189m05Q34J8o06N50N33j597J83P44L01n97K22K6
2806dm87R5R53k55j225K56Q27r9o15K39J63n54L0J120n31q67P98N41r37J71Q17
2827D36n82p90O04R87p47o79N82O10q62J66Q38n09p57J037L65q16j38L31L74r08
2847d58K36J016j030o19J283O40j118l93P53K6n46O96j50o69J0R75r2q43K92N00
2867E09l39m08J145l29j219P1R83j50m24J49j70j76N12O38p16p37N05Q88n63n22
2887c53Q18q68m69Q41P62p07p41O75M69m01l3L19l78l19M66Q18j200n96J418P6
2907E97q15j50J059n24q94Q73M49m26o73O05R6o9p1Kl07J7P86j41p72L43O61n02
2929A44m11L15N59j043L24N65J4r03K69J27k20J98M88o83n86O68Q31p31n35M95
$$ y = [256, 1005, -339, -913, 502, 979, -210, -615, 219, 237, -369, 181, 714, -883, -700, 44, 345, -252, -30, -4, -491, -396, 557, 302, -923, -667, 160, 61, -554, -315, -152, -706, -676, 444, -87, -954, -156, 385, -552, -381, 436, -146, -936, -332, 655, -92, -771, -189, 421, -441, -275, 563, 54, -703, 334, 699, -117, -255, 76, 450, -458, -222, 794, -236, -855, 428, 1068, -50, -443, 310, 336, -210, 486, 336, -333, -323, 652, 560, -283, 9, 509, 170, -238, 907, 578, -641, -570, 413, 263, -161, -12, -182, -358, 154, 792, 76, -661, -156, 732, 169, -353, 465, -403, -872, -31, 731, 24, -717, -42, 427, 26, -7, 312, -66, -385, 81, 899, -301, -897, 521, 597, -218, -368, 691, 167, -727, 146, 595, 169, -504, 101, 197, 128, 57, 59, -248, -231, 555, 414, -358, -15, 646, 144, -267, 48, 607, -436, -112, 453, 467, -436, -167, -40, -260, -62, 426, -257, -843, -175, 656, -75, -610, -115]
2949a15J92j12l19N61l91o69O09J44m88J73N6l97j09M75K07n43j52N55L15k25
2969b33o63M25n7l04K32K99k08j65J71K29j08M2K02n11J50N64j9n55k27P56J85
2990B05m50q0J93J08j74M35l52j90M35K80l89j04N78j54l18J63K91l5o17K48N35
3011F08k0m72M9K13o9J71L88l10j26KM47p02M31J00r8p3O4L10k46l38K54k1j19
3034D43L50j50q5Q1k95k72J45L9J84k6l17M06k25p5k10J17J33k96l6P3M8M2j03
3057b9j05p0K45k41l02K11J08N5m00k3M16j23l50k43L55n3J23M8l24L93k41K73
3079b77k81N5K21K16j17k48J68K31k62j10L55o5j88k46L55K16l95J28P3K17J95
3100B41l82P6J73p8j87K5L77j46k51j01L65K98k92J59k14L5J80j08p0l82L81J23
$$ y = [-115, 77, -35, -354, 207, -184, -853, -244, -100, -588, -415, -359, -756, -865, -390, -183, -726, -878, -323, -8, -233, -896, -471, -528, -832, -600, -301, -509, -674, -503, -274, -382, -340, -138, -649, -499, 65, 46, -509, -736, 20, 205, -245, -325, -132, -24, -198, 237, -115, -305, 130, 410, 21, -83, 495, 341, 23, 186, 477, 442, -175, 73, 608, 588, 116, 165, 378, 309, 480, 868, 558, 432, 434, 881, 179, 610, 710, 612, 539, 603, 913, 667, 329, 583, 562, 443, 793, 643, 558, 639, 344, 72, 217, 256, 440, 414, 97, 503, 278, 203, -7, 110, 243, -53, -89, -16, 32, 74, -29, -134, -204, 41, -200, -502, -291, -183, -128, -528, -551, -135, -258, -608, -851, -496, -549, -426, -378, -702, -309, -550, -277, -558, -503, -282, -66, -183, -431, -263, -32, -294, -404, -49, -114, -302, -548, -193, 23, -372, -244, -171, 46, 241, -141, -65, 108, 30, -157, -132, 245, 99, -152, -253, 112, 410, 118, 277, 63, 98, 278, 170, 100, -282, 99, 222]
3122B22k87M5r6N87l98k04L01j64q2MK32p1J25n0j97j64O0J24k41MJ71J72j78
3145h5l57L78j27J58p7q6N2J96l59K81Q1m9o0j04K29q6j1j71nJ95J02l06J51n7
3169a17M62k63m0oj7L15m83J68KJ73j52K32k82N6J20m99L74J14K63j01k98L92
3191D13k99k50L69k58L07j1o2l65O44k26j16l03j94O99j96l80R4J87n6k37k08
3212d48N6M92j34j48j65J98L57k26l41j69O94l32k30J86K4J21P8J74j87k39J56
3233h3k32J03M01r4k54J89Q8j54k41K06M76k9k34r4J91K11l36J18j00j48K23J90
3255C97n52K11K42j08K5nK24l37j11jK95k00J10J60Q8j70j61J29o4j00K79j27
3277B24j41n1P13m80n61M75p6r1j03K28l23J26qL80n01K73K75n31k15O30l06j26
$$ y = [222, -65, -20, -116, 471, 73, -131, 170, 6, -76, -72, 160, 89, 214, 164, -33, -197, -137, -13, -254, -250, -79, 93, -85, -442, -64, -191, -33, -110, -196, -144, 52, -307, -26, 55, 6, -54, -158, 71, -15, -26, -197, -202, -7, 95, -211, -60, -117, 345, 82, 42, 36, 19, 334, -149, 19, 21, 194, 42, 274, -8, 48, 168, -331, 43, 157, 420, 319, 21, 413, 114, -136, 233, -25, 282, 271, 209, -156, 488, 262, 146, -157, -351, 348, 152, -228, -134, 53, -3, -240, -448, -392, 100, -34, -182, -347, -149, 208, -18, -359, -528, 166, -166, -396, -210, -186, -65, 13, 187, 0, -239, -83, -315, -212, 189, 95, -159, 30, 118, -36, -277, -71, 405, 376, 142, 48, 239, 450, 114, 232, 132, -16, 207, 397, -155, 56, 298, 190, 215, 210, 434, 97, -14, -15, 280, 80, 190, 350, 438, 268, 107, 236, 172, 72, 351, 224, 83, 32, 745, 265, -296, 179, 103, 12, -91, 137, -186, -60, -68, 312, -189, 84, 359, -172, -387, 243, -63, -189]
3299a89m16K94L16l96l6K72Nm35N01k7l8j21j25O26l70j85K60n41K40J27K23l82
3321c97k93P56m21l2Ql1J25J21j43P4j80L36M5k69m8L48j74l61K30N24m44l54
3343e80M29M46m53L82k36m1O1K25M6n34p6M39Q5n4j2N31m92m78P56M29n03j65
3365B05n7L85p3j18N17o32j51M45N8l25mM81n19K18M53J1m91l88M80K83p35J80
3387B23J26p1K71K30l80m90J98N95m33k79K15M31o44j10R97n75m96j04M03L64
3407D71m40J03J06n99L93M36l10n21L60K09k35j09K81k54k67N0O27m14p18N16
3427c15K07j11j51K39p68J36Q25j90o59K9O18r4J5o5J27j99j49L79J09l26k41
3448e84J59j14J14N74r7o44L96L61J44q53M74l20J5J43L66o6o84L80M03R9m43
$$ y = [-189, -605, -311, 5, -391, -427, -155, -150, -585, -84, -111, -149, -270, -395, 231, -139, -324, -64, -605, -365, -238, -15, -397, -690, 66, -355, -387, -379, -410, -285, -164, -307, -233, -413, -77, -32, -301, -349, -1, -175, -536, -306, 218, -226, -580, -151, 295, -158, 224, -12, -53, 8, 233, 279, -255, -331, 108, 193, 139, 127, 658, 166, -312, 444, 873, 370, 205, 148, 533, 460, 342, 859, 227, 76, 521, 579, 254, 250, 731, 212, 430, 883, 894, 403, 15, 495, 778, 43, 223, 349, 278, 549, 779, 399, -91, 107, 702, 269, -10, 205, 636, -8, -118, 879, 304, -192, -296, 107, 471, 31, 134, 240, -359, 34, 470, 160, -361, -1, 208, -27, -136, 145, -109, -376, -326, 301, -113, -831, -315, -108, -219, -370, -131, -899, -763, 62, -128, -787, -758, -140, -234, -219, -284, -157, -356, -505, -126, -17, -343, -584, -425, -539, -425, 149, 52, -592, -196, 165, 309, -544, -70, -390, -375, -232, 134, 68, -616, -236, 167, 266, -177]
3469a77M43k30m18L66M87m03o87L00O32k98o6K57j29l12N26K50n12m20N32J05
3489B46j81K32r4k93j71Q04K1p59k48N12L28l57J9L8q1j34M61R2m83j04K63R4
3511B05m00P45m17m14K40N72j39o36J16M33k55K9L50m9o88L83N34o36q4M42k79
3532E2n01M12K50l84m02P42L26m17l60K32K14l77N02J11j18p80K38N77l53K12
3552A76r5n4j74K10L08p06l11Q50k25rM2p1P9k91N04o7l78P5L65j09K9R5j19p24
3576f00N64L37j21n26j28M34l8J72kn2n19M19L72n39k80N29r2l94L31J67k81l73
3598f20M02O51m80m37M52n1O3j57J12j6j66K34J03j33k62L16k99M5M12J18l53
3619f6k78M58J25k9j95k28J68J75P8M0j95k3M24j16l36M4J78l87K83K60j7n6m02
$$ y = [-177, 266, 36, -382, -16, 471, 68, -619, -319, 313, 15, -51, 206, 77, -235, 291, 541, 29, -391, 141, 246, 65, 297, 203, -90, -261, 543, 564, -195, -443, 69, 397, 40, 59, 97, 16, -118, 343, 435, -48, -152, 111, 205, -195, 550, 133, -281, -41, 531, 392, -244, -128, 305, 50, 79, 429, 380, -308, 75, 609, -27, -111, 331, 52, -449, -37, 213, -171, -573, 169, 495, 78, -282, -50, 164, -213, 289, 400, 282, -498, -260, 317, -36, 176, 81, 27, -147, 63, 371, -335, -646, 204, -21, -30, 12, -59, 20, -271, 233, 166, -212, -137, 228, 119, 148, 243, 124, -600, -36, 301, 180, -346, -474, -40, -78, 94, 92, 40, -479, -60, 312, -227, -507, 22, -70, -464, -133, 34, -247, -620, -218, 433, -47, -484, -32, -83, -20, -177, -65, -81, -247, -13, 90, -43, -305, 11, -288, -243, 169, 287, -66, -344, 114, 239, 210, 15, -213, -45, 130, 208, 248, 53, 30, 454, 338, 2, 46, 224, -163, 120, 380, 363, 307, -95]
3642i5O56j89N9m9j66j53K05N62p61j68P69j31k03j35L95k57l26Q9K35J29k51
3663B15K15j60N7j10J30k31l8O0L64k58l82L98q6m67J85O27n50j02L46k10J08
3684A11l99K33o4j45L69k30k29nK53K35m24r2O58o54j36K24L04l48J01Lk6k0J67
3707a14l41L7L45K09l87Q6j30M57m17k77J88J33k36L18k37P2O7n0N23m72J59K19
3729A52n15J4L33J48l09LK20J00k66j12J53j18J08K35m3N1k87M50l69j32M14P0
3751C00n71MM95J12j84J20J66m58K25j76n3J51l64J80J33p9K25J63l44N1l6k03
3773a43J17O5L33q6j94N4J82k56K8L2L8j94M02Q5m31J38N2k09q7J69K57j60N1
3796B43l0K67j33k09j95J14q6L50m22Q0J24J13j04l00K40K54m84o8L17K21l49
$$ y = [-95, 561, 372, 431, 382, 216, 63, 268, 830, 69, -99, 670, 539, 336, 201, 596, 339, 13, 102, 337, 466, 215, 430, 270, 327, 217, 347, 116, 78, 138, 502, 244, -138, 260, 174, -293, -108, 519, -31, -133, 213, 3, 111, -288, -55, -119, -264, 105, -125, -354, -359, -106, 129, -295, -387, 271, -383, -519, -295, 9, -339, -238, -235, -261, -281, -114, -455, -418, -73, 136, -251, -165, -295, 162, -255, -532, -344, -211, -447, -129, -366, -294, -227, -277, 246, -226, -67, 152, -363, -349, -16, 132, -177, -174, 46, 146, -120, -232, -79, -197, -89, 146, 103, 154, -133, 317, -52, -184, 230, 300, -271, -267, 228, 340, 156, 276, 442, -16, 209, 33, -20, 131, -233, -53, 80, 1, 226, 389, 45, 96, 60, -143, -26, 39, 372, 286, 92, 146, 328, 72, 100, 132, 170, -24, 378, 463, 32, 170, 222, 13, -74, 95, 352, 192, 243, 213, 480, 347, 138, -57, 57, -29, 321, -101, -21, 103, 216, 112, -188, 52, 306, -178, -246, 71, 292, -57]
3817e7mJ46j65J63j13J26j79N5J6l3k95L59q1K55m26J04O1L3n5J27pl36k25K74
3841b57pR3j25n7L31rl80K78n9N1NJ7k85K86m0l3m4l2o7K01j05r3L05q4j19O6
3867a63J20K37m20J51k21J06K52l58O7J20K90l94k4J48k02O57l13j36K61j23J17
3888A72l30L84RJ43n88J96K49m2j12QM7j09L55k79n2N6K58l72L19j89J51j4j96
3911F4K90M6l69m5K62k10J41k94J42N7K76l36l4p3J26L16l72J5J58Q4k67M44K2
3934D43k86k92J92J54p9K2m9k23j1L91Qm51m6J00L19m11JK52k02N0j24K37l0j39
3958a74P6o7j81M03j07n58J12L41J48k86j84L77J22k54l5Q3lnL35n62J03p2J96
3981a92m60K47O51j85n01K62N3Q9m53o1N64m36M81K28k54k14K23j28M33m65K39
$$ y = [-57, -61, 85, -80, 83, -30, 96, -83, -28, -12, -45, -340, 19, -62, 193, -233, -129, -68, -35, -90, 37, 30, -306, -531, -257, -264, -171, -296, -353, -22, -31, -411, -133, -192, -141, -136, -119, -404, -118, -158, -191, -235, -267, -334, -133, -238, -331, -26, -110, -229, -163, -43, 194, -226, -75, -296, -190, 62, -296, -229, -109, 181, -213, -237, -89, -291, 366, 53, -83, 178, 55, 172, -158, 226, 235, 378, -210, -14, 235, 193, 81, 89, 136, 27, 382, 103, 51, 107, 365, -7, 312, 123, 274, 260, 64, 354, 400, 31, -14, 248, 38, 179, -115, 27, 84, 360, 24, -10, -83, 43, 359, -13, 2, 160, 244, -23, 421, 443, 157, -135, 57, 211, 132, 154, 105, -118, -129, 262, 270, -181, -227, -127, 192, -219, -218, 34, -168, -118, -242, -5, -35, -174, -98, -165, -346, 57, -50, -608, -496, -155, -7, -293, -477, -100, 22, -232, -267, -184, -187, -192, 143, -419, -316, -388, -192, -652, -405, 246, 61, -440, -178, -125, -36, -489, -550, 14, -422, 59, 287, 33, -181, 42, -86, 347, -118, 121]
4002A21j31j00J23J35k46K10L45l85K38l28N65k56l75K82K98n17M16p3j02k17
4022CL42J34m10M71Q1k5m35K48k7j60l41N71k42J54j88K28Np1R7j45j29J70K45
4045E76k81l66K57L21J01n52M7L11l89j6K84k02l00K41J20kj06K06m35j9K78K96
4067C70n73l27Q49l06k34J22K52j89n1R4p6o88M05K51q0m29N62k06k48j88P33
4088D3l56k35J70K20n5l96O71k09n66M56L51l74j25L14K86o60K9L66q1p53J68
4109g36P37k84k97J88L24qq4K26k42l33M97p4n7l10N49m82P6M09J65l87j99K29
4131i3J07o3j21K13l61L4O55Q4n00p3J94J93n00K98K95l60J34L07p5n37M73j83
4153A21J75l21L33j44l39M74J42j29m68N00M40o09j93N38O4o56K42J00j57j2j1
$$ y = [121, -10, -110, 13, 148, -98, 112, 457, 72, 310, -18, 547, 291, -84, 198, 496, -21, 395, 322, 220, 3, 345, 479, 69, 540, 621, 596, 161, 409, 382, 222, -119, 452, 210, 364, 176, 404, 409, 338, 435, 290, 161, 331, 576, 295, -71, 186, 507, 608, 56, 103, 414, 25, 9, 293, 91, -209, 32, 152, 150, 44, 250, -185, -204, 74, 370, -203, -530, 319, 13, -221, -99, 153, -36, -87, 7, -69, -757, -352, -101, -181, -610, -48, -254, -502, -690, 43, -313, -548, -378, -158, -213, -609, 62, -147, -713, -257, 94, -280, -405, -91, 195, -465, -436, -70, -151, -904, -736, 1, -283, -580, -392, -68, -76, -160, 66, -176, -509, -12, -86, -143, -453, 96, -386, -310, 99, 264, -123, -322, -93, 14, -49, -170, 43, -318, -284, 371, 455, -45, -118, 76, 269, -231, 67, 362, 2, 136, 443, 368, -169, 304, 121, 296, -25, 308, 164, -175, 299, 441, 312, -156, 344, 784, 175, -18, 520, 584, -72, 170, 270, 113, 101, 90]
4174I0L23l01K87K61m92k97N20K12n64k42N40J49m71K63j61J46k95J67J57j24
4194A68r1p8j12j81N88r5l91m8K67K26o02M27m3Pk21L04J40o24k47N32K08l05
4216a71L62l13p02K74O83k56n14K91O85o33k79J86L10k29k03O75j27p47M34N3
4236b21m3J29K8l16l26M84J94j29l1J14J39k76L59j35j25nM8L86k55l92M67o8
4258B6l1K28k8m36r8O73J99o65R9M24m72n0M34j64n08M83J22l60j30O53r4n01
4280a96J12N27l88l83J36O54k88o06N92L88q00K02M98l95j49J04K08l02J27M89
4300E30n16k86K67M60l9l01j46N08n31J0M91n02n3K72K0j22k36M33m15j61J38
4321a79L32l8j98J73J74l44l24L03L93j71P1j79k92L30p6R4m59K75J37k82pM67
$$ y = [90, 413, 112, 399, 660, 168, -129, 391, 603, 39, -203, 337, 486, 15, 278, 117, 263, -32, 135, 292, 168, 77, -1, -113, -294, 294, 199, -192, -240, 27, 253, -349, 78, 35, 42, -179, 125, 265, -359, -606, -74, 134, -171, 191, -122, -824, -550, 133, -123, -637, -346, 339, -294, -573, -387, -77, -306, -509, 166, 39, -708, -274, -221, -264, -135, -107, -423, -749, -265, -71, -200, -231, -117, 22, -254, 105, -30, -155, -160, -112, 274, 19, -373, 94, 26, -5, 223, 195, -241, -339, 334, 533, -132, -33, 391, -81, -131, 303, 139, -369, 114, 236, -124, -254, 399, 305, -196, -84, 443, 55, -328, -192, 462, 174, -432, 160, 548, -252, -50, 448, 53, -96, 8, 216, -86, 41, 530, 14, -272, -5, 455, 416, 115, -31, 477, -54, -44, 447, -55, -108, 164, 184, 62, -174, 259, -156, -317, -179, 153, 115, -83, 90, 264, -80, -404, -101, 292, 121, 192, 13, -279, 51, -25, 69, -390, -115, 22, -260, -267, 200]
4343B00r8m03j52O66on48J78O3O4M1J09j80j56n8K83k67M6J83k82K80j19J40k88
4366c04M4M9Q3R4j35q7j20k36N58L51l89J6K70j17l80L00k13J07k04J02J92ll00
4389c22K92L0j73L73k63j48L19K20R1o83K65j33K69k61n7M45l75o0N53j2l73J29
4411A26Q8j14k94K35J55O0k37K33j79m1j88L75j67L17M2k15J80j97j4j76Q2K22
4433B93j61j73K46M7j94o1J6K99j68P7n5p5k79L0K42L65l54j14L5j5n1K45j95
4456@NK14j57k09K14J28j93J01q9K63m31O7j84K64N2k41K84j55K01Ml21P3J54
4479D4l04O02l26j58L42m0m58k83N30o8M6K7j73J10j0j21K80k7M9l0l45N6L27
4502G0k87K20ro6K00o8Q4l75J11M6o8R7L46j18k12k08L59l12J2k58N01J03j35
$$ y = [200, 102, -301, -453, 213, 207, -341, -163, -100, -36, 5, 114, -66, -222, -280, 3, -264, -218, -35, -317, -37, -156, -16, -304, -260, -211, -128, -34, -169, -256, -376, -612, -54, 297, -92, -76, 194, 77, -303, -3, -216, -109, -313, -211, -19, -22, -322, -30, 0, -173, 200, -63, -211, 108, 328, 419, -264, 1, -132, 137, -124, -181, 264, -111, -171, 382, 370, -3, 126, 214, 100, -194, 41, 196, 256, 19, 252, 73, 32, -156, 219, 52, 369, 411, 196, 376, 179, 165, -11, 71, 293, 132, -41, 205, 252, 58, -3, 13, 312, 144, 221, 166, 91, -188, -158, 84, 449, 95, -19, 16, 1, -50, 195, 0, 5, 219, 62, -147, 67, 195, 2, 103, 14, 277, -154, -87, -271, -7, 45, -196, 88, -67, 134, 138, -183, -110, 44, -260, 342, 16, -142, 200, 160, -298, -581, -51, -119, -73, -46, -219, -109, -119, -240, 40, 13, 62, 32, -313, -257, 70, -217, 3, -6, -72, 128, 60, 144, -231, -120, -74, -142, -45, 301, 183, -29, -237, 122, -190, -178, -436, 65, 168, 33]
4525C3q8L30l26L1J29k72j48J06O12m39O0K30P8k33r7qJ48k47J88k23K51p2j11
4548f8J6J41j7j17L49k27j75K06j32N4j33J02j30L81M2k87j84K8L62k20l9k63
4570c11K95l22Q02m56o0K64p2j66r0J33j29J55J50k95m4L07q1j17L71k85J11j84
4592b4K5J44j90R9j33J23J46O9l14Q8M36l72l86K50J01K7q7l8J20J47j39k00l29
4615d37L62K17l77K61j75J25K59l22P2J10J7K45k16J31Q1k73j02J40j15K48m19
4636a68J73r3M46m70L1L28j99K03n5o6j6j6k4j87j54M03j79k4K91m59O31p26M65
4659A35k9j58J39k32N45o40J01R0j62L39P3n37o3N17r4l63K62kk65j21M81PR7
4682A20j48l22J05K72N3k76o8J21j38K65Ol08N03j82j26j75J94K1l55N27n4k75
$$ y = [33, -55, 275, -51, -20, 109, -163, -311, -205, 407, -32, 28, 258, 336, 103, 6, -2, 146, -101, 87, -136, 115, 43, -68, -52, 89, 72, -45, 304, 77, -98, 108, -24, 30, -103, -1, -131, 250, 292, 5, -179, -151, 211, -9, -48, -311, -16, -338, 464, 8, -52, 212, 140, -26, -116, 17, -112, 43, 193, -102, -146, 161, 80, -37, 334, 49, 160, -24, 1, 145, -45, 54, -79, 44, 190, 259, -55, 33, 469, 97, -289, -39, 62, 89, 2, -36, 84, 231, 92, -108, -437, -75, 142, -235, 26, -149, -24, 235, -87, -15, 95, 112, 357, 141, 272, 353, 80, -22, 118, 3, 251, -168, 5, -88, 358, -112, -81, 247, 48, 251, 196, 130, 114, 98, 74, -113, -267, 136, -43, -67, 224, -235, 396, -330, 135, 106, -52, 87, -145, 400, -240, -139, -49, -211, 128, 201, -336, -399, 118, 24, -339, -77, -79, -344, -465, 16, 23, 120, -28, -350, -245, 27, 80, -196, -264, -143, -281, -16, -10, -318, 185, 3, -123, -298, -104, -83, -438, 89, 35, -240]
4704b40J94j31N8K55o9Q7r2m87M72k1l16Q8O03r0o41O4K40j11n9o3L74l29M64
4727B50j98q2q2L25J34m40m7M32k82k88j1O7K45M9K37l31J86j63j0J21K15m59
4749a32L72n32K83J93Q8m92N5J48J69r9R9l01K47k76M54k97j03L57n16K7M55L5
4771B34j04m41K67M81q05L48K18J29n38JM81m2l54p5K44l5R4K53k91r7K25m0J07
4794B60l09K81K14o21P8L46k00n9K27j47j10M6L17q5k16R8J28l72j75K29K06N8
4816A94n6n5J07l92L48o4j19K00J29k74n4M61k39l56L1O06n99K3J44K85l35Q0
4838F5KJ19J88L7r0m53J21M11j46l96J89j4k62K55J01n2l90J30K01N8j51P7O1
4861F1k71O3J32Lm67KP45l64n6J64j67k08J63M43P4p71J58M1R2r4L30n70L7O28
$$ y = [-240, -46, -177, -119, 136, 67, 154, 62, -425, 47, 26, -290, -202, 401, 311, -330, -266, -26, -137, -196, -259, 115, -214, 250, 52, -30, -112, 213, 347, -93, -140, 292, 10, -278, -289, -222, 23, 72, 309, -22, 164, 1, -9, 112, 327, -132, 240, -292, -9, 184, 272, -220, -165, -17, 152, 53, 152, -149, 98, -178, 276, -21, -124, 233, -283, -256, 199, 234, 130, -311, -44, 437, -368, -20, 198, 327, -211, -210, 271, 229, -125, -200, 44, 9, 103, 356, 65, -32, 193, 153, 260, -49, 232, 446, -175, -97, 249, 49, -10, 217, 70, -40, 6, 323, 238, 22, 120, 248, -124, -299, -70, 136, 194, 138, 83, 190, -202, 146, 82, -37, 163, 292, 18, -36, 425, 186, -170, -139, 467, -132, -109, 35, 320, -15, 65, 67, 186, 374, 411, 321, -132, -11, 400, 254, -142, 47, 33, -229, 26, 127, 75, -315, -185, 16, 74, -77, 0, 61, -210, -147, -15, -12, -479, -477, 268, -96, -152, 12, -155, -363, -200, 243, 317, -454, -296, -255, -163, -257, 73, -497, -460, 168]
4885A68j63o8m23N30k78j04N9L12l20k33M04J52k50j00J56q0P8j32L91n97K22
4906b76K79L89p20o2J93K22j80M77o1m50j95J95M2r5o0M64j97K10j50J09k40J79
4928G3K09j70p9j75K81Q9n47L43K60m03K01J48J32k85L01m87J63K51R3k89j18
4949ij3J07nm0L32L63o73N9K12k36J41l08J30K22R1k62m5r8K86P6m13m9j78L94
4973H4j05r6J36J4q2L2o0j78K35o1j88k05O63m6l83n3M38l04k66O5L34J08l06
4996b24M8p9j39M35J90k92o0J07K01o56L59O0J76k51j18J69K13k29q3L22L1k29
5018d9L0j78J80p6J54k33o3M61n61N05j37Q6n7m95K85M20j05l01N7J9K27o1j0
5041I8j79N4j21L41l41J80P2l74J57K37P5l45J9k7J09M8k66L65j22J64J33m05
$$ y = [168, 5, -63, -486, 44, -234, -338, -279, 33, -287, -520, -116, 36, -214, -314, -158, -238, -160, -292, 99, -498, -276, 3, 392, -328, -390, -197, 25, -155, 322, 261, -189, -384, -189, -147, -242, -302, 162, -35, 175, 25, 134, -106, 73, 282, 112, 33, -142, 139, 228, -319, 24, 284, -119, 82, 230, 362, 77, 378, -109, 54, 305, 398, 109, -9, -22, 85, 80, 40, 372, 735, 62, 121, 333, 97, 238, -70, 60, 282, 373, 111, 66, -32, 254, 330, -83, -132, -310, 84, -21, -117, 19, 33, -49, -17, -77, -255, -20, -81, -269, -474, 189, 143, -240, -293, 145, -159, -425, -360, -26, 82, -224, -176, -255, -394, 41, 231, -61, -121, -14, 187, -469, -110, -50, 126, -125, -243, -74, 139, -90, -173, 149, 180, -49, -19, -197, -17, -93, 61, -172, -235, 226, -335, 170, 33, 119, 62, -433, -148, 272, 167, -134, -77, -58, 169, 108, 98, -81, -27, -148, 193, -148, 32, 104, -270, -113, 124, 199, -146, -127, -154, -45, 3, -263, 102, -20, 144, 277, -128]
5063a28L3J58n1j1m2K07k84P7k74M06j06j85J34o1K53k53K17J65k27O2M0l25R3
5086a02K91l11K32j48K52j74n3K12j67R6j34j06K56j83J51R5k57m3M26Ro69N99
5108B72j95j34M6N9K65k61Ql50L52J5j71J52k13K30k85K64j81J23L22k16n4q6
5130c8J12k41J63j3r5J47j32L54l44J11k19p6K07J80J1k96%J21J84l49J58P3n8
5153d0r2O4j35K77P1l9j23k11O8j76J65K48q6P0k67j05L88J9p1N6R4K7p1q3j61
5178a13L53j35K54l84N2P9k7N8j30J32j14J9OJ40L18l93k62K74m2j58J08k0j07
5201i2O8j55K13Q1O3o5nJ89kl75M4r5O6j06J90j12J09N4K92m86l6J78J92k57j0
5226e7J57j67J92k28N1L65m61J37p0Q4m7J41k35J73j86L02l57O1P7n7J16k50J84
$$ y = [-128, -95, 63, 12, 1, -41, 166, -118, -41, -315, 91, -15, -200, -66, -127, 126, -127, 90, 255, 28, 90, 130, -195, -102, 189, -122, 110, -38, 214, 40, -13, 199, 32, 128, -6, -112, 144, -39, 112, 207, -50, -93, 333, 342, -327, 272, 77, -57, -11, 48, 313, 52, 60, -290, 62, 77, -94, 58, -155, 75, -210, 54, -127, -4, 318, 102, 48, -38, 74, -167, -4, -17, -112, 35, -97, 257, -87, 24, -195, -271, -64, 116, 127, -169, -169, -48, 136, -213, -55, 18, -40, -132, -68, -203, 74, 145, 106, -17, -228, -160, -336, -171, 77, -9, 61, -206, -311, 77, 96, 25, 81, 175, 202, 131, 48, -113, 240, 105, 359, -25, 27, 106, 79, 137, 7, 139, 25, 44, 50, 190, 508, 115, -147, 127, 85, -73, 35, 15, -92, -24, -179, 34, 115, 178, 113, 108, 297, 295, -80, -36, -131, -65, -171, 19, -93, 16, 70, 362, -124, -160, 18, 210, -47, -57, 100, -67, 125, -103, -52, 313, -148, -11, -81, 3, -44, 97, -138, 35, -151, 151, -206, -145, -68, -125, -9, -259, -75]
5249g5j84J44J77o7l4j2k16o2l2O90m48l76M06jQ0m15J57L9K18j06J03k90M35
5272A31k3l73K06n1p0L9k7k1J73k3j58L7J12J90m85L40j35K50O2k44P4m7J39l84
5296b88L09J29k28Qo6J75K54m06L83l46N5mK26j74k13K16Q9R8m64O7O14j21l12
5319AM52l44n00K22L1J61p5Q3o2K50j21K07k70Q3j3q1k47N5J75m6J0L3N9P5k79
5344a41o6K56J6k15J19L08k74r3J70R2j25K4L6K5j05J92L0k61o5K67j29q7J79
5367A53k97J92j26L59j44o7l21J52j82K52Pk79L22j89M94m97K6M09j75n68L37
5388a42L38l97J09K35l72k83N30J14k67J19K52l22k00M03j11j11J16R8j87K62
5408A84l33K9J75l8q6L88l31o8J11L88m68m21M60n6K82m65J52K20l60n7K27QK11
$$ y = [-75, -259, -115, 62, -5, -39, -51, -267, -329, -361, 329, -119, -495, -89, -90, -10, -425, -268, -229, -11, -117, -14, -304, 131, 108, -265, -59, -110, -180, -141, -168, -189, -16, -39, -197, -160, -48, 142, -343, -3, -138, 112, 174, -70, 4, -43, 96, -288, 21, 150, -78, -70, -136, 39, 293, -113, 270, -76, -21, -25, 201, 27, -186, 30, 119, 217, -247, -180, 434, 313, 1, 453, 109, -391, -169, -138, 23, -52, 31, -31, 219, 98, 305, 35, 118, 105, 24, -223, -168, 7, -39, -29, 4, 63, 138, -141, -207, 49, 65, -150, -31, 277, 3, -90, 80, 172, 47, 71, 107, 132, 27, 219, 249, -12, -77, 190, 61, -26, 153, -144, 48, -78, 281, 137, 70, -251, -99, -281, -29, -22, -301, 21, -168, 326, -171, -145, 264, 89, -479, -142, 196, -201, -92, 143, -229, -512, 18, 132, -135, -16, 236, -86, -286, 117, 6, -105, 11, 109, -78, 184, -149, -120, 55, 17, -69, 319, -12, -80, 31, 419, -49, -470, -10, -66, 216, -249, -97, 123, -237, -294, -67, -59, 152]
5431A52k24J02O9j95j7n1M1L90j31k73K90o6L6k31L01J78j76l15L87j73J10O8
5453B72j56J33jj55q0L7n6K65l84q4QK46k6K44o1l38n6K20j87K15k14O03p10J10
5477a55L74P4l50j10K96K3J93m45L98k08k68M05l89j69M74O5k50rj05L37j37l67
5499c23LN31m26m9L14k83R9M6K51l88p6J70J76j74K10j08l4j14K69j81q5K53q6
5522eJ39k76M2j44P5K81J95l82k82L29K33l05j42N99m80L7M8J50J58m19M81L0
5544C62j43j11J8m45K24K05N8j53j75L40l17R7J12n0K3p8N08j87k36j15J4r1J07
5567c3L79k24l60J34N83m63QMR5M0k20M10k08k23J21J25M2l48QQ8m14O97l8j54
5591D9j75MM80n91M95n9j55n47J85L63P2k89K3L12j6n1j2j85Q1J17n8p65M68J28
$$ y = [152, -72, 30, 99, -96, -113, -164, -123, 267, 136, -137, 153, 87, 123, -108, 193, 371, 195, -120, 267, 94, 204, 272, 116, 249, 248, 93, 13, 50, -6, 259, -125, -209, -201, 45, 19, 263, 202, -136, -192, 28, -159, 56, -158, 445, -265, -155, 219, 293, -57, -167, 129, 152, 345, -100, 298, 90, -178, 227, -162, -331, 143, 208, -42, -51, -156, 181, 44, -323, -320, 211, -215, -264, 50, -233, -134, -88, 163, -225, -301, -131, 45, -129, 81, -27, -61, -175, 94, -87, -172, 81, -5, 134, -142, -100, -244, -169, 112, 307, -75, -357, -28, 205, -100, -242, 357, -123, -86, -38, 112, 270, -149, 332, 362, 219, 108, 126, -319, -95, 110, 168, 15, -160, 180, -137, -40, 72, 22, 45, -33, 475, 288, 52, -63, -49, -140, -33, 346, 122, -238, -104, 479, 16, 24, 28, 123, 163, -57, 353, 145, -78, 43, 168, 210, -138, -130, -42, -456, 241, 203, 49, -126, -122, 358, -233, 262, 203, 48, -499, -314, 49, 121, -168, -145, 167, 151, 100, 88, -97, -16, 101, 43, -722, -254, -126]
5615a26R3k3O9J27k04K24J33k13j42k5M1J86k05p7P6j46K07P3k36j73Q7L25o8
5638Cj02qM2J5K14p8k04J9K63l05l2M24j40r3l36J78N0k6j54N01q5l5j51R4k21
5663a67J06j39k01L36M7r9q2K34J12m3k10P1J67l00qJ6j10L68l92J47R9Mj09J81
5687B8l00O8L98J5m99J30L60K21p34L20k1j57j08M07J23l01J8M04m26K44p0j46
5709b6J72k59L43k77jK38j59M7M4n0n0K54m14J11m6K30J22K00m33o6K26K0p7j21
5733B8M2K05k85K34j48m5j68J75J43k48J34l40J13K23O3l68K88L4J45n10K92k31
5755b24J87j83L79k74m2J23p8KL0j31M9LL7j24J81k11L09k2l78M7K03k3r9K45
5779Fm6n7J06l0ll86K57k68M34k22J24j1K5p6J7j9K74m48Q2J70J0L67n10L77k75
$$ y = [-126, -33, -56, 13, 140, -64, 160, 293, 80, -62, -87, -46, 140, -65, -142, -66, -212, -5, 68, -168, -341, -254, 71, 3, -99, -107, -65, -50, 164, 86, -118, -99, 164, -141, -173, 251, 111, 18, -318, -140, -90, -116, -270, 231, 146, 111, -40, 54, -167, -61, -200, -401, -65, -18, -117, -199, 35, 147, 104, -106, -35, 132, -168, -176, -160, -270, 98, -294, -147, -48, -44, -153, 28, -272, -204, 194, 209, -290, -160, 200, 421, -313, 7, -14, -171, -279, 128, 251, -50, -32, 372, -54, 190, 120, -26, 146, -113, 230, -47, -48, 190, 31, 78, 122, 72, 22, 276, -138, -27, -73, 157, 279, 479, 46, -20, 206, 226, 149, 28, 70, 275, -10, 224, 76, 31, -137, 38, 181, -67, 67, -273, -160, 63, 126, -242, 46, 80, 225, -285, 7, -224, -37, -220, 159, -115, -157, -34, -112, -110, -80, -211, -162, -159, -122, -246, -65, -276, 33, 11, -367, -320, -117, -140, -239, 6, -40, -97, 9, -21, -24, -410, -153, -421, 13, -209, -85, -96, -71, -147, -130, -149, 125, -323, -241, -71, -61, 306, -204, 173, -102]
5804a02J78j02R0k02L24m25L57l4l2Q6j49K71J03m47Q2N18m8m64M3J60k24K82
5826B65p3J29k45m2J56k11J67J61p3j26j75o3M28j61J65k23J20j88K24j26J62
5847B71j54K36l17p6L52l02k09N56k85K8k61J3J08J19P8k44M2%J50r6j12j82L79
5870I4r6l06L66o3J6k55j01J54L4mL4n1K32k34%l51K45K94l27K34n4K49r9k00
5894a89q8J89PN8j88K47k3j6p4k35K67L11k07j12j33J77L93p34K19K09j12j13
5916a47K60J33m34K05Nr3o5J59j26l83N22j55J28l0O7l3j98J78K79k33p9j74J04
5939a10K9j7M7j38J60J92k61l1qQ9j01K99k16L04L02o64o2K26q8J89l94R5L08
5962A50l7r2o1K20j29J72m65M9L8N1P6J13R8K8j55j51J18K74Q1r1r3l48K79p9
$$ y = [-102, 76, -26, 64, -138, 186, -239, 118, 84, 52, 138, -11, 260, 363, -84, -2, 516, 468, 4, 47, 207, -17, 265, 192, 321, 76, 34, 190, -21, 146, 307, 234, 108, -67, -130, 298, 137, 302, 79, 199, 11, 235, 109, 271, 117, 353, 36, -40, 312, 10, -199, 357, 72, 100, -161, -148, -40, 79, 157, -87, -45, -45, 105, 9, -103, -285, 94, -2, -308, 58, -5, 11, -244, -345, -191, -157, -161, -127, -178, 54, -180, -180, -531, -286, 8, -319, -85, -139, 110, 11, -189, -277, -88, -81, -23, -211, 36, 13, -3, -77, -312, -45, 266, 59, -53, -186, -9, 384, -350, -131, 78, -34, -147, 113, 246, -188, 17, 22, -71, -136, 23, -103, -486, 36, -119, 9, -21, 46, 13, -185, -7, 272, 39, -40, -214, -110, -81, -98, -51, -189, -29, 163, -98, -129, -137, -48, -149, 150, -66, 238, 540, -124, -186, 40, -48, 141, -253, -158, 150, 113, 21, -40, 180, 51, 223, -242, -193, -155, -104, -28, 85, 183, 211, 56, -95, 23, 297, 378, 287, 194, -154, 125, 46]
5986D6L6K2M3j25nj38K81k77n7K83Q6l14l7K32ok56R4J3K47M5j89k2k14J91J75
6011A54l19J26j84J33j7m5o3Q5j16J96o0l3J06j90J90q6J44k61J43j78K85k56
6033b46K58m03M84K3l87K12l13K03J32r8L6j16K13j58p7k48L43L73k62K87n3r3
6055A10k47O7K25j08j41Q2j06L94j83k44K29j92L52j76n4J64n0k82K00R4k50N0
6077f6L0J00K3r3N49m18q8j30L92j64J03P3k76j65L96k3J57l61P8K9n8J30j67
6100E1j27K14K82J22l42k80L41k73K53k73K52p1k00q4N50l04N1k08J51l2Q8K34
6122C95o33LL03N6j97K51J16m31J18m0J11j05k63J85K38k64Q4q8J23J41l1j18
6144d6M2m6J09j8j85L53j70Qm24K43m3J13P9j72o3K98R3k48l06J80L48k14r1K87
$$ y = [46, 82, 104, 147, 22, 17, -121, 160, -117, -174, 109, 195, -119, -156, 76, 70, -186, -92, -79, 168, 213, 24, 2, -212, -21, 154, -165, -39, -223, -90, -107, -152, -215, -130, -246, -50, -110, -143, -37, -227, -37, -123, 21, -240, -97, -275, 10, -246, 12, -391, 93, 116, -271, -59, -372, -169, -37, -135, -99, -215, -2, -160, -237, -485, -142, 231, -31, 256, 203, 110, -137, -70, 155, 47, -94, -12, -118, 276, 93, -151, 78, -114, 238, 62, 8, 172, 122, -160, 40, 134, -116, -66, -36, 64, 87, -6, 543, 125, 37, -93, 299, 135, 238, 311, 35, -130, 266, 243, 400, 39, 117, 146, 88, 218, 51, -76, 138, 420, 542, 200, -80, 261, -12, 241, -32, 220, 149, -51, -135, 415, 111, 162, -46, 105, 73, 161, 395, -238, -235, 68, 124, -73, 178, 294, -137, -19, -59, 52, -53, -316, -131, 107, -157, -73, -161, -38, 103, 72, -46, -4, -50, 59, 41, -144, 209, 39, 47, -377, -134, -177, -64, 15, -157, -220, 78, 171, -77, -383, -203, 145, -69, -160, 127]
6168A27j37j28J24m9J92k39k06J1O6K3J57j26k43J77J49K4k74N41l44R1J01k10
6190a73J35l6J11j67J67O7r1k62Q0Q8j7j61M7J01K56k54J35k7j15J06Rl13J68
6213a46NQ4pJ64Mk29QK24J33k93j29M04Q9k77j60J64J62j45O8r5j78J49K4R1k46
6238a32K02L5l6J99j23j30O4k29N1M21n59J45L06j96R2j54M2m3m6k73K45K65j38
6261HR2k62P1j8J6Lj84K23K32l67K21n5j39k0K20J5k05J96p1m5k84L04K46m81
6285b84QK71l4k32K24J58M6O8k49j51J37p8L12k13k2ML40j31k8j23l4n9J27j66
6309a09MP7l3J00j42K43J4j81j4O9J42J48k48J62k83n2J97J63j13p6J43j08k90
6332a87L62l91J2J04J56Q6J38k05J81m4j30n6K2q6k46K79QJ14m4k03J17o3K02
$$ y = [127, -10, -138, -14, -63, 129, -110, -316, -305, -239, -216, -59, -185, -428, -251, -102, -78, -352, 189, -155, -64, 37, -173, -38, -74, 37, -130, 37, 104, 13, -249, -169, -81, -98, -259, -212, -111, 145, -109, 26, -1, -116, -10, -1, -314, -146, -141, -57, -64, 100, 104, -125, -117, 107, 240, -53, -182, 222, 311, 34, -126, 38, 200, 55, 123, 28, -150, -1, 23, 114, -132, 70, 105, 69, 268, 145, 15, 79, -150, -99, 322, -237, -92, 214, 18, 110, -44, -2, -45, -91, -364, -119, 146, 8, 100, -162, -91, -109, -93, -90, -274, -51, 181, -186, 35, -20, -159, -179, 41, 56, -149, 47, -24, -69, -353, -49, 197, -284, -276, -5, -39, -271, -47, 111, 157, 225, -24, -175, -38, -116, 196, -17, -39, -35, 305, 174, 146, 23, -11, -70, 57, -109, -105, -28, -61, 39, -103, 140, 154, -27, -41, 28, 170, 318, 70, 232, -51, -103, 94, 257, 144, 68, 211, 103, -187, 175, -216, -204, -100, 56, 142, 280, 75, 256, 212, 82, 26, 48, -38, -284, -5, 3, 117, 73, -130, -13, -76, 126]
6355A26N9k17J90j8J11m38L3L98J8j75n3n7K52j00j60j18L74k76J00rj66Q0j37
6378a83J45m2j0M2k12K34j27o6L16R9l01k4r9L10k04l9L19m78M78l35J94k24j62
6401c69K19J86j92J32j65K00m2K51o98M19j27J91k59J60M8k7k3j44J0L43m73L79
6423A9J14k02k8K46l14J57L13j98J09j43k39j35K53K46l27J2J4J1k4J80k0L6K9
6446A09j33k1K58j29j92L82o6r7Ok22j29j15N63j15o7J6k39J10r9K68P5k50J46
6469E9j04R8k46L60o2j42N3K7j0J51k69L29l40p0Q3j26K27p7J6j58J43K98j3k34
6493gJ72j67J04K03l56M55l63j85L05j75J29j41J84k02N05l44Q6l80K92l03J07
6514h1J20j77K66k46L03l23K46J89k42p2J9J4l6k16N38l72OOpN7j43J59k69L39
$$ y = [126, 185, -32, 158, 140, 251, -187, -154, 244, 262, 87, 34, -23, 229, 129, -31, -149, 225, -51, 49, 40, -126, -46, -183, -38, -80, -90, -48, -260, -26, -153, -219, 97, 196, -105, -129, -228, 82, -122, -161, 158, -320, 158, -177, 17, -207, -369, -150, 36, -156, -24, -189, 11, -31, 220, -478, -59, -186, 5, -254, -94, -46, -73, -96, -240, -230, 113, -360, 19, 133, -69, -97, 149, -165, -8, 305, 107, 216, 73, -166, -301, -48, 198, -129, -117, -103, -92, -116, 64, 44, 80, 109, -24, -45, 213, 84, -108, 274, 208, 111, 117, -105, -234, -349, 214, 99, 32, 48, -191, -81, -180, 88, 163, -87, 59, -45, 53, -193, 167, 105, -37, 16, 43, 33, 184, -85, 244, -96, -166, -83, -209, 18, -59, -43, -201, -58, 240, 227, -7, 165, -2, 102, 305, -51, 404, 41, -144, 161, -14, 115, -26, 158, -44, 461, 117, 203, -177, 115, -188, -81, 39, -138, 128, -118, 185, -138, 108, 297, 55, -17, 2, 16, -20, -236, 302, -70, -64, -58, -65, -8, -151, 8, -261, 78]
6538G8j40j13nk3L57j72o21N59k1m42J70L51j77lN2k02K59L14k61k33k47P52k84
6561e2K7pj85J01K50j36j73J2k00k4N1M53j22o7j83J39K26jk81J46j81J60P5k5
6585CR3J5J27j19m45M39Qn7O6m18M63l7l26K24K83K07m06j63OL1J15j66J3K80
6609B36l95K90j69Q7P6l06L00n4p1MJ89J19m06j9j02K17K4P2j99R2k9J19j12J97
6633A60m5OQ8j9j26M8r1k55M34mpk23j24l2J53n8N2k05K32K78p1k27q2r9K98k36
6659a55J14K9j1j28J14J08k26N8J95j42K0J7K6j49q2K10o0J8j79L17l71K79J08
6682A10l39L73j67k70M1K11P0M6k29j11K97j82L48j02j38k6J97k08JK2l04K98
6704f2j47K41o7K82l73k5L37m04K50l5j33p9K70J16j99K08o0K3k28J08o6m1J53
$$ y = [78, -62, -175, -180, -203, 154, -18, -639, -80, -101, -543, -373, -22, -199, -202, -150, -352, -93, 221, -40, -273, -520, 232, -52, -25, -32, -217, -116, 134, -2, -175, -163, -363, -387, -336, 117, -5, -72, -255, -116, 110, 109, -172, -26, -207, -47, 28, 3, 96, 111, 238, 119, -326, 113, 121, 64, 130, -288, 175, 138, -188, 36, 319, 526, 120, -43, -37, -6, 109, -57, -44, 236, -159, 131, -38, 49, 125, -181, 119, 65, -6, -2, 187, 306, -100, -119, -221, -4, 20, 92, -107, -15, -44, 75, -37, 160, 115, 121, 209, 190, 64, 112, 21, -234, 200, 196, 189, -34, -158, -190, -37, -95, -43, -248, -16, 262, 191, -36, -118, -217, 81, -155, -41, -12, -23, -151, -37, 71, -155, -97, 98, -44, -24, -7, 19, -130, -212, -2, -62, -44, -223, 94, -277, 2, 110, -229, 144, -23, -293, -252, -41, 29, 75, -154, -265, 32, -150, 198, 96, -42, -68, 129, -79, -78, -56, -360, -62, -209, 32, -35, 247, -126, -151, 186, -218, 32, -3, -136, -215, 55, 171, -28, 180, 120, 143, -85, 23, -43, -84, 69]
6727F9O3j36J75k30L10Q3j14m88L70K66j61p1k42M72l72K84j36P0m8l13K88L15
6749D54m42L31l57O7j02J53pr6p8K35nP6j96m2J62pK09j95k52L04n41L20J15l50
6773b44K34m8K50j31k54L97m1j12l7j73J73P3N5J62n99R6M7J66j84J33L02l55
6795i0k34L3L00m68K34j09L6K04N9M6o0j08Rr0J5O3N8j37k9K62j75R5J37j92J8
6820a23O2j54R6m4J97J6O8k23R6J08k58K56L74m86k37OM09l9m56L08R2l1j62k9
6844a54K07jr5K37j56k81K38J01r1Q7K25m67J93J91j02K49r8l56J17J42J56l51
6866im4K06P1n5j86M8L58k41r7l6j14J85J39Pr1j76L59l07j0m5J73L25p01K84
6890D3J64j66J69J05o8l05K58l4l71L7K30j3R3J00J86j85l89M08k40l1j10K07
$$ y = [69, 132, -4, 171, -59, 251, 334, 220, -268, 102, 368, 207, 136, -106, 366, -6, 278, 142, 212, 164, -149, 139, 454, 12, 343, -14, 53, -49, 104, 97, 1, -77, 158, 153, 229, 33, -9, 153, 146, 355, 160, -92, 212, -329, -9, 106, -244, -10, -58, 192, 61, -193, 204, 163, 51, 14, -159, 14, 87, 142, 304, -295, -199, -152, 14, -170, -37, 265, -90, -324, -291, 9, -459, -225, -334, -298, -94, -35, 11, -49, -157, -148, -238, -223, -160, -102, -239, -268, -6, -181, -86, 51, -141, -123, -61, -215, -119, -163, 34, 50, 118, -105, -9, 99, -159, 97, 471, -15, -252, -246, 163, 124, -332, -24, 68, 37, -125, -154, 53, 52, -43, 194, 38, -243, -5, 96, 5, 92, 317, -150, 43, 234, 132, 381, 283, -73, 44, 186, 342, -9, -53, 153, 224, 169, -17, 31, 389, 148, 51, 15, -99, 86, 225, 232, 141, -35, 324, 17, 7, -38, 135, 460, -241, 43, 207, 41, 210, 315, 247, -58, 200, 166, -205, -168, 62, 49, 142, 242, 428, 243, -146, 262, 22, -9, -119, 88]
6912H8J95l68p2J77j12K56j81N5j91j15K63Ko6K11q3j96q7L05j69J43k18J84j35
6935a14J5L26k32j53K39J51m14o1J1N29n74L69o1j64m9j50N17k79N8K8j10pK21
6958I6k23J36Q2r7l31NM56j19j87N9M79l51k64n2M88l51J38K6j71L24j46K02k16
6981a7N8k18K18J14k40L17J42l38K8k13K49k6l93N16j98Rk25L77m24N26k29J8
7003E1j43M6n0p3L11n8Q2k19J34j1j44k9K34j15K41j97J73k60j90O7J34m8M33
7026C69l12q1K7j04L27k61J49l0J0r2K4L3n9R1k5j36K58k99L56l92J86k43K02
7049bL5l12L60m1J68k07K36m12K84lJ41j77j63J75l2o6r8K79l88J33J62K30j85
7072A17l17J90pK79k40k76lK62O5k63JK93j07l01J10K24k85N33k27J60k08r4J12
$$ y = [88, 283, -85, -157, 20, -92, 164, -17, 38, -153, -268, -5, -3, -69, 142, 59, -137, -224, 81, -88, 55, -163, 21, -114, -99, 227, -5, -158, 81, 232, -182, -243, -232, 297, -277, 92, 31, -133, -182, -332, 185, -94, -36, -8, -118, -125, 96, -127, 9, 91, -6, -337, -332, 124, 5, -182, -123, 356, 5, -259, -311, 177, -174, -36, -10, -181, 143, -3, 199, -17, 41, -177, 41, 155, -85, 232, 374, 36, 64, -149, 100, 74, -319, 197, -1, 8, -217, 160, -264, 262, 33, 51, -92, -46, -96, -169, 142, 84, 166, -53, 81, 70, -74, -103, 131, 16, 257, 60, 233, -27, -217, -150, -16, -64, 369, 57, -24, 3, -101, 226, -35, 114, 84, 94, 2, 26, 59, 0, 91, 66, -70, 188, -111, 245, -147, 39, -204, -2, 33, -279, 81, 40, 208, 1, 237, -175, 109, 106, 247, 70, -93, 82, 50, -16, -114, 165, -223, -90, 72, 302, 117, -200, -10, -17, 262, 22, -254, -257, 5, 70, -193, -192, 101, -6, -307, -197, 27, -258, 275, 48, 208, 0, -94, 18]
7095A8J9l15L07J22k37LM06l60%j1oO8j76J68K45j89k03L58j01j14O8L30l97p7
7119g4k52L44k45M32k17q2L6J5j94L05j72MJ72r8K21r3L3p6rL16k97j07J02j98
7143a34K60k13J94j87J96o5j68K6K01o6K9k47J84J64l29K43L2k77R3J0k3K12m09
7166b74K90k4L60l34j25L00l1l10K00j32j48J69K6k06K90k51P1Q4j01K60p5j85
7188a46K06m04K26K57L2k41O9r7j99L54j05K15l55K5M55l08j53L07R7j01o68J11
7210d23L56j69J89QJ22j27L1p7J28J15r6J1o7K15j14j85Q0Q0j07K50m60O85n80
7233a35M8R2l40J95P1L05j05Q5l62J97P5o9n4j48N20m45J32P7R1p2m7n9k4k19
7257a91M09l9j35J57j74k16L00J17k80j87M75j57k38K9K42M2j68j16K29j17j74
$$ y = [18, 37, -278, 29, 151, -86, -83, 323, -37, -37, -48, -54, 14, -162, 6, 251, 62, -141, 217, 116, 2, 70, 400, 3, -74, -326, 18, -227, 205, -12, -94, -58, -43, -237, 68, -104, -100, 72, -26, 195, 102, 135, 59, 50, 366, 69, -38, 64, -134, 126, -87, 107, -80, 116, 51, -117, -91, 110, 44, 73, -174, 10, 174, -155, 88, 120, -157, -64, -54, -77, 135, -274, 16, -8, 352, 18, -107, 193, 162, -148, 52, -80, -228, -59, -33, -239, 51, -200, -129, -45, -146, 114, 39, -146, 60, -344, -118, 139, 171, -70, -1, -98, -297, 57, -48, 167, -188, -163, 292, -16, -169, 138, 235, 134, -534, -423, -67, -236, -47, -39, 83, -44, -13, -90, 38, 153, 57, 68, 1, 216, 102, -83, -3, 77, -30, 220, -240, 445, -135, -87, 5, -335, -140, -69, 236, 131, 216, -146, 51, 126, 57, 3, -145, 375, -70, 62, 139, 230, 158, 111, 52, 28, -191, 218, 179, 44, 201, 27, -189, 111, 228, -52, -239, 236, 79, -159, -130, 112, 154, -14, -130, 99, -18, -192]
7278a92K01j5k06L21J71l61J78l34R9P3R1l12L94l17J79J63m3l54N87l95l8p5
7300a85J91q5J28j59K99k12j23K49l26J48k18K59j36J17K41j84j70oN4j3k01L83
7322E1r2j29K83o8j20k9NK49r3M2j46N8j13J59m9J52k00J9%j26J91j9k19K37o
7347C7n0K1k93p8K67L8J19m7j55m6L18j86J13rm4M1j05K4k25R3K10j9L3j26J09
7372D0J17k03r2J52r7j93M08j60M7n2M5k4qN1k22r4l7M27o6m93N01K27p5K64k
7397D61l67l65M49L6j13j77M06k71l5k58L10j00J73k19l6L95l37J5J75q9j63M50
7419C40l87j33L85l43J26j41k65M82j0J2J35k88j51K95nJ49l95M20k87l4J13J28
7441A46k97K63O5j00n21K92K89j41j24j15L90j34j46K49r8j3J40Q7l51O3J98o6
$$ y = [-192, 9, -6, -212, 109, 280, -81, 97, -237, -138, -65, 26, -286, 108, -209, -30, 133, 90, -264, 323, -72, -110, -185, 6, -79, 49, -110, 189, -23, -146, 103, -223, -75, -293, -34, -170, -53, 188, 4, -166, -172, -118, -131, -332, 51, -41, -170, 113, 45, -75, -104, -99, 150, 57, 99, -47, 11, -102, 57, 8, 160, -40, -21, -21, -147, 44, 25, -194, 43, 37, -13, 8, -285, -363, -96, -58, 61, 14, -141, -187, 131, -55, 58, 49, 5, 46, -59, -35, -260, -167, 43, 24, 57, -69, 40, 157, -46, -138, 14, -83, -276, 132, -28, 19, -33, 12, -12, -20, 31, -191, -285, -322, 105, 39, -454, 47, 274, 199, 463, 461, 94, -271, 178, 214, 101, -76, 330, 59, 24, -234, 76, -24, 149, -70, -106, 289, -48, -33, 142, 53, -110, 340, -47, -180, 205, -138, -12, -153, -418, 64, 54, 66, 201, -87, -238, 57, 52, 201, -194, 226, -61, -95, 18, 146, -151, 112, 177, 77, -444, -152, 137, -4, -128, -243, 147, 13, -133, 116, 18, 5, 145, 232, -119, -56, 142, 76]
7463G6j30J04J6j92M9Q5p0j68K62o7m17J80K32p5lPJ82j13l1P1Q4j63R4j97J27
7488e7j03J22K35j83j79L81j64k87J51j10J67m3K41n6k13M50k49p4K67m69N1J83
7510F1r8O9p1K15l94J07J33L35k70k9J09l72J14J0J32j53M7J77j41M0%l8J15k59
7534a61J69O0M2l5j28K71k47oj19N7J06n0j74N94No20N02j51j87J33j01L79n55
7557b16N2L0m1R3M1J07l50J83m1K72j99j53K18k24M40l13N8r8j13L34k58l7L2
7580a83l8N6J04M9J69k54k20K95k09K04J45o3j39L5J97k91O1M21J3l93K07k58
7602i2M09l32l10O00l86pj6Q3K55l64K16J3j45K80K05l61J89k03M35k48k12K79
7624B88nj97J78k6j32J7m44M13r8LK26k71K0J71J32k49o6J70k32L47k05J8j40
$$ y = [76, -54, 50, 66, -126, -77, 8, -62, -230, 32, -35, -452, -272, -40, -115, -118, -111, 71, -42, -73, -2, 82, -81, 13, -184, -57, -160, -38, 197, 14, -165, 216, 52, -235, -84, -194, -27, -70, 171, 115, -98, 352, 103, 29, 296, -173, -122, 61, -37, 32, -39, 176, -218, -111, 22, 357, 87, 58, 167, -205, -91, -81, 51, -102, -55, 122, -19, 21, 21, -17, 98, -161, 8, 68, 110, 75, -53, 218, -29, -35, -154, -97, 9, -41, -215, 379, 384, -236, 266, 115, -72, 61, -40, 339, -216, -164, -134, -175, -82, -41, 66, -284, -101, -142, 130, -69, -222, -4, -228, 212, -101, -43, -141, -254, 80, -178, -215, -183, -221, -165, -61, -12, 157, -97, -317, -22, -231, -27, 118, 55, -84, -49, 148, -143, -82, 339, 352, -41, 166, -92, 317, -15, -325, 275, -111, -118, -134, -51, 204, -160, 56, 69, -76, 204, 409, 48, 237, 34, 469, 221, 9, 288, 283, 86, 264, 238, 106, 123, -321, 92, -6, -3, 223, -48, -28, 143, 275, 26, -40, 130, -102, 245, 40, 58, -82]
7647h2l3K31j30J47q6N3J09j5J33m54j99K54K18o3k2j66Kk06L57M6k55J29J3o1
7671h0j06K08J17k4l03L07k03J90J53l77o2K35m16J61k44N66k52J99N1o1j14k96
7693c51J25N15l60m0m2p3M27k60j46L73r3k04K44N0k28m2n1J56J5j96J78j24J27
7716@j16K59j96m0J05lj07J21J54j73J80k15J91j74j45L42k76k4J79k9l00M47
7738A80Q2l18k9J65k22O8K80k01N5k5L29o7n24K42J95k40Q3K6k25J05K47j44K22
7761B84l36K04l38L58R3l94M26n21J54K34k47QL10r7pl34K71Rm08M25n3Q7n2m2
7785C4k0J37K07k42n1j61L33n8n4M2q6j37L08q4J08k46j3K0L6K9M4m4m8k6l02
7810b74M77l50n9L58j97j49J63P0k35kL73m53L86j07k77K05n2J57j21J25Q2k7
$$ y = [-82, -115, 116, -14, 133, 47, 100, 209, 194, 327, -127, -326, -72, 146, 83, 61, -105, -103, -309, 48, 94, -161, -32, -19, -80, -186, 22, 139, 115, -188, 119, -84, 106, 259, -118, -180, 55, -361, -200, -444, 122, -130, 69, 120, 59, -55, -351, -226, 289, -71, -111, -153, -226, 201, -59, -205, 168, 75, -129, 115, 165, -63, -105, -156, 0, 15, -181, -3, -127, 0, -116, 143, -53, -93, 12, 9, -98, 23, 177, 4, 184, -31, 160, -14, -159, 183, -93, -117, 62, 33, -267, 180, 262, -56, -85, 80, -142, -74, 206, 5, 60, 35, 364, 297, -227, 15, 210, -30, 53, 79, -146, -41, 206, 62, 284, -52, 152, -186, 172, 265, -129, 297, -224, -70, 164, -83, -75, 235, 138, 131, -203, 68, 77, -331, 94, 41, 128, 76, 34, 14, 151, 358, 116, 65, -96, 237, 179, 125, 167, 81, -56, 252, 168, 276, 30, 17, 37, 73, 102, 146, 102, 54, 28, -274, 203, -147, -206, 152, -45, -194, -31, 39, -196, -198, 175, -278, 108, 1, -276, -71, -123, 34, -87, 38, 120, 93]
7832I3j2J1O5l61PM12k48k09j8J86J43q3J47j60Q2k06m4J34q7j27L27P0k58K52
7856A16k39J55N8l70J82P0p9K25l07K1lJ17J17j74L16k73J10j83K66n6q6k2Q1
7879D2L97m73J28R1k07l8J13O0k05L53l67J6J25K28l63p2K75J51j79j98M68l7
7901C08j67O1j59k21K06L95l43P3J56j06j52l5K36P0l90J65Jj62J46k45J70j01
7923i4J10J07j15p3j93J56J69L8J5k6j11L0l1k7J39j75J36K7l9J3K0q7j76K31
7947D4j04kJ76l59J13r3J75m1n4P6k13L01J36j77J86q4o1j0P8k28J33r0M4r2j82
7972c28M71m24L88k65J74p2J39j30k1L5j20K64j80o5K10N7k03m9J85j25j19N5
7994a23J78j21J83k7n2jj08J01J7j12R0j5P8O8m72N56l45q7J93J51j19j59K17
$$ y = [93, 81, 92, 157, -204, -197, 215, -33, -242, -260, -74, 69, -14, 133, -27, 55, -151, -195, -61, -148, -275, 52, 122, -136, 116, -123, 32, 90, -280, -98, -28, -107, 118, -189, -168, -171, -54, 63, -111, 205, -68, 42, -141, 125, 69, -17, -39, 42, 439, -34, 94, 185, -22, -60, 53, 113, -92, 261, -106, -90, 35, 263, -100, -172, 103, 254, 75, -123, 345, 308, 141, 202, 43, -178, 28, 423, 80, 153, 309, 203, 51, 16, 252, 322, -68, 97, 98, -64, 82, -163, 7, -94, 16, 123, 8, -65, -258, -102, 67, 105, 120, 94, -17, 13, -18, -45, 94, -81, 55, 82, 43, 56, 76, -11, -187, 44, -60, -62, 114, -245, -132, -225, -50, -91, -145, -69, -282, 19, 155, -22, 164, 80, 19, 9, 87, -141, -8, -98, -54, -146, -328, 143, -281, 107, -158, 16, -56, 83, -47, -68, -33, -153, 111, -69, -134, 76, 133, -70, -119, 66, -59, -178, -123, 55, -66, 117, 90, 38, 37, -71, 30, 47, -65, 25, 10, 88, 156, -316, 240, -105, -192, 1, 152, 33, -126, 91]
8017I1j68j56J38J78j34K89j91M0j88j70L94R3l02j5N6L15l53K21j30j51J30j1
8039b4J42j43j04L9K27j32j45J82l9j84N62m20m2m5J32k11K65m04M19j09j05j
8061a40J7N2j62K11K96m72N31l15k36K98J11j59R6k67K16k8k22J63k25K81j04
8082e8J73J07l07J99N7j28n2j31M9J19k62L75l20j06L66j99J76O9J05k28j37m6
8104a79L1L8j22K78j48j14J37J14J15p04O26Q4M4j57R3L3l02J60nK87n40K14L3
8127A6k15L89j89L1J21k77J66M1N9j51l3J09M2J19r9p2M6p8o6k01M48j62j12K17
8151A49k31J09r7M22m99K27J30k00J28l61K26J81j56j95J91q1j32J62k3P9k31
8172b02L26k85K21n2J43j80L88m10n1j1RJ99j02Q9oPJ55l75q6
$$ y = [91, -77, -233, -95, 83, -51, 238, 47, 87, -101, -271, 123, 216, -86, -101, -45, 270, -83, 138, 8, -143, -13, -24, 118, -25, -129, -90, 137, 5, -140, 42, 3, -181, 381, -39, -81, -126, 6, -205, 60, -344, 75, -34, -139, -140, -123, -71, -233, -22, 274, -198, 333, 18, -218, 80, 191, 32, 128, -139, 77, 49, -173, -10, -235, 46, -58, 115, 222, -85, 114, 171, 43, -9, -140, -91, 28, -234, 141, -179, -285, 81, -118, 58, 127, 232, 4, -133, -179, -148, -110, -232, 46, -102, -216, -79, 35, 150, -554, 72, 156, 200, 43, 136, 169, -133, 27, 22, 309, -231, -17, 16, -199, 190, 1, 32, 153, -124, 42, 83, 142, -9, -42, 67, 109, 228, 129, 57, 103, 25, -41, -242, 206, 44, -68, 149, -82, 27, -70, 352, -147, 80, 210, 10, 138, -223, 3, 184, 28, -167, 24, -57, -189, -27, -50, 29, -202, 124, -161, 60, 8, 151, -29, 359, -51, -102, -113, -104, 95, -7, 82, 76, 83, 238, -137, -223]
8191b23
$$ Imaginary data points
##PAGE= N=2
##DATA TABLE= (X++(I..I)), XYDATA
0@%%%%%%pJ5j6J6j6K2l0L4m2N3o1P2q8J04j22J43j63J87k17K51k87L24l67M15
30B20m65N23n88O58p35Q20r13J014j124J245j379J527j690J872k074K301k557
47a345K846l180L567m023M568n236O078p172Q664j0831J4276k0620L6130j39438
61a15716k40716K09243J57964j7403l5251N1970n1551m9649J12461J43581m7965
72A16968p9904M6005O0960k7488J1496O0004j584l8422M1016M6767l9426m4447
84A51945M5522O2846O684k6820k5225j4868J6372K9865Q816q558j5395l7612k3645
97A69927L8887L8081m1222m6754K3138J0920m9972r879M5872j3742n9649J0896
109A16503K8736n6246m5845N5182K5340p7891l1640N4869j1050p2417J7460N9159
$$ y = [0, 0, 0, 0, 0, 0, 0, -7, 8, -8, 8, -8, 14, -16, 18, -24, 29, -32, 40, -48, 56, -66, 77, -86, 101, -116, 135, -152, 172, -195, 220, -245, 278, -310, 348, -387, 433, -480, 534, -590, 655, -724, 803, -887, 985, -1089, 1212, -1345, 1501, -1679, 1888, -2135, 2433, -2803, 3275, -3897, 4767, -6064, 8212, -12408, 23722, -115716, -356432, -147189, 10775, -6628, -41879, 10091, -41460, -91109, 21352, 164933, 116968, 37064, 83069, 144029, 116541, 128037, 188041, 186457, 148035, 189051, 235818, 196392, 151945, 197467, 260313, 266997, 240177, 214952, 200084, 216456, 246321, 255137, 246579, 231184, 193572, 169927, 208814, 246895, 205673, 158919, 182057, 192977, 143005, 133126, 178998, 165256, 105607, 116503, 145239, 88993, 43148, 98330, 123670, 45779, 14139, 69008, 57958, -14459, 3001, 62160]
121F2160m5496o7814M0879M3566n7738m0896M7739J7325m7922n391L0164k4807
133d8231l3513L6165L3250l5592k8792K1944P236j7959J3258K4563j6730k7101
145g1502J0141K0242J083m121l377l371R092Q914j4060p154K4791J1080k4832
158d3074m935K5040n364k3050K0620K9820k3367k6280K4827J6420k3926L032L0144
171i3j5607l4692K6760L5816l1217k9306L6535K1670l7478j1772L6736k39l5078
184c7965J3708L7471j8168l4250J6729K4831j2970q960J5122m599k0321J1297
196a8075K3827r420j9944P700J2732n751m061O045j285o530L931R799J013p422
210g441j0261P08J9419J3437j7671k0223J0548J6945n476j786J2787p817k3781
$$ y = [62160, 16664, -51150, -10271, 33295, -24443, -65339, -17600, -275, -48197, -53588, -23424, -48231, -81744, -45579, -12329, -47921, -76713, -54769, -47533, -65492, -52234, -27671, -44401, -71502, -61361, -41119, -40036, -44157, -47534, -50905, -41813, -32899, -46959, -54113, -29322, -18242, -43074, -48009, -22969, -28333, -51383, -30763, -943, -24310, -50590, -25763, -9343, -33269, -30237, -93, -15700, -50392, -23632, 12184, -19033, -48339, -11804, 9866, -27612, -39384, -2648, -2887, -37965, -24257, 13214, -4954, -39204, -22475, 2356, -10614, -19574, -4452, -9051, -29372, -18075, 5752, -3668, -23612, -15912, -3180, -8931, -12992, -6947, -8232, -14762, -10831, -1032, -19, -7441, -17702, -16994, 2425, 15862, -1809, -22032, -11484, 5461, -15, -1801, 10986, 3169, -20612]
223b0612O781K8181j515j8426N247O666j4853J570K6347q02k8416L715K5715j0666
237H932k5252J5997K5488j6591k2906J4051J3977j5205n820J9725M092j9396n418
250h326J2624K879m097L469l85j2656m813J0833O138p518m405M283O32o914k74
265h530J0391O450q953j1311M421J0135l943q045O934P567j2719j2597J3112J4968
279G880q323j0324P342M044p509L677J3766m140j3986M511R923p766m925J3732
293G902M205j7959n026J9442O088j5488j536J6398q82j5381K539J6609R3j1768
307E236o51O687k710m097N235L951n801l382M917J802l882K155O686l000j0299
322B847J936J1067j655j1583N38J1112k372j3768Q84J3148r24j2205K08Q978k853
$$ y = [-20612, -13831, 14350, 12835, -5591, -344, 6322, -8531, -6961, 19386, 18584, -9832, -6117, 19598, 8932, -16320, -323, 25165, 8574, -14332, -281, 13696, -1509, -7329, 12396, 16488, -2908, -8326, 4298, 7177, 3080, 6549, 6164, -6492, -11305, -472, 5666, -1852, -6257, -1974, -1342, -8256, -8530, 1861, 8311, -642, -11953, -7532, 2603, -1340, -9385, -2451, 5116, -7603, -20200, -7088, 7880, -443, -10767, -3425, 619, -6890, -3213, 10553, 6413, -7573, -3062, 6861, -905, -5830, 7902, 12107, -5852, -10878, 8564, 14652, -836, -2372, 14026, 13144, -2237, 302, 16911, 17004, 5236, 4585, 11272, 8562, 4465, 9700, 13651, 7850, 4468, 9385, 11187, 7305, 9460, 16146, 13146, 2847, 4783, 15850, 14195, 2612, 3150, 14262, 11890, -1878, -994, 12154, 11230, -975, -767, 8211, 5358]
337E358q001M386O804n458p446L469L016n779K61O372l582r646L212R927m397
352a504j0070M789P905o738r214O971Q901p841q295P612P451q184o895P345N763
367b004n573l852M895J807n999L48O422j088o168J646N016k336l190O938M124
382I86q270m760R390N774q624n225Q295M025r798k515R457L172q794k238Q472
397f53J737o241M42O211q0m063K092K686m240j715O064J752o733j788P137J398
413D006o690J544Q968n12r473M20J0403P71q050OO571j173n931K076O510k268
429G178m999K124M208k298j512L849J592m497K49M855j087n844J696P014k614
444I914p611K498P417l069o658L485O807n254p469M449P460m441o643L606L621
$$ y = [5358, -2643, 1743, 8547, 3089, -4357, -888, 2128, -3651, -3390, 2982, -600, -10246, -7034, 2893, -1504, -11574, -6785, 1120, -5618, -14832, -7861, 1040, -6801, -15096, -7484, -33, -8217, -15112, -7767, -2004, -7577, -11429, -6534, -4727, -10726, -10378, -3956, -5044, -11212, -9566, -4550, -6886, -10076, -3138, 986, -7284, -12044, -2654, 3120, -5504, -10729, -2434, 1591, -8207, -10722, -1265, 1907, -6887, -9125, -653, 1084, -5157, -4715, 1496, 1416, -2647, -555, 2131, -2109, -3824, 2240, 3992, -2741, -4529, 2608, 4006, -2684, -1140, 7828, 7316, -2157, -1737, 8666, 9437, 1387, 1393, 7964, 6791, 860, 2936, 9446, 7178, 2179, 4303, 8511, 6213, 4701, 8550, 10142, 5645, 5894, 10749, 9662, 3818, 5514, 12528, 9914, 2303, 4801, 12218, 9149, 2491, 5976, 12783, 7529, 60, 4509, 11969, 7528, 885, 4491, 8112]
459H112m667k833M444Q3m849j81L742k068m013L611L211o024m413N831L378o912
475c548l543P214K572p713l218P146K692o278l050M216J887l339j991K258P96
490c899j439l71J003n06k71R28J399j528p96K531J499m163j163N796K258o417
506e139l988P580M884o844l192P389K230o762l1Q239r03o949K127N806k572l259
522a384M304J526n041N08O315j237p045L677P215l861o149M321N185m227l776
537C31L876K507m572j542L653J467k303j440K39O34J195o30l013o50K155L76j636
554F47k61k03j335J447K076l141k597K942R93m037O30N592l659q584M166R592
570D268m969r789M212P724m720l466N827R48p305J058P897l299o618L627L959
$$ y = [8112, 3445, 612, 5056, 5139, 290, 109, 3851, 1783, -2230, 1381, 4592, -1432, -5845, -14, 3364, -3548, -7091, 123, 2695, -5018, -8236, -1090, 1602, -4676, -7726, -3510, -1623, -4962, -6953, -4695, -3899, -5338, -5709, -4706, -5212, -5483, -4555, -3156, -4684, -5480, -2949, -1450, -5613, -6776, -980, 1278, -5139, -9127, -1547, 3337, -3507, -6699, 690, 2920, -3842, -3873, 4366, 3463, -3486, -1359, 4447, 1875, -1384, 2920, 4446, -595, -87, 6228, 4991, -2054, 1623, 8838, 4977, -1172, 3149, 8334, 4107, 331, 4207, 6714, 2142, 600, 4253, 5720, 3417, 1977, 2216, 2850, 4045, 3415, 402, -248, 1907, 2283, 647, 386, 183, -1152, 295, 2371, -770, -3367, -425, 568, -3469, -2839, 2753, -906, -9490, -5324, 4268, -701, -10490, -6278, 1446, -3274, -6740, -913, 35, -7270, -6212, 1685, -1614, -8232, -4605, -646]
585f46n780j208P005j285q913L100R409k400q457K786O416j877j936K229j123
600b680l145J905K733j903k388J564r17m46M611J363n475r76O353J271l762J278
616f14J435l658M68N929j668q132K884P438l802m895O854K255p970J025J1666
631I215j549j1884K842J0915l133p525M145K794o789Q21R544k796r664L496R007
646I439l999m088O173J57p833K373J0116k673j0219J111O195p25j974R98k297
661B754k243N293L156m850j455L606r62l115M690K290p734k593Q452J327p020
676A596n78L755l367n58P357k166j0625K621J2235l020j0572L770N691p977k422
691d260J1237J61j4257n14J2696j149q979K565M341o477j115R022j704j0880K929
$$ y = [-646, -6426, -7634, -629, -1914, -10827, -7727, 1682, -718, -9175, -6389, 27, -1850, -3786, -1557, -2680, -5825, -3920, -1187, -3090, -5478, -3914, -4831, -5277, -666, 697, -4778, -5754, 599, 1870, -1892, -614, 821, -2837, -2369, 3560, 1892, -6240, -3356, 4082, 280, -4615, 2239, 4494, -3476, -2451, 9215, 7666, -4218, -1376, 9539, 6406, -1119, 3026, 5820, -969, -148, 9396, 6600, -3064, 432, 9439, 5440, 1352, 7525, 7682, -151, 2222, 12338, 9665, -554, 557, 6752, 6027, 4053, 5051, 2754, 511, 5804, 8960, 4110, 2655, 6261, 5299, 2184, 6874, 9164, 1430, -1163, 7289, 8616, 1596, 1018, 4773, 1406, 848, 8205, 6039, -4586, -1965, 10270, 7250, -3322, 448, 6139, -1838, -4260, 6977, 7138, -7119, -7633, 5063, 3914, -5065, -2500, 1841, -4636, -5751, 3271, 1567, -9313, -6384]
706f384R702m169q669L873L781n253J86O763l207q760J787Q036o2l368j202l359
722a0305r26P069L986p428m057M552J094k495L293K689o445k497P522J905o316
737h359N75N605l106k501P083Pr928K377J3831k105j3308K597J0638l104m294
752c992P593J451j1252J27J2973O84q927J395M823m263p88Q839m01j1282J591
767a429J0995j141q131K095N564l316j696M894j564n407J622M779j336k709Q00
782D020j915j825M825L087p002m111N734K940l940K41J173m669p02O331Q93q787
798c707j249N941j526l696M798J955r205j323J1592Q38j0491q0Q224j813n874
813e616M341K799p126q78Q417r28q333J908O832k783k694N324P67p615J064Q893
$$ y = [-6384, 3318, -851, -9520, -5647, -1866, -7119, -6933, -170, -3377, -12137, -10350, -2314, -2376, -5744, -6946, -10305, -11231, -4162, -176, -7604, -11661, -7109, -6015, -8510, -5217, -2528, -8973, -11470, -3948, -2043, -8359, -7784, -2179, -5285, -7786, -703, -696, -10624, -8247, 5584, 3479, -9829, -7232, 3406, 302, -3992, 3601, 5052, -6200, -6073, 6900, 7584, -1343, 52, 4875, 612, -176, 8663, 8262, -3020, -1429, 9566, 8425, 294, 2389, 7953, 4637, 2941, 7835, 6271, 864, 2486, 7265, 5929, 3220, 4020, 2105, 280, 5105, 8192, 1190, -2921, 2813, 5753, 1813, 2054, 3227, -1442, -2144, 4187, 5080, -3707, -4956, 985, -541, -4237, 561, 2516, -6689, -8012, 3580, 4418, -6073, -6153, 2071, 258, -5616, -1275, 1524, -5602, -6480, 1937, 1009, -7324, -5416, 1416, -1367, -4061, 1263, 2030, -5585, -4521, 4372]
829D372o91p846K07M217q88r66J996j606k869K762L702k576j845K722l29j641
845a279K947K995m024l686M478K547l601p22K030j793j049N129P36n677O56O360
861F047j013n555K344M374m166k195O212M11q134j154P465J402m881J07J680l162
877b18J82O308K53o421r58M248p43k609L049J051m767j880M291J214l523n01K899
894A875q47j892M69p90P3K775Q02m377j992K221J011j543J423J252m054k883L778
911b699L226j779r31j08k455p70M528J460m335j280L731K02m812J820N041k164
927a325m373K465K513k654j495L690J150l612l45J514n52l7K813O6m022p97L840
944a161J465k610j9J584j368j457J411K049p48j109o72R35J336M27j543k14K004
$$ y = [4372, 3681, -4165, -3958, 259, -629, -1595, 401, -1205, -4074, -1312, 2390, -186, -2031, 691, 362, -1279, 1668, 4663, 639, -3047, 1431, 3978, 377, -345, 1685, -108, -1157, 3972, 4708, -969, -313, 6047, 5034, -521, 1823, 6197, 2031, -164, 6048, 6459, -1675, -2829, 4636, 6038, 1157, 1264, 2944, -218, -36, 6272, 6525, 104, -854, 3394, 2651, 42, 3091, 4142, -625, -2505, 1786, 3000, -523, -1024, 1875, 1028, -864, -395, -1185, -1112, 1663, 2465, -1912, -3904, -1683, -672, -2215, -792, 460, -3594, -6477, -2699, 527, -1252, -2183, -2291, -4746, -5516, -988, 472, -3863, -5143, -1412, -1210, -6022, -4202, 839, -1325, -5698, -3233, -720, -3374, -4869, -1179, -29, -3641, -3986, -2472, -3024, -3061, -248, -182, -4204, -5001, -1161, 304, -2306, -2325, -741, -2109, -3566, -2155, -106, -854, -1963, -2635, -1700, -364, 63, -1480, -1694, 310]
961C10j39j631K73J823J11j805J01J369o07j59J396k14j300Q51J815j236j034
978g6K151R00k627j427L790J363l226j090L065M49k595M3K595j49j780L58J013
995B757r88N01Q70N1j496K25J520j070r11J332J012j743k024J612K755q24k192
1012A387p36J692L87j351lJ420p61j020L8J417K7j282k67K99l52j38Q90j02j465
1031H0P4J773n54j988O23J276p71j625J416J583j481k027J495J359j699j582J212
1048h36J057j314j013J233L83o01j72P31m2j167K28J162p40o75Q16l69j141m83
1066b943J664P83j896q13J445Q28j004o55J640L82j913j025J925Q21j673o21R32
1083b123k00m77M62Q25k24l40J60J2o39N66J790k36j528o99J768M8j245P68J440
$$ y = [310, 171, -1460, -1187, 636, 747, -1058, -957, 412, -195, -354, 1042, 828, -472, 379, 2194, 958, -76, 2075, 2975, 348, -1079, 2711, 4074, 848, -242, 2823, 3272, 677, 720, 3315, 3166, 1386, 1744, 2757, 1769, 2270, 3140, 3191, 1695, 1920, 3440, 2370, 1459, 2791, 3803, 2060, 36, 1648, 4403, 3579, 1387, 651, 2343, 2730, 1379, 1376, 2796, 2035, 1015, 1053, 2470, 2497, 1215, 948, 1247, 895, 757, 1647, 1545, 80, 154, 1927, 1373, -615, 8, 1284, 513, -1112, 304, 1887, 406, -1621, -126, 1233, -466, -2048, -836, 221, -1093, -2106, -873, -490, -1091, -1263, -532, -574, -1741, -1513, -351, -1091, -1766, -950, -1319, -2460, -2943, -1279, -496, -2392, -3205, -1760, -932, -1936, -2591, -951, -569, -2482, -3507, -1582, -761, -2434, -3055, -2123, -2323, -2800, -2338, -1513, -1737, -2077, -1917, -1905, -2544, -1978, -188, -424, -1952, -2651, -883, -835, -2080, -1312, 128]
1102A28p38j740O11K031Q18j774q1R29k50j30Q90L41o10m61N42N41k50N05N71
1121A873p52p52J072J051p28r90P71J063q61j011J362R60r21j156P43J482p27
1138B479j192P71J216j045r75K18L80m82J97K85l13p74N42J158p98p09N53J91
1156A702j561k09J801O34k735j466K342Q45j933l81J488m35j194K45R00j2m89
1173d58K59m11r83K83Q12p92r75O21O11j156q17J280Q85m93j109J58R35K51p50
1192a849l13J062M18j144r53R79J279q72m89J062J73j041N63J823l23o13M84j2
1210B34j161N92K025p28k407Q71K101j006j542J315J724j795o64J918R43k173
1226B47oJ324j35q61j57N99r99J31J415n89j660M13J470m78p91Q52o7j038J34
$$ y = [128, -610, -2350, -1739, 292, 1110, -664, -745, 184, -66, -196, 694, 1035, 425, -36, 506, 1047, 797, 1302, 1873, 1121, 369, 1441, 2492, 1764, 774, 1545, 2608, 1747, 736, 2098, 3058, 2137, 981, 1724, 3206, 2479, 1287, 2058, 3274, 2229, 1254, 1472, 1852, 1370, 1567, 1852, 1539, 765, 1307, 2465, 1667, 958, 1511, 1702, 141, -68, 1733, 2367, -368, -1834, 508, 1353, -580, -961, 527, 92, -1102, -857, 43, 31, -458, -199, -610, -1593, -1310, -498, -1290, -2265, -1644, -1033, -2189, -3006, -1726, -841, -1334, -2443, -2285, -1350, -1099, -1849, -2162, -1100, -682, -1826, -2779, -1800, -521, -1393, -1882, -820, -647, -1688, -1125, 698, 375, -238, 246, 234, -927, -335, 1690, 962, -1445, -574, 1527, 521, -1021, 294, 2018, 223, -441, 1477, 2420, 247, 241, 1565, 1430, 569, 412, 1011, 12, 143, 1558, 969, -691, -278, 1192, 714, -77, 775, 708, -330, -196]
1245a96R28k4n40j77m76j64J073j34j833j4K496j46k573M71J735l20j816J522
1263a88R84k337j54K049J12j661N20J451k033n70L022J93l113k45L037P8k737
1280a592O18K118j338q33J713J57j888j03K569m86j415R19R2j477R96J885r79
1297I56k096J151J797j084l35J018q03j055J133J883j528j303J403L33j512J496
1313A454J255k701q92L022J178l029q96K460Pk018J450J365k495j296L027J380
1329C271l389K96J681j348p00K353J026m197r73M139O18l531l61K113q45j189
1345a036J761N19k446J30J781O7j503K06L16j809Q48K413j689k802J003K668j119
1362f92j191R57n64j001J959J573k704j603K348L98k293O92K124k591k039L634
$$ y = [-196, 732, 708, 168, -9, -485, -649, 424, 290, -1543, -1557, 939, 793, -1780, -1309, 426, 106, -1710, -188, 796, -1541, -1695, 354, 466, -1195, -675, 776, -1257, -1827, 1195, 1388, -1725, -1970, 1067, 1145, -1592, -974, 1144, -194, -1027, 686, 843, -1045, -1148, 1421, 935, -480, 439, 531, -946, 50, 1935, 956, -1140, 11, 1808, 724, 389, 1407, 604, -451, 682, 2565, 1037, -266, 1137, 1470, -42, 1454, 2709, 8, -884, 2138, 3316, 287, -609, 1851, 1858, -160, 1290, 2655, 160, -1136, 1891, 3271, -118, 178, 1859, 511, -189, 2164, 3190, -1007, -1980, 2159, 2777, -754, -1115, 998, 153, -1036, 725, 1244, -1202, -1072, 709, 776, -727, -521, -205, -2014, -1166, 1247, -442, -3244, -2241, 427, -692, -1883, -926, -1490, -2491, -532, 1041, -1663, -3266, -918, -520, -2813, -2121, 3, -2588, -4627, -993]
1378i93K090l777j923L462Q08k144R09J439k538j070L567J134l629j063L070p02
1394a360k219K318J740l567q44M283J658l737q53K701M8j083J369j3k339N06K487
1411A095l55k139O59J283j201N52K294n73k747J364K256o81j220P94r4j206J619
1428A700J492k686j192K998J214k756J52K611j228k218K820J825l341j685K995
1443B701Q20k214J5J290j864r51L424J017m126j017M330J60l133Q00J287j923
1459F16r46K989Q30l506j013K653M13j283O15m91k190P90L143o36k901m3J954
1476I94p38j32P66p03k108J145K036r39j624N15N59r13J207J289k783j418K959
1493A12J323k418o82J876p51j805J796J866k667j517K402J243k031J59J471j351
$$ y = [-993, 1097, -2680, -4603, -1141, -333, -2477, -1568, -129, -2667, -3737, -170, 964, -2665, -3728, -658, -1360, -3579, -1261, 479, -3088, -3932, 351, 2009, -1728, -2581, 120, 168, -915, 454, 441, -1898, -1392, 1095, 740, -1399, -740, 543, -658, -106, 2188, 1615, -1132, 232, 2488, 1807, 587, 1381, 1287, 81, 1700, 3192, 506, -686, 2312, 3526, 770, 922, 3533, 2305, 87, 2907, 4732, 1391, -294, 2701, 3521, 1307, 1322, 2612, 748, -203, 3221, 4238, 112, -905, 3425, 3585, 452, 1252, 2539, 616, -330, 2659, 3489, -17, -1030, 1623, 2036, 753, 1368, 877, -1313, -523, 2620, 1984, -917, -960, 994, 256, 124, 890, 187, -1921, -776, 1260, 321, -1303, -788, -229, -1142, 65, 1354, -1429, -2847, 112, 1435, -983, -1665, 211, -540, -2345, -549, 1317, -1350, -2867, -465, 778, -1253, -1094, 377, -974]
1509i74j382K703J055l703q53L598M90k756J27J851q96j324J913R01k792j61K276
1526G3k53q90M28J59j105M35K059l83k927O65J785k62q42J180l86j130N23J325
1544D54o29r41O24L36q89Q45J773j914j836K261J614j985j325K060O41j616P13
1561A86J083j162j192J975P26j647j08J353q87n43J442J004k391j128K586R11
1577B208k050q6J420j24j082L66M67m26k24O95n80o01Q98N66j204Q2J426m29j663
1596c41Q68J333l38q40k43M84k39M17J72q47p45J019K38j271M44J141o68j315
1614g31J010J772j537j271R42N54o27k72M7k48l37Q19M69j543J8J385o36q70O32
1633d24J052r96j203J057P68q61p71L17N02P0N9l99l18J02P43J28k77Q7K62o89
$$ y = [-974, -2356, 347, 1402, -2301, -3154, 444, 934, -1822, -1695, 156, -740, -2064, -151, 750, -2042, -2203, 73, -180, -1070, -642, -483, -1588, -1153, 906, 523, -2404, -1739, 46, -216, -1058, 122, -264, -1394, -871, 454, -175, -1116, -492, -156, -1045, -200, 1573, -341, -2177, 84, 1698, -287, -1612, 448, 1089, -527, 186, 1269, 107, -1085, 890, 1616, -31, -139, 1214, 327, -216, 1226, 2230, -161, -1289, 1297, 2208, 158, 72, 1492, 1368, 286, 652, 1119, 693, 469, 1164, 584, -17, 881, 1447, 243, 325, 1751, 1322, -341, 527, 1860, 1522, 682, 439, 923, 684, 1101, 1273, 426, -319, 700, 938, -333, 111, 1252, 584, -731, 279, 2051, 514, -757, 185, 739, 112, -160, -113, -361, -698, 121, 590, -953, -935, 450, -186, -1056, -424, 628, -368, -1571, -514, 254, -607, -1378, -1061, -559, -489, -430, -829, -1147, -1045, -302, -174, -451, -364, -102, -791]
1653g91p6R75M67o32l67j92L15J93M3o5n44O94K56q44L06J136J41j497j82J223
1673E59Mq13J30P72j77q27M11N13l7j31j48P0n16N32M67p83l38J192j01j066j4
1694c01P10M84q48l70N64K45n56n73O07K40O3k90k32J42M35m12j18L91L57k35
1714C03o52j22M40j86L02j94m85O26k0q63L77Q80J70j015n92P05Q35p91j84P18
1734B52l40l35l3N09k41j86M75p28k20M06N28j9m24K28k6j10k71O69N15n07j012
1755h70N19N60k90m80K48M21k78p17K00J139M42r49l05J80N16k58k80R8pM5j90
1776b56k32K65M35L96n10l88K77O38k73m46N78N39p50r95J006L64l72n15R3O53
1796E07k42l5J14J27P2l40L32m07M67j46Mn78K47R20n62l75j29O34J49n56l8M48
$$ y = [-791, -867, 108, 575, -57, -424, -616, -301, -108, -65, -130, -674, 20, 276, -568, -262, 874, 1015, -482, -664, 559, 563, -250, -120, 652, 475, -352, 59, 572, 535, 404, 256, 326, -190, 342, 809, 26, -312, 880, 779, -287, -301, 409, 893, 45, -325, 239, 484, -72, -645, -38, 202, 265, -25, -257, -115, 320, -92, -210, 181, 538, 303, -349, -471, -31, -217, 85, -109, -594, 32, 12, -851, -474, 406, 576, -439, -1031, -326, 509, -282, -466, 252, -88, -423, -456, 53, -188, -374, 101, -627, -847, -441, 87, 68, -356, -128, -154, -264, -535, 134, 649, 142, -870, -351, 209, -81, -561, -313, 108, -170, -887, -687, 452, 894, -55, -360, -180, 336, 78, -202, -104, -111, -66, -256, -488, -223, 212, 608, 98, -290, -13, 625, 352, -94, 484, 1023, 273, -722, 284, 648, 276, -239, -146, 507, 265, 230, 344, 471, 543, 203, 535, 128, 595, 449, 453, -125, 122, 1042, 480, 105, -24, 610, 759, 203, 165, 613]
1818F13j20n80n2N43K21k61n00m5L02L00o13J4J40J14l9j87L7k8J90n07M0J42
1840b76M05j32p49L38Q61k37j421R3J286k07n74q5O61K2q29M42K2k9KK0k31m1
1862f59O79K0n49m41R79J31q37l67J135j9o24k37P87Q4l17k11L90q3K61J00p91
1883e69N54N83n80l91M21N65m18m23j1L45K80n74M40n98N25M16p11j45L63L62
1903D34o21m79J451M34j286m63Q42O87q69l15N13J18n20J76o2m12O31K83o28J8
1923f8QQ15r69r5J233l62j192P0O66J62l45j03p1k91M46K99m64j69P66K7o31l18
1945e86J003j56q52K52J025p86p84N98M46j73n22K68j26j96J386n3j895M2J892
1964G83k95p89j21L25q95p38J683L56q63o23P51J9j71P67l55q53N04J406r24j446
$$ y = [613, 493, -87, -139, 404, 625, 364, -136, -181, 121, 421, -192, -178, -38, 76, 37, -150, -113, -141, 49, -458, -418, -276, 129, -3, -752, -414, 447, 210, -1211, -1118, 168, -39, -613, -698, -37, -15, -844, -402, -380, -409, -407, -387, -618, -659, 20, 40, -509, -950, 29, 160, -677, -1044, 91, 72, -552, -789, -2, 82, -235, -446, -56, -139, 122, 222, -569, -15, 568, -12, -403, 18, 583, 165, -258, -269, 76, 356, -218, 222, -376, 149, 565, -146, -291, 72, 434, -187, -666, 785, 1219, -67, -530, 312, 999, 130, -185, 328, 446, -74, 102, 40, -372, 259, 542, -86, -68, -60, 755, -214, -309, 924, 562, -630, -560, 106, 268, -77, -180, -251, -542, -96, 203, -261, -430, 336, 363, -268, -586, 417, 261, -591, -339, 686, -100, -884, -286, 160, -13, -535, -267, -393, -589, 797, 744, -1151, -1109, 783, 488, -301, -422, -97, -992, -1730, -47, 309, -554, -1177, -426, -407, -578, 189, -166, -1019, -515, 891, -33, -1479]
1984a479P04J078n24o16P78o3j155M61J307j7p46k6k68R2N36J049j501r31J296
2003b5P89j042l74J279k71j367N42J270n52q11R86K79o71R3L22q79j67J359M18
2022A178j980l79K001M94j568N1J245n87r67J173Q78j444n8P51o4m78L67J01p53
2041c9M2J613l70j807M35J414L0r77L50J88p68O16Q03o94o29J45J64l94O85M00
2061A207j213r28J706J057j297j231J062K01o25M93N97j458n81J514O16j572K6
2078d26J308j221p32J527J033k389p23J931P00j908l37J238j52n32R16o3j334
2095a164k9J304j12j219N99O25j024k08J906k53k103L88J325J10o52l11r3l45
2113a256P13R75j062j137J322O10r67L35R17j306r68J554J368j627j050R87P16
$$ y = [-1479, -775, 303, -221, -837, -59, -122, -1277, -816, 491, 474, -272, -298, -566, -474, 62, 1111, -390, -1321, -25, 764, -278, -652, 627, 356, -1011, -469, 801, 249, -562, 424, 703, 32, 125, 447, -432, -599, 760, 1178, -802, -1181, 820, 1314, -254, -203, 1042, 455, -512, 661, 1539, 95, 37, 788, 724, 246, 613, 714, -39, 3, 1616, 1246, -561, -126, 1288, 1318, 341, 691, 879, 111, 727, 1530, 836, 207, 352, 516, 122, 807, 1207, -6, -934, 772, 1829, 532, -699, 363, 564, -61, 432, 1029, -429, -1010, 504, 1120, -452, -426, 882, -339, -1071, 456, 1489, -900, -1623, 308, 1008, -900, -1237, 1, -151, -683, 233, 170, -1164, -1193, 111, -1, -1220, -621, 4, -1020, -1228, 678, 425, -1678, -1290, 35, 145, -507, -818, -911, -1256, -543, 432, -630, -1767, -445, 165, -802, -467, 450, -856, -1824, -270, 1098, -529, -1579, -592, 124]
2130A24n99P39J0j513N4J808O06j874m38J535n25p70J299J163j935r00J828O33
2148A245j518k01Q77N5n33J051K64j801J06J934j33j620J4J218p01j99R80k17
2166H21j039j01J198p8o10K99J76n60O01P99j055r36P80J137j347m28R06n04n93
2185e34Q31J029j150q80J066L16m43J56K73j341l12J334R23k135m66J762l72r36
2203h79O26J042j319p65J626P40j688l09R14l84k82P82k18j454L73J673J31j746
2221a137J34R67l86m21Q20M80j316Q2P98J1j50K1l22j13L05Q21n86j467J402R89
2241I32p41o54R21k27m47K92M57n88o35P66O29p15O0K54p44m18J439O21j475l92
2261f65Q07P69j308J5N74n31j74N96K78r70k15J138n39m41O28J34j294J03J189
$$ y = [124, -475, 264, 274, -1239, -1185, 623, 1229, -645, -1083, 452, -73, -843, 456, 1619, -316, -1216, 612, 1245, -273, -474, 403, 458, -75, 976, 1240, -561, -455, 1479, 1346, -274, -260, 958, 257, 58, 1038, 821, -218, -319, 879, 801, 191, 490, 666, 106, 707, 1506, 451, -485, 295, 1432, 85, -343, 563, 59, -534, 297, 1326, 176, -704, 362, 678, 235, 391, 664, -677, -989, 345, 1268, -867, -1333, 429, 57, -879, -253, 789, -530, -1295, 331, 1071, -617, -926, -12, -396, -678, 104, -114, -1568, -1195, 478, 609, -1137, -1003, -36, -422, -843, -23, 457, -859, -777, 21, 32, -118, -97, -419, -532, -227, 594, 8, -1459, -57, 932, 191, -463, 458, 231, -216, 76, 533, -55, -690, 76, 705, -10, 50, 304, -440, -858, 581, 1202, -273, -665, 142, 911, -397, -382, 192, -339, -513, 83, 361, -609, -824, 314, -225, -666, -38, 96, -1198, -1095, 94]
2280I4k23r21k41J014J23l23j3l07k49L71K96k91j26L24n2l61J04J277j007q64
2300a375P80R46n76o77K63N57k23K15K9l78j75P11K8p47M61M48k59n75R17O18
2320I88o24r20O03P53k7r48O59R4P5J09j97l93M35L97j59o21O47K20j45j78K88
2341A056J83n95j48L50j05L41J14l66k61N03k46m74k18L75K4J16k62J55j3k93
2361B36O5L69m82m6L25l66l39M66q5j68l86N94J33n20j35N23L14j005J85Q64n93
2382e1l74M32K76l31j94q4P5N4J00O8k28j17M51q5k80m6L63j5l53j29M50N10n33
2405d1r9L23k3k06pj39M95k97k83R1P51l40R3k24Q5m9j7K19j78J21M9j89K41k95
2429H1mJ33k26k1K08K03l56k86R53j33m89k76J24L20k25m0K41j62j47q8j50L09
$$ y = [94, -129, -1050, -1291, -277, -154, -477, -490, -797, -1046, -675, -379, -670, -796, -472, -524, -885, -781, 496, -511, -1375, -595, 351, -225, -902, -639, -82, -305, -90, -61, -439, -614, 97, 125, -622, -161, 287, 28, -547, 370, 988, 364, -556, 47, 800, 773, -175, 484, 578, 653, 762, 565, 172, 607, 1004, 845, 224, 871, 1091, 946, 768, 1056, 1239, 644, 496, 846, 741, 1082, 1196, 830, 569, 1072, 826, 352, 134, 509, 533, 649, 387, 542, 529, 236, 301, 670, 188, 142, 467, 101, -238, 228, 143, -25, -411, 183, 316, -204, -339, 184, 498, -507, -322, 542, -51, -425, 7, 283, -48, -242, -326, -251, -197, -97, -29, -257, -374, 77, -8, -288, -334, 29, 14, -339, -468, -18, 492, -41, -140, 183, 160, -46, -53, -192, 303, 6, -277, -186, 565, 225, 318, 94, 179, 130, 113, 332, 154, 275, 324, 135, 376, 81, 77, 210, -16, -37, 171, 374, 18, -268, 685, 552, 63, -213, -89, 231, 6, -34, 207, 45, -102, -190, -340, -31]
2451c1k30j13J04j70J5K41j79m05K36L9k79j97K68J58j08n5l34N20Nk89L3K29
2473e42m4k31k35R2L58j47J9J67m8o3O0Q5P3K9J83l00l45M69J52k59q0K00M50
2496D3m5n99L24N72j56k48j22L45k43l43K92K41O0j15kr5M99qj77l08K11K39k92
2519G3J14M7n9J23p4P9k13J81j21m90L42O13K9o45K8N35J33l28j78K68l81J46
2541B22L88j82J12m60J95qp0J99K02l16o4N55Q0r19P9K73K5k43J55Q7k51k31M71
2564B99k9k50kM25l16k17M67Q0m77p0P72o95l9P6p0K04m08L04k5k21P4K19k52
2587a51K11J26k32m00N13K2j80j49K54J47j03p5J10J07l09M78j82k00j52P01n87
2608e1m7L94J24l07m25P62J02q03k26P88K56p66N82k00m21qP54m7n10rM84m31
$$ y = [-31, -261, -374, -270, -440, -425, -184, -363, -768, -532, -493, -772, -969, -701, -543, -651, -706, -1040, -520, -515, -804, -771, -542, -586, -817, -1052, -960, -602, -749, -730, -563, -611, -674, -614, -529, -456, -427, -244, -544, -889, -420, -268, -527, -607, -407, 43, -2, -601, -277, 295, 139, -109, -231, 114, -129, -472, -180, 61, 121, 6, 4, -91, 408, 400, 223, -85, 126, 365, 73, 187, 234, 175, 298, 224, 303, 90, 271, 150, -340, 2, 615, 644, -1, 27, 562, 695, 367, 189, 457, 76, 222, 610, 428, 540, 80, 275, 267, 197, 396, 598, 282, 218, 773, 853, -66, 13, 286, 311, 68, 223, 310, 59, -172, 299, 270, 20, 18, 443, 127, -90, 377, 457, -20, -90, 682, -13, -52, 24, -46, 158, -250, 54, 29, -192, -118, 101, -151, 60, 186, -46, -446, 67, 89, -91, -240, 14, 161, 58, -17, 93, 200, -109, 369, 187, -13, -165, 536, -51, -98, 296, 420, 113, -312, 450, 552, -251, -477, 311, 567, -199, 383, 183, -238, -246, 508, 461, -49, -58, 426, -5]
2630ek44P41k01p02K2Q24m43m30M09R0L4l23M00n91j66O46N9o12M3K20p7l42M49
2653a99K23l61o95J130rm34q2K17k87k64N90k2k79k95Q42J57p49J41L70j49n17
2674f72Q91L37j285L61L77L11k62q3K29m23K85N85k98m36n4Q24k24l22L19K31
2694F91p35K79Q07k04j016N20N63j99N1K44n64p37J317M46j167k66Q27J99p37
2713C19K25J011j045q08J061M37l82q85O14J66n78M92L09j213k43J355N76j533
2731a22k42J039n53l86P07p4q77l85J091k15j08l97J75l86K54R31m35j147L92
2750g38J045o50q41N08M62r29L43O17k46r92Q00L36k99k42N15l48q91R17Q91p03
2770d45j020R64Q59j396N00M50m49q88J119O81q09n69R02L60p93N69K84q76o55
$$ y = [-5, -249, 492, 291, -411, -389, 435, -8, -438, -29, 61, 95, -228, 172, -419, -585, 61, 120, -492, -449, -229, -306, -648, -199, 24, -337, -1032, 98, 89, -345, -427, -210, -497, -761, -171, -193, -472, -767, 75, 232, -517, -376, -6, -155, -672, 219, 556, -729, -368, 9, 320, 58, -25, 204, -219, 66, 651, 353, -83, -137, 687, 463, 141, 460, 691, -44, 235, 1042, 838, -178, 342, 905, 706, 757, 1001, 437, -300, 1017, 1463, 296, 30, 857, 1056, 319, 544, 1555, 510, -298, 763, 1200, 818, -67, 547, 713, 135, 627, 936, -277, -520, 835, 1411, -122, -364, 675, 122, -264, 443, 369, -508, -893, 198, -17, -125, -522, -347, -733, -479, 452, 17, -1130, -738, 307, -343, -1184, -676, -214, -1143, -800, -183, -429, -1421, -621, -285, -584, -826, -311, -659, -1550, -633, 258, -445, -1465, -501, 358, -1038, -538, -88, -537, -1425, -306, 375, -434, -1003, -101, 259, -534, 35, 319, -557, -1212]
2789a212J219O69j001n95Q70M5k87L23K70p81MQ38K51q67P5K58m48O9R18j08j515
2810a005N46R16j17r06N86K85m14K62M33n43p97O56P75m18m32O83k30r73R36J204
2830A447q79j144O26Q15n85k64P72n56o49P44R71j243n41R42M25q48L56M05o91
2849A03l64R73L67q05q01R52J12l25L45O4k16n81R09Qo39k48O50j66k74L20K62
2870F46r71K05R41j55o49j24O34k98j62O51o79m81O61L95l74p70Q27j38q69M75
$$ y = [-1212, 7, 676, -325, -920, -50, -5, -292, 31, 301, -480, -476, 362, 613, -254, -179, 79, -369, -300, 618, 510, -1005, -459, 457, 340, -566, 20, 305, -109, 153, 586, 43, -754, -98, 677, 259, -173, 510, 280, -693, 243, 1447, 568, -576, 50, 865, 280, 16, 788, 232, -417, 327, 1298, 55, -486, 456, 881, 33, 389, 794, 103, -261, 712, 1079, 274, -527, 425, 537, 212, 557, 621, 405, -176, 733, 741, 102, -146, 504, 338, 64, 384, 646, -325, -120, 821, 666, 17, -107, 527, 229, 67, 718, 39, -442, 219, 614, 240, -530, 297, 159, -710, -235]
$$ [...]
8191d8
##END NTUPLES=NMR FID
##END=
