##TITLE=1H_SA_PPh3vCl(water)
 CDCl3, 8 sc, 
 16.9.2019
##JCAMPDX= 6.0         $$ Bruker NMR JCAMP-DX V2.0
##DATA TYPE= NMR FID
##DATA CLASS= NTUPLES
##ORIGIN= UXNMR, Bruker Analytische Messtechnik GmbH
##OWNER= root
$$ XWIN-NMR		Version 3.5
$$ Mon Sep 16 14:30:44 2019 Russian Standard Time (UT+4h)  she@DPX200
##.OBSERVE FREQUENCY= 200.13155
##.OBSERVE NUCLEUS= ^1H
##.DELAY= (6, 6)
##.ACQUISITION MODE= SIMULTANEOUS
##.ACQUISITION SCHEME= undefined
##.AVERAGES= 8
##.DIGITISER RES= 18
##SPECTROMETER/DATA SYSTEM= spect
##.PULSE SEQUENCE= zg30
##.SOLVENT NAME= CDCl3
##.SHIFT REFERENCE= (INTERNAL, CDCl3, 0, 15.7039)
##AUDIT TRAIL= $$ (NUMBER, WHEN, WHO, WHERE, WHAT)
$$ ##TITLE= Audit trail, XWIN-NMR		Version 3.5
$$ ##JCAMPDX= 5.01
$$ ##ORIGIN= Bruker BioSpin GmbH
$$ ##OWNER= she
$$ F:/spectra/data/she/nmr/H-F/1/audita.txt
$$ ##AUDIT TRAIL=  $$ (NUMBER, WHEN, WHO, WHERE, WHAT)
(   1,<2019-09-16 14:29:41.04 +0400>,<she>,<DPX200>,
      <created by zg, POWCHK disabled, PULCHK disabled
       configuration hash MD5:
       00 E9 B6 7A A2 85 ED C7 34 08 36 98 17 FE 4E 26
       data hash MD5: 16K
       C0 A2 2A 38 13 D4 47 A3 B3 A3 0C 8A 45 80 7D B6>)
$$ ##END=
$$ 
$$ hash MD5
$$ A5 42 CE EC DF 71 E4 3D 33 2F AA E5 77 C3 1E 4F
##$RELAX= 
##$RELAX= 
##$RELAX= 
##$RELAX= 
##$RELAX= 
##$RELAX= 
$$ Bruker specific parameters
$$ --------------------------
##$DU= <F:/spectra>
##$EXPNO= 1
##$NAME= <H-F>
##$PROCNO= 1
##$TYPE= <nmr>
##$USER= <she>
##$AMP= (0..31)
100 100 100 100 100 100 100 100 100 100 100 100 100 100 100 100 100 100 
100 100 100 100 100 100 100 100 100 100 100 100 100 100 
##$AQSEQ= 0
##$AQ_mod= 1
##$AUNM= <au_zg>
##$AUTOPOS= <>
##$BF1= 200.13
##$BF2= 200.13
##$BF3= 200.13
##$BF4= 200.13
##$BF5= 200.13
##$BF6= 200.13
##$BF7= 200.13
##$BF8= 200.13
##$BYTORDA= 1
##$CFDGTYP= 0
##$CFRGTYP= 5
##$CHEMSTR= <none>
##$CNST= (0..31)
1 1 145 1 1 1 1 1 1 1 1 1 1 1 1 1 1 1 1 1 1 1 1 1 1 1 1 1 1 1 1 1 
##$CPDPRG= <>
##$CPDPRG1= <>
##$CPDPRG2= <>
##$CPDPRG3= <>
##$CPDPRG4= <mlev>
##$CPDPRG5= <mlev>
##$CPDPRG6= <mlev>
##$CPDPRG7= <mlev>
##$CPDPRG8= <mlev>
##$CPDPRGB= <>
##$CPDPRGT= <>
##$D= (0..31)
0 1.2 0 0 0 0 0 0 0 0 0 0.03 0 0 0 0 0 0 0 0 0 0 0 0 0 0 0 0 0 0 0 0 
##$DATE= 1568629780
##$DBL= (0..7)
120 120 120 120 120 120 120 120 
##$DBP= (0..7)
150 150 150 150 150 150 150 150 
##$DBP07= 0
##$DBPNAM0= <>
##$DBPNAM1= <>
##$DBPNAM2= <>
##$DBPNAM3= <>
##$DBPNAM4= <>
##$DBPNAM5= <>
##$DBPNAM6= <>
##$DBPNAM7= <>
##$DBPOAL= (0..7)
0.5 0.5 0.5 0.5 0.5 0.5 0.5 0.5 
##$DBPOFFS= (0..7)
0 0 0 0 0 0 0 0 
##$DE= 6
##$DECBNUC= <off>
##$DECIM= 24
##$DECNUC= <off>
##$DECSTAT= 4
##$DIGMOD= 1
##$DIGTYP= 9
##$DL= (0..7)
0 120 120 120 120 120 120 120 
##$DP= (0..7)
150 150 150 150 150 150 150 150 
##$DP07= 0
##$DPNAME0= <>
##$DPNAME1= <>
##$DPNAME2= <>
##$DPNAME3= <>
##$DPNAME4= <>
##$DPNAME5= <>
##$DPNAME6= <>
##$DPNAME7= <>
##$DPOAL= (0..7)
0.5 0.5 0.5 0.5 0.5 0.5 0.5 0.5 
##$DPOFFS= (0..7)
0 0 0 0 0 0 0 0 
##$DQDMODE= 0
##$DR= 18
##$DS= 0
##$DSLIST= <SSSSSSSSSSSSSSS>
$$ [...]
##$SUBNAM2= <"">
##$SUBNAM3= <"">
##$SUBNAM4= <"">
##$SUBNAM5= <"">
##$SUBNAM6= <"">
##$SUBNAM7= <"">
##$SUBNAM8= <"">
##$SUBNAM9= <"">
##$SW= 24.9336996594482
##$SWIBOX= (0..15)
0 0 2 0 0 0 0 0 0 0 0 0 0 0 0 0 
##$SW_h= 4990.01996007984
##$TD= 16384
##$TD0= 1
##$TE= 0
##$TE2= 300
##$TE3= 300
##$TEG= 300
##$TL= (0..7)
0 120 120 120 120 120 120 120 
##$TP= (0..7)
150 150 150 150 150 150 150 150 
##$TP07= 0
##$TPNAME0= <>
##$TPNAME1= <>
##$TPNAME2= <>
##$TPNAME3= <>
##$TPNAME4= <>
##$TPNAME5= <>
##$TPNAME6= <>
##$TPNAME7= <>
##$TPOAL= (0..7)
0.5 0.5 0.5 0.5 0.5 0.5 0.5 0.5 
##$TPOFFS= (0..7)
0 0 0 0 0 0 0 0 
##$TUNHIN= 0
##$TUNHOUT= 0
##$TUNXOUT= 0
##$USERA1= <user>
##$USERA2= <user>
##$USERA3= <user>
##$USERA4= <user>
##$USERA5= <user>
##$V9= 5
##$VALIST= <valist>
##$VCLIST= <CCCCCCCCCCCCCCC>
##$VD= 0
##$VDLIST= <DDDDDDDDDDDDDDD>
##$VPLIST= <PPPPPPPPPPPPPPP>
##$VTLIST= <TTTTTTTTTTTTTTT>
##$WBST= 1024
##$WBSW= 4
##$XGAIN= (0..3)
0 0 0 0 
##$XL= 0
##$YL= 0
##$YMAX_a= 323874
##$YMIN_a= -277936
##$ZGOPTNS= <>
##$ZL1= 120
##$ZL2= 120
##$ZL3= 120
##$ZL4= 120
##$ABSF1= 10
##$ABSF2= 0
##$ABSG= 5
##$ABSL= 3
##$ALPHA= 0
##$AQORDER= 0
##$ASSFAC= 0
##$ASSFACI= 0
##$ASSFACX= 0
##$ASSWID= 0
##$AUNMP= <proc_1d>
##$AZFE= 0.1
##$AZFW= 0.1
##$BCFW= 1
##$BC_mod= 2
##$BYTORDP= 1
##$COROFFS= 0
##$CY= 11.3945322036743
##$DATMOD= 1
##$DC= 2
##$DFILT= <>
##$DTYPP= 0
##$F1P= 20.1720416913024
##$F2P= 0.152960286110954
##$FCOR= 0.5
##$FTSIZE= 0
##$FT_mod= 4
##$GAMMA= 1
##$GB= 0.15
##$INTBC= 1
##$INTSCL= 1
##$ISEN= 128
##$LB= 0.24
##$LEV0= 0
##$LPBIN= 0
##$MAXI= 10000
##$MC2= 0
##$MEAN= 0
##$ME_mod= 0
##$MI= 1.114404
##$NCOEF= 0
##$NC_proc= 0
##$NLEV= 6
##$NOISF1= 3.799351
##$NOISF2= 2.8
##$NSP= 1
##$NTH_PI= 0
##$NZP= 0
##$OFFSET= 15.70392
##$PC= 1
##$PHC0= -9577.469
##$PHC1= 17.40096
##$PH_mod= 1
##$PKNL= yes
##$PPARMOD= 0
##$PSCAL= 0
##$PSIGN= 0
##$REVERSE= no
##$SF= 200.130013532006
##$SI= 16384
##$SIGF1= 3
##$SIGF2= 2
##$SINO= 400
##$SIOLD= 16384
##$SREGLST= <1H.CDCl3>
##$SSB= 0
##$STSI= 0
##$STSR= 0
##$SW_p= 3612.71676300578
##$SYMM= 0
##$S_DEV= 0
##$TDeff= 0
##$TDoff= 0
##$TI= <>
##$TILT= no
##$TM1= 0
##$TM2= 0
##$TOPLEV= 0
##$USERP1= <user>
##$USERP2= <user>
##$USERP3= <user>
##$USERP4= <user>
##$USERP5= <user>
##$WDW= 1
##$XDIM= 8192
##$YMAX_p= 0
##$YMIN_p= 0
$$ End of Bruker specific parameters
$$ ---------------------------------
##NTUPLES= NMR FID
##VAR_NAME=  TIME,          FID/REAL,        FID/IMAG
##SYMBOL=    X,             R,               I
##VAR_TYPE=  INDEPENDENT,   DEPENDENT,       DEPENDENT
##VAR_FORM=  AFFN,          ASDF,            ASDF
##VAR_DIM=   8192,          8192,            8192
##UNITS=     SECONDS,       ARBITRARY UNITS, ARBITRARY UNITS
##FACTOR=    0.0002004,     1,               1
##FIRST=     0,             0,               0
##LAST=      1.6414764,     0,               0
##MIN=       0,             -277936,         0
##MAX=       1.6414764,     323874,          0
$$ Real data points
##PAGE= N=1
##DATA TABLE= (X++(R..R)), XYDATA
0@%%%%%%Qj6J6k4L2m0N4o2P2q8J10j34J59j84K15k54K94l39L90m47N12n84O61
$$ 0 0 0 0 0 0 0 8 -8 8 -16 16 -24 30 -32 40 -48 62 -72 87 -97 118 -136 158 -181 209 -238 274 -310 351
29C51p49Q45r50J067j194J337j492J658j844K046k268K515k787L086l415L783
$$ 351 -398 447 -503 564 -630 707 -785 873 -971 1075 -1193 1322 -1465 1621 -1794 1989
45A989m193M656n181N779o472P284q250R424j0887J2768j5293J8885k4447L4327
$$ 1989 -2204 2452 -2729 3050 -3422 3862 -4388 5036 -5851 6917 -8376 10509 -13938 20389
59B0389n7262K09627J51120j63402O5811K5861K6763M361K5511o8487m8081J2545
$$ 20389 -36873 172754 323874 160472 226283 252144 278907 283268 308779 240292 192211 204756
71B04756M5974o566J0431J1878j9505m7559j913L071n596J2468L3943k7303o2655
$$ 204756 250730 244164 254595 266473 246968 199409 197496 200567 194971 207439 241382 214079 151424
84A51424j4102M1780K4484M585o804k4239k2019J9761J7447k3350j7937J9055
$$ 151424 137322 179102 203586 208171 201367 177128 155109 174870 192317 168967 151030 170085
96A70085r96k7501O075K1413k8676k9765L8775L9773l4585m0551J6269J6898j7038
$$ 170085 169089 141588 147663 169076 140400 110635 149410 189183 154598 114047 130316 147214 130176
109A30176k357J1065j9208j9701J9335Q312l2242q990L1031L909k6019J529J0101
$$ 130176 127819 138884 119676 99975 119310 127622 95380 86390 117421 121330 95311 96840 106941
122A06941k3486j4899K7835J3316k9718k1548M549J713n43N299j2449j9762J5273
$$ 106941 83455 68556 96391 109707 79989 58441 62990 64703 64160 69459 57010 37248 52521
135E2521K0751k7205l3163J7389K2735j7959j0488J6174j3155l7560R538L9820
$$ 52521 73272 46067 12904 30293 53028 35069 24581 40755 27600 -9960 -422 39398
147C9398j308k9454m542L952q457P474J8203j1585j8176J5263J1847k7145j4462
$$ 39398 38090 8636 4094 8046 -411 7063 25266 13681 -4495 10768 22615 -4530 -18992
160a8992K8402J8171j7722j0814N401q132j0227J4745J5963o779j4690r544n348
$$ -18992 9410 27581 9859 -955 4446 -3686 -13913 832 16795 10016 -4674 -14218 -19566
173a9566R511K0129o646k6866K037K2659q813k6550P865K2241q320j4615P198
$$ -19566 -10055 10074 3428 -23438 -21401 1258 -7555 -34105 -26240 -3999 -12319 -26934 -19736
186a9736N16j6681M036K2442j574j7294N17L722r484N736K1122p929k6559O729
$$ -19736 -19220 -35901 -31865 -9423 -10997 -28291 -27774 -24052 -33536 -27800 -6678 -14607 -41166 -34437
200c4437K5231p106k1633P232J8872m712j0907K231J334k611O467M845m961k412
$$ -34437 -9206 -16312 -37945 -30713 -11841 -16553 -27460 -25229 -23895 -26506 -20039 -15194 -20155 -22567
214b2567K221n383P30J6977L527k2641j0422K2430J4271j3401j0557M954J673
$$ -22567 -20346 -25729 -24999 -8022 -4495 -27136 -37558 -15128 -857 -14258 -24815 -19861 -18188
227a8188Q44J0123J969j1386j377Q333l252n270J2526N354k0588r574J9108Q097
$$ -18188 -17344 -7221 -5252 -16638 -18015 -9682 -12934 -18204 -5678 -324 -20912 -30486 -11378 -3281
241c281j6982k828J7278K694j6911m560J1629O491j157m615q105m863O370N318
$$ -3281 -20263 -23091 -5813 -3119 -20030 -24590 -12961 -6470 -7627 -12242 -20347 -25210 -18840 -13522
255a3522l992K97O276n518j0848R203J8437j995j5199j386Q037N10k878k97j742
$$ -13522 -17514 -17217 -10941 -16459 -27307 -18104 333 -1662 -16861 -18247 -10210 -9700 -12578 -12875 -14617
270a4617j084L339l30n503O432J2046m435j2599N675J4328m039j2776K365O943
$$ -14617 -15701 -12362 -12692 -18195 -11763 283 -4152 -16751 -11076 3252 -787 -13563 -11198 -4255
284d255p025p837O448Q727k419o315l125L422R796O511p676j0653L137O418n384
$$ -4255 -11280 -19117 -12669 -3942 -6361 -12676 -15801 -12379 -2583 3928 -3748 -14401 -11264 -4846 -10230
299a0230o077O239L325r779p528P283R297L82l698j719P80J617j57l720K67O218
$$ -10230 -16307 -10068 -6743 -16522 -24050 -16767 -7470 -7088 -10786 -12505 -11725 -10108 -10265 -13985 -13718 -7500
315g500k177j1961l160J2314P432q210n454P074N185n156k714N583M506m260p180
$$ -7500 -9677 -21638 -24798 -12484 -5052 -13262 -18716 -11642 -6457 -11613 -14327 -8744 -4238 -8498 -15678
330a5678j462M714N234m110o750K210P500p45p558R67Q402N85q261l682O072M075
$$ -15678 -17140 -12426 -7192 -11302 -18052 -15842 -8342 -9087 -16645 -15678 -7276 -6691 -14952 -18634 -12562 -8487
346h487m523m910J438M728J126m659k496N342M549m967n812M334P434l488q101
$$ -8487 -13010 -17920 -16482 -11754 -10628 -15287 -17783 -12441 -7892 -12859 -18671 -14337 -6903 -10391 -18492
361a8492J918Q565n29p141j949N243L480m424n183J221M122j035n672q70N579
$$ -18492 -16574 -8009 -8538 -15679 -17628 -12385 -8905 -13329 -18512 -17291 -13169 -14204 -19876 -20746 -15167
376a5167K383n689m674M919O991k844p993K94O141J121o184k682N048M168l165
$$ -15167 -12784 -18473 -23147 -18228 -11237 -14081 -22074 -21780 -15639 -14518 -20702 -23384 -18336 -14168 -17333
391a7333m463M487P440j38o019K62O068J607n671l921M348M602l798o200J113
$$ -17333 -21796 -17309 -9869 -10007 -16026 -15764 -9696 -8089 -13760 -17681 -13333 -8731 -12529 -18729 -17616
406a7616O784J398m878j915N121K838m220n351K449M985k859q045q49O450J601
$$ -17616 -10832 -9434 -14312 -16227 -11106 -8268 -12488 -17839 -15390 -10405 -13264 -21309 -22158 -15708 -14107
421a4107n754k920N478N121k637m846K072N759q70o070j515N304J730n952m126
$$ -14107 -19861 -22781 -17303 -12182 -14819 -19665 -17593 -11834 -12704 -18774 -20289 -14985 -13255 -19207 -23333
436b3333M320O514j805o352L45P080K054n350l180M172L244m397n308K200O054
$$ -23333 -19013 -12499 -14304 -20656 -20311 -13231 -11177 -16527 -19707 -15535 -12291 -16688 -21996 -19796 -13742
451a3742r32n956j166O802L827m799l630M806O190k675n749Q48O266J072n359
$$ -13742 -14674 -20630 -21796 -14994 -11167 -15966 -19596 -14790 -8600 -11275 -17024 -16176 -9910 -8838 -14197
466a4197k200M748L882k929m080K610N695p60o274o74O220J882o567l619N083
$$ -14197 -16397 -11649 -7767 -10696 -14776 -12166 -6471 -7231 -13505 -14179 -7959 -6077 -12644 -16263 -11180
481a1180M047m533m858J907M838r94m201j621L675L540k401m793J753P021K06
$$ -11180 -7133 -11666 -16524 -14617 -9779 -10773 -14974 -16595 -12920 -9380 -11781 -16574 -14821 -7800 -7594
496g594o272o01P360K349o610k192O955L535m916l480L812N130o5m150j535M350
$$ -7594 -13866 -14467 -7107 -4758 -11368 -13560 -6605 -3070 -7986 -11466 -7654 -2524 -2589 -6739 -8274 -3924
512c924L927k506m614K048N329j481o388J148N770o55n639L22N077J810l011k018
$$ -3924 3 -2503 -7117 -5069 260 -1221 -7609 -6461 -691 -1346 -6985 -6663 -1586 224 -2787 -4805
528d805J104M007K104n076m259N638P080n018p977M625Q610l599o883M331O879
$$ -4805 -3701 306 2410 -2666 -6925 -1287 5793 775 -7202 -2577 6033 2434 -4449 -118 6761
543F761l298n923K951M303o29k832j614O24L288J641n049l796O126N777o206o292
$$ 6761 3463 -2460 491 4794 4165 1333 -281 343 3631 5272 223 -3573 2553 8330 2124 -4168
559d168N571O443l797m923L086L596j309k151J328K202J978j096m461J011P772
$$ -4168 1403 7846 4049 -874 2212 5808 4499 2348 3676 5878 7856 6760 2299 3310 11082
574A1082L68r720j580J1110K848j0031k954Q983K635o323j83L197j847k452J984
$$ 11082 11450 1730 150 11260 14108 4077 1123 10106 12741 6418 6235 9432 7585 5133 7117
589G117q27k749J358K29n350P35Q656o37j0832K76J1801J002j0426k517N842J291
$$ 7117 6290 3541 4899 5128 -222 513 9169 8532 -2300 -2024 9777 10779 353 -2164 3678 4969
605D969l126j237j069m12L374J296l836K093O074l236o730O584Q557q240j1379
$$ 4969 1843 606 -463 -875 2499 3795 -41 2052 8126 4890 -1840 4744 13301 5061 -6318
620f318O530R235n286p725L269L497n85K235R75m823P36P449p90q329J169N979
$$ -6318 212 9447 4161 -3564 -295 3202 2617 4852 5827 1004 1740 9189 8399 70 1239 7218
636G218n953p247P157O793r663p145R117Q188m316n591J214J907K289J134o822
$$ 7218 1265 -5982 1175 7968 -1695 -8840 277 8465 4149 -1442 -228 1679 3968 5102 -1720
651a720n676N787N237q115m789Q038K241p893J362J1227j898j1161J882R244j495
$$ -1720 -7396 -1609 3628 -4487 -9276 -1238 1003 -6890 -5528 5699 3801 -7360 -5478 3766 2271
666B271n201k30k384k328P720N200j1026n712J2846P216j0783l319J0951J4j0270
$$ 2271 -2930 -3160 -5544 -7872 -152 5048 -5978 -11690 1156 8372 -2411 -5730 5221 5235 -5035
681e035K999R364o037r561M553O542j814j954k77k885K344J0272k133j3191N14
$$ -5035 -2036 7328 1291 -8270 -3717 2825 1011 -943 -1220 -4105 -1761 8511 6378 -6813 -6299
696f299J2814j074r867R24N533n466k537P718R18q461L76O426j024j397M784m442
$$ -6299 6515 5441 -4426 -3502 2031 -3435 -5972 1746 2664 -5797 -5421 1005 -19 -1416 3368 -1074
712a074j0209P975J3308q846j5468Q217J3175o719r016P054M313o626K58P188
$$ -1074 -11283 -3308 10000 1154 -14314 -6097 7078 359 -8657 -1603 2710 -3916 -3658 3530
726C530k431n550L514K973l530J774L674p341m177J2552P312j3970q264J2109
$$ 3530 1099 -4451 -937 2036 -1494 280 3954 -3387 -7564 4988 12300 -1670 -9934 2175
740B175P122p245k808M079l515j660P247O85q640K78O313m313l930R243J113j4306
$$ 2175 9297 2052 -756 3323 -192 -1852 5395 6080 -2560 -2282 4031 -282 -4212 5031 6144 -8162
756h162j406J6762Q31j7464j785J4207L82r240J230L410m732J499P563m234q377
$$ -8162 -9568 7194 8025 -9439 -11224 2983 3365 -5875 -4645 -1235 -5967 -4468 3095 -1139 -9516
771i516N089N844n162j087P859l816j1011O109J3437n802j1367K806P318m71r69
$$ -9516 -4427 1417 -3745 -4832 3027 -789 -11800 -5691 7746 1944 -9423 -6617 701 230 -739
786g39Q33n703j374R081J632j0347r09R934k435r116O057P804r834o827J2081
$$ -739 94 -5609 -6983 2098 3730 -6617 -7526 2408 -27 -9143 -3086 4718 -5116 -11943 138
801A38P196j1121o766Q070L108l063J602j537q252K437J1406k927j1814L140R142
$$ 138 7334 -3787 -10553 -2483 625 -2438 -836 -2373 -10625 -8188 3218 291 -11523 -8383 759
816G59m645o108P803L373j0666k786R910J633q908k061L346L06J591K028o246
$$ 759 -3886 -9994 -2191 1182 -9484 -12270 -2360 -727 -9635 -11696 -8350 -8044 -6453 -4425 -10671
831a0671m815J0297P876j0245o849R303L860q456j52Q187l406r088N048Q036l328
$$ -10671 -15486 -5189 2687 -7558 -14407 -5104 -1244 -9700 -9852 -1665 -5071 -14159 -9111 -1075 -4403
846d403m190K987P56j053N097J661r491l266J2301J982j2975l725R671J279o681
$$ -4403 -8593 -5606 -4850 -5903 -806 855 -8636 -11902 399 2381 -10594 -14319 -4648 -3369 -10050
861a0050K504M147m757k940N314K813l270j223j027l790K091O765l877r820L684
$$ -10050 -7546 -3399 -8156 -11096 -5782 -2969 -6239 -7462 -8489 -12279 -10188 -3423 -7300 -17120 -13436
876a3436J0191k742q635M917O964l152l265L498q15l931K945L174m372k103L945
$$ -13436 -3245 -5987 -14622 -9705 -2741 -5893 -9158 -5660 -6475 -10406 -7461 -4287 -8659 -10762 -6817
891f817j137m387O605P102p834q486Q200R543o507p588M041L930l619j237K772
$$ -6817 -7954 -12341 -5736 1366 -6468 -14954 -6754 2789 -3718 -11306 -7265 -3335 -6954 -8191 -5419
906e419j331r20L338j38k609K723L553m823k343P840J651r065k809Q407K793o444
$$ -5419 -6750 -7670 -4332 -4470 -7079 -4356 -803 -5626 -7969 -129 1522 -7543 -10352 -1945 848 -5596
922e596k582L840J468l53O99k110j784M070K041m962k626N518N11o662J232P305
$$ -5596 -8178 -4338 -2870 -3223 -2524 -4634 -6418 -2348 -307 -5269 -7895 -2377 -1866 -8528 -7296 9
938Ij680q597J615Q098P52n118q90J408M10K370R59l779j21M342J7m608J674O672
$$ 9 -1671 -10268 -8653 -555 197 -4921 -5811 -4403 -3993 -1623 -664 -4443 -4564 -222 -205 -4813 -3139 3533
956C533j895n921J910N135j408l970K241M021j193k478n89L16L378K980l120n456
$$ 3533 1638 -4283 -2373 2762 1354 -2616 -375 3646 2453 -25 -614 -298 3080 6060 2940 -2516
972b516J815O190j536m825K834L697m293l564M478M621k678l428M89J493J012
$$ -2516 -701 5489 3953 -872 1962 5659 1366 -2198 2280 6901 4223 795 1284 2777 3789
987C789q8j510q73K472J379m191k279N080L939m973l677L494L304k480k268K378
$$ 3789 3701 2191 1318 3790 5169 978 -1301 3779 7718 2745 -932 2562 5866 3386 1118 3496
1003C496J263j637j791j4J897K336j128l639K88N320R39m697o78N203R37m554
$$ 3496 4759 3122 1331 1317 3214 5550 4422 783 1071 6391 7330 2633 1955 7158 8095 3541
1019C541j285L704K420k762j256J165J703J26j333p25J856K174j266l666J217
$$ 3541 2256 5960 8380 5618 4362 5527 7230 7356 6023 5298 7154 9328 8062 4396 5613
1034E613M420n86m971K4M431M03m190j450L462J703j803k633Q00K441M7k493j236
$$ 5613 10033 9447 4476 4500 8931 9334 5144 3694 7156 8859 7056 4423 5223 7664 7711 5218 3982
1051C982K236K243k918k788K033L728j910l579K96L522P3k790p80K092K010j700
$$ 3982 6218 8461 5543 2755 4788 8516 6606 3027 3323 6845 6918 4128 3348 5440 7450 5750
1067E750k426N32L799M62l312j664L311K077k942k429K635L091j951l013J326
$$ 5750 3324 3856 7655 8117 4805 3141 6452 8529 5587 3158 5793 8884 6933 3920 5246
1082E246L823l5k950r67K887J574j745k657Q16K463j77l110o02L185J357l357
$$ 5246 9069 9034 6084 5117 8004 9578 7833 5176 5992 8455 8278 5168 4566 7751 9108 5751
1098E751j546K767K401k436l149P69K801N6l115j440K015J427k017k308J621L054
$$ 5751 4205 6972 9373 6937 3788 4557 7358 7414 4299 2859 4874 6301 4284 1976 3597 6651
1114F651j060l133j72L126J168l083j908K090J917j956k467J173L227p8l186r80
$$ 6651 5591 2458 2286 5412 6580 3497 1589 3679 5596 3640 1173 2346 5573 5495 2309 1329
1130A329K689K299j899k380J533K287j513k138Q00K976n6l066j729L096K687j616
$$ 1329 4018 6317 4418 2038 3571 5858 4345 2207 3007 5983 5927 2861 1132 4228 6915 5299
1146E299k431M15K626q4k668o13L033J156l221k204K310K855j549l307L43K900
$$ 5299 2868 3283 5909 5825 3157 2544 5577 6733 3512 1308 3618 6473 4924 1617 1960 4860
1162D860k50k907j099K383R71k123k082J010K740l38k852r55K541J083k302k155
$$ 4860 4610 1703 604 2987 3958 1835 -247 763 3503 3165 313 -642 1899 2982 680 -1475
1178a475J832J989j522k183R74K614N69k297j242K531K303j248k917R22K920j017
$$ -1475 357 2346 824 -1359 -385 2229 2798 501 -741 1790 4093 2845 -72 850 3770 2753
1194B753l317O21L666J44l400p26K974J938j536j871N12K105o28k254j031J693
$$ 2753 -564 57 3723 3867 467 -259 2715 4653 3117 1246 1758 3863 3235 981 -50 1643
1210A643J845k156k937J387L864n32l174K02K860K37k909m48K150J044k545k298
$$ 1643 3488 1332 -1605 -218 3646 3114 -60 142 3002 3239 330 -118 2032 3076 531 -1767
1226a767N73L147K52k803j851L208K264k553k345K529K895k924l145J501K405
$$ -1767 -1194 1953 2205 -598 -2449 759 3023 470 -1875 654 3549 625 -2520 -1019 1386
1241A386j244j688L29R64J195l59j506M40K833Q64l537j298L561K171l210k767
$$ 1386 142 -1546 -1217 -253 942 583 -923 -483 2350 3214 -323 -1621 1940 4111 901 -1866
1257a866K631K839k057k305J747K292n57j716K42P46J640j046k627M51L273r96
$$ -1866 765 3604 1547 -758 989 3281 2724 1008 1250 1996 3636 2590 -37 414 3687 2691
1273B691m291J30M352M47m395q65L146Q49j517q84J03L32J72N8j778l43K879j89
$$ 2691 -1600 -1470 2882 3329 -1066 -1931 1215 2064 547 -337 -234 98 270 328 -1450 -1793 1086 897
1291H97l887J067M711j393m579Q59M974L1m598j76L211Q65j280p00l81P99J631
$$ 897 -2990 -1923 2788 1395 -3184 -2325 2649 2680 -1918 -2094 1117 1982 702 2 -379 420 2051
1308B051q54k080J897K588k611k677L147L001l079l677L221L346j827k657R85
$$ 2051 1197 -883 1014 3602 991 -1686 1461 4462 1383 -2294 927 4273 2446 -211 774
1323G74M76P58Q39j111k805K062L461k859l589L296L432m513k948M792K102m729
$$ 774 1250 2008 2847 1736 -1069 993 4454 1595 -1994 1302 4734 221 -2727 2065 4167 -562
1339e62k439M026K177k956j651j27P50K136R4k686k034L234K092l378j652L500
$$ -562 -3001 1025 3202 246 -1405 -1532 -782 1354 1448 -1238 -3272 -38 2054 -1324 -2976 524
1355E24R43l855Q1M224o43l203J086J919m08L0J01k032K3M818k67o026k60P147
$$ 524 1467 -2388 -2307 1917 1274 -1929 -843 1076 668 698 799 -1233 -1210 3608 3341 -2685 -2945 4202
1373D202Q01n717l56M697j149m091K330L357l009l331K277K434j112j88n80k654
$$ 4202 5003 -714 -1070 3627 2478 -1613 717 4074 1065 -2266 11 2445 1333 1145 565 -2089
1389b089J198M754j488n957J084N511j112m658N65K938j861r33J339R7j252L88
$$ -2089 -891 3863 2375 -3582 -2498 3013 1901 -2757 -2192 746 -1115 -2048 -709 -612 -1864 -1476
1405a476J073j173J253J764l598l209M865M281n476n010N123M789m108k959L277
$$ -1476 -403 -1576 -323 1441 -2157 -5366 -501 3780 -1696 -6706 -1583 3206 -902 -3861 -584
1420e84N75j981J764K013k649j578K428jk088J921J629m098j590N973K421o248
$$ -584 -9 -1990 -226 1787 -862 -2440 -12 -13 -2101 -180 1449 -2649 -4239 1734 4155 -2093
1436b093k856O081K640l838j544J167l82m8J934j918k852K013K399k924p51M555
$$ -2093 -4949 1132 3772 -66 -1610 -443 -825 -873 1061 -857 -3709 -1696 703 -2221 -2972 1583
1452A583j056n635J987O599j805o916R2N059k96k798P30m62j215L038K091l606
$$ 1583 527 -5108 -3121 3478 1673 -5243 -5151 -92 -388 -3186 -2456 -2918 -4133 -1095 996 -2610
1468b610k007L863J492m016O97L634k422m360L180N011l212m683K133L881o63
$$ -2610 -4617 -754 738 -3278 -2581 1053 -1369 -5729 -2549 2462 -750 -5433 -3300 581 -82
1483h2J5q68k027J565M108j685m812J342M327k188l354L580K249m352j795N693
$$ -82 -67 -935 -2962 -1397 2711 1026 -3786 -2444 1883 -305 -3659 -79 2170 -2182 -3977 1716
1499A716J140m358j421K760M71q84J530k275l545L098M955l944n128L752M088
$$ 1716 2856 -1502 -2923 -163 308 -576 954 -1321 -4866 -1768 3187 -757 -5885 -2133 1955
1514A955l222k619L649P21l954J29M197o03l216k49J677L56J337K51l648n03N275
$$ 1955 -1267 -3886 -237 484 -3470 -3341 856 253 -2963 -3212 -1535 -1179 158 409 -3239 -3742 1533
1531A533J482n119j900M652J346l376L93K472j282k016K257J635k094j64R58j532
$$ 1533 3015 -2104 -4004 648 1994 -1382 -989 1483 201 -1815 442 2077 -17 -181 777 -755
1547g55M79L782j577n267J386O409p97o089L02M740j38l414J505R71j934K49J627
$$ -755 -276 3506 1929 -3338 -1952 4457 3660 -2429 -2127 2613 2475 -939 566 1537 -397 -148 1479
1564A479n38j386J168J7k160J823L002l167l797L187M769l396l909J785K757j061
$$ 1479 941 -445 723 740 -1420 403 3405 238 -3559 -372 4397 1001 -2908 -1123 1634 573
1580E73o12O45j094n59K048N58k125Q17K046k268j719L705K527m833k379M976
$$ 573 -39 606 -488 -1047 1001 1559 -566 251 2297 29 -1690 2015 4542 -291 -2670 2306
1596B306K776l920k464K926J389m56n68m37j002J378J865j427j803J946R29l008
$$ 2306 5082 1162 -1302 1624 3013 2557 1989 1552 550 1928 3793 2366 563 2509 3438 430
1612D30RL816o8m593j45L827N46k702q89Q07P20Q58n63j956o86L616k63l157P3
$$ 430 439 4255 4187 -406 -551 3276 3822 1120 231 1038 1758 2616 2053 97 -589 3027 2764 -393 -320
1631c20L006m11l881J554L591j466l327J132L054k89j729m18L04R59R46n87k560
$$ -320 2686 2275 -1606 -52 3539 2073 -1254 -122 2932 2643 914 496 800 1759 2705 2118 -442
1648d42P25L171p84k850P24L211j445k248J432K352j540j648R36J259k00n44j005
$$ -442 283 3454 2670 -180 544 3755 2310 62 1494 3846 2306 658 1594 2853 2653 2109 1104
1665A104n55K089J329k237k307K770K552k560k518K146K098k031j602J242Q45
$$ 1104 549 2638 3967 1730 -577 2193 4745 2185 -333 1813 3911 1880 278 1520 2365
1680B365j280q88R30K96K77k94j768J88K358J126l374j499K935J672k953j711
$$ 2365 1085 197 1127 1423 1700 1406 -362 -174 2184 3310 -64 -1563 1372 3044 91 -1620
1696a620K679O59j559q41J134R42j28r24J00M61J299p00j950O99K459j09l171
$$ -1620 1059 1718 159 -682 452 1394 1266 342 442 903 2202 1502 -448 251 2710 2601 -570
1713e70J93K758M66k367m21J863O62j142o04K64P17l55o95q95J058J740j709j878
$$ -570 -377 2381 2847 480 59 1922 2584 1442 838 1102 1819 1464 769 -126 932 2672 963 -915
1731i15J231K240j002k991J126K033k36j810m86J180P56p66j066L52O89O63j696
$$ -915 316 2556 1554 -1437 -311 1722 1486 -324 -810 370 1126 360 -706 -354 335 998 -698
1748f98j129K096J160k031j405J672J676j248j890P04K343q67j356k68J452Q87
$$ -698 -1827 269 1429 -602 -2007 -335 1341 93 -1797 -1093 1250 383 -973 -1241 211 1098
1764A098r58j498M86J879p5j721n14K334N21j807j181J880J029r53j430Q74J089
$$ 1098 140 -1358 -872 1007 932 -789 -1303 1031 1552 -255 -1436 444 1473 520 -910 -36 1053
1781A053q8j448r61J754O69r87j417Q43J614k79j896l99J826O97k195q80J278
$$ 1053 965 -483 -1444 310 979 -8 -1425 -582 1032 753 -1143 -1542 284 981 -1214 -2094 -816
1798h16P94r21j201O36J122O7j614o41J478J315j281j446M18J619o16j743M86
$$ -816 -22 -943 -2144 -1508 -386 -319 -1933 -2574 -1096 219 -1062 -2508 -2090 -471 -1087 -2830 -2344
1815b344K168n42j505k00J621J143j143j062K30J845k58j603l85J520Q96j349
$$ -2344 -176 -718 -2223 -2423 -802 341 -802 -1864 -1634 211 -47 -1650 -2035 -515 381 -968
1831i68j531J524J639p88j538K31J824Q5j545o14J290R20j373j378O96J544m72
$$ -968 -2499 -975 664 -124 -1662 -1431 393 478 -1067 -1681 -391 529 -844 -2222 -1526 18 -454
1848d54k021j93K281J26j639q57J459J331j338j727N83J729n64j157m97J329N63
$$ -454 -2475 -2668 -387 -261 -1900 -2757 -1298 33 -1305 -3032 -2449 -720 -1284 -2441 -2938 -1609 -1046
1865a046j031r90O22J850m16j755j25J507O88j490q62J462J282j270r87N83J307
$$ -1046 -2077 -3067 -2445 -595 -1011 -2766 -2891 -1384 -696 -2186 -3048 -1586 -304 -1574 -2561 -1978 -671
1882f71M8j522j78J598P02j262j080R52J725o79j688K56J919j75j386n32J347
$$ -671 -623 -2145 -2323 -725 -23 -1285 -2365 -1413 312 -367 -2055 -1799 120 -55 -1441 -1973 -626
1899f26N48j144p92O49J040j67j427p00J449J129j419j394Q14J753r20j797L03
$$ -626 -78 -1222 -2014 -1365 -325 -492 -1919 -2619 -1170 -41 -1460 -2854 -2040 -287 -1207 -3004 -2701
1916b701J909l46j594M6R26R51q23j360O13J365q6j623j80J576Q59j614j374J541
$$ -2701 -792 -1138 -2732 -2686 -1760 -809 -1632 -2992 -2379 -1014 -1100 -2723 -2903 -1327 -468 -2082 -3456 -1915
1934a915J483r67j309J059J303l90n58o96R45Q86k50j422K59J722J23k094j46
$$ -1915 -432 -1399 -2708 -1649 -346 -736 -1294 -1990 -1045 -159 -409 -1831 -1572 150 273 -1821 -1967
1951a967K212N63k128r79J861Q67j367j007P02P96k7j035n98J096J056j094j524
$$ -1967 245 808 -1320 -2299 -438 429 -938 -1945 -1243 -447 -474 -1509 -2107 -1011 45 -1049 -2573
1968b573R60J337q60j570N73J785o71j492J34J457J88q65m31K05L95Q56q15j375
$$ -2573 -1613 -276 -1136 -2706 -2133 -348 -1019 -2511 -2377 -920 -732 -1597 -2028 -1823 -1428 -572 -1387 -2762
1986b762R67J774j086j800J571J935j134k279J654J884j003j733L44J531R0l97
$$ -2762 -1795 -21 -1107 -2907 -1336 599 -535 -2814 -1160 724 -279 -2012 -1668 -137 -47 -444
2002d44m64m2Q73P29r95r32J495J223j854p11J123J041j651o77J131P91p66p48
$$ -444 -908 -950 -77 652 -343 -1275 220 1443 -411 -1122 1 1042 -609 -1286 -155 636 -130 -878
2020h78k73M15J474j77k114l23K470N66k604j151K548M88k689j38K354K77j807
$$ -878 -1151 -736 738 561 -1553 -1876 594 1160 -1444 -2595 -47 441 -2248 -2386 -32 245 -1562
2037a562j23J275M87p73m03J13J91J098j60k007L08K760r2k716q2K621J72j861
$$ -1562 -1685 -410 77 -696 -1099 -986 -795 303 143 -1864 -1556 1204 1112 -1604 -1686 935 1107 -754
2055g54P60R46l33p49M66P78k97j06o49q93J631J927j290l092J793L135j595l037
$$ -754 6 952 619 -130 336 1114 817 711 62 -831 800 2727 1437 -1655 138 3273 1678 -1359
2073a359J343K320j300j434J142L68j615L96R56m82j95M48n91j028J704J547k755
$$ -1359 -16 2304 1004 -430 712 1080 -535 -139 817 335 140 588 -3 -1031 673 2220 -535
2090e35j887K566K011j848j939J165J393m22l29J95m31K22J020j075l46J637O08
$$ -535 -2422 144 2155 307 -1632 -467 926 504 175 370 -61 161 1181 106 -240 1397 2005
2107B005k642k77L385N93l652n85L385Q87k589n73J312K83n02Q61l80j366J276
$$ 2005 -637 -914 2471 3064 -588 -1173 2212 3099 510 -63 1249 1532 1030 1891 1511 145 1421
2124A421P45j399n49J934J83k381L96K815n70l552O80K853j95j976o94P86J48
$$ 1421 2166 767 218 2152 2335 -46 350 3165 2595 -957 -277 2576 2381 405 -289 497 645
2141F45O43k98j092m27K082n58k001R66J961j688j985K364J989k278k143J963
$$ 645 1288 990 -102 -529 1553 995 -1006 -40 1921 233 -1752 612 2601 323 -1820 143
2157A43J832j312m54K3p76O30J986m97k802J062K399p04k118J366J627j927j237
$$ 143 1975 663 209 232 -544 86 2072 1575 -1227 -165 2234 1530 -588 778 2405 478 -759
2174g59K519J183k559q89J676Q98o42l26p62p79K032J231k211k166K472J409k101
$$ -759 1760 2943 384 -505 1171 2069 1427 1101 339 -440 1592 2823 612 -1554 918 2327 226
2191B26r80K047Pk077M96J945r99j617Q46N78m35N02Rj875n01L233N13m050l42
$$ 226 -754 1293 1300 -777 -281 1664 665 -952 -106 472 37 539 548 -1327 -1828 1405 1918 -2132 -2474
2210b474L203J303k699m02J875k49j849J062J437n96j032J96L14M12J178r46k321
$$ -2474 729 2032 -667 -1069 806 557 -1292 -230 1207 611 -421 -225 89 501 1679 733 -1588
2227a588J397K881q29l210Q73K809p22j979Q45M73o51lJ034o60m18N26J72j022
$$ -1588 -191 2690 1861 -1349 -476 2333 1611 -368 477 950 299 296 1330 670 252 778 950 -72
2245g2Q92J766k583j907K481K344k611k255J537J806j089j066P28n6m45J080N56
$$ -72 820 2586 3 -1904 577 2921 310 -1945 -408 1398 309 -757 -29 -85 -530 550 1106
2262A106j675rJ034o07j234J978P05k743l99K677J049k406r04J938N29o26k07
$$ 1106 -569 -578 456 -151 -1385 593 1298 -1445 -1844 833 1882 -524 -1428 510 1039 413 206
2279B06k51j60J040P15j294p31J368Q61k115n0K408k66k702M59L008j10k807r8
$$ 206 -45 -205 835 1550 256 -475 893 1754 -361 -411 1997 1731 -971 -512 2496 2386 -421 -519
2297e19J563R2m26o9o24m45J859k96j532k31K088m37k050Q28J629j143j880J104
$$ -519 1044 1136 710 641 17 -428 1431 1135 -397 -628 1460 1023 -1027 -199 1430 287 -1593 -489
2315d89J784q20j265O4M04O33L03q75j183J138J433o96j908J080J519j079j343
$$ -489 1295 475 -790 -726 -322 311 614 -261 -1444 -306 1127 431 -1477 -397 1122 43 -1300
2332a300J211J398j596o00J357Q49r81m63pK13M43N80p28j288J947J141j550j450
$$ -1300 -89 1309 -287 -887 470 1319 338 -125 -132 81 524 1104 376 -912 1035 2176 626 -824
2350h24J377J092j578k50J019K04p29k54O09P9k36k86p46M50J072J74j820l52
$$ -824 553 1645 67 -183 836 1040 311 57 666 745 509 223 -523 -73 999 1173 -647 -999
2368i99J547Q71k217l35J358L17j308j10Q55km45l45J14K23M81m78q83O47J342
$$ -999 548 1419 -798 -1133 225 542 -766 -876 -21 -23 -468 -813 -699 -476 5 -473 -1356 -709 633
2387F33o7k005M90J916j82j495k03J323L62j027m3M23M35k31m39k73P38O73j077
$$ 633 566 -1439 -949 967 785 -710 -913 410 772 -255 -298 125 560 329 -110 -383 355 1028 -49
2406d9p98J207J135j068j234N92J566q26j234K71J114l53l73k05q1P62P3j222
$$ -49 -847 360 1495 427 -807 -215 1351 525 -709 -438 676 323 -50 -255 -336 426 499 -723
2424g23n63J273O37j260r42J544P22j477r81J210Q74m02j267L28L16O56k68p66
$$ -723 -1286 -13 624 -636 -1578 -34 688 -789 -1770 -560 314 -88 -1355 -1027 -711 -55 -323 -1089
2442a089K53R81j96j117K71J031K24j367k57J570M09j094n13N89Q70m57m91L0
$$ -1089 -836 145 -51 -1168 -897 134 358 -1009 -1266 304 713 -381 -894 -305 565 108 -383 -353
2460c53N90Q04j027o22M63J152l47j521L05J426J2j707k45J603J92j060o18P51
$$ -353 237 1041 14 -608 -145 1007 660 -861 -556 870 882 -825 -1070 533 725 -335 -953 -202
2478b02N99m4j200q3Q79O63r75j212J119J137q66j145L88J067l15q07l94J121
$$ -202 397 353 -847 -930 -51 612 -363 -1575 -456 681 -185 -1330 -942 125 -190 -997 -1391 -270
2496b70L80j018n86R05R23n35p76l81J313M43j300m04J031J186q63j055R99P05
$$ -270 110 -908 -1494 -589 334 -201 -977 -1358 -45 398 -902 -1306 -275 911 48 -1007 -8 697
2514F97j46q48j85Q52J58p93k18L93P16k06r90l1J176L67j421j70R59O73j085
$$ 697 551 -297 -482 370 528 -265 -483 -90 626 420 -570 -601 575 942 -479 -649 310 983 -102
2533a02o88L90J286n21j057j1R99M04j482l14P99P39o21j179L59J409r7j137n31
$$ -102 -790 -400 886 365 -692 -703 296 700 -782 -1096 -297 442 -179 -1358 -999 410 313 -824 -1355
2552a355J565K81r30p15P15R47m08r89J92J075K03o74p03P27J270p82j084L44
$$ -1355 210 491 -439 -1154 -439 508 100 -889 -697 378 581 -93 -796 -69 1201 419 -665 -321
2570c21J324l56p78k78J176N78j069n92M67J092j50j130N47N51J97r28l62P21
$$ -321 1003 647 -131 -409 767 1345 276 -316 151 1243 1093 -37 510 1061 1258 330 -32 689
2588F89R00r14j066N58P51k82j022J63R16L04q61n81M93P79n83o14o7R89J61j034
$$ 689 1589 675 -391 167 918 636 -386 -223 693 997 136 -445 48 827 244 -370 -437 552 713 -321
2608c21n86J070Q55o53j165O34R07j9j589Q03O49K36q19m24J066O19n24p21K07
$$ -321 -907 163 1018 365 -800 -166 741 722 -867 -64 585 821 2 -422 644 1263 739 18 225
2627B25J181r5j263J44J019K36q76m67Q15N36n96l26k86Q74N97r78p38P43Q28
$$ 225 1406 1311 48 192 1211 1447 571 104 919 1455 859 533 247 1121 1718 740 2 745 1573
2646A573m12j500N97R68k43j023K22Q48J67j101p80J207N72r43l40L7O78L16r34
$$ 1573 1161 -339 258 1226 983 -40 182 1030 1197 96 -684 523 1095 152 -188 -151 527 843 -91
2665i1k99P54P44r70p93J030M19J9j259M54P01J30l32j004O62J144k87r39m14
$$ -91 -390 364 1108 138 -655 375 794 813 -446 8 709 839 507 -497 165 1309 1022 83 -331
2684c31J205N04j075n19J540M69j394k47R71M26r34l11K11M69J7m62l79J85Q06
$$ -331 874 1378 303 -216 1324 1793 399 152 1123 1549 615 304 515 984 1001 539 160 345 1151
2703A151J69j164j98J044k06j037K05O89j58o88r1N89J97j71p49j46P00L29m52
$$ 1151 1320 156 -42 1002 796 -241 -36 653 495 -193 -284 305 502 331 -418 -564 136 465 13
2722A3j050O86J402o15j273J78J366j52j616O13J279n35l87j65Q26j29m4k77j37
$$ 13 -1037 -351 1051 436 -837 -659 707 555 -1061 -448 831 296 -91 -256 570 441 397 120 -17
2741a7P31M79r84q73Q65J308n35j538N47J607j143l99K75O51l55j34m04M58j12
$$ -17 714 1193 209 -664 201 1509 974 -564 -17 1590 447 48 323 974 619 485 81 539 427
2760D27J44p86l21J214M30j591q65J779P15j631p34J293M42p64j53J53k71J57
$$ 427 571 -215 -536 678 1108 -483 -1348 431 1146 -485 -1219 74 516 -248 -401 -248 -519 -362
2778c62L91m33k81O86K24j072j9J381J75j842m55J910R17j721p72J362rl41q0
$$ -362 29 -404 -685 1 225 -847 -866 515 690 -1152 -1607 303 1220 -501 -1273 89 80 -261 -341
2797c41Ml1P91j74o00LJ336q44j429J207J223r01j614J018J741n27j760M66M67
$$ -341 -337 -368 423 249 -351 -348 988 144 -1285 -78 1145 244 -1370 -352 1389 862 -898 -432 35
2816C5J04K35n2r60J23Q62k45r91M24R90r81r85J192J034j213j212R17J205p12
$$ 35 139 374 322 -638 -515 347 102 -889 -465 525 -456 -1441 -249 785 -428 -1640 -723 482 -230
2835b30p99p9P04P6M56r78q84J165R12r91q20J146N19j082k33J304M36j580n48
$$ -230 -1029 -1108 -404 -328 128 -850 -1734 -569 343 -648 -1468 -322 197 -885 -1118 186 622 -958 -1506
2854a506J476L46n43R3m87l8J140M39j384p95J624J142j696p94J128N06j217J08
$$ -1506 -30 316 -227 -134 -621 -659 481 920 -464 -1259 365 1507 -189 -983 145 651 -566 -458
2872d58J043J70j287k55P17N56k30j82j276L92J494k83j951J71J752J77j820J55
$$ -458 585 755 -532 -787 -70 486 256 74 -1202 -810 684 401 -1550 -1379 373 550 -1270 -1115
2890a115J082m36o37N07P76o45k70L8Q8J36N15m81j373R67K085j055k265J102
$$ -1115 -33 -469 -1106 -599 177 -468 -738 -700 -612 -476 39 -442 -1815 -848 1237 182 -2083 -981
2908i81K033r25q54K79J037m99n73P06jm34L15P7m56N93N14j029q37J380J047
$$ -981 1052 127 -727 -448 589 90 -483 223 222 -212 103 180 -276 317 831 -198 -1035 345 1392
2927A392j312j458J418R52r20n92M88Q7l44M74k54k99L07N69n88q55J349K88j586
$$ 1392 80 -1378 40 992 72 -520 -32 55 -289 185 -69 -368 -61 508 -80 -935 414 702 -884
2946h84n04J735O42k072k76J390O20j614L31J57J84JN80q88l13Q85L87j030Q1
$$ -884 -1388 347 989 -1083 -1359 31 651 -963 -632 -475 -291 -290 290 -598 -911 -26 361 -669 -588
2965e88J542m17j798O94J904n09j336k31J095L38q7m04k16L87O26l92j081M49
$$ -588 954 537 -1261 -567 1337 828 -508 -739 356 694 607 203 -13 374 1000 608 -473 -24
2983b4J335l98j680P87J599j522q14O81J301r54q91K85O30n8J9n75j48M12Q41
$$ -24 1311 913 -767 20 1619 97 -717 -36 1265 311 -580 -295 335 277 296 -279 -427 -15 826
3002H26o73j165P63J024p98j100J197P58j407m03J033L5j49n74M48q1M14K12j058
$$ 826 153 -1012 -249 775 -23 -1123 74 832 -575 -978 55 90 -59 -633 -185 -266 148 360 -698
3021f98l58J462N59j160n11R11R94j112m56J064J86r53L23M20L0j34k80k51J13
$$ -698 -1056 406 965 -195 -706 205 1199 87 -369 695 881 -72 251 671 701 567 287 36 149
3040A49R03J0j905N26J597L4j386m16J212L04j240k9P37k7m59l90L01J02K19l76
$$ 149 1052 1062 -843 -317 1280 1314 -72 -488 724 1028 -212 -241 496 469 10 -380 -79 23 242 -134
3060a34m87M87Q49n96j473N03J600l75j121L81J100k10r65M9M58j31J00j07n4
$$ -134 -621 -134 715 119 -1354 -851 749 374 -747 -366 734 524 -441 -392 66 -65 35 -72 -126
3079a26M60M20p67n88P34J019j014q50R68J139o86j445N96Q86m5n05j26K81L09
$$ -126 334 754 -13 -601 133 1152 138 -712 256 1395 709 -736 -140 746 701 196 70 351 660
3098F60M2m46l64N64K01o46k57R15K2n65q16Q48O08n97n68J9J045k69k78k55m80
$$ 660 702 256 -108 456 657 11 -246 669 691 126 -690 158 766 169 -399 -380 665 396 118 -137 -617
3119f17P27k9m95j28Q19j3q19l06J074L03j184j81R09N43o42l82O0M75J95k09
$$ -617 110 81 -414 -542 277 264 -555 -861 213 516 -668 -849 60 603 -39 -421 -361 114 309 100
3139A00o53L97P93l64p16K57R53M6r24k18J217K7r88l03J000J05m68l42J75J52
$$ 100 -553 -156 637 273 -443 -186 767 813 -111 -329 888 915 -73 -376 624 729 261 -81 94 246
3159B46O65r41k19K85R43n17j139O53J066o62r06K95O49k5p17Q9M16Q9m09o17
$$ 246 911 -30 -249 36 979 462 -677 -24 1042 380 -526 -231 418 393 -324 -235 181 270 -139 -756
3179g56M0Q92J74j018l02J039L59l41q43N87R18q13l61M3J005o7o87o8O44O1j25
$$ -756 -716 176 350 -668 -970 69 428 87 -756 -169 749 -64 -425 -382 623 556 -131 -199 445 506 381
3200C81l65q2P60J26o26m37R89L03r17m11O66N07k66p71N92O56K54r86o60N37
$$ 381 16 -66 694 820 194 -243 746 1049 132 -279 387 894 628 -143 449 1105 1359 373 -287 250
3220B50K96k13l34k2Q60l92q54K34O14M30j488j4M23M32j23o83K09O63r7l12p17
$$ 250 546 333 -1 -23 837 445 -409 -175 439 869 -619 -633 -210 222 99 -584 -375 288 191 -121 -838
3241h38P04R13q53n88N9J098l05o67K46M76L27p37j35M09K33N0p33M67K46K76
$$ -838 -134 779 -74 -662 -603 495 190 -477 -231 245 572 -165 -300 109 342 392 -341 126 372 648
3261F48p41R3N60M92l81q96O87O88o72n14K13O83J37r16k45O30M89p16l72J10
$$ 648 -93 0 560 1052 671 -225 462 1150 478 -36 177 860 997 81 -164 466 955 239 -133 -23
3281b3R50l20q48j69M68N10q37m83N73O63n41m77q3Q98m66j52n43O55L23N5n29
$$ -23 927 607 -241 -410 58 568 -269 -752 -179 484 -57 -534 -617 281 -185 -337 -880 -225 98 153 -376
3302c76o7R14k19o47j05Q02j3n98j47M39Q76n50q36P62M09L2o62l7L23L25j84
$$ -376 -443 471 252 -395 -500 302 289 -309 -456 -17 859 309 -527 235 644 676 14 -23 300 625 441
3323D41o37M57P68m39p67N0O33K28o58k88N75L74o08m05m1N44L43p63q0L82O41
$$ 441 -196 261 1029 590 -177 -127 506 734 76 -212 363 737 129 -276 -317 227 570 -193 -273 109 750
3344G50j112l1P2N21j54n86o8R03j64m91m32N14L05j07o93L41L87R5k92l76N96
$$ 750 -362 -393 -321 200 46 -540 -608 295 131 -360 -792 -278 27 -80 -773 -432 -45 50 -242 -618 -22
3365b2M24n37n82J186K60n43n60L18N99J3m70m27N88O46l34o83m8R10k07p46J11
$$ -22 402 -135 -717 469 729 186 -374 -56 543 556 86 -341 247 893 559 -124 -172 738 531 -215 -104
3386a04O98Rm25n58M98M80o51m60O35L75k82l76m04K71N13k7p51Q3Q47n05r48
$$ -104 594 603 178 -380 118 598 -53 -513 122 497 215 -161 -565 -294 219 192 -559 -476 371 -134 -1082
3407a082K78R22j46n47m23Q94L77p32j94K52M95N0o23m18Q79L58o54o94L73J142
$$ -1082 -804 118 -28 -575 -998 -104 273 -459 -653 -401 94 144 -479 -897 -18 340 -314 -1008 -635 507
3427E07m78p13M00M44q6l91K00K02M46n76k91Q2O50P4n43n41J070K66n18j134
$$ 507 29 -684 -284 160 74 -317 -117 85 531 -45 -336 -254 396 470 -73 -614 456 722 204 -930
3447i30Q60R14q46l66N9M39J43n49l8N83j16l18n11L62Q07j04j095m6O17O12j107
$$ -930 -70 844 -2 -368 -309 130 273 -276 -314 269 153 -165 -676 -314 493 389 -706 -752 -135 477 -630
3468f30n17J213J86o76l58L72j92L49K42n35j32Q19J10q47P37N63j78j366K64
$$ -630 -1147 66 252 -424 -782 -410 -602 -253 -11 -546 -678 141 251 -596 141 704 526 -840 -576
3487e76J388j75j043j61R64k2k50l74k7M05L68j91p16K60P02k46q90Q28O91p93
$$ -576 812 637 -406 -567 397 375 125 -249 -276 129 497 306 -410 -150 552 306 -584 244 935 142
3507A42q96J031N86o82m63Q2L60J79k06o15n06Q32M40n80o18O05Q64p96p52J057
$$ 142 -754 277 863 181 -282 -200 160 339 133 -482 -988 -156 284 -296 -914 -309 555 -241 -993 64
3527F4L15p72n03M20R65m68n78J28K63M86j73n91K8N90L97p60m14J100M8o94l18
$$ 64 379 -393 -896 -476 489 21 -557 -429 -166 320 147 -444 -416 174 571 -189 -603 497 545 -149 -467
3548d67Q53J08o38L35J21K04k56p8m10K09Q66l88j201L26J200m40q70l0O68M06
$$ -467 386 494 -144 191 312 516 260 182 -228 -19 847 459 -742 -416 784 344 -526 -556 112 518
3568E18j058J51Q35m39n54m5K54L75j53l50k21L13J084p51j105L89J213l83j083
$$ 518 -540 -389 446 7 -547 -592 -338 37 -116 -466 -687 -374 710 -41 -1146 -757 456 73 -1010
3587a010P60L15j28l77L04J14j64k21K92l62O20L25n51m06P70M63r11q85J270
$$ -1010 -250 65 -63 -440 -136 -22 -186 -407 -115 -477 143 468 -83 -489 281 744 -167 -1052 218
3606B18O32o71o04P24j99L2L54l28n74P61K36o78j27P19K56j225l71J431K80j228
$$ 218 850 179 -425 299 100 132 486 158 -416 345 581 -97 -224 495 751 -474 -845 586 866 -362
3626c62m88J083K34n99k48q1K00J69O4m18n25O74J98o96J95J056m60r92L33J373
$$ -362 -850 233 467 -132 -380 -461 -261 -92 -28 -446 -971 -297 -99 -795 -600 456 -4 -996 -663 710
3646G10o52r02k57J456L4o71j9j13N63J20p8p20M9J154N1j046J53R27o63q48J112
$$ 710 58 -844 -1101 355 389 -282 -301 -414 149 269 191 -529 -480 674 725 -321 -168 759 96 -752 360
3667C60K68k72n71L1M05K14P1o58k73P21J65k63r25P22Q51n15n80L6R93j062J0
$$ 360 628 356 -215 -184 221 435 506 -152 -425 296 461 198 -727 -5 846 331 -249 -213 780 -282 -272
3688b72L77M06o20n17L43Q6L01l3n45k12Q26L48j098m55R11P78r97k77Q96q3n36
$$ -272 105 511 -109 -626 -283 -197 104 71 -474 -686 140 488 -610 -1065 -154 624 -373 -650 246 163 -373
3709c73J52J74L29n7k80J18j30O85k64o51J25R40J69q87j15P69J16o57j99K79
$$ -373 -221 -47 282 225 -55 63 -67 618 354 -297 -172 768 937 50 -65 704 820 163 -36 243
3729B43J08m35n7L75p5rl77O1K38O04l45q43m0J052j00q62J82P82r1p00l3O91
$$ 243 351 -84 -141 234 159 150 -227 -166 72 676 331 -512 -552 500 400 -462 -280 502 411 -289 -322 369
3751C69n15K69l57k07L55K21n97K08KN75o48p99J086P48o38m50K65K59J27k00
$$ 369 -146 123 -234 -441 -86 135 -462 -254 -252 323 -325 -1124 -38 710 72 -378 -113 146 273 73
3771G3l5J46K30k47R7m70P37q0o05k11P17L40r54j50R18K07p45l09O64L66k64
$$ 73 38 184 414 167 264 -206 531 451 -154 -365 352 692 -262 -412 506 713 -32 -341 323 689 425
3792D25L2o93L13L22k28n43m8R38m22n80J10P62j87p35J45N77R5n15n61L63J91
$$ 425 457 -236 77 399 171 -372 -420 518 96 -484 -374 388 201 -534 -389 188 283 -232 -793 -430 -239
3813b39M32m12j02K50L71k84p49M87O35j08p38j27R46j44n50r8N41K82m55PP0
$$ -239 193 -219 -321 -71 300 16 -733 -246 389 281 -457 -584 362 218 -332 -430 111 393 -62 -55 15
3834A5M31K65o14n07O61L62m56l09p2P62l60l71K78L92j0o71K11K83O6l43j28
$$ 15 446 711 97 -410 251 613 157 -152 -224 538 178 -193 85 477 467 -204 7 290 356 13 -115
3855a15k33O09K30p28j24J45M39j27n15N76K66o41l91K58O11on76j47M23J41r1
$$ -115 -348 261 491 -237 -361 -216 223 96 -419 157 423 -218 -609 -351 260 254 -322 -469 -46 95 4
3876Dl07k8O29l11m12J03M74J85m21k59K94O31j43q73M14N22J2l19l87K27O74
$$ 4 -303 -331 298 -13 -425 -322 152 337 -84 -343 -49 582 439 -434 -20 502 514 195 -192 35 709
3897G09o28l53O33L13oq82K5P88k22l86k00N66J09n41j75K40L99J28k72n96O20
$$ 709 81 -272 361 674 668 -214 -189 599 377 -9 -209 357 466 -75 -250 -10 389 517 245 -351 269
3918B69j55j23m09K35N15l18n33J5N13K6p29J06N66J88j95j29m72P86P2n63j0
$$ 269 114 -9 -418 -183 332 14 -519 -504 9 35 -694 -588 -22 166 -29 -158 -630 156 228 -335 -345
3939c45L28M70l11q41R84Q5q1n4o14R62l1n87j17O65J7o00n1J53O03j07n36k41
$$ -345 -17 453 142 -699 285 370 289 235 -379 583 552 -35 -152 513 530 -70 -121 32 635 528 -8 -249
3961b49L69Q27q62k57Q57j80n70m47O86J66m5m40k53O68l80m8n88P68L65j56p05
$$ -249 120 947 85 -172 685 505 -65 -512 174 340 295 -145 -398 270 -110 -158 -746 22 387 231 -474
3982d74P1P39J57n64m48N89J50n30M3Q5M57n1m71q5M98J93m16j49L71L03j02l09
$$ -474 -403 336 493 -71 -519 70 220 -310 -267 -182 275 224 -247 -332 166 359 -57 -206 165 468 366 57
4004E7K1M81N9n56k03M79J01k60k54K56J24k90Mn8L39q8K33l44k53J057m29n70
$$ 57 78 559 618 62 -141 338 439 179 -75 181 305 15 19 -39 300 212 445 101 -152 905 476 -94
4026i4k98Q22lp32k56N37N12k38p73L81K63K29o86k12O08M3j99o84R43J96l57
$$ -94 -392 430 427 -305 -561 -24 488 250 -523 -142 121 350 -336 -548 60 103 -96 -780 163 359 2
4047Bo52R32L67o44j53O5R7J67Jp58N75J10K66m06j63Q64l19o50J88J66N41l11
$$ 2 -650 282 649 5 -148 -83 14 181 182 -576 -1 109 375 -31 -194 670 351 -299 -111 55 596 285
4069B85m44K40K45O6m20m29M73N25m88m21J96N70k93k98n6M94J71p76jM05k61
$$ 285 -159 81 326 392 -28 -457 16 541 53 -368 -172 398 105 -193 -249 245 416 -360 -361 44 -217
4090b17L14m53O9K83K14n03o64R34J35k46m25J76N17j41n22K12O19J24n99k4J98
$$ -217 97 -356 -287 -4 210 -293 -957 -23 112 -134 -559 -383 134 -7 -529 -317 302 426 -173 -197 1
4111AK23l45q2K7M81j06p19L1J001j15p31k3M95N30m32l46r0O70j83k65MJ42l0
$$ 1 224 -121 -203 -176 305 199 -520 -489 512 397 -334 -357 138 668 236 -110 -200 470 287 22 26 168 138
4134A38j29n2Q3N48l10n45j30Q25m92m55m8L99K94j71m75L96M05l26m30M46j47
$$ 138 9 -43 40 588 278 -267 -397 428 -64 -519 -567 -168 126 -45 -520 -124 281 -45 -475 -29 -176
4155a76M11o22q6K31M49k26o37L70N70j69m11k2N07j35k01n8j82O48j19l86lM81
$$ -176 235 -387 -473 -242 207 -19 -656 -286 284 115 -296 -318 189 54 -147 -205 -387 261 142 -244 -247 234
4177B34M31n90l07K85L55l36l37N64L87l62o93L81J57K47k83k79L51j34M30o16
$$ 234 665 75 -232 53 408 72 -265 299 686 324 -369 12 169 416 133 -146 205 71 501 -115
4197a15o0J40L20n44l7N08J32m49m38N38K11m95k99K90J72K02N1m38k3L04J99
$$ -115 -175 -35 285 -259 -296 212 344 -105 -543 -5 206 -289 -588 -298 -126 76 127 -311 -334 -30 169
4218A69j47n82P87N5m42l51N51M86p80qM31J83p9j78j53N52k3q8m98j1P74K02
$$ 169 22 -560 227 282 -160 -511 40 526 -254 -262 169 352 273 95 -58 494 471 383 -115 -126 648 850
4240H50r17N1Q31n16j24j50M40J33o90J99O5L38k92k06j5J87K14l85m08N30O04
$$ 850 -67 -16 815 299 175 25 465 598 -92 107 172 510 218 12 -3 184 398 13 -395 135 739
4261G39m09q49K78K95k05k87j0O96l84l64L62J01M4K12l80q3K28N68n75p98Q85
$$ 739 330 -519 -241 54 -151 -438 -448 248 -136 -500 -138 -37 7 219 -161 -244 -16 552 -23 -821 64
4282F4M98n17m11O03n7P3l24K18k2K87k99M0j23O42k39q24K23P90J11q90n6N56
$$ 64 562 45 -366 237 180 253 -71 147 125 412 113 153 30 672 433 -391 -168 622 733 -157 -213 343
4304C43L60p69j57K82K41l16M9k65J42R5J28m17L97J45p6r23M25Q28k73o61J45
$$ 343 703 -66 -223 59 300 -16 33 -232 -90 5 133 -284 113 258 182 -741 -316 512 239 -422 -277
4325b77O10jo92j09L80N3Q2j79k1j47N65k90k74K13N18m71k86L85N73m69o39O00
$$ -277 333 332 -360 -469 -89 -36 46 -133 -154 -301 264 -26 -300 -87 431 -40 -326 59 632 163 -476 124
4347A24J39m4j61n7j03O01j9n27q4L75N72o62k91M88J70n51q1O9L01n32L1L26
$$ 124 263 219 58 1 -102 499 480 -47 -131 244 816 154 -137 351 521 -30 -111 -42 259 -273 -242 84
4369H4M8pN2p37K47O94N5p30J42Q4N39q41LM36J93l50n65P15k7l21J8n3L94J77
$$ 84 132 125 177 -560 -313 381 436 -294 -152 -68 471 -370 -367 69 262 -88 -653 62 35 -286 -268 -321 73 250
4393B50q6o56P29R7on44L8N38J18o98J0N96j39L4l36L58J74j28k0l41L86J8k98
$$ 250 164 -492 237 334 328 -216 -178 360 478 -220 -210 386 247 281 -55 303 477 349 329 -12 374 392 94
4416I4l95J49J187r30m59K04Q71p61j86K57N07r8m97r6J32J18o8k64j00K47K34
$$ 94 -301 -152 1035 105 -354 -150 721 -40 -226 31 538 440 -57 -153 -21 97 29 -235 -335 -88 146
4437A46k15o63M88P42n70n72O01L54l90l81j65N78J23j71L76n72M08J82o98M8
$$ 146 -69 -732 -244 498 -72 -644 -43 311 -79 -460 -625 -47 76 -95 281 -291 117 299 -399 -351
4457c51M29L38q87M8M62O81o23n75Q51J74k74j91q1K63L6k12P1l70P48j34l65
$$ -351 78 416 -471 -423 39 720 97 -478 373 547 273 82 1 264 300 88 159 -211 537 403 38
4478C8%N16l78l08j91O59J08o94n5M19K6k24j31r5j71N11j48j97J91J17P3l00
$$ 38 38 554 176 -132 -323 336 444 -250 -305 114 140 -84 -215 -310 -481 30 -118 -315 -124 -7 66 -234
4500b34K93R1j93n64L55L55J50k52m12N03O5j4j75j6K00L17l09o19L37O17l70
$$ -234 59 150 -43 -607 -252 103 253 1 -411 92 157 143 -32 -48 152 469 160 -459 -122 495 125
4521A25m54L04N38l67k14J8J87j25m4J8L18m6j15m17K22N02j67k22m82M35L04
$$ 125 -329 -25 513 146 -68 -50 137 12 -32 -14 304 258 143 -274 -52 450 283 61 -421 14 318
4542C18o0o18L57L7j89k84M27k9K00m39k8J28L49j12l76l30N21K31p09pN64j60
$$ 318 258 -360 -3 34 -155 -439 -12 -41 159 -280 -308 -180 169 57 -319 -649 -128 103 -606 -613 -49 -209
4564b09J11m59O72R2k92J5Q5L5J19k52k86K99N46j61m40M1K83J94p55J66O66k29
$$ -209 -98 -557 115 207 -85 -70 15 50 169 -83 -369 -70 476 315 -125 -84 199 393 -362 -196 470 241
4586B41l35m07P00K61j89l83J88J32J99l70l12K98P2j21o12N72M27m60k67K0K92
$$ 241 -94 -501 199 460 271 -112 76 208 407 37 -275 23 95 -26 -638 -66 361 -99 -366 -346 -54
4607e4M28q96K94M6J31k44K77L4p7J92l52l23O36K14m58m92K70O03p5n90K20L32
$$ -54 374 -522 -228 -182 -51 -295 -18 16 -61 131 -221 -544 92 306 -152 -644 -374 229 154 -436 -216 116
4629A16l7l5l33K44L47j6n20M18m0J21j50k73M24K63n57j53N24L9n56R3o7K10
$$ 116 79 44 -289 -45 302 286 -234 184 144 265 115 -158 266 529 -28 -181 343 382 -174 -81 -148 62
4651F2K97l67j62K91K28k57k08l2N62j63o00L5L81J45n53R9K11N7j79j94J96J2
$$ 62 359 -8 -170 121 349 92 -116 -148 414 251 -349 -314 67 212 -341 -242 -31 26 -153 -347 -151 -139
4673a39L22k95j25J89K66m04k95Q2P40j01p38N06L31J17l80l09N28j07p3k29L32
$$ -139 183 -112 -237 -48 218 -186 -481 -399 341 240 -498 8 339 456 76 -233 295 188 115 -114 218
4694B18L24j31m42J20K45N1l12j51J33K82j68k37j91M93%k89k04K69M46k73l73
$$ 218 542 411 -31 89 334 385 73 -78 55 337 169 -68 -259 234 234 -55 -259 10 456 183 -190
4715a90k4M17O0o03m16N67K82p2m37J74M18j45l77j4NM96j79m60J79P46m79l11
$$ -190 -214 203 263 -340 -756 -189 93 21 -416 -242 176 31 -346 -360 -355 141 -38 -498 -319 427 -52 -363
4737c63N3M54J69n40r8L74Ql12j77L62K13K39p77J92N64k8m06j56K61L95j70k87
$$ -363 -310 144 313 -227 -325 49 57 -255 -432 -70 143 382 -395 -203 361 333 -73 -229 32 427 257 -30
4759c0l9M27j74l14KK09M03n13k62M14k45M98l71l76L87K47l85K1j80N67j46m29
$$ -30 -69 358 184 -130 -128 81 484 -29 -291 123 -122 376 5 -371 16 263 -122 -101 -281 286 140 -289
4781b89J43L51r4o42K97P3k93K09K5O1Q1m4k18K39J85M18o86l05N55K56l20m72
$$ -289 -146 205 111 -531 -234 -161 -454 -245 -220 -159 -78 -122 -340 -101 84 502 -184 -489 66 322 2 -470
4803d70N76K43l24l91L54K73K56k87p4J41m3R3p95N74J26K02o93j85Q16k59j05
$$ -470 106 349 25 -366 -12 261 517 230 156 297 254 347 -448 126 252 454 -239 -424 392 133 28
4824B8j64K03M17l70j85J32j37M31o41q6K15N09l41k75K26L16M3p08K90K63j39
$$ 28 -136 67 484 114 -71 61 -76 355 -286 -372 -157 352 11 -264 -38 278 321 -387 -97 166 27
4845B7k83m35K59L00O1j07J10J68r3k94l0M16k0k70K1L42K38l52m44K58L55K6
$$ 27 -256 -691 -432 -132 -71 -178 -68 100 7 -287 -317 99 79 -191 -170 172 410 58 -386 -128 227 253
4867B53k5o57M99J62J25l95m4M66j05N0n44P41P0n76J0J76j10j46m8q8L03j8n10
$$ 253 228 -429 70 232 357 -38 -82 384 279 329 -215 526 596 20 30 206 96 -50 -98 -186 117 99 -411
4890d11P1L81L49r7o67j45N11J93k15j93L79qm93j73O41J53j83o13M96q0N22l31
$$ -411 -340 41 390 293 -374 -519 -8 185 -30 -223 156 148 -345 -518 123 276 93 -520 -24 -104 418 87
4912H7l53K90L57l69k79O1M12k12K1m8K18p8j23K39J54m6j49j24j2K37J91n82
$$ 87 -266 24 381 12 -267 -206 206 -6 15 -33 185 107 -16 223 377 331 182 58 46 283 474 -108
4934a08j54N97L74o51k08J56L26n0m84J17J71J37k36j13K71M8k54j70l32O64O2
$$ -108 -262 335 709 58 -150 6 332 282 -202 -85 86 223 -13 -126 145 193 -61 -231 -563 101 163
4955A63q67K50P97k9m67n07O82N9m41R2L00J04r7n0j63J50J39j11p3J9K35J61
$$ 163 -704 -454 343 314 -153 -660 22 81 -360 -268 32 136 39 -11 -174 -24 115 4 -69 -50 185 346
4977C46k36l02K86K72j72n38R14k51l04k30K99L00j15K06n59L13K26m40%K00N8
$$ 346 110 -192 94 366 194 -344 570 319 15 -215 84 384 269 475 -84 229 455 15 15 215 273
4998B73J87q78L63L77p8l82L4Q2J3j81K16p9k51M77k01j50k48N25l1p34O66M09
$$ 273 460 -418 -55 322 244 -138 -104 -22 -9 -190 26 -53 -304 173 -28 -178 -426 99 68 -666 0 409
5020D09n17m25M74L54r6n46m0L53L19N5p79M13K75K54k62k33K89l3j22k26M09
$$ 409 -108 -533 -59 295 199 -347 -387 -34 285 340 -439 -26 249 503 241 8 297 264 142 -84 325
5041C25J32o72J73L95j13j56L8k69P6M82j6n38Q5L60Q6l85k47O18P0m46k98O85
$$ 325 457 -215 -42 353 240 84 122 -147 -71 411 395 -143 -58 302 388 3 -244 374 444 -2 -300 385
5063C85j46n49j10L81R0Q0k30l13J79O20o06m27L05N59l12q8qO89m01k14R3J63
$$ 385 239 -310 -420 -39 51 131 -99 -412 -233 387 -219 -646 -341 218 -94 -182 -190 499 98 -116 -23 140
5085A40J69l4k64j61J25K84l91k78M00J74j60j61K58N30m28j87q0M07jm91J82
$$ 140 309 275 11 -150 -25 259 -132 -410 -10 164 4 -157 101 631 203 16 -64 343 342 -149 33
5106C3K89J52j17o47K81K57J00p08M9O95j93l72k66K84p9K01j62K68j19R1o6k53
$$ 33 322 474 357 -290 -9 248 348 -360 -311 384 191 -181 -447 -163 -242 -41 -203 65 -54 37 -29 -282
5128b82K27k91O76p31J62L69P7m31p4O43N8n44k36N77K64n91j50J49J32L52k92
$$ -282 -55 -346 330 -401 -239 130 207 -224 -298 345 403 -141 -377 200 464 -127 -277 -128 4 356 64
5149F4j53m8O52p6m93J37K65P3k50k95O44p3k85q1J92n0n7j61K12K7n6j13m14
$$ 64 -89 -137 515 439 -54 83 348 421 171 -124 520 447 162 81 273 223 166 5 217 244 188 75 -339
5172c39K24M84m33j45q3K82j24q7M9L55k15n11L58Q3K16P6n10l6J91R2J63j16
$$ -339 -115 369 -64 -209 -292 -10 -134 -221 -172 183 -32 -543 -185 -102 114 190 -320 -356 -165 -73 90 -26
5194b6r7M58m55r4J22J60j13l90L47N37k28m56L66L41l21N2k78K32J22L5l70l3
$$ -26 -123 335 -120 -214 -92 68 -45 -435 -88 449 221 -235 131 472 151 203 -75 157 279 314 -56 -89
5216h9N62j55j29l84L06m9k26j21K69oL81n19J82n6J77k63k68M59j29J70m25J31
$$ -89 473 318 189 -195 111 62 -164 -285 -16 -22 359 -160 22 -34 143 -120 -388 71 -58 112 -313 -182
5238a82K29J79m72q1L93J41k29k5Q0j17R7k48j64L35O3l90P7M10J74j67l17j92
$$ -182 47 226 -246 -327 66 207 -22 -47 33 -84 13 -235 -399 -64 -1 -391 -314 96 270 103 -214 -406
5260d06L61J98p3k87K70P6j44j34J42M05k92k03j78N24j17j03n36O70Qj68k78
$$ -406 -45 153 80 -207 63 139 -5 -139 3 408 116 -87 -265 259 142 39 -497 173 181 13 -265
5281b65Q7L29p0j76l1L42J67p67L6L02o7L3k86J24L24J66n09j52K17P3j43M4J81
$$ -265 -178 151 81 -95 -126 216 383 -384 -348 -46 -113 -80 -366 -242 82 248 -261 -413 -196 -123 -266 -222 -41
5304d1K37k08j05j60L25j40J9m3j18K27J72m57L6M52R4n34P1K28K71j51l03o7
$$ -41 196 -12 -117 -277 48 -92 -73 -116 -234 -7 165 -292 -256 196 290 -244 -173 55 326 175 -128 -195
5326a95O35r8J9m31J85M8k0j52qK83K76r00L84L39k19k47J91j68M02m1l06J02
$$ -195 440 342 361 -70 115 163 143 -9 -17 266 542 -358 26 365 146 -101 90 -78 324 283 -23 79
5348G9R4j85m94J63J49K72J89l22n9J17k49k22L17R6o5MR1k3K7K37m67L33qk1
$$ 79 173 -12 -506 -343 -194 78 267 -55 -114 3 -246 -468 -151 -55 -120 -116 -25 -48 -21 216 -251 82 74 53
5372E3m1j38N06R4n74l97L69L09J90l35l3K30N6p7l45M32j44M0o7j73M01l18k66
$$ 53 12 -126 380 474 -100 -497 -128 181 371 36 3 233 289 212 -133 299 155 195 128 -45 356 38 -228
5395b28M8L69j14J13j94o5K62j65j45M7N1K47k84l36M72J11l50p6J99o0L47o81
$$ -228 -180 189 75 188 -6 -71 191 26 -119 -72 -21 226 -58 -394 78 189 -161 -237 -38 -98 249 -432
5417d32J73N29m30J23k98M50k4o2k59J44K96j55j13J54LJ14k64P3K13k29j3j17
$$ -432 -259 270 -160 -37 -335 115 91 29 -230 -86 210 55 -58 96 99 213 -51 22 235 6 -7 -124
5439a24K45L28n81k44K89M64j67m18O2M9K40l1k00Q6N7K60l28k14J94P0j65r8
$$ -124 121 449 -132 -376 -87 377 210 -208 -146 -97 143 112 -88 -2 55 315 -13 -227 -33 37 -128 -226
5461b26l9L79J57l67k30L37M03n52m19R4N41q3l56p0N87L5m88J09K2Q6O4p3MO17
$$ -226 -265 114 271 -96 -326 11 414 -138 -557 -463 78 -5 -361 -431 156 191 -297 -188 -166 -80 -16 -89 -85 532
5485E32n64k15N6P4L81l19J34MJ40k98j9Q6K04L2L7j80k46J62K21l62P2K71M2
$$ 532 -32 -247 -191 -117 264 -55 79 83 223 -75 -94 -8 196 228 265 85 -161 1 222 -140 -68 203 245
5508B45l48J5MK04q5p7j87K17K40j94J08j39J9O5l31K11K10J6l33O9J4N7k31L05
$$ 245 -103 -88 -84 120 35 -42 -229 -12 228 34 142 3 22 87 -244 -33 177 193 -140 -71 -57 0 -231 74
5532G4k74M32n48NL85J05k84k63K74M12l81n4r9K16L13l85J22p9m5L10l68j94
$$ 74 -200 232 -316 -311 74 179 -105 -368 -94 318 -63 -117 -216 0 313 -72 50 -29 -74 236 -132 -326
5554c26M00L33n57j14N00q4n3o7o9K98P7o02K7N38n7k36k45L76Q2l56R6j52K09
$$ -326 74 407 -150 -264 236 152 99 32 -37 261 338 -264 -237 301 244 8 -237 139 221 -135 -39 -191 18
5577A8K8l11J93L58q9m34J82n6L89k41j49n14L23L29k06N8l9L80no22K13L61k16
$$ 18 46 -265 -72 286 197 -237 -55 -111 278 37 -112 -626 -303 26 -180 -122 -161 219 214 -408 -195 166 -50
5600e0j16OK50j65K6k3O8K53Q4o15J28Q3N77k97k67M9M46k16m90M04J06j70M8
$$ -50 -166 -160 90 -75 -49 -72 -4 249 333 -282 -154 -71 506 209 -58 -9 437 221 -269 135 241 71 119
5623A19j63Q8m5K52m36Q6J51K16n47R2M70R2k71j59J89m5K8l40J35q4K88l42j42
$$ 119 -44 44 -1 251 -185 -99 52 268 -279 -187 283 375 104 -55 134 89 117 -223 -88 -172 116 -226 -368
5646c68K01K98J5j08j09J62n4n25N8P31k13k37k81L63J12O1m01M59l13K22J3k96
$$ -368 -167 131 146 38 -71 91 37 -488 -430 301 88 -149 -430 -67 45 106 -295 164 -149 73 86 -210
5668b10L75j89j35J71k02M19j83k29L06l6K8k26Q1m0J82L20m19j14K13j65N5M5
$$ -210 165 -24 -159 12 -190 229 46 -183 123 87 115 -111 -30 -70 112 432 13 -101 112 -53 2 47
5690D7N4Jj88l46L85J99k98k24oO56l89J25j62J83p7K9j46l54P68k35k2k25N09
$$ 47 101 102 -86 -432 -47 152 -146 -370 -376 280 -109 16 -146 37 -40 -11 -157 -511 257 22 0 -225 284
5713B84k18k12L1K1J07rl06J09L97P2l24j00K70R1j66P7j08K02j70k63K20L44
$$ 284 66 -146 -115 -94 13 4 -302 -193 204 276 -48 -148 122 213 47 124 16 218 48 -215 5 349
5735C49J2n07j73P81l25J49k73J10k38K71m80M1N77k76j54k65L27K20l27j0q1
$$ 349 361 -146 -319 462 137 286 13 123 -115 156 -324 -283 294 18 -136 -401 -74 146 -181 -191 -272
5756b72K06P8k60q0M64l52LJ23J54k17M1M2k25M05j38M76q14N35L94l89j32j00
$$ -272 -66 12 -248 -328 136 -216 -213 -90 64 -153 -112 -70 -295 110 -28 448 -366 169 563 174 42 -58
5778e8K98m63O6l6L69k3n5j09j43K38L14k51r1J99j30l39O4M02k93k49M3K88J64
$$ -58 240 -223 -157 -193 176 153 98 -11 -154 84 398 147 56 255 125 -214 -150 252 -41 -290 -247 41 205
5801B05l58l01K37J70J69J59n91J80Lm1KN6N1R3j74l34M62L23k90k08qL23m10
$$ 205 -153 -454 -217 -47 122 281 -310 -130 -127 -168 -166 -110 -59 34 -140 -474 -12 311 21 -187 -195 128 -282
5824b82N0J05P2j8k33P4J59J80o5p3k02N83K12q20O52O2k91L0m92o7K25L01Kj79
$$ -282 -232 -127 -55 -73 -306 -232 -73 107 42 -31 -233 350 562 -258 394 456 165 195 -297 -364 -139 162 164 -15
5848a5Q5L37n2n88M80pl61k64N36Q5l02j89K2J75J21p5k13P4J48k24K25k68M34
$$ -15 70 407 355 -233 247 240 -121 -385 151 236 -66 -255 -233 -58 63 -12 -225 -151 -3 -227 -2 -270 164
5871A64j90Q3l34L32L3r8l39O29j58l83Q4L3K33J68R1k96R9J54O5l33K8J87K96
$$ 164 -26 57 -277 55 88 -10 -349 280 122 -261 -177 -144 89 257 348 52 151 305 370 37 65 252 548
5894E48n87j78M85k04q3r4M21J49m64J73j36l1R8j56k99N61J57k58j82J97J60
$$ 548 -39 -217 268 64 -19 -113 308 457 -7 166 30 -1 97 -59 -358 203 360 102 -80 117 277
5915B77l70q2p4P34l12m67J51K1k02K52J54m63L66J73m71L84k8j96K02l02K00
$$ 277 -93 -175 -249 485 173 -294 -143 -122 -324 -72 82 -381 -15 158 -313 71 43 -153 49 -253 -53
5936e3L39k74l52J92K92r1j99p0Q0L68k15j61K15J23Q0j45P8m51L46m60L22L3
$$ -53 286 12 -340 -148 144 53 -146 -216 -136 232 17 -144 71 194 274 129 207 -244 102 -358 -36 -3
5958cK81k16k46M21l78J70L75n90J43p6L48k41k78M89m3k8k49Q9P4K1k45J22J82
$$ -3 278 62 -184 237 -141 29 404 -186 -43 -119 229 -12 -290 199 156 128 -121 -32 42 63 -182 -60 122
5981A22m4j58j70P3K22j63k07L61p8O0k06K22O0k48p6O9M53o1l87j93M62J06j31
$$ 122 78 -80 -250 -177 45 -118 -325 36 -42 18 -188 34 94 -154 -230 -161 292 231 -156 -349 113 219 88
6004H8j15J21P3r3lo8J40K26m42j57K93J29R0l47J95j9K22l40J84m9K76m32R0
$$ 88 -27 94 167 74 71 3 143 369 -73 -230 63 192 282 -65 130 111 333 -7 177 128 404 -28 62
6027F2k45L42j27k36j00Q2L48R0n74K04K25j20k70N04k31L48l61k94J08Q0J6p0
$$ 62 -183 159 32 -204 -304 -222 126 216 -358 -154 71 -49 -319 185 -46 302 -59 -353 -245 -165 -149 -219
6049b19J40K05l7k43n2J44K58j70J47Kj29J58l99J03l7K01j19O9k60N32j57m33
$$ -219 -79 126 89 -154 -206 -62 196 26 173 175 46 204 -195 -92 -129 72 -47 22 -238 294 137 -296
6071b96N47r9n5m14L17K23J30j75l50K87J84m63J87j57K00J19l45RN7K40l39R
$$ -296 251 152 97 -317 0 223 353 178 -172 115 299 -164 23 -134 66 185 -160 -151 -94 146 -193 -184
6093a84J21k01L77k95L9n9L80l43r5R7K47R2m05l9L34M0j03k67L11r3P4k28Q6
$$ -184 -63 -264 113 -182 -143 -202 178 -165 -260 -163 84 176 -229 -268 66 106 3 -264 47 -46 28 -200 -114
6116a14K36p5k41k9N18m65k55K52M19j9j51M6k82L74J39m08J67j66K35j66O6o8
$$ -114 122 47 -194 -223 295 -170 -425 -173 246 227 76 122 -160 214 353 -55 112 -54 181 15 81 13
6138A3L9K22n30L56J00j41k72L75l07M38j8p12K17K33j79N6K38R1O3m29k23L85
$$ 13 52 274 -256 100 200 59 -213 162 -145 293 275 -437 -220 13 -166 -110 128 219 282 -147 -370 15
6160A5J38l10r5M59j45j76J80k45K03J72m4n62N34j05K30m02K48J71k49o2k8j7
$$ 15 153 -157 -252 207 62 -114 66 -179 24 196 152 -410 124 19 249 -153 95 266 17 -45 -73 -90
6182i0P0L19l82mK98M0n0m70N77L4j69l39J19J45lO1qK7k5j83j57N6K09p9j99
$$ -90 -20 299 -83 -87 211 251 201 -269 308 342 173 -166 -47 98 95 156 148 175 150 -33 -190 -134 75 -4 -203
6207b03j57K44R4j75J22O1M4k19n6L88n9l09K01j43J98R8N8l28R1QJ41K38m66
$$ -203 -360 -116 -22 -197 -75 -14 30 -189 -245 143 84 -225 -24 -167 31 129 187 -141 -50 -42 99 337 -129
6230a29K09J50k13L8R8qk03k27O33k13j97mL71j40K69l26P7J50l64P8p5K26p1
$$ -129 80 230 17 55 153 145 -58 -285 348 135 -62 -66 305 165 434 108 185 335 -29 49 -26 200 129
6253A29r3j61K16L9j02j74K5K31l20M50m58jK37m3l68j44K78M39k45l13L60L45
$$ 129 36 -125 91 130 28 -146 -121 110 -210 240 -218 -219 18 -25 -393 -537 -259 180 -65 -378 -18 327
6275C27k36k67j28K63K52j24l28K67L00m51p0j09M86L3k2l74L29O5m35JL54o6
$$ 327 91 -176 -304 -41 211 87 -241 26 326 -125 -195 -304 182 215 193 -181 148 213 -222 -221 133 67
6297F7k07J2q9O11l52j17P4M9j36J01l78K99J49L65q40K13J63J39k79j27L73o7
$$ 67 -140 -128 -217 394 42 -75 -1 48 -88 13 -365 -66 83 448 -392 -179 -16 123 -156 -283 90 23
6319B3Q5k94K71j23j32N5q0L48N7j28j97j0K78l28J72k60J39J3p1RO4J75K40l61
$$ 23 108 -186 85 -38 -170 -115 -195 153 210 82 -115 -125 153 -175 -3 -263 -124 -111 -182 -173 -109 66 306 -55
6343e5J33p4l11J44J6N7N13j64m57K35J06j6l02J41K39l2Q4k04r6K35K54o22P9
$$ -55 78 4 -307 -163 -147 -90 423 259 -198 37 143 127 -175 -34 205 173 257 53 -43 192 446 -176 -97
6366i7L86m8l38k06J70J24j65K36q0J78m9l16K15j11j88L59l65J04K18K2J7m73
$$ -97 289 241 -97 -303 -133 -9 -174 62 -18 160 111 -205 10 -101 -289 70 -295 -191 27 49 66 -407
6388d07N35k51j31J41J21K24k79K6RJ8K41n92K14K76J07r8k93J41J82k19j32R4
$$ -407 128 -123 -254 -113 8 232 -47 -21 -12 6 247 -345 -131 145 252 154 -139 2 184 -35 -167 -73
6410g3K74k84O7K34K4K9k21k02J94j60M48l38J22K63j58l85j4L21j24Jj36K50
$$ -73 201 -83 -16 218 242 271 50 -152 42 -118 330 -8 114 377 219 -166 -180 141 17 18 -118 132
6432A32N5k56j64j3J58nJ06K78l40J51l49J69j29L56J45o22q6L01J75l59J22K88
$$ 132 187 -69 -233 -246 -88 -93 13 291 -49 102 -247 -78 -207 149 294 -328 -414 -113 62 -297 -175 113
6454A13l9o5k91J90K0J05j36K61j06J10J60m67P8M39k22j42J08N4L8k73r0J15
$$ 113 74 9 -282 -92 -72 33 -103 158 52 162 322 -145 -67 372 150 8 116 170 208 -65 -155 -40
6476d0M07k13k03O2L%O1j55K75j52j10moK2J54Qk75J42K85j27n9j5K0M9j18j80
$$ -40 367 154 -49 13 16 16 77 -78 197 45 -65 -69 -75 -53 101 109 -166 -24 261 134 75 60 80 129 11 -169
6502a69K59k03J22r9J05kJ31m28K50O1J06j93j1L03pp4k67J62Q2k21J22j69L67
$$ -169 90 -113 9 -90 15 13 144 -284 -34 27 133 -60 -71 232 225 151 -116 46 128 -93 29 -140 227
6525B27m7j61M6L03k34N3k98l1M23k48J27j66K73j10j52n6k8M25k76q3k52K92
$$ 227 180 19 65 368 134 187 -111 -142 281 33 160 -6 267 157 5 -51 -79 346 70 -13 -265 27
6547B7J73j28l12J0M66l27k65M40J00j18k81OK98J73l09j48jL68m95l8J52K02
$$ 27 200 72 -240 -230 236 -91 -356 84 184 66 -215 -209 89 262 -47 -195 -196 172 -323 -361 -209 -7
6569gK71k39k08K80K22n54J25j5L89k10J56l62O4K51Q7l11L15L67l69k06j69O07
$$ -7 264 25 -183 97 319 -235 -110 -125 264 54 210 -152 -88 163 250 -61 254 621 252 46 -123 484
6591D84j60n83L00K28j59k78L53J39L7m08oN3J32M8n9m72N35O8l51J16P7J37j1
$$ 484 324 -259 41 269 110 -168 185 324 361 -47 -53 0 132 180 121 -351 184 252 -99 17 94 231 220
6614B20k71P4J58l72K50n1o3O6K9l42j42N17Q7k84K94M9k37L9l1J16j43o5kj14
$$ 220 -51 23 181 -191 59 8 -55 11 40 -302 -444 73 160 -124 170 219 -18 21 -10 106 -37 -102 -104 -218
6638b18M82l19K81j3Q2J00j85j42N5J9J3j39k44L35J56o32M39j32J11q8JJ22K1
$$ -218 264 -55 226 213 295 395 210 68 123 142 155 16 -228 107 263 -369 70 -62 49 -39 -38 84 105
6661A05k82J43P8p5K15j17k58J92J34m8m24J96M59j54l40K27k4j39J52k65l6L7
$$ 105 -177 -34 44 -31 184 67 -191 1 135 87 -337 -141 318 164 -176 51 27 -112 40 -225 -261 -224
6683b24J60M3j83L50L1l5l66j8M90k14j58O3N66m16O8q1n9M46l98k07J31L5l90
$$ -224 -64 -21 -204 146 177 142 -224 -242 248 34 -124 -61 505 89 157 76 17 463 65 -142 -11 24 -366
6706c66L87m41L76J42j56J15q0M39n49M4r3L24j10j64NJ02J38o4Lj77q7L17L5
$$ -366 21 -420 -44 98 -58 57 -23 416 -133 -89 -182 142 32 -132 -127 -25 113 49 52 -125 -212 105 140
6729A40k77K51q8l93L32K3K3J00j66l2K24j55M6j93J38L1lm3R7L3q6m7O6q3K74
$$ 140 -137 114 26 -367 -35 -12 11 111 -55 -87 137 -18 28 -165 -27 4 1 -42 55 88 2 -45 21 -62 212
6754B12l08R7j56K37J30l29Q4K96n2o7j99K63n41K61M26n05K71k28J31q3K63q2
$$ 212 -96 1 -155 82 212 -117 -33 263 211 144 -55 208 -333 -72 354 -151 120 -108 23 -60 203 121
6776A21j21j25M10k46j48K9P8O7o2j53j16L83k03j05j30J19K23R7k65o6L11j94
$$ 121 0 -125 285 39 -109 -80 -2 65 3 -150 -266 117 -86 -191 -321 -202 21 118 -147 -213 98 -96
6798i6Nj07K64j8J41knq3j1l20K38L58l98LN8N6j86N5J07j73K57Jk5k03J94j9
$$ -96 -91 -198 66 48 189 187 182 99 88 -232 6 364 -34 -31 27 83 -103 -48 59 -114 143 144 119 -84 110 91
6824I1J39j75k62N42l54p8l0K75j07pl70J00M75k28m12L99j6l7q2R6J18J94l33
$$ 91 230 55 -207 335 -19 -97 -127 148 41 34 -336 -236 239 11 -401 -2 -18 -55 -137 -41 77 271 -62
6847f2l56L88p0Q1p5O5J61P3j20j36N1K72j31j57J18Q4K4n1J59k84j65N8r3R4
$$ -62 -418 -30 -100 -19 -94 -29 132 205 85 -51 0 272 141 -16 102 186 210 159 318 34 -131 -73 -166 -72
6871g2J52L4j85J20N1L39l28K9O1j23m0k39R5m0L57k6l91M02j99k27n3L17N12
$$ -72 80 114 -71 49 100 439 111 140 201 78 38 -201 -106 -146 211 185 -206 196 -3 -230 -283 34 546
6894E46m45M3m74L26J73l85J09J55J41k71o0j60M28k88j46o1N35j50j64N8qJ86
$$ 546 101 144 -330 -4 169 -216 -107 48 189 -82 -142 -302 126 -162 -308 -369 166 16 -148 -90 -98 88
6916H8j68j29K31j1N17n08N2m1J14R0o5j10J26r3k76K11J12J7l18L65k71M35k76
$$ 88 -80 -209 22 11 528 20 72 31 145 235 170 60 186 93 -183 28 140 157 -161 204 -67 368 92
6939I2k90L38p2J31k76n1J54L8k00j76L13q6l08j0K46K70rl99L17j20J16l3l83
$$ 92 -198 140 68 199 -77 -128 26 64 -136 -312 1 -85 -393 -403 -157 113 104 -295 22 -98 18 -15 -398
6962c98L83M1R0k07q8k7K0J64k58K37K3K85n75j93N02p9r8P3K11k56M58k72q2
$$ -398 -15 26 116 -91 -179 -206 -186 -22 -280 -43 -20 265 -310 -503 -1 -80 -178 -105 106 -150 308 36 -46
6985d6L60j94p0K58K25k93l01M0K68lk49k7k89N62k39l3j07L22j18k13K20j03
$$ -46 314 120 50 308 533 240 -61 -21 247 244 -5 -32 -321 241 2 -31 -138 184 66 -147 73 -30
7007c0J62j20O6k74R4L6k4J8K78k80K65l05Rj4l7P9l48O00k47J81l35n3L76k69
$$ -30 132 12 78 -196 -102 -66 -90 -72 206 -74 191 -114 -105 -119 -156 -77 -425 175 -72 109 -226 -279 97 -172
7031a72J13J18j32P5j29Q5K36J47j38j89r2R3L13l35m1J92P1n74K56L0N98k97
$$ -172 -59 59 -73 2 -127 -42 194 341 203 14 -78 15 328 -7 -48 144 215 -359 -103 -73 525 228
7053B28l16j1J34k61N62l69J37P9M2k38j74K34J56k94Q5j27J58j33N3j12O7N2
$$ 228 -88 -99 35 -226 336 -33 104 183 225 -13 -187 47 203 -91 -6 -133 25 -108 -55 -167 -100 -48
7075d8p1P3j30n5n9K27j86K81O2p3O7L28l68J73l16J63J4j90J43J9k3J46m6N0
$$ -48 -119 -46 -176 -231 -290 -63 -249 32 94 21 88 416 48 221 -95 68 82 -108 35 54 31 177 131 181
7099A81P9j76m34M00k1K21l12l78M86r7L48k75l3N9m5P0J49j80j55M3J0l70L87
$$ 181 260 84 -350 50 29 250 -62 -440 46 -51 297 22 -11 48 3 73 222 42 -113 -70 -60 -430 -43
7122d3Q2k83J37pO0J9j63K67k44J49Q7j44L63m03J07r1l6L42l05K1j10K02p3M76
$$ -43 39 -244 -107 -114 -54 -35 -198 69 -175 -26 61 -83 280 -123 -16 -107 -143 199 -106 -85 -195 7 -66 410
7146D10m31N4L15o77k7M12J05l54k3L59K18m43K33l11N00p6k59J24j68K42k26
$$ 410 -21 33 348 -329 -356 56 161 -193 -216 143 361 -82 151 -160 340 264 5 129 -39 203 -23
7167b3n0j5J45l35O8O3L65j72lj8L8R8n5n8l85K54k17K16m1K04p0J01j72k15l
$$ -23 -73 -88 57 -278 -210 -147 218 46 43 25 63 161 106 48 -337 -83 -300 -84 -125 79 9 110 -62 -277 -280
7192b80N25k82k4N1k44J50J84k66J51M0rj44K78O1N4o09L45L4L6k09K53j52J96
$$ -280 245 -37 -61 -10 -254 -104 80 -186 -35 5 -4 -148 130 191 245 -364 -19 15 51 -158 95 -57 139
7215A39m9k60L84n5p3J04k68K07r2O1k74K01L81k47k25K99P0k00l99N36n4k22
$$ 139 90 -170 214 159 86 190 -78 129 37 98 -176 25 406 159 -66 233 303 103 -296 240 186 -36
7237c6k18N66m9m2l81J47j75J55j04j54K75j3J12j47j64K53K72l15j50KM70m62
$$ -36 -254 312 263 221 -160 -13 -188 -33 -137 -291 -16 -29 83 -64 -228 25 297 -18 -168 -166 304 -158
7259a58K86k67o4L25N6j91p0K74j70l62M42N1j80r9m8J57J50J67k09J55n9j50
$$ -158 128 -139 -203 122 178 -13 -83 191 21 -341 101 152 -28 -127 -175 -18 132 299 90 245 186 36
7281C6k7l71P25l2l56K5K31j74M11o59L64j70j98O1jr0P4J53l09J78L83k51k99
$$ 36 9 -362 363 331 -25 0 231 57 468 -191 173 3 -195 -134 -135 -225 -151 2 -307 -129 254 3 -296
7304b96K75j89K33k16QK20J64j40k40J63J34J06n7l20J21J45jk96J23L46j72k90
$$ -296 -21 -210 23 -193 -185 35 199 59 -181 -18 116 222 165 -155 -34 111 110 -186 -63 283 111 -179
7326a79J48K60k51J3K3k9J05k34R4L2j00K88j27q1k2J07j22%J92m9P7n18L88j75
$$ -179 -31 229 -22 -9 14 -15 90 -144 -50 -18 -118 170 43 -38 -60 47 -75 -75 117 68 145 -373 15 -160
7350a60Q9k23j16L65m7j91J6J09K69n8l3j72L9J53J15m78K53r6K32p5l5P5J66
$$ -160 -71 -294 -410 -45 -92 -283 -267 -158 111 53 20 -152 -113 40 155 -323 -70 -166 66 -9 -44 31 197
7373A97m25o1M91j44M7k32L1M01k6m25L12m4J62m97K15L19k10R8m5l97J46J10
$$ 197 -228 -289 202 58 105 -127 -96 305 279 -146 166 122 284 -213 2 321 111 209 164 -233 -87 23
7395B3j9P4l0L9j74J83L9m9Q8l12J46K1K53k04l45M57l61O2J75o0j9l8p0j28J61
$$ 23 4 78 48 87 -87 96 135 86 174 -138 8 29 282 78 -267 190 -171 -109 66 6 -13 -51 -121 -249 -88
7420h8M0r9k27K61L70l54ok15K31J67j76Q0J64k10K14J0l5J77r8j78j10J4K41
$$ -88 -48 -147 -374 -113 257 -97 -103 -318 -87 80 -96 -16 148 -62 152 162 127 304 206 28 -82 -68 173
7443A73k36J83p0K23j52l97n2N24m9k79J59k7J3K65n58L80m3J66j32OL50m20j58
$$ 173 -63 120 50 273 121 -276 -328 196 147 -132 27 0 13 278 -280 100 57 223 91 97 447 27 -131
7466a31p3J06M43m89K4K43j39J95k85K31r0J47o06K78J06J89j52J3o6M1K06o0
$$ -131 -204 -98 345 -144 -120 123 -16 179 -106 125 35 182 -424 -146 -40 149 -3 10 -56 -15 191 131
7488A31m99K88J98M9j80J13K58n63n2J3L93K70o23L49k3n3j21Q9l7K86j95j47
$$ 131 -368 -80 118 167 -13 100 358 -205 -257 -244 149 419 -204 145 122 69 -52 37 0 286 91 -56
7510e6J35l04K67k0j16M7J98j00Q6l84J13J95l8j76J29L55k78l13J6L51j33j72
$$ -56 79 -225 42 22 -94 -47 151 51 137 -247 -134 61 23 -153 -24 331 53 -260 -244 107 -26 -198
7532a98n3J0M30m64J49k6M1M27o63L65l8K36j67k87K79Q2l98l9K54N8k27O4J22
$$ -198 -251 -241 189 -275 -126 -152 -111 316 -347 18 -20 216 49 -238 41 123 -275 -314 -60 -2 -229 -165 -43
7555d3O7M0J37K6q7j7l99P7L57j4j00l8m0j41K57k55L84k71N65o22LJ25J5j20
$$ -43 24 64 201 227 140 123 -276 -199 158 144 44 6 -34 -175 82 -173 211 -60 505 -117 -114 11 26 -94
7579i4O4K5j69K88l37L61M8k59M21n35J8K18O4l4lj5o9K27j33k65J79J50l78K98
$$ -94 -30 -5 -174 114 -223 138 186 -73 348 -187 -169 49 113 79 76 61 -8 219 86 -179 0 150 -228 70
7603G0K67k15O3j04j49K26oJ0k81L55l30J09n3r8J46J41j68l41P13m76n6J24J90
$$ 70 337 122 185 81 -68 158 152 162 -119 236 -94 15 -38 -136 10 151 -17 -358 355 -121 -177 -53 137
7626A37q9j22n07M46L57j15l93J84j11J52l7n9J01n7K28j85K0Q9J62m89J27pJ17
$$ 137 48 -74 -581 -135 222 107 -286 -102 -213 -61 -98 -157 -56 -113 115 -70 -50 39 201 -288 -161 -168 -51
7649e1J80m44O5M93j42j77n7L12k47k7m52Q02j08j28Jj99L51L5m46M08M0Q8m8
$$ -51 129 -315 -250 243 101 -76 -133 179 -68 -95 -547 255 147 19 20 -179 172 207 -239 169 209 297 249
7672B49m71L41J65k67k08J74R2J75m30K58k4J31k62l02M77J1j98j51K16m8jj69
$$ 249 -222 119 284 17 -191 -17 75 250 -180 78 54 185 -77 -379 98 109 -89 -240 -24 -72 -73 -242
7694b42j61N63l24M5j4q7K95k4r5m2M7K47k64K3K58l27M12l75M4l5J50j07j67
$$ -242 -403 160 -164 -119 -133 -220 75 51 -44 -86 -39 208 -56 -33 225 -102 310 -65 -21 -56 94 -13 -180
7717a80p8L55J73l76N3O8R2k40Q0j12k8L02o4p2P4N8J3j83o1J63j36L16k19J76
$$ -180 -258 97 270 -106 -53 15 107 -133 -53 -165 -193 109 45 -27 47 105 118 -65 -126 37 -99 217 -2 174
7741A74o7l52K85K38j33j92r0K5J48j08j10M6L03n69L90j62P6J24j38l1N3J95
$$ 174 107 -245 40 278 145 -47 -137 -112 36 -72 -182 -136 167 -402 -12 -174 -98 26 -112 -143 -90 105
7763A05j98K17k61N47n58r6J57R3M2j73q3K85j70K48l76J28j05J73p2k59M36K54
$$ 105 -93 124 -137 410 -148 -244 -87 6 48 -125 -208 77 -93 155 -221 -93 -198 -25 -97 -356 80 334
7785C34k47l50R4K73J82l37j20M37j24k03k99N72j43N5m5r5M8K71m52q5M50j4
$$ 334 87 -263 -169 104 286 -51 -171 266 142 -61 -360 212 69 124 79 -16 32 303 -149 -234 216 202
7807B02l39P2j49N16k38m57M80k88K58rl50o5P91m83Q6M7N8J43k84j15K73n9l55
$$ 202 -137 -65 -214 302 64 -393 87 -201 57 48 -302 -367 424 -59 27 74 132 275 -9 -124 149 90 -265
7830b65K38k1O5J47k56M6k15K13o0m4J30K43l45K36j84L26j97o4j10O0K96k34
$$ -265 -27 -48 17 164 -92 -46 -261 -48 -108 -152 -22 221 -124 112 -72 254 57 -7 -117 -57 239 5
7852El9P3L72l82J35j42M8rJ05rk67L24k86j70J55L74m15J72l14M83k49Q1k67
$$ 5 -34 39 411 29 164 22 70 61 166 157 -110 214 -72 -242 -87 287 -128 44 -270 213 -36 45 -222
7875b22J6L65k92K83l01P4L66n02J96L30j04l40j32L30l6j68K86p1L9j26Ml69
$$ -222 -206 159 -133 150 -151 -77 289 -213 -17 313 209 -131 -263 67 31 -137 149 78 117 -9 -5 -374
7897c74M33N7O3j88Q1j51P8L16l63N1J10O1k29J25j41q2j4k5J97M36k80k23J96
$$ -374 59 116 179 -9 72 -79 -1 315 -48 3 113 174 -55 70 -71 -153 -167 -192 5 441 161 -62 134
7920A34O3j87j43K83k57K37k13J43J1k13j00K95l84J45K66k42K13j90O2k4k04
$$ 134 197 10 -133 150 -107 130 -83 60 71 -142 -242 53 -331 -186 80 -162 51 -139 -77 -101 -305
7941c05J79O8K13l34K05o2J4N7K32k92J5k67J01K75r2L7j11o2L05R9m10M4J26
$$ -305 -126 -58 155 -179 26 -36 -22 35 267 -25 -10 -277 -176 99 7 44 -67 -129 176 275 -135 -91 35
7964C5r2K53l03p3L02J24j54j85J71o3J20k34K32j9k21Q1l84K99K86n34J27J62
$$ 35 -57 196 -107 -180 122 246 92 -93 78 15 135 -99 133 114 -107 -26 -410 -111 175 -359 -232 -70
7986g0Q9p3l01O47p0k32P1n7O7p3Q3n9j54M32m33k08M44N2M4l18O0J10p7M0j31
$$ -70 19 -54 -355 292 222 -10 61 4 71 -2 81 22 -132 300 -133 -341 103 155 199 -119 -59 51 -26 14 -117
8011a17J5O1MJ77N9j21k2Q8l39J44M08l66p8K13J79k48k89J38K14N0l64o0n1K48
$$ -117 -102 -41 -37 140 199 78 56 144 -195 -51 357 -9 -87 126 305 57 -232 -94 120 170 -194 -254 -305 -57
8035e7q4q1M19l14J97j43k02L87j71L45l61m05K44M60k21l55N24l27k6L8L23J15
$$ -57 -141 -222 197 -117 80 -63 -265 122 -49 296 -65 -470 -226 234 13 -342 182 -145 -171 -133 190 305
8057C05k00l05j3P01m82J23l2l79J98m9J97J51l75K44l29K69R7l4k79p1L40J82
$$ 305 105 -200 -213 488 6 129 97 -282 -84 -133 64 215 -160 84 -245 24 121 87 -192 -263 77 259
8079B59j23j25n7O7J85j04m83K24J78k34K69m3j1j20j88j59N93j82j75J2M69j63
$$ 259 136 11 -46 21 206 102 -381 -157 21 -213 56 13 2 -118 -306 -465 128 -54 -229 -217 252 89
8101H9l39J81j54P04o01m4M55k8j26k26Q9m5pj17k26M10m5j00J9J83J59k09l8
$$ 89 -250 -69 -223 481 -120 -164 291 263 137 -89 0 -45 -52 -169 -395 15 -30 -130 -111 72 231 22 -16
8124a6J44k44L49m76J72M18l69L2K3j35N9K6j11P6o3L14k99j23L86j18j96J00
$$ -16 128 -116 233 -243 -71 347 -22 10 33 -102 -43 -17 -128 -52 -115 199 -100 -223 163 45 -151 -51
8146e1q6k4K18k23L0j74M57j74k8j60J46J29j62K99M5Pm7k82J96L0L8l08K00j42
$$ -51 -137 -161 57 -166 -136 -310 147 -27 -55 -215 -69 60 -102 197 242 249 202 -80 116 146 184 -124 76 -66
8170f6R8m1J43j93k53K61j9m0J43J62k73J22k40M83k8k88J42l0J69k08l53
$$ -66 32 -9 134 -59 -312 -51 -70 -110 33 195 -78 44 -196 287 259 -29 113 83 252 44 -309
8191c09
$$ Imaginary data points
##PAGE= N=2
##DATA TABLE= (X++(I..I)), XYDATA
0@%%%%%%%%qJ6j6J6k4L2l5M3n1N9p2Q8j04J20j39J58j82K11k40K72l09L51l93
$$ 0 0 0 0 0 0 0 0 0 -8 8 -8 8 -16 16 -19 24 -27 32 -40 48 -56 64 -75 83 -99 112 -128 144 -165 186 -207
31b07M41m96N54o20O90p67Q55r48J051j166J291j428J580j751J943k159K403k684
$$ -207 234 -262 292 -328 362 -405 450 -498 553 -613 678 -750 830 -921 1022 -1137 1266 -1418
49a418L010l390L845m402N102o010P239r013J1815j6929K9296j10784j86297J06497
$$ -1418 1592 -1798 2047 -2355 2747 -3263 3976 -5037 6778 -10151 19145 -91639 -277936 -171439
63a71439P3768Q773k1536L278n1823l1854M0761N9784p857j3020K954j7921l5702
$$ -171439 -97671 -88898 -110434 -107156 -158979 -190833 -150072 -90288 -98145 -111165 -108211 -126132 -161834
76a61834J1419K7224M603O258K1171k4588m9263Q300O0474K3935j6323j8987j7005
$$ -161834 -150415 -123191 -118588 -112330 -91159 -115747 -165010 -156710 -96236 -72301 -88624 -107611 -124616
89a24616j0558K2041J9334k2247k0131K0566Q183k4078L194K4966j6156k2054
$$ -124616 -135174 -113133 -93799 -116046 -136177 -115611 -107428 -131506 -128312 -103346 -119502 -141556
101a41556L7037L6304l8727m3683K3297K9386j5564q747J4222r378j5490K1233
$$ -141556 -104519 -68215 -106942 -150625 -127328 -97942 -113506 -122253 -108031 -117409 -132899 -111666
113a11666J6322k3346n665L4681Q000k8796k595J7711j1490j0348K7873J4272
$$ -111666 -95344 -118690 -124355 -89674 -81674 -110470 -113065 -95354 -106844 -117192 -89319 -75047
125g5047l0738j8664J9635J4681O16M167m862j2106J4520K1478k1179k6275K4511
$$ -75047 -105785 -124449 -104814 -90133 -89517 -85350 -90212 -102318 -87798 -66320 -87499 -113774 -89263
138h9263L0958j5479j6200J7618p50k4368J5804M2233l556l4955r92J8140O94
$$ -89263 -58305 -73784 -89984 -72366 -73116 -97484 -81680 -39447 -43003 -77958 -78950 -60810 -60116
151f0116N398J6045q819j8134J4461J5841k0216j1153L0019J7563k3468j5239
$$ -60116 -54718 -38673 -47492 -65626 -51165 -35324 -55540 -66693 -36674 -19111 -42579 -57818
163e7818J0596J659n774J3955J4321j1573j7387j178O039J1121J4159p741k4037
$$ -57818 -47222 -45563 -51337 -37382 -23061 -34634 -52021 -53199 -47160 -36039 -21880 -29621 -53658
176e3658L506K5557m198k3873R958K6247p012j8380P693Q465j0639M806K1885
$$ -53658 -50152 -24595 -28793 -52666 -42708 -16461 -23473 -41853 -34160 -25695 -36334 -31528 -9643
189i643k618k0153J116J1517l140L364J6336o756k3504P715K7001n629k2983Q295
$$ -9643 -12261 -32414 -31298 -19781 -22921 -19557 -3221 -9977 -33481 -25766 1235 -4394 -27377 -19082
203a9082K1606n768j4660L125O823j462L725M433n902m498M354q60j34J1453P99
$$ -19082 2524 -3244 -17904 -14779 -7956 -9418 -5693 -1260 -7162 -11660 -7306 -8166 -8300 3153 3952
218C952k0831p217K3973J2884j8217j2774Q848O415j432M329J25j1962l031R604
$$ 3952 -16879 -24096 -123 12761 -5456 -18230 -9382 -2967 -4399 -70 55 -11907 -14938 -5334
232e334q97o994P916L787j7429p304J9843R776j7084n794J6788K199j7671l704
$$ -5334 -6231 -13225 -5309 -1522 -18951 -26255 -6412 3364 -13720 -19514 -2726 -527 -18198 -21902
246b1902J4686N335p197o650m750n42Q056O916m203k558M724k304p788Q388J5304
$$ -21902 -7216 -1881 -9078 -15728 -20478 -21020 -12964 -6048 -10251 -12809 -8085 -10389 -18177 -9789 5515
261E515o624j8182r88J1148Q98n385o04N06n30L634J021l397L985Q440o266j3028
$$ 5515 -1109 -19291 -20279 -9131 -8233 -13618 -14222 -13716 -14246 -10612 -9591 -12988 -9003 -563 -6829 -19857
277a9857N024J2621o105j5329K439R225n237o629P965P962m666p604j26N157O308
$$ -19857 -14833 -2212 -8317 -23646 -21207 -11982 -17219 -23848 -15883 -7921 -12587 -20191 -20317 -15160 -8852
292h852O07j0186j0613M395P838m250n843N047M675q070m237R664R418k727o674
$$ -8852 -8245 -18431 -29044 -24649 -16811 -21061 -26904 -21857 -17182 -25252 -29489 -19825 -10407 -13134 -19808
307a9808j879J522J858o84k867N03M384j137q582J69J3963O761r751o481Q007
$$ -19808 -21687 -20165 -18307 -18991 -21858 -21355 -16971 -18108 -26690 -26521 -12558 -5797 -15548 -22029 -14022
322a4022N688n985l602N077K800n843n538J392O374L922m129n539L745P190j099
$$ -14022 -8334 -14319 -17921 -12844 -10044 -15887 -21425 -20033 -13659 -9737 -13866 -19405 -15660 -8470 -9569
337i569p749J223P821l34q760k009P126M118n339m713L282N604P7m773j533N076
$$ -9569 -17318 -16095 -8274 -8608 -17368 -19377 -12251 -8133 -13472 -18185 -14903 -9299 -9222 -13995 -15528 -10452
353a0452L922n050n659M732P141m187p637L025Q077q42p936r46O415K628m782
$$ -10452 -6530 -11580 -17239 -12507 -5366 -9553 -17190 -14165 -6088 -6930 -14866 -15812 -9397 -6769 -11551
368a1551m383L291M790p94m172N25N724K526n302k957N361O135l840p971J718
$$ -11551 -15934 -12643 -7853 -8647 -12819 -12294 -6570 -4044 -9346 -12303 -6942 -807 -4647 -12618 -10900
383a0900P476R79n880j083O266L780l483l904M257O250j687p111n54N856R0o093
$$ -10900 -3424 -2445 -8325 -9408 -3142 638 -2845 -6749 -2492 3758 2071 -5040 -5594 262 352 -5741
399e741l282N488M017l768n053L139O879P88n175k122N382K257m628m280L407
$$ -5741 -9023 -3535 482 -3286 -8339 -5200 1679 2467 -2708 -4830 552 2809 -1819 -6099 -2692
414b692M945k261o203J153Q329K232n103j517O122M409l929m789K458N110j774
$$ -2692 2253 -8 -6211 -5058 3271 5503 400 -1117 5005 9414 5485 696 3154 8264 6490
429F490o237o88N562J588n224k661N431N655k286o377R34O774P55o085l352M871
$$ 6490 253 -435 5127 6715 1491 -1170 4261 9916 7630 1253 2187 8961 9716 3631 279 5150
445E150K772l998m330L814N977n05n614L19P162K868n036l562N038M894l395o000
$$ 5150 7922 3924 -406 3408 9385 8880 3266 3585 10747 13615 8579 5017 10055 14949 11554 5554
461E554K080O125J28o006j381N333L132l861l501K448M458j516o524J6O066J226
$$ 5554 7634 13759 13887 7881 6500 11833 14965 11104 7603 10051 14509 12993 6469 6485 12551 13777
477A3777p027k973O013L535m607m357L566M756j100m159n69M889L081k887m080
$$ 13777 6750 3777 9790 13325 8718 4361 7927 12683 11583 7424 6855 11744 14825 11938 7858
492G858K286O211m1o382m26O889J829o521k739O749K854o029l180M455M463k376
$$ 7858 10144 16355 16314 9932 9506 16395 18224 11703 8964 15713 18567 12538 9358 13813 18276 15900
508A5900m679j129M227K288l805n016J726M797k152n891J029N669q61n913J95
$$ 15900 11221 10092 14319 16607 12802 7786 9512 14309 12157 6266 7295 12964 12103 6190 6385
523F385N178P82l709k110J607K999l99m789l291N038N810n576p602M825Q455m577
$$ 6385 11563 12345 8636 6526 8133 11132 10733 5944 2653 7691 13501 7925 323 5148 13603 9026
539I026q061M513O455m583o430L174M775k123m107n01J755K146M46m033l122N300
$$ 9026 965 5478 11933 7350 920 4094 8869 6746 2639 2138 3893 6039 6485 2452 -670 4630
555D630N050o009o647N684P010m749n801L502L851k162k840J350J448oj758l643
$$ 4630 9680 3671 -2976 2708 9718 4969 -832 2670 6521 4359 1519 2869 4317 4311 2553 -1090
571a090Q40N957m11r076j716J0484K326j0920l140R187K234p692k089L849r48
$$ -1090 -250 5707 5296 -3780 -5496 4988 7314 -3606 -6746 2441 4675 -3017 -5106 -1257 -2205
586b205l509J860O90k677M75K189k738O85O946p55r451J18J1443k09j1175k092
$$ -2205 -5714 -3854 -3164 -5841 -5366 -3177 -5915 -5230 1716 961 -8490 -8372 3071 2862 -8313 -10405
602a0405Q016J895m335j064J457P31K681R06k898M59M606k782o281M085O742p854
$$ -10405 -2389 -494 -4829 -5893 -4436 -3705 -1024 -118 -3016 -2557 2049 -733 -7014 -2929 3813 -4041
618d041j0782P695J0835o018q542N008N922j725j24J045l958o14N870j110q847
$$ -4041 -14823 -7128 3707 -2311 -10853 -5845 77 -1648 -1772 -727 -4685 -5299 571 -539 -9386
633i386O46P139l839o637P138P761q150o789J0601P938p018p065L027L231L74
$$ -9386 -8740 -1601 -5440 -12077 -4939 2822 -5328 -12117 -1516 6422 -596 -7661 -4634 -1403 -1029
648a029p98m884l417O323O205o380m968Q715M858p875M56J0057j679j1749J998
$$ -1029 -1827 -6711 -10128 -3805 2400 -3980 -8948 -233 4625 -3250 -2794 7263 5584 -6165 -4167
663d167R981j909p203J90K131l71O120L927r319m781J2752P114j1587n898J0539
$$ -4167 5814 3905 -3298 -3108 -977 -1348 4772 8699 -620 -5401 7351 14465 2878 -3020 7519
678G519J686j0618J576R147m309r617N783Q637k893m244R71m68J657O653k439
$$ 7519 9205 -1413 163 9310 5001 -4616 1167 9804 6911 2667 3638 3170 4827 11480 9041
693I041j2443R64J3072o87j1652Q36Q082l069l483O811K267q602N36P912q49l731
$$ 9041 -3402 -2438 10634 9947 -1705 -869 7213 4144 661 7472 9739 1137 1673 9585 8736 5005
709E005K736j553p144O417J2102q363j4351R043J5119o736j1331P198P208o498
$$ 5005 7741 6188 -956 5461 17563 9200 -5151 3892 19011 12275 944 8142 15350 8852
723H852j866P490j860o605L490M035l180n91L077m209l435J0040N442j3766p955
$$ 8852 6986 14476 12616 6011 9501 13536 10356 9765 12842 8633 5198 15238 20680 6914 -1041
738a041J3192P285r581n435N096o17k885N348R63q635p02P539k265n250O828J890
$$ -1041 12151 19436 9855 4420 9516 8899 6014 11362 12325 3690 2988 10527 8262 3012 9840 11730
754A1730j2080r68J5764O50j7679j151J6324J390j1788Q6O110k772m03O404l184
$$ 11730 -350 -1318 14446 15096 -2583 -3734 12590 13980 2192 2278 8388 5616 5213 11617 8433
769H433q160M782P474n035l804O420j699r319N384J2263o190j2988M038J0206
$$ 8433 273 5055 12529 7494 3690 10110 8411 -908 4476 16739 10549 -2439 1599 11805
783A1805k093m395M66k644j425P383J401j0076j469R868n52r626L902Q455q246
$$ 11805 9712 5317 5783 3139 1714 9097 10498 422 -1047 8821 8269 -1357 2545 11000 2754
798B754p773J1214P029j2448p350J0082M005n665j016k03m896K005J0173k821
$$ 2754 -5019 6195 13224 776 -6574 3508 7513 1848 832 629 -4267 -2262 7911 5090
812E090j2578K883J0799l781p642O202L991r660l125J0236K211r511j940O646
$$ 5090 -7488 -4605 6194 2413 -5229 973 4964 -4696 -7821 2415 4626 -4885 -6825 -179
826a79J491m11J051m026l024Q921O566j0220p394R559N598q606j897Q419j941
$$ -179 1312 901 1952 -2074 -5098 3823 10389 169 -7225 2334 7932 -674 -2571 5848 3907
841C907q029M866Q937l738n955L258K451k368K354O79q297k204J0682J891j2584
$$ 3907 -4122 744 9681 5943 -12 3246 5697 3329 5683 6362 -1935 -4139 6543 8434 -4150
856d150l169J1559K636p908M81N133l655l288N083K436m693k727J031j395J551
$$ -4150 -7319 4240 6876 -1032 -551 4582 927 -2361 2722 5158 465 -2262 -1231 -2626 -1075
871a075N902k894q153M082J0885k852r306L958Q073l926n048K856P92l059K074
$$ -1075 4827 1933 -6220 -2138 8747 5895 -3411 547 8620 4694 -354 2502 3294 235 2309
886B309L857l752k159M419J372l713M277N672o923p609Q595Q907p962q376M923
$$ 2309 6166 2414 255 4674 6046 2333 6610 12282 5359 -2250 6345 15252 7290 -1086 3837
901C837N939l501j897L346J40j640K555O87k853J639K577l997k769N756J955q811
$$ 3837 9776 6275 4378 7724 7864 6224 8779 9466 6613 8252 10829 6832 4063 9819 11774 2963
917B963k503Q849K715p433k402M526K258j833n38j127j487K820K148m789k664
$$ 2963 460 9309 12024 4591 2189 6715 8973 7140 6602 5475 3988 6808 8956 4167 1503
932A503N481J288n396M17P394j716p727J992R394n72o694p89L282R79J226J29
$$ 1503 6984 8272 2876 3293 10687 8971 1244 3236 12630 12058 5364 4575 7857 8836 10062 10191
948A0191k784q10M166O66m439R34N610j764o561J833N916k010m624J757L835j808
$$ 10191 7407 6597 10763 11429 6990 7924 13534 11770 5209 7042 12958 10948 6324 8081 11916 10108
964A0108l654J07J491K344L43l265m570K715N862k024n481K122L884l339l386
$$ 10108 6454 6561 8052 10396 10739 7474 2904 5619 11481 9457 3976 6098 9982 6643 3257
979C257M159M161l877m409J423K672K67r02j447n18J939J221l600j584N017K785
$$ 3257 7416 11577 7700 3291 4714 7386 7653 6751 5304 4786 6725 7946 4346 2762 7779 10564
995A0564m980l298L700L504l042k915K393J650k369j400J196J914J714j819l406
$$ 10564 5584 2286 5986 9490 6448 3533 5926 7576 5207 3807 5003 6917 8631 6812 3406
1010C406R86M602L73n203o13M934N16n055r44M228J519l499j573J515J593p89
$$ 3406 4392 8994 9367 4164 3551 8485 9001 3946 3002 7230 8749 5250 3677 5192 6785 5996
1026E996j773J16O58J588j814l237J003L829j245m831L81M194k34m078q30L276
$$ 5996 4223 4339 4997 6585 4771 1534 2537 6366 5121 290 671 4865 4631 553 -277 2999
1042B999J050k520k374J233K543j32k646o65K325J718k612k571K714L061j995
$$ 2999 4049 1529 -845 388 2931 2799 153 -512 1813 3531 919 -1652 1062 4123 2128
1057B128l655P50L805r0l249LK659J247k025k531J659K762j80l378j259K888J685
$$ 2128 -1527 -777 3028 2938 -311 -308 2351 3598 1573 -958 701 3463 3283 -95 -1354 1534 3219
1074C219k725k522K727K562k082k928J776L045r10l462q13K725J311k697k439
$$ 3219 494 -2028 699 3261 1179 -1749 27 3072 2162 -1300 -2113 612 1923 -774 -3213
1089c213J073K637m42l246p5K786P94k911j698K795J768k785k848J420K535n18
$$ -3213 -2140 497 55 -3191 -3266 -480 314 -2597 -4295 -1500 268 -2517 -5365 -3945 -1410 -1928
1105a928k760q42K817J401k260j721K051K688j031l765M64L351N64k893j515K275
$$ -1928 -4688 -5530 -2713 -1312 -3572 -5293 -3242 -554 -1585 -5350 -4886 -1535 -971 -3864 -5379 -3104
1121c104J878j989j986J656K982l15l395n66L238J802k457k179J014K284r88l038
$$ -3104 -1226 -3215 -5201 -3545 -563 -878 -4273 -4839 -1601 201 -2256 -4435 -3421 -1137 -2125 -5163
1137e163J514K734n64l128r57K915K000j775l094R97K337l56k983JK457P02l036
$$ -5163 -3649 -915 -1479 -4607 -5564 -2649 -649 -2424 -5518 -4521 -2184 -2540 -5523 -5522 -3065 -2363 -5399
1154e399j953K758K234j826l376J147K958n13l077k04K400J429k406j822J895
$$ -5399 -7352 -4594 -2360 -4186 -7562 -6415 -3457 -3970 -7047 -7251 -4851 -3422 -5828 -7650 -5755
1169e755K606q50k812j05K696J128k712j126K542J840j450j798J376K940l76k374
$$ -5755 -3149 -3999 -6811 -6916 -4220 -3092 -5804 -6930 -4388 -2548 -3998 -5796 -4420 -1480 -1856 -4230
1185d230o36K374J745k102k606J524K669j333k904J084L262J59l408o26L377J148
$$ -4230 -4866 -2492 -747 -2849 -5455 -3931 -1262 -2595 -5499 -4415 -1153 -994 -4402 -5028 -1651 -503
1201e03k524k109J125J313p41j655p42J927J060j615k402J814L501r28l480K34
$$ -503 -3027 -5136 -4011 -2698 -3439 -5094 -5836 -3909 -2849 -4464 -6866 -5052 -1551 -2479 -5959 -5725
1217e725L018k67l123l77K717K87k160j572K001L353r1k955j065L121K257k910
$$ -5725 -2707 -2974 -6097 -6474 -3757 -3470 -5630 -7202 -5201 -1848 -1939 -4894 -5959 -2838 -581 -3491
1233c491k448K848K571k878k639K162K579r40j595P79J940M75o63m57K74J914
$$ -3491 -5939 -3091 -520 -3398 -6037 -3875 -1296 -2236 -3831 -3052 -1112 -637 -1300 -1757 -1483 431
1249D31J54k962j298L230K186l690k252K764K896k277k471K107K164j531j639
$$ 431 585 -2377 -3675 -445 1741 -1949 -4201 -1437 1459 -818 -3289 -1182 982 -549 -2188
1264b188k53R86R76j510k218M62K892o16l710m2M599O70m883l58L750M63k029
$$ -2188 -2441 -1455 -479 -1989 -4207 -3745 -853 -1469 -5179 -5221 -622 48 -4835 -5193 -1443 -980 -3009
1281c009j067J594K03K17j69j236N62K128q8k360M11M446q97m809J535N112j080
$$ -3009 -4076 -2482 -2279 -2062 -2231 -3467 -2905 -777 -865 -3225 -2814 1632 735 -4074 -2539 2573 1493
1298A493m313K2L645Q51k324n00K96P71R52j104j400J481J759k072k654L090K870
$$ 1493 -2820 -2798 847 1698 -626 -1126 -830 -59 893 -211 -1611 -130 1629 -443 -3097 -7 2863
1315B863l644l504L442L501k988k811J146J479O2q1j268j889J690L368k544l616
$$ 2863 -781 -4285 -843 2658 -330 -3141 -1995 -516 -454 -535 -1803 -3692 -2002 1366 -1178 -4794
1331d794K691L821l867l201M174K596m602k300M191K413l560j668J167J577O74
$$ -4794 -2103 1718 -2149 -5350 -1176 1420 -3182 -5482 -1291 1122 -2438 -4106 -2939 -1362 -688
1346f88k22j909j271L329K112l335j991L483J488l587J37L470Kl512Q01K759o90
$$ -688 -910 -2819 -4090 -761 1351 -1984 -3975 -492 996 -2591 -2454 1016 1018 -2494 -1693 1066 376
1363C76j286M96j202J28L371j59n568k79O708Q91p066o51N247k41m694J661L576
$$ 376 -910 -414 -1616 -1488 1883 1724 -3844 -4123 2585 3476 -3590 -4241 1006 765 -3929 -2268 1308
1380A308l184l730K798K565j564j096j55j224J231L425j606n315J056N966j363
$$ 1308 -1876 -5606 -2808 -243 -1807 -2903 -3058 -4282 -3051 374 -1232 -6547 -5491 475 -888
1395h88n128P09L902q48j530J825L16j713Q68J495r35J6J591k635k336L947M239
$$ -888 -6016 -5307 -1405 -2253 -3783 -1958 -1642 -3355 -2487 -992 -1927 -1911 -320 -2955 -5291 -1344 2895
1412B895n476m869N779N145m691l348L422K075k820J21K379k405j797K407O50
$$ 2895 -2581 -7450 -1671 3474 -1217 -4565 -1143 932 -1888 -1767 612 -1793 -3590 -1183 -533
1427e33k128R67J875k965j750N302K146o379k617N793K812m934k420K290J65k66
$$ -533 -2661 -1694 181 -2784 -4534 768 2914 -3465 -6082 -289 2523 -2411 -4831 -2541 -2376 -2642
1443b642O58r91k312K298K480k270j217L425o4m945J484O114k166p119J665O096
$$ -2642 -1984 -2975 -5287 -2989 -509 -2779 -3996 -571 -635 -5580 -4096 2018 -148 -7267 -5602 494
1459D94n16l473L95J419n99J903J908l294k115M185J701l891o20L363r01l968
$$ 494 -22 -3495 -3100 -1681 -2280 -377 1531 -1763 -3878 307 2008 -1883 -2503 860 -41 -4009
1475d009K917M932l353m644K889M205j125k033m09r01J198L086k078m308J271
$$ -4009 -1092 3840 487 -4157 -1268 2937 1812 -221 -630 -1531 -333 2753 675 -3633 -2362
1490b362M668j780l625K839K984m413j362N035R78m828j581L839N32j528K34n73
$$ -2362 2306 526 -3099 -260 2724 -1689 -3051 1984 2962 -1866 -3447 392 924 -604 -370 -943
1506i43k618L097M388l433n328M047N095l839l421L753J919m002j28M281l15l541
$$ -943 -3561 -464 3924 491 -4837 -790 4305 466 -2955 798 2717 -1285 -1413 2868 2553 -988
1522i88R2K681L23Q9O2k673j17M856J298n685j898N412J535l783m72K986j013
$$ -988 -896 1785 2108 2197 2259 -414 -531 4325 5623 -62 -1960 3452 4987 1204 732 3718 2705
1539B705k655K421J573k196j158J797q68k16K804j124m753J110O173j191o452
$$ 2705 50 2471 4044 1848 690 2487 1619 1403 4207 3083 -1670 -560 5613 4422 -2030
1554b030L61N743k01m100J074J901j861l71J963j36k022J034N47j280R68K325
$$ -2030 -1669 4074 3873 -227 847 2748 887 516 2479 2343 321 1355 1902 622 1590 3915
1570C915k475l500L577M343l474m373K424L511j094j613Q37k53q64J902N07j456
$$ 3915 1440 -2060 1517 5860 2386 -1987 437 3948 2854 1241 2078 1825 961 2863 3370 1914
1586A914n5K030j771j630K860K108m184k480N053K593m593k904L608K189k120
$$ 1914 1859 3889 2118 488 3348 5456 1272 -1208 3845 6438 1845 -1059 2549 4738 2618
1601B618q21J09p24J256J207j580k059J751J199k132j165L718l46m063m03M457
$$ 2618 1797 1906 1182 2438 3645 2065 6 1757 2956 824 -341 3377 3031 -1032 -1435 3022
1617C022J93l469p42J866O20J33m56j561L2K489M77k947q08L463M9l411J092L492
$$ 3022 3215 -254 -996 870 1490 1623 1167 -394 -362 2127 2604 -343 -1151 2312 2361 -1050 42 3534
1635C534j270l532J727L036p46k535K32J030K28O62j045k131J075K823q18l496
$$ 3534 2264 -1268 459 3495 2749 214 446 1476 1704 2366 1321 -810 265 3088 2270 -1226
1651a226R83L281j199k549J349J749j458k116R52J885m90j356o36M48J282R73
$$ -1226 -243 3038 1839 -710 639 2388 930 -1186 -234 1651 1161 -195 -831 -383 899 1872
1667A872k162j600K604K130k704k563K209K220k257k221K003J090j668r64J576
$$ 1872 -290 -1890 714 2844 140 -2423 -214 2006 -251 -2472 -469 621 -1047 -2011 -435
1682d35L52j98l63p95R6J848K90k832j339L338J539k918j648K712J292j838q90
$$ -435 -83 -281 -644 -1439 -1343 505 795 -2037 -3376 -38 1501 -1417 -3065 -353 939 -899 -1789
1699a789J710P62p59n21J0L29O91p91j584R28J904l13l108M17L206k79k304j076
$$ -1789 -79 683 -76 -597 -587 -258 433 -358 -1942 -1014 890 577 -2531 -2114 1092 813 -1491 -2567
1717b567K434J27j536p80O34M39R7r35o30J137Q02j181j784J467K347j540k521
$$ -2567 -133 -6 -1542 -2322 -1688 -1249 -1152 -2087 -2717 -1580 -778 -1959 -3743 -2276 71 -1469 -3990
1734c990R89K438l42k244j77J660Q13j108o44L89R84j1j244o34J342J192j764
$$ -3990 -3001 -563 -905 -3149 -3326 -1666 -853 -1961 -2605 -2216 -1232 -1243 -2487 -3121 -1779 -587 -2351
1751b351j203J809J831j377k011J023K107n27j818k74J616Q34j350j050R57J107
$$ -2351 -3554 -1745 86 -1291 -3302 -2279 -172 -699 -2517 -2791 -1175 -341 -1691 -2741 -1784 -677
1767f77J63j842j37J551P01j905m58J419J240j849j468J041J488o18j641r7J360
$$ -677 -514 -2356 -2493 -942 -241 -2146 -2604 -1185 55 -1794 -3262 -2221 -733 -1351 -2992 -3089 -1729
1784a729Q45j152j446O86J676l14k007j62K055J10j931m66J521R37j001j287J104
$$ -1729 -884 -2036 -3482 -2796 -1120 -1434 -3441 -3603 -1548 -1438 -3369 -3835 -2314 -1377 -2378 -3665 -2561
1801b561J698l44j507l66J565J107j429j233R74J788q18j395M79K026pj855K1
$$ -2561 -863 -1207 -2714 -3080 -1515 -408 -1837 -3070 -2096 -308 -1126 -2521 -2042 -16 -23 -1878 -1857
1818a857J778N82j204j700J125J519o96j558L3J397O54j387r61J539P64p71j603
$$ -1857 -79 503 -701 -2401 -1276 243 -453 -2011 -1978 -581 73 -1314 -2275 -736 28 -743 -2346
1835b346N53J433J10j433p55J258R17j354q84R88J126o26j436j5J931L12j762
$$ -2346 -1793 -360 -250 -1683 -2438 -1180 -263 -1617 -2501 -1513 -387 -1013 -2449 -2464 -533 -221 -1983
1852a983r60J775J056j230j316Q97J445k71j362J47J570M94j177r14R84J609l96
$$ -1983 -2943 -1168 -112 -1342 -2658 -1761 -316 -587 -1949 -1802 -232 262 -915 -1829 -845 764 368
1869C68k055M35J624N50j461q77J821R86j041j458R31J538n21j605P9J258L78
$$ 368 -1687 -1252 372 922 -539 -1416 405 1391 350 -1108 -177 1361 840 -765 -686 572 950
1886I50j065j173J343J360p86j702K85J431r3j331n68J403M83j149q03Q88J049
$$ 950 -115 -1288 55 1415 629 -1073 -788 643 550 -781 -1349 54 537 -612 -1415 -527 522
1903E22n33j039m50J695M86j220j402J393J234n71j927P84J845q0k029J34J456
$$ 522 -11 -1050 -1500 195 681 -539 -1941 -548 686 115 -1812 -1028 817 737 -1292 -1158 298
1920B98Q42j050j038R18J267l16j572L7K078N65k034j044J777J496j417r69O71
$$ 298 1140 90 -948 -30 1237 921 -651 -614 1464 2029 -5 -1049 728 2224 807 -162 509
1937E09J156k81r90l15J231M51n77j130L23Q66J04j904n27K676J51k262j111K379
$$ 509 1665 1384 394 79 1310 1761 1184 54 377 1243 1347 -557 -1084 1592 1743 -519 -1630 749
1955G49P82j559j145R29J083m91q79m04R34R46j246j294J048J513p48j745J027
$$ 749 1531 -28 -1173 -244 839 348 -531 -935 -1 945 -301 -1595 -547 966 218 -1527 -500
1972e00J823m03k264M68K128M7j017m18L23N28Q31p37j227Q72J732p72j593R25
$$ -500 1323 920 -1344 -876 1252 1299 282 -136 187 715 1546 809 -418 454 2186 1414 -179 746
1990G46J944j224k034J236J894j009k193O49J473j87j030k14L37Q56M39j133j085
$$ 746 2690 1466 -568 668 2562 1553 -640 9 1482 1295 265 51 388 1244 1683 550 -535
2007e35J483P22j615q67J430J039j690j179J649P24r78p83K07J034M02m71j268
$$ -535 948 1670 55 -812 618 1657 -33 -1212 437 1161 183 -600 -393 641 1043 572 -696
2024f96k43J914O53k466q50K548J013l084k53K634L44j962J59J695K68j216k68
$$ -696 -939 975 1628 -838 -1688 860 1873 -1211 -1464 1170 1514 -448 -289 1406 1674 458 190
2041A90O60l2N18k63j105q8K500L58k934j15K709J80k111J59J389l54j194K48
$$ 190 850 818 1336 1073 -32 -120 2380 2738 -196 -311 2398 2578 467 626 2015 1661 467 715
2059G15Q06o88l75m30n17J072J823j576k833J759L145j719l363J531K709j633
$$ 715 1521 833 458 28 -489 583 2406 830 -2003 -244 2901 1182 -2181 -650 2059 426
2075D26j684J046P84r32m03J499l76n63O80l87o09J317J549k419j988K240K587
$$ 426 -1258 -212 572 -360 -763 736 360 -203 477 90 -519 798 2347 -72 -2060 180 2767
2092B767k135k086J867J309r18o88P27j47j26Q37k99j093J005J119k128p09L037
$$ 2767 632 -1454 413 1722 804 116 843 696 570 1407 1108 15 1020 2139 11 -698 2339
2109B339L36l607l49L846L36k837j025K358k8p37J83l42r13Q05J069j626o59J612
$$ 2339 2675 -932 -1281 2565 2901 64 -961 1397 1369 632 815 473 -440 365 1434 -192 -851 761
2127G61P34k888J41L104p33l375K44L693l67k768k06J340L15J66j66j230o0J858
$$ 761 1495 -1393 -1252 1852 1119 -2256 -2012 1681 1314 -1454 -1660 -320 -5 161 -5 -1235 -1295 563
2145E63K12j931N98J917j309j599J631K219k360k050K207K124j231j350O47N7
$$ 563 775 -1156 -558 1359 50 -1549 82 2301 -59 -2109 98 2222 991 -359 288 345
2161C45K74J383p77k474R79K465j024k214Q49K010k024j160K540O83k319j146
$$ 345 619 2002 1225 -1249 -270 2195 1171 -1043 -194 1816 -208 -1368 1172 1855 -464 -1610
2177a610J772J179j594k83J73k09J186J051k326j904K309J909k425j195K094N15
$$ -1610 162 1341 -253 -536 -363 -572 614 1665 -661 -2565 -256 1653 -772 -1967 127 642
2193F42k068K68K054n12k138O15J212m08QJ81j242R5K608L16l467l99M010M29
$$ 642 -1426 -1158 896 384 -1754 -1139 73 -335 -327 -146 -1388 -1293 1315 1631 -1836 -2235 1775 2204
2211B204l199l54K573k82j827P69J506j136r42J124L35r8M72q12j595J316K468
$$ 2204 -995 -1349 1224 942 -885 -116 1390 254 -688 436 771 673 1145 333 -1262 54 2522
2228B522j339k799N93L052q53k208M07J265j047Q4Q90n91p83P86N8r12O31J327
$$ 2522 1183 -1616 -1023 2029 1176 -1032 -625 640 -407 -323 567 -24 -807 -21 37 -875 -244 1083
2246A083k063j651K613J966k312k882K631K331j958j458J467L17p71O65O03j409
$$ 1083 -980 -2631 -18 1948 -364 -3246 -615 1716 -242 -1700 -233 84 -687 -22 581 -828
2262h28K33R29n95p85J450O34j703r51K681J218k783q76J949R64j310l37J50l13
$$ -828 -595 334 -261 -1046 404 1038 -665 -1616 1065 2283 -500 -1376 573 1537 227 -110 40 -273
2280b73P57N48r60r74J371Q91j707l20K027j68l121Q04K388j49k601j82K011j8
$$ -273 484 1032 72 -902 469 1360 -347 -667 1360 1192 -1929 -1125 1263 1114 -1487 -1669 342 324
2298C24o79m23J4k73R29L6j556O8J930l87k043P88J685q31j919J392J988j426
$$ 324 -355 -778 -764 -1037 -108 -72 -1628 -1560 370 -17 -2060 -1272 413 -418 -2337 -945 1043 -383
2316c83j333N77R71M8J38q83m93P01J842j102j781J097K208j507j528J493J287
$$ -383 -1716 -1139 -168 -120 18 -865 -1358 -657 1185 83 -1698 -601 1607 100 -1428 65 1352
2333A352j613j228K012M69j112j12nK61L13L47j348j128K002R64j558j735J761
$$ 1352 -261 -1489 523 992 -120 -232 -237 24 337 684 -664 -1792 210 1174 -384 -2119 -358
$$ [...]
8191a57
##END NTUPLES=NMR FID
##END=
