##TITLE=1H_SA_PPh3vCl(extra-pure)
 CDCl3, 8 sc, 
 24.9.2019
##JCAMPDX= 6.0         $$ Bruker NMR JCAMP-DX V2.0
##DATA TYPE= NMR FID
##DATA CLASS= NTUPLES
##ORIGIN= UXNMR, Bruker Analytische Messtechnik GmbH
##OWNER= root
$$ XWIN-NMR		Version 3.5
$$ Tue Sep 24 15:33:54 2019 Russian Standard Time (UT+4h)  she@DPX200
##.OBSERVE FREQUENCY= 200.1315
##.OBSERVE NUCLEUS= ^1H
##.DELAY= (6, 6)
##.ACQUISITION MODE= SIMULTANEOUS
##.ACQUISITION SCHEME= undefined
##.AVERAGES= 8
##.DIGITISER RES= 18
##SPECTROMETER/DATA SYSTEM= spect
##.PULSE SEQUENCE= zg30
##.SOLVENT NAME= CDCl3
##.SHIFT REFERENCE= (INTERNAL, CDCl3, 0, 15.7039)
##AUDIT TRAIL= $$ (NUMBER, WHEN, WHO, WHERE, WHAT)
$$ ##TITLE= Audit trail, XWIN-NMR		Version 3.5
$$ ##JCAMPDX= 5.01
$$ ##ORIGIN= Bruker BioSpin GmbH
$$ ##OWNER= she
$$ F:/spectra/data/she/nmr/H-F/1/audita.txt
$$ ##AUDIT TRAIL=  $$ (NUMBER, WHEN, WHO, WHERE, WHAT)
(   1,<2019-09-24 15:32:18.07 +0400>,<she>,<DPX200>,
      <created by zg, POWCHK disabled, PULCHK disabled
       configuration hash MD5:
       00 E9 B6 7A A2 85 ED C7 34 08 36 98 17 FE 4E 26
       data hash MD5: 16K
       37 26 AA B4 C8 0A 64 A7 DC 5C CC 39 F8 A8 FC 18>)
$$ ##END=
$$ 
$$ hash MD5
$$ BD AF 48 50 DB 1B 1B 78 93 F7 10 F0 43 59 11 87
##$RELAX= 
##$RELAX= 
##$RELAX= 
##$RELAX= 
##$RELAX= 
##$RELAX= 
$$ Bruker specific parameters
$$ --------------------------
##$DU= <F:/spectra>
##$EXPNO= 1
##$NAME= <H-F>
##$PROCNO= 1
##$TYPE= <nmr>
##$USER= <she>
##$AMP= (0..31)
100 100 100 100 100 100 100 100 100 100 100 100 100 100 100 100 100 100 
100 100 100 100 100 100 100 100 100 100 100 100 100 100 
##$AQSEQ= 0
##$AQ_mod= 1
##$AUNM= <au_zg>
##$AUTOPOS= <>
##$BF1= 200.13
##$BF2= 200.13
##$BF3= 200.13
##$BF4= 200.13
##$BF5= 200.13
##$BF6= 200.13
##$BF7= 200.13
##$BF8= 200.13
##$BYTORDA= 1
##$CFDGTYP= 0
##$CFRGTYP= 5
##$CHEMSTR= <none>
##$CNST= (0..31)
1 1 145 1 1 1 1 1 1 1 1 1 1 1 1 1 1 1 1 1 1 1 1 1 1 1 1 1 1 1 1 1 
##$CPDPRG= <>
##$CPDPRG1= <>
##$CPDPRG2= <>
##$CPDPRG3= <>
##$CPDPRG4= <mlev>
##$CPDPRG5= <mlev>
##$CPDPRG6= <mlev>
##$CPDPRG7= <mlev>
##$CPDPRG8= <mlev>
##$CPDPRGB= <>
##$CPDPRGT= <>
##$D= (0..31)
0 1.2 0 0 0 0 0 0 0 0.06 0 0.03 0 0 0 0 0.0002 0 0 0 0 0 0 0 0 0 0 0 0 
0 0 0 
##$DATE= 1569324737
##$DBL= (0..7)
120 120 120 120 120 120 120 120 
##$DBP= (0..7)
150 150 150 150 150 150 150 150 
##$DBP07= 0
##$DBPNAM0= <>
##$DBPNAM1= <>
##$DBPNAM2= <>
##$DBPNAM3= <>
##$DBPNAM4= <>
##$DBPNAM5= <>
##$DBPNAM6= <>
##$DBPNAM7= <>
##$DBPOAL= (0..7)
0.5 0.5 0.5 0.5 0.5 0.5 0.5 0.5 
##$DBPOFFS= (0..7)
0 0 0 0 0 0 0 0 
##$DE= 6
##$DECBNUC= <off>
##$DECIM= 24
##$DECNUC= <off>
##$DECSTAT= 4
##$DIGMOD= 1
##$DIGTYP= 9
##$DL= (0..7)
0 120 120 120 120 120 120 120 
##$DP= (0..7)
150 150 150 150 150 150 150 150 
##$DP07= 0
##$DPNAME0= <>
##$DPNAME1= <>
##$DPNAME2= <>
##$DPNAME3= <>
##$DPNAME4= <>
##$DPNAME5= <>
##$DPNAME6= <>
##$DPNAME7= <>
##$DPOAL= (0..7)
0.5 0.5 0.5 0.5 0.5 0.5 0.5 0.5 
##$DPOFFS= (0..7)
0 0 0 0 0 0 0 0 
##$DQDMODE= 0
##$DR= 18
##$DS= 0
$$ [...]
##$SUBNAM2= <"">
##$SUBNAM3= <"">
##$SUBNAM4= <"">
##$SUBNAM5= <"">
##$SUBNAM6= <"">
##$SUBNAM7= <"">
##$SUBNAM8= <"">
##$SUBNAM9= <"">
##$SW= 24.0689530833862
##$SWIBOX= (0..15)
0 0 2 0 0 0 0 0 0 0 0 0 0 0 0 0 
##$SW_h= 4816.95568400771
##$TD= 16384
##$TD0= 1
##$TE= 0
##$TE2= 300
##$TE3= 300
##$TEG= 300
##$TL= (0..7)
0 120 120 120 120 120 120 120 
##$TP= (0..7)
150 150 150 150 150 150 150 150 
##$TP07= 0
##$TPNAME0= <>
##$TPNAME1= <>
##$TPNAME2= <>
##$TPNAME3= <>
##$TPNAME4= <>
##$TPNAME5= <>
##$TPNAME6= <>
##$TPNAME7= <>
##$TPOAL= (0..7)
0.5 0.5 0.5 0.5 0.5 0.5 0.5 0.5 
##$TPOFFS= (0..7)
0 0 0 0 0 0 0 0 
##$TUNHIN= 0
##$TUNHOUT= 0
##$TUNXOUT= 0
##$USERA1= <user>
##$USERA2= <user>
##$USERA3= <user>
##$USERA4= <user>
##$USERA5= <user>
##$V9= 5
##$VALIST= <valist>
##$VCLIST= <CCCCCCCCCCCCCCC>
##$VD= 0
##$VDLIST= <DDDDDDDDDDDDDDD>
##$VPLIST= <PPPPPPPPPPPPPPP>
##$VTLIST= <TTTTTTTTTTTTTTT>
##$WBST= 1024
##$WBSW= 4
##$XGAIN= (0..3)
0 0 0 0 
##$XL= 0
##$YL= 0
##$YMAX_a= 248105
##$YMIN_a= -138559
##$ZGOPTNS= <>
##$ZL1= 120
##$ZL2= 120
##$ZL3= 120
##$ZL4= 120
##$ABSF1= 10
##$ABSF2= 0
##$ABSG= 5
##$ABSL= 3
##$ALPHA= 0
##$AQORDER= 0
##$ASSFAC= 0
##$ASSFACI= 0
##$ASSFACX= 0
##$ASSWID= 0
##$AUNMP= <proc_1d>
##$AZFE= 0.1
##$AZFW= 0.1
##$BCFW= 1
##$BC_mod= 2
##$BYTORDP= 1
##$COROFFS= 0
##$CY= 11.3945322036743
##$DATMOD= 1
##$DC= 2
##$DFILT= <>
##$DTYPP= 0
##$F1P= 20.1720416913024
##$F2P= 0.152960286110954
##$FCOR= 0.5
##$FTSIZE= 0
##$FT_mod= 4
##$GAMMA= 1
##$GB= 0.15
##$INTBC= 1
##$INTSCL= 1
##$ISEN= 128
##$LB= 0.24
##$LEV0= 0
##$LPBIN= 0
##$MAXI= 10000
##$MC2= 0
##$MEAN= 0
##$ME_mod= 0
##$MI= 1.114404
##$NCOEF= 0
##$NC_proc= 0
##$NLEV= 6
##$NOISF1= 3.799351
##$NOISF2= 2.8
##$NSP= 1
##$NTH_PI= 0
##$NZP= 0
##$OFFSET= 15.70392
##$PC= 1
##$PHC0= -9575.062
##$PHC1= 22.20095
##$PH_mod= 1
##$PKNL= yes
##$PPARMOD= 0
##$PSCAL= 0
##$PSIGN= 0
##$REVERSE= no
##$SF= 200.130013532006
##$SI= 16384
##$SIGF1= 3
##$SIGF2= 2
##$SINO= 400
##$SIOLD= 16384
##$SREGLST= <1H.CDCl3>
##$SSB= 0
##$STSI= 0
##$STSR= 0
##$SW_p= 3612.71676300578
##$SYMM= 0
##$S_DEV= 0
##$TDeff= 0
##$TDoff= 0
##$TI= <>
##$TILT= no
##$TM1= 0
##$TM2= 0
##$TOPLEV= 0
##$USERP1= <user>
##$USERP2= <user>
##$USERP3= <user>
##$USERP4= <user>
##$USERP5= <user>
##$WDW= 1
##$XDIM= 8192
##$YMAX_p= 0
##$YMIN_p= 0
$$ End of Bruker specific parameters
$$ ---------------------------------
##NTUPLES= NMR FID
##VAR_NAME=  TIME,          FID/REAL,        FID/IMAG
##SYMBOL=    X,             R,               I
##VAR_TYPE=  INDEPENDENT,   DEPENDENT,       DEPENDENT
##VAR_FORM=  AFFN,          ASDF,            ASDF
##VAR_DIM=   8192,          8192,            8192
##UNITS=     SECONDS,       ARBITRARY UNITS, ARBITRARY UNITS
##FACTOR=    0.0002076,     1,               1
##FIRST=     0,             0,               0
##LAST=      1.7004516,     0,               0
##MIN=       0,             -138559,         0
##MAX=       1.7004516,     248105,          0
$$ Real data points
##PAGE= N=1
##DATA TABLE= (X++(R..R)), XYDATA
0@%%%%%%Qj6J6j6J7k5L2m0M8n6P2q4J00j20J37j57J81k10K43k80L20l64M15m69
$$ 0 0 0 0 0 0 0 8 -8 8 -8 9 -16 16 -24 24 -32 40 -44 56 -64 73 -84 97 -113 130 -150 170 -194 221 -248
30b48N27n93O66p45Q34r31J036j152J278j418J571j739J926k133K362k619K910
$$ -248 279 -314 352 -393 441 -490 546 -606 672 -746 825 -914 1012 -1121 1241 -1378 1532
47A532l239L614m044M550n159N895o811P993r581J1847j5371K1670l6466J37351
$$ 1532 -1707 1907 -2137 2413 -2746 3149 -3662 4331 -5250 6597 -8774 12896 -23570 113781
61A13781J34324p3886L0518J5477J7542m0517k1601o634K5764o32j7763k9666
$$ 113781 248105 174219 204737 220214 237756 197239 175638 169004 194768 194136 176373 146707
73A46707K857J4635Q048k4787k5567j1856J0349K23j7392l2885j8407K100R952
$$ 146707 149564 164199 172247 147460 121893 110037 120386 120609 103217 70332 51925 54025 63977
86F3977j0955k9459k1804Q420J7486n432l1976k3327O722J8574r859l7230k8275
$$ 63977 53022 23563 1759 10179 27665 22233 -9743 -33070 -26348 -7774 -17633 -54863 -83138
99h3138N815J5518r786l3867k2349R917K0132j885k4489j4427J4898K3760J665
$$ -83138 -77323 -61805 -71591 -105458 -127807 -117890 -97758 -99643 -124132 -138559 -123661 -99901 -98236
112i8236j8975j2087J0174J7550M823j2808j3481J810J6397J1774p425j4419J265
$$ -98236 -117211 -129298 -119124 -101574 -96751 -109559 -123040 -121230 -104833 -93059 -100484 -114903 -113638
125a13638K0349J7100l312j5324k075K0148K1401k581j9274m991K2169K4069l769
$$ -113638 -93289 -76189 -79501 -94825 -96900 -76752 -55351 -57932 -77206 -82197 -60028 -35959 -39728
138c9728k0754k670K3582K3663k671j7763k033K1793K0694j679j5764k674J7878
$$ -39728 -60482 -63152 -39570 -15907 -18578 -36341 -38374 -16581 4113 2434 -13330 -16004 1874
151A874J7891p76j2651m062J3197J6669L080j0184o755Q217J6264P528q917j1266
$$ 1874 19765 18989 6338 2276 15473 32142 35222 25038 18283 26500 42764 50292 41375 30109
165C0109L511J7209J0833r038j5699J671J9012J2414j0409j7885M36J9133J1566
$$ 30109 33620 50829 61662 52624 36925 38596 57608 70022 59613 41728 42164 61297 72863
178G2863j1501j8839r14J7932J1087j2385j8881q81J6466Q771j1638j6582j471
$$ 72863 61362 42523 41609 59541 70628 58243 39362 38481 54947 63718 52080 35498 34027
191C4027J1389P683p971j4780n501P302P375m286j3653q771N028Q355j799j3737
$$ 34027 45416 53099 45128 30348 24847 32149 39524 35238 21585 12814 17842 26197 24398 10661
205A0661j2112K067J0399J436j4371j5536J164J3182L612j5619j6198L004J5394
$$ 10661 -1451 616 11015 12451 -1920 -17456 -16292 -3110 502 -15117 -31315 -28311 -12917
218a2917L895j5897j5551L652J5429K519j5027j4853L228J2912K766j1602j0589
$$ -12917 -9022 -24919 -40470 -36818 -21389 -18870 -33897 -48750 -45522 -32610 -29844 -41446 -52035
231e2035L442J2787N616o025p548L171J1621P814k933q254k443Q212R444l52r817
$$ -52035 -48593 -35806 -30190 -36215 -43763 -40592 -28971 -21157 -24090 -32344 -34787 -26575 -17131 -17483 -27300
246b7300n818P985J4393L282q955m572J1771J8259M347r844o443J1105J6393J415
$$ -27300 -33118 -25133 -10740 -7458 -16413 -20985 -9214 9045 13392 3548 -2895 8210 24603 26018
260B6018j3893q445Q681J3446l07j2566o042R682J3761K275q012l926Q160J1427
$$ 26018 12125 3680 12361 25807 25500 12934 6892 16574 30335 32610 24598 20672 28832 40259
274D0259K053p343p060J322N321J099p263j0494l185N343N024m184j0328l488
$$ 40259 42312 34969 27909 29231 34552 35651 28388 17894 14709 20052 25076 20892 10564 7076
288G076Q267R197k897j2418o532P542Q163o040j7203q251O675Q068p003j5013
$$ 7076 15343 24540 21643 9225 2693 10235 18398 12358 -4845 -13096 -6421 1647 -5356 -20369
302b0369n027J0075R376m146j1066k095R690P981l799j0054l466M454M735l436
$$ -20369 -25396 -15321 -5945 -10091 -21157 -23252 -13562 -5581 -9380 -19434 -22900 -18446 -13711 -17147
316a7147q858n273J871N203J922m886n281Q98Q370O517l235p612m78R910P794
$$ -17147 -26005 -31278 -29407 -24204 -22282 -27168 -32449 -31551 -23181 -16664 -19899 -27511 -27989 -18079 -10285
331a0285m703j0333m47J1644Q185n263j0238R94J2611Q464n506r133K494J1644
$$ -10285 -14988 -25321 -25768 -14124 -5939 -11202 -21440 -20446 -7835 629 -4877 -14010 -11516 128
345A28O985n563p732K362J0269N527l688m839K135P653N628r76l734p26L949N405
$$ 128 7113 1550 -6182 -3820 6449 11976 8288 3449 5584 13237 18865 17889 14155 13429 17378 22783
361B2783J085l994m824J642P087L386m489p144K124J0216N210o381q931J458J0782
$$ 22783 23868 19874 15050 16692 23779 27165 22676 15532 17656 27872 33082 26701 17770 19228 30010
376C0010L829r658j0488K023R552J547j0175q749L599Q717P93p584o493K784N332
$$ 30010 33839 24181 13693 15716 25268 26815 16640 7891 11490 20207 21000 13416 6923 9707 15039
391A5039m31p341o326j107Q51j838n425o332l927N30K404l85n082l959K764Q039
$$ 15039 14608 7267 941 -166 685 -1153 -6578 -12910 -16837 -16307 -13903 -14288 -19370 -23329 -20565 -12526
407a2526K573o183n849L735Q676O31r699p380L704Q590n66j0578n701O540R035
$$ -12526 -9953 -16136 -21985 -18250 -9574 -8943 -18642 -26022 -22318 -13728 -14294 -24872 -30573 -24033 -14998
422a4998l00p936k576P054P516r85o215j792M615M493q65l392j158K051L965K795
$$ -14998 -15298 -23234 -25810 -18756 -11240 -12225 -18440 -20232 -15617 -11124 -11989 -15381 -16539 -14488 -10523 -7728
438g728K09j233J35M503O019J258l732k228M950O722K67p292l923O142Q028j612
$$ -7728 -7519 -8752 -8617 -4114 1905 3163 -569 -2797 2153 8875 9142 1850 -2073 4069 12097 10485
454A0485q663k240P993P776k548p563n55Q147O179k929o398M02O493M499k968
$$ 10485 1822 -418 7575 15351 12803 5240 4685 12832 19011 16082 9684 10086 16579 21078 18110
469A8110m045M16M026K932j041k595p67J277J825J599j627l453q51L358M161j605
$$ 18110 14065 14481 18507 21439 20398 17803 17036 18313 20138 21737 20110 16657 15806 19164 23325 21720
485B1720n707j354N632M292l195p254k265N562L465n816q692j819N729J896o532
$$ 21720 16013 14659 20291 24583 21388 14134 11869 17431 20896 15080 6388 4569 10298 12194 5662
500E662p893L38N577J471n648n271L98M308K37m241m268m35J490J86k230l442
$$ 5662 -2231 -1893 3684 5155 -493 -5764 -5366 -1058 -821 -5062 -9330 -9765 -8275 -8089 -10319 -13761
516a3761k345L33J593L62k707l605O6L945J926l422m759k43N231K689m405n678
$$ -13761 -16106 -15773 -14180 -13818 -16525 -20130 -20064 -16119 -14193 -17615 -22374 -22617 -17386 -14697 -19102 -24780
532b4780J333O976K762n029m539K937P139J678m934l515L309N997N87m341k367
$$ -24780 -23447 -16471 -13709 -18738 -23277 -20340 -13201 -11523 -16457 -19972 -16663 -10666 -10079 -14420 -16787
547a6787L238M452J218k466j186K305L340J016p01j064j0R46J863J152k364k255
$$ -16787 -13549 -9097 -7879 -10345 -11531 -9226 -5886 -4870 -5571 -6635 -6645 -5699 -3836 -2684 -5048 -7303
563g303J181M837K230l223k498L158N762J644m410l389K615N670n92o293m132
$$ -7303 -6122 -1285 945 -2278 -4776 -1618 4144 5788 1378 -2011 604 6274 5682 -611 -4743
578d743L203N502r55m702j226N629O301M34k513J451M318L680k16k269p97K5N07
$$ -4743 -1540 3962 3007 -1695 -2921 2708 9009 9443 6930 8381 12699 16379 16163 13894 13097 13122 13629
595A3629q59j850j974q70J399K346J355j242l62K941N208J449l201k989K311L837
$$ 13629 12770 10920 8946 8076 9475 11821 13176 11934 11572 14513 19721 21170 17969 14980 17291 21128
611B1128j462o710m067K877L595k400n496l26N342M596j295l399N18N055J885
$$ 21128 19666 12956 8889 11766 15361 12961 7465 7139 12481 17077 15782 12383 12901 17956 19841
626A9841k946n028j367P97j197m135l837q32r47m75l8N50o61k23J842K860k73
$$ 19841 16895 11867 10500 11297 10100 5965 2128 1296 349 -126 -164 386 -275 -498 1344 4204 3931
643C931l041k168R94J337k929n895l484J508K489l357n454n89N336L943k549l830
$$ 3931 890 -1278 -284 1053 -1876 -7771 -11255 -9747 -7258 -10615 -16069 -16658 -11322 -7379 -9928 -13758
659a3758J649M960J615l608l883N47K624j159l842k422P90J335p4j018K46R09
$$ -13758 -12109 -7149 -5534 -9142 -13025 -12478 -9854 -11013 -14855 -17277 -16487 -15152 -15226 -16244 -15998 -15089
675a5089J619J166J241M36o69l61J490K144j082l175j265L037L512j814l554Q69
$$ -15089 -13470 -12304 -11063 -10627 -11296 -11657 -10167 -8023 -9105 -12280 -13545 -10508 -6996 -8810 -12364 -11495
691a1495N341L065k848k642J862N287J514l627l155K516M086rl852k187L024K984
$$ -11495 -6154 -3089 -5937 -8579 -6717 -1430 84 -3543 -6698 -4182 -96 -105 -3957 -6144 -3120 -136
707a36o88k153N09J810J056k59J36P48L06O6Q18J151N5r36k22K414J997j210k311
$$ -136 -824 -2977 -2468 -658 398 139 275 1023 1329 1395 2213 3364 3419 2483 2261 4675 6672 5462 3151
726C151N77M040K114k851k681K172M597J111l879k288L580M258l05m006p71L567
$$ 3151 3728 7768 9882 7031 4350 6522 11119 12230 8351 6063 9643 13901 13596 9590 8819 12386
742A2386K722j475k780O19K577O02r69j567P77P97q2q76o34K28j535r42L9O09
$$ 12386 15108 13633 10853 11472 14049 14651 13682 12115 12892 13689 13607 12731 12097 12325 10790 9848 9887 10496
760A0496j880k824m94K180K06l709k829O40K993j014m893l345K138K472k407n289
$$ 10496 8616 5792 5298 7478 7684 3975 1146 1786 4779 3765 -1128 -4473 -2335 137 -2270 -7559
776g559j751K272J783k544m119N76L378R15k163k178R19K044r57k222j213j28
$$ -7559 -9310 -7038 -5255 -7799 -11918 -11342 -7964 -7049 -9212 -11390 -10471 -8427 -9384 -11606 -12819 -12947
792a2947j053k017n15P88k52j230O91K593K162k17Q6L214M416J351k029m80L385
$$ -12947 -14000 -16017 -16532 -15744 -15996 -17226 -16535 -13942 -11780 -11997 -11911 -8697 -4281 -2930 -4959 -5439 -2054
809b054L172j650m029K43L890K547j998k658K278M657J687j548q48K032K355j16
$$ -2054 1118 -532 -4561 -4318 -428 2119 121 -2537 -259 4398 6085 4537 3689 5721 8076 7960
825G960k506j426P59j74j210j400P47R36P48R87K530K558N87J022K660L031J08
$$ 7960 5454 4028 4787 4613 3403 2003 2750 3686 4434 5421 7951 10509 11096 12118 14778 17809 17917
842A7917k727j472R20N48l272m810j818J255L41l333k448R98L165R01k131j318
$$ 17917 15190 13718 14638 15186 11914 7104 5286 6541 6882 3549 1101 2099 5264 6165 4034 2716
858B716K342K554j019l171j486J130L97j673k244n39Q87j22o18R2R12j66p72j41
$$ 2716 5058 7612 6593 3422 1936 3066 3463 1790 -454 -993 -106 -228 -846 -754 158 -8 -780 -921
876i21R4j173k295k275l11l92l288l371j327J420M86k581k005J508L258P19j480
$$ -921 -827 -2000 -4295 -6570 -6881 -7273 -10561 -13932 -15259 -13839 -13353 -15934 -17939 -16431 -13173 -12454 -13934
893a3934j370K284K541l34k342r26J931J391j490k066N01K487N49q32k27J504
$$ -13934 -15304 -13020 -10479 -10813 -13155 -14081 -12150 -10759 -12249 -14315 -13814 -11327 -10778 -11610 -11837 -10333
909a0333J368P50L7Q64J013K81L06J573J256J112p68J019K599K122n70o30J668
$$ -10333 -8965 -8215 -8178 -7314 -6301 -6020 -5714 -4141 -2885 -1773 -2541 -1522 1077 3199 2629 1999 3667
926C667K760R20j602o81K268L021J07j938k49L212K277l65j604Q55K454J315j644
$$ 3667 6427 7347 5745 5064 7332 10353 10460 8522 8273 11485 13762 13397 11793 12648 15102 16417 14773
943A4773j241Q70J093l39j295k67L00L48p64p8M46N47r15r88N00N19j203j964
$$ 14773 13532 14402 15495 15156 13861 13594 13894 14242 13478 13400 13846 14393 13478 12490 12990 13509 12306 10342
961A0342k72J037n13k911j971N91J063m33l373j075K125J142j680l091l25J970
$$ 10342 10070 11107 10594 7683 5712 6303 7366 6933 3560 2485 4610 5752 4072 981 656 2626
977B626m52l059k611L74P83j430l027j092K17K15j579j627n9Q81p73j213m45J014
$$ 2626 2174 -885 -3496 -3122 -2339 -3769 -6796 -7888 -7671 -7456 -9035 -10662 -10721 -9840 -10613 -11826 -12271 -11257
995a1257j231q07l73R47j03j628j432J143J999m87k099k85K060J758j269j838
$$ -11257 -12488 -13295 -13668 -12721 -12824 -14452 -15884 -14741 -12742 -13229 -15328 -15613 -13553 -11795 -13064 -14902
1011a4902O19K787J116j555r11J277L240O07j366K23K619J831n26q18J213J776
$$ -14902 -14283 -11496 -10380 -11935 -12846 -11569 -8329 -7722 -9088 -8865 -6246 -4415 -4941 -5759 -4546 -2770
1027b770P48r21Q94J458J334K87K90J622K294M26k90J197K285L75j271j51J599
$$ -2770 -2022 -2943 -2049 -591 743 1030 1320 2942 5236 5662 5372 6569 8854 9229 7958 7807 9406
1044I406J836j410j837O40K695J548j757j019K485K803J27j756l38K262J937k084
$$ 9406 11242 9832 7995 8635 11330 12878 11121 10102 12587 15390 15517 13761 13423 15685 17622 15538
1060A5538k118m00J359k49k316j319R48O27j212j233J94J048q52j459l96L37j005
$$ 15538 13420 13020 14379 14130 11814 10495 11443 12070 10858 9625 9819 10867 10015 8556 8160 8497 7492
1077G492k241j751J08j6k341k951p22J489m59k370j895R26J105o65l422j266R56
$$ 7492 5251 3500 3608 3592 1251 -1700 -2422 -933 -1392 -3762 -5657 -4731 -3626 -4291 -7713 -8979 -8023
1094h023O56k723l119k79Q87j78k611j796R17J020j228j380M28J078M07j273k7
$$ -8023 -7367 -10090 -13209 -13488 -12601 -12779 -15390 -17186 -16269 -15249 -16477 -17857 -17429 -16351 -15944 -17217 -17244
1111a7244J124M70m56k92J473J492M93o33M83K498J798j209m58J862K813M79j423
$$ -17244 -16120 -15650 -16106 -16398 -14925 -13433 -12940 -13573 -13090 -10592 -8794 -10003 -10461 -8599 -5786 -5307 -6730
1128f730K81K948K741j89m63J836L650J648n45k29K530K188j6q34K56J645O42
$$ -6730 -6449 -3501 -760 -949 -1412 424 4074 5722 5177 4948 7478 9666 9650 8816 9072 10717 11359
1145A1359j308l65J202J031Mk35J190K033K47l78M69J731O33j720j267O71R96
$$ 11359 10051 9686 10888 11919 11923 11688 12878 14911 15158 14780 15249 16980 17613 15893 14626 15297 16293
1162A6293j006k445j096J252J194j416k102O51J996j46j952j720L85M11j988l700
$$ 16293 15287 12842 11746 12998 14192 12776 10674 11325 13321 13175 11223 9503 9888 10299 8311 4611
1178D611j987M38j124k593j909j0Q15q46j050N53J270J75n79n21L11R9j672j903
$$ 4611 2624 3062 1938 -655 -2564 -2574 -1759 -2605 -3655 -3102 -1832 -1657 -2236 -2757 -2446 -2347 -4019 -5922
1196e922j011j83j317k662k029M87J017j581j736n3K430K36j672q59J259J449
$$ -5922 -6933 -7116 -8433 -11095 -13124 -12637 -11620 -13201 -14937 -14990 -12560 -12324 -13996 -14855 -13596 -12147
1212a2147j006k231j41J455O92n57j151J605K131Q46j11J156K136J705O56n41
$$ -12147 -13153 -15384 -15525 -14070 -13378 -13935 -15086 -13481 -11350 -10504 -10615 -9459 -7323 -5618 -4962 -5503
1228e503J109J614l94o74P14Q07L99q36j50J804J735N39p19J321K554J301j62
$$ -5503 -4394 -2780 -3174 -3848 -3134 -2327 -1928 -2764 -2914 -1110 625 1164 445 1766 4320 5621 5459
1245E459j85J596K013L78j292j83J670J094l71j325O24J723R5r64o53Q63R12m01
$$ 5459 5274 6870 8883 9261 7969 7786 9456 10550 10179 8854 9478 11201 11296 10332 9679 10542 11454 11053
1263A1053j637J24J152m48j039q69M15l61m55o82j55M11o25j443q63P88O12j532
$$ 11053 9416 9540 10692 10244 9205 8336 8751 8390 7935 7253 7098 7509 6884 5441 4578 5366 5978 4446
1281D446k094L97R50l24k070j026Q52M89j020j894j35J180o0j932j301K17O18
$$ 4446 2352 2749 3699 3375 1305 279 1131 1620 600 -1294 -1429 -249 -309 -2241 -3542 -3325 -2707
1298b707n17j810l69P21J04j393q36K56K65j47j570m21R87Q0j206q43J098P08
$$ -2707 -3224 -5034 -5403 -4682 -4578 -5971 -6807 -6551 -6286 -6433 -8003 -8424 -7437 -7357 -8563 -9406 -8308 -7600
1316g600o33j071L38R04K04j304o37J246R93m71j409N0J588J218p17l11J189K256
$$ -7600 -8233 -9304 -8966 -8062 -7858 -9162 -9799 -8553 -7560 -8031 -9440 -9390 -7802 -6584 -7301 -7612 -6423 -4167
1334d167M16o95L13K044P89k85q58R44J385N14n55K02J798J054K40J03J454J840
$$ -4167 -3751 -4446 -4133 -2089 -1300 -1585 -2443 -1499 -114 400 -155 47 1845 2899 3139 3242 4696 6536
1352F536L70m49N26J481O09j247j183Q38J641q13j316L06K028J120o68n17J813
$$ 6536 6906 6457 6983 8464 9073 7826 6643 7481 9122 8309 6993 7299 9327 10447 9779 9262 11075
1369A1075J695L19j455m03P24L92j509k500r12M43l36k067j476O78Q64p52j098
$$ 11075 12770 13089 11634 11231 11955 12347 10838 8338 7426 7869 7533 5466 3990 4668 5532 4780 3682
1386C682L98J528m17j669n39N75o21k042k181o86K5j523j825o78J123P97j086
$$ 3682 4080 5608 5191 3522 2983 3558 2937 895 -1286 -1972 -1947 -3470 -5295 -5973 -4850 -4053 -5139
1403e139j230R21J898j42k041j000Q59K09k186k104q18R31m62j718p64J129J583
$$ -5139 -6369 -5448 -3550 -3692 -5733 -6733 -5874 -5665 -7851 -9955 -10773 -9842 -10304 -12022 -12786 -11657 -10074
1420a0074q2l11R00J858J034r17m87J148R29j328r67J41R90k06q95K98K200J556
$$ -10074 -10156 -10467 -9567 -7709 -6675 -7592 -8079 -6931 -6002 -7330 -8297 -8156 -7166 -7372 -8267 -7969 -5769 -4213
1438d213K72k93J647K242J059j010p7K068R59o98j015k19J774L77j239l03J321
$$ -4213 -3941 -4234 -2587 -345 714 -296 -373 1695 2654 1956 941 722 2496 2873 1634 1331 2652
1455B652J913K31n88L30J976P57j091k84J017O61o78j271K49R58J77j184q09J156
$$ 2652 4565 4796 4208 4538 6514 7271 6180 5896 6913 7574 6896 5625 5874 6832 7009 5825 5016 6172
1473F172J055q32j007K66J309J23j751j169R22P95p07k012L7J083k28j841o57
$$ 6172 7227 6395 5388 5654 6963 7086 5335 4166 5088 5883 5176 3164 3201 4284 4056 2215 1558
1490A558N77Q55l76j378l55J033L37j282j130J68J308m89j433k21Q71N69j184
$$ 1558 2135 2990 2614 1236 881 1914 2251 969 -161 7 1315 826 -607 -828 43 612 -572
1507e72p64N31P49m06j591k68R07M54j224j083P96R05o06j140j7J122O02j242
$$ -572 -1336 -805 -56 -462 -2053 -2321 -1414 -960 -2184 -3267 -2471 -1566 -2172 -3312 -3329 -2207 -1605 -2847
1525b847j295O51Q07R0j703n70J487P62j196j129O92J283j69j269J41J018O48
$$ -2847 -4142 -3491 -2684 -2594 -4297 -4867 -3380 -2618 -3814 -4943 -4251 -2968 -3137 -4406 -4265 -3247 -2599
1542b599p65n49N19J043J43p38m13J558P22o86r90N94J865m47j062L22J256Q48
$$ -2599 -3364 -3913 -3394 -2351 -2208 -2946 -3359 -1801 -1079 -1765 -2755 -2161 -296 -743 -1805 -1483 -227 621
1560F21o37j018Q45J593J65j119L4J176R93o05j074K15J405l93r66o91N56N82
$$ 621 -16 -1034 -189 1404 1569 450 484 1660 2653 2048 974 1189 2594 2201 1235 544 1100 1682
1578A682l61j389O37J545K71p66q4J094Q76k02j145N83N48Rj159o45O66J5q04
$$ 1682 1321 -68 569 2114 2385 1619 1535 2629 3505 3303 2158 2741 3289 3298 2139 1494 2160 2175 1371
1597A371r45J82J096K10j000k30O74R73p14j217j69J157n05j589j176R33R87j65
$$ 1371 426 608 1704 1914 914 684 1358 2331 1617 400 231 1388 883 -706 -1882 -949 38 -127
1615a27n55O3J363O39Q9k39P94J184j50j331q15Q04o11j305j741K10J73o11j291
$$ -127 -682 -619 744 1383 1472 1233 2027 3211 3061 1730 915 1719 1108 -197 -1938 -1728 -1555 -2166 -3457
1634c457j97J246L78l01o08P78J341n00j183K82P84Q15j262r18L94R66J79q73
$$ -3457 -3654 -2408 -2030 -2331 -2939 -2161 -820 -1320 -2503 -2221 -1437 -622 -1884 -2802 -2408 -1442 -1263 -2136
1652b136k94J461O77m00m73N35J067o72n95m38M39O43r72p64L28J171j77l49J60
$$ -2136 -2430 -969 -292 -692 -1165 -630 437 -235 -830 -1268 -829 -186 -1158 -1922 -1594 -423 -600 -949 -789
1671g89J123R89m92n30Q85J371k6j009q4R32N58p40r51M73R90l32j150m41R53
$$ -789 334 1323 831 301 1186 2557 2531 1522 1438 2370 2928 2188 1237 1710 2700 2368 1218 777 1730
1690A730M98o69j166J01O65J48j206l59M45J088m96j147N94Q47n3j003n29L85
$$ 1730 2228 1559 393 494 1159 1307 101 -258 187 1275 779 -368 226 1073 1020 17 -512 -127
1708a27N91p82j648K83J095j91r11n25J621Q05k03r89Q57J060L94r37o79M85J210
$$ -127 464 -318 -1966 -1683 -588 -779 -1690 -2215 -594 211 8 -981 -124 936 1330 393 -286 199 1409
1727A409o70j440j26J166n5r29n53J016J353m06q59K87J553R3j037q26N53K42
$$ 1409 739 -701 -827 339 284 -645 -1198 -182 1171 765 -94 193 1746 1839 802 -24 529 771
1745G71n54j406M5R82J58r77p88J362J239l33r47L77J502k42r59j191O86Q40j605
$$ 771 217 -1189 -1144 -162 -4 -981 -1769 -407 832 499 -448 -71 1431 1189 230 -961 -275 565 -1040
1764a040j488j03P49K77r44o73P75J469n65p55J5J405P01j156p17R21O06l22j379
$$ -1040 -2528 -2631 -1882 -1605 -2549 -3222 -2447 -978 -1543 -2298 -2283 -878 -177 -1333 -2050 -1129 -523 -845 -2224
1783b224O6J217L34q00n29Q89R19J47q34N46J063N75r59q95J028O81K3j668L84
$$ -2224 -2158 -941 -607 -1407 -1936 -1047 -128 19 -815 -269 794 1369 410 -485 543 1224 1247 -421 -37
1802c7J389M36j055l88M96J339l9r15l9J250M09l81r88L81J247l32j122p4J127
$$ -37 1352 1788 733 345 841 2180 2141 1226 1187 2437 2846 2465 1477 1858 3105 2773 1651 1577 2704
1821B704L30q85r53P46M88L6j159n27J211M65j189o25M86J226n55j137q0Q59P08
$$ 2704 3034 2149 1196 1942 2430 2466 1307 780 1991 2456 1267 642 1128 2354 1799 662 582 1441 2149
1840B149j356r75K99J104q07j328n26J010K04l87j234K69J160k78j231m08J016
$$ 2149 793 -182 117 1221 414 -914 -1440 -430 -226 -613 -1847 -1578 -418 -696 -1927 -2335 -1319
1857a319M98q79r13R9R76k61j161k98J074N38n04r31O91R37Jr38m08J129O25k23
$$ -1319 -821 -1700 -2613 -2514 -1538 -1799 -2960 -3258 -2184 -1646 -2150 -3081 -2390 -1453 -1452 -2390 -2798 -1669 -1044 -1267
1877a267j155K04P55K13o56l70J007J018p61r23K22J126J13j082j24P52Q67o17
$$ -1267 -2422 -2218 -1463 -1250 -1906 -2276 -1269 -251 -1012 -1935 -1713 -587 -474 -1556 -1680 -928 -61 -678
1895f78q77N99R06O37q09m06Q92Q52l55r59J94N49L36j298j59Q13N03J8q50P10
$$ -678 -1555 -956 -50 587 -222 -628 264 1116 761 -198 -4 545 881 -417 -576 237 740 758 -92 618
1915F18J367L19n81rQ13J053m33j199J07L76J94j357r33O12P23l04l92J99J333
$$ 618 1985 2304 1723 1714 2527 3580 3147 1948 2055 2431 2625 1268 335 947 1670 1366 974 1173 2506
1934B506O25l02n01M10J351k51r18q4O60j46j190m39p6L70M6p96k6J216K74q27
$$ 2506 3131 2829 2328 2738 4089 3838 2920 2836 3496 3350 2160 1721 1645 2015 2061 1265 1239 2455 2729 1902
1954A902p21N5N73r56j483p70K43o69j460r28M84M10q7n88K66J104J154j55l96
$$ 1902 1181 1236 1809 853 -630 -1400 -1157 -1826 -3286 -4214 -3730 -3320 -3407 -3995 -3729 -2625 -1471 -1626 -2022
1973b022O52P22k6j472l23K97Qj106j233K32O02J1q20p3J218N47j54m26N42J086
$$ -2022 -1370 -648 -674 -2146 -2469 -2172 -2164 -3270 -4503 -4271 -3669 -3658 -4478 -4551 -3333 -2786 -2940 -3366 -2824 -1738
1993a738N6n51n37Q58P39n01o10M23J582M38o85O03J335J008k89o79M52J048m26
$$ -1738 -1682 -2233 -2770 -1912 -1173 -1674 -2284 -1861 -279 159 -526 77 1412 2420 2131 1452 1904 2952 2526
2012B526j207k93K44O84q03j015Q2L99L04n00L68N83Q85k32l19m7J403J40p07
$$ 2526 1319 1026 1270 1954 1151 136 218 617 921 421 789 1372 2257 2025 1706 1659 3062 3202 2495
2031B495o58N00R80p60r27Q7P20P09j263l67O86Q03l77j603M22O68K70o79j174
$$ 2495 1837 2337 3317 2557 1630 1717 2437 3146 1883 1516 2202 3005 2628 1025 1447 2115 2385 1706 532
2050E32M81J217m66j196p1R03L15j284m98P41Q37k50j101l9Q56j32n87q48N81
$$ 532 1013 2230 1764 568 497 1400 1715 431 -67 674 1511 1261 160 121 977 845 258 -590 -9
2069iN64m94j267K33N95p0q27n07K76J117o07j206j98P24L82p73j062R88P16m68
$$ -9 555 61 -1206 -973 -378 -448 -1275 -1782 -1506 -389 -996 -2202 -2400 -1676 -1294 -2067 -3129 -2141 -1425 -1893
2089a893q06l95J060o8l93q55N20P40L70j050k27R22L09m81j093Q52R05k96j487
$$ -1893 -2699 -3094 -2034 -2102 -2495 -3350 -2830 -2090 -1720 -2770 -2997 -2075 -1766 -2247 -3340 -2488 -1583 -1879 -3366
2108c366L63J084M54m59p08R41N48M75q26n7R19N77o51o72N50Q82m9j193Q6J163
$$ -3366 -3003 -1919 -1465 -1924 -2632 -1691 -1143 -668 -1494 -1551 -632 -55 -706 -1378 -828 54 5 -1188 -1102 61
2128F1M66j77o84R68J069J32q17k33J327K53m46q51K06M94R4p43J98Q28N79k73
$$ 61 527 350 -334 634 1703 1835 1018 785 2112 2365 1919 1068 1274 1768 1862 1119 1317 2145 2724 2451
2148B451k50P37R11M43q04k30J142M68q90j365O2R21n96j216m10R08L96r46l88
$$ 2451 2201 2938 3849 4292 3488 3258 4400 4868 3978 2613 2675 3596 3000 1784 1374 2282 2678 1732 1344
2167A344J67J306J28q86n27Q44q7r59j202j43M48n57j314m44O33N61m36q99M66
$$ 1344 1511 2817 2945 2059 1532 2376 2289 1330 128 -15 433 -124 -1438 -1882 -1249 -688 -1124 -2023 -1557
2186a557J288j13j001n32N68K04n71j277o2L74k94q63k28N37P19m30j98L55J134
$$ -1557 -269 -382 -1383 -1915 -1347 -1143 -1714 -2991 -3053 -2679 -2973 -3836 -4064 -3527 -2808 -3238 -3436 -3081 -1947
2205a947K9j13k81J009P02p97r77k4Q71J93q03l62J004P64Ok12K84J329N69l28
$$ -1947 -1918 -2031 -2312 -1303 -601 -1398 -2375 -2399 -1528 -1335 -2138 -2500 -1496 -732 -726 -938 -654 675 1244 916
2225I16l55R11J35j1o95J60M74K63j045j85O38N84l5m99K90P12M37p45n15O83
$$ 916 561 1472 1607 1596 901 1061 1535 1798 753 568 1206 1790 1755 1256 1546 2258 2695 1950 1435 2118
2245B118N54o95p14j59O22L85p47n47P46N66n26j027J4P65J69q76q24L54N69k86
$$ 2118 2672 1977 1263 1104 1726 2111 1364 817 1563 2129 1603 576 590 1355 1524 648 -176 178 747 461
2265D61q07R1M10J42l35j042M92L06l06p56j30M07M9m20n31K32P65k80p85j73
$$ 461 -346 -255 155 297 -38 -1080 -588 -282 -588 -1344 -1474 -1067 -1018 -1438 -1969 -1737 -972 -1252 -2037 -2210
2285b210J206K05l04q05L65P24k44q01o0L19K14k89n71N70Q04Km05j9M86J102
$$ -2210 -1004 -799 -1103 -1908 -1543 -819 -1063 -1864 -1924 -1605 -1391 -1680 -2251 -1681 -877 -875 -1280 -1299 -813 289
2305B89n08o11N52M47J81j177j3N53L01m35p45L60Q23L45p11J36N33O16j0q64
$$ 289 -219 -830 -278 169 350 -827 -840 -287 14 -421 -1166 -806 17 362 -349 -213 320 936 926 62
2325F2K24J075lo13q69O41O60n97p53M45L59N69o52p83J131L19k15p98L06M49
$$ 62 286 1361 1358 745 -124 517 1177 580 -173 272 631 1200 548 -235 896 1215 1000 202 508 957
2345I57L50o31m75Q50L69k38p80K93P71J44k84n93O68P75o53l47L32N96N83r75
$$ 957 1307 676 201 1051 1420 1182 402 695 1466 1610 1326 733 1401 2176 1523 1176 1508 2104 2687 1712
2365A712k92Q23M61j31p84j54J065J60r20m61N08M20j22q71l05O37Km45n02K99
$$ 1712 1420 2243 2704 2573 1789 1635 2700 2860 1940 1479 1987 2407 2285 1414 1109 1746 1748 1303 801 1100
2385A100K50o3j254o30P00N29j216j088N73N54q23q82l1N84M32m55q66J43Q04
$$ 1100 1350 1287 33 -597 103 632 -584 -1672 -1099 -545 -1368 -2250 -2281 -1697 -1265 -1720 -2586 -2443 -1639
2404a639k0q84m25N90k48n94q69j06R43p54p60j5J121J09o06o46N84J127K2l75
$$ -1639 -1659 -2543 -2968 -2378 -2626 -3220 -4089 -4195 -3252 -4006 -4766 -4781 -3660 -3551 -4157 -4803 -4219 -3092 -3070 -3445
2424c445l11R61O10j30m60L14J098Q3q14L07O71J056k03o59O96N71K04o67l98
$$ -3445 -3756 -2795 -2185 -2315 -2775 -2461 -1363 -1280 -2094 -1787 -1116 -60 -263 -922 -226 345 549 -118 -516
2443e16R27O52j66o05N66P71L31q51K0O62J027o49o20Q86K87M25o41l16Q11Q07
$$ -516 411 1063 897 292 858 1629 1960 1109 1129 1791 2818 2169 1549 2435 2722 3147 2506 2190 3001 3808
2463C808n97o74L91M53J30n76k01R00k17m33q29J99O90j90j094l07Q96L23k28
$$ 3808 3211 2537 2928 3381 3511 2935 2734 3634 3417 2984 2155 2354 3044 2854 1760 1453 2349 2672 2444
2482B444q52J24Q84j4j177l91N05L4r37r54L5N12j83j112j73K74J045o64o96L13
$$ 2444 1592 1716 2600 2586 1409 1018 1523 1557 620 -334 -299 213 30 -1082 -1255 -981 64 -600 -1296 -983
2502i83J052o4r34K0j88N40o80r92j42M87l72o72k0K50Q92k26p38O67N02K49n34
$$ -983 69 5 -929 -909 -1097 -557 -1237 -2229 -2371 -1884 -2256 -2928 -2948 -2698 -1806 -2032 -2770 -2103 -1601 -1352 -1886
2523a886j89M00N21n02j134O29K62J84l60l07J046J036j49n03O75R94N27r28m65
$$ -1886 -2075 -1675 -1154 -1656 -2790 -2161 -1899 -1715 -2075 -2382 -1336 -300 -449 -952 -277 717 1244 316 -149
2542a49M11M30m31r23q6O20l13l81j38M42Q16K72m56k04R60L63m31n11L98N42
$$ -149 262 692 261 -662 -748 -128 -441 -822 -960 -518 298 570 114 -90 870 1233 802 291 689 1231
2562A231o37o93K8M16k06j42o61M74R94j25n84q1R34K06m64r62K34Q93o65n12
$$ 1231 594 -99 -71 345 139 -3 -664 -190 804 679 95 14 948 1154 690 -272 -38 855 190 -322
2582c22k43R63Q7p20k08L93P95l0p37M8R46L12j63r11L94N42m2m73n39M86N70
$$ -322 -565 398 485 -235 -443 -50 745 715 -22 26 972 1284 1121 210 604 1146 1104 631 92 578 1148
2603A148l17j052P46O09j52k94k60O16L93o25n86K03R34l01p90j15M83N18m14
$$ 1148 831 -221 525 1134 982 688 428 1044 1437 812 226 429 1363 1062 272 157 640 1158 744
2622G44n70L5M13L28r23k26O05J85m38q07L06O69J04q10k60K59O33o44l71j48
$$ 744 174 209 622 950 27 -199 406 591 153 -654 -348 321 425 -385 -645 -386 247 -397 -768 -916
2642i16O73J65p30k54O3O88m70n32K78L92J1n28m00L67O13n62l85L8P21k86k85
$$ -916 -243 -78 -808 -1062 -999 -311 -781 -1313 -1035 -643 -632 -1160 -1560 -1193 -580 -1142 -1527 -1489 -768 -1054 -1339
2663a339j80M75O72m93m60j2P78J66o45k17M06M23j0p81L69L31O52l79l53K69
$$ -1339 -1519 -1044 -372 -865 -1325 -1337 -559 -393 -1038 -1255 -849 -426 -436 -1217 -848 -517 135 -244 -597 -328
2683c28J090n78m68l4Q11L48o45l59O9P59k99J2j79R13J16k46m1lQ71J45j030
$$ -328 762 184 -284 -318 493 841 196 -163 -94 665 366 378 199 1112 1228 982 941 938 1809 1954 924
2704I24m87O78K67p27j183L85P55n08m99k27O87M46m8n47L97Q27n3p86l7J74L47
$$ 924 437 1115 1382 655 -528 -143 612 104 -395 -622 65 511 463 -84 313 1140 1087 301 264 438 785
2725G85n95r11O5P99J29q56l3O24J116q25m84L79P59o04q38l8M33r7n33o45J21
$$ 785 190 -721 -656 143 272 -584 -617 7 1123 298 -186 193 952 348 -490 -528 -95 -192 -725 -1370 -1249
2746a249P41J93k69R0J169R44l32m26P11Q63j92k96l90j22L89o85p66j75P42p6
$$ -1249 -508 -315 -584 -494 675 1619 1287 861 1572 2435 2243 1947 1557 1435 1824 1139 373 198 940 864
2766H64p61k38L13O86r5j006K54J096Rj025K7M66L49p04n70j44P99M51q71r2O93
$$ 864 103 -135 178 864 769 -237 17 1113 1122 97 124 590 939 235 -335 -479 320 771 -100 -192 501
2787E01N44l50l94m8O77j23r66m53P5K4k28q20o95R05J96n88n88J009N22o7q99
$$ 501 1045 695 301 253 930 807 -159 -612 -537 -513 -741 -1561 -2256 -1351 -1155 -1743 -2331 -1322 -800 -867 -1766
2808a766M59Q32J18p40l20L34O03m22m15j81O47K4o27l00M64O15l25n98K8O63
$$ -1766 -1307 -475 -357 -1097 -1417 -1083 -480 -902 -1317 -1498 -851 -827 -1454 -1754 -1290 -675 -1000 -1598 -1570 -907
2828i07L52q26n61K66O61P3p74J5J001J10o49k71J081M52j55p96j70R20K89k78
$$ -907 -555 -1381 -1942 -1676 -1015 -942 -1716 -1701 -700 -590 -1239 -1510 -429 23 -132 -928 -1098 -178 111 -167
2848a67n02L41Q00J13q11LM92P49n39j86M28M38j74m82k04R81m9l26n30J045K19
$$ -167 -669 -328 472 585 -226 -223 269 1018 479 293 721 1159 985 503 299 1280 1231 905 375 1420 1639
2869A639k29p94P01N01J62o18k05K50N54j38r41k33J234M0o61K1J5N60K88q00
$$ 1639 1410 616 1317 1818 1980 1362 1157 1407 1961 1823 882 649 1883 1923 1262 1283 1298 1858 2146 1346
2889A346l20P88M6o43k81L66N00k36n90r6N5O57o99n68L37M64k95n24j06M23J34
$$ 1346 1026 1814 1860 1217 936 1302 1802 1566 976 880 935 1592 893 325 662 1126 831 307 201 624 758
2910G58m97k15K96N26l2q46k73N95M01q35o44J85L81K91p57m59M72J99j85o50
$$ 758 261 46 342 868 836 -10 -283 312 713 -122 -766 -581 -200 91 -666 -1125 -653 -454 -639 -1289
2930a289p1R23k7p79j52P24j21k55o67j73O24r2j082L8K10M87n22J18n3N62L36
$$ -1289 -1360 -437 -464 -1243 -1395 -671 -792 -1047 -1714 -1887 -1263 -1355 -2437 -2399 -2189 -1702 -2224 -2106 -2159 -1597 -1261
2951a261n25k60K73L13K97o87l04R84k86m82l81M35N51Qm33Q9R41K32j83m60R89
$$ -1261 -1786 -2046 -1773 -1460 -1163 -1850 -2154 -1170 -1456 -1938 -2319 -1884 -1333 -1325 -1758 -1669 -728 -496 -679 -1139 -150
2972a50J99m0m11J66O7N38r48k07Q21L19j90J29j83J030L40l85k87K03N14P6q08
$$ -150 49 9 -402 -236 -169 369 -579 -786 35 354 164 293 110 1140 1480 1095 808 1011 1525 1601 793
2993G93m9O97J69l37m4J5P72k98k82j84Q08L09n71J49J10O02l01o88l54N89J89
$$ 793 744 1441 1610 1273 1229 1244 2016 1718 1436 1252 2060 2369 1798 1947 2057 2659 2358 1670 1316 1905 2094
3014B094l84o42L18O45m00l59k54K86J79m65n04K02M23k97m71k66M94K15n91l44
$$ 2094 1710 1068 1386 2031 1631 1272 1018 1304 1483 1018 514 716 1139 842 371 105 599 814 223 -121
3034a21J51L42lm95p59L30M62n72q23M69N49o08k05j35L37K47j75o58p4P36j79
$$ -121 30 372 369 -126 -885 -555 -93 -665 -1488 -1019 -470 -1078 -1283 -1418 -1081 -834 -1009 -1667 -1741 -1005 -1184
3055a184l76o50Q15K64m68n06K5P59j92k01m2M45P06j64o9m86P96K71q43j9M13
$$ -1184 -1560 -2210 -1395 -1131 -1599 -2105 -2080 -1321 -1513 -1714 -1756 -1311 -605 -769 -838 -1324 -528 -257 -1100 -1119 -706
3076g06K15K1q14K77N78N42l40m55L96J016j28n08K00M76K29q10p3m1M26j14p80
$$ -706 -491 -470 -1284 -1007 -429 113 -227 -682 -286 730 602 94 294 770 999 189 116 75 501 387 -393
3097c93M7N93O96q43j23N56O87P3q00L17N30N8o95l43L31O77o06p29L4O25K25
$$ -393 -346 247 943 100 -23 533 1220 1293 493 810 1340 1398 703 360 691 1368 762 33 67 692 917
3118I17n99j86N14L48j66o57k63O09J29o80o56Q10Q1j88o13J27M35J89l25l86
$$ 917 318 132 646 994 828 171 -92 517 646 -34 -690 120 201 13 -600 -473 -38 151 -174 -560
3138e60N59O12k22o30l6N22L64p82o28O13K90k06n67J60N83J59o83k51L74O80
$$ -560 -1 611 389 -241 -277 245 609 -173 -801 -188 102 -104 -671 -511 72 231 -452 -703 -329 351
3158C51k89p53J46P44J05n09k58M7R94k07n63L2L54N28m26n48N36M44k6m69n0
$$ 351 62 -691 -545 199 304 -205 -463 -416 578 371 -192 -160 194 722 296 -252 284 728 702 233 183
3179A83O64K63j114J77L36O50l82n95O7K47K74l16o12Q3M50M2k10n67J55O56m68
$$ 183 847 1110 -4 173 509 1159 777 182 249 496 770 454 -158 -75 375 417 207 -360 -205 451 -17
3200a7q73K65N64o7m24l47P75J1l70m56K7M38J72q53Q3N86P5k59m86N0N81k39
$$ -17 -890 -625 -61 -128 -552 -899 -124 -113 -483 -939 -912 -474 -302 -1155 -1072 -486 -411 -670 -1156 -1106 -525 -764
3222g64m31j2O61L64o17k29J09O76m2n12J2L53O07j37q27M53M09q4k77k17M45
$$ -764 -1195 -1207 -546 -182 -799 -1028 -919 -243 -285 -797 -785 -432 175 38 -789 -336 73 -11 -288 -505 -60
3243f0P62o24n27J79Q98J05l76n63M09P47m38o82K98P0K29n81k03L08O43j2p50
$$ -60 702 78 -449 -270 628 733 357 -206 203 950 512 -170 128 198 427 -154 -357 -49 594 582 -168
3264a68J70P74J94p86p9J45K91l19o41n1M41J22k16l53J88N26L82o85K47O05N92
$$ -168 2 776 970 184 105 250 541 222 -419 -470 -29 93 -123 -476 -288 238 620 -65 182 787 1379
3285A379m39m44N86K33j44p78J04N75j48l46l18K78O47j2k20J57L13J98o1o00
$$ 1379 940 496 1082 1315 1171 393 497 1072 924 578 260 538 1185 1173 953 1110 1423 1621 1560 960
3305I60Q9N90J70q68l28n5P46n97l03L25L99Q2n98M6M10M88o88n37R7L95m33p49
$$ 960 1049 1639 1809 941 613 558 1304 707 404 729 1128 1210 612 658 1068 1556 868 331 428 823 390 -359
3327c59n52L98Lm05q39N29K33L31p16k08L73N58m55k55j9Q13m62r06O4P5K80m36
$$ -359 -911 -513 -510 -915 -1754 -1225 -992 -661 -1377 -1585 -1212 -654 -1109 -1364 -1383 -570 -1032 -1938 -1874 -1799 -1519 -1955
3349a955k12K5N68L27o49j95P23L39l25k29l0N23K08n58l22M22L72J69m92K45
$$ -1955 -2167 -2142 -1574 -1247 -1896 -2091 -1368 -1029 -1354 -1583 -1613 -1090 -882 -1440 -1762 -1340 -968 -799 -1291 -1046
3369a046P15J2m29q2R81K86k92k22J44M45L02l39l30J0Q65l09q4k36P32J51m28
$$ -1046 -331 -319 -748 -830 151 437 145 -77 67 512 814 475 145 155 1020 711 627 391 1123 1274 846
3390H46j36M55L63l69n38N6P93M9o25k04N28M16l34l39k38L30L05l24l38P5M31
$$ 846 710 1165 1528 1159 621 677 1470 1519 894 690 1218 1634 1300 961 723 1053 1358 1034 696 771 1202
3411A202l53n06j71Q59o1o40P3j15M64m61p3l58N47J69m32k02mL22R6r59M50N85
$$ 1202 849 343 172 1031 970 330 403 288 752 291 218 -140 407 576 144 -58 -62 260 356 -603 -153 432
3433D32k31l29m97P59k8J20p43j20P39L17l69m34j9R03n09q23K47O08rm26k67
$$ 432 201 -128 -625 134 106 226 -517 -637 102 419 50 -384 -403 500 -9 -832 -585 23 14 -412 -679
3454f79L65O20k50n65k23M43P10p79l98L06M27R7n52n48N07L74n66m43K5Q14J25
$$ -679 -314 306 56 -509 -732 -289 421 -358 -756 -450 -23 74 -478 -1026 -519 -145 -711 -1154 -1129 -315 -190
3475a90l93l10N18M84r8m67l5L52L22p24m4N14K29m39o62K12M95Jn32J98K69P98
$$ -190 -583 -893 -375 109 11 -456 -491 -139 183 -541 -585 -71 158 -281 -943 -731 -236 -235 -767 -569 -300 498
3497D98o14j07M64P63o7n00j12P15q1k68n95L11R47m18m04m77J076L53m75o25
$$ 498 -116 -223 241 1004 937 437 325 1040 959 691 96 407 1354 936 532 55 1131 1484 1009 384
3517C84K22P68n1n95n04J53L53k16p01k03P02j90o36pP65L07l04j36R2K00K00
$$ 384 606 1374 1323 728 224 377 730 514 -187 -390 312 122 -514 -521 244 551 247 111 203 403 603
3538F03o61k33J75K41k42o89qL8L1n31k32M19M14l32k40j28N91M20p67l42M42
$$ 603 -58 -291 -116 125 -117 -806 -814 -776 -745 -1276 -1508 -1089 -675 -1007 -1247 -1375 -784 -364 -1131 -1473 -1031
3559a031N26On33n5P33K5m11J30L37N23j90m00j48Q03L5m52j59J73M02m95j26
$$ -1031 -505 -499 -1032 -1087 -354 -329 -740 -610 -273 250 60 -340 -488 315 350 -102 -261 -88 314 -181 -307
3580c07l02O15j85m5j27K61K32J87l66K44L71J53m78k54O28L48k2o93J46M63J86
$$ -307 -609 6 -179 -224 -351 -90 142 329 -37 207 578 731 253 -1 627 975 953 260 406 869 1055
3601A055k07o06L37Q05m10q18O8M72M39p75p1O9P90m09k32n3M62J82n15k91K90
$$ 1055 848 242 579 1384 974 156 224 696 1135 360 289 358 1148 739 507 454 916 1098 583 292 582
3622E82L72j61m57k51M64L9l02o43M91M26n35J12j54QL75m81q7o3L14j49m80j91
$$ 582 954 793 336 85 549 588 286 -357 134 560 25 137 -17 -9 366 -115 -202 -265 49 -100 -580 -771
3644g71L91K07n23N2n6L29K20r71Q5N25N6j35m40K07K40K37o44n3L13p0M7l50
$$ -771 -380 -173 -696 -644 -700 -371 -151 -1122 -1037 -512 -456 -591 -1031 -824 -584 -347 -991 -1044 -731 -801 -754 -1104
3666a104J40N88L10k43l82N53K08j95l14k2M44j9m69l02P72K06m23j25k62P93
$$ -1104 -964 -376 -66 -309 -691 -138 70 -125 -439 -461 -17 -36 -505 -807 -35 171 -252 -377 -639 154
3686A54J07k84k35N03J62l51j85n3L84N1p9m06L62M51k92m48l9P03O0m94Q8J74
$$ 154 261 -23 -258 245 407 56 -129 -182 202 253 174 -232 130 581 289 -159 -198 505 565 71 159 333
3708C33L86o7p37J42O13p2l25m1N8L85q3m74k63Q34J48m83k93M00M34j77m76k25
$$ 333 719 652 -85 57 670 598 273 232 290 675 592 118 -145 689 837 354 61 461 895 718 242 17
3730A7P33j34j81j35k02L81N4m52l07N69M11n34j19m0M06M6o62L1J8M96m63k30
$$ 17 750 616 435 300 98 479 533 81 -226 343 754 220 101 61 467 513 -149 -118 -100 396 -67 -297
3752b97J81M39j6p78j3j10Q75n41n27j6M43K89o37p4L42L67k14o59K31N84j10
$$ -297 -116 323 307 -471 -484 -594 281 -260 -787 -803 -360 -71 -708 -782 -440 -73 -287 -946 -715 -131 -241
3773b41o58k34N90M85o56k55L73J99R6j10k23K92N48o22r3N2K14J23l72j53N21
$$ -241 -899 -1133 -543 -58 -714 -969 -596 -397 -301 -411 -634 -342 206 -416 -509 -457 -243 -120 -492 -645 -124
3794a24K35r6l27k7P20q7o88J1L6N59j89l25K99M11K92r80j16O54N03j91n74J23
$$ -124 111 15 -312 -339 381 294 -394 -383 -347 212 23 -302 -3 408 700 -280 -396 258 761 570 -4 119
3816A19P60J5p51K34J2J6M1m23j10N94K86o62K1J62O37m7n17m3L70J15n36J41
$$ 119 879 894 143 377 389 405 446 23 -87 507 793 131 152 314 951 904 387 344 714 829 293 434
3838D34m9j77J26o79K20L98j58k66j30L40M11j96n48L4P67k69j83l73J86L00l52
$$ 434 385 208 334 -345 -125 273 115 -151 -281 59 470 274 -274 -240 527 258 75 -298 -112 188 -164
3859a64l36Q4L47J61k33l74M95P25J0q36L00J34J05n14j91K5L07r1o90J39L25
$$ -164 -500 -416 -69 92 -141 -515 -20 705 715 -121 179 313 418 -96 -287 -262 45 -46 -736 -597 -272
3880b72L90l92j09J38Q25o77J05J63N93j56o24J13K07L56k85k55o92O81Rk92k85
$$ -272 118 -274 -383 -245 580 -97 8 171 764 608 -16 97 304 660 375 120 -572 109 118 -174 -459
3901d59P5P92j02n90k20M71k2j78m64l6M20J80p07J92K3L40k11j15L59P42m9p48
$$ -459 -384 408 306 -284 -504 -33 -55 -233 -697 -733 -313 -133 -840 -648 -625 -285 -496 -611 -252 490 441 -307
3923c07J4M17K44m24l91j5Q75n10m32n1P60M5l75k80K67M92q8n72L76M30J56l64
$$ -307 -293 124 368 -56 -447 -462 413 -97 -529 -580 180 225 -150 -430 -163 329 241 -331 45 475 631 267
3945B67o28L08M68J74n65j20L64K15j84j43L2K10J2m66k20M24J92l80j82k0M97
$$ 267 -361 -53 415 589 24 -96 268 483 299 156 188 398 410 -56 -276 148 340 -40 -222 -242 255
3966B55J38p75n1K60O60m16n76n5P63j3k91o0J94l1O1m09o0M96Mj33k94L06M71
$$ 255 393 -382 -433 -173 487 71 -505 -560 203 190 -101 -161 33 2 63 -346 -406 90 94 -39 -333 -27 444
3989D44m81j50J79K75K6k0n45J94P78n25j3k89N48p0l88P5k4L38j64m41J66M79
$$ 444 -37 -187 -8 267 293 273 -272 -78 700 175 162 -127 421 351 -37 38 14 352 188 -253 -87 392
4011C92J22m77r2M49k74k19oJ42K18J02l30o49M71K25O2n36J6M50J02K4n09L50
$$ 392 514 37 -55 394 120 -99 -105 37 255 357 27 -622 -151 74 136 -400 -384 66 168 192 -317 33
4033C3p2K7q7l34P02k41l23j78K6L06J12j34k75K45N93m88l42K95M14k47l22p6
$$ 33 -39 -12 -99 -433 269 28 -295 -473 -447 -141 -29 -163 -438 -193 400 -88 -430 -135 279 32 -290 -366
4055c66L70J43l29j78L7L41m9j61j23M81K03J80k79m6O28k56n26m4J10O67o80
$$ -366 4 147 -182 -360 -323 18 -31 -192 -315 166 369 549 270 224 852 596 70 26 136 803 123
4076A23m23M8K62J68k89j7j1P52o7n34K38K9P9k66l84K10J12L2l77j89M62J98
$$ 123 -300 -252 10 178 -111 -128 -139 613 546 12 250 279 358 92 -292 -82 30 62 -315 -504 -42 156
4098A56r4k89M27M25m79l85J18p2L78m78n38N01K73k81l73J7K74j3RQL49L54k95
$$ 156 62 -227 200 625 146 -239 -121 -193 185 -293 -831 -330 -57 -338 -711 -694 -420 -433 -424 -416 -67 287 -8
4121hm62L3O65L4n07k24k9N45k7r21K34P16K3k91k19K30N47r8n89L95J43o0O1
$$ -8 -470 -437 228 262 -245 -469 -498 47 20 -901 -667 49 72 -219 -438 -208 339 241 -348 47 190 130 191
4144A91n79J56O05l33m37K24K48N18m92l98O69J35j27m21J4N74J39k56m44L23
$$ 191 -388 -232 373 40 -397 -173 75 593 101 -297 372 507 380 -41 -27 547 686 430 -14 309
4164C09M90j94o76N4L43p8P1p54N49K31J24k29o2K81J20n2o44p4J061k38p02J86
$$ 309 799 605 -71 -17 326 248 319 -435 114 345 469 240 178 459 579 527 -117 -191 870 632 -70 116
4186A16J41J5l62r4K23O25m75l06j86L36L85k70l14J2L95K64p83J10N64Q8p13
$$ 116 257 272 -90 -184 39 664 189 -117 -303 33 418 148 -166 -154 241 505 -278 -168 396 484 -229
4207b29r8J89N4J17n52o4N37n9k95l82K77N44j26l80j47L57O9n61j60j51O50r7
$$ -229 -327 -138 -84 33 -519 -583 -46 -105 -400 -782 -505 39 -87 -467 -614 -257 -188 -749 -909 -1060 -410 -507
4229e07m91J15J06L10j05k62K74K11k0l18q9K90M36m40k82L49N66m86k77m0M47
$$ -507 -998 -883 -777 -467 -572 -834 -560 -349 -369 -687 -776 -486 -50 -490 -772 -423 143 -343 -620 -660 -213
4250b13K40J5n80M42L74K43p47L97K42L27j98o29M42O12p8k46k04J52M94m58l3
$$ -213 27 42 -538 -96 278 521 -226 171 413 740 542 -87 355 967 889 643 439 591 1085 627 594
4271E94m2L97m8l49k21K81K98Nn22M5O41j42m52Q5Q0m7J08l92Q6L24k86j35j26
$$ 594 552 949 901 552 331 612 910 915 393 438 1079 937 485 570 650 603 711 319 405 729 443 308 182
4294A82kJ61j51l98K2M68o3k24k64L1L83l52l84j52K94K45r1k81M46k1j16k05
$$ 182 180 341 190 -208 -186 282 219 -5 -269 -238 145 -207 -591 -743 -449 -204 -295 -576 -130 -151 -267 -472
4316d72n4N44K57j88l89J62R9l14r9R4j95N30l23k11J27R3K45l74k68K66L25j64
$$ -472 -526 18 275 87 -302 -140 -41 -355 -454 -360 -555 -25 -348 -559 -432 -339 -94 -468 -736 -470 -145 -309
4338c09k99j13O95j17n67L4N07P3n02j29P43m2m43K22l39J14J61j48k27N6O39
$$ -309 -608 -721 -26 -143 -710 -676 -169 -96 -598 -727 16 -26 -469 -247 -586 -472 -311 -459 -686 -630 9
4359Ik38m80J7L19M9O0l92K70M45L0m68j40N66K44l63k75J0O28J85l53N3L45L84
$$ 9 -229 -709 -692 -373 -324 -264 -656 -386 59 89 -379 -519 47 291 -72 -347 -337 291 476 123 176 521 905
4382I05m15j10j51N28l02j66k57L14M61j88j86k15Q6K68n7Nk02O25k09l01J46
$$ 905 490 380 229 757 455 289 32 346 807 619 433 218 304 572 515 520 318 943 734 433 579
4403E79K41m9j96k12N75O4n91k80l2K75O1j16j71L73J74l16j10J65J98k03k16
$$ 579 820 771 575 363 938 1002 411 131 99 374 435 319 148 521 695 379 269 434 632 429 213
4424B13m09R0M49k69l30L1M19l20p4m68M96O42o20k03k19K40K94n76k40J60K26
$$ 213 -196 -106 343 74 -256 -225 194 -126 -200 -668 -172 470 -150 -353 -572 -332 -38 -614 -854 -694 -468
4445d68J89m22k1L24M21m64o3J11O49j56k91L1K76J11p36J60R7K63j2n52J33M30
$$ -468 -279 -701 -722 -398 23 -441 -504 -393 256 100 -191 -160 116 227 -509 -349 -252 11 -1 -553 -420 10
4467A0q4N1l27K96K33K66j83l51O25o6k10n23L12K96J33m15m99O75M42l12n03
$$ 10 -74 -23 -350 -54 179 445 262 -89 536 470 260 -263 49 345 478 63 -436 239 681 369 -134
4488a34L34M99m01m80L1J93L61M6r07L83M53l29l05K31K35M0j78o49M55K13J02
$$ -134 200 699 298 -182 -151 42 403 449 -458 -75 378 49 -256 -25 210 250 72 -577 -122 91 193
4509A93m56j26M50o7k38N3K0J19j57q2j73K86K05o7m57r7O61n8l69j95M86K16
$$ 193 -263 -389 61 -6 -244 -191 -171 -52 -209 -291 -464 -178 27 -40 -497 -594 67 9 -360 -555 -69 147
4531A47k80k38J70L17q5k87j19J44L84j81k78j81O85j59l98j43J82N64l26n08
$$ 147 -133 -371 -201 116 31 -256 -375 -231 153 -28 -306 -487 198 39 -359 -502 -320 244 -82 -590
4551e90RO83j48n95OL98K95r3n33P1O10J59n05k6J67J96k27k15J35M23p5r0j59
$$ -590 -581 102 -46 -641 -635 -237 58 -35 -568 -497 113 272 -233 -259 -92 104 -123 -338 -203 220 145 55 -104
4574a04K79j04K7k07Q3M20M34p73j00K89m1L23n1k19JO70o46j70M93M06k38m91
$$ -104 175 71 98 -109 -26 394 828 55 -45 244 203 526 475 256 257 927 281 111 604 1010 772 281
4596B81K96J71J55j42k40K45K92m21k72J79j64M43o17K5N05K18j67l32p3M22J48
$$ 281 577 748 903 761 521 766 1058 637 365 544 380 823 206 231 736 954 787 455 382 804 952
4617I52k72o14M61K75m50l90n4L57N4j41l74O5L70j80K1K2k5k4N9l76J84L21k65
$$ 952 680 66 527 802 352 -38 -92 265 319 178 -196 -131 239 59 80 102 77 53 112 -264 -80 241 -24
4640b4l65k42L17j44j11k60K91L77j53k83k19K81J09j26l21k55L16k96k28J34
$$ -24 -389 -631 -314 -458 -569 -829 -538 -161 -314 -597 -816 -535 -426 -552 -873 -1128 -812 -1108 -1336 -1202
4660a202N2K82j98j27L01K19k36O8l3J18M02j52m76K12K61j88K30n03P78j85k86
$$ -1202 -1150 -868 -1066 -1193 -892 -673 -909 -841 -874 -756 -354 -506 -982 -770 -509 -697 -467 -970 -192 -377 -663
4681f63K04j05M58j84q3j09J23O31l94l51L55M78%l54k1N38M0j37j85J98L27R8
$$ -663 -459 -564 -106 -290 -373 -482 -359 272 -122 -473 -118 360 360 6 -15 523 563 426 241 439 766 864
4703H64J9l35K80k0L48m95Q1M65j70l49k27M00K73k96l02j03M48k7j54j76J17
$$ 864 883 548 828 808 1156 661 742 1207 1037 688 461 861 1134 838 536 433 881 854 700 524 641
4724F41O16n58k76L12r8N7j2o30M44L44k15k31j49M48k45k87m06K88L44j15l92
$$ 641 1257 699 423 735 637 694 682 52 496 840 625 394 245 693 448 161 -245 43 387 272 -120
4745a20l6J46pk53L0J29K23k89l23p0K51J6q0j60J27L95l99j16k7K56o2m40j99
$$ -120 -156 -10 -17 -270 -240 -111 112 -177 -500 -570 -319 -303 -383 -543 -416 -21 -420 -536 -563 -307 -369 -809 -1008
4768a008N81m77O33n20P9J11J64j76k78J6M97K9l67m8R3N73m68O2N4O23m57j84
$$ -1008 -427 -904 -271 -791 -712 -601 -437 -613 -891 -875 -378 -349 -716 -764 -671 -98 -566 -504 -450 173 -284 -468
4790d68q4J37L65l60j6Q6N54k76k99J09J36L52j22k63K40J56M6k03J11k0K97m3
$$ -468 -552 -415 -50 -410 -426 -340 214 -62 -361 -252 -116 236 114 -149 91 247 293 90 201 181 478 435
4812D35l73K29O57k68l74j02K70L54l77j92J36M31j42J55o77L40N03l99l49L32
$$ 435 62 291 948 680 306 204 474 828 451 259 395 826 684 839 162 502 1005 606 257 589
4832E89L10j67n37j34N48L61n44n54r9Q58j11l35L8J79L43k48j96k4L8j23j04
$$ 589 899 732 195 61 609 970 426 -128 -227 631 520 185 223 402 745 497 301 277 315 192 88
4853H8M1o7J29k0m92M47k21K73l78jO7j55J56j81J03L46p9o60J05k11N41n00j29
$$ 88 129 62 191 171 -321 126 -95 178 -200 -201 -134 -289 -133 -314 -211 135 56 -604 -499 -710 -169 -669 -798
4876g98r0K86M07l04k73k19R43m67j80Q9K26j48j51m80M53J30n9m83l25Q91K31
$$ -798 -888 -602 -195 -499 -772 -991 -48 -515 -695 -606 -380 -528 -679 -1159 -706 -576 -635 -1118 -1443 -552 -321
4897c21k48k63K48N67m59j88M8L06J38k38k15K23K21ol99J48N72N6m35P7K32M19
$$ -321 -569 -832 -584 -17 -476 -664 -616 -310 -172 -410 -625 -402 -181 -187 -586 -438 134 190 -245 -168 64 483
4919D83Q1m00K2p8L91k90O1J67J19p6k59L56J86J1l52K31j79O13j85k55j7J30
$$ 483 564 164 186 108 499 209 270 437 556 480 221 577 763 774 422 653 474 1087 902 647 630 760
4941G60J7j04l31M55K17k50j30k78K04L40m65k78M84P5k5o81J30K20K84o30O6
$$ 760 777 673 342 797 1014 764 634 356 560 900 435 157 641 716 691 10 140 360 644 14 80
4962H0J3J71k52j76j87L82K57l93m84M08J83ll19l50R1M67nl52j63O70l70j77
$$ 80 93 264 12 -164 -351 31 288 -105 -589 -181 2 -1 -320 -670 -579 -112 -117 -469 -632 38 -332 -509
4984e09k2P3J69r7l42N49K07l58q3k84M98O0k84Q5j10L81j30k0k10K71J26m9k0
$$ -509 -531 -458 -289 -386 -728 -179 28 -330 -413 -697 -199 -139 -423 -338 -448 -67 -197 -217 -427 -156 -30 -79 -99
5007i9K10K78k03j29l10L61L12k24k57L83J32K07n26R1J57M33n12k62p9K54M17
$$ -99 111 389 186 57 -253 108 420 196 -61 322 454 661 135 226 383 816 304 42 -37 217 634
5028F34l75m16K78N10m35k51R1J72L46m04k22K51J62k79p9r1K74J94n25k57K82
$$ 634 259 -157 121 631 196 -55 36 208 554 150 -72 179 341 62 -17 -108 166 360 -165 -422 -140
5049a40M00k26o41K61o1N16m39k8J08J93k37j36N3K57J73j59j94j54K73J92l92
$$ -140 260 34 -607 -346 -407 109 -330 -358 -250 -57 -294 -430 -377 -120 53 -106 -300 -454 -181 11 -381
5070c81m19P78o5M6m90J99L37j58k00l71N78P3l89o7K07L24J3n26n1K83L09k23
$$ -381 -800 -22 -87 -41 -531 -332 5 -153 -353 -724 -146 -73 -462 -529 -322 2 15 -511 -562 -279 30 -193
5092a93j00m24P90j14l39L03J75J05k96J15Q0K89l54N1l12L26L25o4p41N38P9
$$ -193 -293 -717 73 -41 -380 -77 98 203 -93 22 102 391 37 88 -224 102 427 363 -378 160 239
5113B39J5k14L0M46P8j48m14k0M48J71m28k8K26K47Lm41K17J61j11K3j55J27L9
$$ 239 254 40 70 516 594 446 32 12 460 631 203 175 401 648 651 210 427 588 477 500 345 472 511
5136E11R4j27l18L55K73n96J12L08O9m73m1j06M04J33o00R7J96L20k95j90J2J52
$$ 511 605 478 160 515 788 192 304 612 681 208 167 61 465 598 -2 95 291 611 316 126 138 290
5158B90r7j79k07J86L70p6l53j37L29pO3k01k49L65l9n51j92R92k72l62j06L68
$$ 290 193 14 -193 -7 363 287 -66 -203 126 119 182 -19 -268 97 58 -493 -685 307 35 -327 -433 -65
5180f5k30K69j98l15M16K27q00K54L24j58l05j88L64P2J9k70L16k69M68J7l46
$$ -65 -295 -26 -224 -539 -123 104 -696 -442 -118 -276 -581 -769 -405 -333 -314 -584 -268 -537 -69 -52 -398
5201c98j3J77L17o13j58L22L64r7m80P2M58q7l10m8O7K37KJ2l04L41K93m05m69
$$ -398 -411 -234 83 -530 -688 -366 -2 -99 -579 -507 -49 -136 -446 -494 -427 -190 -188 -176 -480 -139 154 -251 -720
5224g20L79M81l8p27K21J59L32J15j67j69K52L52l01kL09k27L36l99l81O96l96
$$ -720 -341 140 102 -625 -404 -245 87 202 35 -134 118 470 169 167 476 249 585 186 -195 501 105
5245A05k54P9M06K26n46k7R0L71L1m78m5O65l27R3j83k21P08l44l79p4N62L96
$$ 105 -149 -70 336 562 16 -11 79 450 481 3 -42 623 296 389 206 -15 693 349 -30 -104 458 854
5267H54m96j74j49O12l21j32j12p2N29n12K36n06N26M3k62k90L17K33o54L46q6
$$ 854 358 184 35 647 326 194 82 10 539 27 263 -243 283 326 64 -226 91 324 -330 16 -70
5288g0m4O81r66K66n9J48K3n26J89M58J34n69j59M42j02K33o49J15O10o30J38
$$ -70 -114 567 -399 -133 -192 -44 -21 -547 -358 100 234 -335 -494 -52 -154 79 -570 -455 155 -475 -337
5309c37j48M1K92l20lK50O2N8n98M09R5K57k69p2n2M14l4p19P15k17M22o39J12
$$ -337 -485 -444 -152 -472 -475 -225 -163 -105 -703 -294 -199 58 -211 -283 -335 79 45 -674 41 -176 246 -393 -281
5332b81K70K98q6j82r5N9L29l64l55L69L28J08n9m22K40J48r8j65k01N5K34K6
$$ -281 -11 287 201 19 -76 -17 312 -52 -407 -38 290 398 339 -83 157 305 207 42 -159 -104 130 156
5354A56k17M04Q4Mk58j15N15j5k80k18R0K83k03j76j07N75J77l97j90J2M26l64
$$ 156 -61 343 427 431 173 58 573 558 278 60 150 433 230 54 -53 522 699 302 112 124 550 186
5376A86l75JL16K5P2k24J82K41l64L0j80J96j68j31j68K43L34j71j63j2K65J41
$$ 186 -189 -188 128 153 225 1 183 424 60 90 -90 106 -62 -193 -361 -118 216 45 -118 -130 135 276
5398B76k26m0q6M1K25l91n9K08N9j43q3J04J41M0n11j11O04N2l86n5K8J81J73
$$ 276 50 10 -76 -35 190 -201 -260 -52 7 -136 -219 -115 26 66 -445 -556 48 100 -286 -341 -313 -132 41
5421D1k30k4j10L9J14j80J10K00J68m60J20MN3m9m3l35M91j34l40o2M08J85l39
$$ 41 -189 -213 -323 -284 -170 -350 -240 -40 128 -332 -212 -208 -155 -204 -247 -582 -91 -225 -565 -627 -219 -34 -373
5444c73k84m7P04j69j13j00M94J56k76j78r9J75K39k31P2J85m16j87K53K50k16
$$ -373 -657 -704 0 -169 -282 -382 112 268 -8 -186 -285 -110 129 -102 -30 155 -261 -448 -195 55 -161
5465a61M03l01k75K50K60J36j82r3K92R4k49k77N37J3m8k69J13J44M28k17j71
$$ -161 242 -59 -334 -84 176 312 130 37 329 423 174 -103 434 447 399 130 243 387 815 598 427
5486D27Q1L60j13j78o0M01j22m81K0p3J02K4l25lO10j55P9k06K6J27j08j95K42
$$ 427 508 868 755 577 517 918 796 315 335 262 364 388 63 60 670 515 594 388 414 541 433 238 480
5509D80m5K11l56p1l7O1ml85K17R3J69j23n86k9K58j6j28j83K99O7k81j45K70
$$ 480 435 646 290 219 182 243 239 -146 71 164 333 210 -376 -405 -147 -163 -291 -474 -175 -108 -389 -534 -264
5532b64Q1o8j95j12J03l0J50l04L47j30j40Kk21N62J55k81m48J12M52j0m29J82
$$ -264 -183 -251 -446 -558 -455 -485 -335 -639 -292 -422 -562 -560 -781 -219 -64 -345 -793 -681 -229 -239 -668 -486
5554d86J74L46k32m66J02L15L43nk25J24r5J66q6j78J32K09n1j40J73J86k73P5
$$ -486 -312 34 -198 -664 -562 -247 96 91 -134 -10 -105 61 -25 -203 -71 138 87 -53 120 306 33 108
5576A08J32J62k77l22J41j7N20K9p45N72J08J63j47n02J9M61N6m55J81j89J77
$$ 108 240 402 125 -197 -56 -73 447 476 -269 303 411 574 427 -75 -56 405 461 6 187 -2 175
5597A75q5%J39Rk35l7p4L37k60j94j48N42K91k43o22N81K26R1k94l26P9O20n22
$$ 175 90 90 229 238 3 -34 -108 229 -31 -225 -373 169 460 217 -405 176 402 493 199 -127 -48 572 50
5620E0k68O23k11j7k05R2j78P07o84q7J49L75M5k55l02N38o1k94o2J33p9j48J33
$$ 50 -218 405 194 177 -28 64 -114 593 -91 -178 -29 346 391 136 -166 372 311 17 -45 88 9 -139 -6
5643fk31Q0L18j70o21K83L80Om79K16l69P83l78k38k3L92j55k14k91N89K19n97
$$ -6 -237 -157 161 -9 -630 -347 33 39 -440 -224 -593 190 -188 -426 -449 -57 -212 -426 -717 -128 91 -506
5665e06K13m48M36K89q3o45L57J94j8l31K7K58K06j51j80j98O06j44l82J87J34
$$ -506 -293 -741 -305 -16 -99 -744 -387 -193 -211 -542 -515 -257 -51 -202 -382 -580 26 -118 -500 -313 -179
5686a79J62p5j33k0L85J27l33l6M31J09m3J27j86r2J50n50P48j55m7p5k29L76
$$ -179 -17 -92 -225 -245 140 267 -66 -102 329 438 395 522 336 244 394 -156 592 437 390 315 86 462
5708D62L22l09m5nK34n5l3j63r4J52J95l89m7K15J38k26m8O9K4J39l59J28qK07
$$ 462 784 475 430 425 659 604 571 408 314 466 661 272 225 440 578 352 304 373 397 536 177 305 297 504
5732E04k37m59K41J32K21m80k27M68J75m70n4j3J96J6l19j28K67L12l87j18J46
$$ 504 267 -192 49 181 402 -78 -305 163 338 -132 -186 -199 -3 13 -306 -434 -167 145 -242 -360 -214
5753b14L02k19k35r5K11M3k48l3Q2L22p7l66Q0L61M3m60M8K10M60l34k08o5J57
$$ -214 88 -131 -366 -461 -250 -207 -455 -488 -406 -84 -161 -527 -447 -86 -43 -503 -455 -245 215 -119 -327 -392 -235
5776b35q2j7N1n9l3N7J74l85K62P1M91n71n7K71J10m41j52L09K00L8l24K50L5
$$ -235 -317 -334 -283 -342 -375 -318 -144 -529 -267 -196 295 -276 -333 -62 48 -393 -545 -236 -36 2 -322 -72 -37
5799c7M36j50l95K33Q4k34k49L00j07L42k59l5J99J6J94n55L05M9N93m22l01J09
$$ -37 399 249 -146 87 171 -63 -312 -12 -119 223 -36 -71 128 144 338 -217 88 137 730 308 7 116
5821A16K59j55J25j49J7J28j24r9k14O18m60J61r0K93J90k42o34K88M01j46J17
$$ 116 375 220 345 196 213 341 217 118 -96 522 62 223 133 426 616 374 -260 28 429 283 400
5842D00m78J00K98m38O8O5L50j6k36l08L75L28j99m33R3K40j16j17K5L88l95l3
$$ 400 -78 22 320 -118 -50 15 365 349 113 -195 180 508 309 -124 -31 209 93 -24 1 389 -6 -39
5864c9k53K28K32q5n13K60jL64j08n26L58J8q7n03K21L44N2n5r2J01L45k79l15
$$ -39 -292 -64 168 83 -430 -170 -171 193 85 -441 -83 -65 -152 -655 -434 -90 -38 -93 -185 -84 261 -18 -333
5887c33O1L44l3k83J23r8L43J47k95j6lM57p8m40M3J13j38J89j49M05J57k14j24
$$ -333 -272 72 39 -244 -121 -219 124 271 -24 -40 -43 414 336 -104 -61 52 -86 103 -46 359 516 302 178
5910A78k69J97O2n3J49l3j34L60k50k10L34N8k52l77K78K66j35l89L76L5K86m76
$$ 178 -91 106 168 115 264 231 97 457 207 -3 331 389 137 -240 38 304 169 -220 156 191 477 1
5932AJ59n4j6j28P8K5K57L1k80l57K45L50p3m36O0K8K42n06L80q4K30m21p5m7
$$ 1 160 106 90 -38 40 65 322 353 73 -284 -39 311 238 -198 -138 -110 132 -374 6 -78 152 -269 -344 -391
5956c91P9K03k16k02L41L96k59l88l2M5J82j59j70M28ol47J34q8K11K40k91n77
$$ -391 -312 -109 -325 -527 -186 210 -49 -437 -469 -424 -242 -401 -571 -143 -149 -496 -362 -450 -239 1 -290 -867
5978h67R61k34K43m84k0M22q5q1k80N45l5j16k8q5Q4J93q7R7k50M12Q9m16m3M54
$$ -867 94 -140 103 -381 -401 21 -64 -145 -425 120 85 -31 -59 -144 -60 133 46 143 -107 305 394 -22 -65 389
6002C89N1k31r1lL43j74j02K58R0o2J3j31J43q9J26j69j31N21l55k2k39L33PP6
$$ 389 440 209 118 115 458 284 182 440 530 468 481 350 493 404 530 361 230 751 396 374 135 468 475 551
6026E51m23p7Q7L51n03J24J6J09k7k07J13J77J24n22O9K5K39J99m79N3J22J95
$$ 551 128 51 138 489 -14 110 126 235 208 1 114 291 415 -107 -38 -13 226 425 -54 -1 121 316
6048C16j42n49K06O0K80J1n72J87J42n3l9l37J71j5j01J02J13Q6n8j51R9K40K49
$$ 316 174 -375 -169 -109 171 182 -390 -203 -61 -114 -153 -490 -319 -334 -435 -333 -220 -134 -192 -343 -244 -4 245
6071B45m86J30o2j63K00m15l7K86l4k86L10k29M32j55j16j76N98k77J71m25J40
$$ 245 -241 -111 -173 -336 -136 -551 -588 -302 -336 -622 -312 -541 -109 -264 -380 -556 42 -235 -64 -489 -349
6092c49J86rM68m13q9K92l03j70J41M34k32q4J72J92j94Qj77q4P0L41j03j21L32
$$ -349 -163 -172 296 -117 -206 86 -217 -387 -246 188 -44 -128 44 236 42 50 -127 -211 -141 200 97 -24 308
6115C08j91K00k29j07L54K01n23O1K79j23J52J15l86K86J19l66n2K29L14k37j68
$$ 308 117 317 88 -19 335 536 13 74 353 230 382 497 111 397 516 150 98 327 641 404 236
6136B36R6OJ43k18oj5J30n5l2r1J46J36k39m90P89j45p9n65L40J02k28M2j69J68
$$ 236 332 338 481 263 257 242 372 317 285 194 340 476 237 -253 536 391 312 -253 87 189 -39 3 -166 2
6160Bj8L7l34J3L99n0k61k94K36Q4N2j43j0L99k40l92P9J51Lk13Q7K3K57m85J75
$$ 2 -16 21 -313 -300 99 49 -212 -506 -270 -186 -134 -277 -287 112 -128 -520 -441 -290 -287 -500 -413 -390 -133 -618 -443
6185d43l40M32L26n48k5l32P54p2J44l68n6J67L1j97K52J47K66q70L45K98K75
$$ -443 -783 -351 -25 -573 -598 -930 -176 -248 -104 -472 -528 -361 -330 -527 -275 -128 138 -732 -387 -89 186
6206A86l4l38N01k40K42m20J67j36%L80m97J29L03R6l63j67J77N41o07J16J93
$$ 186 152 -186 315 75 317 -103 64 -72 -72 308 -189 -60 243 339 -24 -191 -14 527 -80 36 229
6227B29K64L2m92j58M13K10o2k49j77P84n37J6P0J15k1k76J82m71N35k96J22j74
$$ 229 493 525 33 -125 288 498 436 187 10 794 257 273 343 458 437 161 343 -128 407 111 233 59
6249E9R4K44j98l77K47J92r7R9k09j39O47m42k14mK73L74k00l43J59rJ55m55K31
$$ 59 153 397 199 -178 69 261 164 263 54 -85 562 120 -94 -98 175 549 349 6 165 156 311 -144 87
6272H7l8O5K39l89J4J69p3k65j21J14J89Rj94k5M4J07J0j91M42J49k35j94j17
$$ 87 49 114 353 -36 -22 147 74 -191 -312 -198 -9 0 -194 -219 -175 -68 -58 -249 193 342 107 -87 -204
6295b04L38q3m55J97j00K41j41l04K67K63j10k61k62K08M69k65P0k51J35K08l76
$$ -204 134 51 -404 -207 -307 -66 -207 -511 -244 19 -91 -352 -614 -406 63 -202 -132 -383 -248 -40 -416
6316d16M4L50k86J45k53N3M98j24j70m3K37Q8m13L8M7L40m5k84J28l95N66k06
$$ -416 -372 -22 -308 -163 -416 -363 135 11 -159 -202 35 123 -290 -252 -205 135 90 -194 -66 -461 105 -101
6338a01m89N11L25J36l07K2j62J87k73j34K19L79n8k45M8J99K87m25m05L6K09
$$ -101 -590 -79 246 382 75 97 -65 122 -151 -285 -66 313 255 10 58 257 544 119 -286 -250 -41
6359d1K06J2R2L6J11m01k34K64K12L52n22j52M48j59k50K21j93L55j2k68j86l4
$$ -41 165 177 269 305 416 15 -219 45 257 609 87 -65 383 224 -26 195 2 357 345 77 -109 -143
6381a43O43m49q7J73J31n0k15K26rL26j27l77KM03j30j99O9J28k6L7l71J09K56
$$ -143 500 51 -36 137 268 218 3 229 220 546 419 42 44 447 317 118 187 315 289 326 -45 64 320
6404C20l77L0j74L41Q8Q5j15Kp7j3J02o6j95L22k2l19J53O5r1K2k81K1J65p4l23
$$ 320 -57 -27 -201 140 228 313 198 200 123 110 212 146 -49 273 251 -68 85 150 59 81 -200 -179 -14 -88 -411
6429d11M84j40k05L07l71j09K26J90n67M06L1j8j69q4M19j82O6k13K26j52K91
$$ -411 73 -67 -272 35 -336 -445 -219 -29 -596 -190 -159 -177 -346 -430 -11 -193 -127 -340 -114 -266 25
6450B5j79l49L45n4k20j83J66M34l5q7k54J05L30m48J36K06n5M56l12n61M48J24
$$ 25 -154 -503 -158 -212 -432 -615 -449 -15 -50 -137 -391 -286 44 -404 -268 -62 -117 339 27 -534 -86 38
6472C8J74m11o2O3J54J90k92L45m7L5k53O5N17k58j89k1k72L33J48k32n7j23K26
$$ 38 212 -199 -261 -198 -44 146 -146 199 152 187 -66 -1 516 258 69 48 -224 109 257 25 -32 -155 71
6495G1K32n18L0M06K09j1R5k72k2p2M1L6J73l55L8K38n67L59L09m37J57J98Qm
$$ 71 303 -215 -185 221 430 419 514 242 220 148 189 225 398 43 81 319 -248 111 420 -17 140 338 346 342
6519C42l41L1N1k7J09M7M5n7R2l13o5P40j86n70Q5K23M2j44L6k10L00j18k05j30
$$ 342 1 32 83 56 165 212 257 200 292 -21 -86 654 468 -102 -17 206 248 104 140 -70 230 112 -93 -223
6543b23J87J95q2m58K92N73n06j1j9N3J10n4j96L8k6j34p1L57K6k45j91L7J42
$$ -223 -36 159 77 -381 -89 484 -22 -33 -52 1 111 57 -139 -101 -127 -261 -332 25 51 -194 -385 -348 -206
6566b06Q4J49n61K38J54k9l60J70j91M30K3j71J33L8N0n15J86K72K71j41k79k04
$$ -206 -122 27 -534 -296 -142 -171 -531 -361 -552 -122 -99 -270 -137 -99 -49 -564 -378 -106 165 24 -255 -459
6588d59K11N42n72k50M73RK8j73j69M66j71O0j55J83K5K7q0k82M95l1q1j30P9
$$ -459 -248 294 -278 -528 -55 -46 -18 -191 -360 106 -65 -5 -160 23 48 75 -5 -287 208 177 96 -34 45
6611D5N5L00k39p9K05J61l80j11OK11J47k64L8K07j27L13o02J74M94o7n40L8J44
$$ 45 100 400 161 82 287 448 68 -43 -37 174 321 57 95 302 175 488 -114 60 554 487 -53 -15 129
6634A29O5Ol4O4K1P7k95j75K95L54m57J41l77L72q3q7J13N9J7n1l49J89j39q9
$$ 129 194 200 166 230 251 328 33 -142 153 507 50 191 -186 186 103 16 129 188 205 154 -195 -6 -145 -234
6658b34p3L51J2J57m20J19K43j99J21j86j19J09K56K3l68J91P1J0N7l74K33O2
$$ -234 -307 44 56 213 -207 -88 155 -44 77 -109 -228 -119 137 160 -208 -17 54 64 121 -253 -20 42
6680D2pl29L21J06k20K3r1P0J56J17j00j42J49J87l43j85L01o6K8r6q7L17Q9J2
$$ 42 35 -294 27 133 -87 -64 -155 -85 71 188 88 -54 95 282 -61 -246 55 -11 17 -79 -166 151 240 252
6704B52l69J92j12J57k13J9N04k30n01K64JJ25j38j99r0L00j53J41o5m9K68k27
$$ 252 -117 75 -37 120 -93 -74 430 200 -301 -37 -36 89 -49 -248 -338 -38 -191 -50 -115 -164 104 -123
6726a23o2J94K27m07j46J15K51j97l1q1K54L9q5r2m03L89M34l74K49n31J50K84
$$ -123 -185 9 236 -171 -317 -202 49 -148 -179 -260 -6 33 -52 -144 -547 -158 276 -98 151 -380 -230 54
6748E4J03n6o6P5j09l46l0J84L85k72k10M40J75r4j94l3J79mj12p8J86O2j71k63
$$ 54 157 101 35 110 1 -345 -375 -191 194 -78 -288 152 327 233 39 6 185 181 69 -9 177 239 68 -195
6772a95p9N36R3j36k51p0L49k05l93K69j07M30k17k47K74K96k91j12nK3J23p0
$$ -195 -274 262 355 219 -32 -102 247 42 -351 -82 -189 241 24 -223 51 347 56 -56 -61 -38 85 15
6794A5J18j00n5K40q5l18L39J32j27l01K36Lj7J95m83J87R4j45J71jj3O6R4l59
$$ 15 133 33 -22 218 133 -185 154 286 159 -142 94 97 80 275 -208 -21 73 -72 99 98 85 151 245 -114
6818a14N39j46j05l08K63j06O7l21K70L0J67k43j50J90j13m9K12l12J97Q9Q7n76
$$ -114 425 279 174 -134 129 23 90 -231 39 69 236 -7 -157 33 -80 -129 83 -229 -32 57 144 -432
6840d32J80K57O9p1l49J90J81M4j57k7J59J73m63O9j16K72j92M6K50k84L29n56
$$ -432 -252 5 74 3 -346 -156 25 69 -88 -115 44 217 -246 -177 -293 -21 -213 -167 83 -201 128 -428
6862d28n0J40M10p6j57q1M34k88l55R8rL72l16J90j46L00mk43j53J16J16J14P
$$ -428 -478 -338 72 -4 -161 -242 192 -96 -451 -353 -362 10 -306 -116 -262 38 34 -209 -362 -246 -130 -16 -9
6885in6J47n6j50k85L28J92M4p4p2J89Q2k83R4N4K17j57j49q1J81J44k73M0k20
$$ -9 -65 82 26 -124 -409 -81 111 155 81 9 198 280 -3 91 145 362 205 56 -25 156 300 27 67 -153
6909a53N76K15m39n4j33M39n41R4J34n3L25l77O7L42L9k50j14l6J25M8k34L09
$$ -153 423 638 199 145 12 451 -90 4 138 85 410 33 100 442 481 231 117 81 206 254 20 329
6931C29J63n82J16j08K93j29J41k37l51L91M41k31m50j60L53lk37p9J02K18l21
$$ 329 492 -90 26 -82 211 82 223 -14 -365 26 467 236 -214 -374 -21 -24 -261 -340 -238 -20 -341
6952c41J99r9K9K65j43k96N2K76j7j04K6J67l34k18J93L16r4l05P5J48L56m76
$$ -341 -142 -241 -212 53 -90 -386 -334 -58 -75 -179 -153 14 -320 -538 -345 -29 -123 -428 -353 -205 151 -325
6974c25J02j24KL49k33m4OK16P1k91K01j98J21r0K5j73N40p9l00l9J09PJ80n6
$$ -325 -223 -347 -345 4 -229 -273 -267 -51 20 -271 -70 -268 -147 -237 -212 -385 155 76 -224 -263 -154 -147 33 -23
6998b3r5o4K61o9k58L57p8q8j60Q7j0L35J55m52K05P7l2Ql19O03l79j33M13j60
$$ -23 -118 -182 79 10 -248 109 31 -57 -217 -130 -140 195 350 -102 103 180 148 156 -163 440 61 -72 341 181
7022A81K93m42J8k45Q0L59n3m13K30R6K26j92L7l4n6k29J88K45m0L05l97l45L88
$$ 181 474 32 50 -195 -115 244 191 -222 8 104 330 138 175 141 85 -144 44 289 249 554 157 -188 200
7045B00J23k85O9q4M13j73n11K74K38j09k01j7J61Q8k46j25j56M99k84n6k7J85
$$ 200 323 38 107 23 436 263 -248 26 264 155 -46 -63 98 186 -60 -185 -341 158 -126 -182 -209 -24
7067b4J70l56pk64M18Kj63M6k00L32j42J16r4p5L91l70J92L9l28K58O4l94L06
$$ -24 146 -210 -217 -481 -63 -61 -224 -178 -378 -46 -188 -72 -166 -241 150 -220 -28 11 -317 -59 5 -389 -83
7090h3q1Lk24K45L12l30l1K46%l05R2J32j75J30oj57M08l15K4K18l01N09k71n1
$$ -83 -164 -161 -385 -140 172 -158 -189 57 57 -248 -156 -24 -199 -69 -75 -232 176 -139 -115 103 -198 311 40 -11
7114a1j07J34k2jJ11Q0j74N42m42k80K81q8L19l3m07K31O5j06j18j58K42P5R3
$$ -11 -118 16 -6 -7 104 184 10 552 110 -170 111 23 342 309 -98 133 198 92 -26 -184 58 133 226
7137B26o4O9k21k49J14K03J37K4k84j57M55Nk93K5K04j07J48j65p9L3n1R8Oj4
$$ 226 162 231 10 -239 -125 78 215 239 -45 -202 253 258 -35 -10 194 87 235 70 -9 24 -27 71 77 63
7161F3m9L30l13k86J04J67K76n68K86j21J64J87j03n01M18J93l37l07K23L96j05
$$ 63 14 344 31 -255 -151 16 292 -276 10 -111 53 240 137 -364 54 247 -90 -397 -174 222 117
7182A17q9j63J08J9q8r3M97k11l96K22J32J78j78l54JR6L66J98l71k39M10k01
$$ 117 28 -135 -27 -8 -96 -189 308 97 -299 -77 55 233 55 -299 -298 -202 164 362 -9 -248 162 -39
7204c9J90m04J74J24r5r8j59M9M68n53j17J54L24M8k6j86J23p5K2j59o7K03K42
$$ -39 151 -253 -79 45 -50 -148 -307 -258 210 -343 -460 -306 18 66 40 -146 -23 -98 -76 -235 -302 -99 143
7227A43l69J78J08J22Q0o99L85N3j9o2k96N90q2K6k50J18l3K82k39k69K41K02
$$ 143 -226 -48 60 182 262 -437 -52 1 -18 -80 -376 214 132 158 -92 26 -7 275 36 -233 8 210
7249B10l22KJ06N5L38k07n1K2K1k39P7o2K46J00l14JM23M8l49k27J30OJ94l95
$$ 210 -112 -110 -4 51 389 182 131 153 174 -65 12 -50 196 296 -18 -17 406 454 105 -122 8 14 208 -187
7273a87J05K65J27j4m79L38j59L61o95K76K48J34r4m61J17M45o2k17j49M5M22
$$ -187 -82 183 310 296 -183 155 -4 357 -338 -62 186 320 226 -235 -118 327 265 48 -101 -56 366
7294C66k24k2m4k91L78l24L5J27O1Mm31K18M11k37j75K10K00k97L73n79j59M80
$$ 366 142 120 76 -215 163 -161 -126 1 62 66 -365 -147 264 27 -148 62 262 -35 338 -241 -400 80
7316H0K35m24r8J34L01j73n15L16J26O6m11J63J40L3M8m72O7J79L0J89m94K45
$$ 80 315 -109 -207 -73 228 55 -460 -144 -18 48 -363 -200 -60 -27 21 -451 -384 -205 -175 14 -480 -235
7338b35J20L14m20J22k8r8j16L0J40J45l9Q8k67K68J6n2m87N02n2K38o9m16L06
$$ -235 -115 199 -221 -99 -127 -225 -341 -311 -171 -26 -65 23 -244 24 40 -12 -499 3 -49 189 120 -296 10
7361A0P1j14j48P4J05J39m29L14J20J66l59j11J64KM1L9k08K70j07j74J79n2J20
$$ 10 81 -33 -181 -107 -2 137 -292 22 142 308 -51 -162 2 4 45 84 -124 146 39 -135 44 -8 112
7384A12Kj47m86P48j45L73j73j00K5M9k50p8L38k16J19j86K52nM9k90K40j12K03
$$ 112 114 -33 -519 229 84 457 284 184 209 258 8 -70 268 52 171 -15 237 232 281 -9 231 119 322
7407C22k04j93O3K00Kj46p2K89J77l61k35J1L32k48JL28m4j62j50N08m54l4L1
$$ 322 118 -75 -12 188 190 44 -28 261 438 77 -158 -147 185 -63 -62 266 222 60 -90 418 -36 -70 -39
7430c9k27K35o3M00N6n04K05o9Q3j29k24K74n7q8q3K02j05K98n18n5L98O6j11
$$ -39 -266 -31 -94 306 362 -142 63 -6 77 -52 -276 -2 -59 -147 -230 -28 -133 165 -353 -408 -10 56 -55
7453e5l34Q1J72J1k11nJ78k7L7j04R5j62J58L2j55j41O46m36J01k61K23N0j06
$$ -55 -389 -308 -136 -125 -336 -341 -163 -190 -153 -257 -162 -324 -166 -134 -289 -430 216 -220 -119 -380 -157 -107 -213
7476b13m2P4M00l13J36k46M16K52j87n01L56l96L10k38O3M6K87k28L1L13j97J11
$$ -213 -255 -181 219 -94 42 -204 212 464 277 -224 132 -264 46 -192 -129 -83 204 -24 7 320 123 234
7498B34m45J35P9L69k40k82L62m31K62J00K5l7Jj09NK05Q6k51k75L08L17j42j72
$$ 234 -211 -76 3 372 132 -150 212 -219 43 143 168 131 132 23 28 233 319 68 -207 101 418 276 104
7521A04J44Q4P8j84k48J2J9J28Ok98K10m9O9J90m34J94P1j58j9J86l08K70j40
$$ 104 248 332 410 226 -22 -10 9 137 143 -155 55 6 75 265 -169 25 96 -62 -81 105 -203 67 -73
7544g3j38L93K42o90K6K59P0L4rk2r5K29j07m42K40K64j00j13k26L5p4M22r4k14
$$ -73 -211 182 424 -266 -240 19 89 123 114 92 -3 226 119 -323 -83 181 81 -32 -258 -223 -297 125 31 -183
7568a83J66j13R2k9k48J65qj00Q2J44m4N7j8j02j54J88o8J45m7Q5j56j28L22J17
$$ -183 -17 -130 -38 -67 -315 -150 -158 -258 -176 -32 -76 -19 -37 -139 -293 -105 -173 -28 -75 10 -146 -274 48 165
7592A65m7j85p3J18L08k33n38N12K96k11M4l71J36L39l50K83k08k51P5r1O7M8
$$ 165 118 -67 -140 -22 286 53 -485 27 323 112 156 -215 -79 260 -90 193 -15 -266 -191 -282 -215 -167
7614a67L6l4k5J24J80j95j49P6L29m03J85k8J20o8j67O2P6J37R7k55l0L71k87
$$ -167 -131 -165 -190 -66 114 -81 -230 -154 175 -228 -43 -71 49 -19 -186 -124 -48 89 186 -69 -99 272 -15
7637a5j07j78J90M6L50k26l43l2K91Q3j86k3M46j84k64K43J18p6k12K62j38m7
$$ -15 -122 -300 -110 -64 286 60 -283 -315 -24 59 -127 -150 296 112 -152 91 209 133 -79 183 45 -2
7659bL52m22k0O3O1K01k09j89K07J63l05O4l6Q9P7l00K04j43R6K02p7P4K49l34
$$ -2 350 -72 -92 -29 32 233 24 -165 42 205 -100 -36 -72 17 94 -206 -2 -145 -49 153 76 150 399 65
7683F5k04K30J04r2j48k20K17L22l33O1l01N15M4j68j82p7L29j90j23J75J84J93
$$ 65 -139 91 195 103 -45 -265 -48 274 -59 2 -299 216 260 92 -90 -167 162 -28 -151 24 208 401
7705D01k44n02L81K15J6l43K82n19O27l40J39k61K80n8K1J12q6O3L2j33j37O9
$$ 401 157 -345 36 251 267 -76 206 -313 314 -26 113 -148 132 74 95 207 121 184 216 83 -54 15
7727A5J67p61K37K59L17k31P3J85m67J91k54J31j3J0Q8M6l42L06j93P5J57k47
$$ 15 182 -579 -342 -83 234 3 76 261 -206 -15 -269 -138 -151 -141 -53 -7 -349 -43 -236 -161 -4 -251
7749b51L43l73K6L25j2r4Mm36N03J60l03O8j23J02O6k74K70k74J26R3J9R2l11
$$ -251 92 -281 -255 70 58 -36 -32 -468 35 195 -108 -40 -163 -61 5 -269 1 -273 -147 -54 -35 57 -254
7772b54J47K38Q5k26K75n0j22n6k0J66l5j44R3J20k22J93m02K53K69k48j65j11
$$ -254 -107 131 216 -10 265 215 93 37 17 183 148 4 97 217 -5 188 -214 39 308 60 -105 -216
7794b16L14K24k51m4R3J46j45J22j92J1J58j74J79k6N6l01J36J52L5k41N5P8k51
$$ -216 98 322 71 27 120 266 121 243 51 62 220 46 225 199 255 -46 90 242 277 36 91 169 -82
7817h2J49kl6M2J54l04L55m10L00L5n5N7M6r4r6j12r7J70J63R1k18k34J19L4k63
$$ -82 67 65 29 71 225 -79 276 -134 166 201 146 203 249 155 59 -53 -150 20 183 274 56 -178 -59 -25 -288
7842b88J03k37O47j30k55J57O8j57j10n8J88o3p2J5j7K02J29r1l12O3J10j43j63
$$ -288 -185 -422 225 95 -160 -3 65 -92 -202 -260 -72 -135 -207 -192 -209 -7 122 31 -281 -218 -108 -251 -414
7865d14L98J22m35L11k30K06j42L00l23r5J92J50j04l16L89Q4m69K17M08l39J60
$$ -414 -16 106 -329 -18 -248 -42 -184 116 -207 -302 -110 40 -64 -380 9 93 -376 -159 249 -90 70
7886G0l6l74p4R04o48K0N14n02K84j16M7J52j5j10l38N6J97K82j71j65K19j48
$$ 70 34 -340 -414 490 -158 -138 376 -126 158 42 89 241 226 116 -222 -166 31 313 142 -23 196 48
7908D8J5p4j62K10m3L96l26J3j00J23KQ7n2J05j81M7R2L79j82m92J37K10k57K96
$$ 48 63 -11 -173 37 -6 390 64 77 -23 100 102 189 137 242 61 108 200 579 397 -95 42 252 -5 291
7932B91l32N1N34m22J14n3q4MJ31j51o2J12l11J78j10J89J05l03P5j04L23L8k16
$$ 291 -41 10 544 122 236 183 99 103 234 83 21 133 -178 0 -110 79 184 -119 -44 -148 175 213 -3
7955cl2J00L3L2j80k3J89j56o0J46q1l12K61N4%M5j03J71l38J42K80j06n16K05
$$ -3 -35 65 98 130 -50 -73 116 -40 -100 46 -35 -347 -86 -32 -32 13 -90 81 -257 -115 165 59 -457 -252
7979b52L93K6n27M42o3J63k45j03Q2q0J91j53j86K10m0J31j21j55K66j02p4j60
$$ -252 141 167 -360 82 19 182 -63 -166 -84 -164 27 -126 -312 -102 -142 -11 -132 -287 -21 -123 -197 -357
8001c57K52J41j32N1j14NQ0j61K05O3K31k34m4K20l05K34k30J10J66o2K2k39L07
$$ -357 -105 36 -96 -45 -159 -154 -74 -235 -30 33 264 30 -14 206 -99 135 -95 15 181 119 141 -98 209
8024B09j91J10Q6l36J59Q3J10k90K10k10j35J24j18L46R2l00J9K79j53l6l71k4
$$ 209 18 128 214 -122 37 120 230 -60 150 -60 -195 -71 -189 157 249 -51 -32 247 94 58 -313 -337
8046c37K66J42K43m35J87j1m4j51M07k71p0L98l90J23J46l6p8l20N3J95M8o9J00
$$ -337 -71 71 314 -121 66 55 11 -140 267 -4 -74 324 -66 57 203 167 89 -231 -178 17 65 -4 96
8069I6k50L94k12j71J01O1Q6l36M9K1M18k40k51K92J49n75K12N6m3J91Nj63N0
$$ 96 -154 240 28 -143 -42 19 105 -231 -182 -161 257 17 -234 58 207 -368 -156 -100 -143 48 53 -110 -60
8092f0M23p4o12R6L48k7J73m39M50J05m59J43k39N0K75q1k60K84j61K23l33j38
$$ -60 363 289 -323 -227 121 94 267 -172 278 383 -76 67 -172 -122 153 72 -188 96 -65 158 -175 -313
8114c13K44M04o96J85J70j8PK14m09L36j28j26mK03J79m39K25j37P6j80J19Q1
$$ -313 -69 335 -361 -176 -6 -24 -17 197 -212 124 -4 -130 -134 69 248 -191 34 -103 -27 -207 -88 -7
8136gk4J83M6k28j29o9N31k90J96r0J11p6l12k7L60j9RJ19m48M78k87K42m98K23
$$ -7 -31 152 198 -30 -159 -228 303 13 209 119 230 154 -158 -185 175 156 165 284 -164 314 27 269 -229 -6
8160fK29j83J11j10J64l31qL63l94K77L66k42k2l2L04p62N38l21Q9J93j41J45
$$ -6 223 40 151 41 205 -126 -134 229 -165 112 478 236 214 182 486 -276 262 -59 30 223 82 227
8182B27j95K01l38J95m22N46k38J22J0
$$ 227 32 233 -105 90 -332 214 -24 98 108
8191A08
$$ Imaginary data points
##PAGE= N=2
##DATA TABLE= (X++(I..I)), XYDATA
0@%%%%%%%%%%qJ6j6J6j6J6k4L2l2M0m8N6o9P7q8J04j19J35j52J73j95K19k46K74
$$ 0 0 0 0 0 0 0 0 0 0 0 -8 8 -8 8 -8 8 -16 16 -16 24 -24 32 -37 40 -48 56 -63 72 -80 93 -102 117 -129 145
34A45l06L41l81M24m70N23n79O40p09P86q70R64j072J191j328J490j680J904k178
$$ 145 -161 180 -201 223 -247 276 -303 337 -372 414 -456 508 -564 627 -701 789 -891 1013 -1165
53a165K522k965L561m418N763q194J3987n0308p6627M9290M1293K0381k0513M24
$$ -1165 1357 -1608 1953 -2465 3298 -4896 9091 -41217 -117844 -68554 -27261 -6880 -27393 -26969
67b6969K8992M4016J5346o628n478K3224L0107J0796j6985j2700R173K3090Q716
$$ -26969 2023 46039 61385 54757 49279 72503 102610 113406 96421 83721 92894 115984 124700
80A24700j1557j5209M042K2857K0558k123j4746n51K4720K4011m612k5109r647
$$ 124700 113143 97934 101976 124833 145391 143268 128522 127971 152691 176702 172090 146981 137334
93A37334J9156J9418j2776l3721j5089J6627J6617j4143l2769j2907J5595J5705
$$ 137334 156490 175908 163132 129411 114322 130949 147566 133423 100654 87747 103342 119047
105A19047j3625l1222j5139J2086J0886j5645l2290j7068O324P780j0574k3459
$$ 119047 105422 74200 59061 71147 82033 66388 34098 17030 23354 31134 20560 -2899
117b899j6585J832J1221O29j6871j7621J324J4617M883j6890k0814k733J4969
$$ -2899 -19484 -17652 -6431 -5802 -22673 -40294 -38970 -24353 -19470 -36360 -57174 -59907 -44938
130d4938P718j5432k4690l559J9384J3367j5047k3988J5K3177J4584j3332k0368
$$ -44938 -37220 -52652 -77342 -80901 -61517 -48150 -63197 -87185 -87170 -63993 -49409 -62741 -83109
143h3109J075K1727J3573j0907j7737N98J9474J2561q001j4381l9J6054J2662
$$ -83109 -82034 -60307 -46734 -57641 -75378 -74780 -55306 -42745 -50746 -65127 -65166 -49112 -36450
156c6450l057j2726m109J2006J4558J319j1335q071Q778J7400N661j1714j1621
$$ -36450 -39507 -52233 -56342 -44336 -29778 -28459 -39794 -47865 -39087 -21687 -16026 -27740 -39361
169c9361P857K0790P932j3908j3356P748K1233P906j3968j4143P969K1297Q144
$$ -39361 -31504 -10714 -2782 -16690 -30046 -22298 -1065 6841 -7127 -21270 -13301 7996 16140
182A6140j3463j3365P926K1735P404j2679j1140P480J7422P580q796r548K895
$$ 16140 2677 -10688 -2762 18973 26377 13698 2558 10038 27460 35040 26244 16696 19591
195A9591J3984Q828m711r971r20J0933J0459k322j1657m844Q884J2423j90j3548
$$ 19591 33575 42403 37692 27721 26801 37734 48193 45871 34214 29370 38254 50677 50487 36939
209C6939r092Q170J5458M36j5665j0842Q545J5137j211j8528j2506P507J3417
$$ 36939 27847 36017 51475 51911 36246 25404 33949 49086 47875 29347 16841 24348 37765
222C7765l455j8957j2584O673J1789k538j5678r735O059R931j190j2444r515K307
$$ 37765 34310 15353 2769 9442 21231 18693 3015 -6720 -661 9270 8080 -4364 -13879 -11572
236a1572P020n62j0991j1379k656O015M277o491j1628l652R497J0258k634j1262
$$ -11572 -4552 -5114 -16105 -27484 -30140 -24125 -19848 -26339 -37967 -41619 -32122 -21864 -24498 -35760
250c5760l698J1418J2062l887j4278o560J0953J1678n127j5484m504J3089J3203
$$ -35760 -39458 -28040 -15978 -19865 -34143 -40703 -29750 -18072 -23199 -38683 -43187 -30098 -16895
263a6895k276j1232K8J4788J3816q39q675j006J0571R653j828q874l746N323P988
$$ -16895 -19171 -30403 -30375 -15587 -1771 -2610 -11285 -12291 -1720 7933 6105 -2769 -6515 -1192 6796
278F796K048n264l401M877J1619P464j602n128L044J2137Q377m655j1351j883
$$ 6796 8844 3580 179 5056 16675 24139 22537 17409 20453 32590 40967 36312 24961 23078
292B3078R578P143q601j4538k343J1767P930p719j2560J221J3103P657p965j1657
$$ 23078 32656 39799 31198 16660 14317 26084 34014 26295 13735 14956 28059 35716 27751 16094
306A6094M1R653L218r145j1842k259N586K164o515r050k716M189M097j525o953
$$ 16094 16135 25788 29006 19861 8019 5760 11346 13510 6995 -2055 -4771 -582 3515 1990 -4963
321d963n435J430N466L30q331r827n51O525J307r258j1314N13J0219L794r321
$$ -4963 -10398 -8968 -3502 -3172 -11503 -21330 -21881 -15356 -14049 -23307 -34621 -34108 -23889 -20095 -29416
336b9416r830K936J2515L868r019r320L937J1497L109r084o832M803J0354K636
$$ -29416 -39246 -36310 -23795 -19927 -28946 -38266 -34329 -22832 -19723 -28807 -35639 -30836 -20482 -17846
350a7846o582m271L983Q376K836k962l750J737N752M784O62l682n72N157Q739
$$ -17846 -24428 -28699 -24716 -16340 -13504 -16466 -20216 -18479 -12727 -7943 -7281 -10963 -11535 -6378 2361
365B361K703m028l589N371J0523K961p927o939N288J0582J713j0492o353O728
$$ 2361 5064 1036 -2553 2818 13341 16302 8375 1436 6724 17306 19019 8527 2174 8902
379H902J1534J384q720l010R131J1211O36p259k082O744P129j411o479l442K747
$$ 8902 20436 21820 13100 10090 19221 30432 31068 23809 21727 28471 35600 34189 27710 24268 27015
394B7015L242k16m145l134l4L612K915j096m571k560L469N145j439q761n899L249
$$ 27015 30257 30041 25896 22762 22728 26340 29255 28159 23588 21028 24497 29642 28203 19442 13543 16792
410A6792O100l109j1036n193O142P626k857r935k750Q136P250m423j0054l305
$$ 16792 22892 19783 8747 3554 9696 17322 14465 4530 1780 9916 17166 12743 2689 -616
424f16O206K928p132r915l445K696K72n399o591k660J698Q77n91l006l315j72
$$ -616 5590 8518 1386 -8529 -11974 -9278 -9006 -14405 -20996 -23656 -21958 -21081 -21672 -24678 -27993 -28165
440b8165K263K509k119n945k293M188M272k673p877j899P057O106l555p784LR465
$$ -28165 -25902 -23393 -25512 -31457 -33750 -29562 -25290 -27963 -35840 -37739 -30682 -24576 -28131 -35915 -35912 -26447
456b6447N636m333p263J854R454M595m929n240L099Q320L794l351l213K845O011
$$ -26447 -20811 -25144 -32407 -30553 -21099 -16504 -21433 -26673 -23574 -15254 -11460 -14811 -18024 -15179 -9168
471i168L150j361j123Q73L122L376J493m91j616K330N178L668j263l329J441P074
$$ -9168 -6018 -7379 -8502 -7629 -4507 -1131 362 -129 -1745 585 5763 9431 8168 4839 6280 13354
487A3354M418l270n511J594P693L216m874n922K948Q088K482n425m837M120P178
$$ 13354 17772 14502 8991 10585 18278 21494 16620 10698 13646 21734 24216 18791 13954 18074 25252
502B5252J193n831m170K958M840l69m884l178J920K541K12j704k211pK651K106
$$ 25252 26445 20614 16444 19402 24242 23873 18989 15811 17731 20272 20484 18780 16569 16562 19213 21319
518B1319M20k933j709J138L165O65m170m731O53M548L68o228n483K310N438j56
$$ 21319 21739 18806 17097 18235 21400 22065 17895 13164 13817 18365 18733 12505 7022 9332 14770 14614
534A4614p384m749L148N069j703o871m039L527L928k181o262k359K782K849k042
$$ 14614 7230 2481 5629 10698 8995 2124 -1915 1612 5540 3359 -2903 -5262 -2480 369 -1673
549a673m791k126J282J498j436l223k600q68O36K08n45k527j854K230L972N53
$$ -1673 -6464 -8590 -7308 -5810 -7246 -10469 -13069 -13937 -13301 -13093 -13638 -16165 -18019 -15789 -11817 -11264
565a1264l881k150L577M245j003o126l350K912M207k175o850k655N061N099j748
$$ -11264 -15145 -17295 -13718 -9473 -10476 -16602 -19952 -17040 -12833 -15008 -21858 -24513 -19452 -14353 -16101
580a6101m547K31O387L967j729l724J44L398J261k437l341p26J869J013K69o87
$$ -16101 -20648 -20417 -14030 -10063 -11792 -15516 -15372 -11974 -10713 -13150 -16491 -17217 -15348 -14335 -14066 -14753
596a4753P99K047L228L790J337n44K2K750L278j381m752k847K400K748k071n456
$$ -14753 -13954 -11907 -8679 -4889 -3552 -4096 -4074 -1324 1954 573 -4179 -7026 -4626 -1878 -3949 -9405
612i405o78N885N275r24k809K946P577M748j676l258J805M500J630m274m140P06
$$ -9405 -10083 -4198 1077 153 -2656 290 7867 12615 10939 7681 9486 13986 15616 11342 7202 7908
628G908L092L99k107o63K248L634J225J915J631L91M44J820J151j700l844j773
$$ 7908 11000 11399 9292 8629 10877 14511 15736 17651 19282 19673 20117 21937 23088 21388 17544 15771
644A5771J317R00l284m555m18L891K865k294l833J477N920K433m180m589J078
$$ 15771 17088 17988 14704 10149 9731 13622 16487 14193 10360 11837 17757 20190 16010 11421 12499
659A2499L270q49o267l926O98K170j733l966j649K038K298o37j351K28M52J31
$$ 12499 15769 14920 8653 4727 5425 7595 5862 1896 247 2285 4583 3946 2595 2823 3275 3406
675C406p1j201j701k200j737J02k85k048l790k70K406J728k666l895J734M400
$$ 3406 3335 2134 433 -1767 -3504 -3402 -3687 -5735 -9525 -9795 -7389 -5661 -8327 -12222 -10488 -6088
691f088J199m725l250K441L647r07n248k440K305L502j376m775j237L544K345
$$ -6088 -4889 -9614 -12864 -10423 -6776 -7683 -12931 -15371 -13066 -9564 -10940 -15715 -16952 -13408 -11063
706a1063k188k659O32J921N02q48q95M52J79k62O18M50J6j112L69K374J580j210
$$ -11063 -13251 -15910 -15278 -13357 -12855 -13703 -14598 -14146 -13967 -14229 -13611 -13161 -13145 -14257 -13888 -11514 -9934 -11144
724a1144k066J545M339J174k986j778L155M858j67l582r82M612M153j168l441
$$ -11144 -13210 -11665 -7326 -6152 -9138 -10916 -7761 -2903 -3070 -6652 -7634 -3022 1131 -37 -3478
739c478M67M902K916k121j983J871L362J254j432l75J824J916K82l70K10J012
$$ -3478 -3011 1891 4807 2686 703 2574 5936 7190 5758 5383 7207 9123 9405 9035 9245 10257
755A0257L05P2J436J377l92j319J395L097Q95k989j445K786L137j556m400j445
$$ 10257 10562 10634 12070 13447 13055 11736 13131 16228 17123 14134 12689 15475 18612 17056 12656 11211
771A1211L033K386k283m550K32L689J868k994k479J582L626L00l449j691R87J305
$$ 11211 14244 16630 14347 9797 10029 13718 15586 12592 10113 11695 15321 15621 12172 10481 11468 12773
787A2773j910k658j297Kj248j813q47K93o40j849n52Q36m44k765k386m2J96k688
$$ 12773 10863 8205 6908 6910 5662 3849 3002 3295 2655 806 254 1090 646 -2119 -4505 -4547 -4351 -7039
805g039n244k315J536Q85l509l764P94M270J759k226j769L536M115L48l265j375
$$ -7039 -12283 -14598 -13062 -12177 -15686 -19450 -18656 -14386 -12627 -14853 -16622 -13086 -8971 -8623 -11888 -13263
821a3263J247R86k693l404j793Q50J21j763l58R61J849R10J214K545K033L17J74
$$ -13263 -12016 -11030 -13723 -17127 -18920 -18070 -17949 -19712 -20070 -19109 -17260 -16350 -15136 -12591 -10558 -10241 -10067
838a0067K696K283m81j497K38L357K527q51r85K339M880K889m14l30L727L560
$$ -10067 -7371 -5088 -5569 -7066 -6828 -3471 -944 -1795 -2780 -441 4439 7328 6914 6584 10311 13871
854A3871K96l201j311J690R81k263m219j097J826M39r53j192J820K342J519O55
$$ 13871 14167 10966 9655 11345 12326 10063 5844 4747 6573 7012 6059 4867 6687 9029 10548 11203
870A1203J192J362J024m65L61K08q84j611j486m1L86k237k321K16J970j59k563
$$ 11203 12395 13757 14781 14316 14677 14885 14001 12390 10904 10863 11249 9012 6691 6907 8877 8718 6155
887F155j987J635K067j220l684j914J709J185j743l807q35K066Q19j813j919Q19
$$ 6155 4168 5803 7870 6650 2966 1052 2761 3946 2203 -1604 -2439 -373 446 -1367 -3286 -2467
903b467K250j70j772n29R05J40j200j252m98k44j080r43j49J43j133j723k44J689
$$ -2467 -217 -387 -2159 -2688 -1783 -1643 -2843 -4095 -4593 -4837 -5917 -6860 -7009 -6866 -7999 -9722 -9966 -8277
921h277J08j784j804Q77J713j17k657r58K120J945q30k543O3L176J783j931j883
$$ -8277 -8169 -9953 -11757 -10880 -9167 -9284 -11941 -12899 -10779 -8834 -9664 -12207 -12144 -8968 -7185 -9116 -10999
938a0999J159K523K3j251q23J575K084K61n75O68K396J409P06M87J708J688l5
$$ -10999 -9840 -7317 -7294 -8545 -9368 -7793 -5709 -5448 -6023 -5355 -2959 -1550 -844 -357 1351 3039 3004
955C004K12J060J329l70l67N59J890K90j207l02K365K576l52j489N25L137J698
$$ 3004 3216 4276 5605 5235 4868 5427 7317 7607 6400 6098 8463 11039 10687 9198 9723 12860 14558
972A4558j503k060Q07K562mk841j602J910J305r43k164m93J770M85j409j666K02
$$ 14558 13055 10995 11802 14364 14360 11519 9917 11827 13132 12189 10025 9532 11302 11787 10378 8712 8914
989H914Q50j231j695o17L10j293j704m87J75n90k131j384M72J347j667k647p25
$$ 8914 9764 8533 6838 6221 6531 5238 3534 3047 3222 2632 501 -883 -411 936 -731 -3378 -4103
1006d103J466N87k448k632K41K407p89k724j538J179J758j755k471o82J469N99
$$ -4103 -2637 -2050 -4498 -7130 -6889 -4482 -5271 -7995 -9533 -8354 -6596 -8351 -10822 -11504 -10035 -9436
1022i436j989k098O83J379n17j223QJ287R08q37j67J295J013p69o76O54J479l87
$$ -9436 -11425 -13523 -12840 -11461 -11978 -13201 -13193 -11906 -10998 -11835 -12002 -10707 -9694 -10463 -11139 -10485 -9006 -9393
1040i393j650k72K084J523r98q34J238L476J064j378R0K708K853l07j876K61K753
$$ -9393 -11043 -11315 -9231 -7708 -8706 -9540 -8302 -4826 -3762 -5140 -5050 -2342 511 204 -1672 -1411 1342
1057A342J337j632o73J137K576P20r43R07K610J911N0K81J298J617K06q64L59
$$ 1342 2679 1047 374 1511 4087 4807 3864 4771 7381 9292 9342 9623 10921 12538 12744 11880 12239
1074A2239J392m27j683m95J288J239j348j454J073K128K20j556n32J166J731r75
$$ 12239 13631 13204 11521 11026 12314 13553 12205 10751 11824 13952 14172 12616 12084 13250 14981 14006
1090A4006k828m19J885K58k386k382k04J758m58k607j452J130M48j808j684r52
$$ 14006 11178 10759 12644 12902 10516 8134 7930 9688 9230 6623 5171 6301 6749 4941 3257 2305
1106B305N60q21k302j247R4p13j616j618M9N64j760j881n58M95j72k520j950P53
$$ 2305 2865 2044 -258 -1505 -1411 -2124 -3740 -5358 -5309 -4745 -6505 -8386 -8944 -8449 -8621 -11141 -13091 -12338
1124a2338J046j427k573n07K025R04k014j628J280K442n16j873p52J638J230q63
$$ -12338 -11292 -12719 -15292 -15799 -13774 -12870 -14884 -16512 -15232 -12790 -13306 -15179 -15931 -14293 -13063 -13926
1140a3926j707N41K181R85j101N44K397K054N24J65J694J685O25n82O50J437P91
$$ -13926 -15633 -15092 -12911 -11926 -13027 -12483 -10086 -8032 -7508 -7343 -5649 -3964 -3339 -3921 -3271 -1834 -1043
1157a043j294k10J575K312N17m33J521L541K697K14O27K057L267P77j286m15J446
$$ -1043 -2337 -2547 -972 1340 1857 1424 2945 6486 9183 9397 10024 12081 15348 16125 14839 14424 15870
1174A5870J064j203k371j6J515j11j252j202J494J177k60j493L42Q84q32j848
$$ 15870 16934 15731 13360 13344 14859 14748 13496 12294 13788 14965 14705 13212 13554 14438 13606 11758
1190A1758j376l0p12k018j930p1N13m60j908J52J173J011j449j386K58O91p67
$$ 11758 10382 10352 9640 7622 5692 5621 6134 5674 3766 3918 5091 6102 4653 3267 3525 4216 3449
1207C449l252k372j05l42k635l108p72M14l55j769j193J363Q19K44n30k86J362
$$ 3449 197 -2175 -2280 -2622 -5257 -8365 -9137 -8723 -9078 -10847 -12040 -10677 -9858 -9614 -10144 -10430 -9068
1224i068L11j196p26M14O04r92j095J73R43k00n76k61J239J199k78j211K89K317
$$ -9068 -8757 -9953 -10679 -10265 -9661 -10653 -11748 -11575 -10632 -10832 -11408 -11669 -10430 -9231 -9509 -10720 -10431 -8114
1242h114Q2j624r31J378J358m79j180L42J924J527q65k26J342K043J068o63M82
$$ -8114 -8032 -9656 -10587 -9209 -7851 -8330 -9510 -9168 -7244 -5717 -6582 -6808 -5466 -3423 -2355 -3018 -2536
1259b536J631J455k46k54N50J859P88p28O17J246R88L12J1J116J244N70m49N46
$$ -2536 -905 550 304 50 600 2459 3247 2519 3136 4382 5370 5682 5693 6809 8053 8623 8174 8720
1277H720J634R38m67n47J129J760j36j069o5J179R93r66j190O22J271J71j623
$$ 8720 10354 11292 10825 10278 11407 13167 13031 11962 11897 13076 14069 13103 11913 12535 13806 13977 12354
1294A2354j333P00R11q21j543n43P60J55j752j258J51K75j475j945j7K89o02j896
$$ 12354 11021 11721 12632 11811 10268 9725 10485 10640 8888 7630 7781 8056 6581 4636 4619 4908 4306 2410
1312B410j191M49J74j636j892n29N04n67k169j119N33M55j377k010l67J621k15
$$ 2410 1219 1668 1842 206 -1686 -2215 -1711 -2278 -4447 -5566 -5033 -4578 -5955 -7965 -8332 -6711 -6926
1329f926j870j354P15J092j008k138k80P65N29j860j300R47R98l1q35K74J380
$$ -6926 -8796 -10150 -9435 -8343 -9351 -11489 -11769 -11004 -10475 -12335 -13635 -12688 -11690 -11721 -12556 -12282 -10902
1346a0902J033k28j22O48J751n31j239k6J383M7j240p68J535J485m6o43J284K122
$$ -10902 -9869 -10097 -10219 -9571 -7820 -8351 -9590 -9616 -8233 -8186 -9426 -10194 -8659 -7174 -7220 -7863 -6579 -4457
1364d457J594l93J45J920K112n75j186J76J700R15r07r40J387K034R31l84J045
$$ -4457 -2863 -3256 -3111 -1191 921 346 -840 -664 1036 1951 1044 104 1491 3525 4456 4072 5117
1381E117K238J937M41p33J247J352l46j421o21O11L8j602q21L98J593J71r32O12
$$ 5117 7355 9292 9733 9000 10247 11599 11253 9832 9211 9822 9860 8258 7437 7835 9428 9599 8667 9279
1399I279K028J072p70q08O00J324j104k838j005M12j77k398k112J86J328r64j087
$$ 9279 11307 12379 11609 10801 11401 12725 11621 8783 7778 8190 8013 5615 3503 3689 5017 4053 2966
1416B966o76J492R84j129j523j89Q64r04k762j692M15n45j920j674k72J121l83
$$ 2966 2290 3782 4766 3637 2114 1925 2789 1885 -877 -2569 -2154 -2699 -4619 -6293 -6565 -5444 -5827
1433e827j378J6J730Q37j119q07L54J062p38k199o66Q24P07j715j268O89J608
$$ -5827 -7205 -7189 -5459 -4622 -5741 -6548 -6194 -5132 -5870 -8069 -8735 -7911 -7204 -8919 -10187 -9498 -7890
1450g890O59j084j49J448K269p07r87M16J412L43j181n89J084J107r85l78L11
$$ -7890 -7231 -8315 -8464 -7016 -4747 -5454 -6441 -6025 -4613 -4270 -5451 -6040 -4956 -3849 -4834 -5212 -4901
1467d901J454P61n47K15J908J287l66l97O13J960N84j563j36J743J182n74j022
$$ -4901 -3447 -2686 -3233 -3018 -1110 177 -189 -586 27 1987 2571 1008 872 2615 3797 3223 2201
1484B201J80J973L71j152j17R39J633p70j295K13J536M73j425o43J081Q22n02
$$ 2201 2381 4354 4725 3573 3456 4395 6028 5258 3963 4176 5712 6185 4760 4117 5198 6020 5518
1501E518j328j28J515J70j171j052R51M42q28j194j35J231R3j340j082J142O51
$$ 5518 4190 4062 5577 5747 4576 3524 4475 4917 4089 2895 2760 3991 4084 2744 1662 2804 3455
1518C455m13j888N12J177k80j319p15M90J043r03j353m56J461O74j849r29J123
$$ 3455 3042 1154 1666 2843 2563 1244 529 1019 2062 1159 -194 -650 811 1485 -364 -1293 -170
1535a70J051q15j052J1P93O78j499q13J014N21m07j306K77R58K78j258j085O97
$$ -170 881 66 -986 -975 -182 496 -1003 -1816 -802 -281 -688 -1994 -1717 -759 -481 -1739 -2824 -2127
1553b127R89o15j548K46J079J63j196o75Q65J199n93j174pQ17N59j232r41L30
$$ -2127 -1138 -1753 -3301 -3055 -1976 -1813 -3009 -3684 -2819 -1620 -2213 -3387 -3394 -2577 -2018 -3250 -4191 -3861
1571c861O99q1j343m01J219O21o86q04N22J164Q7j051J27P34M20n79j078M71J011
$$ -3861 -3162 -3243 -4586 -4987 -3768 -3147 -3833 -4637 -4115 -2951 -2864 -3915 -3788 -3054 -2634 -3213 -4291 -3820 -2809
1590b809o5m90k03J813R98o9k01J427J772K59m18l52J385M20m45j557j90R38j76
$$ -2809 -2874 -3364 -3567 -1754 -756 -825 -1026 401 2173 2432 2014 1662 3047 3467 3022 1465 1275 2213 2037
1609B037j660k58Q22J209o91l76R95J203K65o50j76P00L85n66j167OQ31mp64o80
$$ 2037 377 119 941 2150 1459 1083 2078 3281 3546 2896 2720 3420 3805 3239 2072 2078 2909 2905 2141 1461
1629A461Q24J043o20l47L6J149m4r52j229L48M71j166j615m80P06l17r90q16R34
$$ 1461 2285 3328 2708 2361 2397 3546 3502 2550 1321 1669 2140 974 -641 -1121 -415 -732 -1722 -2538 -1604
1648a604J186N88p41J85J332J195p18m10O21P96l81j421O7M60O95j089q21L00
$$ -1604 -418 170 -571 -386 946 2141 1423 1013 1634 2430 2049 628 695 1155 1850 761 -60 240
1666B40J001k62p66l41J227K71q53r94O73J117o32j263j91J029N94q58p25R60
$$ 240 1241 979 213 -128 1099 1370 517 -477 196 1313 681 -582 -773 256 850 -8 -733 227
1684B27R61m50j046l32J062N97j100j039L45O80N1r79m98J072M69o56q20N90Q34
$$ 227 1188 738 -308 -640 422 1019 -81 -1120 -775 -95 -44 -1023 -1521 -449 20 -636 -1456 -866 -32
1703c2k12j276l54P89N70j096q40O71R26pr32k6J362N10o74q84QJ587m91j267
$$ -32 -244 -1520 -1874 -1085 -515 -1611 -2451 -1780 -854 -861 -1793 -1819 -457 53 -621 -1505 -1497 90 -401 -1668
1723a668r92R63O72r53n05M73J604N3q43J66J358R06n18j096J49Q87j74j316p79
$$ -1668 -2660 -1697 -1025 -1978 -2483 -2010 -406 -353 -1196 -1030 328 1234 716 -380 -231 656 482 -834 -1613
1742a613O10O5l70j083J83J516Ro72j6J514J310p30p18K75J316l81j395l77Q21
$$ -1613 -1003 -938 -1308 -2391 -2208 -692 -683 -1355 -1371 143 1453 723 5 280 1596 1215 -180 -557 264
1761B64O69p87j170P08J065M60p90o73J338R34o16j009k02J058j3j546p33N47
$$ 264 933 146 -1024 -316 749 1209 419 -254 1084 2018 1402 393 191 1249 1236 -310 -1043 -496
1779d96P25o46j246M86J089M88p11n63Q12R95m77q77L24O40m4j210j015J329N56
$$ -496 229 -417 -1663 -1177 -88 400 -311 -874 -62 933 456 -421 -97 543 499 -711 -1726 -397 159
1798A59l80j436O1J643O9r90n08J122Q68l07j018p4J454j30j063N9R85Q39l83
$$ 159 -221 -1657 -1596 47 116 -874 -1382 -260 608 301 -717 -791 663 533 -530 -471 514 1353 970
1817I70j087J97J259K46n77m35M53R09o62n93K51P67N18p64l92O41J036m94j148
$$ 970 -117 80 1339 1585 1008 573 1026 1935 1273 680 931 1698 2216 1452 1060 1701 2737 2243 1095
1836A095J4J127L94j091m51N19Q92j9j310k35J318K90p67q29R24O78m10r60m24
$$ 1095 1109 2236 2630 1539 1088 1607 2499 2480 1170 935 2253 2543 1776 947 1871 2549 2139 1179 755
1855G55J214j4q78q50N28N28l24r26m16J217j36l44r50N21J068p88o73k40Q55
$$ 755 1969 1955 1077 227 755 1283 959 33 -383 834 698 354 -596 -75 993 205 -468 -708 147
1874A47K39q30j020P93P42m30j087j56R54M6q92q18R6J010k10j347m42J093N20
$$ 147 386 -444 -1464 -671 71 -359 -1446 -1602 -648 -602 -1494 -2312 -2216 -1206 -1416 -2763 -3205 -2112 -1592
1893a592j001k08K77M60M96j287l10Q67K89q77p09P2R08j11j010nJ074L72j03
$$ -1592 -2593 -2801 -2524 -2064 -1568 -2855 -3165 -2298 -2009 -2886 -3595 -3523 -2615 -2726 -3736 -3741 -2667 -2295 -2398
1912b398l93R31R99O3p65m3R08O80q47q90L10R56L92p71p2J183P97J43n87M39
$$ -2398 -2791 -1860 -861 -798 -1563 -1606 -698 -18 -865 -1755 -1445 -489 -97 -868 -940 243 1040 1183 596 1035
1932A035J493R9r24q57O26K22n23j589K15N67M81o94m50J598J041n4N4O62J118
$$ 1035 2528 2627 1703 846 1472 1694 1171 -418 -203 364 845 151 -299 1299 2340 2286 2340 3002 4120
1951D120N51o75j064R05J0q59j086l43N16q33n76m39R55N02l77m02J23R24j29
$$ 4120 4671 3996 2932 3837 3847 2988 1902 1559 2075 1242 666 227 1182 1684 1307 905 1028 1952 1823
1970A823l58q44N6N30p45r95k77J060K37p66k83R95J305Ln96M98M81j71j185p56
$$ 1823 1465 621 677 1207 462 -533 -810 250 487 -279 -562 433 1738 1741 1145 1643 2124 1953 768 12
1990A2O0n22o25j625o99K87J49l50r96O74J007j2p09K56J104N16n38n85J86O76
$$ 12 72 -450 -1075 -2700 -3399 -3112 -2963 -3313 -4309 -3635 -2628 -2640 -3349 -3093 -1989 -1473 -2011 -2596 -2410 -1734
2010a734n4p81p95J162J97J1j065N74J611k5r64l8R62L70l65p18K21R17K19q89
$$ -1734 -1788 -2569 -3364 -2202 -2005 -1994 -3059 -2485 -874 -899 -1863 -1901 -939 -569 -934 -1652 -1431 -514 -295 -1184
2030a184l86J196J045o10l98J066J423K03p24P8R58Q19j29j247L83J188k79o27
$$ -1184 -1570 -374 671 61 -337 729 2152 2355 1631 1709 2667 3486 3357 2110 2493 3681 3402 2775
2048B775q88R35M56m57p25J09J112j64q55n02Q52N98j005o18k05J284r6j068m26
$$ 2775 1887 2822 3278 2821 2096 2205 3317 3153 2298 1796 2648 3246 2241 1623 1418 2702 2606 1538 1112
2067A112M62P58m98q58j60N16N39j191p90Q89O42n91j144J42J020M44j330n21
$$ 1112 1574 2332 1834 976 816 1332 1871 680 -110 779 1421 830 -314 -172 848 1292 -38 -559
2085e59O44Q26p85p89n4Q94R4q13m28J65R35l20r59j05N77K06q70o03M95J002
$$ -559 85 911 126 -663 -717 177 271 -542 -970 -805 130 -190 -1149 -1254 -677 -471 -1341 -1944 -1449 -447
2105d47o93r49J1Q82K65j592l49Q61Q55q59j030l89R37J87j252n33L43R73n26
$$ -447 -1140 -2089 -2078 -1196 -931 -2523 -2872 -2011 -1156 -2015 -3045 -3434 -2497 -2310 -3562 -4095 -3752 -2779 -3305
2124c305q37M1J097N4r1p44O15R12p1r89m7N98K74j014q57J095R53j36n77L53
$$ -3305 -4142 -4101 -3004 -2950 -3041 -3785 -3170 -2258 -2329 -3318 -3365 -2767 -2493 -3507 -4364 -3269 -2316 -2452 -3029 -2676
2144b676J224N02l61k7M87J473k42n22l89J371K33o92o13N40J591Q9o52L85J269
$$ -2676 -1452 -950 -1311 -1338 -851 622 380 -142 -531 840 1073 381 -232 308 1899 1988 1336 1721 2990
2163B990Q75l55k31R71O21k1q15k63O02J05j047o97K87Q45Lo00j25J316M19n34
$$ 2990 3865 3510 3279 4250 4871 4850 4035 3772 4374 4479 3432 2735 3022 3867 3870 3270 3145 4461 4880 4346
2183D346l15N24N90m00j289l14J82k16q26j170L17J63r5o30n3O46M03n83j005
$$ 4346 4031 4555 5145 4745 3456 3142 3324 3108 2282 1112 1429 1592 1497 867 814 1460 1863 1280 275
2202B75J67N15M1j112q88J16L25j372j093L35O93n83Q3p91J050O41q20k51J78
$$ 275 442 957 998 -114 -1002 -886 -561 -1933 -3026 -2691 -1998 -2581 -2498 -3289 -2239 -1598 -2418 -2669 -2491
2221b491Q61l12o81n00L71M76m72o83L90P51M29q94J50J039R31j81r12O25Q72
$$ -2491 -1630 -1942 -2623 -3123 -2752 -2276 -2748 -3431 -3041 -2290 -1861 -2755 -2605 -1566 -635 -816 -1728 -1103 -231
2240b31K36p53l20L43P03l76n76M40N91N17n65m12J270K38j67l50j9R95L9o26
$$ -231 5 -748 -1068 -725 -22 -398 -974 -534 57 574 9 -403 867 1105 938 588 569 1564 1603 977
2260I77m02M06R24q60l06J78L54M73r18p72M41R03q57q37p5Q37Ml93l71L02P11
$$ 977 575 981 1905 1045 739 917 1271 1744 826 54 495 1398 541 -296 -371 466 470 77 -294 8 719
2281G19j25n65n03P78K40q23m01K97N77l53j184J03Q10L91m89o39R59M32k93l75
$$ 719 594 29 -474 304 544 -279 -680 -383 194 -159 -1343 -1240 -430 -39 -528 -1167 -208 224 -69 -444
2301d44r9O80M44o37n92J32P42l39o85n3L24N58n07n70N52Q29j59o64j38O06O9
$$ -444 -543 137 581 -56 -648 -516 226 -113 -798 -851 -527 31 -476 -1046 -494 335 176 -488 -626 -20 49
2322D9o82o97l4Q19l64p52m61J017N83o55p26M71Q69m9p07mM19P30n83o24P0L52
$$ 49 -633 -1330 -1364 -545 -909 -1661 -2122 -1105 -522 -1177 -1903 -1432 -563 -612 -1319 -1323 -904 -174 -757 -1381 -1311 -959
$$ [...]
8191C00
##END NTUPLES=NMR FID
##END=
