##TITLE=1H_SA_PPh3vCl(H2O')
 CDCl3, 8 sc, 
 19.9.2019
##JCAMPDX= 6.0         $$ Bruker NMR JCAMP-DX V2.0
##DATA TYPE= NMR FID
##DATA CLASS= NTUPLES
##ORIGIN= UXNMR, Bruker Analytische Messtechnik GmbH
##OWNER= root
$$ XWIN-NMR		Version 3.5
$$ Thu Sep 19 14:49:00 2019 Russian Standard Time (UT+4h)  she@DPX200
##.OBSERVE FREQUENCY= 200.1315
##.OBSERVE NUCLEUS= ^1H
##.DELAY= (6, 6)
##.ACQUISITION MODE= SIMULTANEOUS
##.ACQUISITION SCHEME= undefined
##.AVERAGES= 8
##.DIGITISER RES= 18
##SPECTROMETER/DATA SYSTEM= spect
##.PULSE SEQUENCE= zg30
##.SOLVENT NAME= CDCl3
##.SHIFT REFERENCE= (INTERNAL, CDCl3, 0, 15.7039)
##AUDIT TRAIL= $$ (NUMBER, WHEN, WHO, WHERE, WHAT)
$$ ##TITLE= Audit trail, XWIN-NMR		Version 3.5
$$ ##JCAMPDX= 5.01
$$ ##ORIGIN= Bruker BioSpin GmbH
$$ ##OWNER= she
$$ F:/spectra/data/she/nmr/H-F/1/audita.txt
$$ ##AUDIT TRAIL=  $$ (NUMBER, WHEN, WHO, WHERE, WHAT)
(   1,<2019-09-19 14:44:09.14 +0400>,<she>,<DPX200>,
      <created by zg, POWCHK disabled, PULCHK disabled
       configuration hash MD5:
       00 E9 B6 7A A2 85 ED C7 34 08 36 98 17 FE 4E 26
       data hash MD5: 16K
       B0 E4 CA 21 0E 84 2A 8E AE 51 94 43 4A 65 D6 4A>)
$$ ##END=
$$ 
$$ hash MD5
$$ 91 23 F4 EB 98 C9 A0 9F 75 0C B4 1E 17 4D AD 7B
##$RELAX= 
##$RELAX= 
##$RELAX= 
##$RELAX= 
##$RELAX= 
##$RELAX= 
$$ Bruker specific parameters
$$ --------------------------
##$DU= <F:/spectra>
##$EXPNO= 1
##$NAME= <H-F>
##$PROCNO= 1
##$TYPE= <nmr>
##$USER= <she>
##$AMP= (0..31)
100 100 100 100 100 100 100 100 100 100 100 100 100 100 100 100 100 100 
100 100 100 100 100 100 100 100 100 100 100 100 100 100 
##$AQSEQ= 0
##$AQ_mod= 1
##$AUNM= <au_zg>
##$AUTOPOS= <>
##$BF1= 200.13
##$BF2= 200.13
##$BF3= 200.13
##$BF4= 200.13
##$BF5= 200.13
##$BF6= 200.13
##$BF7= 200.13
##$BF8= 200.13
##$BYTORDA= 1
##$CFDGTYP= 0
##$CFRGTYP= 5
##$CHEMSTR= <none>
##$CNST= (0..31)
1 1 145 1 1 1 1 1 1 1 1 1 1 1 1 1 1 1 1 1 1 1 1 1 1 1 1 1 1 1 1 1 
##$CPDPRG= <>
##$CPDPRG1= <>
##$CPDPRG2= <>
##$CPDPRG3= <>
##$CPDPRG4= <mlev>
##$CPDPRG5= <mlev>
##$CPDPRG6= <mlev>
##$CPDPRG7= <mlev>
##$CPDPRG8= <mlev>
##$CPDPRGB= <>
##$CPDPRGT= <>
##$D= (0..31)
0 1.2 0 0 0 0 0 0 0 0.06 0 0.03 0 0 0 0 0.0002 0 0 0 0 0 0 0 0 0 0 0 0 
0 0 0 
##$DATE= 1568889848
##$DBL= (0..7)
120 120 120 120 120 120 120 120 
##$DBP= (0..7)
150 150 150 150 150 150 150 150 
##$DBP07= 0
##$DBPNAM0= <>
##$DBPNAM1= <>
##$DBPNAM2= <>
##$DBPNAM3= <>
##$DBPNAM4= <>
##$DBPNAM5= <>
##$DBPNAM6= <>
##$DBPNAM7= <>
##$DBPOAL= (0..7)
0.5 0.5 0.5 0.5 0.5 0.5 0.5 0.5 
##$DBPOFFS= (0..7)
0 0 0 0 0 0 0 0 
##$DE= 6
##$DECBNUC= <off>
##$DECIM= 24
##$DECNUC= <off>
##$DECSTAT= 4
##$DIGMOD= 1
##$DIGTYP= 9
##$DL= (0..7)
0 120 120 120 120 120 120 120 
##$DP= (0..7)
150 150 150 150 150 150 150 150 
##$DP07= 0
##$DPNAME0= <>
##$DPNAME1= <>
##$DPNAME2= <>
##$DPNAME3= <>
##$DPNAME4= <>
##$DPNAME5= <>
##$DPNAME6= <>
##$DPNAME7= <>
##$DPOAL= (0..7)
0.5 0.5 0.5 0.5 0.5 0.5 0.5 0.5 
##$DPOFFS= (0..7)
0 0 0 0 0 0 0 0 
##$DQDMODE= 0
##$DR= 18
##$DS= 0
##$DSLIST= <SSSSSSSSSSSSSSS>
$$ [...]
##$SUBNAM2= <"">
##$SUBNAM3= <"">
##$SUBNAM4= <"">
##$SUBNAM5= <"">
##$SUBNAM6= <"">
##$SUBNAM7= <"">
##$SUBNAM8= <"">
##$SUBNAM9= <"">
##$SW= 24.0689530833862
##$SWIBOX= (0..15)
0 0 2 0 0 0 0 0 0 0 0 0 0 0 0 0 
##$SW_h= 4816.95568400771
##$TD= 16384
##$TD0= 1
##$TE= 0
##$TE2= 300
##$TE3= 300
##$TEG= 300
##$TL= (0..7)
0 120 120 120 120 120 120 120 
##$TP= (0..7)
150 150 150 150 150 150 150 150 
##$TP07= 0
##$TPNAME0= <>
##$TPNAME1= <>
##$TPNAME2= <>
##$TPNAME3= <>
##$TPNAME4= <>
##$TPNAME5= <>
##$TPNAME6= <>
##$TPNAME7= <>
##$TPOAL= (0..7)
0.5 0.5 0.5 0.5 0.5 0.5 0.5 0.5 
##$TPOFFS= (0..7)
0 0 0 0 0 0 0 0 
##$TUNHIN= 0
##$TUNHOUT= 0
##$TUNXOUT= 0
##$USERA1= <user>
##$USERA2= <user>
##$USERA3= <user>
##$USERA4= <user>
##$USERA5= <user>
##$V9= 5
##$VALIST= <valist>
##$VCLIST= <CCCCCCCCCCCCCCC>
##$VD= 0
##$VDLIST= <DDDDDDDDDDDDDDD>
##$VPLIST= <PPPPPPPPPPPPPPP>
##$VTLIST= <TTTTTTTTTTTTTTT>
##$WBST= 1024
##$WBSW= 4
##$XGAIN= (0..3)
0 0 0 0 
##$XL= 0
##$YL= 0
##$YMAX_a= 46679
##$YMIN_a= -64742
##$ZGOPTNS= <>
##$ZL1= 120
##$ZL2= 120
##$ZL3= 120
##$ZL4= 120
##$ABSF1= 10
##$ABSF2= 0
##$ABSG= 5
##$ABSL= 3
##$ALPHA= 0
##$AQORDER= 0
##$ASSFAC= 0
##$ASSFACI= 0
##$ASSFACX= 0
##$ASSWID= 0
##$AUNMP= <proc_1d>
##$AZFE= 0.1
##$AZFW= 0.1
##$BCFW= 1
##$BC_mod= 2
##$BYTORDP= 1
##$COROFFS= 0
##$CY= 11.3945322036743
##$DATMOD= 1
##$DC= 2
##$DFILT= <>
##$DTYPP= 0
##$F1P= 20.1720416913024
##$F2P= 0.152960286110954
##$FCOR= 0.5
##$FTSIZE= 0
##$FT_mod= 4
##$GAMMA= 1
##$GB= 0.15
##$INTBC= 1
##$INTSCL= 1
##$ISEN= 128
##$LB= 0.24
##$LEV0= 0
##$LPBIN= 0
##$MAXI= 10000
##$MC2= 0
##$MEAN= 0
##$ME_mod= 0
##$MI= 1.114404
##$NCOEF= 0
##$NC_proc= 0
##$NLEV= 6
##$NOISF1= 3.799351
##$NOISF2= 2.8
##$NSP= 1
##$NTH_PI= 0
##$NZP= 0
##$OFFSET= 15.70392
##$PC= 1
##$PHC0= -9651.893
##$PHC1= 10.60096
##$PH_mod= 1
##$PKNL= yes
##$PPARMOD= 0
##$PSCAL= 0
##$PSIGN= 0
##$REVERSE= no
##$SF= 200.130013532006
##$SI= 16384
##$SIGF1= 3
##$SIGF2= 2
##$SINO= 400
##$SIOLD= 16384
##$SREGLST= <1H.CDCl3>
##$SSB= 0
##$STSI= 0
##$STSR= 0
##$SW_p= 3612.71676300578
##$SYMM= 0
##$S_DEV= 0
##$TDeff= 0
##$TDoff= 0
##$TI= <>
##$TILT= no
##$TM1= 0
##$TM2= 0
##$TOPLEV= 0
##$USERP1= <user>
##$USERP2= <user>
##$USERP3= <user>
##$USERP4= <user>
##$USERP5= <user>
##$WDW= 1
##$XDIM= 8192
##$YMAX_p= 0
##$YMIN_p= 0
$$ End of Bruker specific parameters
$$ ---------------------------------
##NTUPLES= NMR FID
##VAR_NAME=  TIME,          FID/REAL,        FID/IMAG
##SYMBOL=    X,             R,               I
##VAR_TYPE=  INDEPENDENT,   DEPENDENT,       DEPENDENT
##VAR_FORM=  AFFN,          ASDF,            ASDF
##VAR_DIM=   8192,          8192,            8192
##UNITS=     SECONDS,       ARBITRARY UNITS, ARBITRARY UNITS
##FACTOR=    0.0002076,     1,               1
##FIRST=     0,             0,               0
##LAST=      1.7004516,     0,               0
##MIN=       0,             -64742,          0
##MAX=       1.7004516,     46679,           0
$$ Real data points
##PAGE= N=1
##DATA TABLE= (X++(R..R)), XYDATA
0@%%%%%%%%%%%%%%%%%%oJ4j6J6j6J6j6J6k3L1l2L2l8M6m8N4o2O8p6Q5r3J02j15
41f1J27j39J54j71J91k11K35k64K95l34L80m35N08o04P32r22J234j821L294j3672
61a1484l1929J2119O500p850j789l409j5368L65Q927n654n063R583J888n791J875
76d7080M005K249R631Q689K385N152M777l048O87R669J0906Q761K374n247J583
91A5493J0728N634K768N249l504o833L986J178p544M296Q818r102j0986J562m019
106A7724q138L226J34j0789l770p8r032m258N360p36m326j015o314o627L957L301
122b1381k308L378L523m706j529M552K780N600O843l000m228M945M002J622O392
137F485J969m112L565L988o545q92R584J508m528J581j352n868K671N395k303
$$ plain form
0 0 0 0 0 0 0 0 0 0 0 0 0 0 0 0 0 0 0 0 -6 8 -8 8 -8 8 -8 8 -15 16 -16 16 -22 24 -24 30 -32 36 -40 45 -48 54 -61
41 -61 66 -73 81 -90 101 -110 125 -139 156 -178 202 -233 275 -329 403 -519 715 -1106 2188 -11484
61 -11484 -43413 -31294 -24794 -32644 -34433 -37842 -53210 -52845 -43918 -49572 -54635 -45052 -43164 -48955 -47080
76 -47080 -43075 -40826 -31195 -22506 -20121 -14969 -10192 -13240 -12553 -2884 8022 16783 19157 13910 15493
91 15493 26221 31855 34623 39872 36368 29535 33521 34699 27155 31451 40269 31167 20181 21743 17724
106 17724 9586 12812 12946 2157 -1613 -1691 -10723 -14981 -9621 -10357 -14683 -15698 -22012 -28639 -24682 -21381
122 -21381 -23689 -20311 -16788 -21494 -23023 -18471 -15691 -10091 -3248 -6248 -10476 -5531 -1529 93 6485
137 6485 8454 4342 7907 11895 5350 4458 14042 15550 11022 12603 11251 5383 8054 13449 11146
152A1146j762O24m885m692J343J404K32Km763n378Q27J001j732R99Q65k336l67
169g472l1k759J754N299Kj075J764k204j969N690L247k639K769K828o347k439
185c582O963J970k231K852r5n592P30M442j054o44K452j785l328M83k6p76J938
202B717L00k816p09l23k536J11K997P06j319j863k645k63K659J150M7K15k164
219c736j681K390R44j785K016K713l001k246K345N40m02L342J803k490j035N56
235B73o46J237K602l92j322o7q30L24K895O20j910L06N27k175r66J447P29P44
253C396J174j135k257m04M59Q42J172j331k987l18Q35o58R01K084j364k607J87
270b011j17j915NJ534q7p44j36n08l05Q65J114N61o39j899q03J415J306O29J452
$$ plain form
152 11146 9384 10008 5123 431 1774 3178 3410 3412 -1351 -6729 -5902 -4901 -6633 -5634 -4769 -7105 -7472
169 -7472 -7503 -10262 -8508 -3209 -3207 -4282 -2518 -4722 -6691 -1001 2246 -393 2376 5204 -1143 -3582
185 -3582 3381 5351 3120 5972 5877 285 1015 5457 4403 3759 6211 4426 1098 1581 1555 779 2717
202 2717 3017 201 -508 -831 -3367 -3256 -259 447 -872 -2735 -5380 -5643 -2984 -1834 -1787 -1572 -3736
219 -3736 -5417 -3027 -2083 -3868 -1852 861 -2140 -4386 -2041 -1501 -1903 1439 3242 752 -283 273
235 273 -373 864 3466 3074 1752 1685 855 1179 4074 4694 2784 3090 3617 1442 476 1923 2652 3396
253 3396 4570 3435 1178 774 1233 2075 3247 1916 -1071 -1389 -554 -1212 -311 1773 409 -2198 -2011
270 -2011 -2128 -4043 -4038 -2504 -2591 -3335 -3471 -3979 -4284 -3419 -2305 -1744 -2383 -4282 -5085 -3670 -2364 -1735 -283
289b83R04q37n12O11N34P00Q61Q4j76Nj42Q90K035N70q42J29m56k079o4K202K21
310D355j382N8j0j393l80Q03l56r56l65p26j330o73L18R47P01q77j707o39J49
329c463j29K61O34l59j033m4O82K88K56R56R01k67o40N31J160N76P22J335K48
348B615j113k36J064O67K34M65q7j012o97L32O94J61m85l99n9m40o52L39P39l98
368A732q46k20p18j475l43R47J12r53n82k15n85l68M88N26l47p27j87K98L03N80
388b580J125P50m18n78L77O35P9K12Q69M91l13J13Q45M97M6O12N42p85j117J89
408A591P87J44n2K15k82r45n06J59jn23n01j96m00o30n7P22L34o48n80o7n85q45
430b866K06O71l02o15K06J34n05J56J043M23m84j22N01M54M33P85Q81L41j73M5
$$ plain form
289 -283 621 -216 -728 -117 417 1117 1978 2062 1886 1891 1749 2639 4674 5244 4402 4531 4075 1996 1932 4134 4355
310 4355 2973 3031 3021 1628 1248 2051 1695 739 374 -352 -1682 -2355 -2037 -1090 -389 -1266 -2973 -3612 -3463
329 -3463 -3592 -3331 -2697 -3056 -4089 -4133 -3451 -3163 -2907 -1951 -1050 -1317 -1957 -1426 -266 310 1032 2367 2615
348 2615 1502 1266 2330 2997 3231 3696 3609 2597 1900 2232 2926 3087 2602 2203 2144 1704 1052 1391 2130 1732
368 1732 886 666 -52 -1527 -1870 -923 -811 -1764 -2346 -2561 -3146 -3514 -3026 -2500 -2847 -3574 -3761 -3463 -3160 -2580
388 -2580 -1455 -705 -1123 -1701 -1324 -689 -610 -398 471 962 649 762 1607 2104 2150 2762 3304 2519 1402 1591
408 1591 2378 2522 2470 2685 2403 1458 952 1111 1110 587 86 -110 -510 -1140 -1197 -475 -141 -789 -1369 -1436 -2021 -2866
430 -2866 -2660 -1989 -2291 -2906 -2700 -2566 -3071 -2915 -1872 -1449 -1933 -2055 -1554 -1100 -667 118 999 1340 1167 1212
450A212M23J60j28L22N10l97q99J3N24n8j98K48r9q04m06M39K29m09j92K07m04
471B93r86j50N75j62o40k0k4p84l75M99K49k17pJ47qN5K29N39O60K0l57K88L45
494A69l13K95J141J42p17K49O16j90p6N41R6m45k68j4O6j06j83J89O8r39p82M12
516d9M6q70N7N80o40o72M57K49k17L33J88m32j52R4N0M93K32n06J67O36n26m31
538i13J025N28n80J84O48k74j09O59L06l1O3j18l0M8l21J88N86q04j194N02L06
559F69j166j65Q03n48o36N22k44p62N28L54p35q5J72m12M28O97n94K3J184m60
579d27j230P67Q56o07J39P91k77k6Q91K31k58J34k2l6K4o51j0J248J0j052N81
600A076O75j170l82P11o96o90P61l07j007P62O74o85j2L2j096Q4P53j069n51J578
$$ plain form
450 1212 1635 1795 1667 1989 2499 2102 1203 1216 1740 1682 1484 1732 1633 829 423 862 1091 682 490 697 293
471 293 -693 -843 -268 -430 -1070 -1090 -1114 -1898 -2273 -1774 -1525 -1742 -1749 -1602 -1610 -1555 -1326 -787 -127 -107 -464 -176 169
494 169 -144 151 1292 1434 717 966 1582 1392 1316 1857 1953 1508 1240 1226 1292 1186 1003 1192 1260 321 -461 -49
516 -49 -3 -873 -816 -236 -876 -1548 -1091 -842 -1059 -726 -538 -970 -1122 -1028 -978 -485 -253 -759 -592 44 -482 -913
538 -913 112 640 60 244 892 618 509 1168 1474 1443 1506 1388 1358 1406 1085 1273 1859 1055 -139 363 669
559 669 -497 -662 141 -407 -1043 -521 -765 -1527 -999 -645 -1380 -1465 -1293 -1705 -1277 -580 -1174 -1151 33 -427
579 -427 -1657 -890 -34 -641 -502 289 12 -14 877 1108 850 984 962 926 950 299 289 1537 1547 495 1076
600 1076 1751 581 199 910 214 -476 285 -22 -1029 -267 407 -278 -290 -258 -1354 -1270 -517 -1586 -2137 -559
620e59K08j210O69R21p34kP14o45m85P69J74k17M75L62L19L73p65o18J077K04
640A030j270K61R51o96m9J057n06o22J016k03j466K92N42o59L09M91r49K44J306
659A079j079j226J340L97j507J86P78p84J78J185n15p40O92J88n67k8o1J82P51
678D49m59q49J011P89r96j11P20o56k09R58o26q76J223N67j040P6L59o02M91O29
698H48j263k59J502m72j261J076O47j148J84P27r17j81J089l44p86O14L80l12
716A24rk94m3R84j15j266L71Q55p19j95O73o80m07J072k72j190P39P51p74J3M11
737B9n89L84R05j016n02J585K1j486N34Q45p31R0P06q92m58J189J36r42L6M30
757B74J50J52n19m31R34M19r96m9N67n29j36O17p12o06J061Q6j189K26O76m35
$$ plain form
620 -559 -351 -1561 -892 29 -705 -707 7 -638 -1123 -354 -180 -397 78 440 759 1132 367 -251 826 1030
640 1030 -240 21 972 276 227 1284 778 156 1172 969 -497 -205 337 -322 -13 478 -471 -227 1079
659 1079 0 -1226 114 511 -996 -810 -32 -816 -638 547 32 -708 -16 172 -395 -423 -484 -302 449
678 449 -10 -859 152 941 -55 -166 554 -102 -311 647 21 -855 368 935 -105 -29 330 -272 219 848
698 848 -415 -674 828 356 -905 171 818 -330 -146 581 -336 -517 572 228 -558 56 436 124
716 124 115 -179 -222 762 647 -619 -248 607 -112 -307 366 -314 -721 351 79 -1111 -372 379 -395 -382 29
737 29 -560 -176 729 -287 -789 796 817 -669 -135 710 -21 69 775 -117 -575 614 750 -192 -156 274
757 274 424 576 57 -374 560 979 -17 -66 501 -28 -164 453 -259 -865 196 282 -907 -681 -5 -440
777d40L3J89q64J84J194o95r52J246N64j049K33O74p32N5J052n57q32R72P24n32
797D67j20K85J69L58k80p69L00N76m73j61L98m00j40O78m16q69N35L09q76j28
817e57M37j66K37L15q07j19J034m68j199N31M57p57K25O53p17j15J202m0r37L28
837d63N77k35k3J69J27O06K76n30J46N82k74k84K21m34l30P77J03q25J44O38k77
858F91k58n1m66M3M28n52m19P23N2p69L16L73p29m5N38p00n73Q86M23o84%M87
880b86P4R0Kk85J42L59j63O1L71k11k5O52j3n05L29K81m77j1M78j02j84Q7j87
903D77L8L42m45n40L86M8o49J11K74o01j09O56k91o88L90L79l99j06K59KJ9N9
925c88j64J30K86j72p3L31j06j41M57J41m32J81N11j91j76K86J58K6O6j36l5K86
$$ plain form
777 -440 -407 -218 -1082 -898 296 -399 -1351 -105 459 -590 -357 317 -415 -360 692 135 -697 275 999 467
797 467 347 632 801 1159 879 110 410 986 513 352 750 350 210 888 472 -397 138 447 -429 -557
817 -557 -120 -286 -49 266 -541 -660 374 -94 -1293 -762 -305 -1062 -837 -184 -901 -1016 186 146 -791 -463
837 -463 114 -121 -144 25 152 758 1034 504 650 1232 958 674 895 461 131 908 1011 186 330 968 691
858 691 433 382 -84 -41 387 -165 -584 139 191 -578 -262 111 -618 -663 -125 -825 -1398 -512 -89 -773 -773 -286
880 -286 -212 -122 -120 -405 -263 96 -67 -6 365 154 129 781 768 263 592 873 396 385 863 761 577 664 477
903 477 515 857 412 -128 258 306 -343 -232 42 -559 -668 -12 -303 -991 -601 -222 -621 -727 -468 -466 -447 -388
925 -388 -552 -422 -136 -308 -381 -50 -156 -297 160 301 -131 50 561 370 194 480 638 664 730 594 559 845
947H45j27l58J83J1m07J09K84n26l22M98K4o07k9J72k34j01J48q7p6k3m2J29J33
970d03k87q4L46m2k35L22K61k97O8M97%k15J35J64M9J06oJ6J61l5q6K68J05l69
994D39j6L49j82k96K34O6l75m5K24j28k83p3L2Oj41k06JN1k03p9K11j17k90J92
1018f29K59k26j23K66J14j43J9J27J01M9K7R9J94J1q2K57J16k52N8L57o2k64J93
1041D66K51j26r6J11j8j53o0L1j4j64j23J18Q2k26j72J54k6l12n5J29j48j93J21
1064d23J17j07r0Q7N4p5j21P9J72q4j08K35K18j31mK49J6j78J25K00q5r3J55J90
1088C98Jr6M0J46l9j52O5R2j71j26J94M9k68o6J58o4k12j6O6p2j11OP5m4j50K5
1114b72J71r0j95J02J84j65j25J96M8j91K9J83k1j27J04K01j9o8M9J61Rj42P5
$$ plain form
947 845 718 360 543 554 147 256 540 14 -308 190 214 -393 -422 -250 -484 -585 -437 -524 -600 -623 -665 -536 -403
970 -403 -690 -774 -428 -470 -705 -383 -122 -419 -351 146 146 -69 66 230 279 385 379 395 556 521 435 703 808 439
994 439 423 772 590 294 528 594 219 174 398 270 -13 -86 -54 -48 -189 -395 -394 -343 -546 -625 -414 -531 -821 -629
1018 -629 -370 -596 -719 -453 -339 -482 -463 -336 -235 -186 -159 -60 134 145 63 320 436 184 242 599 537 273 466
1041 466 717 591 495 606 588 435 375 406 392 228 105 223 305 79 -93 61 35 -277 -332 -203 -351 -544 -423
1064 -423 -306 -413 -503 -416 -362 -437 -558 -479 -307 -391 -499 -264 -46 -177 -181 68 84 -94 31 231 146 53 208 398
1088 398 399 303 343 489 450 298 363 455 284 158 352 401 133 67 225 161 -51 -67 -1 -73 -184 -178 -103 -147 -297 -272
1114 -272 -101 -191 -386 -284 -100 -265 -390 -194 -146 -337 -308 -125 -146 -273 -169 32 13 -55 -6 155 164 22 97
1137I7J52p2j19J66J15j47o4J01j9j43l5N8j3j07k1J48R4k04r8J91Lk65L6J54
1161Hj83r8K62Q4k27lJ82n2j27j9N6J2j2j8J42J09j21l6J80l8k06N3J19j53k9
1186a15K15P5j00l2J03M8o5j39K9J12j09r2K04O5k52L6K30j84k30J50P4k23J2
1209a88J99j4m8K9M3M3j5j42J0J44j42j19K06M6k07O0J64j66j06J22L0j14J0Q1
1233g4P4M5j09J5K31l7k27J28J53k33jK74r9k36K13J63k31p0J73j3o3Ll7O4R2
1258A98j29o5J51m4j75J25N0k36J3K06j23k00J25P1q8m6l1K3Q3j11j10K06K7k53
1282c33J06K21k22q2L27l1k67K03K54k09m8J87L5k9P1p3K0J86q6j48J70M4j96
1305A00Q6J14k29m6K67r4k37R2J29o8q1q2J2J24p6k02Q6J01k33NJ87k08j55L18
$$ plain form
1137 97 249 177 58 224 339 192 128 229 210 67 32 90 77 -30 -51 97 191 -13 -111 80 83 -182 -146 8
1161 8 -175 -273 -11 73 -154 -157 25 -27 -154 -173 -117 -105 -117 -135 7 116 -5 -41 139 101 -105 -52 67 -86 -115
1186 -115 100 175 75 43 146 194 129 -10 19 131 22 -70 134 199 -53 -17 213 29 -201 -51 23 -200 -188
1209 -188 11 -3 -51 -22 21 64 49 -93 -83 61 -81 -200 6 52 -155 -95 69 -97 -203 -81 -51 -165 -155 -74
1233 -74 0 45 -64 -49 182 145 -82 46 199 -34 -35 239 140 -96 117 280 49 -21 152 139 76 79 42 106 198
1258 198 69 4 155 111 -64 61 111 -125 -112 94 -29 -229 -104 -33 -121 -167 -198 -175 -92 -203 -313 -107 -80 -333
1282 -333 -227 -6 -228 -310 17 -14 -281 -78 176 -33 -81 106 141 112 183 110 130 316 230 82 252 296 100
1305 100 186 300 71 25 292 198 -39 53 182 114 33 -49 -37 87 11 -191 -105 -4 -237 -232 -45 -253 -408 -90
1329i0L7l53R1K73j30j35J59J8J7J21q1n3K28M2j84J06P3j70J08K12k09j34L18
1352B64Q1k51nJ18k2l6q2q0J38M9j91L6J37j78n7K10j99k60K88J61l76m3L32l9
1376ej41Q2p0m9J84o6j95J75J09j03R8J32j99L8K76j68k71K39J88j94n1J38L6
1399A83M0l9j37M2P0j44k8P9j42l6K86r0l34J71K38k95j74J79mr1J07n4q0K15
1423c8M0k08N5J01j47Q6J48k16m0M15Pl19J34K51j39q3P1k2M7Q6q0nJ24m8k1P8
1449B77j60j31K60L4l91L9L08j24j99J21m5j11J04o4j93J16Q7j63K1Q8j39L6K08
1472b1k26j72L04J04k91K6K39l2m3Q9m5QJ35k1l0P7k4NJ80q7j89K15J76k80q9
1497HK62n5j55J04j8r5J05K8j94L8J00j41LP8j94rK41j40k76J97J53k34o3J80
$$ plain form
1329 -90 -53 -406 -315 -42 -172 -307 -148 -130 -113 8 -73 -126 102 144 -40 66 139 -31 77 289 80 -54 264
1352 264 345 94 89 207 185 149 67 -13 125 174 -17 19 156 -22 -79 131 -68 -328 -40 121 -255 -298 34 -5
1376 -5 -146 -64 -134 -183 1 -65 -260 -85 24 -79 19 151 -48 -10 266 98 -173 66 254 60 9 147 183
1399 183 223 184 47 89 159 15 -13 66 -76 -112 174 84 -250 -79 159 -136 -310 -131 -135 -226 -119 -173 -253 -38
1423 -38 2 -206 -151 -50 -197 -111 37 -179 -219 196 203 -116 18 269 130 47 118 96 143 229 149 144 268 220 199 277
1449 277 117 -14 246 280 -111 -72 236 112 -87 34 -11 -122 -18 -82 -275 -159 -72 -235 -214 -126 -265 -229 -21
1472 -21 -247 -419 -115 -11 -302 -276 -37 -69 -112 -23 -68 -60 75 54 24 101 77 82 262 175 -14 201 377 97 8
1497 8 270 215 60 164 146 51 156 184 -10 28 128 -13 -10 68 -126 -135 106 -34 -310 -113 40 -194 -257 -77
1521g7n1o5R1l1n6J03J2m1O6k8lJ77k5k18J35K43j66j38J81K7j01R3J0j21Q7P6
1547A80j15jP1q9K3R7j76p3K36m1k70R0J77j50p5J22n4o8Q7j6r0M0K1OL6m6p3
1574a51J58N6k04K1K03p5j23J34M9q2P8O5q9L3O7n9PL3r1L7J30j40j12J97K5k19
1600e2J5J50j19r9R5j5o2N1L9o9RkoM3p3j06J06J09j53l2J66k4j03P3M9q6J1R0
1628Ek5J5M2K3L2K3o4K3J16q6j20J26Q2j40rJ30m3q9P4J0r9j5M0Km0m1kO9k9j15
1658a05M3Q2j16o4J07jj00L7P4n9j4N3Ql4lj1M8M5r0K6J05j6r2R6O9q5pJ11oo9
1688C2N1M9j2m0K5L5j7m2qN6j1j07K3N7p5n5P2J8r7nM7j0m3kJ3nm3j5M8J0p1o
1720a28J04k1q3L0P5o1l3Q5L9o8K8P4J3l6rN3J7l4j8N9J3n9K5P7m1p5M7M0n9l5
$$ plain form
1521 -77 -128 -193 -102 -133 -189 -86 -74 -115 -49 -77 -80 97 72 -146 -11 232 66 -72 109 136 35 128 138 17 104 180
1547 180 65 64 135 46 69 166 -10 -83 153 112 -158 -68 109 -41 -116 6 -48 -116 -29 -45 -135 -95 -74 -68 -32 -78 -151
1574 -151 7 63 -141 -120 83 8 -115 19 68 -14 64 129 40 73 140 81 88 121 30 67 197 57 -55 142 167 -52
1600 -52 -37 113 -6 -105 -10 -25 -87 -36 3 -66 -57 -59 -65 -22 -95 -201 -95 14 -139 -171 -5 -29 -132 -59 -10 -96 -85 5
1628 5 -20 -5 37 60 92 115 51 74 190 104 -16 110 192 52 43 173 130 41 115 125 26 11 51 53 13 -28 -30 39 10 -105
1658 -105 -62 20 -96 -160 -53 -54 -154 -117 -43 -102 -116 -63 -55 -89 -92 -103 -55 -10 -100 -74 31 15 -77 19 88 3 -4 107 101 32
1688 32 83 132 120 80 105 140 123 81 73 129 118 11 34 91 16 -39 33 51 -46 -51 -4 -14 -57 -59 -46 -51 -94 -109 -61 -51 -122 -128
1720 -128 -24 -45 -128 -98 -23 -84 -117 -32 7 -61 -33 41 54 18 9 62 79 45 27 86 99 40 65 142 101 26 73 113 54 19
1750A9M7jm5k0L1J3m8l8L1J2p2k6O1Rq5K3Q4m4o0M0M9o6k6O5L1m4PL7L9m6lN6
1782C0Rn3KQ9j1o0L8N4k1l3K6K2l1k7K9L1l9n1J3N5n8l8L1Qn9PN8m5o6K4N9n0
1814e7l8L5K3l3j5L4K2k6k5M5K2l6j2O3J6n3J2O2On5L0M0ll7J7L3Mm4J9N4m1o2
1846@O0M0p7m1Q7j4o7KL6j0n5K5J4l2k7K1K1l0l1L8L1m2m4N6K9n4j9O1lj8MK8
1878a1J0j7%K7J5k7j7P7j5o2M4O0n9n0Q1J0o2RN3l1k8K0K0k2j2KL3ln2LN9k9q5
1911e9N2K5m4m0N8%k4J6%Ljk5K4J5l9l3J07kj10M9Q3n7o0O9K6n9lN8k2j3L4Mj3
1944A9nj4K3K2n1k1P9J2q7M4L5l5j8K3j4l1J4%J0Lj6OM8n0n1O1M0j12k3J19k5
1975Ep0P0K7q1K7N1n1k7M4LJK2l4OO1m7n9P0L9r2NO9l0j5L3Ml4L3nrj0l1kP3k2
$$ plain form
1750 19 66 65 20 0 31 44 -4 -42 -11 1 -71 -97 -36 -27 -112 -89 -5 -49 -109 -69 -20 -86 -112 -47 -16 -60 -53 -16 23 -23 -26 30
1782 30 39 -14 -12 77 66 6 44 98 77 44 70 92 61 34 63 94 55 4 17 72 14 -24 7 15 -44 -37 21 -24 -90 -66 -7 -57
1814 -57 -95 -60 -37 -70 -85 -51 -29 -55 -80 -35 -13 -49 -61 2 18 -35 -23 39 45 -10 20 60 57 20 37 70 74 30 49 103 62 0
1846 0 60 100 23 -18 69 55 -12 -10 26 16 -39 -14 0 -32 -59 -38 -17 -47 -78 -40 -9 -51 -95 -39 -10 -64 -83 -22 -25 -43 -39 -11
1878 -11 -1 -18 -18 9 24 -3 -20 57 42 -20 24 84 25 -25 56 66 4 13 66 35 7 27 47 25 13 15 48 45 -7 -4 55 26 -59
1911 -59 -7 18 -26 -66 -8 -8 -32 -16 -16 -13 -14 -39 -15 0 -39 -72 35 33 -77 -28 55 -2 -62 7 33 -26 -29 29 7 -6 28 32 19
1944 19 14 0 23 45 -6 -27 52 64 -23 21 56 21 3 26 12 -19 -5 -5 5 8 -8 -2 46 -4 -55 6 46 -66 -89 30 5
1975 5 -65 5 32 -49 -22 29 -22 -49 -5 -2 -1 21 -13 -7 54 7 -52 18 57 -35 -30 39 9 -6 27 31 -3 30 25 16 6 -25 -27 46 24
2010B4r6O9P8j07l5J07k7p7N0L3p3L4N7k8l1L0j0PJ8n1rQ8j4j03P6O1p5lM6l5
2040Dk2M2Km2L0QkK2m9k6P9J1j25K5J16q4m7Q5j6n1M1M3q5RN6k7l1J8%KL3n9l1
2073g1J00J6j01K8P8o0pN4m0k4N1kk4K3j0oN1m1n9Q5M7j17j3J09m8o0P0J4r9O9
2103A3N2q3k1O5ml8K9l2LP5o5o7Q8K2q5J4N7n1j6N7k1m5M7K0l4Ppj4N9j9p6N9
2135a1P0q8k4R8j7p6P4K4j05M6O5o5k5O4j8mJ9m3RO9l6p8O6L9p6NO0m7j3O8k4
2166B6o7M3J2k0Jj8k0P0Pr2L9O8n5n5P3no4O1K4o2mP9k0m5K5lJ3K2l2l0P3Qp1
2199a9K7M2n2NN1n9k3N0J4m5RJ6rL5m7k4M5K4p0%P4m0l7M6Ko4M9L4n7k6O0%mL
2233A0j5oN2l1m0N6J0o1K3M4l8j7O3k1m3K8L0l2r%%K7k1k5K6K4n5j2O5m5l0N0
$$ plain form
2010 24 -72 -3 75 -32 -67 40 13 -64 -14 19 -54 -20 37 9 -22 8 -2 5 23 -28 -37 51 37 -66 10 71 -4 -7 39 4
2040 4 -18 24 26 -16 14 22 20 42 -7 -33 46 57 -68 -43 73 -11 -58 27 11 -40 1 44 -41 -32 24 -3 -34 -16 -16 -14 19 -40 -71
2073 -71 29 45 -56 -28 50 -10 -17 37 -3 -27 24 22 -2 21 11 5 56 15 -44 41 88 -29 -42 67 19 -41 29 43 -56 13
2103 13 65 -18 -39 26 22 -16 13 -19 -16 59 -6 -73 15 37 -48 -34 23 -28 -44 13 -8 -53 -6 14 -20 -13 -20 -34 25 6 -70 -11
2135 -11 59 -29 -53 45 28 -48 26 50 -55 -9 56 -9 -34 30 12 8 27 -16 -7 62 26 -52 14 53 -23 -18 42 -5 -18 50 26
2166 26 -41 2 14 -6 -5 -23 -43 27 34 -58 -19 49 -6 -61 12 7 -57 4 28 -34 -38 41 21 -24 1 -2 11 33 1 -29 44 52 -19
2199 -19 8 50 -2 3 54 -5 -28 22 36 -9 0 16 7 42 -5 -29 16 40 -30 -30 44 4 -33 13 15 -49 0 34 -23 -49 11 11 7 10
2233 10 -5 -11 41 10 -30 26 36 -25 -2 42 4 -13 50 29 -14 14 44 12 3 3 3 30 9 -16 10 34 -21 -33 32 -13 -43 7
2265GRn8K1M4m3j7K7J5j6J1j7MM0k4l1M6Nm7K8L2l7j3M7J0n5J5K3Mj1mJK3j2l2
2299eL2J1m1JL3j4l7M4J9n2j5N0jm6J2J8rmj5LL3rl2K5Qk2JL0k2k6L5J9k4j5K6
2334A1Nnj7J0J8j5k1K1J7l0k2M3Jm7K7L1k7k3K9Qj9kJLNnJJ6lm2L4K5l3j5M2%
2370B2l0J3J6nk9J4J7oj9J0K6k2j1J2J4j1k3J6J6m1OJ7ol6L6Pnk5K0Pkk7J4J3
2404boj1K6J2j1k2K4K3m1J1K8lk9OK8j4j9RK4rrJJ0lk6K1Nk3j4K2Nk0j3L0j1j0
2440a1jJ7j8j8PK3Mk5%J4ok4L5K0j8l2L6Ok5LL0Lk4NJ4Lj2kK0Jl2LL6j4k9K8M
2477B1k3RPK2l7MRRj5rJ2Lk2pJ5Kk6OK3rk3J6K9l1j0K4J0k9OJ8nj5%K3pk1NK9
2515A3j3rJ8Rj2nJ4Knk5J1J9kj4ML0l3j0K2Nk6LK7pk1J3J1k8KK0Kk1pJ4Ppj0L
$$ plain form
2265 7 16 -42 -21 23 -20 -37 -10 5 -11 0 -17 -13 27 3 -28 18 23 -24 4 36 -1 -14 33 43 -12 3 26 30 19 15 16 39 27 -5
2299 -5 27 38 -3 -2 31 17 -20 24 43 -9 -24 26 25 -21 -9 9 0 -4 -19 -16 17 8 -24 1 9 -13 -12 18 -4 -30 5 24 0 -15 11
2334 11 16 11 -6 4 22 7 -14 7 24 -6 -28 15 16 -31 -4 27 0 -23 6 14 -5 -7 -6 -3 2 -3 -2 14 11 -31 3 28 -5 -20 22 22
2370 22 -8 5 21 16 -13 1 18 12 -7 3 29 7 -4 8 22 11 -12 4 20 -21 -15 2 -4 -40 -4 3 -2 -27 -7 0 -2 -29 -15 -2
2404 -2 -8 -19 7 19 8 -14 10 33 -8 3 31 28 -1 5 33 19 0 9 33 24 15 16 26 23 -3 18 23 0 -14 8 13 -7 -20 10 -1 -11
2440 -11 -12 5 -13 -31 -24 -1 3 -22 -22 -8 -14 -38 -3 17 -1 -33 3 9 -16 -13 17 20 -4 1 15 18 6 4 24 25 -7 -4 32 18 -11 17 21
2477 21 -2 7 14 36 -1 3 12 21 6 -3 9 12 -10 -17 -2 0 -26 -20 3 -6 -29 -13 16 -15 -25 -1 9 -20 -14 4 -1 -16 -16 7 0 -21 -16 13
2515 13 0 -9 9 18 6 1 15 17 12 -13 -2 17 15 1 5 35 2 -8 14 19 -7 -4 23 16 -5 8 19 -9 -7 13 15 -6 -13 1 8 1 -9 -6
2553fJ2j6mJ6%l0J4K8k4j4J8JmLlNJ3j4j1L2rk0K8J2k5JJ8mk1J2J9j7Mj5K9nj1
2590A2nLPk4K3j0nj5K8Kj9QRj4j4J0nQmj1J1Qk3NJ6qk6K3J6k3qK7pk2J9J8j9K
2628gj0OJ0LrL1nj8LJ2j6MJ3Lk0MK6j8poJ0PJj9%K8k6k0L6j2k5K3J4l1qL4Rl9
2666a9J0Q%pqoJ2mj4L5kj5mK5j1j8L2Jl6J1K2%j6PmQJ8j6KOkk0L5pl6ML4j8k1
2705a4L4Pk7kJ6j2Mkj2J2Qk1J2Mj3j9K4nl3L2K0l5OOLJ5rj6KK7k5NJ2Ll9K9J6
2742A3l6J5K5j3k8L3Mj5MRrK0j3j0K1Lk9MK1j8j6M8k3k4J6Qj0jLMjJ5k2nK3oj8
2779hK7mm3L9K2m9J1K3%l3J7J4j6Mjj4J9mmLJ2k9PK5l0j2M1jk9%J4omJ2j8K1J3
2816A9k0MJ5nk2L3j4k9K5K2j9j2K9%k0N%KkJ2k4J1kMlmk3LL5j2k8J9J3j9lPMj
$$ plain form
2553 -6 6 -10 -14 2 2 -28 -14 14 -10 -24 -6 -5 -9 -6 -9 -4 9 -5 -16 16 7 -13 15 27 2 3 21 17 -4 8 27 10 14 -1 28 23 12
2590 12 7 10 17 -7 16 6 1 -14 14 16 -3 5 14 0 -14 -4 -9 -1 -5 -16 -5 3 -20 -15 1 -7 -33 -10 6 -17 -25 2 -5 -27 -8 10 -9 -7
2628 -7 -17 -11 -1 2 -7 24 19 1 4 16 0 4 17 20 0 4 30 12 5 -1 9 16 17 -2 -2 26 0 -20 16 4 -21 2 16 -15 -23 11 20 -19
2666 -19 -9 -1 -1 -8 -16 -22 -10 -14 -28 7 5 -10 -14 11 0 -18 14 15 -21 -10 12 12 -4 3 -1 7 25 9 11 17 15 -5 30 23 -13 -9 25 7 -14
2705 -14 20 27 0 -2 14 2 6 4 -8 4 12 -9 3 7 -6 -25 -1 -6 -39 -7 13 -22 -16 -10 -7 8 -1 -17 -15 12 -13 -8 4 7 -32 -3 13
2742 13 -23 -8 17 4 -24 9 13 -2 2 11 2 22 9 -1 20 23 -6 -2 19 1 -15 33 10 -14 2 10 0 -1 2 6 5 20 -2 -7 16 10 -8
2779 -8 19 15 -28 11 33 -16 -5 18 18 -15 2 16 0 4 3 -11 8 4 0 3 15 -14 -7 18 -12 -24 17 16 -13 -13 1 -5 -9 3 -15 6 19
2816 19 -1 3 18 13 -9 24 10 -19 6 28 9 -3 26 26 6 11 11 13 11 23 -1 10 8 12 9 5 -18 -15 20 8 -20 -1 12 -7 -10 -3 1 0
2854@kj4kJ7j9KL0j7j1K7j3j9J3M2k3pJ0J0j3j6K1j3J0QnKprJ6%j8PK6j5k2J2
2890HJ6k6nQJoJ0qmNj4RJNk7J8L3m9NK9pk2K3NqlJ4j9%KOMkj0qL6j5pK3kk8PK3
2933B1j4j0Rj7K1Mj2OQk2J4Mrj4J7J1j3j5K2Kl4K5K%noJ1mJ4j1Pkj5MJ7ol0K9
2971I%j4jJ6j2rJ5%jQnMnn%J9mj0j1L1j8j0J5Ok9QOMj7J2nLkKK1j5okJ6%lj6J2
3014Gpj2J6Jj7KJ2kmoKLRj8J6Kk5K1J2j2j1OJ1mnK1k2J0kPoMjLMj2kK0j4k9L1
3055INpj7J1klJ5mMj1oNJ6j7nKQj0nK3j4j4PJ0j4jPP%lOKJkoPlk1K1Pj4mL3j5
3099Hj3J5K2j9pKKloNJ2rj4OQj5mJ1Mk4K2Kjj2NQmmOkooRKKj1J7oonJ2Kjj4J2
3144BJmJ5j5J6k0%J3KrKOj7NKK7l7J2PPj6Q%Qj1nRJJJKlmNJ0qj0kJ6qj3J8non
$$ plain form
2854 0 -2 -16 -18 -1 -20 -18 12 -5 -16 11 -2 -21 -8 34 11 4 14 24 11 -5 16 3 13 21 16 18 11 2 18 18 0 7 33 18 -4 8
2890 8 24 -2 -7 1 2 -4 6 -2 -6 -1 -15 -6 -5 0 -27 -9 24 -25 -20 9 2 -20 3 8 0 -3 11 -8 -8 -6 0 4 2 -8 -16 20 5 -2 21 19 -9 -2 21
2933 21 7 -3 6 -11 10 14 2 8 16 -6 8 12 3 -11 6 17 4 -11 11 13 -21 4 6 6 1 -5 6 2 16 5 12 10 -5 -1 16 10 -20 9
2971 9 9 -5 -6 10 -2 -11 4 4 3 11 6 10 5 0 0 19 15 5 -6 25 7 -3 12 18 -11 -3 3 7 -10 2 -3 0 -2 0 21 6 0 -2 14 14 11 -5 7
3014 7 0 -12 4 5 -12 -10 2 0 -4 -10 -8 -5 4 -14 2 4 -21 0 12 0 -11 -5 6 2 -3 18 -4 6 4 11 5 9 8 11 15 3 1 21 7 -22 9
3055 9 14 7 -10 1 -1 -4 11 7 11 0 -6 -1 15 -2 -7 -5 3 -7 -12 11 -3 -17 -10 0 -14 -15 -8 -1 -1 -4 2 4 5 3 -3 4 1 -20 1 8 -6 -10 23 8
3099 8 -5 10 32 13 6 8 10 7 1 6 18 9 -5 1 9 -6 -10 1 5 -19 3 5 4 -8 -3 5 1 -3 3 1 -5 -11 -2 0 2 -9 8 2 -4 -9 3 5 4 -10 2
3144 2 3 -1 14 -1 15 -5 -5 8 10 1 3 9 -8 -3 -1 26 -11 1 8 15 -1 7 7 15 4 -1 8 9 10 11 13 10 6 11 21 13 3 1 17 9 -4 14 9 3 -2
3189bMMj8NJ4%%rJ0kj6J3J1rpOrRq%KoJ1NJ4j9pLK4k2kJ6kj6LJ4j1jOJ0k1MMJ1
3233A6j5lJ8nj4NJ5kj3LOj4J0j5O%MnnJ3j3OJ2o%mKlmQPj5J1J3j0%JrJ8k0PJ4
3275B0j8PmKmkJ7nj4OLj3NLPNmqMjJpJ3j0j6J0LJqJ2mj0NJjqOMLkJlqrJ0K4j8
3322dj4J5MoNO%kmJ0j%oOmrK6j6Mj7J1OqnJ3Mj0oLQkj2OjqlPrjJ6rQj0J3Nj6P
3369@j3MOmJ0JpkKlLoJ0pQoJ2Lj4QLLj8NOmM%JnrJ2Rj9kK3Nk2%J5ppJQj1Mj7J8
3417AKkj1OPKqKlnJ3koJQo%NrmKnQJ2qJ4j%j3J7Rk5KJ8qj1J2j6NkRkJ4j1rJ1j
3464A2mjQj3Qj1J9k4JJ6j1lPjpj0J4rQjLJ0nj6LJLkK1j2j1NJ0nqNmJ6j0jK0kk
3507A7k2J6LLj2Qj4OKoLmOjklP%ojQqQj7J0Qj8J7nnKkrQRlK%j6J9njpK2k3NJj
$$ plain form
3189 -2 2 6 -12 -7 7 7 7 -2 8 6 -10 3 14 5 -2 4 -5 4 -4 -4 -2 -8 3 8 22 3 -4 -1 23 1 -1 15 13 -3 0 14 3 2 8 18 -3 1 5 16
3233 16 1 -2 16 11 -3 2 17 15 2 5 11 -3 7 -8 -2 -2 2 -3 -8 5 -8 -2 10 4 4 0 2 -1 -5 3 10 -5 6 19 9 9 10 1 19 -1 6 20
3275 20 2 9 5 7 3 1 18 13 -1 5 8 -5 0 3 10 15 11 3 7 6 7 0 13 3 -13 -3 0 1 -7 5 1 -9 -4 -3 -4 -12 -6 -2 1 -1 0 -3 -11 -20 -10 14 -4
3322 -4 -18 -3 1 -5 0 6 6 4 0 10 9 9 3 9 5 -4 22 6 10 -7 4 10 2 -3 10 14 4 -2 1 9 7 -5 1 0 -8 -11 -4 -13 -14 2 -7 1 -9 4 9 -7 0
3369 0 -13 -9 -3 -7 3 4 -3 -5 -3 -6 -3 -9 1 -6 2 -4 8 11 -3 5 8 11 -7 -2 4 0 4 4 5 0 -9 3 12 -7 -9 14 19 -3 -3 12 5 -2 -1 7 -4 0 -17 1
3417 1 3 1 -10 -4 3 5 -3 -1 -4 -9 4 2 -4 -3 5 -1 -1 4 -5 -9 -7 -12 -4 8 0 14 13 13 0 17 26 1 3 21 13 2 14 -2 3 1 10 8 22 11 2 13 12
3464 12 8 7 15 2 10 -1 18 -6 -5 11 0 -3 4 3 -4 -14 0 -9 -1 -2 1 11 6 -10 -7 -6 -3 -5 16 4 -7 -2 8 3 -5 0 -4 12 2 1 21 19 17
3507 17 -5 11 14 17 5 13 -1 5 7 1 4 0 6 5 3 0 7 7 1 0 8 0 8 -9 1 9 -9 8 3 -2 0 -2 -11 -3 6 3 5 5 -11 8 3 2 -5 17 -6 -1 0 -1
3555aRoJ1oj4J1J7%j0nKpNjJ7j1qJ4mmrJ0rJ0oloPLl%J0j1mQj5lJ1lqJ3j5OlJ3
3600BJnlRLk1J2M%j1J1nlJRLj7RqJ5KjJ%llPmPnlNMqjOj3PmNPnkmklJ3klj1NQ
3652Fj1MMmrkJ2LmL%j3MJ1j2KJJ4lj7PNLj2J1J0lnJ0kj1mJ7j8J0JJ%qjOJ0qJp
3697BlNm%J5j9Kj1J0mLKJj1Oj1oK1j3KjJJ5pPj0J1Nj0NjOJ1j5jj1J0oK4mj0J0
3739A6Jj4O%qMRj7PRoJ0lj4kQKj2QjMnOjrKlKoOP%Rj3Nj4PL%pKJ5j6oNOPnrJ3
3789HjoJ1%mQk0J8j1jJ3knpJ2MoLmnMmRj6KNlOjmjrNoNkNj5J3%qK1poKJ6mj8K
3838dJ1jnpNlMMNrQLOj2LMrJ0pOoJJ0j8J0RpmmLj0RKpJ8j1jJ%jpOMmkj5J2mml
3888a1OKJ0joj1J4qOOj2rL1j8j8K2MjkQrNMlKmlRJJpNj0kNJj5J4nJ3jLmnrJ6j6
$$ plain form
3555 -1 8 2 13 7 -7 4 21 21 11 6 8 1 6 5 22 11 3 17 13 9 0 10 1 11 5 2 -4 3 6 3 3 13 2 -2 6 -9 -12 -1 -4 -12 1 -14 -8 -11 2
3600 2 3 -2 -5 4 7 -14 -2 2 2 -9 2 -3 -6 -5 4 7 -10 -1 -9 6 8 7 8 8 5 2 9 5 12 7 4 9 13 5 4 10 -3 4 0 5 12 7 5 1 -1 -4 9 7 4 -7 -2 6
3652 6 -5 -1 3 -1 -10 -12 0 3 -1 2 2 -11 -7 4 -8 -6 -5 9 6 -11 -4 1 4 -8 3 13 10 5 15 13 2 -2 15 -3 7 8 9 9 1 0 6 16 8 9 2
3697 2 -1 4 0 0 15 -4 -2 -13 -3 -7 -4 -2 -1 -12 -6 -17 -23 -2 -15 -13 -14 -13 2 -5 2 -8 3 8 -2 3 2 8 19 4 3 -8 2 -4 20 16 6 16
3739 16 17 3 9 9 1 5 14 -3 4 13 7 17 14 0 -2 6 8 -4 4 3 7 2 8 7 -2 0 -3 -1 -7 -1 6 6 15 2 7 -7 0 3 3 -4 -2 13 -3 -9 -4 2 9 4 -5 8
3789 8 7 1 12 12 8 16 -4 14 3 2 15 13 8 1 13 17 11 14 10 5 9 5 14 -2 0 5 2 8 7 3 2 -7 -2 -8 -3 -5 0 -15 -2 -2 -10 11 4 -2 0 16 12 -6 -4
3838 -4 7 6 1 -6 -1 -4 0 4 9 0 8 11 17 5 8 12 3 13 6 12 6 7 17 -1 9 18 11 7 3 6 -4 5 7 0 18 7 6 7 7 6 -1 5 9 5 3 -12 0 -4 -8 -11
3888 -11 -5 -3 7 6 0 -11 3 -5 1 7 -5 -14 17 -1 -19 3 7 6 4 12 3 8 12 9 11 7 4 13 14 15 8 13 3 1 6 7 -8 6 1 14 13 16 12 7 -2 14 -2
3935bLnKRlknkjJ0pNkrK3j6nJ0PqmN%NqQomJJ0Lj1JK1j3rJPJn%nmPMrNL%qJ0p
3987AMNrRj1rJ2pK4j8j3OKQrMoPj6K4Qk4MJRKp%J2j4NKoLKNkkJkO%rLR%opjKP
4038Inj0J1LRj1j3J6r%NnoKQj0MpkKJ2kLKqjJrPQjnj0J1JoJ1OjpkOj0JJ9j6MK
4086GKJKkMoMj4J4j3J5j5M%rN%%nJ2j0Ojr%RnJ2j6Lj0J3Lj4J2%NpJ6rQmj0L%l
4132bJLQj5J1PoJ0lmj0Qk%kmJ1lMj8QnJ1Jj4NMNj0lJ5plJJrMoPrPPj7RMpKLJo
4182gQn%OpOjRj3J1nlLkNjMJ5j5kJ4j3JOj7J0Pj7N%qmJ6ojLMj0JOkpPlmpJ0nQ
4231@Pj8J1qOKrO%Rkj0J8plMl%J1j8JJJKjMoJ1NmmpQJj1JRLpqLJ8j7KlnqJ2LM
4281Dj0j0J9j1QqJJ0Lmr%KOLj3mJ6qQkMj4QLlKkNjPj0%ORkj2J3j4QJ3j2qJ0ln
$$ plain form
3935 -2 1 -4 -2 7 4 2 -3 -5 -6 4 -3 2 0 -9 14 -2 -7 3 10 2 -2 3 3 8 0 8 2 -2 -1 9 12 1 2 23 10 1 2 9 10 5 5 0 -4 3 7 -2 3 6 6 -2 8 1
3987 1 5 10 1 10 -1 -10 2 -5 19 1 -12 -6 -4 4 -5 -1 -7 0 -16 8 16 -8 -4 -3 6 8 1 1 13 -1 4 6 0 3 5 10 8 6 7 5 11 11 2 5 14 14 8 1 0 2 9
4038 9 4 -6 5 8 17 6 -7 9 0 0 5 0 -6 -4 4 -6 -2 -9 -11 -9 3 1 4 6 -2 -3 -2 -11 -4 4 3 -2 -12 -1 0 -6 5 11 10 3 1 7 -3 -2 17 1 5 7
4086 7 9 10 12 10 14 8 12 -2 12 -1 14 -1 3 3 -6 -1 -1 -1 -6 6 -4 2 1 -8 -8 1 -4 8 -8 -5 -15 -2 1 -13 -1 -1 4 -3 13 4 12 8 -2 1 1 -2
4132 -2 -1 2 10 -5 6 13 7 17 14 10 0 8 6 6 4 0 11 8 12 -6 2 -3 8 9 -5 0 4 9 -1 -4 11 4 1 2 3 -6 -2 -8 -1 -10 -3 4 -13 -4 0 -7 -5 -2 -1 -7
4182 -7 1 -4 -4 2 -5 1 0 9 -4 7 2 -1 2 0 5 4 8 23 8 6 20 7 8 14 -3 7 14 -3 2 2 -6 -10 6 0 -1 2 6 -4 -3 3 1 -6 1 -2 -6 -13 -3 -8 0
4231 0 7 -11 0 -8 -2 0 -9 -3 -3 6 4 -6 12 5 2 6 3 3 14 -4 -3 -2 -1 1 0 4 -2 9 14 10 6 -1 7 8 -3 -2 7 10 3 -5 -2 16 -1 1 -2 -7 -15 -3 0 4
4281 4 -6 -16 3 -8 0 -8 -7 3 6 2 -7 -7 -5 1 4 -9 -13 3 -5 3 1 5 -9 -1 2 -1 1 -1 4 3 10 0 0 6 15 13 1 14 0 8 21 9 1 11 8 3
4327CKkLj6J2qRplkJ8j8J0lj0OPoLoR%jJpMkKPJj3POJnNKlrPlJ2j6kQmNRJrNr
4379APrJ0j5QOj4Rj1MOj2J3qLNrRj3J5prJ6j3J0oLPj1PnMqQ%j1J5knPpJJLmQj
4426FmRmjKkQj0joPQpjMLlrPpjLkNrlJRj2KMj2J4lkjpJ0%mJQkkRJj2RNj2olJ2
4479aMJrOjjJ0j4K0k1K0qnLJ5j2j0MNj1RnKQrj5J7pNkJnjlPpnJ5njJPj7J1%Jj
4526dNnOjl%OmoMMQj1NrRLLmJKnNj0PlkpJ5j8PJpMJjrQNkqJ0r%ORqLMj3kJ0j5
4579a5K1k5J4Oj1QPKrMlLkRj2J4j3JNjJ4onJ3j8J4j0NPMrj8QQprJ5m%jQj3PKj3
4624eLOj1kKRjL%noOmOJjPj7J2Oj1JMkjQqlJ0kMK3k4jmJ4pmlK%Km%J4qLnmNlL
4676Hmj8J6Qj3nPOoj4J3jPj1J2j6J6j0LKlJ1j2mM%%KMJ2k0K0%lnkMjqJ0oK%kK
$$ plain form
4327 3 5 3 6 -10 2 -6 3 -4 -7 -9 9 -9 1 -2 -12 -6 1 -5 -2 -8 1 1 0 1 -6 -2 -4 -2 5 6 -7 0 6 7 2 7 9 6 -3 4 1 13 -3 -5 3 -1 4 13 14 5 10 1
4379 1 8 -1 9 -6 2 8 -6 3 -8 -4 2 -10 3 -5 -2 3 -6 3 -10 5 -2 -11 5 -8 2 -4 -1 6 -5 2 -3 1 -7 1 1 -10 5 3 -2 5 -2 -1 0 3 -1 7 6
4426 6 2 11 7 6 8 6 14 4 3 -3 4 12 5 4 8 11 8 -1 6 -1 -2 1 -1 4 -5 -8 -7 2 -10 -8 -4 -16 -2 -5 -7 -8 -15 -5 -5 -9 -8 0 -2 -4 5 6 -6 3 8 -4 -10 -13 -1
4479 -1 3 4 -5 1 0 -1 9 -5 15 -6 14 6 1 4 19 7 -3 1 6 -5 4 -1 1 9 0 -15 2 -5 0 -2 -1 -6 -7 -10 -3 -10 -15 0 -5 -6 -5 2 -15 -4 -4 -3 -4
4526 -4 1 -4 2 1 -2 -2 4 0 -6 -2 2 10 -1 4 -5 4 7 10 6 7 9 4 9 -1 6 3 1 -6 9 -9 -2 -1 -8 -4 -3 -4 -13 -5 0 -2 -10 0 -9 -9 -3 6 -2 1 5 -8 -10 0 -15
4579 -15 6 -19 -5 1 -10 -2 5 7 -2 2 -1 2 0 9 -3 11 -2 -1 4 3 17 11 6 19 1 15 5 10 17 21 12 -6 2 10 3 -6 9 5 5 4 12 -1 6 8 -5
4624 -5 -2 4 -7 -9 -7 2 1 4 4 -1 -7 -1 -5 1 2 1 8 -9 3 9 -2 -1 3 1 0 8 0 -3 7 5 9 32 8 7 3 17 10 6 3 5 5 7 3 3 17 9 12 7 3 8 5 8
4676 8 4 -14 2 10 -3 -8 -1 5 -1 -15 -2 -3 4 -7 5 -11 5 -5 -2 0 -3 8 -4 -8 -4 -4 -4 -2 2 14 -6 14 14 11 6 4 8 7 -1 9 3 5 5 3 5
4721ElRmJ2j5kLJkpJ4j4MpQQj5MjJ1oJpnJ2ppj1RJ2nJLjqJ0Kj2K1plNj6RRMjn
4769FqNmJ3nrKJQklMmKlJoLJ1j3%q%J4oljJ0j2QLjmKMj0nJ6j1Nj1LLRkQpnQj0
4819dKRj0JOLj6J0Pj5J5rPjJ0jj2J4qJllpJ8j2mmkJ2%Mmj%Jj5kPlPLnNqJKJ8j4
4867@KMj5J1LkkQjlPoJJ0krlLKPlnL%KkJojJ3OlmojJ0j0jrJJ5mjj1lJ5rJKkMj0
4919cJ3kj4J4nj5J2NJnrNJ0rlJ2KKql%Nj2JJ9lkQmmkMOkkQroMqKkjkOKlpLjOj3
4971iK6j1mKpJ0lj3J0%k%nKPj0KJ6j3lMnJ4lj3K2j1PlJ2k2P%RkrOJrQqMQj6LL
5017BKOmj3jQnRj2MKlKJQJj3J3j3nQMLPk9J5Jj2J1MNjkkpLNJkNqJ3j2lOOj4J0
5065DjNJ0j9J3j4MJ1j1QmLKj4nklKLMKPj3J4j1klRJjj1J2LmNJ%j2QkJ1j0LjkM
$$ plain form
4721 5 2 11 7 19 4 2 5 6 4 -3 11 -3 1 -6 2 10 -5 -1 -2 9 3 4 -3 -8 4 -3 -10 -21 -12 0 -5 -4 -1 -2 -10 0 2 -10 11 4 1 6 -10 -1 8 12 11 6
4769 6 -2 3 -1 12 7 -2 0 1 9 7 4 8 4 6 3 4 -2 1 12 -1 -1 -9 -9 5 -1 -4 -5 5 -7 1 4 3 -1 1 5 -5 -10 6 -5 0 -11 -8 -5 4 2 10 3 -2 6 -4
4819 -4 -2 7 -3 -2 4 7 -9 1 8 -7 8 -1 6 5 15 14 2 16 8 9 6 3 -4 14 2 -2 -6 -8 4 4 8 4 3 3 4 -11 -13 -6 -9 -2 1 -4 1 -7 -6 -4 14 0
4867 0 2 6 -9 2 5 3 1 9 8 5 12 6 7 17 15 6 3 6 8 15 12 7 10 10 12 10 11 5 4 17 23 20 16 10 9 19 9 8 -1 0 15 11 10 -1 -4 11 2 3 5 3 7 -3
4919 -3 10 8 -6 8 3 -12 0 5 6 1 -8 -3 7 -2 -5 7 9 11 3 0 0 5 -7 -6 13 10 8 16 12 8 6 10 16 14 12 20 11 5 9 1 3 1 0 -2 4 6 3 -4 -1 -2 4 -9
4971 -9 17 6 2 4 -3 7 4 -9 1 1 -1 -1 -6 -4 3 -7 -5 11 -2 -5 -1 -6 8 5 -8 14 3 10 7 19 -3 4 4 13 11 2 8 9 0 8 0 4 12 -4 -1 2
5017 2 4 10 6 -7 -8 0 -5 4 -8 -4 -2 -5 -3 -2 6 7 -6 7 -6 -11 -3 1 4 11 -18 -3 -2 -14 -3 1 6 5 3 1 -6 -3 2 3 1 6 -2 11 -1 -4 2 8 -6 4
5065 4 3 8 18 -1 12 -2 2 13 2 10 6 9 11 -3 -8 -10 -13 -11 -8 -4 -2 5 -8 6 -5 -7 -10 -1 0 -1 -12 0 3 -1 4 5 5 -7 1 -1 10 0 3 2 0 4
5111DRrknJ4rMlNLj5J0j1J4qM%ljL%pKqrJ8nlQmjnKlPNj8QJ0rJ1j0OMj2KQr%K
5161fNkkN%JLKnkpJ2MmKJ1qnOnRj0R%qjoJ1Lj8PlPnKJk3J3K0k2JkJ4Poj0L%Nn
5211bkRrNLOj8K3kqlPlm%mJ5Jkj0J6Nj9JJ1o%Qj1%oPlMj0J2j2kJJoJ2j1JMlO%
5259BlrK2rljLnJpMJNjQj3QJkOjj1J1l%kMJJLPj0j4J1J0pNj1OLlolNNqOno%mJ3
5311Ekj1LQoj%mNJoKPNrmJ6nj4J0N%LjllLoNjKJloJ4jpKKOoMjNmj1OqQOnoOlP
5366A0jj3MKpMJJNkJ2j4jRnKj2J5qOmKjlpJJ3JjqPqkJ2jJnJ3j2JMj1OolNqOK0
5415B0k0OkKrOKmKk0J0QMj2NRj0KJ6j7MloNj3QQkRj2J4j2MRjj1KmJ3qpK3oQk0
5460@J2Pj5qJ3ljmQJ0%qKj0Pj7J4j2PLqPJjqJ9j8L%moJ0LqjQj0QOlqJ2j2OkJ4
$$ plain form
5111 4 13 4 2 -3 11 2 6 3 8 11 -4 6 -5 9 1 5 5 2 1 4 4 -3 -1 -9 -18 0 -5 -8 0 -4 -5 -10 -8 -11 -4 1 -17 -9 1 -8 3 -7 -1 3 -9 -7 1 -8 -8 -6
5161 -6 -1 -3 -5 0 0 1 4 6 1 -1 -8 4 8 4 6 17 9 4 10 5 14 4 13 13 5 4 -2 9 12 -6 1 -2 5 0 2 3 -20 -7 13 -9 -8 -10 4 11 5 -5 -2 -2 3 -2
5211 -2 -4 5 -4 1 4 10 -8 15 13 5 2 9 6 2 2 -2 13 14 12 2 18 23 4 5 16 10 10 18 7 7 1 8 5 9 -1 11 -1 -3 -2 -1 -7 5 -6 -5 -1 -4 2 2
5259 2 -1 -10 12 3 0 -1 2 -3 -2 -9 -5 -4 1 0 8 -5 3 4 2 8 7 -4 7 4 4 2 6 7 8 11 18 8 -6 5 15 8 13 2 8 11 8 2 -1 4 9 1 7 2 -4 -4 -8 5
5311 5 3 -8 -5 3 -3 -4 -4 -8 -3 -2 -8 -6 1 6 -3 -7 9 4 -10 0 5 5 8 7 4 1 4 -2 3 2 4 5 2 -4 10 9 2 4 6 12 6 10 9 14 10 -1 5 -3 5 11 6 0 6 3 10
5366 10 9 -4 0 2 -5 -1 0 1 6 4 16 2 1 10 5 7 -5 10 2 8 4 6 5 2 -5 -4 9 10 9 1 8 0 -2 10 9 10 5 18 6 7 11 0 6 0 -3 2 -6 0 20
5415 20 0 6 4 6 -3 3 5 1 3 -17 -7 1 5 -7 -2 7 -3 -1 15 -2 2 -1 -7 -2 -15 -7 1 -1 8 -4 10 -2 2 11 10 -1 1 -3 10 2 -5 18 12 20 0
5460 0 12 19 4 -4 9 6 5 1 9 19 19 11 13 3 10 -7 7 -5 2 5 -3 4 5 4 -4 15 -3 0 0 -4 -10 0 3 -5 -6 2 -8 0 6 3 -5 7 -5 1 -1 13
5506A3j1oNOnQkkLkLj2nJ1%nLlNqLJQnnMk%JjMmmLj7K3j1JJ0j0JPj2J1j2J0j0
5553a0J8j2KnkONkRmjNLj0%KJjkJk%RljlKjKj1MOlQKjj2lLRlkLj6PMjj1J8j1J2
5604H%j4MjrJ1Kj0ORj1j2ROLKlJ%MKj0JJ%OKoQmL%oNnJ0J0oOj7JmQj1Rj0J3j0
5652ARj9J2pMNj1NpMJ5Jj6kRlQ%%kNj6%J4pJj0NKP%nlJ0ljlLJLj2RKj3J0J0om
5700EmJJ0j6OKoNrMMmj2J9pMoJ5j2k%JLj0MpJnJ4NqNPqMNnOJkKNqJQj2RpJ0lj8
5751eK3j9kJ6nj2NNoLlOJ3j6kjmJpJ1oJ1kmj5J3pNPj0J1JOj1qJ2pKOj2J4j7KJ3
5795EjkJNnmJ2kj0jJmOJKjjmJ4j1NjMk5J6Qj1OpnRK%kj3J1Nlj4J0jL%lMlJ1oR
5844A0ojpJ4j6J1j0Rj1K3j9NNMj1J1j0JjLPpP%KrjR%Oj5NjKNqmqJ6j2LjlRnNj6
$$ plain form
5506 13 2 -4 1 7 2 10 8 6 9 7 10 -2 -7 4 4 -1 2 -1 4 -4 -1 0 8 3 -2 2 0 0 1 0 4 0 -4 -1 -18 5 -6 -5 5 -5 -4 3 -9 2 -10 0 -10
5553 -10 8 -4 -2 -7 -9 -3 2 0 9 5 4 9 12 2 2 4 5 4 2 3 1 1 10 7 6 3 5 4 6 -5 -1 5 2 10 12 11 -1 -4 -1 8 5 3 6 -10 -3 1 0 -11 7 -4 8
5604 8 8 -6 -2 -3 -12 -1 1 -9 -3 6 -5 -17 -8 -2 1 3 0 1 1 5 7 -3 -2 -1 -1 5 7 1 9 5 8 8 2 7 2 12 22 16 22 5 6 2 10 -1 8 -2 11 1
5652 1 10 -9 3 -4 0 5 -6 -1 -8 -4 11 12 -4 -6 3 0 8 8 8 6 11 -5 -5 9 2 3 -7 -2 0 7 7 2 -1 9 6 5 2 5 6 9 -3 6 8 -5 5 15 9 5
5700 5 1 2 12 -4 2 4 -2 3 -6 -2 2 -2 -14 5 -2 2 -4 11 -1 -3 -3 -2 1 -9 -5 -12 -11 -16 -2 3 -5 0 7 -1 3 8 3 9 10 8 10 15 7 8 16 4 13 6 16 13 -5
5751 -5 18 -1 -3 13 8 -4 1 6 0 3 0 6 19 3 1 0 -4 -3 -10 1 -5 6 4 0 -15 -2 -9 -4 3 -7 4 5 11 0 -8 4 -3 -1 5 -7 7 -10 -8 5
5795 5 4 2 3 8 3 -1 11 9 -1 -2 -1 -5 1 2 4 3 2 -2 12 1 6 5 9 -16 0 8 -3 3 -4 -9 0 2 2 0 -13 -2 3 0 -14 -4 -5 -2 -2 -5 -1 -4 7 1 10
5844 10 4 3 -4 10 -6 5 -5 4 -7 16 -3 2 7 11 0 11 1 2 1 4 11 4 11 11 13 4 3 12 12 18 3 8 7 9 14 6 2 -6 10 -2 1 0 -3 6 1 6 -10
5891a0K3j9J0lNnj1J4j2%OJ%Mk3K0kO%rJ4j2QNnqJ1Rj2pJ0KpPkmj2qL0qkJj0L
5935bKJ1poMjNp%kMkqJ1Qnm%lOQmnjLmmJ6j9J0lqJ0JNKRnnLj3J0Oj3K6j0j1J9
5983B7k0KnJ5qj1O%OjlkJokNoj3MRPj1KLLpJ8j2kkkOj0J3Mj2Qj3R%J7k0RmJ7j3
6029FmQpJ2ojpJNjKJj1KJ1jnlOjJjJPpnojJ6rpJ4j3OJNj7MJ5lj5RjjlpJ7pP%k0
6080a3J1%JPMJrQj3KKkOLnNjj6J3KJ3k1LjKMJpkOq%KjjKk%kjmJ4pNRnqllJ0nO
6132BP%nRk4OK4j1nj%KJ0pQLj1KjpONoJ0j0oKKJ1oKj4J0j1RLo%nOpJ0j3NllkJ3
6180C%mKmlN%knNkmQpMkOOpMKMKkojmPM%k0J0JQlPn%%pQoRkL%j5J3ojoLJ2Mk5
6235iKQLNj4RrLj1J1KokOKJNqOOkmJ3j3j5J5QJ2j2rJ2j3Mj0jJ1oM%J4j5lPJ1j5
$$ plain form
5891 -10 13 -6 4 1 6 1 -10 4 -8 -8 -2 -1 -1 3 -20 0 -2 4 4 -5 9 -3 5 10 5 -3 8 17 5 -2 8 10 3 10 8 4 -8 -16 14 6 4 5 -5 -2
5935 -2 0 11 4 -2 2 1 6 -1 -1 -3 1 -1 -9 2 10 5 1 1 -2 4 12 8 3 2 5 1 -3 13 -6 4 1 -7 3 4 9 11 20 15 10 13 0 10 16 3 29 19 8 27
5983 27 7 9 4 19 11 0 6 6 12 11 8 6 7 1 -1 4 -2 -15 -11 -2 5 -6 -4 -1 2 -5 13 1 -1 -3 -5 1 -9 4 8 -4 4 -9 0 0 17 -3 6 2 19 6
6029 6 2 10 3 15 9 8 1 2 7 6 8 9 -2 0 11 10 5 2 8 7 8 7 8 15 8 3 -3 -4 12 3 -4 10 -3 3 4 9 -8 -4 11 8 -7 2 1 0 -3 -10 7 0 7 7 -13
6080 -13 -2 -2 -1 6 10 11 2 10 -3 -1 1 -1 5 8 3 8 7 -9 4 6 19 -2 1 0 2 6 7 0 -2 4 -4 -4 -2 -3 -4 -2 -4 -4 -6 -7 -11 3 -4 1 10 5 -3 -6 -9 1 -4 2
6132 2 9 9 4 13 -11 -5 19 8 3 2 2 4 14 7 15 18 7 9 8 1 7 12 6 16 6 0 2 4 15 9 11 -3 7 -4 5 8 2 2 -3 3 -4 6 -7 -2 -5 -8 -10 3
6180 3 3 -1 1 -3 -6 -1 -1 -3 -8 -3 -5 -9 -1 -8 -4 -6 0 6 -1 3 5 9 11 9 3 2 -2 5 9 9 -11 -1 0 8 5 12 7 7 7 0 8 2 11 9 12 12 -3 10 4 3 -3 0 12 16 -9
6235 -9 -7 1 4 9 -5 4 -5 -2 -13 -2 0 -6 -8 -2 0 1 6 -2 4 10 8 4 17 4 -11 4 12 24 12 3 15 2 6 -4 -5 6 0 4 4 18 3 0 7 18 3
6280CkRj0pQQj3Qj3jlJ6j1J1j0RrJ1nmN%kJ3j4Nl%mKRkJ0oj6J5q%PQkopLJ1j0
6326CnNj0J6lpJ2nRpkKQmlj0MpRjKj9J8j0lQMj1J4jj0J4jj4J0lNrRoJ0j3J0Jk
6371GMqJ0Rj4mJ1NmrJ0Mk0%oJ0MqNnQmJ6j4jK%j1KOnJ5j2qkNJ5j4KPorJ0lnJ2
6417GkkJ0j3Q%j1PljMLmmJ0NkLpko%J0nLLj6QmOmJmK1k3KLmJ0j6J9pnNrJ0Mk0
6465a2J4oPloJ1lJ0j1k%L%NjnjnmJ4Mj5LjJ2lJPnnoOPpMjqJ2p%PQj1KoJ0prJ3
6514A0j5OMj0JjJ2oOjlj9K6qMJr%QqKNpOlQ%%jPnqJJ3j%rnOjmJJ0onONMj3LjJ
6566GJ1j2QJj2jJ3j9J3j8J%nJ4j1J0oPLJnKOokPrJ3j0OpJ0qPqJ0j2NLkqK0Jj3
6610EJ8j7Pj6K0j0OPj2jNj7J2LqMJ0pkkNlo%lQj2J6j7JLRj5J4nMlMpKPPl%%qn
$$ plain form
6280 3 1 10 0 -7 1 9 -4 4 -9 -10 -13 3 -8 3 -7 2 -7 4 -1 -5 0 0 -2 11 -3 2 -1 -1 -5 -3 6 4 14 8 -8 7 -1 -1 6 14 12 6 -1 2 13 3
6326 3 -2 3 -7 9 6 -1 11 6 15 8 6 8 16 12 9 -1 3 -4 5 4 6 -13 5 -5 -8 0 4 -7 7 6 -4 10 9 -5 5 2 7 -2 7 1 11 -2 8 9 7
6371 7 11 3 13 22 8 4 15 20 16 7 17 21 1 1 -5 5 9 1 6 1 9 5 21 7 6 8 8 -3 -1 5 0 15 3 -5 -7 -2 13 -1 1 8 2 -7 3 0 -5 7
6417 7 5 3 13 0 8 8 -3 4 1 0 4 7 3 -1 9 14 12 15 8 6 0 0 10 5 8 11 -5 3 -1 5 1 2 -2 19 -4 -2 1 -3 7 -9 10 3 -2 3 -6 4 8 -12
6465 -12 2 -4 3 0 -6 5 2 12 1 -1 -1 2 2 7 6 1 0 -5 -9 5 9 -6 -3 -4 8 5 6 13 8 3 -3 3 10 3 7 6 -2 10 3 3 10 18 7 9 3 13 6 -3 10
6514 10 -5 1 5 -5 -4 -5 7 1 7 6 3 -16 10 2 6 7 -2 -2 6 -2 0 5 -2 4 1 9 9 9 8 15 10 2 3 16 15 15 6 1 7 6 2 3 13 7 2 8 13 17 4 7 6 7
6566 7 18 6 14 15 3 2 15 -4 9 -9 -8 -8 -13 1 -10 0 -6 1 4 5 0 2 8 2 0 7 -2 11 1 7 0 10 2 9 1 11 -1 4 7 5 -3 17 18 5
6610 5 23 6 13 -3 17 7 13 20 8 7 12 -5 7 10 2 6 16 9 7 5 10 7 1 1 -2 6 -6 10 -7 -6 -3 6 -9 5 0 4 1 5 -2 0 7 14 11 11 11 3 -2
6657bLkJ9mj4J0MojLNnmpMRkmpKJ0onJ0lKj1JJ0j3ONNqjJ2j3J3j1Nml%%qK1Kj2
6705EoJ0k0J7j1J8m%MoJLr%kQQOpOj1%PLkj8J6Lj1K%j6J1QrJmJ2qL%omJ1j0lr
6752a3J2LpJ4Lj4KlJ0jpnMJ3nKjnklMOqlJ2knLrMJ0LkQj2j0J3olR%kLjrKkjkJ6
6802A3j8J2kKj3j%RLNj0JRj2Kk%jJ2j2rKJ2kLkPJmJ3j4OnLK%oRj0J5mJ0j8Qoj1
6848cJ2JmqOKoMkKJMqM%Jlkj4J4oJmRpOkNokJ4j8J9jnJMmoJ3k1J3qJ9j3J1j0k
6896AQJ0mj4LJ0j3J2qKj6J6pPLj3J0j2J1kOk1K3%nj8NjJ3pPJj6J6Rj2pMOrMLJ1
6939A6rJ4qj2j%J2j1jjJ1j%NJ0j5OKj2nJ1MlLj6J1jqllKkJ0%%j2LJ1pKKLKKj4
6984cLLmJ0kKMOj9J3JkmnoJ4n%NmJLpQJknjJ6j6J0Jjj2ORj4nkQnPjLlpK1j6mq
$$ plain form
6657 -2 1 -1 18 14 0 10 14 8 7 10 15 10 6 -1 3 12 10 6 -1 1 11 5 0 10 7 9 -2 -1 9 -4 2 7 12 4 3 15 2 15 4 9 5 2 2 2 -6 15 17 5
6705 5 -1 9 -11 6 -5 13 9 9 13 7 8 11 2 2 0 8 16 22 15 21 10 10 17 20 18 0 16 19 8 10 10 -6 5 13 4 5 1 13 5 8 8 2 -2 9 -1 -4 -13
6752 -13 -1 2 -5 9 12 -2 0 -3 7 6 -1 -6 -2 11 6 8 7 2 0 -3 1 7 -1 -4 8 6 1 4 -5 -1 9 12 10 18 6 -4 9 3 0 9 9 7 10 9 0 2 0 -1 -3 13
6802 13 -5 7 5 7 -6 -7 -7 2 5 10 0 1 10 -2 0 -2 -2 -3 9 -3 -12 -10 2 0 3 1 8 9 5 18 4 10 5 8 10 10 4 13 3 18 14 24 6 14 8 -3
6848 -3 9 10 6 -2 4 6 0 4 2 4 5 9 1 5 5 6 3 1 -13 1 -5 -4 -8 1 -6 0 -2 3 -3 -5 9 -9 10 9 4 5 9 5 -1 12 -9 4 -4 15 2 13 3 1
6896 1 9 19 15 1 4 14 1 13 5 7 -9 7 0 7 10 -3 7 -5 6 4 10 -11 12 12 7 -11 -6 -7 6 -1 6 7 -9 7 16 4 -3 1 7 -2 2 5 16
6939 16 7 21 13 1 0 0 12 1 0 -1 10 9 9 14 24 9 15 17 5 0 11 15 12 15 -1 10 9 1 -2 -5 -3 -5 5 5 5 -7 -4 7 0 2 4 7 9 11 -3
6984 -3 0 3 -1 9 7 9 13 19 0 13 14 12 8 3 -3 11 6 6 11 7 8 11 4 12 13 11 6 5 21 5 15 16 15 3 9 18 4 -1 -3 5 0 7 6 9 6 -1 20 4 0 -8
7034hJ6nRpoPoLRpklQj3Rjj6K3j5%Qj0JJ0JLj6J9oqK8j1Npj7RJ2k2J3kOopK6j6
7079Hj3J2Qj0PkrqJ1Nj6QLqMLqN%j1J5j2PqJ3Rj5lJ6%J%Qj8%N%mNMj2KjNJoPn
7127CqJ6lKj0OoQmRMk0JPoKjNpjOqNNqlKpKQj0RRmjjJ5j5LoPLj2KJ1nj0oJ4J5
7177A7j1J1j1lJ0j6K0j6J2pJ3%qnkKKmkJ1qJRj1pLLlLQk7J7jL%qkJ3j3OOpjLM
7222DploJ0J5rlkJ1j0J1j5jlQlJ1rQJmpQj1QjLrKpJ0jjj0mJmK0njj1J4%JkLok
7270hnJ3j2J9qrL1k6rJ0jQjj1J1jj2J8j3pJ1pMkJ4Jj%Pr%MLJ3k2RjrNJlnQj2L
7315aMj2RpLJ0NqoJ2mJ1oomNlolpJ6lpJjJ6nOj1J1lJ0j7kPQrMl%Qj5K2j1RqoQ
7363A1nj4J8mJmkNmQm%JnrJ3j1NpJ1n%JjpNoLnJ3Jpk%J0k%nPNnjjm%J8j3rJ1n
$$ plain form
7034 -8 8 3 12 5 -1 6 0 3 12 5 3 0 8 -5 4 3 -13 10 -5 -5 3 -7 -6 4 5 8 -8 11 5 -3 25 14 19 12 -5 4 16 -6 7 5 11 5 -2 24 8
7079 8 -5 7 15 5 12 10 1 -7 4 9 -7 1 4 -4 0 3 -5 0 0 -11 4 -8 -1 -9 4 13 -2 -5 11 11 12 12 20 2 2 7 7 3 8 12 0 2 1 6 7 1 8 3
7127 3 -5 11 8 10 0 6 0 8 4 13 17 -3 -2 5 -1 1 0 5 -2 -3 3 -5 0 5 -3 -6 -4 -11 -9 -1 -11 -2 7 3 2 1 16 1 4 -2 5 8 -4 -2 9 4 -6 -12 2 17
7177 17 6 17 6 3 13 -3 17 1 13 6 19 19 11 6 4 6 8 4 2 13 5 6 15 4 -3 0 3 0 3 11 -16 1 0 3 3 -5 -7 6 -7 -1 5 -2 -3 0 4
7222 4 -3 -6 -12 -2 13 4 1 -1 10 0 11 -4 -5 -8 0 -3 8 -1 7 8 4 -3 5 -6 2 1 4 -5 -3 -10 0 -1 -2 -12 -16 -15 -19 1 -4 -5 -16 -2 -2 -1 -3 0 -6 -8
7270 -8 -13 0 -12 7 -1 -10 21 -5 -14 -4 -5 3 2 -9 2 1 -11 7 -6 -13 -2 -9 -5 -7 7 8 7 7 14 5 5 9 12 25 3 12 11 2 7 8 5 0 8 -4 -1
7315 -1 3 -9 0 -7 -4 6 11 3 -3 9 5 16 10 4 0 5 2 -4 -7 -14 2 -1 -8 -7 -8 8 3 9 -2 9 6 16 -1 -3 4 12 3 7 4 4 12 -3 19 8 17 9 3 11
7363 11 6 -8 10 6 7 3 1 6 2 10 6 6 7 2 -7 6 -5 0 -7 4 -1 -1 0 -1 -8 -3 -9 -6 -11 2 3 -4 -6 -6 4 2 2 -3 4 9 4 3 2 -2 -2 16 3 -6 5 0
7413@NKjmOmjRomMlPj1JQoMj9J7mJ3j3%kPnnJ0Nj4J3rkJ1oqJ0nk%K%jlRjLpqJ1
7464CPplPkoKMJ1oLj1NMmMpJ0pmMklJNnKOj5J5KqnlNjljPJNoJkqJ1JKr%mNJ3r
7518ELpJ5oKkKj3mJ0Oj0NmnJ2onkRjOoJpLkokNqPJ1po%K%mkJ2jmlJ1mj4OMNpJ1
7570EqLR%n%k%J0Ok0LQkoOrK1nkopJkNJ%lPrJLPj9LOLkLPj6J3j9QJ2j3J2j2QN
7620Ij2Nj1PJ0j4J5qJjlJ1j2NN%nNj3LJ2%krmJKJ4nMj3%JlkOKj4OmPpMlJ0jlN
7668Aj2J3J2k0%J0lJo%KrPPPqoKL%LkJ5j2oJ1jjNj8RMj4K1j1R%j0J1j4Qj0NMl
7713DpJ1j3lJ1Jj5OPj0J2JOj9RpmQJ2qKrO%oOKKLrPqLOjnlRokMNLpkjLpJ0jj1
7764eR%%MkjMnKoMqJPjjlJ1j2PoJ7oj9JJ4lnKLjMj%nJ9j8PqJ1oKj3J2Nj4M%PN
$$ plain form
7413 0 5 7 6 2 8 4 3 12 6 2 6 3 10 -1 0 8 2 6 -13 4 0 13 0 0 -2 5 0 -5 5 10 -4 9 0 -2 9 3 -5 5 0 -2 -2 0 0 -1 -4 5 4 7 0 -8 3
7464 3 10 3 0 7 5 -1 1 5 16 10 13 2 7 11 7 11 4 14 7 3 7 5 2 3 8 3 5 11 -4 11 13 5 0 -3 2 1 -2 -3 4 5 10 4 5 3 -5 6 7 9 0 0 -4 1 14 5
7518 5 8 1 16 10 12 10 12 -1 -5 5 11 1 6 2 -3 9 3 -2 -4 5 4 10 4 5 -2 1 -1 -7 -9 -4 -12 -5 6 -1 -7 -7 -5 -5 -9 -11 1 0 -4 -7 4 0 -14 -8 -4 1 -6 5
7570 5 -3 0 9 9 4 4 2 2 12 18 -2 1 9 7 1 7 -2 19 14 12 6 -1 0 -2 3 4 4 1 8 -1 0 3 10 -9 -6 0 3 1 4 11 -5 8 -11 -3 9 -4 8 -4 4 9
7620 9 -3 2 -9 -2 8 -6 9 1 2 1 -2 9 -3 2 7 7 2 7 -6 -3 9 9 7 -2 -6 -5 -3 11 6 10 -3 -3 -2 -5 -7 -1 1 -13 -7 -11 -4 -11 -7 -10 0 -1 -4 1
7668 1 -11 2 14 -6 -6 4 1 2 -4 -4 -2 -11 -4 3 10 2 -4 -2 1 1 4 2 17 5 -1 10 9 8 13 -5 4 8 -6 15 4 13 13 3 14 0 8 -2 3 7 4
7713 4 -3 8 -5 -8 3 4 -11 -5 2 -8 4 5 11 -8 1 -6 -10 -2 10 2 4 -5 1 1 -5 1 3 5 8 -1 6 -2 1 7 6 1 -2 7 1 -1 3 8 11 4 2 1 4 -3 7 6 -5
7764 -5 4 4 4 8 6 5 9 4 6 0 4 -4 -3 4 3 2 -1 10 -2 5 -1 16 10 -9 -8 6 3 -2 0 3 2 6 5 5 0 19 1 8 0 11 5 7 -6 6 11 -3 1 1 8 13
7814A3j4J0pJ0j2J7kj8J3qpRooPj%qK1j3NkrjJ0jj1MR%Nj0NnOqJ3ljj4J6mkJ4
7858A4qj3ML%LklJ7Mj8jNjqJ0k%%kJj0LJ0lmmjO%j0J0j1J2j2J1J%j1LQJoj6K6
7903F%j1jNnnPJ0lj7K1j5JOJoONkoKkNKolJ4pj3J1kKKJoJj1P%PJ%Koj2J1j0kM
7952a1NMpj0J5JmLnNkkMJOLj3ONmj0QK0j0lmMlN%LprOOLNmJj9J5j7KQJ0j5J0p
8000bMjj8K9k2J5lnnQkNkmlm%J2Mlnj1jkQNoPoJ4qMnPJ0pj4J0Mj1KOj3RrNJ3j8
8048iK1j4OQomkLNl%joMKPj0LLj4MOJ0j9M%nJ2kjMolKk%%J7j1kJknmJ4j0J1%l
8097ClJ1mNLolNpPkMj2JPnPrLj3J3kLrrJ8rnKJ0j1J3nj7K3rLJ%j0OLOoqOj%Rl
8147DnMJ0j3RRk8J7OpMoJ6nj9LNj5L4j3jrLLlJj1N%j4J7pj0PJ0Oj3J9k1MKQpP
$$ plain form
7814 13 -1 9 2 12 0 17 15 -3 10 2 -5 4 -2 -8 -1 -2 -2 -10 11 -2 3 1 -8 -9 1 0 -11 -7 2 2 7 -3 2 -3 3 -5 8 5 4 -10 6 2 0 14
7858 14 6 -7 -3 0 0 3 1 -2 15 19 1 0 5 4 -4 6 4 4 4 2 3 -7 -4 6 3 -1 -5 -6 0 0 -10 0 -11 1 -11 0 1 1 -10 -7 1 2 -4 -20 6
7903 6 6 -5 -6 -1 -6 -11 -4 6 3 -14 7 -8 -7 -1 0 -6 0 5 3 -3 -1 -3 2 4 -2 -5 9 2 -11 0 -2 0 2 3 -3 -2 -13 -6 -6 1 2 2 4 -2 -14 -3 -13 -15 -11
7952 -11 -6 -2 -9 -19 -4 -3 -7 -4 -9 -4 -6 -8 -4 -3 3 6 -7 -1 4 0 -10 -2 18 8 5 1 5 2 7 7 10 3 -6 0 6 9 14 10 11 -8 7 -10 -8 0 10 -5 5 -2
8000 -2 2 1 -17 12 -10 5 2 -3 -8 0 -2 3 1 -3 -6 -10 -10 2 6 3 -2 -13 -14 -16 -8 -3 -9 -2 -8 6 -2 2 -3 4 14 7 -7 3 7 -4 -2 4 -9 0 -9 -4 9 -9
8048 -9 12 -2 4 12 6 2 0 3 8 5 5 4 -2 2 4 11 1 4 7 -7 -3 3 13 -6 -2 -2 -7 5 3 2 6 0 -3 -1 -3 -3 -3 14 3 1 2 0 -5 -9 5 -5 6 6 3
8097 3 0 11 7 12 15 9 6 11 4 11 9 13 1 2 9 4 11 2 5 -8 5 3 6 -3 -12 6 -3 -8 -6 4 -7 6 1 -16 7 -2 1 2 2 -8 -2 1 7 1 -7 -1 -2 -2 7 4
8147 4 -1 3 13 0 9 18 -10 7 13 6 10 4 20 15 -4 -1 4 -11 23 10 9 0 3 6 3 4 -7 -2 -2 -16 1 -6 -16 -9 1 7 -6 13 -8 -4 -2 6 -1 6
8191F
$$ Imaginary data points
##PAGE= N=2
##DATA TABLE= (X++(I..I)), XYDATA
0@%%%%%%%%%%%Qj6J6j6J6j7K5l2L2m0M8n6O8p6Q8j04J20j36J52j68J88k12K36
34A24k63K95l28L64m04M48m96N49o10O77p50Q30r20J024j142J278j437J626j860
53i95K150k522L022l731M831o787J1313m0656l1367L3081j2082M582K159o65M091
68c3576K0205M23l43J1567R271m669N846Q890N427O576P550k241O2J781k871j093
84C2805Q496N378j044o309r351l001O614k46p381m524p834j1174k6J105q635j353
100f480N266j0721j4043K392J273o708K818L422q300k544N769k088p58R341L313
115a8048l824J422Q28n65Q589Q564l64K522N062k433m47P416M557K220L209m143
131A4565n733M631N027j384J300l36o804p31K964o354l485P534O7q869j521J27
$$ plain form
0 0 0 0 0 0 0 0 0 0 0 0 0 8 -8 8 -8 8 -9 16 -16 16 -24 24 -32 36 -40 48 -56 64 -72 80 -88 100 -112 124
34 124 -139 156 -172 192 -212 236 -260 289 -321 356 -394 436 -484 540 -602 676 -761 865 -995
53 -995 1155 -1367 1655 -2076 2755 -4032 7281 -33375 -64742 -31661 -43743 -39161 -37002 -37667 -33576
68 -33576 -13371 -12948 -13291 -1724 7547 2878 8724 17614 23041 29617 37167 34926 34988 36769 33898 32805
84 32805 41301 46679 45635 39326 29975 26974 33588 33342 25961 21437 13603 2429 2403 3508 -5127 -6480
100 -6480 -1214 -11935 -25978 -23586 -22313 -29021 -26203 -22781 -31081 -33625 -27856 -29944 -30702 -21361 -18048
115 -18048 -21872 -20450 -19622 -20187 -11598 -3034 -3398 -876 4186 1753 1306 8722 13279 15499 18708 14565
131 14565 8832 13463 18490 17106 18406 18070 11266 10535 13499 7145 3660 11194 11261 2392 871 998
147I98n022J428N177l694m990J90k859l388L267L133r31j055l030k975L474M449
163e828j91J057K199j249KK160j27K147N391j64l090J145l03j606M647L233m368
180E055o58K394n102k884P058K258n142j56L02n103J85N177j222l088J182j480
196a224l658R85J640o78J037L72k879q28J233p39O67L302M05k357j334n76J211
213c421L523J356j137l66j032q30K800J974j802P23K363k588k486L142J877j036
229C060J621R41l414j757J517K38N08J737j072k437j01J39J41J917qk965o99Q31
247A97j588q18K036R29n00m6j509k268J85J317M93J38j372k406M53K186J30K32
265b211J389j380k674O65J353p88N33K242K85r04K38L99L15J214J082j6p88j133
$$ plain form
147 998 -4024 -2596 2581 -1113 -6103 -5913 -8772 -12160 -8893 -5760 -6691 -7746 -10776 -13751 -10277 -5828
163 -5828 -6019 -4962 -2763 -4012 -4010 -1850 -1977 170 5561 5397 2307 3452 3149 1543 6190 9423 5055
180 5055 4397 6791 1689 -1195 5863 8121 2979 2823 3125 -1978 -1793 3384 2162 -926 256 -1224
196 -1224 -4882 -3897 -2257 -2935 -1898 -1526 -4405 -5233 -4000 -4739 -4072 -770 -365 -2722 -4056 -4632 -3421
213 -3421 102 1458 321 -45 -1077 -1907 893 2867 1065 1788 4151 1563 -923 2219 4096 3060
229 3060 4681 5622 2208 451 1968 2206 2714 4451 3379 942 841 980 1121 3038 3030 65 -634 197
247 197 -1391 -2209 -173 756 256 210 -1299 -3567 -3382 -2065 -1572 -1434 -2806 -5212 -4759 -2573 -2443 -2211
265 -2211 -822 -2202 -4876 -4211 -2858 -3646 -3113 -871 -586 -1490 -1252 -853 -538 676 1758 1742 954 -179
283a79K59K328J746P8L17J13j300q33P33N91N8J16m71p43j38l6L62R60n61k096
303A304r32m26j536pK120l8k239m91K94j077l57R95j80j065j54J0m20L07J151
322b741J080L30r14j226K35J260O97N23P65l2n43N60J372P05K25O83N19n23o52
341B323N89J108J80k00K26n27j555n03R28L01p00m91o29j216o41M64N49k74q51
360i19o05q6j98m21K88N49n79j102j87r8o12L27J400L69q75k56N27K34K79R30
380a035P81j38l41M08R45P16O08P08K04p88o79M42P34j0j08M33J15o55k72M84
400B552N0o06k66j51j109j179K91Q53j78o59k89m80r26l47M09J39m25l14J02N5
420b478r1L38Q05K59p23n11K66P3k07O64J050Nm09M78O63k2L58J089L77n77r5
$$ plain form
283 -179 80 2408 4154 4232 4549 4662 3362 2529 3262 3853 3911 4027 3556 2813 2675 2639 3001 3961 3400 1304
303 1304 372 -54 -1590 -1597 523 485 -1754 -2245 -1951 -3028 -3385 -2390 -2570 -3635 -3789 -3779 -4199 -3892 -2741
322 -2741 -1661 -1331 -2245 -3471 -3236 -1976 -1279 -756 9 -23 -566 -6 1366 2071 2296 2979 3498 2975 2323
341 2323 2912 4020 4200 4000 4226 3699 2144 1641 2569 2870 2170 1679 1050 -166 -807 -343 206 -68 -919
360 -919 -1524 -1610 -1808 -2229 -1941 -1392 -1971 -3073 -3260 -3358 -3970 -3643 -2243 -1874 -2749 -3005 -2478 -2244 -1965 -1035
380 -1035 -254 -392 -733 -325 620 1336 1944 2652 2856 2068 1389 1831 2565 2555 2447 2880 2995 2340 2068 2552
400 2552 2602 1996 1730 1579 470 -709 -418 435 257 -402 -691 -1171 -2097 -2444 -2035 -1896 -2321 -2635 -2533 -2478
420 -2478 -2569 -2231 -1426 -1167 -1890 -2401 -2135 -2062 -2269 -1605 -555 -550 -959 -481 182 160 518 1607 1984 1407 1312
441A312P10N37J73K80K39l86p39l70O3j16m94j75O5o54r79M6O14j48n09Lj67o81
463a376k42N64K94m82l11J83k09o32J36Q54P0n53J28L80k39M2R04N91j31R3L70
484D34J83J98L52M05L04k30n15J00L77k35nP40j74j078q4N27l49m79K02j45p23
505a95l79O5J3j31k48k0k6o93n36O81M93n74J10Q40k69n06P34O38k02J66K87l70
527a22o1M05K22L16K02m71j6O31k63m85Q59N63q04j98N97l04m12M47Q7n03k90
548D00k67k53n9l07j20K56o83j081N50P41q47k21J084j45o95O11K72n74N47O84
568a07n69j07O65k6L07P77m15l10R50k05j202P44J172o16k60P69k04m07N92K5
588A573p41j75o0k67n7l40p2R18l5j345J26P18j077o91Q87k35p59P75K50q76O30
$$ plain form
441 1312 2022 2559 2732 3012 3251 2865 2126 1756 1819 1703 1209 1034 1099 445 -534 -488 126 -22 -531 -528 -695 -1376
463 -1376 -1618 -1054 -760 -1242 -1553 -1370 -1579 -2211 -2075 -1221 -1151 -1704 -1576 -1196 -1435 -1393 -489 102 -29 64 434
484 434 617 815 1167 1572 1876 1646 1131 1231 1608 1373 1368 2108 1934 856 772 1299 950 471 673 528 -195
505 -195 -574 -509 -496 -627 -875 -895 -921 -1614 -2150 -1469 -976 -1550 -1440 -600 -869 -1375 -641 -3 -205 -39 248 -122
527 -122 -183 222 444 760 962 491 475 1106 843 358 1217 1780 976 778 1375 1071 659 1106 1193 690 400
548 400 133 -120 -179 -486 -606 -350 -1033 -2114 -1564 -823 -1670 -1891 -807 -952 -1647 -1036 -764 -1338 -791 -107
568 -107 -676 -783 -118 -144 163 940 525 215 1165 960 -242 502 1674 1058 798 1567 1363 956 1548 1573
588 1573 832 657 597 330 273 -67 -139 779 744 -601 -475 243 -834 -1525 -638 -873 -1632 -857 -607 -1483 -853
609h53R30p84m24L62n90P6J126m29m98J588N59j342L44J152p13m69P82l34n75
628i2Q52M23m25K43K88k04j06o67o50Q33M06j233kJ170n20n48Q73l41j017O81
648c6R7j391K38J106m47q3O88o57j94J172o93j381J267Q68j455l0J264m25k09
667c01J084l63j025O42M42o88m7L10J38M57k61q39P45Q84j094n24Q48l38m98Q60
687D32j97r35R87P60j234k88P39m06M9O78r40m85J450r2j452Q32J001j191k36
706e28R72n88m60J068q3r72N61N82n38j86L6p7O29l6j214K01J107n63n66P40k63
727a78n79R58J06j159O01J070p84l33O76l09mQ30p14p52J338K62j622K42J200
746H49o78m14P46n56o18J107K75j131%O76Oj34l30l64P22M17j062l07P79l11m06
$$ plain form
609 -853 77 -707 -1131 -769 -1359 -1283 -157 -586 -1084 504 1063 -279 65 1217 504 35 817 483 -92
628 -92 760 1183 758 1001 1289 1085 979 312 -338 495 901 -332 -334 836 316 -232 641 300 -717 -36
648 -36 61 -1330 -1092 14 -433 -516 172 -485 -679 493 -200 -1581 -314 554 -901 -931 333 -92 -301
667 -301 783 420 -605 37 479 -209 -256 54 192 649 388 -451 294 1178 84 -440 408 70 -428 432
687 432 235 -700 287 1047 -187 -475 264 -142 -93 585 -355 -840 610 518 -934 -102 899 -292 -528
706 -528 444 -144 -604 464 381 -591 -30 552 14 -172 -136 -213 416 380 -834 -633 474 -89 -655 85 -178
727 -178 -757 201 307 -852 -251 819 35 -298 378 69 65 895 181 -571 767 1029 -593 -351 849
746 849 171 -243 503 -53 -671 436 711 -420 -420 256 262 128 -202 -566 156 573 -489 -796 -17 -328 -734
767g34O22l04o53R41L84j149J17J029l39k97L98m31L6J183l72j043J063Q24j166
786A09j77R30n01l01R55l25r43Q33P95q28m49L54K5o2l16o88K17O66m56m28M13
807a77j67l56N15j80q87M61O27p41j77P57L9q0L06n69k62R69j65j153N60R64n77
828b93J7Q56l97l23J093N9j083K31P96k46k46K93P8K15M7o75j98M66l56n87J70
849h3j56l23O08J88q57j9O95l08n56Q4j70RN02k60m26P07K71p57J42O07n25k09
871h36P04k56m69R68O15p34j07O56N5j64Pk14Q0M03j36j39K99j30k27M08m3o82
893E8J01L37m90j94M72j42m16M2p3j24J85k94n40L77L07n45K1N26l16j72P20l0
915a90o59M39O12l61j57M18Q6p0J11p2Q4K85j05j86K89K6k15K91J64m58K5M64
$$ plain form
767 -734 -112 -416 -1069 -128 256 -893 -776 253 -86 -383 15 -416 -380 803 431 -612 451 1275 109
786 109 -68 862 361 60 1015 690 -253 580 1375 547 98 452 477 415 99 -589 -372 294 -162 -590 -177
807 -177 -344 -700 -185 -365 -1252 -791 -164 -905 -1082 -325 -286 -366 -60 -629 -891 78 -87 -1240 -680 284 -293
828 -293 -276 580 183 -140 953 1012 -71 160 956 710 464 757 835 1050 1097 422 224 690 334 -253 -83
849 -83 -239 -562 46 234 -623 -642 53 -255 -811 -727 -897 -888 -386 -646 -1072 -365 -94 -851 -709 -102 -627 -836
871 -836 -132 -388 -857 111 726 -8 -115 541 596 432 439 225 305 708 572 433 732 602 375 783 740 58
893 58 159 496 6 -188 284 142 -274 -232 -305 -429 -244 -538 -1078 -701 -394 -939 -918 -392 -708 -880 -160 -190
915 -190 -849 -410 202 -159 -316 102 188 118 229 157 241 526 421 235 524 550 335 626 790 332 357 821
937H21k24l87K37J30k15j13j50j64J38j28m26Q4J35l40ML10l58l40N24J87n76
958h51k0M20o3p4K74L9n4J06Q1J22J58j54n9M01R1k21K42K96k66n0M32m3l65N4
982D96J76p1m1m0j12M7o2k03R2M4m11j37L14j65l86J69J32l53r9K64q3k87J6J48
1006e52L3n6r9Q3J76m6j8K75M8j84K17L37j33j38L01J59j42MJ81O3J0j1M9Q6l5
1031F08j57R6P1k69p2K73j06l48Q1K16k23k54P4m0k04o5N2j3j29q1J24Q4j85j67
1055f34J88P3k39RK40j2j10J93K00o0n5J24J16l8n2J36J98l3q7K07K02j75r5J88
1079D84Kk09M1J71j03j47J00J27j01j95k5P9q3k03MP7j67j40J75M4k64p2J91j9
1103b33k00K6J45l2n8O3J07Mp8L8J86k7j72J18K23j31j27K11J08j82J7K33j5j22
$$ plain form
937 821 597 210 447 577 362 249 99 -65 73 -55 -481 -397 -262 -602 -598 -288 -646 -986 -462 -275 -851
958 -851 -871 -451 -514 -588 -314 -275 -329 -223 -142 -20 138 -16 -75 326 417 196 438 734 468 418 850 807 442 496
982 496 672 601 560 520 408 455 393 190 282 326 -85 -222 92 -73 -459 -290 -158 -511 -610 -346 -429 -716 -700 -552
1006 -552 -519 -575 -674 -591 -415 -461 -479 -204 -156 -340 -123 214 81 -57 244 403 261 265 446 509 519 508 557 643 608
1031 608 451 547 618 349 277 550 444 96 177 393 170 -84 -10 -50 -254 -319 -267 -280 -409 -490 -366 -282 -467 -634
1055 -634 -446 -373 -612 -603 -363 -375 -485 -292 -92 -152 -207 -83 33 -5 -57 79 277 244 157 364 566 391 296 484
1079 484 486 277 318 489 386 239 339 466 365 170 145 224 141 -62 -58 19 -148 -288 -113 -69 -333 -405 -214 -233
1103 -233 -433 -407 -262 -294 -352 -289 -182 -178 -256 -218 -32 -59 -231 -113 110 -21 -148 63 171 -11 6 239 224 102
1127A02J00J41l8j16QJ14l7j71J2J43r9j66J05J00k00j17R2k2j35oQ3K0q0J7J27
1152b3O1j95j05J90N3k43K3K16r0j05K72R1k44l2K02l2j53L0J07L3j3RJ05N7j44
1177G0j00J49j3k13M4J70r2m8J84O6j74o1O0L2j15j24M0J31n6j12J65P1k45l3
1201b04K31j31k43J87J72j70mK37Oj15L2K4km0j21K1J32m3j29J84P5k06K2J91
1225A06j23j52J78Q7j04J2J26M8Rj07l5J67m8k30P8J73j72q8K47m9k78J68J99
1248B12k57j32K02J3j31J4J0J4N3j04r2J26%j88Q1J09j85mK27p3j97J40J53j05
1272a14o2M8M2P9m7q2J69J04k15O3K63j32j41K91L9k95J41K55j85j65K26J9j21
1295A80Km1m8J20q0k01J12P6k03j2J51j92r3K39n8k54Q6J73r8j17mM0R9k2j98
$$ plain form
1127 102 202 343 305 189 197 311 274 103 115 258 159 -7 98 198 -2 -119 -27 -49 -184 -190 -107 -87 -167 -150 -23
1152 -23 38 -157 -262 -72 -19 -262 -239 -23 -113 -218 54 145 -99 -131 71 39 -114 -84 23 56 43 52 157 214 70
1177 70 -30 119 106 -107 -63 107 15 -33 151 217 43 -18 42 74 -41 -165 -125 6 -50 -162 3 74 -171 -204
1201 -204 27 -104 -347 -160 12 -158 -162 75 81 -34 -2 22 20 -20 -141 -120 12 -31 -160 24 99 -107 -85 106
1225 106 -17 -169 9 96 -8 4 130 178 187 80 45 212 164 -66 12 185 13 -75 172 123 -155 13 212
1248 212 -45 -177 25 38 -93 -79 -69 -55 -2 -106 -198 -72 -72 -260 -179 -70 -255 -259 -32 -105 -302 -162 -9 -114
1272 -114 -176 -128 -86 -7 -54 -136 33 137 -78 -15 248 116 -25 266 305 10 151 406 221 56 282 301 180
1295 180 182 141 93 213 133 -68 44 120 -83 -95 56 -136 -229 10 -48 -302 -216 -43 -141 -258 -262 -222 -123 -145 -343
1320c43Q2J84j48m5K45r0j73L19J28l33N9L60r9k03J74J14m7O3m1j01J59M8k24
1343H8K9J29j53PJ88j92j80K72P7l29o3J71l1r1m1m2J11M6j62k2J86j34j24K05
1367e5r1k28K64K50l24p3L71Rk30O2M1n6J42Jj69J44J88j17k5J21j59m3K21j16
1391A28l00K12K36k22j21J51L2o4p1j21qJ02r1p2J16m8m6K05j6l37J26L13k64
1414a60k08K82R8j21J11K6j02J79P5k29J2J83j00J1J65j24p4L22K8l77N4K76j42
1437A85j85Q9J1j1O8q8q4J04m5j10M9r3j50K00Q3l37kL48r5k59J13O9j21P4L9
1462a48j54J19J76j31l0J62o8rJ82q9j96L11J70l07k9L04k1j36R1j1m9J00j1j09
1486A17M8Km3Q8o0k05J27J74k71j43K70k9k23P5N3j30N3O5j78J9J30q8l5J04j06
$$ plain form
1320 -343 -261 -77 -225 -270 -25 -115 -288 31 159 -174 -115 245 146 -57 117 231 184 247 206 105 264 312 88
1343 88 117 246 93 100 288 96 -84 188 265 -64 -127 44 13 -78 -119 -161 -50 -4 -166 -188 -2 -136 -260 -55
1367 -55 -146 -374 -110 140 -184 -257 114 123 -107 -45 -4 -60 82 83 -86 58 246 129 104 225 66 23 244 128
1391 128 -172 40 276 54 -67 84 116 52 -19 -140 -148 -46 -137 -209 -93 -141 -187 18 2 -335 -209 104 -160
1414 -160 -368 -86 12 -109 2 28 -74 105 180 -49 -37 146 46 57 222 98 24 346 374 -3 51 327 185
1437 185 0 89 100 89 157 69 -15 89 44 -66 -17 -110 -260 -60 23 -314 -316 32 -63 -322 -209 -140 -261 -187 -148
1462 -148 -302 -183 -7 -138 -168 -6 -74 -83 99 10 -186 125 295 -12 -41 263 242 106 197 186 137 237 226 117
1486 117 165 167 124 212 152 -53 74 248 -23 -166 104 75 -148 -73 -20 -150 -97 -32 -210 -191 -61 -149 -184 -80 -186
1511a86n2K34o0k64J97K35k17r2K39J1j02Q5K5o2R2M6n9K7K2k6J06j2k05O7K37
1536B86j47k24J88O8j65M4M2j19K1Q2j21l8Q0n0l8J03j15j04K15K6k78O3K49j25
1560e7j23J38K4r4Q8L6r0M3O0j0L6ro3J16P7j79m4K28l8j61J11Q7j27K5P3j08
1586C9rO3o6m1K4m9j4J09r8j38J55O2k17j5J79o2j24J17M2p8M9N7o1%J6JL4j4
1614c9o6R3J26j16o4J67J1j16M9Q3q1pR4j1j4M9j7j7J2p6k0R3q6j20R8J04j57
1641b8m6J24l6j19N9J0p3k4O0%k2k7pO6j6q7L4J13r0o8J29M8r2L1Q8k7k8O3K1
1670E6l7RJ9M4J2m5j5J14j7r6N8P9r2n2J02mr5K0O8o3m7J3Nk4o1kN1k1r6J2P9
1701b6m8p7O9M4r1JP5j3n7J9L5J6k4lM6L6n0j6J02J8r2K8R5m1m7Q3L9o0%Q4j8
$$ plain form
1511 -186 -238 -4 -64 -328 -131 104 -113 -205 34 45 -57 28 53 -9 83 129 70 97 119 93 199 187 -18 49 286
1536 286 139 -85 103 171 6 50 92 -27 -6 76 -45 -83 -3 -53 -91 12 -103 -207 8 34 -244 -181 68 -57
1560 -57 -180 -42 -18 -112 -24 12 -78 -35 25 15 51 42 -21 95 172 -7 -51 177 139 -22 89 176 49 74 147 39
1586 39 30 93 27 -14 10 -39 -53 56 -42 -180 -25 37 -180 -195 -16 -78 -202 -85 -43 -121 -72 -15 -76 -76 -60 -59 -25 -39
1614 -39 -105 -12 114 -2 -66 101 112 -4 45 128 47 40 134 123 109 158 141 124 136 60 40 133 47 -73 25 129 -28
1641 -28 -74 50 14 -105 -46 -36 -109 -133 -73 -73 -95 -122 -129 -63 -79 -166 -132 -19 -109 -177 -48 0 -92 -61 27 0 -28 35 56
1670 56 19 28 47 91 103 58 43 157 140 44 102 181 89 37 139 135 40 60 128 65 18 31 36 12 -49 -51 0 -21 -117 -105 -26
1701 -26 -74 -151 -82 -38 -129 -128 -53 -66 -123 -104 -69 -53 -77 -80 -34 2 -48 -64 38 56 -36 -8 87 46 -1 82 121 61 61 145 127
1732A27p1NL1%m1k6O9j0p1NN7n0q5M1L1o3l6M4K6n2j9L0Ol8k0K5L0l9k1P1K4o9
1764h9L0Q8l2o4M4O3m7k0O1L7m5jN1J8o1j3O0nm7kO2lp0KN4k6n6K1J8n5k6K7K5
1797am0k9K7L8m5n2N2J9n9j2R2j9o6L3P1m6l1M9K8j8k0L8M1l7k4N1L4l9j6O0J1
1828I0n9RN0j9m8OM0j8l2nK5nk5nK6m1m9N3L6q1l8J03mr4J4O4k7m7L7K4j7k0K5
1861c2K5k0j6J9M2k5m1O2M1o1nN0J2m8K6K1Nk1nK2Rl5j7O2k3n9J5P8o5n8P0L5
1893F3q5qO2l1l2L9Nk8k3J2J6Ll5nM0j8o1L3O9n5k2M4L1l9kJ6J7k5KK2K2l5k4
1926c2P6J8r6KJ09m8p7O7M4p6rQ0l7k3L8ml4rj1K7J1m1j2O0J4p5KO2l7m0M6kk8
1959c5QK2mMj1kL9l7o5P2N8j00k1J26Kr9P1K9o5NL8k5l7M4J0j7J0k2NL5k9n6L4
$$ plain form
1732 127 56 61 92 92 51 25 94 84 13 18 75 25 -60 -19 12 -51 -87 -43 -17 -69 -88 -58 -52 -90 -110 -85 -55 -94 -115 -44 -20 -89
1764 -89 -59 29 -3 -67 -23 40 -7 -27 34 71 26 25 76 94 33 20 80 75 28 26 88 85 15 17 71 45 -11 10 28 -27 -53 -26 -1
1797 -1 -41 -70 -43 -5 -50 -102 -50 -31 -90 -102 -10 -29 -95 -62 9 -37 -68 -19 9 -9 -29 9 50 13 -11 40 74 35 19 79 90
1828 90 31 40 90 71 23 29 69 51 19 14 39 34 9 4 30 -11 -60 -7 29 -52 -90 13 9 -85 -71 -7 -34 -81 -44 -20 -37 -57 -32
1861 -32 -7 -27 -43 -24 18 -7 -48 14 55 -6 -11 39 51 3 29 50 55 34 29 51 60 25 8 70 47 -12 3 81 16 -42 28 63
1893 63 -22 -30 32 1 -31 8 13 -15 -38 -26 -10 -7 -42 -47 -7 -25 -86 -53 16 -39 -61 -17 14 -25 -27 -11 6 -19 -17 5 27 -8 -32
1926 -32 44 62 -34 -32 77 29 -48 19 63 -13 -22 58 21 -2 36 32 -2 -11 -22 5 16 -25 -37 23 37 -38 -36 26 -11 -51 -5 -7 -35
1959 -35 -27 -5 -9 -5 -16 -18 21 -16 -81 -9 49 -51 -72 54 56 -43 28 57 -8 -3 35 10 -27 17 27 10 20 -2 3 38 9 -47 -13
1992a3N8p2j2P2j1m7M5qm2K2J6k2mnlN1j5q9N5Q2q8n3R4J7q8L7P0n4j3O2k4l4
2024a6M2K0m6L0l4oQ0j9r9M2Q4o4n8P4pn6N3lm2J8L0m1J0j1j8N3J7j02nJ18l9
2055Er3Q5L4r5L6P1q8qP0k5m1K8J1kL5l8l5Q5K4j07K8R2p0k3O3j1m4M8J4m4LK9
2087C7k0Mj0n5N6M9r1k8J20m0q9O5N3j05J8Q0o9l5P3Jn5J0J3j1M3l0p0P2N1p7
2117d0k5Q3k5m6O0on5M9N2o5mK1JK7j3n7M9Q2q0n8R4Lo2M2K9q0J1P8o0l8O0Mj6
2150A5%ll6P0j3r3M6P3q2k2P0l3m2O5j3o7J9M9j3j8mpM0M0q5MP0m2n7P5J3o5L5
2183a1O4p5J0O7k8n1L4Qj3L1j3n2P5J0q0K0N0n1k6N4k0m0N8K1n8j4M5j6Kj3l4
2214d6L5L7o4nP2k8m9N9J6q0M5N4p3j9O2Ml7K3mkK6k5m0M4K7n9J1N2m5j1N3j6
$$ plain form
1992 -13 45 -27 -39 33 22 -25 20 12 -30 -8 8 -14 -18 -23 -26 25 10 -79 -24 58 -30 -83 11 28 -60 -23 47 -7 -20 42 18 -16
2024 -16 26 46 0 30 -4 -10 70 51 -48 -6 78 14 -44 30 23 -33 20 17 -25 -7 23 -18 -8 -19 -37 16 33 -69 -74 44 5
2055 5 -88 -3 31 -64 -28 43 -45 -53 17 -8 -49 -21 -10 -12 23 -15 -50 35 59 -48 -20 72 2 -21 42 31 -13 35 49 5 8 37
2087 37 17 21 11 -44 12 61 -30 -58 62 22 -67 -2 51 -54 -36 44 -25 -60 13 14 -41 -31 -18 -29 14 -16 -86 -14 37 -40
2117 -40 -65 18 -7 -53 7 1 -54 -5 47 -18 -22 -1 0 27 14 -43 6 88 8 -50 44 47 -15 27 56 -24 -13 65 5 -33 27 31 15
2150 15 15 12 -24 46 33 -60 -14 59 -23 -45 25 -8 -50 15 2 -65 -46 3 -10 -28 -32 -39 1 41 -44 -40 30 -12 -69 6 19 -46 -11
2183 -11 53 -22 -12 55 27 -24 10 18 5 36 23 -29 46 56 -24 -4 46 -5 -31 23 3 -37 21 42 -16 -30 15 -1 1 -12 -46
2214 -46 -11 26 -38 -43 29 1 -48 11 27 -53 -8 46 -27 -46 16 20 -17 6 2 0 26 1 -39 5 32 -27 -16 36 -9 -20 33 17
2246A7m6J8M5m2j8K2joMj9K0L7o2j7O5j1n0L7L0n3NO6m2l1L0K2pnjk2M7rm6K5
2280BL7n8QN4l4l2M2Lm5J3K5kk6JJ2Rml6J9J9j8k3L8mm4L2L0k9j7M0Ll7JK8pj
2316aj0J6K8j7k5K2J4l9J2L1j7k8J3L4l7j4K4J6k0mLJ2ql3J5J8j6j8L7Jm1RM3
2349B0k8j6OL3j9nMOJ1k2KK0ok7L0K1l0qK7jk1NK3ql3K0K8j3k5rK2Ol2RK6k0k7
2386c1L5J0l5%K8nl0J7K3j6orK6jk7PL0jj8J4J4j7k2L3Pk9oL3pj8OJ5%k1j1J9
2422Gpj4KL0k4j3K2orpK6j8j4%K3Jj1QJNj5jJ2Mj8kL0pl3K9J0k3j2L4J7k5kJ6
2460A6pqRLjk3LK5j3k2J3J0lj6J5Qk9%K9j0j2JRKj2j0NJ8j9j1K8J3k4oK5nk4J7
2498fJ8j8j3K3Rj5k5L6LooOJ0k1pK6mk8J8J0qlJ2Joj3J0Ooj5J4JJk4K2K1l8NK4
$$ plain form
2246 17 -29 -11 34 -8 -26 -4 -5 -11 -7 -26 -6 31 -31 -48 17 6 -44 -7 23 -30 -25 41 -1 -32 -2 20 13 8 7 -15 32 23 -23 2
2280 2 39 -19 -11 43 9 -23 19 22 -23 -10 15 13 -13 -12 0 9 5 -31 -12 7 -11 -34 4 0 -44 -12 18 -11 -28 12 15 -22 -21 7 0 -1
2316 -1 -11 5 33 16 -9 13 27 -12 0 31 14 -14 -1 33 -4 -18 6 22 2 -2 1 13 5 -28 -13 5 -11 -29 8 9 -32 -23 20
2349 20 -8 -24 -18 15 -4 -9 -5 1 12 -10 -8 12 6 -21 9 30 0 -8 19 18 -3 2 25 17 -16 4 32 19 -6 -15 7 13 -19 -10 16 -4 -31
2386 -31 4 14 -21 -21 7 2 -28 -11 12 -4 -10 -19 7 6 -21 -14 16 15 -3 11 25 8 -14 19 26 -3 -9 24 17 -1 5 20 20 -1 -12 7
2422 7 0 -14 -12 18 -6 -19 3 -3 -12 -19 7 -11 -25 -25 -2 -1 -12 -4 -3 2 -13 -14 -2 2 -16 -18 12 5 -28 1 11 -12 -24 10 27 2 0 16
2460 16 9 1 10 13 12 -11 -8 17 4 -18 -5 5 2 -14 1 9 -20 -20 9 -1 -13 -12 -3 -1 -13 -23 -18 0 -19 -30 -2 11 -13 -19 6 1 -23 -6
2498 -6 12 -6 -19 4 13 -2 -27 9 12 6 0 6 16 -5 -12 14 10 -18 0 10 2 -1 11 12 6 -7 3 9 3 -12 2 3 4 -20 2 23 -15 -10 14
2537A4mk4J0J9j9k0K0J1j5j0J3L%j7J7K3j9rJ0jj5NK2j6j7J5J0LqOmLk5K1J2p
2573Gk2L1jk9j2M2Jl1PK3k2j8J3J8pj4kK5Jk6OK3j8k1L4%k5J9J2k1j4L1p%j2p
2609a6J8%Oj0K0qk5J2K8k2k5L6kl2K0K3mrkj1J4oj2J6Lj8jL2k0j6K9pk6mL3k3
2645ij0JjK1Lj2nJ9j2l0M8j3k2J4K7l4j5M6nl0K6LJk8J0NO%k2L2Nk5PK1j9j8J5
2682@J8k6mL1kj3qjjK3k2mK4j0l3J8K0l4JM4l1j2K4J5k3kJ4j0OLj5NK8l4LK6j8
2719@j4K2Nm3L0K8l5J0J6mj7Pj3J5K0k6j9L5jm8M0J5l3j7L8Nm9L8Pj0rLKJRj6
2755hPKk6K3RKk5L6Ml9J6J4j0j8K2LmJ1qqJ8j9%KK2m3J9K2l3lL4lm0J1K3j3j5
2792a5QJ0rRj6KJ9k5%J2lj9J7K2l6NK7j3j1J8j7K1kLj1PJ0k0K8j3k1J9K7k1k2
$$ plain form
2537 14 10 -14 -4 15 -4 -24 -4 7 -8 -18 -5 -2 -2 -19 -2 21 2 -7 3 2 -13 -8 14 -2 -19 -4 6 9 1 7 3 6 -19 2 14 7
2573 7 -15 16 15 -14 -26 16 17 -14 -7 16 -6 -24 -11 7 0 -14 -16 9 10 -16 -10 13 -5 -26 8 8 -17 2 14 -7 -21 10 3 3 -9 -16
2609 -16 2 2 8 -2 18 10 -15 -3 25 3 -22 14 12 -20 0 23 19 10 8 -3 11 5 -7 9 12 -6 -7 25 5 -11 18 11 -15 -19 14 -9
2645 -9 -19 -18 -19 2 5 -7 -12 7 -5 -35 13 0 -22 -8 19 -15 -30 16 11 -19 7 10 11 -17 -7 -2 4 4 -18 14 19 -6 1 22 3 -15 0
2682 0 18 -8 -12 19 17 4 -4 -5 -6 17 -5 -9 15 5 -28 -10 10 -24 -23 21 -10 -22 2 17 -6 -8 6 -4 2 5 -10 -5 23 -11 -8 18 0
2719 0 -14 8 13 -30 0 28 -7 3 19 15 -2 5 -8 7 27 1 -18 17 16 -32 8 23 -10 -27 11 16 -33 5 12 2 -7 -4 -2 -1 8 -8
2755 -8 -1 1 -25 -2 7 9 -16 20 24 -15 1 15 5 -13 9 12 8 19 11 3 21 2 2 4 26 -17 2 24 -9 -12 22 19 -21 -10 13 0 -15
2792 -15 -7 3 -6 3 -13 -11 8 -17 -17 -5 -8 -27 -10 12 -24 -19 8 -5 -16 2 -15 6 4 7 -4 3 13 -7 21 8 -13 6 33 12 -10
2827a0L6oj8j4K4plNk0J0Pj4LOnMJ8j6j8J4K1l5JK3j1pK4rj5K1j8JRppL0j1l4
2865b8J3L9mm0J9K4k7QRj6lQqQJ4j7NPk2j0L5mk8J2J9j6k3K9olJ0nj0J1Ok5J6
2902cLj6K1Rl3lL5Kl7J2K1j6j2K4j1oJPpOnkMjj4K4Lk7J2K5j4j1OjLLjoPjmRQ
2945A4j6LJ7j9j2K5jk6KJ3oMNj4LPmMOk6J8%ppJ9Rj1j2J6qk2PJ5mNoPjNLqKqN
2989dK3j8j1J3J8k9MJ4jLrJ0lkLk0RJ0k0K7lk6J7Pj9JPpj5K1J2mqPj5N%lJ0ln
3030dj1K9%l5J8J8j9pK6j5oOO%Kj1Q%nrK2j0jkK3l3JJ9oj3lK8j1r%RmKj9K2Rp
3072Hk4J7MqNJ1jk4J6%j2QOKolP%Jj2J2jj0MRjrlKLkj0J9Lk1LJ3j0MKKLnJ4lj0
3118CnK0ok3J6Qj3PpMj5J2nJ1j2j3J1K4j5j0PJ1j3qJ0kj4J2kQj7J6Pjk0KK9j6
$$ plain form
2827 -10 26 20 2 -12 12 5 2 7 -13 -3 4 -10 -7 -1 -6 -2 16 0 -18 -4 17 -18 -17 6 -5 -12 12 3 -12 9 -9 -8 1 -6 -13 17 6 -28
2865 -28 -15 24 20 -20 -1 23 -4 4 13 -3 -6 2 -6 2 16 -1 4 11 -11 -21 14 10 -18 -6 13 -3 -26 3 -3 -6 4 -1 -11 0 6 -19 -3
2902 -3 0 -16 5 14 -19 -22 13 15 -22 -10 11 -5 -17 7 -4 -10 -9 -2 -9 -3 -8 -10 -6 -7 -21 3 6 -21 -9 16 2 -9 -3 -4 -1 2 1 -5 2 1 -3 6 14
2945 14 -2 1 18 -1 -13 12 11 -15 -13 0 -6 -2 3 -11 -8 -1 -5 -1 5 -21 -3 -3 -10 -17 2 11 0 -12 4 -4 -26 -19 -4 -8 -3 -9 -2 -3 2 5 -3 -1 -9 -4
2989 -4 19 1 -10 3 21 -8 -4 10 9 12 3 13 10 8 11 -9 0 10 -10 17 14 -12 5 12 -7 -6 1 -6 -21 0 12 8 0 7 -8 -3 -3 -6 4 1 -4
3030 -4 -15 14 14 -21 -3 15 -4 -11 15 0 -6 0 6 6 8 -3 5 5 0 -9 13 3 2 0 23 -10 -9 10 4 -9 -12 16 5 -4 -4 5 1 3 -16 6 15 8
3072 8 -16 1 5 -3 2 13 12 -12 4 4 -8 0 6 8 2 -1 6 6 7 -5 7 6 -4 0 9 8 -1 -4 -2 1 -1 -11 8 11 -10 -7 6 -4 0 2 4 7 2 16 13 3
3118 3 -2 18 12 -11 5 13 0 7 0 4 -11 1 -4 7 -5 -18 -7 17 2 -8 -1 10 -3 -11 -1 -3 -17 -5 -7 1 -16 0 7 6 -14 -12 17 1
3156AnlJ8k3PMOp%PpkoJ8rOrJ0Kj6J4Pj3MpQj5J2%LLj9OQnj1J6Lj6kJ3qMj5K5
3201Gj1qRjlJQpLKJ1Nrj2KK0j7J1Pqj4J3qNLrPlpj0J2jlRRj6JKMj7POp%J0omJ3
3249FJLj9PkJ2j4mKN%JJ7j4MmRmj3NLpJ1qJ9rj5J2J3j8lJ6j0%jPJj0MJ2j0LrK
3293AL%oJ1j1oQRqj5NPk%MllmJ5oJ6k4RqnNJ2j2j0J9LllRpPOj3jJ0nKk1NpJ4N
3340Bj0J0RmrJJ4k5K3rnLokMJ5l1K6j7jmK4qk3L1jj2KLoJ2j1J2K%j2LMNj8J3P
3382A1j6J0OPj7PRj7omPJ0NKj2nLMMj3OJ2Lj8QKOj9jJ3j0KlOj0jOLj0LJ1Mj3j
3426fJ0nNnJ2j1rLlQj2J0J2kj1KRJkKNpkRj2j2J4M%KLolj%KOj5J9jmj2J0Qk8J5
3472BkJ0j0jOk1OJ3j0J0Nj9J6nrJ2JpmKRj0Qj0QnJ9pj0%POlmkJ0j1MKj0JkJ2%
$$ plain form
3156 1 -4 -7 11 -12 -5 -1 5 -2 -2 5 -2 -4 -10 8 -1 5 -4 6 8 -8 6 13 0 4 -3 5 -10 2 2 5 8 -11 -5 3 -2 -13 3 6 -10 -12 1 -7 -3 -18 7
3201 7 -4 -12 -3 -4 -7 -6 2 -5 -2 0 11 16 7 -5 -3 17 0 11 18 10 -4 9 1 6 9 0 7 4 -3 -13 -1 -2 -5 4 13 -3 -2 0 4 -13 -6 0 -7 -7 3 -3 -7 6
3249 6 7 10 -9 -2 -4 8 -6 -10 -8 -3 -3 -2 15 1 5 1 10 6 -7 -2 1 -6 5 -3 16 7 -8 4 17 -1 -4 12 2 2 1 8 9 -1 3 15 5 8 -1 1
3293 1 4 4 -2 9 -2 -8 0 9 1 -14 -9 -2 -4 -4 0 -3 -6 -10 5 -1 15 -9 0 -8 -13 -8 4 -8 -18 1 4 1 -2 7 0 7 13 0 -1 9 4 6 -15 -10 -17 -3 2
3340 2 -8 2 11 7 -2 -1 13 -12 11 2 -3 0 -6 -8 -4 11 -20 6 -11 -12 -16 8 0 -23 8 7 -5 -3 0 -6 6 -5 7 9 9 -3 0 4 9 -9 4 11
3382 11 -5 5 11 18 1 8 17 0 -6 -10 -3 7 12 14 2 -3 0 4 8 -5 1 13 16 -2 6 8 14 -5 -6 7 -3 -1 -4 2 -8 -9 -3 0 -10 -7 4 8 -5 -6
3426 -6 4 -1 4 -1 11 0 -9 -6 -9 -1 -13 -3 9 7 -4 -2 7 8 6 8 13 6 4 13 1 -11 3 7 7 9 12 6 3 2 2 4 10 -5 14 13 9 -3 7 15 -13 2
3472 2 0 10 0 -1 5 -16 -10 3 -7 3 8 -11 5 0 -9 3 4 -3 -7 -5 4 -6 2 -8 0 -5 14 7 -3 -3 4 10 7 3 1 11 0 4 6 -4 -3 -5 7 7
3516GrjJ2kjlkRmKJj6MLLmoK1j2j3J5Lj4%QoOpKMqJMJ0mj4OJ1Mj5J1J0k3K2Or
3562A2Jj0MMkoJ7j1KlOjk8K4mJNJ1j2mJKj0Mj0J3Pj3JjjJJJ3k1NNKojLrJ2jj1
3607hJ3j1mJ5pJj0J2Koj0K7j4JJ2%Mj5Oj3K1j8J3j0Mo%L%LJJ2j2ok%lMmJ4j8O
3649ckRk0J1LjPKmj1ML%K%MNmj1J6nj1NJ1rmJ2Olj4J1onK2qj0NJ0nOj5KJ0prl
3695dONk0K6j5JRj4%nnJ5nM%%kr%J6j3Oj2K4j7%J5jrLmQj1J0jjkJ2nLn%OJrLL
3742GkljRj5J7jlpKOKopNRj9lJ8qrQMj1J0Qj7MkNjqLoJ5noJ5rLMpk1K8jLjmnn
3792hOJ1j0J3j5O%J0j1pJ2qnJ2kj4kJ7klmlNOpJJ2j5NkKpJ0rOKjqLqJ2PnrJ7j
3838Ij5mKPjRj5J8pPj1kPlLlLoJ1MkmLlk%lNjOrMrqN%NrJ6j1oMKqJ3qJ0kkrQN
$$ plain form
3516 7 -2 -3 9 7 6 3 1 10 6 8 9 -7 -3 0 3 -1 -7 14 2 -11 4 7 -7 -7 1 -5 1 -6 -4 0 -8 -7 -3 7 3 -11 -5 6 10 -5 6 16 -7 15 21 12
3562 12 13 3 7 11 9 3 20 9 11 8 14 13 -15 9 5 6 11 22 10 6 7 9 -1 3 -7 6 13 0 1 0 -1 0 1 14 -7 -2 3 5 -1 -2 1 -8 4 3 -8
3607 -8 5 -6 -10 5 -2 -1 -11 1 3 -3 -13 14 0 1 13 13 17 2 8 -5 16 -2 11 1 5 -1 -1 2 2 5 6 18 6 0 -2 -2 -5 -1 -5 9 -9 -3
3649 -3 -5 4 -16 -5 -2 -3 4 6 2 -9 -5 -2 -2 0 0 4 9 5 -6 10 5 -6 -1 10 1 -3 9 15 12 -2 9 3 -2 20 12 2 7 17 12 18 3 5 15 8 -1 -4
3695 -4 2 7 -13 13 -2 -1 8 -6 -6 -11 -16 -1 -6 -2 -2 -2 -4 -13 -13 3 -10 -4 -16 8 -9 -9 6 5 -4 -1 -5 3 -8 2 1 0 -2 10 5 8 3 3 9 10 1 4 7
3742 7 5 2 1 10 -5 12 11 8 1 3 9 11 5 -2 3 12 -7 -10 8 0 -9 -1 3 -8 2 10 -7 -3 -5 0 -1 -9 -6 -12 3 -2 -8 7 -2 1 5 -2 -23 5 4 7 6 2 -3 -8
3792 -8 -2 9 -1 12 -3 3 3 13 2 -5 7 -1 -6 6 4 -10 -12 5 3 0 -4 -7 -2 4 -3 -2 10 -5 0 -2 0 -7 3 -6 0 2 1 -7 -4 -12 0 7 2 -7 10 9
3838 9 -6 -10 -8 -1 -2 7 -8 10 3 10 -1 -3 4 1 4 1 4 -2 9 13 11 7 10 7 5 5 2 7 6 12 3 7 -2 -10 -5 -5 0 -9 7 -4 -10 -6 -4 -12 1 -7 3 1 -1 -10 -2 3
3890CP%k5MJ4Lk1K1qMomJ6JpMMpRj3LRj8J1Oj2RpkPqNjplJ6pqKJ0lj%Np%NqPm
3940bLMj2J2PKj4jOj3QJ1j4pRrJ1llJ9j1nkJ4kmlRomPLoj5RQm%ooRqJ5roMO%%
3989ARnmm%%MlJkMrJ1kolOJ1j2KjlMjNpj0J1Pj0oK5j5Pj0J2nNj7K2j2Pj2M%JM
4036DrNlJ0pKmJ5j6L%lOrmJ0qQKj1Qj0PPrJQk%OrRrj1J9Jj4%J5kJ0mLjlpJ1j3
4084BOoRpkJjlRj0KkOJp%LMrqJ3%moLoMMlmJ0jkkJ6pLj5K4k2jkJ2KpLmRpRk0K0
4136GnNpJ5j0krJ1KqjjJ2j3lNqRj0J2QrPrJ3nj7kLJ8j4PoJkRj4ONj4J6j%mqPK
4183bJNqQJ1k2MOJPj2LmOlnoK1Jj0mMNmKj0NJ2j2%Pj8OLlqJ5p%LlkmORj5K1k9
4231a9J4k%kOJ1j0%oJ3mmjNj0RKMKj6J9mJjm%PnmrJ1Mj3kJK2j3oPKkMj1J2mkj9
$$ plain form
3890 3 10 10 -15 -11 3 6 -15 6 -2 2 -4 -8 8 9 2 6 10 3 12 -1 2 11 -7 4 10 -2 7 0 -2 5 -3 2 1 -6 -9 7 0 -8 -6 4 1 0 0 5 -2 -2 3 -5 2 -2
3940 -2 1 5 -7 5 12 14 0 -1 5 -8 0 11 -3 -10 -1 -10 1 -2 -5 14 3 -2 -4 10 8 4 1 10 4 0 7 10 4 -11 -2 6 2 2 -4 -10 -1 -9 6 -3 -9 -5 1 1 1
3989 1 10 5 1 -3 -3 -3 1 -2 -1 -3 1 -8 3 1 -5 -8 -2 9 -3 -1 -2 -5 -1 -2 3 -4 -14 -3 4 -6 -12 13 -2 5 -5 7 2 7 -10 12 0 7 -5 -1 -1 0 4
4036 4 -5 0 -3 7 0 2 -2 13 -3 0 0 -3 3 -6 -10 0 -8 0 2 -9 -1 -11 -4 3 -6 -5 3 1 1 7 -2 7 -2 -13 6 7 -7 -7 8 6 16 12 15 14 11 4 15 2
4084 2 8 2 11 4 2 3 2 -1 8 -2 0 -2 4 5 -2 -2 1 5 -4 -12 1 1 -3 -9 -6 -12 -8 -4 -7 -11 -1 -2 -4 -6 10 3 6 -9 15 -7 -8 -10 2 4 -3 0 -4 5 -2 7 -13 7
4136 7 2 7 0 15 5 3 -6 5 7 -1 -2 -3 9 -4 -7 -2 -10 -1 -11 1 9 0 7 -2 11 6 -11 -13 -10 8 -6 1 -5 -4 -6 3 -11 -5 0 -14 2 1 1 -3 -11 -4 -2
4183 -2 -1 4 -4 4 15 -7 -3 3 4 11 -1 2 -2 4 1 -4 -10 11 12 2 -2 2 7 3 5 -5 0 12 0 0 7 -11 -5 -2 -5 -13 2 -5 -5 -2 -5 -7 -11 -5 4 -11 10 -19
4231 -19 -5 -7 -7 -9 -3 8 -2 -2 -8 5 1 -3 -4 1 -9 0 2 6 8 -8 11 7 8 7 3 3 10 5 1 -8 3 7 -6 -8 -7 15 2 -4 3 5 3 7 -4 8 4 2 -17
4278a7J8j4PMjoKMJj0J8nj3J1NpNpMmJ0j3NJ0mj1QjNNlj6J8kkKjknMr%J5j4%J0
4324DJmN%mlOqjQj5J4okoNjJ1qRj3J0qKKmRolO%OQj8OLlqJ2j6J0QlLnJ3pnPjj2
4375bQRrj0Nj0J2Nj5LPrJ3j2jJ0%j1NLkj5NM%lKlkJ0lJ2j0MJ2pKj0j%%QqjNQl
4422EKll%J3%qL%Nj2lpMKQ%qOpoJ5jj1NJnP%j3J0nmQnlPrMKJQlpJ4llmMKMpj0
4475a0NJL%%NkJ0j3NJ1j9J2rMpJ1o%J0j7KRj1jpNJ2pRk3QRNKj5MLk0PJ1QpJ5o
4520Fj5KJ0k%QqoMMkP%j3jPJ0mokMlMJ5j6oJ2jjmpJ4j4J6oj8pJ3J4%Lj5nJ1qJ1
4566EnqjnJ5j2PJ0rk5K1JkKKkOJj3NOjklkLJ1j2PMnloRjOnRkKj1KkQr%OLj0Mq
4617ikNQlrJ8qj3J0o%PjrJJ2qJ6%j4Mj2QRj0K0qmjjRqoNqMJ6j1QkLOrkkq%LLK
$$ plain form
4278 -17 1 -13 -6 -2 -3 -9 -7 -3 -2 -12 6 1 -12 -1 4 -3 2 -5 -1 -5 5 -8 -3 7 3 -8 0 -1 4 9 6 -10 8 6 4 6 5 3 -2 2 -7 -7 8 -6 -6 4
4324 4 5 1 6 6 2 -1 5 -3 -4 4 -11 3 -3 -5 -11 -6 -7 4 -4 5 -8 2 -6 -4 -2 -6 3 -3 -6 0 0 6 14 -4 2 5 2 -6 6 -10 0 8 5 8 3 16 9 4 11 10 -2
4375 -2 6 15 6 -4 1 -9 3 8 -7 -4 3 -6 7 -5 -6 4 4 -7 -2 1 -1 -16 -11 -7 -7 -10 -8 -11 -13 -3 -6 6 -4 0 12 5 7 -3 -4 -4 -4 4 -4 -5 0 8 5
4422 5 7 4 1 1 14 14 6 9 9 14 2 -1 -8 -4 -2 6 6 -2 4 -3 -9 6 5 -6 -1 0 -5 2 2 -11 -1 -6 -10 -2 -7 -10 -3 -12 -8 -6 -5 3 0 -7 7 4 1 -3 1 3 7 0 -10
4475 -10 -5 -4 -1 -1 -1 4 2 12 -1 4 15 -4 8 -1 3 -4 7 1 1 11 -6 -4 5 -6 -7 -14 -9 3 -4 5 -18 -10 -1 4 6 -9 -5 -2 -22 -15 -4 4 -3 12 6
4520 6 -9 -7 3 1 1 9 1 -5 -1 3 1 8 8 -5 -6 1 11 7 1 -1 3 0 4 19 3 -3 9 8 7 3 -4 10 -4 12 6 -12 -19 -6 8 8 11 -4 -9 2 -6 5
4566 5 0 -8 -9 -14 1 -11 -4 6 -3 -28 -7 -6 -8 -6 -4 -6 0 1 -12 -7 -1 -2 -4 -7 -9 -6 5 -7 0 4 -1 -4 -10 -1 -2 4 -1 8 6 8 -3 -1 -3 5 -4 -4 2 5 -5 -1 -9
4617 -9 -11 -6 2 -1 -10 8 0 -13 -3 -9 -9 -2 -3 -12 -11 1 -7 9 9 -5 -1 -13 -5 4 -6 14 6 2 1 0 9 1 -5 0 -8 -4 12 1 9 7 10 16 7 5 3 -5 -5 -2 1 3
4667Cj1mjQKkRKj5MJ6ok2J7j6J6jkoqK0j3J3rLoMMJ2j5pJ5Lj1%OMj0OOJj8QPj1
4712eOmKJ1Pj2kJ0rPj1J1j0kMJj1J9j4jJ4nj8J9Jj6Nl%KP%j7J3j0J1nRrOj4J6
4754COj2KLLj4PPlpJ1j6J2LLonRlMLjj1J1OrMkk5%K2noPnrQLLl%NKn%mKjpMMJ
4806aJMj1mJ0JQjn%lknJ4mmnNKKqkQJ0OlPlj3J2k1MmNJJMpMm%%kLj8J6KklJMp
4858gJnjJ1qOl%J4Jmj1NklKLj3J7mLk0J4J6j4jMOlj0ROKmNoj1JlNJ4oj6JQNLk4
4906a7J7JmJ2j2kk%MQj7Mm%jOjJ1kj5J5j4J6j1MJ2kjkj2K0mpmKRm%kN%Mlj1Ql
4952AJ2j4QprMlKQjlJnMoMOmnJ0%olJjlJ4j7J6mLlJlNkJ0%j3KrQOnoRlO%Nlj0
5004bQkJOj3QnPj5J2j2J9j6lPjKqJ6ommLJj9J2KPj3MOoKQpoJ3Llj4J7k4J5L%r
$$ plain form
4667 3 -8 -12 -13 -5 -3 -5 4 6 -9 -5 11 5 -17 0 -16 0 -1 -3 -9 -17 3 -10 3 -6 -3 -9 -5 -1 11 -4 -11 4 7 -4 -4 2 6 -4 2 8 9 -9 -1 6 -5
4712 -5 1 -3 -1 10 17 5 3 13 4 11 0 11 1 -1 3 4 -7 12 -2 -3 11 6 -12 7 8 -8 -3 -6 -6 -4 3 3 -14 -1 -11 0 -5 4 -5 1 -13 3
4754 3 9 -3 -1 2 5 -9 -2 5 2 -5 6 -10 2 5 8 2 -3 6 3 7 10 9 -2 9 15 6 10 8 -17 -17 5 0 -6 1 -4 -13 -5 -2 1 -2 -2 3 5 0 0 -4 -2 -3 -10 -6 -2 -1
4806 -1 0 4 -7 -11 -1 0 8 7 2 2 -1 -3 -8 6 2 -2 -7 -2 0 2 -6 -8 0 10 16 13 20 17 4 16 -5 -1 -5 0 1 2 6 -1 3 -1 -1 -1 -3 0 -18 -2 0 -2 -5 -4 0 -7
4858 -7 -6 -11 -12 -1 -9 -3 -6 -6 8 9 5 -6 -1 -3 -6 -4 -1 -14 3 -1 2 -18 -4 12 -2 -3 1 7 4 -6 3 9 11 7 12 6 -5 -4 -7 -2 12 6 -10 -9 -1 4 7 -17
4906 -17 0 1 -3 9 -3 -5 -7 -7 -3 5 -12 -8 -12 -12 -13 -7 -8 3 1 -14 1 -13 3 -8 -4 8 6 5 3 -9 11 7 0 -4 -2 7 3 3 1 6 6 10 7 -4 4 1
4952 1 13 -1 7 0 -9 -5 -8 -6 2 1 -2 -1 -6 -2 -8 -4 2 -2 -7 3 3 -3 -6 -5 -6 -9 5 -12 4 0 3 0 1 -2 3 1 11 11 -2 0 -9 -1 5 0 -6 3 0 6 6 11 8 -2
5004 -2 6 4 5 11 -2 6 1 8 -7 5 -7 12 -4 -7 0 -1 1 -7 9 3 -1 -5 -2 -1 -20 -8 -6 1 -12 -8 -2 -8 -6 2 -5 -11 2 5 2 -12 5 -19 -4 -1 -1 -10
5050a0RQj8QJkNKk%QlLonOnQoOpjlNrQnNLoJoMrLJ4oj3K2j9qJ1JoqJ4LkQj1Qm
5102fjJ6j0KOqMkjNLj1PMoJ2j1J2k%onnNLLj4MMlj1J4pjJ4k1J4mOmkj0OPj0mJ
5149a3Roj0PJ3kjmKOrQonQ%JMj0kLJ0jnNmmJ8k6J9pN%nKmKnJ0JmlqJ5qpQlLL%
5200@Jj0j2J3Pj3J3p%RqMmJ4j5RoJ3qmOjKKpLnPqPMrJ2j1OoJ4oMJj4kJ0kKJqn
5248gNKlqR%qJ0pqMnJ3moqJ5j3K0rLJjKNJ0j6MLroK4j2QMlprJ3j0M%MJJ%lPlO
5298A3j5NLj2JRj2OLmLj0J0j3K3k1QnkPlkLnpJ5lmMlR%oPj9J1NjkJ5j6lQOpJr
5345iKLOMMp%nmPPn%loJ0k2J0Rj1KRj1KoJ3qKkJKnjJ0oJlj3J9jOj1RkKMnRj5J3
5395EqOqMOrPRqPj2PJqOJJqMkoNKJ1j4oKk%MRj3jKJ0j0lmMNkrpRLnJ1KKj0QRo
$$ plain form
5050 -10 -1 7 -11 -3 -2 -4 1 3 1 1 9 6 9 3 -2 4 -1 7 1 7 0 -1 -4 1 -8 0 -5 0 3 -3 -2 -8 -4 -13 -10 4 -2 -15 7 -12 -20 -9 -8 -14 -22 -8 -5 -7 1 -10 -2 -6
5102 -6 -7 9 -1 1 7 -1 3 1 0 5 8 -3 4 8 2 14 3 15 13 13 7 2 -3 2 5 8 -6 -2 2 -1 -12 2 -5 -6 8 -13 1 -3 3 -1 -3 -13 -7 0 -10 -14 -13
5149 -13 -4 -10 -20 -13 0 -2 -3 -7 -5 1 -8 0 -6 -11 -3 -3 -2 2 -8 -10 -7 3 2 -3 2 -2 -6 12 -14 5 -2 3 3 -2 0 -4 -2 -7 3 4 0 -3 -11 4 -4 -11 -3 -6 -3 0 0
5200 0 1 -9 -21 -8 -1 -14 -1 -8 -8 1 -7 -3 -7 7 -8 1 -5 8 0 -4 2 1 3 5 -2 1 -4 3 -5 2 6 -3 9 -2 4 -2 12 6 10 11 -3 -5 5 3 5 6 -2 -7
5248 -7 -2 0 -3 -11 -2 -2 -10 0 -7 -15 -11 -16 -3 -7 -13 -21 -6 -19 1 -8 -5 -4 -5 -3 2 12 -4 0 3 -6 -12 12 0 8 12 9 2 -7 6 -4 0 0 4 5 6 6 3 10 7 13
5298 13 -2 3 6 -6 -5 4 -8 -2 1 -3 0 -10 0 -13 10 -11 -3 -8 -10 -3 -6 -8 -5 -10 -17 -2 -5 -9 -5 -8 1 1 -5 2 -17 -6 -1 -2 -4 11 -5 -8 0 6 -1 0 -9
5345 -9 -7 -4 2 6 10 3 3 -2 -6 1 8 3 3 0 -6 4 -18 -8 1 -10 -8 1 -10 -8 -14 -1 -9 -7 -9 -8 -6 -11 -12 -2 -8 -7 -10 -23 -4 -5 1 -10 -1 -3 -1 3 -2 7 -8 5
5395 5 -3 3 -5 -1 5 -4 3 12 4 11 -1 6 7 -1 5 6 7 -1 3 1 -5 0 2 13 -1 -7 -5 -7 -7 -3 6 -7 -8 -6 4 -6 -9 -13 -9 -4 -6 -15 -22 -13 -10 -15 -4 -2 0 -10 -2 7 1
5448APj4%kJ5j2n%%J0oKQLj4OJln%OkKKKoPkLnjnoOMpOj6K3j0lpK2kj8OOqPj6
5498b0QK0j8Ql%jJ8j6lJ4%KomNrj1J4%JjmOJ3mpMpLLkpkJ2jrOrPj2oJ4Jj6MK4
5545Ij7rJJ2k1J5%KJjrRPmjMKlMlmJ1MlLlj4RJnlJ0lqJ9j3JNqPklKJpMj3JJ3j
5595aNk1J6rNlJJ0jj4RnJ%JnnJ6krPomJ1OrRnRKj5J5rOj3J4pQpjmPJ4j3%J2j3
5642CmkkJ0j4J5j6JMLLlQj7PrOkQ%KqJ1lmlj1J5j0LQlKPlMnMjpLKoj0K1JlLMl
5692IloK5k1%O%qPqkjj1J3PmmlJ0j6J5mLmkJOj1jKNNmJmknJ0ppK1p%JqRkjJ1j0
5742A%Rj3mJ3Mj1%J7Nj2npJ0j4J7N%k2QOnoOn%MjRj3P%lQlj6RPj1Pj3PMj2K2j7
5788hQMJlrJ8MpmJ1j5%RNJlmNj3kJ8Kj5OQpolMJllj%QpnnOLpJ%rJ5qLLOlJlJj2
$$ plain form
5448 1 8 -6 -6 -8 7 -5 -10 -10 -10 0 -6 -4 4 7 -7 -1 0 -3 -8 -8 -2 -4 -2 0 2 -4 3 1 4 -1 -2 -7 -13 -7 -3 -10 -4 -20 3 -7 -10 -17 5 3 -15 -9 -3 -11 -4 -20
5498 -20 -12 8 -10 -2 -5 -5 -6 12 -4 -7 7 7 9 3 -1 4 -5 -16 -2 -2 -1 -2 -6 0 13 9 2 6 -1 2 5 3 -4 -6 6 5 -4 2 -7 0 -12 -18 -4 -3 -19 -15 9
5545 9 -8 -17 -16 -4 -25 -10 -10 -8 -7 -8 -17 -8 -1 -5 -6 -2 0 -3 1 -2 -6 5 9 6 9 6 -8 1 2 -3 -6 4 1 -7 12 -1 0 5 -3 4 2 -1 1 2 -5 -1 -14 -13 0 -1
5595 -1 4 -17 -1 -10 -5 -8 -7 3 2 -12 -3 -8 -7 -7 -6 -11 -16 0 -2 -11 -4 -10 -14 -3 3 -6 3 -2 7 9 -6 9 0 6 -7 7 0 8 1 0 -4 3 17 4 4 16 3
5642 3 -1 -3 -5 5 -9 6 -10 -9 -5 -2 1 -2 6 -11 -4 -13 -7 -9 -1 -1 1 -7 4 1 -3 -6 -17 -2 -12 -9 -1 -4 -2 5 2 6 1 5 4 -3 0 2 -4 -14 7 8 5 8 12 9
5692 9 6 0 25 4 4 10 10 2 9 1 -1 -2 -13 0 7 3 -1 -4 6 -10 5 1 4 0 -2 -1 5 -6 -7 -5 0 5 1 2 -2 -4 -9 1 -6 -13 8 1 1 2 -6 3 1 0 11 1
5742 1 1 10 -3 -7 6 10 -1 -1 16 21 9 4 -3 7 -7 10 15 15 -7 1 7 2 -4 2 -3 -3 1 0 9 -4 3 3 0 8 5 -11 -2 5 -6 1 -12 -5 -1 -13 9 -8
5788 -8 0 4 5 2 -7 11 15 8 4 15 0 0 9 14 15 12 8 13 0 -2 16 18 3 9 17 10 4 1 5 6 3 0 -1 -1 7 0 -5 -10 -4 -1 -8 -7 -7 -16 -1 -9 -6 -3 3 0 1 -2 -1 -13
5842a3LPj2J0lP%Mj1jlJ5lNLj5ORkLj0J1j1R%oPj1J6j1LkjrLJ0Moj2J5pko%Op
5888hJ4nrJ1JkKj5nJ7OqljkJ%PkkJ9j6%LPqjKMlp%PmMKRlkq%Rj0lnK1k3J1Nj8
5938a1LJKkjPnLjnMJ3pLJ0pj2JqLLLoNPnMNKj6J5%KljMnjPj1M%Rm%n%JnRLj3P
5991FqoJ0moJ3pLrmQ%%jJ0rpJ2KlmlLMjjpkK1j7J0%Mkn%J1jj0L%%Pojk%OKkkk
6043CKpJKJ0Mj0qJ0pkJ2j8PMm%Onj2LJ2knKJK%mnJ2kpjJ4j8J2KMjRj1Oj2M%Kp
6091bJ1j0J1Oj5JKjJ0nJMlLj4knJ4njkmjMmMJ0j8LJ2j1J1lOqjMJpkrRNoJ3qjP
6139DJ0j7KJ3j6J1mlJ1ljoLnLJKjLklJRo%nM%Jj3R%ooMLqJ2llRj3Rj%KJnJ3j2
6189bmRj4J1j3J2OLmJkoQmPQj0J1j8J0j1nJ8j0JJ7j0kqnOMnJ0rMLoo%MoJNrKl
$$ plain form
5842 -13 -10 -3 -15 -5 -8 -1 -1 3 -8 -9 -12 3 0 5 8 -7 -1 8 6 9 -1 10 -1 8 8 2 9 -2 14 3 6 4 3 -6 -3 7 11 5 -7 8 1 -1 -7 -7 -1 -8
5888 -8 6 1 -8 3 4 2 4 -11 -16 1 7 -1 -4 -5 -7 -6 -6 1 -1 -3 16 0 0 3 10 2 1 3 7 4 -3 -3 4 0 4 6 15 12 10 2 2 11 1 -2 -7 14 -9 2 7 -11
5938 -11 -8 -7 -5 -7 -8 -1 -6 -3 -4 -9 -5 8 1 4 14 7 -5 -4 -12 -9 -6 -3 -9 -4 3 -2 2 7 9 -7 8 8 10 7 6 10 5 4 11 0 4 4 13 9 9 4 4 5 0 9 12 -1 6
5991 6 -2 -8 2 -2 -8 5 -2 1 -8 -12 -4 -4 -4 -5 5 -4 -11 1 3 0 -4 -7 -4 0 -1 -2 -9 -11 10 -7 3 3 7 5 0 0 11 10 0 3 3 3 10 4 3 1 1 7 9 7 5 3
6043 3 5 -2 -1 1 11 15 5 -3 7 0 -2 10 -8 -1 3 -1 -1 5 0 -12 -9 3 1 -4 -2 -1 1 1 -3 -8 4 2 -5 -6 8 -10 2 4 8 7 16 5 11 -1 3 3 5 -2
6091 -2 9 -1 10 16 1 2 4 3 13 8 9 13 10 13 -1 -3 -8 6 1 0 -2 -6 -7 -3 -7 -3 7 -11 -8 4 -7 4 1 7 -1 -2 2 3 -4 -6 -15 -6 -1 -7 6 -2 -3 4
6139 4 14 -3 -1 12 -4 7 3 0 11 8 7 1 4 -1 2 3 5 4 7 5 2 3 12 6 6 1 5 5 6 -7 2 2 -4 -10 -6 -3 -11 1 -2 -5 4 -9 0 -1 -1 1 2 -3 10 -2
6189 -2 -6 3 -11 0 -13 -1 5 8 4 5 3 -3 5 1 8 16 6 17 -1 9 -2 -7 11 1 2 19 9 7 -1 -6 0 4 -1 9 0 4 7 1 -5 -5 -1 -7 -6 -1 -10 -8 -11
6236a1kKNqJ8rjknRqJ1JjQn%jj2PJ1j7Q%J1Jj3PljPJPro%QPnj6J6Kj3R%ppQKj2
6286hQqnJ2kqPKJnQj8J8j5J2PpkJKklJjMNPpNkmoRlpQoJ3j0mKNMj4J6rlLMllk
6338cLkQj7QNKj3Oj1KQJqN%Oj1Mj7K1qPqkJ9j3R%j0LOnQJ1llrROj0r%J0rJOjo
6387dOMlRj0Pj0lLJ3pj6J6j3J3Kj8NjMlMoKljJ6jj0oJMrQj1OJ1NjmJ0j9RJ1j7
6432gJ6JmJj3OMqJ1pQlJ5j8J7j8lRJPpOj2Lj0%jK%nPj9K2joJMj%nnJ0Nj3Qj1R
6479dNpJ2j8QlKJ1rLNj0NmKjQj6MJLLjMLNqpQpMnoPJrLKrQnKkOKkJKj0J4Nk3J1
6532fn%pNNlPoLjnJ9rQjmKLonJLOr%RrJ0ljQj5PMmQj8QqlJ3jKjqKlkpJ8j4QNl
6586cjKmml%lPOkoOOlJ0j1J0mrKJ1j0KJpJ1j8J7lpRmnN%noJ6j4PrjJ3Pj6mjlR
$$ plain form
6236 -11 -13 -11 -6 -14 4 -5 -6 -8 -13 -4 -12 -1 0 -1 7 2 2 1 -11 -4 7 -10 -2 -2 9 10 -3 4 1 0 7 8 15 6 0 0 8 15 10 -6 10 12 -1 8 8 1 -6 2 4 -8
6286 -8 0 -8 -13 -1 -3 -11 -4 -2 -1 -6 2 -16 2 -13 -1 6 -1 -3 -2 0 -2 -5 -4 -5 -1 4 11 4 9 7 3 -3 6 3 -4 4 -2 11 1 -3 -1 4 8 -6 10 1 -2 1 5 2 -1 -3
6338 -3 0 -2 6 -11 -3 2 4 -9 -3 -14 -12 -4 -3 -11 -6 -6 0 -11 -7 -24 -3 -11 -4 -12 -14 5 -8 1 1 -9 -6 0 -5 3 14 11 8 -1 8 14 4 -5 -5 5 -4 -3 3 2 -4
6387 -4 2 6 3 12 2 9 -1 -4 -1 12 5 -11 5 -8 5 7 -11 -6 -7 -3 -6 -2 -8 -6 -9 -10 6 5 -5 -11 -10 -6 -15 -7 -18 -12 -1 4 3 -1 9 -10 -1 10 -7
6432 -7 9 10 6 7 -6 0 4 -4 7 0 8 5 20 2 19 1 -2 7 8 15 8 14 2 5 -5 -5 -6 -4 -4 -9 -2 -21 1 0 -6 -5 -1 -2 -2 -7 -12 -2 3 -10 -2 -13 -4
6479 -4 1 -6 6 -12 -4 -7 -5 6 -3 0 5 -5 0 -4 -2 -3 5 -11 -7 -6 -3 0 -1 3 6 11 3 -4 4 -3 1 -4 -10 -3 -2 -11 -8 -6 -15 -7 -12 -10 -12 -6 -4 -6 -5 -3 -13 1 6 -17 -6
6532 -6 -11 -11 -18 -13 -8 -11 -4 -10 -7 -8 -13 6 -3 5 4 0 2 5 -1 -6 -5 -2 4 -5 -5 4 -5 5 2 1 9 -6 1 5 1 9 -9 -1 -9 -12 1 0 2 1 -7 -5 -8 -10 -17 1 -13 -5 0 -3
6586 -3 -4 -2 -6 -10 -13 -13 -16 -9 -3 -5 -11 -5 1 -2 8 -3 7 3 -6 -4 7 -3 -1 0 -7 4 -14 3 0 -7 2 -2 -7 -2 -2 -7 -13 3 -11 -4 -13 -14 -1 6 -10 -14 -15 -18 -9
6635iMk1J2KK%KqQ%QLjoJrJ1j0PLJj1jRlNJ0lj2JRloJ6pKj9J4oJ2j0j1jK9rj2
6681gqK3j4kQj1LoJ0j0J1Lj6jK1j5OqjJ0j0LljKJ0Jlj0LjJ1Op%LpO%Rj1j0J9%
6725FrjOkNknLKKrRlRrJmlJ5j2PnqKKjNojnJ6oMj3KRrRpPLk0J0NooK3j2LJ1j4
6776bJ0jJ0j5Oj7J0%KKjmJ0noJLOrpJ4rkNnnJ0orJ5pJJLj1%jJ1jNqlJJ0j2J5j8
6823a3NlJ8lqkOJj2NJ0mjRKoLMj7J7K%k1J1J3onMqJ4j5PmjlnKoJ0Jkj0mJkKRo
6871a1NmrJ3KoPnMjMj5K0%Rk1PQj1RoMJNmJ4j2jPrmMklmJ2krJ0k2J3%LjLkLmp
6920h%%Lj0jJ4rMQqJ0j4QoJ4mJlj0JPlQLoPOnnkOmmJLJj3J7j2MKrOJ0j8J1Q%k
6969Gj2PkNljj1%j%JnKjkRRm%KjpoJJ3oJJ1k9K6jmjQj1J8qj4kJ5jPooJMkMJ%o
$$ plain form
6635 -9 -5 -26 -14 -12 -10 -10 -8 -16 -8 -8 0 3 2 -4 -3 -12 -1 -11 -4 -1 0 -11 -12 -3 -6 -1 9 6 -6 -5 4 1 -5 11 4 6 -13 1 -5 7 -3 -14 -15 14 5 -7
6681 -7 -15 8 -6 -8 0 -11 -8 -14 -4 -14 -3 0 -16 -17 4 -11 -5 -13 -14 -4 -14 -11 -14 -15 -13 -3 -2 -5 -15 -12 -13 -2 4 -3 -3 0 -7 -1 -1 8 -3 -13 6 6
6725 6 -3 -4 2 0 5 3 -2 1 3 5 -4 5 2 11 2 3 -1 -4 11 -1 6 1 -7 -5 -3 -4 1 -5 -6 -11 5 -1 3 -10 -8 1 -8 1 -6 1 4 -16 -6 -1 -7 -13 10 -2 1 12 -2
6776 -2 8 7 17 2 8 -9 1 1 3 5 4 0 10 5 -1 0 3 9 0 -7 7 -2 -4 1 -4 -9 1 -5 -14 1 -6 -5 -4 -1 -12 -12 -13 -2 -3 2 -6 -9 -8 2 -10 5 -13
6823 -13 -8 -11 7 4 -4 -6 0 1 -11 -6 4 0 -1 8 10 4 7 11 -6 11 13 13 -8 3 16 10 5 9 1 15 0 7 3 2 -1 -6 -4 -10 0 1 -1 -11 -15 -14 -16 -14 -5 -11
6871 -11 -6 -10 -19 -6 -4 -10 -3 -8 -4 -5 -1 -16 4 4 13 -8 -1 7 -4 5 -1 3 4 9 5 19 7 6 13 4 0 4 2 -1 -5 7 5 -4 6 -16 -3 -3 0 -1 2 0 3 -1 -8
6920 -8 -8 -8 -5 -15 -16 -2 -11 -7 1 -7 3 -11 -3 -9 5 1 2 -1 -11 -10 -3 -6 2 5 -1 6 12 7 2 0 6 2 -2 -1 2 3 -10 7 -5 -1 1 -8 -2 8 -10 1 9 9 7
6969 7 -5 2 0 5 2 1 -10 -10 -11 -11 -10 -15 -13 -14 -16 -7 2 -2 -2 0 -1 -8 -14 -13 0 -6 -5 6 -23 3 2 -2 -3 5 -6 12 4 -10 -12 3 2 9 3 -3 -2 2 0 4 5 5 -1
7020aOkqJ0j0J1%pPJLj2pn%RpmJ6nlNLNj4JKQ%jj6R%lJ0jKoKN%jLljKkMjJoJ4
7072A3%qNjj1JLkKjk%nOnj2J7qRmp%j2RLjJ2j0jMJ7j3j4J6lj2PJ1j0QooOkOLm
7119brJ0MjLLLj2J4Kj2LqQj0J5j2%PqJqK2j2j2Mn%J0mLj4K1qj2JJJ4j6NJqJ6p
7163iJM%rlJ0%NLj0J1k3QPPj9K8j0NRk5J2PrRjpNk1J3mQNpQmJkKmj1J3Qj5J4k8
7209a8QpJ2Qk4J5mQj2Pn%QLJm%%RMOk8RNjOlOqKpNNj2RJ8k7J2qoJ4j0NPj4JOM
7257EKPj5j3OJ4mpllOjj7J3%Rj4nK0lkqj0K7qrKJ2l%pPjkQj1MlLJ1j1KQOj3lQ
7304D%lj3J0OrJ6j4KkPjMojJ1qkpLMonN%jNpLlJNqJ1JoRmjJjoK%OJ3j2mjNmJ1
7356A0Mmj0mJ1Rj6OrMlJ0KlrLJj6NLRoooL%JJ0pLj0J2pJrNLJ1lNqmQj0R%kPKj1
$$ plain form
7020 -1 5 3 -5 5 -5 6 6 -1 6 7 10 -2 -9 -14 -14 -5 -12 -16 0 -5 -8 -3 0 5 -9 -8 -6 2 2 1 -15 -6 -6 -9 1 0 2 -4 -2 3 3 2 5 2 1 3 1 5 4 5 -1 13
7072 13 13 5 10 9 -2 -1 2 0 2 1 -1 -1 -6 0 -5 -17 0 -8 1 -3 -10 -10 -22 -13 -10 -11 1 -9 -10 -6 11 -2 -16 0 -3 -15 -8 3 -7 1 -5 -11 -5 -7 -1 2 -2
7119 -2 -11 -1 3 2 5 8 11 -1 13 15 3 6 -2 6 -4 11 -1 -1 6 -2 -1 -9 13 1 -11 -7 -12 -12 -2 -6 -3 -17 4 -4 -16 -15 -14 0 -16 -11 -10 -18 -2 -9
7163 -9 -8 -4 -4 -13 -16 -6 -6 -1 2 -8 3 -20 -12 -5 2 -17 11 1 6 15 -10 2 9 0 9 8 1 6 -15 -2 -6 2 7 0 8 4 5 3 5 1 -10 3 11 -4 10 -18
7209 -18 -10 -17 -5 3 -21 -6 -10 -2 -14 -7 -12 -12 -4 -1 0 -4 -4 -4 5 9 15 -13 -4 1 0 6 3 9 1 3 -4 1 6 -6 3 21 -6 6 -2 -8 6 -4 1 8 -6 -5 1 5
7257 5 7 14 -1 -14 -8 6 2 -5 -8 -11 -5 -6 -23 -10 -10 -1 -15 -20 0 -3 -5 -13 -23 4 -4 -13 -11 1 -2 -2 -9 -2 -3 -5 3 -8 -4 -7 -4 7 -4 -2 6 12 -1 -4 4
7304 4 4 1 -12 -2 4 -5 11 -3 -1 -3 4 3 7 1 0 11 3 1 -6 -3 1 -5 -10 -5 -5 -6 -1 -8 -5 -8 -7 -2 -10 1 2 -4 5 1 0 1 0 -6 -4 -4 2 15 3 -1 -2 3 -1 10
7356 10 14 10 0 -4 7 16 0 6 -3 1 -2 8 10 7 -2 1 2 -14 -9 -6 3 -3 -9 -15 -12 -12 -11 -1 -8 -5 -15 -3 -10 -9 -18 -13 -10 1 -2 3 -5 -9 -1 -11 -2 -2 -4 3 5 -6
7406fKKjQOj4NLoJ1jj9J8qLjjOJj%oJ3j8%J3j5kQJRj1j6QLpJ0%njoQNkJrJ1Jo
7455frJ4Jj0OKjKJ7j7lKMJolRjJplJ0LpNprJ6nNnjNqLNpKQlJqrkKoJ2oJ0pJNL
7508aopMKoJ4j0MpJOKJ3j1JJ3rqOJ2qQj8K1j3OpoJ1jkoLJ1k2J1KJk%pJ2j5JOo
7554gNj2nJ5k0J0pORoLL%%jPpJLrJ1oQpmJ8j2J2j1kOMNj8J7j%j2J3n%j1J6j0%
7599apJ3kj1LnNpmQkOmJj4J8nKk1K1Llj1J3l%lMQrlLoJ3pOlj2PLKL%RkjojQL%
7650IqjJqkQ%MpJ0j1JkJ2j5J1%j9KO%oNlKkJRkpNj5J1POmKm%qJ4j5%RmLLj%pM
7701fMRjJnJ0j1MolJ4j2J3j0%Mj2JLJjMj3J8j4NnqKLRj2rOJ6nPj1P%LpKmJ4or
7748a0NmJ8j9J0nKMKrJ0%lKKlLKMj0nkNLpnoJ0JMoQnJj0J4j4kOmQlQj5nJ3Kj0
$$ plain form
7406 -6 -4 -2 -3 5 11 -3 2 5 -1 10 9 -10 8 0 3 2 1 7 8 7 7 1 14 -4 -4 9 -6 -8 0 1 10 -1 -17 -9 -6 -13 -3 -3 -8 -9 -15 -7 -2 -4 -3 -12 -1 0 -6
7455 -6 -15 -1 0 -10 -4 -2 -3 -1 16 -1 -4 -2 2 3 -3 -6 3 2 3 -4 -7 3 6 -1 4 -3 -12 4 -1 4 -1 -2 3 -5 -2 3 -4 -2 6 3 4 -4 -13 -15 -13 -19 -7 -13 -3 -10 -9 -4 -1
7508 -1 -7 -14 -10 -8 -14 0 -10 -6 -13 -12 -6 -4 9 -2 -1 12 3 -5 1 13 5 13 -5 16 3 9 2 -4 7 6 4 -2 1 12 -10 1 3 4 2 2 -5 7 -8 -7 -1 -7
7554 -7 -2 -14 -19 -4 -24 -14 -21 -15 -6 -12 -9 -6 -6 -6 -7 0 -7 -6 -3 -12 -1 -7 1 -6 -10 8 -4 8 -3 -5 1 5 10 -8 9 8 8 -4 9 4 4 -7 9 -1 -1
7599 -1 -8 5 3 -8 -5 -10 -5 -12 -16 -8 -10 -4 -8 -7 -21 -3 -8 -6 -27 -6 -3 -6 -17 -4 -7 -7 -10 -6 2 -7 -10 -7 -13 0 -7 -1 -4 -16 -9 -6 -4 -1 -1 8 6 5 -1 -2 6 9 9
7650 9 1 0 1 -7 -9 -1 -1 3 -4 6 -5 -4 -6 6 -9 2 2 -17 -15 -9 -9 -15 -10 -13 -11 -13 -12 -3 -5 -12 -7 -22 -11 -4 2 -2 0 -4 -4 -12 2 -13 -13 -4 -8 -5 -2 -3 -3 -10 -6
7701 -6 -2 7 6 7 2 12 1 5 -1 -4 10 -2 11 1 1 5 -7 -6 -3 -2 -3 1 -12 6 -8 -3 -8 -16 -14 -11 -2 -14 -23 -17 -1 -6 1 -10 -3 -3 0 -7 -5 -9 5 -1 -10
7748 -10 -5 -9 9 -10 0 -5 -3 1 3 -6 4 4 1 3 5 2 5 7 11 1 -4 -6 -1 2 -5 -10 -16 -6 -5 -1 -7 1 -4 -3 -13 1 -13 -15 -9 -13 -5 -8 0 -15 -20 -7 -5 -15
7796a5%LJ2j3J9mlpMNrPkmJ2j1jJ3lQ%j1LKm%Lj6K0jj1RnlmLjK0k5J0jkjlJ0j2
7842iJ5j6PppJ1j0J6j6nJ3%O%MqPjJjpJ1j4KJ%%kLJ4l%rJ1mjNLoM%j1mJ3lnJM
7890CJpJ3rmqlJ6Nlk0MOpQ%mMrLjK%PPqQj1jj2K0onPJ1j8OJ1nNoLRpJKj2O%Lp
7941bJ%j5JOMoRjoQoNpMlpJ5k0J3j0NoJ2jnkOOj2J0Pj0rMJRoPkjLJKjRoOPmKk0
7993eJ7%kJOj5KjqK%KqJ4pJKOj0KMqMjj2PJ4nppnJ3j3J5j2MJP%KpmNMMlJ0qnN
8043AJ3j2Nj4K2j5J0nMj0JKMp%lmJ6j6ORk0LJ6lJj6K0rLj0kpJ1%OmlJOj0%J1j3
8087a2K2k2J1J4mj5LJMj2J2j0J0j1LJjJ1j0NM%PJj7J0pmMmJj0J5LlrRKoJjmJ4
8130Fj5qJ4mLOqlJpJ0M%JKl%Qj1oJ6p%KKj0OoJMJ5j3KjLkPMj1JoJ1rJjQpJjNj
$$ plain form
7796 -15 -15 -12 0 -13 6 2 -1 -8 -4 1 -8 -1 -3 -7 5 -6 -7 6 3 11 11 0 3 5 1 1 4 -12 8 7 -4 5 0 -3 -7 -4 -5 15 -10 0 -1 -3 -4 -7 3 -9
7842 -9 6 -10 -3 -10 -17 -6 -16 0 -16 -21 -8 -8 -2 -2 2 -6 1 0 1 0 -7 4 -10 -8 -7 -7 -7 -9 -6 8 5 5 -4 7 3 2 7 10 4 8 8 -3 -7 6 3 -2 -1 3
7890 3 4 -3 10 1 -3 -11 -14 2 7 4 -16 -12 -6 -13 -5 -5 -9 -5 -14 -11 -12 -10 -10 -3 4 -4 4 -7 -8 -20 0 -6 -11 -4 7 -11 -5 6 1 6 0 3 12 5 6 8 -4 2 2 5 -2
7941 -2 -1 -1 -16 -15 -9 -5 -11 -2 -3 -9 -1 -7 -2 -9 -5 -8 -15 0 -20 -7 -17 -12 -18 -6 -7 -12 -14 -8 -2 -14 -4 3 -7 -16 -12 -11 -2 -8 -1 -3 -4 -1 0 2 1 10 4 10 17 13 15 -5
7993 -5 12 12 10 11 17 2 4 3 -5 -3 -3 -1 -9 5 -2 -1 1 7 -3 -1 3 -5 -1 -2 -14 -7 7 2 -5 -12 -17 -4 -17 -2 -14 -10 -9 -2 -2 0 -7 -11 -6 -2 2 -1 9 1 -4 1
8043 1 14 2 7 -7 15 0 10 5 9 -1 0 2 6 -1 -1 -4 -8 8 -8 -2 7 -13 -10 6 3 4 -12 8 -1 2 -8 -10 -17 -6 -6 0 -4 -7 -6 0 -10 -10 1 -12
8087 -12 10 -12 -1 13 9 -6 -3 -2 2 -10 2 -8 2 -9 -6 -5 -6 5 -5 0 4 4 11 12 -5 5 -2 -6 -2 -6 -5 -15 0 3 0 -9 0 2 -4 -3 -4 -8 6
8130 6 -9 -17 -3 -7 -4 2 -6 -9 -8 -15 -5 -1 -1 0 2 -1 -1 7 -4 -10 6 -1 -1 1 3 -7 -1 -7 -6 -2 13 0 2 1 4 2 9 13 2 3 -3 8 -1 0 -1 7 0 1 0 5 4
8181DmRj2Oj1jQ%LM
$$ plain form
8181 4 0 9 -3 3 -8 -9 -1 -1 2 6
8191F
##END NTUPLES=NMR FID
##END=
