##TITLE=1H_SA_PPh3vCl(EtOAc)
 CDCl3, 8 sc, 
 19.9.2019
##JCAMPDX= 6.0         $$ Bruker NMR JCAMP-DX V2.0
##DATA TYPE= NMR FID
##DATA CLASS= NTUPLES
##ORIGIN= UXNMR, Bruker Analytische Messtechnik GmbH
##OWNER= root
$$ XWIN-NMR		Version 3.5
$$ Thu Sep 19 15:36:32 2019 Russian Standard Time (UT+4h)  she@DPX200
##.OBSERVE FREQUENCY= 200.1315
##.OBSERVE NUCLEUS= ^1H
##.DELAY= (6, 6)
##.ACQUISITION MODE= SIMULTANEOUS
##.ACQUISITION SCHEME= undefined
##.AVERAGES= 8
##.DIGITISER RES= 18
##SPECTROMETER/DATA SYSTEM= spect
##.PULSE SEQUENCE= zg30
##.SOLVENT NAME= CDCl3
##.SHIFT REFERENCE= (INTERNAL, CDCl3, 0, 15.7039)
##AUDIT TRAIL= $$ (NUMBER, WHEN, WHO, WHERE, WHAT)
$$ ##TITLE= Audit trail, XWIN-NMR		Version 3.5
$$ ##JCAMPDX= 5.01
$$ ##ORIGIN= Bruker BioSpin GmbH
$$ ##OWNER= she
$$ F:/spectra/data/she/nmr/H-F/1/audita.txt
$$ ##AUDIT TRAIL=  $$ (NUMBER, WHEN, WHO, WHERE, WHAT)
(   1,<2019-09-19 15:35:13.50 +0400>,<she>,<DPX200>,
      <created by zg, POWCHK disabled, PULCHK disabled
       configuration hash MD5:
       00 E9 B6 7A A2 85 ED C7 34 08 36 98 17 FE 4E 26
       data hash MD5: 16K
       69 AE 9B 7F 76 BE F5 30 A6 DF E3 B0 38 B9 D3 0B>)
$$ ##END=
$$ 
$$ hash MD5
$$ EE 29 22 5C B9 F3 22 BE B9 BA D2 4E E5 76 D1 61
##$RELAX= 
##$RELAX= 
##$RELAX= 
##$RELAX= 
##$RELAX= 
##$RELAX= 
$$ Bruker specific parameters
$$ --------------------------
##$DU= <F:/spectra>
##$EXPNO= 1
##$NAME= <H-F>
##$PROCNO= 1
##$TYPE= <nmr>
##$USER= <she>
##$AMP= (0..31)
100 100 100 100 100 100 100 100 100 100 100 100 100 100 100 100 100 100 
100 100 100 100 100 100 100 100 100 100 100 100 100 100 
##$AQSEQ= 0
##$AQ_mod= 1
##$AUNM= <au_zg>
##$AUTOPOS= <>
##$BF1= 200.13
##$BF2= 200.13
##$BF3= 200.13
##$BF4= 200.13
##$BF5= 200.13
##$BF6= 200.13
##$BF7= 200.13
##$BF8= 200.13
##$BYTORDA= 1
##$CFDGTYP= 0
##$CFRGTYP= 5
##$CHEMSTR= <none>
##$CNST= (0..31)
1 1 145 1 1 1 1 1 1 1 1 1 1 1 1 1 1 1 1 1 1 1 1 1 1 1 1 1 1 1 1 1 
##$CPDPRG= <>
##$CPDPRG1= <>
##$CPDPRG2= <>
##$CPDPRG3= <>
##$CPDPRG4= <mlev>
##$CPDPRG5= <mlev>
##$CPDPRG6= <mlev>
##$CPDPRG7= <mlev>
##$CPDPRG8= <mlev>
##$CPDPRGB= <>
##$CPDPRGT= <>
##$D= (0..31)
0 1.2 0 0 0 0 0 0 0 0.06 0 0.03 0 0 0 0 0.0002 0 0 0 0 0 0 0 0 0 0 0 0 
0 0 0 
##$DATE= 1568892912
##$DBL= (0..7)
120 120 120 120 120 120 120 120 
##$DBP= (0..7)
150 150 150 150 150 150 150 150 
##$DBP07= 0
##$DBPNAM0= <>
##$DBPNAM1= <>
##$DBPNAM2= <>
##$DBPNAM3= <>
##$DBPNAM4= <>
##$DBPNAM5= <>
##$DBPNAM6= <>
##$DBPNAM7= <>
##$DBPOAL= (0..7)
0.5 0.5 0.5 0.5 0.5 0.5 0.5 0.5 
##$DBPOFFS= (0..7)
0 0 0 0 0 0 0 0 
##$DE= 6
##$DECBNUC= <off>
##$DECIM= 24
##$DECNUC= <off>
##$DECSTAT= 4
##$DIGMOD= 1
##$DIGTYP= 9
##$DL= (0..7)
0 120 120 120 120 120 120 120 
##$DP= (0..7)
150 150 150 150 150 150 150 150 
##$DP07= 0
##$DPNAME0= <>
##$DPNAME1= <>
##$DPNAME2= <>
##$DPNAME3= <>
##$DPNAME4= <>
##$DPNAME5= <>
##$DPNAME6= <>
##$DPNAME7= <>
##$DPOAL= (0..7)
0.5 0.5 0.5 0.5 0.5 0.5 0.5 0.5 
##$DPOFFS= (0..7)
0 0 0 0 0 0 0 0 
##$DQDMODE= 0
##$DR= 18
##$DS= 0
##$DSLIST= <SSSSSSSSSSSSSSS>
$$ [...]
##$SUBNAM2= <"">
##$SUBNAM3= <"">
##$SUBNAM4= <"">
##$SUBNAM5= <"">
##$SUBNAM6= <"">
##$SUBNAM7= <"">
##$SUBNAM8= <"">
##$SUBNAM9= <"">
##$SW= 24.0689530833862
##$SWIBOX= (0..15)
0 0 2 0 0 0 0 0 0 0 0 0 0 0 0 0 
##$SW_h= 4816.95568400771
##$TD= 16384
##$TD0= 1
##$TE= 0
##$TE2= 300
##$TE3= 300
##$TEG= 300
##$TL= (0..7)
0 120 120 120 120 120 120 120 
##$TP= (0..7)
150 150 150 150 150 150 150 150 
##$TP07= 0
##$TPNAME0= <>
##$TPNAME1= <>
##$TPNAME2= <>
##$TPNAME3= <>
##$TPNAME4= <>
##$TPNAME5= <>
##$TPNAME6= <>
##$TPNAME7= <>
##$TPOAL= (0..7)
0.5 0.5 0.5 0.5 0.5 0.5 0.5 0.5 
##$TPOFFS= (0..7)
0 0 0 0 0 0 0 0 
##$TUNHIN= 0
##$TUNHOUT= 0
##$TUNXOUT= 0
##$USERA1= <user>
##$USERA2= <user>
##$USERA3= <user>
##$USERA4= <user>
##$USERA5= <user>
##$V9= 5
##$VALIST= <valist>
##$VCLIST= <CCCCCCCCCCCCCCC>
##$VD= 0
##$VDLIST= <DDDDDDDDDDDDDDD>
##$VPLIST= <PPPPPPPPPPPPPPP>
##$VTLIST= <TTTTTTTTTTTTTTT>
##$WBST= 1024
##$WBSW= 4
##$XGAIN= (0..3)
0 0 0 0 
##$XL= 0
##$YL= 0
##$YMAX_a= 28124
##$YMIN_a= -39953
##$ZGOPTNS= <>
##$ZL1= 120
##$ZL2= 120
##$ZL3= 120
##$ZL4= 120
##$ABSF1= 10
##$ABSF2= 0
##$ABSG= 5
##$ABSL= 3
##$ALPHA= 0
##$AQORDER= 0
##$ASSFAC= 0
##$ASSFACI= 0
##$ASSFACX= 0
##$ASSWID= 0
##$AUNMP= <proc_1d>
##$AZFE= 0.1
##$AZFW= 0.1
##$BCFW= 1
##$BC_mod= 2
##$BYTORDP= 1
##$COROFFS= 0
##$CY= 11.3945322036743
##$DATMOD= 1
##$DC= 2
##$DFILT= <>
##$DTYPP= 0
##$F1P= 20.1720416913024
##$F2P= 0.152960286110954
##$FCOR= 0.5
##$FTSIZE= 0
##$FT_mod= 4
##$GAMMA= 1
##$GB= 0.15
##$INTBC= 1
##$INTSCL= 1
##$ISEN= 128
##$LB= 0.24
##$LEV0= 0
##$LPBIN= 0
##$MAXI= 10000
##$MC2= 0
##$MEAN= 0
##$ME_mod= 0
##$MI= 1.114404
##$NCOEF= 0
##$NC_proc= 0
##$NLEV= 6
##$NOISF1= 3.799351
##$NOISF2= 2.8
##$NSP= 1
##$NTH_PI= 0
##$NZP= 0
##$OFFSET= 15.70392
##$PC= 1
##$PHC0= -9658.741
##$PHC1= 22.00096
##$PH_mod= 1
##$PKNL= yes
##$PPARMOD= 0
##$PSCAL= 0
##$PSIGN= 0
##$REVERSE= no
##$SF= 200.130013532006
##$SI= 16384
##$SIGF1= 3
##$SIGF2= 2
##$SINO= 400
##$SIOLD= 16384
##$SREGLST= <1H.CDCl3>
##$SSB= 0
##$STSI= 0
##$STSR= 0
##$SW_p= 3612.71676300578
##$SYMM= 0
##$S_DEV= 0
##$TDeff= 0
##$TDoff= 0
##$TI= <>
##$TILT= no
##$TM1= 0
##$TM2= 0
##$TOPLEV= 0
##$USERP1= <user>
##$USERP2= <user>
##$USERP3= <user>
##$USERP4= <user>
##$USERP5= <user>
##$WDW= 1
##$XDIM= 8192
##$YMAX_p= 0
##$YMIN_p= 0
$$ End of Bruker specific parameters
$$ ---------------------------------
##NTUPLES= NMR FID
##VAR_NAME=  TIME,          FID/REAL,        FID/IMAG
##SYMBOL=    X,             R,               I
##VAR_TYPE=  INDEPENDENT,   DEPENDENT,       DEPENDENT
##VAR_FORM=  AFFN,          ASDF,            ASDF
##VAR_DIM=   8192,          8192,            8192
##UNITS=     SECONDS,       ARBITRARY UNITS, ARBITRARY UNITS
##FACTOR=    0.0002076,     1,               1
##FIRST=     0,             0,               0
##LAST=      1.7004516,     0,               0
##MIN=       0,             -39953,          0
##MAX=       1.7004516,     28124,           0
$$ Real data points
##PAGE= N=1
##DATA TABLE= (X++(R..R)), XYDATA
0@%%%%%%%%%%%%%%%%%%%%%Lj1J6j6J6j6J6j6J6k2L0l2L2l3M0m7M8n4O2o6P4q2
43d2R0j01J12j25J40j57J76k00K30k67L15l80M73o15Q55j327K588j1463l0255
62c9953M2088K5989l7722j0652M0067j811m2071Q100M1209r656l1695J3910K2784
75B0587j8452j5453K0760J1321j8588o091J5430K376j2066m26Q509J183l932j508
89C650J170K604j376n779K636J0283l591j3295M691J2821r014j1636J4928J0673
103A8765k0189r542K2257N080k3842J071K4805p733k5326J2503K2372j8114j8633
116a6526K2636J4137k5551r751K4672K417k3669N124K3181j0504k2408J1401J7307
129A2466j1932r983J3582L492j5882q66J4861m11j0782K193N831m754k565N747
$$ y = [0, 0, 0, 0, 0, 0, 0, 0, 0, 0, 0, 0, 0, 0, 0, 0, 0, 0, 0, 0, 0, 0, 3, -8, 8, -8, 8, -8, 8, -8, 8, -14, 16, -16, 16, -17, 23, -24, 24, -30, 32, -34, 40, -42, 48, -53, 59, -66, 74, -83, 93, -107, 123, -144, 171, -209, 264, -351, 504, -823, 1765, -9698, -39953, 2135, 28124, -9598, -20250, 19817, 18006, -24065, -15965, 25244, 15588, -16107, -2197, 20587, 2135, -13318, 7442, 18763, 175, -5916, 9514, 11890, -176, -602, 7907, 9090, 5158, 3650, 4820, 7424, 6048, 269, 2905, 13188, 9597, -3698, 993, 13814, 4800, -6836, 8092, 18765, -1424, -10966, 11291, 16371, -7471, -6400, 18405, 10672, -14654, -2151, 20221, 2107, -16526, 6110, 20247, -5304, -15055, 9617, 12034, -11635, -6511, 16670, 6166, -16242, -4841, 12466, 534, -9449, 4133, 7625, -8257, -9123, 5738, 5327, -5455, -3262, 2569, -2185, -4750, 997]
143I97M57m895J009K741j918j83J880k888j670N244J346n670L77M429m142l740
159f626Q190M098r848l470R045r4q333N159R114q532r465R522P170r985k822J1464
175D587j064j2693L689J2143n923j0088Q352P733r840m972J0202J508j0214J966
189d614J0494l744r508M093O490m837k519O750L29p984n4O823k04l846J983J579
205A231l804p85M127N66k895L55J493j121k69J320q88j148J956J099j867j61J095
222C04j927q81M136J767m380j729L260k88k643L299L676m596m464M131L284l690
238g41o12M640j373n760J992N655k187m223L086K728m102j557M566L80m628O90
254a446M492j337l858J522K312k258p67L518L90m115q53L107N71j499Q16Q03k251
$$ y = [997, 1454, -3441, -2432, 309, -1609, -1792, 88, -2800, -4470, 774, 2120, -3550, -3173, 1256, -2886, -6626, 1564, 5662, -4186, -7656, 1389, 1295, -7038, -1879, 7235, -1297, -10762, -1240, 5930, -4055, -6877, 4587, 3523, -9170, -5481, 6662, 739, -9349, -997, 6736, -3104, -8076, 2126, 3634, -6580, -4614, 5880, 2136, -7372, -3279, 3211, -1626, -4145, 2605, 2934, -5050, -5104, 1719, 1515, -2331, -348, 1231, -2573, -3358, 769, 1335, -1560, -1205, 288, -833, -1102, 218, -670, -1818, 138, 1237, -630, -791, 304, -1623, -2504, 1632, 3399, -981, -2710, 550, 262, -2381, 918, 4594, -2, -4466, -335, 2949, -741, -1353, 3287, 1914, -3846, -1854, 3801, 1614, -2609, 477, 3205, -897, -2454, 2112, 2492, -2136, -1446, 3046, 1709, -2149, -627, 1685, -573, -1340, 2178, 2568, -1547, -2400, 707, 1278, -221, 595, 1398, -853]
271h53j393K135J667j142j062L78J05l90K62N13j58m54n1M86M08p01j163M50J526
290E63Jj062J68K11j443j72K744J073k703j407J770L48j432J361K229k131l064
307b946J796K724j530j491K110M97k932j7L377j97l244O40K994r67k492J374J723
324A419k084j180K942J302l087j544K362J043j561K70J740j160k492R82K680l07
340A325j966K25J063q62q36J453J141j559j368J407J322j307j201J253R37j289
356b62n33J681K08k341l85K655P80k247o10J669m03j796J355K454j527k876J175
373a003K360j210j458J890R36k659q84L001P69k923m79K730o7k577O05K351j276
390A06k314J808K473j874k374J587J722j573q02K097L40k750n81K728P43k123
$$ y = [-853, -2246, -111, 1556, 414, -648, -270, -165, -555, -293, 220, 62, -392, -443, 43, 451, -250, -1413, -963, 563, 564, -498, -330, -119, -1562, -1734, 1010, 2083, -620, -2027, -257, 91, -1341, 20, 2249, 118, -2946, -1150, 1574, 44, -1447, 663, 1160, -1772, -1789, 1588, 1391, -1853, -1213, 1781, 814, -1678, -304, 1419, -665, -1845, 1097, 2399, -688, -2232, 130, 1173, -388, -118, 1622, 462, -2030, -1048, 1632, 1325, -641, -416, 647, -215, -1051, 402, 1543, -16, -1384, 23, 1345, 38, -1163, 90, 1027, -262, -795, 886, 1094, -1247, -1632, 1023, 1803, -444, -1054, 615, 212, -1584, -229, 2225, 698, -2178, -1003, 1357, 147, -1311, 579, 1515, -1144, -2028, 973, 1742, -1181, -1660, 1070, 1003, -1574, -969, 1382, 106, -2208, -400, 2073, 199, -2175, -588, 1134, -439, -1241, 856, 1196, -1554, -2135, 593, 1336, -787]
406g87l51J636m65j718J038K113j048k201Q52J930q72j532J118J248j457j126
422a622J815J129k022j207J997J169j709p39J700R3k009L33K457k68k503J82K115
439I11m59j654J102J535j630j646J890J706j814j432J793R87j859m69K115J40
455A216k359K8K491l0k222J82J871n84j585J174J668j485j779J497J693j358j221
472h03J464P40j795m01K104L04k207k22K084J8j863L32J666q17j625J173J675
489A827j305j637J193J265j184p70J367L82j657l53J703K92j490j65J188j56j068
506e68M18J041n55j091N33J096m67j013L22Q35l86o97O28O96q67r47R36J130q42
525B02j015Q42P15j134m61J548L92j778l43J779P9j733L64J726p77j645J123J474
$$ y = [-787, -1138, 498, 33, -1685, -647, 1466, 418, -1783, -931, 999, 127, -1405, -287, 961, -496, -1622, 193, 1322, -700, -1907, 90, 1259, -450, -1189, 511, 604, -1405, -1072, 1385, 1117, -1386, -1204, 911, 452, -1202, -100, 1435, -195, -1841, 49, 1755, -59, -1491, 302, 1289, -570, -1039, 1076, 1216, -1143, -1115, 1376, 1346, -876, -694, 1177, 593, -992, 182, 1850, 365, -1414, 83, 1776, 418, -803, 661, 1401, -394, -795, 1309, 1613, -594, -816, 1268, 1286, -577, -245, 1421, 604, -1021, 152, 1827, 522, -1115, 78, 1343, 159, -611, 756, 1138, -519, -872, 831, 1123, -367, -532, 656, 500, -568, -150, 891, 336, -755, -222, 874, 407, -606, -284, 551, 165, -532, 96, 792, -75, -1022, -86, 1044, 202, -813, 29, 744, -390, -851, 697, 1089, -689, -1032, 747, 826, -907, -543, 1183, 406, -1239, -116, 1358]
543A358j476j237J754R69j828n58J801j7j839N57J857p66j660R00J155j147o45
560h22J413L88j440k20J131j10p55M86N56o71l56N74M7l76K90J92m79K6M64m19
580h1m84P60M18q63j58R01l86j000Q73J177j052j020J102M37j313Q6J599m73j588
599a065P17J252j094q36J490N35j537r1J380n47j244J085J152j276q00J199P5
616C95j274O26J390r55j185J181O77j446o7J713l23j650P17J277j318r64J802
633E96P05j856l51J672l47j518J059J543j326j324J318P40j409j52J562k12j456
650g56L46R42o92m75J043L22r61j58N55l11j66P77L9q60Q8N77o03l36J055J96
670F22j147J74J020q06j055J381J189j478q73J393R4j632O53K038r16k060R67
$$ y = [1358, -118, -1355, 399, 1368, -460, -1018, 783, 766, -1073, -516, 1341, 575, -1085, -185, 970, -177, -822, 591, 979, -461, -681, 450, 340, -415, 71, 627, -44, -400, 174, 221, -155, 135, 327, -152, -126, 338, -81, -565, 195, 613, -250, -408, 493, 107, -893, -20, 1157, 105, -915, 187, 624, -689, -603, 996, 523, -1065, -348, 904, -190, -1026, 464, 999, -538, -629, 751, 204, -1040, 45, 1197, -79, -879, 320, 395, -879, -253, 1137, 182, -1003, 178, 855, -591, -658, 1055, 732, -918, -201, 1076, -242, -1206, 596, 1301, -555, -906, 766, 419, -1099, -40, 1503, 177, -1147, 171, 911, -498, -650, 912, 700, -756, -410, 532, -160, -635, 408, 730, -231, -389, 166, -145, -311, 466, 505, -355, -267, 310, -293, -629, 426, 622, -525, -351, 669, -137, -1192, 189, 1378, -100, -973, 420, 514, -1118, -465, 1573, 657, -1403, -436]
687d36J577j220r46J712N69j881k32J779k33j595O87J515p97j155P54N09r20O5
705b48J279j18j269LP33j86j95O66J20q13k42M69N2j56L31J62m13k35J21n7L2
726C6M15J12m78k12K19q5j55L55K83l58k78J48r8k64L03N20j59m37q9j18j90M45
748h5P03k50q20j44L56k4O2N52k5q53k19P36J73o21R6P24k24p45K54N64n65m91
770h46J046P69j140r72Q45O62p16J2J194k51j674K5J654J17j151L36R59q68j133
789a132J017J203q30p74Q67M10j136k57J222K69r41JP59l02q38K86Q13o2m24Q2
809B33R6l98k71M39O92O3o66n36K12M15q2R4N01k83j114J4J181R3r87K06Q99o43
831A58r55Q78Q13j121n49J519L83j798m26J550Q1j204O58J197j287j555J263J506
$$ y = [-436, 1141, -79, -1025, 687, 1256, -625, -857, 922, 689, -906, -219, 1296, 499, -656, 98, 607, -313, -248, 1031, 913, -356, -353, 380, 194, -1, 665, 785, -28, -270, 199, 251, 95, 426, 588, 175, -60, 61, 4, 36, 451, 563, 85, -127, 92, 7, -148, 207, 490, 132, -146, 2, -96, -360, -57, 463, 304, -133, -222, -340, -530, -85, 618, 368, -452, -596, -240, -264, -202, 350, 325, -528, -747, -11, 162, -459, -363, 361, 137, -608, -354, 210, -355, -846, 200, 969, -171, -1143, -298, 364, -352, -340, 854, 603, -1071, -1046, 608, 725, -426, -90, 869, 1, -1132, -115, 1088, 258, -516, 351, 761, -375, -632, 590, 859, -82, -81, 678, 376, -462, -176, 637, 575, 151, 233, 329, -69, -340, 99, 791, 854, 188, -348, -136, 279, 197, 291, 792, 509, -605, -591, 590, 683, -304, -98, 801, 158, -797, 81, 894, -227, -776, 743, 1126, -672, -1098, 452, 533, -671, -13, 1184, -103, -1658, -395, 1111]
849A111r23q10R61P2j394J36J527j2j171J30O54n38m66P21M07n47j55M04j67l86
869d46K38K24j08J80J62m73l57L09J91q6M02K64q19o49O67O13k85K3M02o16q58
890a022O90J025m80o08N44J19q72J51J050k75r25N64Q46p90q00P74N44o68M2Q95
910H04m45j234L14J167m7n24K47k3p92L5J002K40o16j49J53l17k5O20J51n23q8
931e0K99j70k01L24J58l66OM57j56n40J04L99r2k9L55j67o89jO44K14k03j2j58
954A26m80N6O74K01m10j59O3k01K1M68R5m98j15M08j8l35J08K09k11m4L93j8n65
977b32p9L78J42n5J83j36n70n5N98K45k76q0nl60q3O17K89n08l04K81M8k23K33
1000D8L09l98l69M29L55m08k93L15J15k25J46L05l09n40K18N63M9k80r5r5j50
$$ y = [1111, 188, -622, 339, 411, -983, -847, 680, 668, -503, -373, 281, -257, -723, -2, 405, -142, -297, 107, -60, -446, -208, 16, -92, 88, 250, -223, -580, -271, -80, -166, 236, 500, -319, -968, -301, 312, 27, 50, 452, -164, -1022, -332, 693, 213, -395, 149, 268, -604, -453, 597, 322, -603, -39, 807, 17, -783, -9, 535, -133, -91, 804, 359, -875, -561, 606, 559, 35, 282, 259, -533, -498, 504, 744, 128, -21, 132, -185, -210, 410, 561, 38, -50, 249, 79, -122, 202, 360, -6, 0, 457, 301, -239, -135, 264, 172, 143, 498, 331, -358, -359, 285, 499, 296, 284, 126, -354, -298, 376, 577, 167, 8, 71, -130, -109, 359, 454, -44, -159, 249, 231, -104, 4, 213, 2, -42, 351, 333, -232, -311, 67, 209, 154, 337, 201, -369, -424, 174, 419, 143, 63, 58, -302, -385, 232, 521, 13, -291, -10, 38, -185, 48, 357, -41, -410, 19, 374, -34, -327, -12, 103, -122, 24, 329, 20, -520, -302, 261, 310, 30, -65, -160, -310]
1021c10J52M01J07l40k72%K10J97L5j28j43l8L4J67J32j73k56J11L28m9k41O8
1043hN4k07N5N05J0o62j74N33J76k80Q3K20m28l80N46N63m24m53K92J67l31Q7
1065e6N01j73o36J57N99j23m81J38K87k09j24L86J42n21k57M15L46j52k21Pm0
1086a5j25J49L22J2l58k45K06L00m6j44O2n9k36R2M29j7n31o2M76L6l71J17L01
1109B93l81l40N80M66n98n36M59L47l65l4M85k03p06K16P57j33n48J31L07l64
1129a67j51N61J68o27k02N62J47m04l7K85j08k61K55L36k48l94Q4L27R3j09q6
1150B4o7p5J5J99K30j03l83r8L59K05j95o6J51j87k41L48M20l78m76L33M17l49
1172H3k00M40K7o01J00P69q9p90Q0O08j92l53M27K79o80l19O87L27n14j45M08
$$ y = [-310, -158, 243, 350, 10, -262, -262, -52, 145, 180, 52, -91, -129, -95, 72, 204, 31, -225, -114, 214, 165, -76, -8, 46, -161, -106, 399, 409, -253, -427, 106, 282, 2, 85, 305, -123, -503, 43, 606, 182, -271, 21, 188, -143, -56, 445, 272, -364, -207, 392, 269, -212, -74, 213, 4, -120, 266, 408, -113, -370, 45, 391, 239, 18, 25, -15, -140, 9, 331, 343, -15, -260, -54, 246, 200, 56, 118, 59, -177, -85, 344, 327, -204, -266, 210, 246, -125, -8, 293, -88, -428, 152, 618, 20, -516, -57, 290, -75, -109, 376, 173, -533, -317, 440, 307, -241, -110, 197, -167, -318, 243, 411, -216, -418, 144, 291, -113, -150, 135, 27, -234, 21, 357, 109, -285, -201, 126, 219, 110, 24, -43, -118, -103, 96, 326, 223, -160, -258, 101, 306, 111, 45, 196, 9, -232, 116, 536, 158, -318, 15, 432, 83, -117, 323, 350, -251, -151, 618, 529, -261, -181, 427, 235, -118, 309, 588, -92, -411, 276, 603, 89, -56, 352]
1193C52j57m09L41M80l74m51K83K78k50r3K45q3k88J51K92j33k17K5%M5K13Ol31
1216g5j17K24M6q1J74J6m41j14N02J68l83m4K46k30k28M19K88n29k62M62J49m56
1238b66N5M21k58m25M08M14m49l46L83J69l60J18M02l10m66L34M17k96j75L17
1258H7q6m21K19N30k23m54K46K22l00QM36j08n23J67M67j87k90K82O4l84J05M93
1280C50j47n16J55L87j78j28L11n6m81J07N34p5l97J62J53l06J1M66p1n05J00
1301a24M10j75k34K85R3m26K0N01r7m40J47L15k65j48M26N0n30mM89q4l47K22
1323H4K40m02j76M90J18m33j9L37j91k49L81K03m57j69M35K7l81J79L03l81k66
1344c27M93K40n22j77M67k9l82K68L68m86m07N35L47m85j67M34j13m59L05N03
$$ y = [352, 195, -214, 127, 607, 233, -218, 65, 343, 93, 0, 245, 162, -126, 25, 317, 184, -33, -8, -8, 37, 250, 256, -75, -192, 32, 78, -3, 171, 187, -254, -368, 134, 302, -81, -125, 121, -109, -337, 82, 370, -159, -421, 41, 190, -266, -211, 210, -48, -473, -65, 349, -100, -446, -63, 106, -254, -136, 266, -44, -510, -176, 241, -55, -230, 87, 1, -420, -201, 329, 106, -348, -102, 120, -180, -172, 264, 156, -367, -200, 267, 80, -210, 72, 136, -248, -143, 350, 203, -313, -158, 229, 51, -77, 234, 178, -303, -196, 338, 263, -134, 28, 181, -125, -114, 352, 281, -224, -124, 286, 111, -123, 162, 255, -171, -151, 350, 253, -187, -40, 275, 10, -138, 288, 338, -192, -196, 293, 209, -138, 84, 324, -78, -254, 236, 354, -79, -98, 239, 48, -201, 180, 383, -74, -243, 192, 219, -162, 17, 320, -61, -327, 166, 406, -116, -293, 174, 145, -237, 31, 399, -87, -494, 41, 388, -97, -264, 170, 57, -402, -97, 406]
1364D06m11m62M10L16l79j28L74n5l98J79L55k39k79K08J60k10K1K19j55k34K48
1385e4J44k37J0K17j77k40L09J73l53o7L99j26m39K93M93m18m00M89K54n87o6
1406c83O93j18p39K46P09l53o19M76M26n83k00O96N5p52N5P12j32n41K43L62m12
1427a59k20N33J52n27q8L92Rk48J39J11k05l0K18n2j35J13J3j78J25J97k45k15
1449c00L33J68l80l6L86j07m29K52M11l54l51M33K40n48j10N88Jn77J21N11k98
1470d6m27M40L60m82l01M62J78m12nL73j40l48K34K73k59j76K37J01k14J5J65
1491B8j28j08J90J19j93n4R7k2k5J33J1j82j5J70l0r7J01N9j80j1K10l0k03Q1
1515g9J90j07j44J15P4j44PJ77l7k08O6J61q3j08J15N7j37j5J49l0j32L8J33l9
$$ y = [406, -5, -467, -57, 259, -120, -248, 126, 71, -327, -148, 207, -32, -311, -103, 57, -153, -132, 87, -68, -302, -54, 90, -147, -137, 80, -97, -337, -28, 145, -208, -275, 124, -2, -441, -148, 345, -73, -473, 16, 270, -317, -383, 310, 192, -547, -301, 408, 55, -564, -88, 338, -245, -445, 251, 306, -446, -391, 321, 189, -352, -109, 253, -159, -379, 154, 306, -221, -309, 83, 92, -156, -17, 94, -111, -141, 77, 25, -110, 3, 16, -162, -37, 160, -85, -300, 33, 201, -179, -215, 171, 64, -365, -113, 298, -56, -407, 26, 266, -282, -392, 196, 197, -380, -259, 252, -46, -473, -33, 327, -155, -456, 6, 184, -228, -233, 140, 0, -348, -114, 159, -100, -276, -39, 62, -152, -137, 28, -100, -208, -18, 101, -92, -146, -49, -71, -96, 37, 48, -134, -149, 21, -9, -106, -5, 54, -126, -137, 73, 43, -160, -79, 111, 4, -140, -25, 49, -95, -88, 89, 52, -156, -90, 71, -12, -120, -5, 52, -85, -100, 49, 19, -113, -75, 58, 19]
1539A9r6J2K9j5J0P0m3q0QO8j1j1J9jn4pO1Nn3j7P3K5j01m9R1L6p4qR2m7j20N4
1571a15J40n8j32P2R9j20o0J21M7j41K9J28r3j39R5J17p5o7P3l1r7R0R8r3p5J03
1597h4Kj16O0J12j20p2J37P6j83m2J56j6j09J09Q4j78r7K04O0j61M0J25j53j15
1621b81J97J06k06m1J98m7k08J35J87j78j35K05Q0k47oK42n8k27J68J50j98j13
1643b77K15N0j80Q9J60j64j61J98J20j72pJ97j21k23J87K37j90j38K00L0k26P0
1665a06K58j11k34J69J68j89q4J93Lj71R5J81j71j64J71J00j38N2J46j79j75J98
1687A2J87j58p8J33p6k01J75K18j66j56J57L3j88M8K23j27j95J90J35k38q4K30
1709G4rk13J41K13k55k32K60J50k09PK25j68l04K09L22j86j98J80K1k52O3L06
$$ y = [19, -77, -65, -36, -51, -41, 29, -14, -94, -86, -18, -29, -40, -21, -22, -76, -83, -22, -17, -70, -87, -14, 11, -90, -139, -48, -12, -86, -94, -2, -49, -169, -115, 25, -33, -165, -93, 6, -114, -174, -53, -6, -147, -118, 10, -83, -222, -127, -10, -85, -152, -79, -110, -207, -117, -19, -112, -187, -84, -82, -198, -138, -26, -146, -218, -81, -5, -188, -230, -74, -90, -199, -90, -6, -184, -281, -77, -17, -178, -138, -13, -166, -281, -84, 22, -184, -225, -27, -74, -282, -147, 40, -138, -273, -68, 12, -235, -241, 1, -57, -284, -116, 34, -164, -277, -62, -12, -192, -103, 57, -107, -268, -70, 50, -122, -129, 68, -53, -276, -89, 148, -42, -180, 20, 50, -176, -106, 152, 41, -193, -24, 144, -45, -129, 64, 67, -104, -9, 172, 1, -163, 8, 108, -30, 22, 168, -11, -186, 12, 199, 41, -37, 96, 20, -181, -6, 212, 46, -110, 47, 80, -108, -60, 163, 36, -159, 31, 166, -72, -156, 74, 65, -148, -7, 206, -49, -281, -21, 129, -80, -73, 152, -16, -320, -111, 211, 25, -173, 7, 28, -224, -161, 145]
1731A45p9k54P3J34j28m9J75j7j83Q5J44j55j14J61N2j41R9J21k12j84K23J42
1753C8j49OJ55k01k20K59K53j96j44J95n1k83J66L45j92k86K16J69k82o2L26j3
1775D9l21J39K79k21k66K73J75k41j0K82j58l50J97L46j21k06J55k2k62R3L79
1796A89o2k78O2J11j99M0L12p1k97J05K03j92j24K74N2k75Q4K49j81k95K50K15
1818A72k28j6K79j83l71K45L79j89k19K45j3l96J29N11j38m22J78K40l15r8M58
1839B48J6m71P0M09j84l66L16K38l43p9L96q2m84J42M56j31k76K26N4l99NM85
1861B46jl54N8J38k34m0L87M0l91L4K54j69j72L14R6l57kL65j40l46K37K65l04
1884g6q5L84p3n05J46N00j62l40K86J43m99p2O18P2n39L3L39k34k45M31K35m93
$$ y = [145, 66, -188, -115, 19, -109, -158, 17, 0, -183, -98, 46, -109, -223, -62, -10, -151, -52, 69, -143, -327, -104, 38, -111, -105, 50, -151, -371, -112, 141, -55, -199, -4, -55, -338, -172, 173, -19, -305, -89, 80, -202, -264, 62, 49, -272, -133, 146, -75, -341, -68, 107, -134, -144, 138, -20, -370, -173, 173, 52, -154, 1, -21, -283, -190, 189, 127, -151, -89, 22, -177, -137, 175, 104, -193, -88, 115, -77, -201, 73, 125, -150, -66, 183, 2, -293, -43, 172, -56, -72, 207, 24, -347, -102, 277, 88, -131, 114, 101, -295, -166, 345, 207, -215, -37, 203, -112, -210, 248, 264, -207, -137, 272, 88, -278, 38, 276, -67, -146, 250, 168, -316, -174, 282, 151, -125, 101, 155, -244, -239, 246, 245, -109, -51, 87, -147, -187, 200, 240, -151, -117, 137, -32, -204, 110, 206, -151, -153, 212, 72, -274, -37, 228, -76, -161, 223, 150, -355, -209, 291, 129, -211, 75, 218, -281, -353, 265, 337, -202, -169, 170, -64, -309, 122, 357, -136]
1906a36j57M26j2l59J57L19k76k12L45R9m18k5L76m6k31J88J07l80m3M24L6l16
1928a34O0J67k98r8M50J34m46p9L54j15k80L14K66l93k31M15R9m07M3L88j59l29
1950b79K92K43l97j82M39J03l48M0K74k39k72L49K75k96j77K22n1k21K62K46k84
1971aj97K27N4k10J22K49k58k37K99J87l15q6L20n9k73K10K75l55k63L99K07l42
1993d7m8K97j50l40L06L65l07l21K56J54k60L7L28j47l29J40K78j59j64K03M1
2014A33k25M4K20j02j93J43J20j37rJ41j10j65J48J59j55n7J46q8j95J84K49j99
2036E2k25J78Q7k17O3L00j36l55J64K86j53j83K03O0k89L9L50r4l36R3K72j25
2058C4j45J81K1k60L4K94J2k65KJ16n7jJ57k6k11K1J41mn5O1k8j17M5J29l7j00
$$ y = [-136, -293, 133, 121, -238, -81, 238, -38, -250, 95, 194, -224, -249, 127, 81, -150, 38, 145, -235, -278, 146, 182, -134, -74, 93, -205, -303, 147, 281, -165, -244, 110, -5, -285, 29, 295, -98, -329, 86, 185, -222, -179, 209, 50, -279, 13, 256, -141, -323, 116, 219, -129, -89, 185, -54, -326, 23, 298, 2, -175, 47, -4, -225, 37, 283, -1, -198, 29, 83, -127, -5, 244, -14, -251, 48, 235, -80, -166, 154, 95, -178, 32, 307, -48, -311, 88, 295, -47, -95, 202, 52, -288, 18, 383, 76, -245, 11, 165, -95, -58, 270, 123, -206, -66, 212, 53, -111, 92, 133, -92, -48, 172, 70, -123, 20, 140, 3, -6, 135, 25, -140, 8, 167, 12, -45, 101, 13, -182, 2, 251, 52, -173, 5, 92, -125, -62, 238, 102, -253, -89, 197, 44, -139, 64, 124, -165, -126, 224, 130, -206, -113, 159, 34, -111, 70, 91, -169, -135, 159, 171, -94, -92, 24, -33, -34, 123, 97, -114, -93, 48, 44, -11, 50, 22, -95, -50, 79, 42, -58]
2084e8O3J0p9L0J23p4j25Q5R0j15oJ15n2j48P3J49o2j19O5K8j18N8J71o3j89L5
2110a13J27l8j4Q5n1j63L9K04j4j38nM8l9J3J28k4j55MQ6M5l2j5l4k2N2P7l6o1
2138d6j8MM0O8k1j09PN4OpQ1l0j36LJ67pj32L2R9j01q7J41Q2j33o9J26J4j25N8
2167c9J18r3j26J34Q2j26m8R7J0q8P9R4r1j16N0P7RK1k6q8l1J12L8m8J4rj02Q
2195h8J73Rj67MJ30m5r4J21L1j78LK26nk35M0J52q6q8J90N0k57o6K45N2j59K6
2221a6J22j43j11J59J15j46l9J24n4j23J21J16j33n8J26J1j38L1J30r2p3J36L3
2244I8j49k1J20l5n7J35J9j84o0J61L8q2N9P0j76r9K00J04j77k0J12p0j07J17
2268dJ03j46n7J58Kj74L8J23p6o9J63K8k06m6J78Op9P4O8j78p7J64R1j33K3J12
$$ y = [-58, 5, 15, -64, -34, 89, 15, -110, -25, 65, -50, -56, 59, 7, -141, -68, 81, 19, -100, -35, -7, -125, -67, 104, 41, -148, -113, 14, -24, -38, 47, -4, -167, -128, 76, 62, -76, -81, -33, -72, -59, 69, 45, -110, -106, -20, 25, -7, -22, -56, -78, -26, 51, 15, -46, -64, -60, -20, 48, 27, -82, -75, -21, -15, -22, 59, 29, -107, -104, 63, 56, -76, -44, 55, -46, -133, 8, 90, -43, -112, 14, 28, -97, -39, 79, -14, -140, -6, 76, -50, -98, -1, 9, -79, 0, 94, 3, -113, -63, 14, 23, 44, 18, -70, -101, 11, 49, 1, 15, 6, -96, -88, 85, 94, -73, -69, 61, 16, -78, 43, 74, -104, -101, 125, 120, -115, -75, 77, -9, -97, 93, 143, -114, -180, 65, 117, -42, -16, 106, -37, -148, 11, 126, -20, -59, 65, 11, -112, 9, 125, -8, -66, 60, 71, -67, -36, 94, 2, -71, 65, 98, -51, -72, 48, 13, -44, 91, 110, -74, -134, 27, 65, -17, 42, 112, -64, -163, 37, 141, -36, -56, 56, -14, -121, -4, 99, -47, -104, 54, 56, -118, -80, 43, -33, -102, 61, 89, -117, -163, 15, 21, -58, 16, 84, -94, -171, -7, 84, -49, -26, 86]
2294H6j13j53J46J37r5n8J12j6j64N2J40n6n6Q4K9j37j0J01Po4R0N4j50p3J01
2319fO1l4M2K5j22q8J08P9k5J9J5j11p1J23P2p3mP8p7j08O5J03p0l6J30jj81j0
2347i7J37kn5R0M4j66j01J47Q8p5J3P4j09j23R6J30m0l4M5n7r9L4J20k9k7M0R
2374E3j18j6R4J9m0L7K3j12k6O6L5oM4Mj20m6Q1M5j5M4J7j01q5R2O3k8K4O0r6
2403hj05P2Q3l4QQ4m0j37J0J07Nl9Q8L4j80n4J25O4n5L6N4j07r9Q4Q9j7j3N9o0
2432E4j38K9J37J2o2L0Pr6m1Q8P6k1k8Lm1m2K5L7M1L2n3q1oN4MMP2jj19m9P6M4
2464D7m9O1Q2j19j33P3J06m6j5J18k4j98k3J72L0q1L4N2r6j15R0J19l8n0N8k4
2490C1j16JJ19J8m8J4%q1l8P7P1ol1j0o4k5K9O6M8mp2n1JK8K3L6N2m6r7m4Q1M8
$$ y = [86, -27, -180, -34, 103, 8, -50, 62, 46, -118, -66, 74, 18, -38, 46, 75, -62, -72, 29, 36, -28, 62, 116, -34, -107, -6, 55, 21, 63, 88, -34, -122, -14, 65, 40, 59, 74, -37, -108, 15, 87, 14, 10, 88, 11, -97, -32, 71, 1, -35, 95, 94, -87, -97, 40, 38, -17, 73, 117, -49, -150, -3, 85, 10, 23, 97, -12, -135, -39, 91, 51, 17, 62, 5, -94, -60, 60, 31, 4, 44, 53, -65, -81, 13, 32, -8, 29, 52, -60, -86, -20, 15, 9, 53, 57, -63, -109, -28, 17, 2, 46, 63, -38, -123, -31, 32, 4, 28, 88, -8, -113, -41, 42, 8, 16, 100, 60, -77, -67, 40, 45, 6, 94, 128, -52, -106, 19, 83, 28, 64, 118, 11, -88, -4, 85, 68, 55, 114, 54, -84, -55, 82, 94, 32, 62, 69, -27, -68, 20, 96, 75, 47, 50, 9, -33, -8, 29, 70, 102, 49, -32, -38, 16, 20, 24, 96, 95, -24, -73, 3, 47, -2, 59, 141, 22, -111, -38, 68, 22, 7, 125, 101, -97, -120, 52, 82, 1, 35, 87, -9, -124, -34, 85, 47, -3, 55, 31, -85, -84, 35, 53, 5, 19, 19, -62, -100, -23, 48, 42, 11, 1, -63, -88, -59, 7, 55, 51, -21, -72, -71, -43, -20, 16, 68, 22, -75, -119, -38, 10]
2522A0qL1J4p7o2K6O9MQL3m5r7OO8M0LK1j9q4o8P3J07%l4%o3n8L3J06K0m2lk0
2555ho7lR1N5m0l9L6m2p7N8J15jn7j2kp3j8J34Q4o8o1Pk9m4J00R8j8r4k1JrM4
2587D0J06j1o0m8moK4P3K5m9l4j5l4L0O7J6k1j0k5p7j3J33O7p0n8J4m7n4J03J46
2617B08p2j32L0J4q0M8J59l7j53J0Q5p5o9J47P8j23p0P6k7j08R5J64o2j37J9J5
2643Cq0M8J58rj56j1M0n4K0J37J2j48n4P8l5k7J20O1j39o3P7j6p4R1Q7q7p0O0
2671c1oj26N9J75l2j37J6K9r2K5J92J2j68l4O4m2pJ57M1j86l5J04J0q0R2J03j15
2698a2r8J19J4j19L5J72l2j43M6N4j10LJ97K1j85k8J17n5o0J56Q9j69j05J19J4
2723D0j01J00J38j07j68J10P8r9mJ51k1j76L0J40p4j05J37R2j46m0O9k7p8J13
$$ y = [10, 2, 33, 47, -30, -92, -66, 3, 7, 15, 48, 3, -94, -88, -20, 20, 23, 44, 25, -59, -127, -54, 53, 53, 19, 19, -44, -102, -69, 37, 57, 15, 12, -8, -75, -78, 13, 68, 28, -11, 25, -17, -94, -36, 79, 78, 21, 9, 7, -66, -84, 50, 134, 66, 5, 12, -17, -61, 39, 137, 119, 25, 4, 5, -4, 40, 146, 135, 75, 27, 23, 17, 41, 114, 139, 90, 56, 41, 7, 37, 104, 120, 99, 89, 64, -13, -26, 107, 174, 104, 46, 60, 13, -41, 62, 208, 136, 4, 34, 48, -32, 16, 175, 138, -15, -5, 80, 5, -64, 83, 161, 38, -32, 44, 17, -91, 4, 168, 106, -31, -12, 3, -77, -29, 129, 120, -36, -47, -7, -61, -41, 96, 108, -40, -94, -16, -51, -78, 42, 103, -36, -99, -22, -38, -112, -21, 66, -21, -91, -31, -37, -163, -104, 71, 39, -98, -82, -53, -145, -120, 72, 84, -84, -118, -54, -96, -103, 54, 95, -91, -126, -22, -12, -92, 0, 103, -12, -110, 9, 23, -96, -61, 111, 79, -64, -18, 36, -74, -71, 126, 147, -38, -66, 51, -4, -64, 92, 181, 12, -93, 26, 40, -61, 39, 177, 70, -98, 12, 90, -9, -13, 138, 117, -59, -29, 111, 37, -68, 69, 161, 15, -25, 44, 17, -61, 52]
2747E2J21r8j19M8J5l7J00R3j25j22Q6O6p8L7J04q0j45J03J08j39n9J65K2j66
2771d8L0J38j26j30J92J44j98j22J74nj56P9K02j20j99J00J25j22m9J96j4k25
2793a34J7J80n3j05J02O6j53m5J44pj06M1J08q6n9J10k5r7M8J22o5q5M9J7j04
2818a20O3J70q0j72N1J08p7j5J49n2j76M5J93q8j37J32Q4j64l1J97m9k00Q4J99
2842A14j01j43J21O8j78LK13j3k17N5J31r6n2J37L3j74j6J67k5j29J04Q8j28n7
2866i5J29L5j31K2J03n7o1R9K5j34RJ32k9p6N8K9j25NJ82j1j58K1Q6o6n1J46O
2893I3j76PJ59k9j15Q6N2j39j7J78nj85J6J60n7j01J00M4j53j4J69Nj41K3Q4p8
2919c4n1J37L7j58k2J14%q1N5O9j06m0J00K4q1J5M8n6k9P4J6p2j2P8k7k6M1K0
$$ y = [52, 173, 75, -44, 4, 19, -18, 82, 175, 50, -72, 14, 80, 2, 39, 143, 63, -82, 21, 129, -10, -69, 96, 118, -48, -18, 120, -6, -136, 56, 200, 2, -120, 54, 49, -107, -28, 174, 54, -145, -45, 80, -42, -91, 105, 91, -134, -117, 63, 10, -95, 7, 73, -80, -125, 19, 12, -94, -53, 55, -31, -90, 20, -5, -102, -54, 68, 3, -82, -33, -16, -120, -57, 113, 33, -139, -88, 20, -57, -72, 77, 25, -151, -106, 87, -1, -138, -6, 78, -86, -117, 80, 31, -169, -85, 114, 13, -130, -9, 59, -119, -116, 97, 84, -133, -78, 53, -43, -95, 42, 75, -99, -115, 52, 27, -102, 2, 90, -38, -95, 34, 69, -62, -40, 63, 6, -55, 44, 69, -65, -56, 76, 47, -29, 29, 58, -67, -62, 120, 109, -49, -28, 58, -8, -59, 87, 93, -83, -76, 83, 54, -61, 25, 77, -62, -79, 99, 94, -91, -75, 85, 28, -73, 27, 71, -82, -96, 73, 78, -63, -40, 44, -34, -85, 52, 89, -69, -91, 23, 23, -58, -3, 66, -40, -80, 20, 44, -37, -22, 26, -30, -59, 15, 31, -41, -53, 25, -2, -28, 13, 33]
2947C3j01kR6K0p8K2J5n8j1J08Kj10OP5j4n2O9K8r9k3J20K0j30K1O4m3j9P4K4
2976E7j06j4R1J9o8L4L1p9k8R3M6q5j7O2k7n2O1M3o7l9N3M9m8j4K2l0lM0K2m6
3006@l1K8jj2L6K5p3j3L1J5j3J8J5p1JM9J7m5ML0m5j1N8J0q0MP9qn5J3L1n8OQ0
3040C4J8r7k2N8J3k3L4M4p6o5O6N7l2l2L0J2n4J7M7j2l6QL7j6l1J1J2l%K0J1l0
3072@l7JM1K7ok6lk0pL6M6pp7oN0Oj6L1Ql3l7M6K4m9oM5J4l8LJ0j4k5N1N9m2o4
3108a5J5K8%J3L6po4k6N4L4j9mQl4j8K4K9oj3lJ4k8mJ8J5j6J1L2n0l1PM4J8pq
3143D7pm6nM4N4rm0qj9j8L7L9Mm3nJ1j1kK6J4k8j3J2Lj5j6M4L1l9n0KJ6PJ2L6
3178F5%n7m6L0M2kLNl1o2RP2J0n4MM3m6n6M7P8n2n2O4K2q1l3P6L9n5lK8k8m7M9
$$ y = [33, -68, -70, 26, 46, -32, -10, 5, -53, -64, 44, 46, -64, -58, 17, 3, -49, 20, 48, -51, -74, 46, 66, -64, -43, 21, -22, -41, 33, 57, -49, -63, 28, 47, -21, 13, 44, -35, -63, 30, 76, -9, -26, 36, 9, -43, 18, 61, -6, -45, 8, 57, 9, -5, 17, -13, -16, 24, 46, 0, -31, -3, -4, -16, 20, 45, -28, -41, -10, 5, -8, 10, 25, -46, -45, 4, 21, -24, -20, 10, -35, -46, 12, 22, -58, -54, 25, 17, -38, -25, 6, -52, -46, 34, 52, -45, -67, -9, 4, -19, 15, 59, -17, -82, -16, 41, 9, -23, 7, 19, -35, -18, 29, 17, -19, -11, 26, 10, -21, -10, 2, -1, -1, 19, 30, 0, -37, -36, 5, 32, 26, 0, -3, -23, -30, 6, 52, 45, -32, -38, 12, 18, 2, 33, 41, 8, -29, 17, 41, -8, -14, 31, 45, 7, 10, 20, 6, -19, 32, 91, 49, -15, 0, 28, 28, 41, 77, 70, 6, -20, 34, 68, 49, 45, 53, 19, 1, 25, 54, 48, 35, 32, 46, 18, 14, 32, 47, 31, 42, 74, 24, -7, 0, 44, 62, 55, 47, 40, -6, -11, 33, 87, 78, 38, 30, 11, -7, 30, 69, 73, 30, 25, 36, 25, 23, 49, 63, 35, 22, 34, 37, 22, 6, 50, 81, 42, -8, -6, 10, 17, 29, 65, 65, 8, -38, -8, 34, 32, 35, 40, 9, -53, -44, 28, 38, -16, -12, 31, -15, -71, -24, 54, 2, -50, 14, 36, -45, -78, -2, 37, -18, -21, 7, -21, -68, -19]
3212a9P3j9m7J1j6k9K2P3%m4j0moRL1K1j2k8j6j2L5MQjJ9k2o2K2N8mj6PK1p4k1
3247d8O9M3k8j9K2l6l6M0P1l5l4L2j2m9J4P4ql1mL4m1j6M6K4k5qK2l8l4M9M2p
3279G3k2J4l0m1L8N9mm3oLk7oO3K0m2j4Nk2qL2L0k2j7Oj6k8J5N3%k6pj7j5J1L9
3314D8Orj8k8k1K8K3J5k2Mj3m0J8M8J4k2k5J5k2j2M9L0l8k0KPl6J1P2k3m1mK8
3347B4n4rQ8K5n6l9K5Pm6L9O5l9n8OL5l7pO3Qo8j2M4k3k6M9M8m7n4J5K9k0PM2
3380B4j1l5KPj0J7L6k1j0jlk8L7N7rm8JMl7J6O4Qq1LL9k3k9P5L4p7l2N9Lp9M3
3415eQ6l1q7K2M1m5nQ6K0j08MM8j8k7N6M3p5n3P6kl7K5O7l6o5L0J6k3J9O0k0n8
3447DRL5j6qN5j2n4%M0l0j9O7J3m5j5K3k5k7O1N3p9m1N1nl6L6O0n5o2L7L6n0p
$$ y = [-19, 54, 35, -12, -1, -17, -46, -24, 49, 49, 5, -5, -9, -15, -6, 25, 46, 34, 6, -10, -22, 13, 17, 25, 24, 43, 21, -41, -19, 39, 35, 19, 26, 47, -27, -48, 21, 64, 36, 17, 39, 3, -33, 7, 78, 43, 9, 41, 29, -20, -6, 68, 60, 29, 25, 59, 18, 2, 48, 72, 47, 39, 61, 23, -11, 38, 80, 73, 51, 65, 35, -6, 32, 91, 87, 44, 38, 41, 14, 8, 71, 91, 49, 35, 40, 18, 10, 42, 72, 50, 33, 39, 23, -5, 10, 63, 63, 37, 30, 13, -2, 9, 48, 54, 45, 27, -1, -22, 6, 29, 44, 22, 26, 13, -27, -9, 39, 53, 31, 6, 21, -1, -13, 36, 66, 28, 8, 10, 17, -19, -8, 64, 41, 0, -4, 24, -30, -39, 49, 74, 18, -21, 4, 11, -35, 4, 69, 30, -28, -22, 13, -24, -31, 32, 40, -28, -40, 4, -19, -45, 4, 52, 5, -49, -34, -5, -25, -18, 24, 13, -22, -20, -13, -23, -6, 30, 9, -1, -2, -5, -33, 4, 61, 52, 4, 5, 9, -28, -12, 52, 60, -21, -18, 21, -2, -31, 44, 78, 1, -31, 28, 31, -48, -5, 81, 50, -37, -15, 26, -19, -24, 62, 82, -26, -22, 26, 8, -19, 37, 80, 5, -48, 28, 26, -11, 14, 81, 45, -20, 10, 26, 3, 22, 82, 62, 4, 13, 48, 32, 24, 79, 67, 13, 13, 53, 23, 4, 71, 84, 39, 24, 47, 22, -5, 56, 109, 30, -11, 40, 35, -1, 35, 95, 40, -22, 15, 51, 1, -6]
3480fP0j7n2PL5l5j9O0K8p5l7P1qm3M7O1n7q0N4K6m2lQ4j9p2MM2k0j3O2J0q5j4
3513c6N7%l1L8J3l6l3M2Lk7PL6j5l5J6lj3KO1k3m9J3QmJL7j2o5ON9k6k1N5on1
3548c2J0M2j5n4M4M8n2m1O2K6p2NQ0j9p0J7N3n0j5N4K6o3j9O4lm3K8N1n3n6L4
3579a3N3l1qL2j1n1J9K9kk2J0J7k5jK6l5k0N2Nk5j4K6l2kN7K1n3k2K8mj9L6K8
3612D9o1k2P1J0o5PO8k3o2M5N1p1k6P2K4o6j4N7j7m4L4M7l6m1M0J5o2L5O5m3n4
3643a7J5M0l6k0O7k3m4OM5l4j6K4J7m0J2L6m0l5L1M2l2qK6l0l7M9M2k9m0L0Ll3
3675b9L0M5l9m6L8K9m2j6N3on7K4N9n7n1P4K4m9j8O7l8n3M0O3m9l2N2j0o3K1N5
3706A9op0J9M2m2pM5J5o1QL9j3j9L2Mm1J3L9k7m2K8L9j8qK5j7m5M3M5k0m1L1L
$$ y = [-6, 64, 47, -5, 2, 37, 2, -17, 43, 71, -4, -41, 30, 22, -21, 26, 87, 30, -50, 4, 30, -12, -15, 69, 50, -22, -18, 24, 4, -9, 53, 63, -22, -36, 21, 21, -10, 28, 41, 5, -28, 14, 17, -10, -3, 33, 18, -17, -1, -4, -17, -15, 46, 23, -26, -13, -5, -9, -8, 29, 17, -48, -42, 17, -9, -30, 25, 19, -32, -22, 20, 5, -49, -5, 43, -9, -50, 12, 38, -34, -29, 51, 32, -38, -21, 32, -18, -33, 21, 47, -16, -35, 29, 26, -17, 11, 62, 9, -47, -13, 40, 9, 1, 33, 22, -29, -10, 19, 17, -5, 5, 22, -3, -4, 22, -13, -33, 19, 24, -1, -15, 11, -21, -23, 34, 55, 2, -20, 8, 4, -15, 21, 49, -12, -34, 37, 47, -18, -11, 57, 34, -28, 17, 68, -3, -29, 43, 67, 1, -13, 44, 27, -17, 17, 64, 28, -13, 27, 42, -20, 15, 80, 37, -17, -2, 38, 2, -18, 49, 26, -18, -12, 33, -1, -17, 7, 24, -16, -4, 32, -8, -43, -12, 30, -2, -10, 16, -14, -51, -2, 40, 11, -29, 1, 4, -29, 1, 46, 7, -39, -1, 28, -14, -30, 23, 17, -40, -16, 43, -14, -65, 9, 33, -16, -34, 33, -5, -58, -18, 45, -4, -36, 16, 6, -57, -36, 19, 13, -57, -38, 4, -38, -45, 0, 15, -46, -38, 1, -12, -31, 1, 5, -36, -23, 16, -11, -53, -25, 14, -4, -12, 13, -4, -49, -6, 39, 19, -22, 9, 12]
3739A2m6J4P2l8m4L4J6k9j3O9k5n6K2M6j9m1L7K4m7OM1k8n0L6M0l1j4L7j9m2J8
3770a8O2j7n9K5K9m5kO1pn2pM5j1j6K8J6m2oL8%l2%K7j9J5J4j6j2RJ8oj0Rj2l0
3805b3L0L8k1l1J6Ol7J6N3k3m5J9L2j9k7L1J5n0oL7Pn3K0M3k6k6K8J3l9JM6nk3
3838cLRk2rM3kj3k4K8k6K4Mrj7J4J6j5KJ7j0j9K4K5j4k7LJ4j7NK2j3k9J5K8j8
3873I%jKl0J9K4j0l4J1J2j0%L1j8k6J2J9Nk9R%j3J7K2j2j8lJ5llJ8pl0J2K0Oj1
3910Ekj1J0J4jqNkk4OL0%j8j3K8rj4J4J6m1lM7%m0mK5j0j8K3K0l7k2L4J0k7LK1
3947Gkl0jL0lj7J8Nk0J6qj0MJ0QnJ1j7mlL6Pl6LmnnL5J5m2k0M1Lk6J0L1k9l8N4
3986A9K4n6pK9ml7K6K1l2j9L7J9m2MK8j4k8L0L0n5j3M6mk2J5L3m0j9M0Lm9K6L7
$$ y = [12, -34, -20, 52, 14, -30, 4, 20, -9, -22, 47, 22, -34, -12, 34, 15, -26, 11, 35, -12, -6, 35, 7, -43, -7, 33, 2, -12, 25, 6, -36, -18, 44, 27, -32, -7, 22, -23, -25, 36, 29, -23, -30, 15, 4, -12, 16, 32, -10, -16, 22, 22, -10, -10, 17, -2, 13, 27, 11, -1, 8, 26, 20, 10, 19, 7, -23, 7, 45, 24, -7, 9, 15, -22, -6, 47, 24, -21, -2, 30, 11, -16, 15, 30, -20, -26, 11, 18, -35, -15, 28, 2, -24, 4, 17, -22, -21, 25, 20, -3, 0, 9, -13, -22, 21, 19, 6, -18, 10, -16, 8, 12, 3, -14, 0, 16, 1, 3, 20, 10, -9, 15, 40, 26, -1, 2, 16, -1, 4, 26, 13, -16, -1, 27, 9, 9, 8, 10, -20, -1, 23, 13, -21, -10, 2, -8, -8, 23, 5, -21, -9, 10, 15, -14, -5, -5, -18, -1, 21, 9, -9, -12, 3, 0, -3, 15, 8, -22, -10, 10, 16, 5, 3, -8, 2, 16, 15, 7, 12, 10, -14, -8, 22, 22, 4, -9, 19, 10, -4, 10, 26, -15, -18, 29, 29, -11, -15, 10, 0, -18, 5, 25, -12, -34, 0, 10, -17, -14, 7, 5, -25, -26, 4, 1, -16, 2, 7, -13, 3, -5, -15, -11, -1, 7, 2, 13, -4, -8, -11, 25, 32, -4, -1, -5, -10, -15, 20, 35, -7, -27, 14, 17, -9, 1, 32, 3, -35, 19, 43, -13, -20, 9, 5, -32, -6, 15, -17, -36, 1, 20, -22, -18, 10, -4, -32, -2, 28, -27, -40, 6, 2, -20, -5, 28, -12, -31, 9, 12, -37, -11, 26]
4019B6k5l9L8L2l4j0M2ql2PM3l5k9L8K8l6pK6j9k3K3K4k5l0K8Rk0KK2k7k8L6K7
4052B4l6j4M4m0qL1J7o0NM7%m0RL6l4l9N6K9n5j1N3j0m7K6M8k9m0K7L5l9rM1q
4085Im6K4L9k7k8K8J5m1KL5j3l3K9mpMJ3ol1K8J7k7k6M7j9k3K3L0m2k8L7L0l3
4118b4qL2j1l5J9M0l5l6M3K2m8K1L1k2l9K2M2j9l2L2K4m8J0K9km4NM9k1k6L4K
4150Gk6rM0j3k1K0LqqmK4j5jknQJ1rj8K2mnmK2j2j4RJ0rj3J4J5j9KL1j4l6J4L5
4189A8pm5L7J5j9j9K8J3m0kM0Mk3jK9j0k3RJ9k8oK0K0k9oOOj8J3Qj0j4LJ0j7J8
4225arjmQj7j2L5Ll0%J1jL%J2k1j0J1Qj9KJ1mj6J9J7j6j5K2J3j1k2J8NmlKJ1l3
4264c8J4oNMJ3rk1K2J2l2J5%J1j5j3OLjPkj2jJ6qLLNj9nPKOKJMOj1lJ3K2k4Mn
$$ y = [26, 1, -38, 0, 32, -2, -12, 30, 22, -10, -3, 40, 5, -24, 14, 42, 6, -1, 25, 6, -17, 6, 30, 5, -25, 3, 12, -8, -6, 16, -11, -39, -3, 24, -12, -26, 18, -22, -30, 1, 18, -42, -37, 10, 10, -30, -21, 15, -19, -58, -2, 27, -28, -39, 14, 4, -43, -17, 31, 2, -38, -11, 24, -15, -24, 17, 9, -37, -13, 26, -1, -29, -1, 14, -27, -25, 10, -3, -36, -7, -11, -18, -14, -1, -7, -38, -10, 7, -20, -46, 1, -18, -41, -18, 12, -30, -58, -21, 9, -24, -32, 0, -11, -46, -27, 13, -22, -58, -15, 7, -41, -20, 11, -11, -50, -28, 14, -5, -37, -5, 19, -29, -19, 10, 8, -36, -31, 18, -3, -29, 5, 7, -19, -28, 12, -1, -22, -2, 1, -7, -15, -19, 5, -10, -11, -13, -18, -10, 1, -8, -26, -4, -8, -13, -17, 5, -7, -21, -12, -2, -11, -24, -10, 5, -14, -12, 19, 5, -31, -17, 18, 11, -34, 3, 18, -1, -20, 8, 21, -19, -21, 19, 23, 0, -1, 28, 18, -5, 4, 23, -5, -11, 9, 29, 0, -6, 0, 6, -12, 1, 9, -1, -15, -12, -2, -19, -1, -10, -11, -15, -7, -24, -36, -1, 2, -28, -28, -17, -18, -15, -15, -3, -24, -34, -23, -15, -34, -32, -21, -25, -41, -22, -5, -21, -36, -14, -1, -12, -34, -16, -11, -15, -18, -16, -5, -38, -24, -30, -25, -21, -8, -17, -38, -16, -4, -36, -21, -21, -10, -25, -38, -32, -29, -30, -23, -25, -37, -38, -22, -30, -27, -24, -19, -38, -43, -36, -34, -28, -26, -25, -21, -15, -26, -29, -16, 6, -18, -14, -19]
4307a9Nj2NJ9Lk6jK3%jPRj8mPrKJ0J2rlMoj7mL3Lk0kNKJ6j9oJ0Rrj5J0J3j6j1
4349b0KJ1j4RJ1PqjJ5j3j0J5Rk5J2J5ok8K0K0k6LMQk5J9J0Ok8J5lj5kK5%k7JK5
4387A1ok0L3qk6nK7k0k0K6J4j2j8J3kj7J8Lj7oJ1Nk8K2K1j3j3LJ1j3OK1pl7K6
4422a7Jj1JM4lm3J0L1k9j9K7K2l2qL5j3l1K6L6m1j9L8jl5KN2j3m2J7K1l4JL8j
4456A0l7%L0j2k3L6Ql6PK4ll2K5L0k8j6L2nm2K2M2l0k3L4Mm2J9M8k0l8K7J8l7
4489hJL9J2n4K3K1k8j8M4J2n5J2L7j1m8K4M9m1k6M0K2o5J0M5j3n1K8K3k9j6L7
4520A6J9m6oK8rk5M0J3l6j9K8J0k3J4K3l1j3K9ll7L4J8l0nK6%l0lO0k4m9M1K0
4553C0m9j3N8J9o5qN8k2l8M1L1p1j0O2Ko2J7N1m0l9M4K4m7rM1qk1K1Pk5k1N0m
$$ y = [-19, -14, -26, -21, -2, 1, -25, -26, -3, -3, -4, 3, 12, -6, -10, -3, -12, -10, 0, 12, 3, 0, 4, -2, -19, -23, 10, 13, -7, -9, -4, -2, 14, -5, -11, -1, 8, -1, -16, -6, 7, -9, -20, -18, -7, -21, -12, -1, 6, -2, -3, 12, -1, -11, 4, 13, -12, 0, 15, 9, -19, 1, 21, -5, -2, 2, 10, -15, 4, 14, 20, -8, 7, 4, -11, -13, 12, 12, -15, -14, 11, 5, -15, 18, 10, -16, -21, 6, -14, -34, -8, 6, -6, -24, -11, -13, -30, -12, -9, -26, -32, -21, -16, -44, -22, -1, -14, -27, -24, -13, -26, -20, 1, -6, -43, -17, -16, -27, -26, 18, 15, -28, -18, 13, -16, -35, -8, 14, -18, -26, 9, -4, -35, -9, 27, -14, -33, 5, 4, -31, -29, 23, 10, -32, -15, 6, -28, -27, 11, 10, -27, -27, 3, -9, -32, 4, 12, -24, -17, 7, 4, -28, -3, 27, -1, -17, 15, 10, -32, -10, 32, 2, -21, 13, 17, -25, -6, 42, 22, -16, 11, 29, -8, -7, 32, 44, -10, 13, 34, 6, -12, 32, 44, -11, 1, 38, 27, -21, 3, 52, 11, -15, 25, 47, -18, -8, 37, 24, -27, 1, 24, -5, -21, 16, 35, -11, -17, 11, 2, -23, 17, 30, -6, -25, 3, 13, -10, 4, 27, -4, -17, 12, 9, -28, 6, 24, -6, -11, 15, 15, -15, -18, 42, 18, -31, 10, 30, -19, -32, 26, 45, -20, -28, 30, 8, -30, 11, 42, -29, -39, 23, 25, -37, -20, 31, -9, -48, -4, 20, -27, -36, 5, -3, -24, -3, 4, -21, -42, 8, 4]
4586Dl7K2J9k9rN3om5J4L9j1l5L9J9m3j9N5jl9K7K8l8k2M9K2n0k1N4j3m1K4K2
4618C1m3nM5J7m8lM0k8k4L6J4m5k3N8pl4K2K7k6m1O1nm1J1L6k5k8M0J2l1j5M3
4650B1j0l3J9J2j1k8M9J3l5pK6qj3K9K0m4pL0%k8J6K8l3l0M7J2m1jL2k9k7L7K2
4683B8l4k3N0j0l8OL6l0k2M8K0m5k6L4J1k6QL1k7k5L5K1l7OJ3Jk7K9J2qk0K4k
4716A3j7K1Oj2nJ0pj2J4J3j6j1J6K7m4j1L0Jk0J3K2l2j9K5Rmk5K5ql1L0K1l5p
4750b0K9kj1LQj6j8K9Qj7oJ8Nk8K6mloRPj0OJqOOQnj5RNonJ7lk2PQp%LrrJ6J0
4795A4j8pM%k8K5Rj8oQNoRKj1j2K2MnqJ3j3j8K6Rj8mK0jj5kJ4oqJ7Jj0mLJ8Rl
4837A1jj7pNJ0j0J7Rk7OpJ0KNrJj4J5pJ4k%j2nJ2jj1JK2Nk0kNoJ3J3oj6j8J5J6
$$ y = [4, -33, -11, 8, -21, -30, 23, 17, -28, -14, 25, 14, -21, 18, 37, -6, -25, 30, 29, -10, 17, 45, 7, -15, 34, 56, 6, -15, 39, 26, -15, 9, 31, -12, -17, 28, 45, -3, -6, 34, 6, -18, 18, 32, -13, -36, 22, 15, -19, 3, 30, 4, -37, 24, 19, -22, -11, 25, 0, -28, 12, 24, -7, -22, 21, 11, -22, -3, 9, -2, -30, 19, 32, -3, -10, 16, 8, -5, 24, 44, 0, -7, 23, 23, -5, 11, 39, 6, -24, 23, 35, -6, -7, 25, -4, -31, 6, 28, -6, -29, 21, 11, -27, -21, 15, -15, -37, 11, 31, -14, -40, -6, 5, -21, -13, 18, -9, -34, 1, 22, -15, -9, 4, 5, -22, 7, 19, 11, -9, 15, 13, -4, 17, 23, 11, 6, 16, 9, -3, 11, 24, 8, -3, 13, 40, -4, -15, 15, 16, -4, 9, 31, -1, -20, 5, 14, 10, -15, 10, 2, -29, 1, 22, -13, -20, 9, 7, -4, -1, 7, -9, -27, 2, 10, -7, -13, 5, 10, -18, 8, 4, 1, -5, 4, 11, 1, 7, 8, 0, 6, 12, 20, 15, 0, 9, 14, 8, 3, 20, 17, -5, 2, 10, 3, 3, 6, -3, -12, 4, 14, -4, -11, -7, -7, -35, -10, -1, -19, -25, -17, -12, -18, -9, -7, -18, -30, -8, -4, -9, -17, -4, -17, -35, -9, 0, -18, -22, -2, -3, -18, -20, -6, -12, -20, -3, -2, -12, -16, -13, 5, 14, 11, 10, -7, -14, -9, 1, -9, 8, 17, -10, -4, -11, -1, 1, 6, -3, -2, -16, -1, -8, 6, 4, 4, -8, -13, -1, -2, -13, -12, 10, 15, -5, -7, -2, -8, 5, 18, 12, -4, -22, -7, 9]
4878Ij0K6rj0k4K5J3Jj1QJj7%K8j1lLLoj0JJ0JJ1nk5MjLJ0%Mk3OKLj0J2Kj0k0
4919a9J2J0j8J1J6kl0RJ1Kj6J6Kj4j4K2nj1J6J9k2k4J8K9j3JQk0j6kL6j1Nj2P
4954Ak1RK3j7oJ0Jj6NJ1k3JK0Mk3j2J4Rj2J1Rj7j7J0J9ojJ6k5j7OK1nMK0rl1J7
4992a7K2rrpL4m9J5K1J1j6J5J4k0k4K4Oj3QK6k5l3K6J0Pj6K8j8k5jL1J1k3oJ5
5026A3k2lK0qnK6ml1jNJ7j4JJ8rk9J8J9j5KK4k2k1K4J6k1pL0Jl5J0L7j1k8K3J9
5062C7l3j0K8mqKJ5k5rJ5K5l0kK1j1k5J2J7Nk1J6Qm0J4J1Pj8J4rk2kK1Mk4J8R
5098Fk0k1K3J6k9LJ7ok4J3K2qKJ4j7mkK8k7j5L0j2llJ4K1j9LNk6%L0%j5QJ9j6
5135Gl0K0J5k7J2Rqj5mK6j5nJ7J2l6lJ9J0j8NJ3k2j9K1K4k0MLPj7RP%j3J4kj5
$$ y = [9, -1, 25, 16, 6, -18, 7, 20, 21, 10, 18, 19, 2, 2, 30, 19, 16, 19, 22, 16, 6, 7, 17, 18, 29, 24, -1, 3, 2, 5, 15, 15, 19, -4, 2, 4, 7, -3, 9, 11, 1, -19, -7, 3, -15, -4, 12, 10, -20, -11, 0, 2, -14, 2, 4, -10, -24, -2, -7, -18, -2, 17, -5, -29, -11, 18, 5, 6, 14, -6, -22, -24, 12, 1, 6, -6, 1, -20, -11, 12, -5, -11, -1, 0, -16, -11, 0, -23, -22, -2, 2, -21, -33, -19, -10, -22, -11, -2, -19, -36, -26, -7, -13, -14, 2, -23, -40, -34, -13, -18, -14, 6, -3, -34, -17, 5, -4, -13, -20, 14, -35, -20, 1, 12, -4, 11, 25, 5, -19, 5, 11, -2, 6, 32, 7, -26, 0, 10, 17, 1, 29, 11, -14, -15, 16, 27, 4, -2, 13, -9, -12, 8, 0, -5, 21, 17, -14, -15, -10, 7, -7, -6, 12, 3, -26, -8, 11, -4, -2, 22, 0, -21, 3, 19, -2, -9, 21, 22, -13, -3, 34, 23, -5, 18, 37, 4, -6, 22, 18, 10, 12, 27, 2, -7, 8, 33, 3, 1, 22, 11, -14, -2, 15, 20, -1, 15, 23, -17, -3, 8, 15, -3, 11, 2, -20, -22, -1, 3, -21, -3, 6, -14, -35, -12, 4, -25, -22, -5, -11, -35, -22, 0, -8, -6, 8, -9, -13, -15, 13, -14, -29, 1, -11, -14, -17, -3, 18, -1, 2, 7, -19, -19, 11, 11, -4, 4, 23, 7, -23, -3, 12, -15, -3, 6, -2, -17, -21, 5, -10, -15, 2, 14, -22, -25, -6, 4, -14, -9, 4, -18, -37, -16, 8, -12, -8, -5, 2, -15, -6, 1, 1, -12, 2, 0, -15]
5172a5K2j4KJ6J0j7j0LJ8rKJ0Rl1NJ6noQJ5k3k0J7Rj3PJ8k7k0K1J7pj1mJ2j1J
5209e%Pj0MOrj1J6koJ1Lqj6K0Qj0JLqkLJ4J1j0JopLJ3Nj2LJrMJLQj1Nj4J4p%L
5255Hlmp%M%%MLj0j5OJ9nqkOLonJ4nmOookOKLJ0kokJ2J0k2mK1j4j5J3J3Kkj0J0
5302A0rJ4J1j6j2Mk%mNNpj1J7j1qJ6j0j1ORj2lNNqOLj0jKJ8j6oJJ3kj6K2Jj4Q
5344hOj2JK5pmj0K3mj1JK0j3j4RJ1j4mQNpQNrj1J3Mj9K7j9moPJ0j1j0J8lj6K0
5384EqqJ0j1J1j4QJ3Jk2K0J6k2LJ4jj1LJ3k7NK5j1j8OJ7j2j9K9J5k2j0K4Pl9Q
5420bJ8j6NQj2njOOk1RJ2j3mRLj4%Pj6qJ4J0k0QJ0jqMNpj4K3joJ3njkJ3jllj1
5464a2J0NmJ8k7%K0jj3J1J0k9oJ3J8j2j1J8pj2PNmj2J4Qk1PPj4pQRolpJ8j5MN
$$ y = [-15, 7, -7, -5, 11, 21, 4, -6, -3, 15, 6, 8, 18, 27, -4, 1, 17, 12, 6, 14, 29, 6, -14, 3, 12, -1, 6, 24, -3, -23, -2, 15, 8, -3, -7, 5, -6, -5, -5, 2, -8, -4, 2, -7, -18, -2, -4, -10, 1, 4, -4, -20, 0, 8, -2, -1, 2, -6, -8, -5, 9, 20, 10, 11, 5, -2, 1, 14, 19, 7, 10, 11, 2, 6, 7, 10, 18, 7, 12, -2, 12, 5, 5, 8, 5, 1, -6, -6, -2, -2, -2, 2, 5, -5, -20, -14, 5, 0, -8, -10, -4, -1, -7, -12, 2, -3, -7, -1, -7, -13, -15, -9, -7, -4, 6, 4, -2, -4, 8, 18, -4, -8, 13, -1, -16, -3, 10, 12, 10, 0, 10, 1, 15, 26, 10, -2, 2, 0, 0, -4, 1, 6, -1, -12, 5, -6, -14, 2, -8, -19, -13, -4, -16, -19, -14, -9, -17, -11, -8, -18, -19, -17, 1, -15, -21, -20, -7, -9, -25, -3, -2, -16, -8, -2, -14, -13, 12, 5, 1, -9, 14, 10, -1, 0, 20, 7, -7, 2, 13, -1, -5, 3, 8, 1, 9, 14, 5, -6, 7, 11, -8, 19, 0, -4, -10, -3, 7, -4, -14, 4, 1, -15, 5, -3, -11, -1, -12, -1, -15, -7, 6, 7, -15, 5, 21, -1, 2, 16, 15, 4, 7, 20, -7, -2, 23, 12, -6, 0, 17, 5, -14, 15, 30, 8, -2, 22, 29, -10, -2, 16, 0, 5, 13, 1, -4, -5, 1, 7, -14, -5, 7, -6, -10, -1, 2, -12, -12, -5, -21, -29, -15, -5, -25, -17, -7, -8, -16, -12, -7, -14, -28, -5, -6, -12, 1, -4, -5, -7, 6, 5, 2, -1, -12, -2, 3, -1, 17, -10, -10, 10, 9, -4, 7, 17, -12, -18, -5, 13, 1, -10, 8, 1, -11, -4, 1, -3, -15, -1, 7, -14, -7, 0, -14, -21, -13, -4, -10, -13, -20, -2, -17, -13, -8]
5504hKlJ2rMoJ0mj0J1RpjJ0rmJ2Mj0KJ1jj4J3oNj4J8jk1LK2lqOj4N%nJ2j1lrJ1
5548AoNOj1RoqoOPpjJ5j5j%J1j2JJ6nokJJ2j2jJ9j0MkLklrJ9mLokjNjKJ2k4%L
5596cnJ0qnRj0LOOj4RrpOJ3j6%qJ5lMj5J4JmljjJ0r%K1qpNKrOOJ7j8OmLOmJ1%
5644A8j3jJ3mj2J4Lj0j6K0rJQOj0k0RjOkJ0k0OlJ7j4mNMk6MK0mrK1Kj8%J6kj2
5685gJ4j0%JQqj1J6Roj2lJ0jJ1JmnnJ9j2QqJ0k4J4%krONj9%J4rkJLKj7PJLj3K4
5730@j9k0K2Rj2NM%qjJ8Mj6OKj3PNJ4j2LJ3qj0KRnjJ6qlJ1j5J2mJ2j0Kj9J7Qj0
5772GKPj4j6K2lnJKj6R%kjN%J3k6JJ3olJ4%j1lJ3J5rk%kk1L0OrkQj1j3J7%pJ2
5816A5Mj8JNJ1j9J9ojj7kJ6kKNKj8j4J8j0K%Kqj7J5J3qKJj2%LPRnoL%pK7j6jl
$$ y = [-8, -6, -9, 3, -6, -2, -8, 2, -2, -12, -1, 8, 1, 0, 10, 1, -3, 9, 13, 3, 5, 16, 15, 1, 14, 8, 13, -1, 17, 16, -5, -2, 20, 17, 9, 15, 1, 6, 6, 1, 13, 2, -1, -10, 1, -5, 0, 6, -5, 4, -2, -10, -16, -10, -3, -10, -11, 4, -11, -12, -12, -1, -13, -12, 4, -1, -7, -9, -8, 4, -8, -9, 10, 0, 4, 2, 5, 3, 0, -9, 10, 6, 9, 3, 1, 0, 5, 4, 6, 18, -6, -6, -3, -8, 2, -6, -11, -2, -12, -9, -3, 3, -11, -2, -11, -18, -12, 1, -15, -15, -23, -8, -11, -7, -22, -8, -7, -11, -14, -15, -16, -6, -15, -15, 6, -2, -9, -4, -2, -11, -5, 1, 18, 0, 6, 2, 5, 11, 7, 18, 18, 5, 4, 17, 13, 1, 15, 18, 8, -8, 12, 3, 4, 12, 18, 8, -12, -3, -4, 2, 0, 10, -10, -4, -7, 10, -4, -8, -3, 1, -25, -21, -1, -5, -14, 7, 9, -9, -9, 7, 5, -7, 7, -3, -3, -2, 6, -2, -13, 3, 12, 6, -6, -9, 1, 0, 11, 12, 8, 3, -2, 17, 5, 13, 5, 15, -9, 5, 5, 3, -6, 0, 5, -14, -14, 0, -9, -11, -10, -7, -5, -22, -15, -14, -11, -24, 0, -19, -39, -17, -8, -20, -15, -11, -11, -19, -20, -2, 2, -14, -8, -6, -19, -12, -7, 7, -5, -2, 11, 3, -7, -5, 4, -1, -2, 14, 6, 3, 14, -1, 11, 7, 19, 9, 11, -8, 9, 17, 7, 9, 16, 2, -14, 8, 5, 0, 1, 3, -13, -4, -4, -6, -7, -2, -2, 11, -15, -14, -1, -7, -10, 4, 4, -7, -10, 3, 18, 9, 7, 7, 5, -16, 14, 20, 11, 9, 17, 6, -7, 10, 10, 3, 15, 19, 1, 2, 7, 18, -1, 18, 12, 11, -6, -8, 8, 6, 8, 13, 15, -3, -17, 1, -9, -7, -7, -5, -13, -30, -15, -2, -10, -8, -7, -19, -19, -16, -9, 0, -5, -11, -8, -8, -15, 12, -4, -5, -8]
5860hJ2nk1K2Qj5J1Mj4lJ6J1j2NRj8poK7j0JmQqrJ7qn%J5k5J0KPj6J4j5lMNrK
5902a1J2Nj8j3J6QnOJ7k3j5K1mPknRj3NJ8oKoJ4rj4J8J0j3mJ6kj1JP%nlKoMJ1
5944B1nJrkjNJj6RKMj4m%Pj2NJ3j4kJ5mk1J5Rjj0NJ2j0JKpqJ1RljM%j2NJ6nJ0
5989B1j2qKlJ6k1J4p%PqKPNpJqjj4J6jmrJ4k1jNOjj8J4Qj1LL%Lj6J2LmOjoRRr
6036eMLK%MorJ3MqJJ2p%NNj1OoNJroOl%KJj2PKoPlMpJ4k7PJ8rlKlj2ROJj0J2%
6087ArK%Oj7J2J7j1j3K6qPj5J7%j4LNMj0JKlKQnj1PpnJ0jnpMJoJJ1j1NjlPj9K1
6133aQk8QjPpnK4j4j5J2J2j4MJ9j6oJ2J7j7rK0lj5J9%j0oK9nplMOk4NK6k1j0J2
6173GLj9PPoj5J5J8l4mK2J0l0JK1nj8J2Mpj1K0j0j9K0K1j0j3J6j2j2J1J5mj5N
$$ y = [-8, 4, -1, -22, 0, 8, -7, 4, 8, -6, -9, 7, 18, 6, 11, 20, 2, -5, -11, 16, 6, 7, 3, 11, 3, -6, 11, 3, -2, -2, 13, -12, -2, 0, 7, -9, 5, -10, -13, -9, -4, -13, -11, 1, 6, -12, -25, -9, -1, -6, 0, 17, -6, -21, 0, -4, 3, 1, -4, 5, -8, -3, 15, 9, 11, 5, 19, 10, -4, 14, 24, 11, 7, 23, 21, 10, 11, 18, 18, 13, 10, 12, 6, 10, 21, 16, 17, 8, 6, 5, 10, 11, -5, 4, 6, 10, -4, -8, -8, -1, -13, -8, 5, -9, -11, 4, 0, -21, -6, 3, 2, -8, -3, 9, -1, 0, 2, -5, -13, -2, 7, 4, 3, 7, 7, -5, 0, 16, 11, 21, 9, 1, 3, 0, 16, -5, 9, 2, 2, 9, 1, 3, 10, 15, 8, 9, 1, 0, -14, 2, 1, -3, -12, 2, -19, -20, -15, -9, -10, -28, -14, -6, -17, -14, -11, -11, -8, -24, -12, -9, -13, -7, -8, -14, -5, 4, -5, -1, 2, 4, 4, 8, 2, -7, 6, 10, 2, 3, 15, 8, 8, 13, 18, 7, 13, 7, 12, 13, 4, -2, 4, 1, 1, 3, 4, -8, -1, 1, -5, 2, -1, 3, -4, 10, -17, -10, 8, -1, -4, -2, -5, -17, -8, -2, -1, -11, 1, 1, -8, -6, -6, 0, -17, -5, 12, 1, -12, 14, 6, 13, -2, 15, 15, 1, 4, 9, 13, 3, 4, 6, 3, 5, 13, 8, -3, 4, -3, -8, 2, 1, -4, -11, -7, -6, -12, -11, 0, -11, -6, -7, -10, -3, -22, -1, 7, -21, -13, -14, -7, -14, -19, 5, -9, -24, -12, 0, -14, -10, 9, -7, -13, -1, 16, -1, -10, 10, 7, -8, 11, 11, 1, -5, 24, 19, 12, 9, 13, 19, -5, 0, 26, 5, -5, 7, 10, -9, -2, 5, -1, -16, -1, 17, -17, -21, 1, 11, -19, -18, 3, -2, -20, -8, -4, -11, -22, -2, -12, -31, -11, 10, 0, -13, 3, -9, -21, -10, 5, 1, -14, -9]
6209iJ6j3rK0nKJRj6jJ7Qj4j2K6j4j6J5Qj6qK6j5pK%lpJ3J2pj1J7Jk4OJ9nk1J5
6249@Mk1RMj6j2M0Lj0j3J0jk1J4J7j1qQJ0j8J0Rol%K0j6KJ1kqNokj3K5lr%J1j3
6290@j3J7J5k2LJ5ok9PK1k1MMKrJJ2Rl2NRqRlJ7k0NJ4j4oJ9Mj0kJ8j4oJ1Mkk2
6331a4K9lj0PP%j8J4krjJ0LnmRj2JrJ4oqK4j6nj1K5j4pKKj6PJ5Lk0J5lj4KJJ2
6373ej0JJ8j4j7K7Oj7J3pJj1J3JNk0J7JKLQj9Rj0J2j5NJ2j2j1J4Kj2jOJ1j7J2
6411AOj2rJ0qLlJ5qp%Rj1jjQKj0J1J5k0NJ2moJ4Qj9nJ6Lj2J9oj9J0MloJ9jkj2
6454EMMj5J2lroK6Jj5rRmj5J5kJrJ7j1Qqkj0OMjKk%nqNK3j5j0J4Pj1PJmOoLrN
6501dJPnJ4nJlPjj0%N%J%lJJMk0KJJ5k0MLNrj1J1NlklrMLkOMjkoMkjJ5jq%MjN
$$ y = [-9, 7, -6, -15, 5, 0, 2, 3, 12, -4, -5, 12, 20, 6, -6, 20, 6, -10, 5, 13, -3, -11, 15, 0, -7, -5, -5, -8, -15, -2, 10, 3, -8, 9, 10, -14, -8, 11, 6, -15, 0, 4, -17, -8, -4, -20, -32, 8, 11, 1, -12, -2, -3, -24, -10, 7, -4, -12, -4, 6, -12, -2, 7, 1, -2, -2, 18, 2, 4, 15, 13, 5, 10, 4, 2, -11, 14, 11, 2, 2, 13, 0, -13, 4, 19, -3, 0, 15, 9, -20, -13, 8, -13, -9, -5, -3, -12, -11, 1, 10, -22, -17, -8, -16, -7, -10, 7, -13, -8, 6, -8, -14, 5, 9, -1, -3, 15, 1, -5, 6, 10, 8, -14, 15, 12, 2, 9, 16, 16, -2, 12, 10, 1, 0, 10, 13, 8, 4, 13, 1, 2, -7, 7, 1, -7, 17, 1, -4, -15, 10, -4, -11, -9, -7, -23, -16, -1, 2, -18, -3, -6, -20, -18, -17, -5, -15, -14, 4, -10, -27, 0, 6, -11, 2, -5, -4, -15, -2, -1, 4, -16, 1, 2, 4, 7, 15, -4, 5, -5, 7, -8, -3, 9, -3, -14, 0, 2, -10, -11, -5, 6, -11, 1, 7, -5, -14, -4, -12, -9, -12, 3, -5, -12, -12, -3, -14, -15, -16, -8, -6, -16, -5, 10, -10, -5, 7, 3, -3, 11, 19, 0, -5, 11, 14, 2, 21, 15, -4, 6, 10, 7, 1, 20, 19, 17, 5, 9, 13, -2, 10, 7, -2, -8, 18, 19, 4, -5, 4, 0, -15, 0, -2, -1, -10, 7, -4, 4, -4, -6, -16, -10, -6, -7, -5, -7, -7, -12, -20, -15, 8, -7, -17, -3, 4, -7, 0, 1, -3, 3, -3, 0, -9, -4, -3, 4, -1, 13, 8, 9, 6, 13, 12, 2, 2, 7, 7, 8, 8, 5, 6, 7, 11, -9, -7, -6, 9, -11, -7, -4, 1, -8, -19, -8, -3, -6, -8, -11, -20, -16, -13, -15, -9, -5, -6, -8, -14, -10, -12, -13, 2, 1, -7, -7, -3, -4, 1]
6554Ak0J2JNlJ8rj1J2Rj2llOjJ4j4jjJOj4PkmoRkrMKlK%Nn%JNrnJ2k8J2J6%j3
6601a8J3Kj0MLPo%MMj4J1LPoJ7j8omJ5JljJ2j6KK2k1O%jMKmlj6OLNj0L%r%J1K
6647Ck1J8nqpJ7Jj7J1MnLPj4oJ1J0J3k5pK5j3N%J4j6OQ%oKJ9l2J7Lnj3nL5j6p
6688DJ0rpKJ2j2jLRk0POOk5J3NrpJ1J0j5QOnj5J6%j3rL2nj7RMPonJ8k0kK1lj7
6731cJ0Oj0RKnj4JK0r%MKj5rK5lj5J1Ljj5J6oj0nJ4oj0J0J3j8lLNj5PK1k2kKJ6
6773Dk4LK1mj3J4Qk6RJ0NjOjmj2J0J3k0OJ8j3oNJ4rnkK2l0%K3qj5J7Qj4rJ0Lj5
6814bORj3oQPj5mK2j7j1J4J5j7j0J9Nj1%Qjj3J5J1j8qK8Ml7J5J1mqJ5Pk3QJ7j6
6853A0OKnrQLlpNOj6%QJ2j5j3J7j3nJ6kj0pP%jPjj6J0JlkJOJj7J1LnkJ9qoJJ0
$$ y = [1, -19, -7, -6, -1, -4, 14, 5, -6, 6, 15, 3, 0, -3, 3, 2, 16, 2, 1, 0, 1, 7, -7, 0, -2, -6, -12, -3, -5, -14, -10, -8, -11, -9, -9, -4, -9, -9, -8, -3, -12, -17, -5, -33, -21, -5, -5, -18, -5, -3, -13, -9, -6, 1, -5, -5, -1, 3, -11, 0, 3, 10, 4, 21, 3, -3, -7, 8, 9, 6, 5, 17, 1, 3, 25, 4, 10, 10, 9, 13, 15, 11, 8, -8, -2, 1, 6, -4, -1, -1, -10, -10, 1, 3, -18, 0, -5, -13, -20, -3, -2, -19, -8, -4, -9, -6, 1, -13, -19, -8, 2, 15, -10, -17, 8, -5, 0, 0, 14, -2, 4, 12, 12, 6, 8, 27, -5, 12, 15, 10, -3, -8, 27, 11, 4, 14, 5, -2, 0, 12, 0, -1, 2, 11, -9, -2, 4, 10, -15, -2, 3, -6, -13, -2, 8, -7, 1, 7, 2, -13, 3, 3, -10, -19, 13, 8, -9, 0, 4, 11, 5, 0, 18, -2, -4, 17, 14, -3, 7, 13, 3, 12, 14, 9, -5, -4, 16, 7, 7, 11, 13, -2, -11, 14, 11, -4, 7, 10, 9, -6, 10, 4, -6, -11, 3, -3, -13, -3, 10, -8, -11, -8, -3, -18, -11, 10, -12, -14, -12, 4, -20, -17, 4, 0, -13, 1, 9, -17, -8, 2, 7, 6, 12, 11, 7, -5, 5, 18, -2, 4, 22, 9, 3, 8, 22, 13, 8, 6, 28, -2, -2, 21, 13, -2, 15, 23, 9, 0, 10, 13, -2, 4, 13, 0, -6, 2, 9, -6, -10, 12, -5, -16, -2, 13, -4, -14, 5, 10, -1, -1, 7, 6, -7, 8, 19, 1, -7, 21, 25, -12, 3, 14, 10, 2, 17, 24, 1, 9, 26, 10, 16, 18, 13, 4, 12, 15, 12, 5, 10, 16, 0, 0, 8, 20, 5, -8, 9, -4, -9, 7, 5, -5, -12, -5, -5, -6, 1, 0, -16, -6, -5, -8, -10, -9, -3, -2, -19, -8, -5, -10, -12, 7, -1, -7, -6, 4]
6899DmnJ8j1JjKJ0k1KJ4k2J3MJ0%%k3K3j1MmRrmjOnKrKLJ1j2MLj2oROmj2QkOj0
6945a4J3mlJ3qJ2pj0J3kP%LqJ0Oj0pRNj1PoJ7oqQj8kJ2j0J1%j%nKjONj7qRqJ2
6990Fj6%%NJ3j1nK1j8J4rmloJ7mOj7NOMmJ0kmrkJ1PJpPoj8J6J7j3qJ6onKoJ4j7
7035bRJ2k8K6j4mL%pMMrOj5J2olQj3LNj8K0oJj0QOJ4oj0J2qNlJ3j3MJ3mmkPN%
7080A5MLqKkmjOMj1J4mpMrqJ2JOpqRnkj%j0J1JMj3jKRqpJ4opLQnMoQQooJNKMk
7133A0J1kknjJjoJ0MJj5OklJ0jj3mNkK%qJ6j9oJ5krLJ0lj4JQkOLlqmKJ0lKmM%
7182bpK1j8N%JJ0MkMOj5LJNpJ0j5Rj%LqnQJ1r%KnkknJ2j5JR%k0J4J%mq%QkpRj0
7232a2QJ0rQqnJ0j1J6kJ5olnMmOqPJ3nkRkj3j3J9joJ1pJnmj0J7koLkLpmpJ7j0
$$ y = [4, 0, -5, 13, 2, 3, 2, 4, 14, -7, -5, 9, -13, 0, 4, 14, 14, 14, -9, 14, 3, 7, 3, 12, 3, -1, -2, 4, -1, 1, -8, -6, -3, 8, -4, 0, 3, -9, -15, -6, 0, -4, -16, -8, -10, -4, -14, -1, -5, -8, 5, -3, 9, 2, -8, 5, 3, 10, 10, 13, 5, 15, 21, 11, 4, 13, 18, 7, 14, 8, 25, 19, 11, 19, 1, -1, 11, 1, 12, 12, 11, 11, 6, 8, 7, 13, 18, 1, -7, 2, -6, 6, -10, -10, -10, -5, 8, -3, -8, 13, -5, 9, 0, -4, -7, -13, 4, 0, 6, -11, -6, 0, 4, 0, 10, 8, 4, -5, -7, 4, 11, 12, 5, 12, 6, -12, 4, 21, 8, 0, 16, 10, 5, 7, 1, 15, -2, 7, 19, -9, 17, 3, -1, 2, 2, -5, -1, 3, -6, 0, -15, -3, -9, -12, -4, -17, -14, -9, -27, -7, -13, -12, -22, -14, -8, 6, 0, -10, 2, -6, -1, -4, 9, -4, 0, 13, 9, 5, 3, 10, 15, 15, 19, 22, 14, 16, 14, 10, 9, 15, 19, 8, 22, 18, 11, 15, 6, -2, 10, 11, 17, 10, 2, 11, 6, 4, 3, 3, -7, 4, 5, 9, -4, -5, -3, 6, -2, -9, 5, -1, -8, -5, 3, -2, 2, -4, 4, 12, 6, 0, 1, 6, 8, 12, 10, 21, 19, 17, 12, 11, 12, 11, 5, 15, 19, 20, 5, 11, 9, 6, 16, 15, 2, -2, 3, 1, 3, 3, -5, 11, -8, -14, 1, -1, -10, -7, 3, 0, -14, -13, -5, -7, -1, 2, -1, -9, -13, -11, -1, -4, -2, -6, -2, -2, -9, 12, -6, -1, -1, 0, 10, 14, 12, 16, 22, 7, 10, 11, 16, 9, 19, 4, 13, 12, 12, 15, 7, 2, 10, 21, 12, 12, 14, 9, 7, 5, 0, 12, -3, -2, 7, 7, -13, 1, 2, 2, -2, -10, -10, -2, -4, -11, -2, -12, -4, 6, -3, 5, -3, -8, 2, -9, 7, 5, 20, 14, 11, 6, 10, 6, 12, 4, 11, 24, 19, 17, 26, 24, 11, -2, 17, 16, 10, 21, 14, 15, 10, 6, -4, 13, 11, 5, 8, 6, 9, 2, -2, -9, 8, -2]
7278bLNqkmRJ2j3J0jj2j3J0JjNQpjPj%jQpnJ2QrLj4J9rlLjnJ1jk%J4j3j3POnJ
7326IjoJ3jj8MoQJj2J5okj0J6j5J1%nmNJ%Nlr%RpJ1Nj1PqJ7pOkpLKJ2j1kJ4Jn
7373A7M%mnQqmjPpMrMnlMOoKJj7LJ5Jj1QmMqqPMLoQKj6J3Mj2J4kJJ3lj1KqJ8j5
7423DOPKmJn%lQMo%kmljlLl%j3J6j3Qj9NKJ0kjjorJ8j1K0j4JjJoNLLoLjJ2klK
7474BPklJ3rLK%mlQkj%Jj1%J5j5LJ1Opmj3LLLj3MKMmMNj5RnnmJ0%j2RMj0Rj4J0
7523fJJ2lj8J7j0Qj5RNQrJ6pj3J1jOJjj0nJ0OJr%lrJ3jKJOj2%qPPj2kOPj1%jj
7570gJ0j0lJ1j2Rj1J0pj%J1Lj1M%lNQLKLMmnQJj3KNKj0J0%kpMJJlNrkOj3J0oJ1
7618A0lk2OOrJ4qKj3%RMJj6J5LrKm%ONplJ2ljjKnRjRlqJ0koJ1j7J9Nj5J5j0Rj3
$$ y = [-2, 1, 6, -2, -4, -8, 1, 13, 0, 10, 9, -3, -16, -6, -5, -6, -1, 7, 0, -1, 6, 5, 5, 4, 12, 5, 0, 12, 20, 11, 14, 0, 19, 10, 7, 10, 9, 4, 15, 14, 12, 12, 26, 13, 0, 7, 13, 8, 9, 8, 2, 15, 14, -4, 0, -6, 2, 3, -9, 6, 0, -2, -12, 4, -11, 0, 0, -5, -9, -4, -3, -3, 2, -1, -10, -10, -1, -8, 3, 8, -3, 4, -4, 13, 6, 12, 10, 3, 6, 8, 20, 9, 7, 21, 22, 17, 21, 21, 17, 12, 20, 12, 8, 7, 14, 7, 11, 2, 6, 1, -2, 2, 8, 2, 4, 5, -12, -9, 6, 7, -4, 4, 0, 4, -4, -12, -5, -1, 2, -4, 4, 6, -10, 3, 7, -5, 9, 7, 8, 21, 18, 7, 9, 1, 19, 4, 10, 17, 19, 15, 16, 11, 11, 8, 16, 20, 14, 14, 12, 8, 5, 4, 1, 4, 1, 1, -12, 4, -9, -1, -20, -15, -13, -3, -5, -6, -7, -13, -22, -4, -15, 5, -9, -8, -9, -8, -14, -9, -6, -3, -9, -6, -7, 5, 3, 0, 2, 9, 7, 4, 17, 8, 11, 13, 13, 9, 6, 14, 12, 11, 11, 12, 1, 1, 16, 1, 4, 15, 21, 14, 10, -3, 0, 3, 6, -7, -3, -1, 3, -1, 3, 8, -7, 2, -3, -8, -12, -2, -2, -14, -5, -1, -11, -2, -16, -6, -5, 7, 4, -14, 3, -7, 1, -14, -5, 0, 8, -1, 15, 8, -5, 6, 5, 11, 12, 11, 1, -4, 6, 12, 13, 4, 4, 1, -8, 5, 4, 6, 7, 13, 1, 1, -7, 0, 7, -5, -7, -1, 6, -5, -5, -6, -7, 3, -7, -10, 1, -11, -2, -13, -3, -10, -11, -11, 0, 3, -8, -4, -4, -7, -2, 6, 9, 11, 14, 18, 14, 9, 17, 18, 5, 7, 12, 14, 4, 14, 14, 12, 5, 9, 10, 11, 8, 13, 4, 2, 8, -5, 5, -1, 10, 7, -15, -9, -3, -12, 2, -6, -4, -17, -17, -8, -4, -3, -19, -4, -1, -10, -8, -12, -12, -6, -1, -8, -11, 1, -2, -3, -4, -2, -7, 2, 1, 10, 7, -1, 9, 7, 1, 12, -5, 14, 19, 4, 19, 9, 18, 5]
7665EJ5j6OjmmjJ5k5J8rRlj0PJmjJ2j2nMJ%jkJoJ1KkmOmJ0j7LmJ8j7J3oJ0j0R
7710HKJ1oj6K1jpJ4j8%kkJK1j1rPrJJlKmkJ2mqj1RJ2j6J0l%nnJ0lnoJ5mJpjQM
7757BmlQmJ4lkj3J1jQr%NP%j%pLJqJ3j4KMJlOppQjroJ3Nj2pPmKqJ0lJ0j4%J2r
7807glPLp%qJ0kJ4qkOjj1J5j0J0lJ2j0PpjJ5k4PjQoPKpljOj5J7lPj0jkj3QOj0
7853iOMooJKrLJkOJ3pnJJJ5j3j2J9j2J4NnLjnJ1j6OJ1j8QPl%nJ1Km%oLM%Mj3J
7901EKlpPjomjJ3rmOlo%J0j4LPjjk1K6jjn%NrJ5j2JjJ3oMJJkJOoKPJnJLnjJMn
7954EJ%KJLj3pPLMj2JPpO%j7NKmJ4j5KNjLlL%qPJ2poJ9j5mLO%j1J0Pj1POnLJO
8004A5kj0k%JPj%j3K1pKqMm%j0RnmkJ0mj7J4J3j8lOkRj4NmpJ3JjLPoNoKQqNnP
$$ y = [5, 20, 4, 10, 9, 5, 1, 0, 15, -10, 8, -1, 8, 5, -5, 2, 3, -1, -2, 10, -2, -7, -3, -2, -2, -3, -5, -4, -10, 1, 3, 1, -3, 3, -1, 9, -8, -5, -9, 9, -8, 5, -1, 9, -1, 8, 10, 21, 15, -1, 20, 19, 12, 26, 8, 8, 6, 4, 5, 26, 15, 6, 13, 4, 5, 6, 3, 5, 1, -1, 11, 7, -1, -12, -3, 9, -7, 3, 0, 0, -5, -10, 0, -3, -8, -14, 1, -3, -2, -9, -10, -2, 2, -2, -5, 3, -1, 13, 10, 8, -5, 6, 5, 13, 4, 4, 9, 16, 16, 15, 15, 8, 11, 12, 4, 17, 3, 5, 9, 10, 7, 13, 6, -1, 7, 6, -3, -9, 4, 9, -3, -10, -3, -7, -5, -13, -3, -6, 4, -10, -10, 2, -7, -10, -3, 0, -7, -7, -15, -5, -7, 7, -1, -3, 3, 2, -9, 6, -4, 6, 3, 15, 5, 12, 5, 4, 19, -5, 2, 1, 9, 3, 10, 12, 5, 2, 1, 7, -8, 9, 6, 13, 3, 2, 0, -13, -5, 1, -9, -3, 1, -5, -11, -10, -8, -17, -14, -13, -15, -9, 4, -3, -8, -7, -6, 9, -4, -16, 3, -9, 5, 10, 5, 8, 7, 2, 13, -3, 3, 14, -4, 4, 11, 8, 8, 3, 14, 16, 12, 12, 6, 9, 13, 13, 17, 4, 5, 7, 4, -3, 4, 3, -3, -7, -8, 5, -4, -8, -2, -5, -11, -11, -1, -15, -12, -5, -6, -7, -28, -2, -3, -4, -9, -9, -4, -13, 2, -10, -9, -10, 3, -3, 1, 2, 3, 1, 2, 8, 2, 4, 11, 12, 7, 8, 11, 6, 5, 6, 10, 5, 6, 6, 8, 9, 12, -1, -8, -1, 2, 6, -6, -5, 2, -5, 1, 1, -16, -11, -9, -13, 1, -14, -12, -7, -8, -5, -8, -5, -5, -13, -6, 6, -1, -7, 12, -3, -7, -4, 2, 2, -9, 1, 8, -3, 4, 10, 5, 8, 9, 15, 13, 3, 1, 1, 2, 9, 8, 8, -5, 16, 9, 11, 3, 7, 3, 3, -7, 2, -3, -7, -9, 1, -3, -20, -6, 7, -11, -14, -8, -10, -1, -15, -10, -14, -21, -8, -7, -8, -5, 2, -4, 1, -5, -3, 5, -3, 2, -3, 4]
8053DPkjkRj1LLM%njKjJjkNKkmnM%joNplJ0%k0J4l%jnJ2j0J4j8OOj7J9j7RNNn
8103anJ4loJPrJ1j%pNomNmPLmRmJKjKj2J6qr%J7k0JNMj4QOmMpnlN%qKmK4k2RK
8155apL%J0j0MmJ4j7J0MNj4QOMjkJjNjLrqMJ2j8J4NMrlknJ
$$ y = [4, 11, 9, 8, 6, 15, 4, 7, 10, 14, 14, 9, 8, 10, 9, 10, 9, 7, 12, 14, 12, 8, 3, 7, 7, 6, 0, 5, -2, -5, 5, 5, -15, -1, -4, -4, -5, -10, 2, -8, 6, -12, -6, 0, -17, 2, -15, -6, -1, 4, -1, -6, 8, 5, -1, 0, 7, -2, 9, 8, 8, 1, 6, 0, -4, 1, -3, 4, 7, 3, 12, 8, 9, 11, 10, 12, 0, 16, 8, -1, -1, 16, -4, -3, 2, 6, -8, 0, 6, 2, 6, -1, -6, -9, -4, -4, -12, -10, -14, 10, -12, -3, -1, -8, -5, -5, 5, -5, -1, -5, 9, -8, 2, 6, 11, -3, 5, 11, 15, 14, 12, 13, 12, 17, 16, 19, 10, 2, 6, 18, 0, 14, 19, 23, 14, 11, 9, 4, 5]
8191E
$$ Imaginary data points
##PAGE= N=2
##DATA TABLE= (X++(I..I)), XYDATA
0@%%%%%%%%%%%%jRj6J6j6J6j7K5l2L2m0M8n6O4p2Q1q9J04j20J36j52J68j85K09
36A12k33K57k88L20l53L89m31M78n28N86o50P22q08R04j017J153j316J519j778
55i62K123k611L359m662P545k4537Q930L8678m4459j5129L5704N920m2931P520
69b5512M1470p562l7848J2559K6440j5277j9054K1076J3108j9232q830J7788M016
82C142j3038r64J1038P70n632j193K673K025n40l702K381Q224k827j1944M225
97e362J3586o106j1951J2193J1294j7597j0193K1709P859k2880j991K4509m419
110A0651k5239J0286K4285j5167k0460K0605J6419k4502j2112K5423O410k4087
122g488J448K3320q415k3204J1300K0321j1625j3841J2482O246j5015j854J5815
$$ y = [0, 0, 0, 0, 0, 0, 0, 0, 0, 0, 0, 0, 0, -1, 8, -8, 8, -8, 8, -9, 16, -16, 16, -24, 24, -32, 32, -40, 41, -48, 56, -64, 72, -80, 88, -97, 112, -121, 136, -152, 168, -185, 204, -227, 251, -277, 309, -341, 381, -427, 477, -540, 613, -703, 816, -962, 1161, -1450, 1909, -2753, 4792, -19745, -10815, 27863, -16596, -31725, 3979, 9899, -33032, -25512, 15958, 8396, -29452, -16893, 9547, -5730, -24784, -3708, 9400, -9832, -18662, -874, 3142, -9896, -10860, 178, 948, -4684, -5877, -3204, -1179, -1719, -5421, -3040, 5184, 2357, -9587, -5362, 8224, 2118, -9833, 2360, 13654, -3943, -14136, 7573, 15432, -7448, -9439, 15070, 10651, -14588, -4302, 19983, 4816, -15644, 4961, 21380, -3122, -15234, 10189, 16599, -7488, -6040, 17280, 8865, -14339, -3039, 17282, 5657, -8184, 4298, 10544, -4471, -6325, 9490]
135I490J30j3216J076Q092l589m082N409J310n608K13L854j641j614J904j439
150B89j850M212J485n806q30N099k134m001O307L808r473m133R560K011q538K624
166a370Q527p217r576R214Q664r689n118J0594O98j2274K459J2677m809j1231
180h451P152Q903r270o466J0119L318j0201L31J0343l126j0276L985Q222m293
194B90m457N694J119p633m5P708O3n417R17K489k983j045M191P17l636j73K145
211e6p91q99J299k99j219J504J146k073p62J475p34q29L194J300m514j937L852
228c43R90k732J875L061m216m235M532M182l747j952M058n50n236J846N960j984
244A509n039K603L462l615k089M417J011m592K06M618j050m239J443L203j753
$$ y = [9490, 9620, -3596, -2520, 5572, 1983, -2099, 3310, 4620, -988, -775, 3079, 1438, -176, 1728, 289, -1561, 2651, 4136, -1670, -2500, 2599, 465, -3536, 2771, 6579, -2894, -7027, 2533, 4544, -3994, -1370, 7157, -60, -9636, -422, 8242, -1447, -6565, 4029, 4727, -7547, -5088, 7589, 2780, -8451, -1299, 7604, -1666, -8132, 1987, 5305, -4896, -4565, 5778, 2652, -7624, -3639, 4583, 290, -4167, 1527, 2646, -4987, -5032, 2676, 2739, -2678, -1761, 728, -2255, -3300, 891, 1608, -2028, -2201, -56, -847, -1746, -447, -746, -1965, -461, 685, -1388, -2150, -675, -1409, -2238, 956, 2256, -2258, -4195, -343, 647, -2085, -210, 2851, -1365, -5600, -1068, 3114, -633, -2585, 1473, 923, -4313, -2467, 3493, 1509, -3530, -927, 2535, -1080, -3169, 1248, 2259, -2333, -2127, 2491, 1441, -2798, -1355, 1848, 95]
259I5j422K901M17l980n95L790Q69k252J7R68j664j003K366J636j660j467O78
276c06N41l37J86M55k66n11L9M13J57o43p89O18J429k23j408p1N93p20l0K185
296A312N48k918j417K252J016j475N29J721j957k742K032L058j584k147J721R15
312H64k526k12L231q2l352L88L139q26k780J135K124j678j359K538J185l138j464
329b813K826J466j872m36J543q18k114J207K722o00k405J80J484m79q26J220R92
346A277j552j269J503J395j332j263J281J120j239p23J458L37j991k23K585O34
362A998k527q20J945J89j629R40K125j546k757J359K731j091j911J490J128k320
378f96q96K875Q43k990o84K822K05k651L20K454r33k310J593K385j925k494J737
$$ y = [95, -1327, 1574, 1991, -1989, -2584, 1206, 2075, -177, -160, 808, -856, -1859, 507, 2143, 483, -984, -306, 235, -102, 84, 539, 273, -238, -199, 214, 371, -272, -1061, -443, 986, 763, -645, -716, -123, -843, -873, 1312, 1860, -1058, -2475, -223, 793, -682, -153, 1568, -389, -3131, -1099, 1959, 375, -1772, -51, 864, -1662, -1874, 1357, 1275, -2077, -1689, 1450, 624, -2156, -1021, 1103, -575, -1934, 604, 1789, -1349, -2813, 13, 1479, -393, -829, 714, -104, -2218, -1011, 1711, 1111, -1294, -1114, 370, -109, -935, 285, 1277, -275, -1544, -41, 1354, 22, -1241, 40, 1160, -79, -802, 656, 993, -998, -1221, 1364, 1998, -529, -1349, 596, 785, -844, 96, 2221, 675, -2082, -723, 2008, 917, -994, 496, 1624, -696, -1592, 1283, 2126, -864, -1548, 1274, 1479, -1172, -852, 1602, 669, -1641, -48, 2337, 412, -2082, -345]
395c45K110j529j257J763M75k474m14K829P01k451o26J809n1j618Q02J900j102
412E22k242R18K091q54j749R51J357j302j171J628J070j947j175K042J206j898
428e53j013J657L90j813J47K237l44k560J95K342k68j871P55J551j385j590J797
445c26J721j867j628J800J238j801p13J971K90k242j0K462j7k380Q5K080l25j696
463a358Q95J615j348j722J548J789j391j477J401R85j588n26J982L59k163k61
479a260K187J71j975J60J762n57j605J037J649j255j667J276J483j167r91J267
495E15N37j521l12J719L22j614k46J337K3j103K86J059n15j077N57J099n16j084
513e34L81R35l52p57M72O64p61q29R35J039r09j130Q02Q75r63n89J322M01j696
$$ y = [-345, 1765, 236, -1021, 742, 1217, -1257, -1671, 1158, 1859, -592, -1218, 591, 540, -1078, -276, 1624, 522, -1720, -802, 1289, 435, -1314, -363, 994, -308, -1479, 149, 1219, -728, -1903, 139, 1345, -553, -1566, 91, 481, -1332, -1185, 1052, 708, -1852, -1657, 685, 417, -1454, -699, 852, -533, -2123, -326, 1395, -472, -2100, -300, 938, -863, -1576, 395, 685, -1557, -1567, 895, 878, -1502, -1417, 663, 338, -1358, -463, 1152, -196, -1918, -370, 1419, 28, -1449, -48, 937, -651, -1177, 805, 1164, -999, -1260, 927, 1098, -877, -717, 1045, 488, -1117, -80, 1569, 314, -1353, -77, 1406, 239, -752, 515, 1052, -469, -781, 938, 1260, -354, -600, 737, 760, -343, -57, 1002, 487, -590, -33, 1066, 550, -534, -153, 782, 430, -327, 145, 809, 48, -781, 154, 1193, 284, -846, -44, 831, -132, -721, 601, 1002, -694]
532f94l99J800K32j762J27J728n76j715R43J569j318j352J640J105j819p81J815
549E43K90j820L18J855o87j792Q18J420r81q76J284M83j473k95J326Q1r27L01
567a32O58o22m57O39K23m70J23K84m20j15N03k31m66O20M80q35l51Q84r2r42O51
588f8J122j023j146J057P56j185j55J473l11j646N94J473q78j046J335O75j575
605e48l37J466k14j305Q52J210j236j024J245M65j200L06J352q19j352J084R64
622I09j308l54J591j36j741M99J474j003j105J597Q67j874n65J793L4j556P29
639a49J527j245j480J332J055j331m17J491r4j535K72J235m76o73Q89L80j086
656c05k48P62l6l57N53Q0q91j5P22l19m29Q62K68j154p6J074m52j033J134J131
$$ y = [-694, -1093, 707, 939, -823, -696, 1032, 456, -1259, -316, 1253, -65, -1417, 223, 1328, -491, -1272, 543, 833, -987, -669, 1186, 499, -1293, -475, 945, -36, -912, 372, 855, -618, -913, 413, 494, -433, -132, 526, -96, -553, 86, 309, -161, -38, 246, -174, -289, 214, -17, -483, 137, 617, -218, -569, 315, 223, -719, -68, 1054, 31, -1115, -58, 698, -487, -642, 831, 520, -1126, -532, 941, 63, -983, 352, 1027, -548, -885, 581, 367, -938, -86, 1124, -112, -1136, 109, 574, -626, -320, 1032, 213, -1139, -55, 909, -399, -753, 838, 702, -1039, -540, 934, -69, -1174, 423, 1290, -584, -1149, 644, 678, -878, -149, 1378, 133, -1347, -15, 1040, -291, -708, 783, 689, -846, -574, 661, 185, -488, 401, 781, -305, -553, 209, 173, -184, 369, 449, -442, -457, 265, -54, -483, 379, 647, -507, -583, 491, 39, -994, 140, 1271]
676A271j491j122J396N32j491L15J832q39k113R40J841j045j222J454P16j845
692h71m00J842J2j672N07J547p67j392P76Q85q02j59J111j40j331N8J050j9m04
711a69M44J07p82k04O90K25k57J52J44m24k11K97J48J1K69K2m80j96L68J07j30
732A31K47K04l97l06K44R5j42K50M12k96n35nJ74K3L44M28m14q41K1O17J15j04
754B65K49r3p75j24Q10K32o78m0O41k10p83K20O52l94m95Q02N86j178r32J002
774b43Q84p28l18Q74j95j487J48J747R8j419O3R86o36j014J002J236r27j030Q15
793a44N60r99k71J225K92j091j73Q06j54p75L56Q77j59o51L6K22k33r5N10N05
813F44k39p31l62M68N63o8j54K49k59q18J76J225J09j085L4R10m17r24P79R27
$$ y = [1271, -220, -1342, 54, 586, -905, -590, 1242, 403, -1710, -770, 1071, 26, -1196, 258, 974, -871, -1271, 571, 583, -1089, -582, 965, 198, -1194, -418, 467, -335, -494, 617, 477, -854, -796, 254, 235, -169, 275, 382, -400, -604, 86, 311, 54, 206, 350, -74, -285, 12, 160, 171, 440, 462, -18, -214, 154, 261, 131, 378, 582, 185, -121, 123, 218, 76, 326, 738, 442, -93, -98, 76, 99, 443, 871, 457, -384, -363, 254, 369, 265, 514, 421, -354, -478, 332, 564, -114, -154, 487, 277, -506, -286, 366, -28, -523, 279, 865, -313, -1245, -243, 641, -87, -405, 469, 274, -1213, -1065, 682, 780, -639, -576, 410, -226, -1240, -238, 998, 71, -959, -144, 416, -583, -854, 371, 663, -428, -601, 205, 51, -724, -368, 509, 350, -301, -265, -43, -276, -371, 139, 644, 405, -326, -688, -220, 343, 275, 121, 370, 111, -707, -531, 694, 803, -282, -248, 662, 245, -679, 100, 1027]
833A027r78o85J311M24j707l95J709L37j361K45J155j039j376J356J613j094j217
850f75Q46M06j190P6J552q6j414J6Q91l22n39O84M54o72l12M59m1l75K31L26j66
871A49n6R2l68k78M28L56j87Q8J20o88m72P99P09m50l41K74l86o42P32J004n81
892C02q86M56L47o94M8J000j93j025M02Q67p01q36Q25P10o98k69P39l02j083M36
912e55J278j57q75P4K15n26J06R84J10q70k56L70o4l7N19J04o16j40M00k3k40
933a99K71K12l76m9M01j06n08J59N17o9k14J86j21n26J10P24J57m37j70l3k41
954c12J72O49Q2n81k37K27J2OL74M7n20j33M50L9l37O2K75j29j28K96nn02l2N33
978C08J54k14k9q3l95P3O49J89m74k16J01j40K6N29J94n96l38L89J87k30J14K45
$$ y = [1027, 49, -636, 675, 1099, -608, -1003, 706, 1043, -318, -73, 1082, 43, -1333, 23, 1636, 542, -675, 171, 577, -613, -537, 1015, 929, -485, -469, 422, 100, -439, 245, 699, 27, -285, 174, 133, -242, -11, 315, 149, 93, 185, -183, -461, -33, 323, 136, 224, 344, -344, -816, -17, 692, 242, -99, 175, -211, -853, -121, 883, 302, -584, -128, 219, -475, -427, 573, 380, -645, -243, 624, -77, -913, -88, 622, -76, -345, 394, 92, -991, -555, 723, 566, -309, -235, -20, -546, -440, 544, 654, -216, -472, -102, -166, -203, 316, 420, -196, -336, 64, 41, -199, 72, 284, -92, -141, 260, 154, -354, -195, 322, 253, 39, 225, 104, -422, -312, 412, 569, 132, -38, -71, -312, -140, 509, 591, 10, -227, 0, 12, 18, 392, 439, -81, -214, 236, 275, -62, 0, 275, 146, 18, 314, 309, -193, -225, 308, 462, 248, 219, 136, -259, -186, 463, 652, 178, -38, 63, -77, -51, 478, 672, 76, -262, 127, 314, 84, 198, 443]
1000D43l23l42M11L71m29l29L49K32k67J8K33k50m24L05N65p6m57j17P7j8J77
1021A49L05m9m11k26J74K71J05p5j90j14L2J08J17M5j78j93J38L05q6l04M6J66
1043A35j29J6L54n5o06r7O13K37m05r8K36k89k55N13M89m88n55L30L30k94l3M28
1065C77j59n87J66O33j51n37J17L91j59j97L03J15m65k00M77L36k88l13M7Q2j6
1086b8J24K18q6l70j39L16L11j07k38K0M4j36R1L35o3n11kN24O5m30L9L17k37
1109E7k80M74M06o23n01N39M59l97j90M05j17o00K26P65j58o95J01M43k44k18
1129a48M78J50o28j81O11J78m99j10L50n0k60J99K74k80l86J82L82Pk21j33J6
1150f9RO4J55J17j84l28pL92J78k75j51J43n2j91K83L41l86m45L53M72l36l13
$$ y = [443, 120, -222, 189, 560, 131, -198, 151, 383, 116, 134, 367, 117, -307, -2, 563, 487, 30, -87, -10, -28, 149, 454, 405, -6, -232, -58, 213, 318, 243, 53, -61, -29, 79, 196, 241, 63, -130, 8, 313, 227, -77, -31, 135, 6, 22, 376, 321, -285, -382, 231, 468, 63, -35, 201, -88, -343, 170, 659, 171, -384, -54, 276, -18, -51, 377, 218, -369, -203, 430, 279, -258, -141, 250, 91, -106, 197, 312, -153, -353, 124, 460, 172, -141, -94, -12, -28, 96, 314, 228, -142, -281, 35, 346, 239, 1, 21, 65, -71, 20, 355, 292, -219, -221, 303, 368, -62, -23, 294, 57, -223, 251, 657, 34, -467, 72, 531, 134, -56, 349, 232, -368, -142, 623, 465, -230, -129, 314, 70, -148, 330, 480, -148, -329, 282, 460, -39, -149, 201, 151, -109, 90, 364, 84, -302, -120, 262, 269, 48, -85, -69, -60, 4, 159, 276, 92, -236, -243, 149, 327, 52, -99, 44, -8, -199, 84, 425, 39, -406, -53, 419, 83, -230]
1172b30L93R6n17N4P04j11q06Q1P15j08m83L09L10n80k88P30L53o05k74M50j6
1193A77l90K98M39l87m69L27L85k55j79K44mk53J33K95j27k76O6J33L1J07k6l03
1215c4o1K99J02j49M7K6l35l2N00J61m68j27K93r2k24L51K53n03l06M99K24m73
1237d9n8M29j43m29L21M30m42m10M22K65l73k9L55k27m54L34M55k98l30K78L7
1258H4l70J63N00k28n24K29L25k42j11L79q7m70J32M94j63l89K33J72l17QM48
1279B66j26n28J49M71j46k65K36K7m02J04N27r0m83J05K63j90q3M00m1n04O8M81
1301B39j27l29K33J60l74j3M77n6m89J09L93k16k05L42Q6m76k9N20j7m35J43K99
1323B35l06k06M75J50m76p4L95q9k71K79K34m47j80M66R6l93N0L37k61k81M48
$$ y = [-230, 163, 259, -258, -204, 500, 389, -417, -336, 379, 271, -212, 97, 407, -173, -461, 269, 622, 17, -257, 193, 177, -213, 85, 524, 137, -332, -5, 380, 125, -54, 190, 186, -67, 66, 361, 234, -42, 24, 157, 188, 295, 269, -34, -95, 204, 306, 157, 204, 230, -105, -137, 363, 524, 56, -71, 222, 130, -94, 257, 510, 7, -299, 200, 424, -49, -107, 322, 179, -250, 71, 501, 59, -351, 71, 336, -37, -66, 289, 62, -392, -58, 397, 99, -231, 47, 84, -286, -123, 377, 149, -375, -146, 179, -63, -174, 205, 118, -352, -220, 274, 111, -278, -45, 127, -190, -182, 266, 140, -388, -239, 232, 86, -179, 57, 84, -318, -214, 313, 223, -260, -155, 108, -82, -165, 235, 194, -310, -242, 239, 112, -217, 16, 176, -198, -211, 266, 210, -279, -170, 223, 7, -198, 144, 230, -246, -275, 245, 228, -207, -64, 235, -71, -277, 198, 348, -128, -202, 193, 104, -167, 112, 346, -101, -281, 185, 281, -112, -62, 275, 14, -267, 181]
1344A81K70n43k11N10R5m11J49L38m03l62N30L81n26k65M57K7m38K30M80l69m92
1365c72M10M02l88k41L76K6l85J29L85k28l45K54K31k29n9K24j22j99K05J85k46
1386A3p0K20j04k36K45K30l40j33L86l6m26K21M78l56m69M51L36n41j68O53m2
1407C12p33J73P43k85o84M02N30n12l12O34J13p38RP56j11o35J83M32l25k72M83
1428A63J89n53j13M67M9l05O7J59j65p4K23Lj93P2Q0j39N3J86j76k17L06J97l43
1451f4j33L94k8m18J82M31l11l95L97L00m91j82N82N6n96N1N50k08m68L60M03
1472D12m82l37M79K46m53q3L89p2l68J99L08k57k32K57J34k31m2J84q8j19J68
1493A2J20k10r5J61L1p3P6M4j79mJ81jj46P4Q8j51k5J91j2j97O1K08r5j64J19
$$ y = [181, 451, -92, -303, 207, 302, -109, 40, 378, -25, -387, 143, 524, -2, -267, 190, 217, -221, 9, 489, 120, -372, 38, 440, 52, -189, 187, 213, -172, -43, 342, 114, -231, 23, 254, 25, -34, 190, 68, -131, 74, 259, 13, -57, 163, 59, -177, 68, 298, -42, -175, 211, 175, -251, -30, 448, 92, -377, 74, 410, -131, -299, 354, 312, -421, -248, 495, 210, -474, -72, 458, -54, -366, 268, 381, -357, -348, 408, 297, -338, -155, 277, -48, -320, 163, 352, -201, -314, 153, 202, -103, -36, 123, -42, -116, 107, 110, -83, -11, 69, -70, -17, 169, -7, -224, 82, 279, -64, -197, 197, 169, -249, -67, 364, 53, -342, 55, 355, -136, -318, 264, 320, -276, -225, 325, 117, -351, 9, 412, -70, -407, 72, 318, -135, -218, 171, 99, -269, -70, 238, -19, -251, 6, 140, -91, -133, 51, -37, -156, 12, 132, -78, -173, -12, 19, -54, 22, 66, -113, -117, 64, 63, -83, -9, 79, -72, -97, 94, 82, -115, -54, 154, 59, -105, 14]
1518A4J14j41j6J73l3k06O2J91p5j25R7Q9j39j6J28j5j18M6J32n3j17K6O6o%L6
1544A14k1q4K2P1J0m2J0Lk7KM9J6o0j7O6K7r0l7R2M7p7l5Q4k7r6N3J40o6j31O8
1574F4J11j05p4J27M9j41pJ22n6j23R3J24q6j04O7J4q4O8J08r2j02R1N8j14J4
1599B2R6p1j00J38O0j70m7J81J4j47N3J01j36r8J90Q2j78j7J23q4j15J75J18k10
1623b0p8J90Kj99J06J96j44j90J84J14k20m1K34k2k14R1J82j84j46K22Q1j93K
1646d7J69j39j62J76J76j85q1J67q0j74J52K31j93j90K00J01k27L1K42j04k41
1667a78J45K06j78j41K06O8j99N8J81j34j68J74J45j47k7J25j07j66K08J93j68
1688I6j51J56qj67J39K29j83j84J62Q1j74L0K16j03k10J54J88k28j10K43L8k18
$$ y = [14, 128, -13, -29, 144, 111, -95, -33, 158, 83, -42, 55, 144, 5, -11, 117, 102, -16, 30, 162, 109, -8, 18, 84, 78, 78, 114, 93, 9, 31, 102, 112, 70, 80, 83, 56, 58, 107, 123, 63, 46, 112, 139, 49, 12, 104, 151, 74, 39, 123, 96, 0, 53, 193, 127, -4, 64, 175, 70, -4, 123, 172, 31, 24, 146, 90, -33, 60, 184, 98, -6, 61, 75, -9, 59, 167, 75, -27, 64, 122, 8, 22, 118, 47, -53, 85, 145, -25, -72, 109, 123, -24, 29, 130, -6, -104, 86, 168, -10, -27, 96, 12, -103, 72, 190, -20, -98, 92, 94, -105, 1, 197, 53, -137, 47, 161, -59, -100, 134, 112, -102, -11, 171, -13, -159, 63, 144, -49, -47, 122, -17, -179, -3, 173, -12, -93, 74, -6, -180, -28, 203, 10, -180, 20, 121, -106, -75, 167, 63, -178, -33, 173, -5, -146, 60, 128, -71, -13, 168, 34, -134, 40, 185, 38, 11, 136, 29, -137, 71, 264, 96, -55, 101, 93, -74, 65, 294, 111, -73, 89, 170, -4, 26, 242, 139, -71, 83, 271, 43, -67, 176, 214, -4]
1710dQ0J95k02k02K53J94k25r3K03p9k73K07L15j95k65J59J21j95J4K85p1k92
1732g0N7K08j04r3J79J7k05M8J70j18j35J66P6j54L1J09j47j64K19J95j95p6J31
1755A45j16j80K46K47k32k13J83L2k26J15L32j93l40K05K21k39j19L08L2l37O6
1776f3L10j96k65K50K22k45j01K27o0l28J98L74j65k85J22R5k17P1L49q4l41M3
1798h9J69j03k9K60n4l04Q9K35j42j54K49P2k78J4K67j57k75K34K61k36j19K28
1820A38q6l17K26L99k23l19J99J00l18R2M63j18n04J43L35k31j55L78O2m81L6
1841a81M30j30l72K62K95l13j74L77Jm54J28M77j15l82J66J64l22J0M67j1m33
1862a10OK40j34p4L47K4l99k7L38j02k11K48J43l47n8L65o9l62J96L18k68j71
$$ y = [-4, 76, 271, 69, -133, 120, 314, 89, -4, 199, 120, -153, 54, 369, 174, -91, 68, 189, -6, 8, 293, 222, -70, -13, 195, 91, -2, 177, 194, -11, 37, 207, 89, -46, 120, 196, 42, 73, 182, 35, -129, 90, 285, 90, 14, 145, 29, -151, 95, 342, 110, -103, 80, 112, -114, 1, 333, 140, -200, 5, 226, -13, -132, 176, 208, -129, -63, 247, 51, -214, 36, 258, 13, -88, 139, 79, -249, -51, 323, 158, -127, -5, 90, -127, -56, 293, 209, -132, -89, 80, -23, -52, 208, 154, -150, -61, 174, 32, -122, 127, 199, -79, -65, 202, 45, -230, 4, 265, 29, -90, 138, 52, -265, -39, 360, 137, -182, 17, 117, -201, -109, 354, 236, -268, -125, 210, -21, -176, 202, 264, -217, -181, 249, 119, -253, 9, 304, -9, -183, 194, 195, -259, -131, 346, 231, -151, 15, 179, -143, -133, 334, 323, -110, -104, 136, 2, -72, 275, 299, -100, -127, 211, 109, -102, 146, 289, -58, -116, 249, 180, -182, 14, 332, 64, -107]
1884a07L25Qm60J28N18j51m33J99K32l90p5N72P7n86o4M49j16k89L60K46m96j92
1906b45M45Q5l80Q5L37k12k83K96J76l87n5M04ll21J01J67k86n9M14M9l70l2K46
1929A72j88j16L94J16m74j30L99j8l17K27K88l89k69M25J63m19k6L95r5l67K24
1950eK72l59j89M25J41m09m6L03j40k52L02K69l37k28K43N2j79J63K26k87k54
1971b89K64J50k26N0K30k11k47K77K27l09j35L24K0l07J37K78k96k53L72K45l71
1992g0j56L18m5k99K32L65l17l56K75K50k51m7K90q6l51J40L21j50k20J88Q3k00
2014h6pK30p0k03J20J85j44p5J41m9j50J42J76j67j29J57j2j73J55K30j92k62
2036a83J91J61j83pK57j14l31J57L27j61k42J83J10k55RL09o5l47R7L13j16k03
$$ y = [-107, 218, 226, -234, -106, 412, 261, -172, 27, 259, -131, -206, 366, 443, -143, -207, 242, 126, -163, 197, 443, -53, -245, 200, 285, -95, -10, 327, 115, -168, 128, 304, -83, -138, 266, 263, -58, 43, 210, -76, -135, 279, 328, -42, -74, 172, -16, -132, 262, 378, -96, -226, 173, 155, -162, 65, 353, -36, -305, 120, 283, -136, -162, 233, 138, -229, -5, 267, -92, -281, 144, 285, -124, -170, 133, -7, -259, 43, 312, -25, -253, -10, 42, -137, 26, 252, -35, -289, -25, 125, -101, -51, 179, -32, -279, -2, 225, -84, -219, 105, 125, -182, -45, 233, -63, -316, 56, 301, -70, -226, 92, 47, -252, -20, 345, 28, -328, -53, 197, -54, -101, 189, 103, -248, -108, 213, 63, -157, 31, 114, -86, -93, 137, 67, -136, -16, 169, 25, -50, 91, 42, -108, 34, 210, 43, -86, 71, 59, -114, 41, 271, 79, -183, 8, 169, -14, -21, 236, 122, -209, -52, 275, 114, -128, 55, 165, -90, -81, 228, 163, -184, -87, 226, 110, -93]
2058i3J28R5k23PK95l0l05J9J88k9n5J19k6j95K3J87rj02L6Mq9M1J42m4j25N0
2084IN4p0J0R7m1j24O7J08r0n7J14k4j38O1J65p9j48O6P3p1j1J38o3j69L4J67
2110G8k3p9N6k6j29M7J92k6j79j8R6lrQ3n0j30J4J32K2p5k2j4JN5M9l6p6rM6N0
2140A7L8n1q3OQ0J9j3K1k8j09J7J79qj45J2J07o7q5J20R4j50p4J52L1j40K4J16
2167H0o9j14J04R6j15p7J18L1j03N1P5p7j17Q4R5j8l5k2o3JJ06M3p2k5J6o0K3
2194d4J37pj66JJ50l3j04O8N9j50LK05j7k46J7K08m9j22J51O7k36p2K61P0k30
2219g9NJ31r0j17J54J28j69p9J32lj37R7J23j17j00J31L9j55L6J24n3r9J08N4
2243F4j38l2J45qq5R1M9j87m9J93P7j40J5O4j23p8K08R9j80p1J28j5j09J11R6
$$ y = [-93, 35, 130, -93, -86, 209, 179, -126, -107, 81, 52, -3, 116, 90, -105, -82, 105, 96, -6, 30, 34, -55, -14, 128, 84, -41, 9, 63, -7, 3, 100, 59, -65, 2, 110, 20, -37, 77, 53, -85, -24, 141, 62, -86, -20, 53, -18, -29, 109, 46, -123, -89, 78, 55, -24, 32, 6, -123, -76, 116, 90, -89, -107, -11, -14, -23, 60, 10, -120, -106, 26, 48, -27, -49, -63, -62, -7, 42, 6, -70, -79, -33, 17, 55, 4, -79, -73, 7, 26, 13, 34, 6, -103, -86, 93, 85, -60, -48, 59, -8, -93, 27, 121, -29, -103, 49, 80, -60, -36, 80, 11, -103, 1, 97, -18, -95, 23, 54, -49, 2, 77, 0, -117, -33, 62, 44, 9, -13, -76, -75, 31, 74, 2, -23, -7, -67, -44, 93, 86, -80, -79, 71, 38, -66, 2, 61, -89, -86, 119, 102, -144, -127, 81, 32, -90, 61, 128, -108, -180, 81, 151, -79, -74, 57, -33, -150, 4, 132, -37, -116, 16, 13, -124, -27, 96, -21, -121, 10, 49, -106, -70, 54, 1, -98, 10, 64, -74, -106, 39, 31, -54, 37, 86, -101, -150, 43, 120, -20, -5, 59, -64, -142, 66, 165, -15, -86, 42, 27, -82, 29, 125]
2268A25j35p6J61J5j61J1J50n1j00J22L4j85l9J93L4j27L7O1j54o8K12Q2j55l9
2292e3R8o7j21J33J35j21r2J00J2j39M9J43m6j10Q3N1j35k4J50J5q9M3N0j22q5
2317a42J53P4o8j1K3p8o9J30R8o4l8Pn6n1J15Q1j00m7P6m3r4N7J36p3o2P8J0j53
2345a11j0J72J8j02M3N1j51o3J76R1j04n0P0p1j07J11J49o8q9L5rr1N5J23j1q6
2371b9K8Kq5LJ03L2n6jQp3j9Q2N5k9njr7l8J05P4n3jJr9n2J25P3m2m6L1n9q2R7
2404d8R3l3n0N9l5j35M1J41Np3L4K2j33m4J52Q6q3j1N2p8j01J14J32o0p1M2l0
2431a2r5M5J58qq5j2L8q5j3J19P2p2m0j7k8mM7N2Nkp0n6J2Q9J4rL3l1j07k1J01
2462A8N5l9mN1j07j07J07J33n4p8P2j0j51j3J98L5j33LO7p8r5J30J23p0q8L9r
$$ y = [125, -10, -86, 75, 90, -71, -60, 90, 39, -61, 61, 95, -90, -129, 64, 98, -29, 8, 69, -85, -153, 59, 141, -14, -53, 45, -22, -143, -10, 125, 4, -88, 12, 24, -115, -66, 77, 31, -79, 4, 55, -80, -104, 46, 61, -28, 15, 65, -57, -142, 11, 85, 17, 6, 29, -49, -118, 12, 110, 46, 8, 15, -41, -92, 23, 104, 4, -43, 33, -10, -104, -47, 89, 16, -46, 32, 42, -111, -121, 51, 69, -33, 10, 61, -90, -153, 23, 114, 10, -40, 30, -41, -148, -37, 112, 44, -45, -10, -19, -110, -55, 68, 57, -29, -1, 1, -84, -81, 22, 54, -2, -3, 5, -68, -87, -5, 50, 21, 16, 15, -82, -120, -15, 59, 6, 5, 6, -93, -145, -20, 53, 11, -35, -4, -63, -145, -48, 45, 12, -38, 21, -14, -149, -108, 33, 38, -35, -1, 21, -112, -156, -4, 82, -1, -12, 40, -38, -139, -25, 107, 47, -24, 18, -12, -107, -62, 96, 88, 3, -9, 29, -56, -69, 50, 122, 50, 10, -7, -35, -39, 8, 60, 65, 63, -7, -63, -51, 38, 52, 43, 76, 45, -62, -83, 18, 73, 34, 30, 81, -26, -133, -26, 107, 53, -25, 47, 37, -114, -127, 71, 106, -27, -24, 43, -35, -130, 0, 123, 53, -35, 4, -5]
2489eo8J1J26K0q4k5Qm5j1Q9O6l7p3j5j3mM9N9K0n5p7m2L4O6L6j4ml7q2lR8N7
2521D5m9j1j1m8m4O5O5j7k0Ll4o7K0J02L4m8j4j0p1j6R2J04n7o5jl6k4N1J03l
2551C8p6n2K1l6K4Q0M2o7o6K7nm4N9J01j5j09l3L1l5J1J06O4j06j16M2L4j1N6
2579c5Q3o8j10k7N2L0M0M4k3r6k9M7L1J8M4Mo4m6RJ4L1P2Mo4k6j4l4K4J29N5j18
2610b3p1K5Ok0J12J12j12j46M7P2n0L9J08l1j62J0J19m9n5J27N7j36q0J01J7o5
2636d8N0J46q7j62L2P9m9M9J15m4j76oR3OJ1R4rj58m5J13J6m1R9J6j38n9J02K4
2664B3n4M9Q7r5r7O7L3p9M0J29m2j62RP9m7NJ47k0j85o1J35Qk7R5J1j85o2J63
2692c6K2q5M0Q9j03j13J19O4j23J2J53m8j62K4R4o4j0J51K0k07m9J61lo9J12O8
$$ y = [-5, -73, -62, 64, 84, 0, -25, -17, -62, -73, 16, 82, 45, -28, -43, -56, -60, -11, 48, 68, 13, -64, -106, -72, -6, 30, 16, 12, -25, -107, -110, -12, 45, -4, -15, -26, -74, -118, -53, 12, -5, -25, -22, -56, -123, -103, -1, 33, -15, -29, -39, -110, -126, -34, 70, 13, -52, -53, -89, -113, -62, 41, 38, -38, -90, -69, -105, -81, -1, 41, -26, -92, -65, -70, -114, -55, 46, 31, -78, -111, -80, -115, -104, 2, 66, -40, -156, -114, -80, -91, -35, 48, -20, -130, -157, -105, -75, -35, 9, -14, -110, -139, -92, -61, -43, 1, 5, -59, -105, -96, -82, -51, 21, 25, -39, -65, -79, -113, -89, 40, 95, -23, -94, -69, -63, -83, 29, 141, 29, -117, -70, 2, -48, -9, 99, 68, -94, -84, 35, -14, -69, 58, 115, -21, -101, 0, 17, -48, 2, 148, 61, -101, -69, 10, -39, 10, 125, 81, -95, -101, -8, -2, 9, 103, 94, -64, -109, 4, 20, -21, 78, 94, -44, -103, -1, 23, -31, 18, 105, 10, -87, -20, 13, -66, -26, 103, 61, -101, -92, -13, -60, -55, 92, 72, -113, -174, -39, -31, -58, 37, 48, -137, -199, -36, -14, -99, -59, 30, -73, -186, -67, -3, -126, -114, 39, -9, -171, -147, -53, -117, -127, 24, 44, -163, -212, -51, -54, -123, -11, 57]
2718E7j70j14J51P6j06M0J11r8j56J04J30q9m5J18kj66K8J59o1r7R2Q9j32o2R5
2743d8J0o6Q6R8j39j10P0P5k9N0O8j25j14J04J09q0qQ3p2j14J01J25j18q4J58
2768C0N1j70J3J38p1j16J58J28j96j31J64P4j44M1J80j08k05J00J84j09r4J67
2790H4J0k05RK08l9j37P8Q4j33p8J71K7j45J9J16o7q4Q8J3q3K9J25p1j12N2N1
2816A0o3K5J44q0j82O6J39o4o1J21j8j72M9J91o3j70J01R8j33m3J75j9j97M8K18
2841A20j01j73J16J09j52j4J77j3k18L7J63n8r6J01O5j81l2J74kj41N0J15j16
2864g0q2J40M6j31pJ23m3q6P4L8j09J5J20qj13M0N2q6oJ56qj64K9J20n8n0J06
2891C8K2j62pJ76j7j29O2Q3j05l4J52Mj58qJ82m5j26P9O6j42k2J85mj57J0J06
$$ y = [57, -113, -227, -76, 0, -106, -66, 45, -53, -209, -105, 25, -64, -109, 9, 7, -159, -131, 28, -33, -130, -38, 51, -81, -143, -48, -38, -104, -18, 80, -59, -169, -99, -24, -53, -3, 65, -60, -174, -70, 39, -41, -49, 34, -38, -152, -51, 74, -44, -128, 30, 81, -89, -76, 62, -9, -125, 33, 161, -35, -166, -2, 72, -72, -31, 149, 41, -164, -64, 120, 11, -83, 84, 94, -111, -102, 106, 67, -70, 8, 92, -41, -119, 52, 79, -66, -47, 69, 2, -82, 6, 19, -64, -35, 90, 19, -93, -41, 10, -53, -28, 116, 36, -146, -80, 59, -5, -66, 55, 37, -135, -86, 105, 42, -128, -27, 71, -62, -105, 70, 51, -146, -98, 120, 19, -154, -38, 71, -81, -95, 82, 69, -149, -112, 51, -7, -103, -2, 63, -118, -150, 24, 22, -119, -69, 46, -70, -152, -12, 34, -97, -104, 19, -24, -110, -36, 2, -107, -92, 28, 20, -93, -53, -1, -87, -93, 63, 55, -109, -80, 40, -18, -68, 38, 60, -102, -109, 67, 50, -79, -17, 66, -39, -73, 79, 83, -75, -83, 99, 54, -72, 7, 73, -69, -91, 94, 90, -67, -57, 49]
2917D9m7p1J21L6j29l7J17J7j11M9P3q0o3J13K5r4j0Q5l1m8O1L3r8nQ2Qo6N2J3
2946D4p0j8R7L1r2rN2m4k2Q1J8j20oJ11rp0M3L9r9k5J24J6j21nQ1j5l9M8K5r7
2976e1k5J08K8q5lM4m4l6Q3M6r3m4P9Ro4M4M5m9l8M9M3o6JK9j1j7M5J9n6k9L7
3007bL3k9K7J0n1m1P0K7k1pJ4n1NO3kn6RL0k8k5N0Po1qO5J2o6J0K8j8j5O2J1r4
3041d2j8O8L4n1J8M4p3m3N4P4m9n3L7K2n5J7N7ln3J7M0k6k1LK0pRJ5rl0j7K8L7
3074D4J7m5j9KLQK0M4m1n6pO0Ql4RK2n3j6K6L4l7oL2Ol0k1K4Kj3K9K6m6p0N3L1
3109FokL6k8n3MN7L7l9j5rj7oM1L4k4k3PQk1kJ9J9j5lJ9k5k2QN0Rk1l2%kj3N6
3146C2K4l8l8%J3RK6J1j4l9OK5lrL5%j7l7K6Rk5K2L5K1m8l3J2L1K0%J4ro2j5M8
$$ y = [49, 2, -69, 52, 88, -41, -78, 39, 56, -55, -6, 67, -13, -76, 37, 62, -32, -42, 43, 12, -36, 25, 58, -40, -45, 37, 45, -21, 31, 44, -26, -44, 53, 84, -8, -17, 35, -9, -31, 50, 68, -52, -58, 53, 44, -26, 17, 56, -43, -68, 56, 72, -49, -54, 27, 12, -27, 21, 46, -51, -76, 32, 60, -25, -28, 16, -28, -64, 19, 65, -28, -72, 7, 16, -48, -4, 41, -8, -46, 3, 46, -20, -19, 10, -1, -18, 27, 46, -10, -39, -2, 31, 2, 29, 39, -12, -53, 17, 44, 23, 16, 30, -21, -16, 47, 45, -11, -2, 28, 0, -25, 25, 32, -29, -37, 28, 40, -26, -16, 12, -6, -21, 41, 52, -42, -60, 8, 42, -9, 9, 53, -20, -63, -9, 65, 16, -37, 0, 22, -33, -16, 41, 38, -15, 2, 42, 16, -5, -2, 18, 11, 20, 35, 26, -4, -21, 7, 44, 61, 16, -3, -1, 2, 10, 30, 74, 33, -23, -30, 30, 38, 4, 13, 35, -18, -34, -8, 26, -11, -17, 15, 21, -9, -30, -6, -4, -17, 12, 38, -8, -78, -25, 6, 0, -2, 34, 6, -47, -43, 14, 51, 12, -3, -12, -29, -35, 6, 40, 16, -7, 0, 8, -13, -15, 4, 23, 8, 5, 24, -1, -23, -15, 35, 44, 23, -9, -9, -11, -24, 32, 56, 18, -20, -20, -7, 2, 28, 39, 25, -14, -8, 17, 14, 5, 40, 40, 23, -14, 12, 21, -4, 18, 53, 74, 26, -7, 5, 36, 56, 56, 70, 61, -1, -16, 32]
3181C2M7j4k3Pj1n8L6P0Pp1lM2k9l8M6N1n0m7M0J4o5rO6M4q3j2L5l0k8M3P1k9
3213E1p9QJ0j7K3O2k9o2j6J5K1LRQk3j7j8J9L5%kLkk9l0K6O3jm7j4J4m1pQ0J7
3248C3m3l1J3j2j2M0O7n3n2J2J7m2K5N6pn5j5M7k8j7M2K9l9k3J9j5pK3N8k6l4
3279c0%mk1M3N0j2o6%J8kJ1N0Lm6l2M1rlK9L1k2m2LK6j2J8L6On6rJ4jJ4L2%k8
3315C0l6J2QJ0K2J0l9o%j0J8M2Lo1j0K0%oM2J0l6k5K0Lk8J4M9ln7pL1j5j5O4L8
3350I2p1n2M8K8l5K4M6m5p3K0N2k3%L7J1r2KM1J3l5M1K9n0o7M2L6k5mK7j2n8L
3382e0L0lMK5j2m4NK3j8J9N1m0n3MJ8J1OL2%q7RN9nk9N1L8p7m7O6K3n5PQ2m4r2
3417i3L8O5l1l0P9Lq4j5P9J5o7L8M0n8n0N4L8n8J1N6l0q0L4M6oj2M8k4o5K4M9
$$ y = [32, 79, 65, 42, 49, 38, -20, 16, 86, 93, 22, 19, 61, 32, -6, 40, 91, 41, -6, 34, 48, -17, -26, 40, 84, 1, -11, 24, -6, -34, 9, 80, 51, -28, -20, -10, -27, -4, 58, 29, -33, -49, -34, -13, -10, -1, 7, -16, -33, -51, -32, 3, 3, 1, 4, 2, -27, -57, -31, 32, 31, -16, -30, -16, -57, -64, 16, 33, -10, -41, -28, -40, -52, -12, 55, 2, -50, -38, -21, -63, -38, 18, 11, -44, -59, -12, -40, -57, -15, 14, -25, -48, -29, -44, -51, -28, 30, 4, -30, -30, -34, -55, -12, 38, 26, -40, -40, -22, -24, -13, 37, 40, -6, -38, 3, -6, -9, 20, 51, 29, -13, -10, 16, 4, 22, 58, 64, 8, -1, 13, 12, 26, 58, 58, 30, -6, 6, 14, 24, 46, 56, 17, 11, 11, 1, 19, 61, 64, 3, -7, 13, 13, 7, 49, 59, 23, -2, 18, 21, -7, 7, 56, 53, -4, -11, 20, 5, -10, 54, 92, 21, -31, 17, 45, 10, 34, 80, 35, -38, -18, 34, 11, 11, 48, 59, -33, -31, 10, 23, -12, 29, 58, 8, -59, -17, 19, -6, -10, 17, 5, -53, -50, -20, -23, -19, 6, -6, -50, -45, -22, -40, -21, 30, -10, -63, -59, -41, -30, -24, 8, 8, -79, -70, -11, -16, -45, 6, 44, -33, -80, -14, 9, -46, -39, 43, -1, -93, -55, 10, -21, -51, 28, 31, -53, -68, 11, 26, -41, -3, 37, -21, -71, -17, 21, -37, -26, 30, 0, -80, -46, 0, -6, -18, 30, 6, -59, -35, 14]
3448A4j4k9N6qn6KL7%k1L4L3n8k6N1Mk7M3M0p6l6M7L1l2J2M2l1p0M3N6n0j5O5
3480F1j4r3L1O7l3l2O3K4j01k4P2K6p4L2O1o8n3M8N3m4k7Q6k5p6%N1Kk9M5Jo8
3511c8j0O3Ll5K0K4l7l1M7K7m7QL5k2m3J8K1k2K5M0m2l1KL0j9J7K5j1o4K2M4j
3543A8k7J9J3o6J0N4j0o1L4M1m5m6O2L3o2JO9k9p3K2O9k0n0N6K2p6j8P1J1n1L3
3574DL2m3o9N9N5l4k5L3jm3J8M8k1l1J9K1k2mK1k7JK8J5l1k6K9oj3L4J8o4j7M6
3607DQk7K5K3n0l8N8K0n4kN3j1o0L4N8l8n5O7M0p2k7M7J7n7L2M6m5l8L3K8l7J9
3639AN3m0n6L6M7j9l5L6J0o3J8N9m1j5J7L1m6KL4k1k0K0M7l6l2K6j1j4K3L9m2
3670Hm5L1L0l4QM8m0n1M5N0n7j3M9rm8K8L9k7m2M1M6m1l4N4j2o0L6P1m0n9M5K7
$$ y = [14, 0, -29, 27, 19, -37, -35, 2, 2, -19, 15, 48, -10, -36, 15, 19, -8, 35, 75, -1, -37, 10, 41, 9, 21, 63, 32, -38, 5, 61, 11, -4, 61, 47, -46, -15, 52, 19, -13, 50, 74, -27, -51, 21, 47, -27, 5, 66, -2, -55, -7, 46, 2, -25, 61, 36, -40, -40, 11, 13, -16, 29, 30, -38, -48, 15, 18, -17, 3, 27, -10, -41, 6, 33, -14, -6, 29, 7, -36, -18, 3, -19, 6, 46, 4, -27, -25, 5, -14, 3, 28, 17, -47, -25, 19, 18, -9, 10, 23, -43, -33, 21, 11, -50, -16, 25, -20, -66, -4, 29, -33, -32, 37, 8, -65, -43, 26, 6, -44, 12, 34, -42, -60, 11, 22, -29, 4, 36, -7, -76, -17, 38, 4, -21, 12, 11, -32, -14, 34, 13, -18, 1, 22, 0, -4, 17, -10, -9, 19, 34, 3, -23, 6, 0, -13, 21, 39, -25, -42, 4, 12, -15, 10, 33, -17, -55, 3, 23, -31, -33, 20, 9, -51, -17, 41, 3, -52, 15, 55, -17, -44, 3, 20, -37, -5, 41, -4, -42, -9, 19, -18, 1, 54, 14, -42, -6, 41, 22, -13, 23, 33, -30, -12, 47, 6, -9, 8, 39, -7, -5, 29, 8, -12, 8, 55, 19, -13, 13, 2, -12, 11, 50, 8, -37, -6, 24, -10, -2, 46, 6, -45, 0, 50, -7, -20, 29, 20, -28, 0, 39, 12, -30, 11, 57, 16, -18, 36, 24, -36, 0, 71, 31, -28, 17, 44]
3702D4m8ON9j3q6K5N0j2l0M8J1p2QN3k0l0K1K3l7j5M8j1m8K4K7k9qK6jo1M5M0
3734C7k5n3L5Kk3K4M4l0o4L3L5k7j2M4jp1L6N9m0l3L5L4m9j0N2j0n8L5M8m0k9
3765b2K8J1n1J7O2j2o0J0L2k1rL5J3o8J2L2mk8K4Pl3rM2pk7JL4qqK1k2j2J1K4
3799A5j1j4OJk7K8L3j2m4J9J6rLL5qn4K3M6k5k0L1J3m7kN4qn2J1N5j4m3J9J7l1
3833DoL5Rk5j2J5j4jJ8Ll2kJ3QLJlk2J3J2%j1LRj5ML1l3j2OK7j6MJ6j9l0L8J6
3871C5k2nPkj6K4Qjl0MJ3oOJ2j4j4KM6k7l5J6J0k3JJ4nk6KK6Pk0Rqj7PJ7Pj9J
3910a6j7J4MJ9j4j5QKMK2j8j5%L4%ppJ2roJ7K2l4j9K6J3k6J2K8l7l1L8K6j9k1
3945a0L0j3j4lM6j5k9PK2j4qMMnJ1kj1kPj3PJ3J0k9lJ5nj7L7Nm9NL7K2m4LL4l6
$$ y = [44, -4, 2, 61, 48, -38, -13, 37, 25, -5, 43, 54, -18, -10, 43, 23, -7, 14, 37, 0, -15, 33, 22, -26, -2, 25, -4, -12, 14, 13, -48, -3, 37, 12, -41, -6, -4, -27, -3, 41, 11, -53, -20, 15, -12, -24, 20, 19, -52, -16, 43, 3, -30, 5, 39, -10, -20, 32, 22, -36, -1, 47, 7, -22, 6, 17, -34, -17, 45, 33, -27, -17, 15, -6, -15, 20, 33, -35, -23, 9, 5, -23, 1, 8, -25, -34, 8, 1, -26, -25, 9, 1, -7, 14, -8, -20, -9, 15, 4, -10, -4, -3, -30, -2, 31, 19, -25, -6, 10, 1, 4, 39, 31, -23, 0, 46, 21, 1, 32, 45, -2, -4, 50, 42, -10, 1, 56, 42, -1, 18, 35, 4, -2, 33, 42, 17, 5, 20, 6, 5, 23, 26, -6, -8, 5, 13, 16, 17, 14, -8, 5, 17, 17, 6, 9, 18, 3, 7, 38, 5, -7, -1, 26, 10, 14, 30, 11, -19, 19, 35, 13, 8, 15, 13, -3, 21, 29, 28, -2, 2, 15, 9, 15, 27, 13, -1, 1, 47, 20, -15, 1, 11, -12, -11, 3, -2, -28, -26, 0, 7, -13, -4, -12, -29, -22, -5, 2, -17, -16, -33, -19, -15, 4, -10, -25, -17, -15, -11, 11, -7, -22, -22, 12, 12, 5, -2, 10, 1, -5, 12, 34, 0, -19, 7, 20, -6, 6, 34, -3, -34, 4, 30, 11, -10, 20, 7, -7, -10, 36, 21, -8, -1, 21, 7, -1, 3, 7, 2, 13, 11, 0, -2, 5, -8, -1, 12, 22, -7, -10, 5, 0, -17, 20, 25, -24, -19, 18, 40, -4, -1, 33, -3]
3983cl2N1L3n5j5L9J3m6J1L6k2k6L2K8n5pK8Ok1L5jm0k1M5kk6J4J5k4k5L1K6n0
4016b8%L6k1m0L1K4k4j5L9Nm4QL2j5l6N1J5l0k4L6ll0K9K5k9l6M1K1l4J5J3k4
4048a2j3L5K2k9k8M6j0l1K8K5m4j0L7J3m1JM0l5k8M5L4m5m5N6Nl2KM2j9m9L3M5
4080C8m4k6M6Qn1J3O1m0l5L0J4k1%L0j1l2K5J1j0j5K7j4j4K0K2j7j9J1Oj2ML9
4112D4k7m9N1J4l5j7L9nl9K3L3k8m2M0K2m9nM7j9m2J8N6m2k9L3J1k6j4M3ol6J2
4144b4K7j3l2K2J4ok2K7jk5OL2j7j0J8Knj8J7M%J6j5k6K5J2j0j0K0oj7MK7j8j4
4179a6J5J5j2k9L1Jl2J8K0kl5NL3k6nK5J8l8j1L5Nk0%J7jk0J0J6j5%J5J6j5k4
4213fK1klJ6Oj9MRloJ6j0pJ5Kj3j4L0Oj5j3J3Lj0J0JrqJJ1j5pJ9kk3J8Mk4PoK7
$$ y = [-3, -35, 16, 49, -6, -21, 18, 31, -15, -4, 32, 10, -16, 16, 44, -11, -18, 10, 16, -5, 30, 29, -11, -32, 13, 11, -15, -1, 14, -10, -35, -4, 22, -28, -28, 8, -13, -53, -22, 2, -22, -37, 2, 7, -37, -29, 3, -12, -48, 3, 18, -12, -36, 0, -3, -33, -4, 21, -8, -44, -3, 18, -16, -1, 12, -12, -25, 10, 32, 3, -25, 21, 11, -20, 8, 33, -11, -21, 16, 29, -12, -11, 29, -6, -34, 11, 45, 0, -45, 11, 16, -16, -14, 28, 9, -40, -7, 38, -6, -32, 14, 22, -29, -16, 45, 5, -30, 0, 14, -7, -7, 23, 12, -20, 5, 16, 6, -9, 18, 4, -10, 10, 32, 15, -4, 7, 13, 1, 5, 44, 17, -32, 19, 33, -2, -19, 20, 15, -24, -1, 32, 4, -38, 2, 24, -25, -30, 17, -2, -44, -26, 30, -12, -41, -8, 3, -23, -37, 6, 0, -36, -24, 3, -10, -42, -20, -6, -12, -34, -7, -8, -33, -27, 5, -12, -22, -4, -2, -7, -25, -8, -4, -4, 12, -3, -29, -4, 8, -2, -12, 8, 2, -15, -11, 16, -2, -16, -1, 14, 2, -27, 4, 5, -27, -9, 11, 9, -26, -21, 12, -14, -19, 6, 24, -14, -25, 10, 15, -5, -5, 12, 11, -9, 1, 17, 2, 2, 17, 33, 18, -6, 15, 13, 10, 26, 32, 13, 17, 26, 23, 17, 33, 23, 16, 31, 33, 20, 6, 36, 42, 27, 14, 27, 30, 20, 30, 31, 22, 14, 15, 26, 11, 4, 23, 21, -2, 16, 20, -4, 3, -3, 24]
4254B4k0noJ8qjK7k6%MPj0nJ8j9KMJ3j2LJ9pj3j5QOOpJ6j2O%pj3MmRjNoj6RJ%
4298dj8K2j8LJ0rj2JOkkK0lj9j0J8JjQllmPQk7J8Q%rQlkQK3j0j5RoK7rLrJJJ6
4343B8k4OROl0J3QpJK6j6j4KK0%j9J5%k3kJ9jj2PK3k2j6K7monK6%l3J9J1j0oJ7
4382C3j0l7K2K7qj0J7Lk4KJ2joPJ4k0j9L7pj4%J4qk3J6J5k1%K9j1l3MQJNJ3k4
4419Ck2J0J6k0nL6ql5J1L3j5k8J8J4j8j7L3mk7J8L2l1j9J6J8k9K2L3j8l2NJ7p
4452@JK2nl9%L3rk1M2Lm7qN2nk7J8J1j6l6L5Pl2J0L1k3l0L0K1l9mM4j4l2PL6k4
4488hj2M8ln1OL2Jl0L2J2m1j1M4%m5L5M1m6k0K8K9m6KN7j4o0J7L2k9LL6jn3J2
4522cL5j5k2L0J6m4j1M0%l9J6L1m4oL3J1n5K0M5n0j2L2J6n5J9N2k7n4M0K3l1k1
$$ y = [24, 4, -1, -7, 11, 3, 2, 29, 3, 3, 7, 14, 4, -1, 17, -2, 0, 4, 17, 5, 8, 27, 20, 7, -8, 0, 6, 12, 5, 21, 9, 15, 15, 8, -5, -1, -5, 4, 3, 8, 2, -14, -5, -4, -4, -22, 0, -18, -15, -5, -14, -26, -25, -19, -21, -23, -3, -6, -25, -35, -17, -16, -17, -9, -12, -15, -19, -12, -4, -31, -13, -5, -5, -14, -6, -9, -11, -3, 20, 10, -5, 4, -2, 25, 16, 19, 10, 11, 12, 28, 4, 10, 19, 25, -5, 8, 16, 9, 10, 36, 20, 6, 8, 28, 28, 9, 24, 24, 1, -1, 18, 17, 5, 12, 35, 13, -3, 24, 20, 14, 9, 35, 35, 2, 21, 32, 22, 16, 33, 23, -14, 8, 35, 27, 17, 34, 37, 13, 15, 27, 26, 20, 27, 41, 21, 2, 39, 32, 18, 18, 32, 24, 1, 17, 32, 11, 11, 40, 29, -4, 0, 8, 9, 14, 27, 3, -19, -9, 7, -13, -18, 18, 10, -25, -14, 19, 4, -24, -6, 8, -10, -27, 6, 2, -25, -7, 25, -6, -25, -9, 9, -20, 2, 35, 17, -15, -10, 7, 0, 1, 23, 18, -21, -21, 12, 3, -18, 24, 27, -20, -28, 24, 19, -8, 10, 21, 5, -31, 4, 11, -21, -11, 20, -3, -33, -3, 18, -21, -25, 19, 5, -27, -20, 16, -8, -20, 28, 25, -26, -20, 12, 13, -17, 15, 27, -14, -25, 19, 19, -26, 9, 50, 4, -16, 12, 41, -5, -3, 54, 40, -20, -3, 29, 0, 3, 39, 38, -15, -3, 32, 17, -5, 25, 41, -3, -14, 26, 26, -13, 3, 34, -10, -16, 17, 28, -27, -7, 38, -12, -24, 8, 24, -31, -12, 40, 13, -41, -1, 22, -9, -30]
4554c0N8Po1%N3Pn4L5L2o3j8O5Qo4J9N3k8n7M7L5n3k5O0j2m0K8L2l8qK8J0l6j5
4587b5N8l1j7K6Pm6pN1j2k9K8K1l4k7N6Nm6KL4pm4M1L6o5j2O2%n0J2M8m0j9M6
4620B2K1o3JN2k5mJ4J1m3j7P3mm8QL4m1k8N1K5m5oL6mm7K3K9k9k1K8J8n7J0L8
4653A2mn7M6J9l7j4L5J0l0J2J7m0j2M8Rl0nK6k9mK1K4l0j2K7Ql7J6L1k6k2L2K2
4686B6n4lL8pk3J7K9l5k7L5J4k7JK7k4k5L3K1k9j2K1ml4L6kj0j2J3Oj1RJ5j1j7
4720b6J7J3j9LK0k0pLL0l9jL4Ql4J4J1j4j3K6K2k8mK0j6oRK5j7k0J2J0l3K2Kj1
4755gpJ5Oj2rOK2k1MJ6k8j2L2j6OlJ0rrRJ5k4j4K7npMNj2MRJrOK2j9JPNk6KK0
4797EoLj1K0k8j0L3NpOqk9J0QJ6pj4J3j2JqL1j9j0LJ5k0MRprJ7j1qoJ3N%nNoq
$$ y = [-30, 28, 35, -26, -26, 27, 34, -20, 15, 47, -16, -34, 31, 39, -25, -6, 47, 19, -38, 9, 44, -9, -34, 26, 14, -26, 2, 34, -4, -12, 16, 26, -10, -25, 33, 2, -15, 11, 18, -28, -35, 16, 4, -25, 3, 24, -10, -37, 19, 24, -22, -20, 14, 7, -37, 4, 40, -25, -37, 25, 25, -25, -13, 35, -5, -24, 22, 43, -20, -19, 33, 8, 4, 18, 29, -14, -31, 42, 38, -10, -2, 32, -9, -37, 14, 39, -6, -12, 24, 20, -27, -4, 25, -4, -25, 3, 21, -36, -26, 12, 8, -49, -3, 16, -21, -35, 0, 10, -20, -8, 9, -31, -43, 5, 14, -16, -21, 5, -24, -28, -7, 17, -13, -25, 2, 10, -27, -11, 20, -6, -28, 4, 26, -28, -31, 7, 0, -23, -6, 23, -12, -39, -4, 10, -17, -16, 11, -13, -38, -5, 16, -13, -25, -4, -8, -42, -6, -8, -18, -30, -17, -11, -22, -13, 2, -9, -26, -9, 4, -15, -12, 8, -12, -19, -16, 14, -25, -26, 8, 16, -18, -4, 7, -7, -20, 6, 28, 0, -4, 16, 0, -6, 3, 28, 11, -9, 3, 13, -20, 2, 4, -7, -14, 1, 7, -5, -14, -8, 14, -7, -3, 13, -15, -27, 5, -11, -5, -8, 2, -7, -16, -7, 8, -16, -30, -3, -8, -15, -11, -6, -18, -14, -5, -4, -13, -7, 15, -4, -3, 4, 9, -17, -15, 5, -1, 2, -9, 11, -17, -27, 6, 11, 4, 10, 2, -27, -17, -9, 7, 0, -14, -1, -13, -12, -20, 11, -8, -18, -15, 0, -20, -16, -7, -14, -23, -6, -17, -25, -31, -18, -13, -13, -18, -13, -19, -27]
4839b7J7Pj4J0j0krJ5%oJ2nmnK4j2%Qqjj1KJ6%j1J3Lj6kQLpJ3Ql1PKJ5qmMj2j5
4882c3K2J8j7qj%jlJ3J6j7RJj4q%J7rPJjqJ7J0jjj0nmK6q%oM%j6OJ8j2kNqoKK3
4927A6pk3K4jk3mM4j2l0QK4k7j1PJ9j0%Mrk1L0J0mKj6jj4QK4kj9KRj0MKRJJKj5
4968ikJ9J0k1NJ8k9j0J8K4k3oKJk3K3L1j9k7K3Kl2PK1mk8J1J3j8j6K7J5k9OK6
5003Fj9l2L0J2j1qJ1nj5J0K2nj2J5rl3K7K8%k6MJ7k7jK4nqkJ9k1k0L2Rk2NRk0
5040b1j3L0Pj8JJ9j7j9OL8j9k0J3Mk0kL5j1j5lK9l3j7L7Pj5lJ8k3mOK9k0rK1j6
5076a8k1K6K0qj0J0kj3JL4j0pjJ0k2j1L7Lk2jK0k4qK2J4j8j2J7Kk7J2K0oj5KJ3
5112Gk3j5M1j4j6J3rOj8L2jlqQj2rJ8Qk0QJ8j7j3L4Jk5mJ7qmNL6l1j4K0lj9pK9
$$ y = [-27, -10, -3, -17, -7, -17, -19, -28, -13, -13, -19, -7, -12, -16, -21, 3, -9, -9, -1, -9, -10, -21, -19, -3, -3, -14, -1, 2, -14, -16, -8, -5, -12, 1, 9, -22, -15, -13, 2, -6, -10, -6, -18, -33, -11, 7, -10, -18, -19, -19, -20, -23, -10, 6, -11, -2, -1, -15, -23, -23, -6, -15, -8, -7, -8, -16, 1, 11, 10, 9, -1, -6, -10, 16, 8, 8, 2, 6, 6, -10, -4, 14, 2, 0, 5, -3, -9, -7, 16, 9, -14, 10, 9, -14, -18, 26, 14, -16, -8, 16, -11, -22, -15, 4, -6, -6, -2, -11, -32, -2, 8, 4, 6, -10, -11, -25, -17, 7, 5, -14, -12, -3, -13, -9, -7, 2, 3, 4, 6, -9, -11, 8, 18, -3, 2, 20, -9, -19, -1, 23, 0, -6, -4, -3, -26, -3, 28, 9, -18, 5, 7, -25, -18, 3, -1, -29, -18, -5, -23, -39, -12, 3, -26, -20, 6, -13, -45, -15, -3, -14, -22, -11, -16, -31, -21, 1, -4, -16, -1, -10, -43, -16, 12, 12, -14, -10, 7, -20, -21, 3, -2, -10, -12, 7, -14, -34, -2, 7, -15, -10, -1, -21, -34, -4, 3, -15, -14, 5, -12, -31, -25, 13, -6, -26, -13, -9, -29, -31, 4, -7, -22, -25, 4, -29, -46, -9, -2, -17, -20, -2, -25, -29, -23, 6, -14, -23, -2, -18, -39, -13, 7, -1, -11, -1, -3, -16, -15, 19, 9, 2, 1, 11, -11, -22, 15, 18, -4, -5, 15, -9, -17, 5, 19, 1, -11, 6, 8, -19, -7, 13, 7, -8, -6, 7, -16, -31, 10, -4, -20, -7, -16, -10, -28, 4, 3, 0, -8, 0, -12, -21, -3, 5, -15, -7, 11, -6, -19, 15, 16, -9, -13, 4, -4, -8, -3, 33, 2, -12, 8, 5, -14, -21, 8]
5151HQj5Llj4oJ2J5j9pM%j9J7KMj3JRj5J5Jj6Pm%j4KK6nlk%lk0L7ln%kj2NJ8Q
5195BqqOkpJ7Ppj6K3lk4PJ2J4k9pJ7pmJ9Lj5ONj3oKJ7qj9J4qOJJ1rQqJ%j2L1j2
5239cj2%OlPJ5j0rjKKkKK5j5%MkkKJ2qmLMk0%J4J2k6mJ3okJ2Pkj7rK4j6PMj8J
5284a3nJ0JlJ0nj0JmJ2k0K6oPLj8K1k3J3Pkk8J8OrOPpmoJ5Nj3J0nNj6J4qpJ1R
5326Ej5j3K9mk8J1K1k1nNJ2j7JJ9j3j5RPj5nK2nj2%K3nj3jK0j1qJ9Qj9kK0%j5
5364a1%JnK2Kqj2J1KpRJJ3k7OJJ5j1mJ4qrK1Ll2J1J6j7oK6j2k0kK8j3oRnMk1K5
5405Doqj0K3mj5J7J2k4KK1j5KmJ5k0KRNj3nK4pmJ4Ok5jK1Qk4MKkqnK4j5j9J6J8
5446A5k9PJ5j4j0J0Rj0pJ1j7lQJ1j4oK2k3J8oJ3j0j0J5Pj2oJ6rj1J2K4k5rK3l
$$ y = [8, 16, 1, 4, 1, -13, -19, -7, 8, -11, -18, -14, -14, -33, -16, -14, -10, -23, -22, -13, -28, -13, -12, -28, -21, -25, -25, -39, -37, -11, -16, -19, -21, -21, -24, -44, -7, -10, -15, -15, -17, -29, -24, -6, 2, -6, -14, -8, -10, -17, 0, 7, 0, -16, 7, 4, -20, -13, -1, 13, -16, -23, -6, -13, -17, 2, 5, -10, -4, 1, -12, -18, -16, 1, -7, -26, -12, -20, -14, -13, -2, -11, -3, -11, -10, -10, -22, 9, -3, -15, -15, -9, -12, -5, 10, 0, -9, -10, -8, -6, -8, -6, 19, 4, 4, 8, 6, 4, 6, 18, 10, 6, 9, 13, -7, -7, 7, 19, -7, -11, 2, -4, -6, 6, 13, 11, -6, -15, 9, -7, 0, 4, -14, -13, -18, -8, -7, -10, 0, -5, -15, -14, -18, -6, -26, 0, -6, 1, 4, -14, 7, -16, -3, 4, 2, -26, -8, -2, -11, -5, 2, -5, -9, -15, 0, 5, -8, 2, -3, 2, -14, 0, -8, -15, -4, 5, -10, -23, 6, 2, -26, -15, 6, -15, -20, -15, -3, -20, -19, 0, -13, -28, -19, -12, -27, -32, -10, -15, -27, -27, -4, -9, -22, -23, -3, -14, -22, -3, 5, -14, -16, 4, 4, -11, -11, -10, -15, 7, 9, 1, -11, 0, 2, -5, 4, 5, 18, -9, -3, -2, 13, 2, -2, 12, 4, -5, 16, 19, -13, -2, 14, -3, -9, 17, 5, -15, -17, 11, -2, -8, 1, -4, 0, -21, 4, -2, -10, -20, 3, -1, -16, 1, 13, -11, -9, 12, -3, -1, -5, 10, -10, -8, 1, 6, -7, -12, 12, 5, 1, 15, 21, -4, -5, 16, 24, 0, 4, 6, 4, -4, -9, 15, 0, -19, -3, 15, -14, -7, 8, -6, -16, -6, 3, -7, -14, -3, -20, -23, -15, -4, -18, -24, -2, -25, -7, -13, 0, -10, -20, -5, 2, -10, -16, 0, -9, -20, -8, 16, -9, -18, 5, 2]
5482Bj5kJ4Oj3K5oqqQ%pRk%j2OMNj5J2j3ONjllOmlnJ3mqJ3rpRLj2JQPk2RmPOM
5531BOj2JjJ3k7K2kLnLJ2nrPlMQj3J1r%prJ6qrJ2Oj3jQNk6K6j0lmM%JJl%rKLk
5579a4JOjNpnQNlqPJJ3j0qMJ8j1JmLqnK1oj2%OMqJ5oqRKjj5J6mmrJ2mNkoJ2pj
5628cKj8RNojqKrRJ2llPlOkOQk6K2%j5qJ3Qmj0K7j6j3J0J3j2MRpjjPlKKoj1OJ3
5675A3pkKNpj5K3mj4J5%k4LjLoJ0J0k0oJ3Nj%Njj7J1jNqJ3Oj4lJ4LnjJj3RJ1K
5719A2pJ0Pj6oJ7Jl%qjj2mLJ2m%%oJ3J2mj4rNj5J7pOj2K2kk1lKRQj%j5oMK0Qj1
5764AkKk0J7RNpMKj3%J3jOprO%qK1j0LkpmlJ3nMMpqMQJ2j0j3MLk2J5J2k2J4Kj1
5810gjK0Mj2j0NJ1j5J1J5j6j0J8lqnJ4Qj9JRoj0K7Qj7Mjnj2J0J9k3J1lj0qJ4N
$$ y = [2, -13, -15, -1, 5, -8, 17, 11, 3, -5, 3, 3, -4, 5, 3, 3, -9, -3, 1, 6, -9, 3, -10, -4, 1, 0, -3, -6, 0, -4, -7, -12, 1, -3, -11, 2, -7, -14, -5, -2, -14, -13, -5, 2, -20, -11, -15, -8, -2, 2, 8, -4, -3, -4, 9, -18, 4, 2, 5, 0, 3, 15, 10, 1, 8, 5, 9, 17, 4, 15, 6, 6, -1, -10, 6, -2, -11, 1, 7, -6, -7, 1, 6, -20, 6, -4, -7, -11, -7, -7, -6, -5, -8, -8, -17, -15, -12, -14, -13, -7, -8, -3, -10, -15, -7, -2, -5, -13, -6, -5, 8, -2, -10, -6, 12, 1, 2, -2, 1, -7, -12, 9, 3, -9, -9, -3, 1, -7, 8, 2, -6, 3, 5, 4, -11, 5, 1, -3, -12, 0, -4, 1, -1, -7, 5, -2, -3, -1, -19, -10, -5, -11, -12, -20, -18, -27, -18, -6, -9, -12, -5, -8, -2, -4, 2, 10, -16, 6, 6, -9, -17, -4, 4, 0, -10, 17, 1, -12, -2, 11, -1, 3, 12, 5, 4, 3, 10, 7, 9, 11, 5, -6, 0, 13, 6, 4, 6, 11, 4, -11, 12, 8, -6, 9, 9, -15, -12, -13, -10, -16, -6, 4, -16, -22, -9, -4, -5, -5, 0, -1, -18, -7, -8, -3, -11, 2, 8, -6, -9, 5, 8, 3, 2, 3, -10, -1, 10, 12, 5, 15, 22, 6, 0, 17, 18, 15, 15, 7, 6, -6, -10, -7, 5, 1, 1, 1, -5, 8, 20, 16, 2, -7, -2, -17, 0, -7, -1, -13, 9, 7, -14, -17, -15, -6, 2, 1, 1, -14, -20, -16, 4, 12, 1, -1, 1, -19, -2, 7, 12, 5, 9, 11, -2, -2, 11, 10, 16, 9, 0, 6, 6, -2, 19, 9, 12, 10, 3, -1, -4, 9, 4, 8, 12, 5, -3, 1, 9, 21, 11, -2, 2, 5, -17, -2, 10, -12, 2, 4, -7, -8, 12, 16, 4, -6, -1, 10, -5, 6, 21, 5, -5, 13, 10, 2, -3, 11, 19, 0, 1, 10, 4, -6, 21, 29, 12, 16, 15, 10, -2, 8, 27, 4, 15, 12, 2, -6, 8, 13]
5849A3nnl%MmMklQrk2J3PKnMJ%j9J3J2n%Qj4LJK3j7j5LJ0j2KJ8j0kJJ1k1lJ9O
5893A0j0LMLj4K0rj0qJ5mpJ7KqqNkmLJ0j4jKj3MPKjoKjmmQKqRLlKJLOmMJj4Mn
5943a0J6j2pOnJ6%nnPOqJ0Lrl%LnJj1J0MmJ2mk6J2J5ojKMj8MJJ0lj7PJ0rJ0m%
5988cmPo%J0jKlJqKQmkkJ3j2MPjMqRj4PMmmpJ0j3KNPlOj2%J3j3nJJ2%j5nJ2qO
6037ePllj5OPqKQJ0j4nJ6ojOpkkJmKNJloOQ%%nJ1mj0oJ6mOjmJJkMkLpqQqMNJq
6091hrRlKpJ8j1mOKj5J1K2k3nmRjmJ4Kj8LJ2o%J3Jj9J3ROj5J4j2%pJ5pj0J6lo
6134@nJ0mpjK0j9lJ3p%j3J4OooOpjJ0Lk0%K1Lk4PK3k0mJ2%j2KK7j6j0J4rj1QK0
6176A4%k6J9J3j3jJ2Ll0J4J0j7kJ2%j5jJ7mj7OJ7j9mJ7Nk1MJ0lk7J4K0k4LJ0M
$$ y = [13, 8, 3, 0, 0, 4, 0, 4, 2, -1, 7, -2, -24, -11, -4, -2, -7, -3, -2, -2, -21, -8, 4, -1, -1, 7, -7, -4, -3, 20, 3, -12, -9, 1, -11, -9, 9, -1, -3, -2, 9, -12, -15, 4, 10, 0, 3, 7, 10, -4, 16, 7, -3, -11, 4, 0, -7, 10, 12, 4, -4, 1, -1, -5, -2, 8, -6, -7, -5, -18, -14, -7, -5, -6, -12, -10, -11, -15, -19, -11, -9, -17, -8, -5, -8, -6, -5, -2, 4, 0, 4, 5, -9, -5, -10, 6, -6, -13, -7, -12, 4, 4, -1, -6, 1, 7, -1, 9, 12, 3, 0, 0, 3, -2, -1, -12, -2, 2, -2, 10, 6, -20, -8, 7, 1, 0, 2, 6, -12, -8, -7, 3, 0, -17, -10, 0, -9, 1, -3, -3, -7, 0, -6, -6, 4, 3, 5, 2, 3, -5, -3, 5, 1, -1, -3, 10, -2, 2, 9, 8, 12, 4, 13, -1, 6, 10, 6, 2, -5, 5, -8, -6, -1, 6, 3, 9, -3, -3, 10, -3, -8, -7, 5, 5, -10, -15, -3, -11, -5, 2, -1, -4, -19, -13, -6, -14, -12, -4, 6, -8, -13, 3, -3, -4, 2, -5, -7, -9, -8, -12, -10, -5, -4, -7, -13, -7, 1, 1, 1, -4, 7, 3, -7, -13, 3, -1, 5, 4, 0, 1, 2, 0, 4, 2, 5, -2, -10, -2, -10, -6, -1, 0, -8, -17, -8, -11, -9, -16, 2, -9, -13, -7, -5, -20, -9, 13, -10, -15, -19, -10, -11, -15, -1, 1, -17, -14, -2, -8, -8, 5, 6, -13, 0, 9, 15, 0, 14, 2, 2, -5, 10, 3, -7, 9, 6, 0, -5, 5, 1, -6, -7, 13, -6, -9, 4, -3, -3, -16, -2, 4, -2, -8, -2, -9, -10, 0, 3, -17, -17, 4, 7, -17, -10, 13, -7, -11, 1, 1, -11, -9, 18, 2, -8, 6, -3, -14, -6, 14, 14, -12, 7, 20, 7, 6, 18, 21, -9, 5, 15, -2, -4, 8, 8, -7, -8, 9, 5, -12, -6, 11, -8, -12, 5, 10, -11, -7, 3, 0, -27, -13, 7, -17, -14, -4, 0]
6213@k0NJ9k3j4J5Qj0j2L3nj5QK2j9KRLj6kL2j3k5K4Mqj5K8j2krJ1%j6K3Lj9J3
6251GKj6oJ3J3k6pJ7NqpJ5nj9K5Rl1PJ7j0j7J0mjqK2J7l8L2Kj3j1QJ9j8nJ5j9
6289a4mJ2J5j6KJ5nj1NJ9oj6QJ0j2j0K2j0k0J0PojQOj9jNjqK0jj6NJ1j1j0ONN
6329brjM%kK2j6nJ2lkoK1nnoLMj7J8mmkK0pj5QK7k7lJ3J2k4nLJ4k3LJ8j1nMJ1
6372Hk1J5JOlmRj5qK0j0rj2J9jj4OPQqJ7mj7J4mj1J4oKMpK4j5j2J8pmlJ6jj1j4
6414a3K1jj1QMj9J7JlrLJ7k4MJ0Jj0jJ0j1pPJ7k3lJ0Nk3KOJLKlJoJ4KlJ3qj1Q
6457blLKMnNj2J9onP%KpMNj8J3LKrmNmJ0%opPOkoKmj1J0pJ7pqK1qj5J0kqMOj6
6506a5LJ1Oj0pK0j0KN%mKJ1rj7K2J1j6nMLNpRKn%lrLPkj3OJ0k4J4J1j1jkOkjk
$$ y = [0, -20, -15, 4, -19, -33, -18, -10, -20, -32, 1, -4, -19, -11, 11, -8, -6, 3, 6, -10, -12, 20, 7, -18, 6, 10, 2, -13, 15, 3, 1, -8, 3, 3, -13, 10, 13, -6, 7, 9, -7, -13, 0, 13, -13, -20, -3, 2, -6, -13, 2, -3, -22, 3, 12, -19, -12, 5, -5, -22, -12, -16, -17, -25, -3, 14, -24, 8, 10, -3, -14, -6, 13, -5, -10, 5, -14, -18, -6, 9, -7, -5, 10, 5, -6, -1, 18, 12, -4, 4, 14, 2, -8, 14, 4, -16, -6, 1, -5, -6, 2, 8, -11, -12, -7, -8, -16, 4, 3, -13, -8, 3, -8, -18, -12, -7, -2, -11, -12, -8, -8, -10, 12, -4, -9, 3, 0, -2, -8, 13, 8, 3, -3, 0, 4, -13, 5, 1, -3, -5, 15, 8, -7, 1, 28, 1, -2, 11, 23, -1, -6, -3, 11, -12, -9, 9, -2, -7, -3, 8, -13, 2, 3, 9, 6, 2, 11, -4, -12, 8, -2, -11, -23, -4, -5, -19, -13, -6, 2, -6, 11, 7, -10, 4, 0, -11, 3, -3, -1, 3, -4, 20, 5, -7, 11, 4, 0, -3, 13, 12, 1, -13, 8, 7, -4, 4, 8, -11, 6, 7, 4, -5, -2, 15, -9, -5, 5, 6, -4, -5, 5, -6, -13, -6, 11, -12, -15, -5, 0, -23, -21, -15, -14, -11, -9, -12, -11, -17, -3, -1, -4, 9, 1, -10, -2, -5, -2, 0, 4, -1, 4, -8, 11, 5, 0, 7, 7, 9, 2, 6, 11, -7, 6, 9, 11, 2, -2, 3, -1, 9, 9, 3, -4, 3, 9, 7, 1, 3, -1, -12, -2, -9, 8, 1, -7, 14, 6, -9, 1, -1, -9, -5, 1, -15, -12, -1, 5, -5, -12, 8, -2, 0, 5, 5, 1, 3, 14, 5, -12, 10, 21, 5, 0, 4, 7, 12, 5, 14, 16, 11, 11, 8, -1, 2, 9, 7, -6, 0, 10, -14, 0, 11, 0, -1, -3, 3, 1, 0, -2]
6551bJ1j0nRMj1mK%qJ8j0Nj3RQj7K0j4NoPkQ%Oj7j1J9lNj2K1prNNoQRj0j4NJ3
6595A1j6nMoJLL%mLJ1j3OnOj2LQj0qJ7lpOj1J3j7OJ1LmQJ2k3LPLj3PJ2j9mJ2O
6639EqJ2pJqJ6j1qJ7Nj1LRlj0nQPk7K3%j3oJ8Oj1JOpj0K0j1j6jRQpkJ0qjJ1Nk1
6683a2PJ5j4PPmrJ3j4J7k0QJ7j8pK3p%mK3k6kJ0J1j5mOj1pJ1Lj1nK4j2j7K0Qo
6722Ek2RPj1KK5j2k3OK0j7oRRj8MJ1j3LJ6kj3lK6mj1KM%qLNjj2J1JkMJ1j5j5K8
6764A3pnjJ3jj8ORk4J7Lj0kMMjj1J0Kj3MkNj3J7Mk3JPJ0j4QOj0oJ8lpOPqk4L5
6807FLpqK3j6oqK9nj7K1j1JoJ0%k6K0Lj2jORk2J9Pj3j0MM%j5K8lj1rK5l3J1L%
6848gnkK5j7qROnoJ3nMoMpnQM%nPjKLqjJ2L%Kj0J7j1j4RNqnJK3j4j1LlKlJ1j7
$$ y = [-2, 9, -1, -6, 3, 7, -4, -8, -6, -6, -14, 4, -6, -1, -14, -5, 3, -14, 6, -8, -3, -9, -2, -4, 4, 4, 10, -7, -18, 1, -2, 3, -9, 12, 5, -4, 1, 6, 0, 8, 17, 7, -7, -2, 11, -5, -10, -6, -12, -11, -8, -5, -5, -9, -6, 5, -8, -2, -7, -1, -13, -10, -2, -12, -20, -3, -6, -13, -7, -18, -5, -22, -16, -5, -2, -6, 2, 14, -9, -6, 1, 4, -9, -2, 10, -9, -13, -1, 5, -3, 9, 2, 3, -5, 11, 0, -8, 9, 14, 3, 6, 15, 12, 2, -3, 5, 12, -15, 8, 8, -5, -11, 7, 13, 2, 3, 9, 2, -8, 12, 1, -15, -16, -7, 1, -6, -8, 2, -6, -7, 4, 9, -12, -5, 10, -4, 3, 10, 6, -3, 10, -4, 13, -7, 1, 18, 0, -7, 16, 9, 9, 5, 28, 2, 0, 10, 21, 6, 2, 8, -3, -10, 1, 4, -7, -12, 12, 0, -17, 3, 11, 5, -17, -8, -1, -12, -10, 15, 3, -20, -14, 6, -11, -17, -8, 1, -17, -13, -2, -15, -12, 4, 2, -11, -14, 12, 8, -3, -1, 3, 3, -5, -2, 3, 2, -10, 1, 2, 0, 4, 15, 0, -15, 13, 6, 1, 0, 13, 12, -6, 0, 9, -15, 2, 5, -5, -7, -3, 1, 0, -11, -1, 1, -12, -8, -10, -5, -18, -1, 3, -20, -19, -12, -2, -16, -8, -2, -12, -18, 0, -3, -10, -4, 3, -5, -29, 6, 9, 2, -6, 17, 1, -5, -13, 16, 11, -6, 15, 4, 5, -1, 9, 9, -17, 3, 6, -6, -7, -1, 8, -14, 5, 12, -1, -11, -7, -3, -3, -18, 10, 7, -4, -13, 12, -21, -10, -7, -7, -12, -14, 11, -6, -14, -5, 1, -4, -10, 3, -2, 2, -4, 0, -7, -12, -4, 0, 0, -5, 2, 1, 3, 6, -2, -3, 9, 12, 12, 14, 4, 21, 10, -4, 5, 10, 2, -3, -2, 21, 7, -4, -1, -4, -2, -5, 6, -11]
6896a1kJ0njkM%JrK0rrJ0oJ0ll%KPkpnJ0OpJ1j5%OQjj8J1MkqJ2nQoLPj3P%j8L
6944glNjJJ6j5okO%NmLKl%j6NPPk2J5J0JrJJ1j7MRJjj4J5Lj5RNj6J4rjlQJ4lj3
6991cNNkjLjJ8j1j5PoNjJlNllrQmjLJ%jJMj1mJ1mJMJkmpQJ1j0J2Mj0kK1k1Q%n
7041CMoOJkKoL%kj1K0pLrLJoQj1OMj0OjNlOmnjJ3mk2J5jqrQPj2QKNjNj3R%Qkj2
7093gmJ1OoLpLP%Kj6LK2j4jlNQoNmj6QRj7K6npnJMmqK1j2%%oJlNNk5J7plJ0LJ0
7142IoJ1j2J0o%OolMOjrJJ2j4QJOrJ0rJ2joJMj6K%O%j5J6lloKqJ6j3mK1%j7Mk
7189aj0R%%pRKJrJ3j4LMOrRoJ8k3qJ5mkRoJj3MKJJ1nRmJOj2OolkJ1mpmlJ0Oj1
7238gKJ1nj4KJMlJMj0OpNJ%mJ3lpLRj2J3loK7k0kmJ1j1OmK4k1jMJJ3oLj6J1qP
$$ y = [-11, -13, -3, -8, -9, -11, -7, -7, -6, -15, 5, -4, -13, -3, -9, 1, -2, -5, -5, -3, 4, 2, -5, -10, 0, 6, -1, 10, -5, -5, 1, 9, 8, -10, 1, 5, 3, -5, 7, 2, 10, 4, 7, 14, 1, 8, 8, -10, -7, -10, -5, -6, -5, 11, -4, -10, -12, -6, -6, -1, -5, -2, 0, -3, -3, -19, -14, -7, 0, -22, -7, 3, 4, -5, -4, 7, -10, -6, 3, 4, 3, -11, 4, 7, -8, 1, 6, -10, 4, -5, -6, -9, -1, 13, 10, -3, 2, 7, 5, 4, 7, 6, 24, 13, -2, 5, -1, 4, 3, 4, 1, 6, 3, 0, -9, -1, -5, -6, -3, -2, -2, -3, -2, 2, -9, -13, -2, -6, -5, -1, 0, -2, -6, -13, -5, 6, -4, 8, 12, 2, 0, 21, 0, 8, 8, 3, 7, 1, 7, 8, 6, 8, 2, 5, 5, 3, -8, 12, 5, 8, -1, 2, 3, -3, 5, -6, 0, 4, -6, 0, -1, 4, 1, 7, 3, -2, -3, 10, 6, -16, -1, -2, -10, -19, -11, -4, -16, -8, -6, -1, -2, 3, -10, -1, -1, 7, 5, -7, -11, 0, 6, 0, 3, -4, -1, 6, 6, 8, -8, -5, 17, 3, 2, -1, 4, 12, 6, 11, 7, -9, -1, 8, -9, 17, 12, 5, 0, 1, 5, 1, -7, 14, 2, 2, 2, -4, -3, -6, -1, 4, -21, -4, -11, -14, -4, -1, 9, 3, 14, 2, 12, 6, 6, 12, 6, 3, 7, 13, 12, 3, 4, 16, 2, 10, 11, 17, 8, 18, 9, 21, 20, 14, 15, 19, 3, 5, 5, 11, 11, -4, 12, 9, 6, 0, 2, -6, 10, -3, -7, 14, 14, -3, 1, -1, -11, -2, -2, -2, -9, 0, 2, 3, -6, 7, -7, -4, 0, 6, -3, 6, 0, 18, -5, -13, 2, -2, -4, 5, -1, 0, -13, -9, -7, -6, 5, 0, 9, 5, 6, 12, 0, 6, 0, -3, -5, 6, 2, -5, -9, -12, -2, 4, -7, -5, 6, 1, -13, -11, -10, -6, -9, -8, -4, -14, -8, -15, -10, -9, -9, -13, 0, -3, -10, -7, 2, -10, 3, 0, -6, 21, 1, -1, -5, 6, -5, 1, -3, 21, 0, -1, 3, 4, 17, 11, 14, -2, 9, 1, 8]
7284Hj7J8lkMqllJ2J2j1j7J5PrNj4OOoJ1jrPqmjJKkQllKj3K5j1kPqJ9j7RmJ1k
7330A4rJmNLLkmlmK%mjJJ%nLjLJllPpJ2k0JRpJ8j5LpmP%nMJ0jkMj5OJ2Mj2j2J
7381a5J3pNLlMrPnjomK5oJ3j2J0%lrlOnnNqJ2JJ%rPj4J1nMOlJRj9K2qj1Rj0On
7429e%MPJjj6J9omJ4rLj0MpO%MJ2mmOj7J5llPoj1jR%NplJ1j6OLJjj3OoJ1rROJ
7478Hj3NnnpQlRqNnKjJ4koMQlj7JKQMmJrJ3PkooqJ1MnmJ0j0%LNOj9lJ1j3R%nj
7529a2J0kNj4J1klLMonMLPk6K0rK3k2OLpJ1jkJnJ4Jj0Pj7ROQrQ%lMmKj1LPQqp
7577CnQk9J2J3%j2J0pJN%Rp%mNoJ2j1qJJ7nnJ0mroJ3mJ1Poj0J1lN%lQj1PlLpj
7624EJkqRKLorLNLjkj4MQjrQMj5LOK%jnPoKJqKJ8k0JPJPj9OJ3rJ5Nj8LPj5J9j3
$$ y = [8, -9, 9, 6, 4, 8, 0, -3, -6, 6, 18, 7, -10, 5, 12, 3, 8, -6, 0, 6, 0, 11, 10, 1, 8, 0, -4, -5, -4, -2, -4, 4, 1, -2, 0, -13, 12, 1, -1, 6, -2, 17, 0, 9, 5, 16, 14, 5, 6, 2, 7, 10, 13, 11, 7, 4, 0, 2, 2, -2, -3, -2, -1, -1, -6, -3, -4, -1, 0, -3, -6, 1, -6, 6, -14, -13, -4, -11, 7, -8, -5, -12, -16, -9, -9, -14, -10, 0, -1, -3, 1, -14, -8, 4, 8, -4, -16, -15, -2, -9, -4, -1, -4, 0, -9, -2, -7, -8, -14, -18, 7, 1, 14, 2, 12, 12, 9, 0, -3, 3, -2, -7, -2, -10, 2, 3, 4, 4, -5, 2, -12, -1, -6, -2, 4, 1, 2, 11, -8, 14, 6, -5, 4, -6, 0, -5, -5, -1, 6, 7, 6, -10, 9, 3, -1, 13, 4, 7, -3, 1, -6, 0, 0, 4, 16, 12, 8, 14, -3, 12, 9, 6, 13, 7, -4, -5, 4, 4, 9, 2, -1, 10, -6, 0, 3, 4, 3, -10, -4, -10, 1, -8, 1, 7, 8, -5, 0, -5, -10, -17, -9, -12, -3, -11, -6, -11, -9, -10, 4, 2, -4, 0, 8, 5, -12, -11, -9, -1, 3, -1, 0, -9, 4, 11, 9, 3, -3, -11, 0, 4, -1, -5, 5, -5, -5, -2, 3, 9, -10, -13, -2, -15, -6, -6, -11, -12, -2, -4, 1, -13, -2, -4, -7, -4, 0, -6, -11, -7, -4, 3, -23, -3, -12, 11, -11, -5, -2, -9, 2, 1, -1, 0, -5, 9, 10, 0, 7, -10, -1, 5, 13, 4, 12, 12, 9, 13, 9, 11, 0, 3, 10, 18, 10, 3, -2, 6, -23, -11, 2, 2, -10, 0, -7, -6, -1, -1, 8, 1, 1, -3, 2, -4, 8, -3, -11, -10, 7, 2, -3, 7, 3, -6, -12, 1, -3, 8, 15, 9, -1, 10, 7, 12, 12, 9, 17, 6, 13, 10, 13, 6, 5, 6, 4, -4, 5, 7, 10, 4, -5, -2, 3, 6, 5, 3, -11, -7, 1, 0, -9, -1, 3, -12, -9, -3, -1, -1, -2, -7, 0, -6, -4, -3, -11, -9, 9, -11, -10, -3, -2, 5, -14, -8, 5, -4, 11, 16, -2, 1, 8, -7, 12, -1]
$$ [...]
8191A8
##END NTUPLES=NMR FID
##END=
