##TITLE=1H_SA_PPh3vCl(CH2Cl2)
 CDCl3, 8 sc, 
 19.9.2019
##JCAMPDX= 6.0         $$ Bruker NMR JCAMP-DX V2.0
##DATA TYPE= NMR FID
##DATA CLASS= NTUPLES
##ORIGIN= UXNMR, Bruker Analytische Messtechnik GmbH
##OWNER= root
$$ XWIN-NMR		Version 3.5
$$ Thu Sep 19 15:27:12 2019 Russian Standard Time (UT+4h)  she@DPX200
##.OBSERVE FREQUENCY= 200.1315
##.OBSERVE NUCLEUS= ^1H
##.DELAY= (6, 6)
##.ACQUISITION MODE= SIMULTANEOUS
##.ACQUISITION SCHEME= undefined
##.AVERAGES= 8
##.DIGITISER RES= 18
##SPECTROMETER/DATA SYSTEM= spect
##.PULSE SEQUENCE= zg30
##.SOLVENT NAME= CDCl3
##.SHIFT REFERENCE= (INTERNAL, CDCl3, 0, 15.7039)
##AUDIT TRAIL= $$ (NUMBER, WHEN, WHO, WHERE, WHAT)
$$ ##TITLE= Audit trail, XWIN-NMR		Version 3.5
$$ ##JCAMPDX= 5.01
$$ ##ORIGIN= Bruker BioSpin GmbH
$$ ##OWNER= she
$$ F:/spectra/data/she/nmr/H-F/1/audita.txt
$$ ##AUDIT TRAIL=  $$ (NUMBER, WHEN, WHO, WHERE, WHAT)
(   1,<2019-09-19 15:22:12.78 +0400>,<she>,<DPX200>,
      <created by zg, POWCHK disabled, PULCHK disabled
       configuration hash MD5:
       00 E9 B6 7A A2 85 ED C7 34 08 36 98 17 FE 4E 26
       data hash MD5: 16K
       01 5C F7 5F 1B 2C 84 C3 61 6B EF BD 43 F9 59 12>)
$$ ##END=
$$ 
$$ hash MD5
$$ 94 A9 D0 61 71 6E BD 73 70 67 AB 61 8C B6 15 11
##$RELAX= 
##$RELAX= 
##$RELAX= 
##$RELAX= 
##$RELAX= 
##$RELAX= 
$$ Bruker specific parameters
$$ --------------------------
##$DU= <F:/spectra>
##$EXPNO= 1
##$NAME= <H-F>
##$PROCNO= 1
##$TYPE= <nmr>
##$USER= <she>
##$AMP= (0..31)
100 100 100 100 100 100 100 100 100 100 100 100 100 100 100 100 100 100 
100 100 100 100 100 100 100 100 100 100 100 100 100 100 
##$AQSEQ= 0
##$AQ_mod= 1
##$AUNM= <au_zg>
##$AUTOPOS= <>
##$BF1= 200.13
##$BF2= 200.13
##$BF3= 200.13
##$BF4= 200.13
##$BF5= 200.13
##$BF6= 200.13
##$BF7= 200.13
##$BF8= 200.13
##$BYTORDA= 1
##$CFDGTYP= 0
##$CFRGTYP= 5
##$CHEMSTR= <none>
##$CNST= (0..31)
1 1 145 1 1 1 1 1 1 1 1 1 1 1 1 1 1 1 1 1 1 1 1 1 1 1 1 1 1 1 1 1 
##$CPDPRG= <>
##$CPDPRG1= <>
##$CPDPRG2= <>
##$CPDPRG3= <>
##$CPDPRG4= <mlev>
##$CPDPRG5= <mlev>
##$CPDPRG6= <mlev>
##$CPDPRG7= <mlev>
##$CPDPRG8= <mlev>
##$CPDPRGB= <>
##$CPDPRGT= <>
##$D= (0..31)
0 1.2 0 0 0 0 0 0 0 0.06 0 0.03 0 0 0 0 0.0002 0 0 0 0 0 0 0 0 0 0 0 0 
0 0 0 
##$DATE= 1568892132
##$DBL= (0..7)
120 120 120 120 120 120 120 120 
##$DBP= (0..7)
150 150 150 150 150 150 150 150 
##$DBP07= 0
##$DBPNAM0= <>
##$DBPNAM1= <>
##$DBPNAM2= <>
##$DBPNAM3= <>
##$DBPNAM4= <>
##$DBPNAM5= <>
##$DBPNAM6= <>
##$DBPNAM7= <>
##$DBPOAL= (0..7)
0.5 0.5 0.5 0.5 0.5 0.5 0.5 0.5 
##$DBPOFFS= (0..7)
0 0 0 0 0 0 0 0 
##$DE= 6
##$DECBNUC= <off>
##$DECIM= 24
##$DECNUC= <off>
##$DECSTAT= 4
##$DIGMOD= 1
##$DIGTYP= 9
##$DL= (0..7)
0 120 120 120 120 120 120 120 
##$DP= (0..7)
150 150 150 150 150 150 150 150 
##$DP07= 0
##$DPNAME0= <>
##$DPNAME1= <>
##$DPNAME2= <>
##$DPNAME3= <>
##$DPNAME4= <>
##$DPNAME5= <>
##$DPNAME6= <>
##$DPNAME7= <>
##$DPOAL= (0..7)
0.5 0.5 0.5 0.5 0.5 0.5 0.5 0.5 
##$DPOFFS= (0..7)
0 0 0 0 0 0 0 0 
##$DQDMODE= 0
##$DR= 18
##$DS= 0
##$DSLIST= <SSSSSSSSSSSSSSS>
$$ [...]
##$SUBNAM2= <"">
##$SUBNAM3= <"">
##$SUBNAM4= <"">
##$SUBNAM5= <"">
##$SUBNAM6= <"">
##$SUBNAM7= <"">
##$SUBNAM8= <"">
##$SUBNAM9= <"">
##$SW= 24.0689530833862
##$SWIBOX= (0..15)
0 0 2 0 0 0 0 0 0 0 0 0 0 0 0 0 
##$SW_h= 4816.95568400771
##$TD= 16384
##$TD0= 1
##$TE= 0
##$TE2= 300
##$TE3= 300
##$TEG= 300
##$TL= (0..7)
0 120 120 120 120 120 120 120 
##$TP= (0..7)
150 150 150 150 150 150 150 150 
##$TP07= 0
##$TPNAME0= <>
##$TPNAME1= <>
##$TPNAME2= <>
##$TPNAME3= <>
##$TPNAME4= <>
##$TPNAME5= <>
##$TPNAME6= <>
##$TPNAME7= <>
##$TPOAL= (0..7)
0.5 0.5 0.5 0.5 0.5 0.5 0.5 0.5 
##$TPOFFS= (0..7)
0 0 0 0 0 0 0 0 
##$TUNHIN= 0
##$TUNHOUT= 0
##$TUNXOUT= 0
##$USERA1= <user>
##$USERA2= <user>
##$USERA3= <user>
##$USERA4= <user>
##$USERA5= <user>
##$V9= 5
##$VALIST= <valist>
##$VCLIST= <CCCCCCCCCCCCCCC>
##$VD= 0
##$VDLIST= <DDDDDDDDDDDDDDD>
##$VPLIST= <PPPPPPPPPPPPPPP>
##$VTLIST= <TTTTTTTTTTTTTTT>
##$WBST= 1024
##$WBSW= 4
##$XGAIN= (0..3)
0 0 0 0 
##$XL= 0
##$YL= 0
##$YMAX_a= 10510
##$YMIN_a= -24511
##$ZGOPTNS= <>
##$ZL1= 120
##$ZL2= 120
##$ZL3= 120
##$ZL4= 120
##$ABSF1= 10
##$ABSF2= 0
##$ABSG= 5
##$ABSL= 3
##$ALPHA= 0
##$AQORDER= 0
##$ASSFAC= 0
##$ASSFACI= 0
##$ASSFACX= 0
##$ASSWID= 0
##$AUNMP= <proc_1d>
##$AZFE= 0.1
##$AZFW= 0.1
##$BCFW= 1
##$BC_mod= 2
##$BYTORDP= 1
##$COROFFS= 0
##$CY= 11.3945322036743
##$DATMOD= 1
##$DC= 2
##$DFILT= <>
##$DTYPP= 0
##$F1P= 20.1720416913024
##$F2P= 0.152960286110954
##$FCOR= 0.5
##$FTSIZE= 0
##$FT_mod= 4
##$GAMMA= 1
##$GB= 0.15
##$INTBC= 1
##$INTSCL= 1
##$ISEN= 128
##$LB= 0.24
##$LEV0= 0
##$LPBIN= 0
##$MAXI= 10000
##$MC2= 0
##$MEAN= 0
##$ME_mod= 0
##$MI= 1.114404
##$NCOEF= 0
##$NC_proc= 0
##$NLEV= 6
##$NOISF1= 3.799351
##$NOISF2= 2.8
##$NSP= 1
##$NTH_PI= 0
##$NZP= 0
##$OFFSET= 15.70392
##$PC= 1
##$PHC0= -9654.308
##$PHC1= 12.60096
##$PH_mod= 1
##$PKNL= yes
##$PPARMOD= 0
##$PSCAL= 0
##$PSIGN= 0
##$REVERSE= no
##$SF= 200.130013532006
##$SI= 16384
##$SIGF1= 3
##$SIGF2= 2
##$SINO= 400
##$SIOLD= 16384
##$SREGLST= <1H.CDCl3>
##$SSB= 0
##$STSI= 0
##$STSR= 0
##$SW_p= 3612.71676300578
##$SYMM= 0
##$S_DEV= 0
##$TDeff= 0
##$TDoff= 0
##$TI= <>
##$TILT= no
##$TM1= 0
##$TM2= 0
##$TOPLEV= 0
##$USERP1= <user>
##$USERP2= <user>
##$USERP3= <user>
##$USERP4= <user>
##$USERP5= <user>
##$WDW= 1
##$XDIM= 8192
##$YMAX_p= 0
##$YMIN_p= 0
$$ End of Bruker specific parameters
$$ ---------------------------------
##NTUPLES= NMR FID
##VAR_NAME=  TIME,          FID/REAL,        FID/IMAG
##SYMBOL=    X,             R,               I
##VAR_TYPE=  INDEPENDENT,   DEPENDENT,       DEPENDENT
##VAR_FORM=  AFFN,          ASDF,            ASDF
##VAR_DIM=   8192,          8192,            8192
##UNITS=     SECONDS,       ARBITRARY UNITS, ARBITRARY UNITS
##FACTOR=    0.0002076,     1,               1
##FIRST=     0,             0,               0
##LAST=      1.7004516,     0,               0
##MIN=       0,             -24511,          0
##MAX=       1.7004516,     10510,           0
$$ Real data points
##PAGE= N=1
##DATA TABLE= (X++(R..R)), XYDATA
0@%%%%%%%%%%%%%%%%%%%%%%%%mJ2j6J6j6J6j6J6j6K0k8L2l2L2l6M4m8N2n8O3o9
$$ 0 0 0 0 0 0 0 0 0 0 0 0 0 0 0 0 0 0 0 0 0 0 0 0 0 -4 8 -8 8 -8 8 -8 8 -8 12 -16 16 -16 16 -20 24 -24 28 -30 33 -36
45c6P7q5R6j11J24j39J58j80K08k48L02l79N06p44J340n471j1670Q917P877j144
$$ -36 41 -44 52 -59 65 -74 84 -96 112 -136 166 -213 293 -451 889 -4582 -16252 -7335 542 -602
65f02j2K402n893m277O905O366l390j656K939j496l380L413L400k033o7L090k148
$$ -602 -614 1788 -4105 -8382 -1477 4889 1499 -157 2782 1286 -2094 1319 4719 2686 2619 5709 3561
82C561l963K941N016l93j767l44j362K61L826R13l260m37J751j098K01L581r27
$$ 3561 -402 2539 7555 7162 5395 5051 3689 3950 7776 8689 5429 4992 6743 5645 5846 9427 8500
99H500m697J601M813j888l139L043J588l764j78L285j683k165L928J266n536q85
$$ 8500 3803 5404 10217 8329 5190 8233 9821 6057 5879 9164 7481 5316 9244 10510 4974 4089
115D089N330ll685K092J838m743j188N822P05n522k07L512j379j966K159m7k776
$$ 4089 9419 9416 5731 7823 9661 4918 3730 9552 10257 4735 4528 8040 6661 4695 6854 6807 4031
132D031J571K702l043k942K533J593j920M16J228k983k070L315K121k477j366
$$ 4031 5602 8304 5261 2319 4852 6445 4525 4941 6169 3186 1116 4431 6552 4075 2709
147B709O77p86nJ990n38k408R67J572k192j031K707K07k680P53J930k287j625
$$ 2709 3386 2600 2595 4585 4047 1639 2606 4178 1986 955 3662 3869 1189 1942 3872 1585 -40
164d0K921J033k806l69J668j180p32K485k10l478P49L349j539k776K089J575k746
$$ -40 2881 3914 1108 739 2407 1227 495 2980 2770 -708 41 3390 1851 -925 1164 2739 -7
181gn25K835p68k805J504K234j871j410J625M6j271J371Q47k515o79K834L63k482
$$ -7 -532 2303 1535 -1270 234 2468 597 -813 812 858 -413 958 1805 -710 -1389 1445 1808 -674
199f74J12J583q53p05J498L9j802K69J537l47p30K17n40k42J805N69k486q73K171
$$ -674 -562 1021 168 -537 961 1000 -802 -533 1004 657 -73 144 -396 -638 1167 1736 -750 -1623 548
218E48O71j179L87L37j754k22K341M33j773j20N54q46M31K014o88k336Q61J880
$$ 548 1219 40 427 764 -990 -1212 1129 1562 -211 -331 223 -623 -192 1822 1134 -1202 -341 1539
236A539j328j181J964P00k245m07J847j33j177R77P92j377n10J210Q4n92P25R2
$$ 1539 211 -970 994 1694 -551 -958 889 756 -421 556 1348 -29 -539 671 755 163 888 980
254I80j546j08J701O9j336J67P76n81m63Q61M80n39l09j07j72M64M97n84n72M64
$$ 980 -566 -674 1027 1096 -240 -73 703 122 -341 520 1000 461 152 45 -127 337 834 250 -322 142
274A42j8o98N77J114p19j326M86J000j80j81R4p17m61R30M93q63k05O16n38o33
$$ 142 124 -574 3 1117 398 -928 -442 558 378 197 291 -426 -887 43 536 -327 -532 84 -454 -1087
294a087J215Q63j375r39J180O66r25k09P10k61p61L27N09k63r7K37l49k70O28
$$ -1087 128 991 -384 -1323 -143 523 -402 -611 99 -162 -923 -596 -87 -350 -447 -210 -559 -829 -201
313b01L00o40j76N74j37o44J93O72j50o36o9L94J96j51j57J61K19k38m10K51O10
$$ -201 99 -541 -717 -143 -280 -924 -731 -59 -209 -845 -914 -520 -324 -475 -632 -471 -252 -490 -900 -649 -39
334c9r4o06l6L42J7r6K37O9k98j66J04J35L35J70n68n86M96P47l22n64L14K92
$$ -39 -133 -739 -775 -433 -416 -512 -275 -206 -504 -670 -566 -431 -96 74 -494 -1080 -584 163 -159 -723 -409 -117
356a17n29j90P11K59p21l76M75L20k30j45O5J9O9P5j65j14K80J81l12j65L18N3
$$ -117 -646 -836 -125 134 -587 -963 -488 -168 -398 -543 -478 -459 -390 -315 -480 -594 -314 -133 -445 -610 -292 -239
378b39l94J5N90J10o32l05N47N02k44l88J17J50k02o9L17J61l50l43P1L63J89
$$ -239 -633 -618 -28 82 -550 -855 -308 194 -50 -438 -321 -171 -373 -442 -125 36 -314 -657 -586 -223 -34
399c4j66k54l3K23J35j79j08K22J07l92k21M08K95l96k73M42K93m43k83M33M23
$$ -34 -200 -454 -487 -264 -129 -308 -416 -194 -87 -479 -700 -292 3 -393 -666 -224 69 -374 -657 -224 199
420A99k71l65P5K26nn5K3j3o7o5o5J71L27o5m88j25M82K75m11k23K72J48l14j28
$$ 199 -72 -437 -362 -136 -141 -196 -173 -186 -253 -318 -383 -212 115 50 -438 -563 -81 194 -217 -440 -168 -20 -334 -462
444d62L94K47l54l56K82M12r9k88Q2K31l5j91O2K16O4j24j33P5K50Q7k45j62L39
$$ -462 -68 179 -175 -531 -249 163 64 -224 -142 89 54 -137 -75 141 205 81 -52 23 273 360 115 -47 292
467B92K76l79k85M54L45m28l19M15K51l68j19L66J09l00j22J28J73R8j12k82M7
$$ 292 568 189 -96 358 703 275 -44 371 622 254 135 501 610 310 188 316 489 587 475 193 240
488B40M23K2l80OL73p5l73J48M02j33l69L6K68J02j61j97Q9L32m1m42jN28m2n38
$$ 240 663 685 305 311 684 609 236 384 786 653 284 320 588 690 529 332 421 753 712 270 269 797 755 217
512B17K9M32r3l56J21J73j17p1P2j13M3K30k20l80L80M38n84m77O55M58p11l69
$$ 217 246 678 585 229 350 523 406 335 407 294 337 567 347 -33 347 785 201 -276 379 837 126 -243
534b43O11J71m71L3K88k08j72K57j8k17K05Jm53J55O39l02p95K84P17k60n76J70
$$ -243 368 539 68 101 389 181 9 266 248 31 236 237 -216 -61 578 276 -519 -235 482 222 -354 -184
556a84K41j93J7J41k13r0K21j19j50L81K9p13N1Q76j25r54J16P65j55m23K16L2
$$ -184 57 -136 -119 22 -191 -281 -60 -179 -329 52 81 -632 -581 295 170 -784 -668 97 -58 -481 -265 -233
578b33k93L21L27m89k00N33j12n41M65M92q79n14J075M42j029k90Q85P9n31J80
$$ -233 -526 -205 122 -367 -567 -34 -146 -687 -222 270 -609 -1123 -48 394 -635 -925 -40 39 -492 -312
598c12J48m00J93N11m65n09N51K29o15J66O78n42p03Q36P45p53n92N18K65k04
$$ -312 -164 -564 -371 140 -325 -834 -283 -54 -669 -503 175 -367 -1070 -234 511 -242 -834 -316 -51 -255
618b55J29r6n32L21O87m31o06N78L55o74J45Q77m89r62O71R24o64o44M38J40j97
$$ -255 -126 -222 -754 -433 254 -177 -783 -205 150 -524 -379 498 9 -953 -282 642 -22 -666 -228 -88 -285
639b85M77N7r01J05J118j80r49M52O62p12k79R97j21j181K97J129l09p24K76J84
$$ -285 192 249 -652 -547 571 391 -558 -106 556 -156 -435 562 441 -740 -443 686 377 -347 -71 113
659A13k23N39K88j034l08J217J98j074R5P43n78m54R38K37j104l8J023p9o11J77
$$ 113 -110 429 717 -317 -625 592 790 -284 -189 554 -24 -478 460 697 -407 -445 578 499 -112 65
679F5Ml59O06N06j082o86J197N69j027k31O85l53m79R09L85j114l35Q45P5l82
$$ 65 69 -290 316 822 -260 -946 251 820 -207 -438 247 -106 -585 324 709 -405 -740 105 180 -202
699b02K78j81p65N84J044q44j106R10Q23q87l61Q02j81p49O70O05r34m72Q04J72
$$ -202 76 -105 -870 -286 758 -86 -1192 -282 541 -346 -707 95 -86 -835 -165 440 -494 -966 -162 10
719A0m65L04M2q92K97J314m82j470M82J160m67n57N46j37p21N65Q23o94o57N39
$$ 10 -455 -151 -109 -1001 -704 610 128 -1342 -860 300 -167 -724 -178 -315 -1036 -471 352 -342 -999 -460
739d60J81l24M78J80j078j27J384Q2j352M7J033j95n03M28m0o68M79Q19n68o49
$$ -460 -279 -603 -125 55 -1023 -1150 234 316 -1036 -989 44 -151 -654 -226 -266 -934 -455 364 -204 -853
759h53M86J52l72N91M20j197n27J409N92j172l36P75j19l73O04J29q37J36Q23
$$ -853 -367 -215 -587 4 424 -773 -1300 109 701 -471 -807 -32 -151 -524 80 209 -628 -492 331
778C31l61o15N79K31o95K77P84p15q65J001R11r17o87O21K50k69L37P6p72L7Q34
$$ 331 -30 -645 -66 165 -530 -253 531 -184 -1049 -48 863 -54 -741 -120 130 -139 198 274 -498 -461 373
799C73j38o12L60K34n95J78Q76m74r77N89R54n15o28L02Q1j63N11J30q98j06R29
$$ 373 235 -377 -17 217 -378 -200 676 202 -775 -186 768 253 -375 -73 8 -155 356 486 -412 -518 411
820D11J9o32L32L55p46p6J023l9j078J53Q45k19m95K47Q3k60M14L03p29l02Q18
$$ 411 430 -202 130 485 -261 -337 686 647 -431 -278 567 348 -147 100 183 -77 337 640 -89 -391 427
841D27K11o76O0L98n11l01Q35K38q95k53O50R3k55J78j08l71L54M20n81l99O67
$$ 427 638 -38 22 420 -91 -392 443 681 -214 -467 183 276 21 199 91 -280 74 494 -87 -486 181
862A81K34o76n0N40k64l85N74L37o80k90N18J73j86R0j81m75L57O62m10o83M12
$$ 181 415 -261 -311 229 -35 -420 154 491 -189 -479 39 212 26 116 -65 -540 -183 479 69 -614 -202
883b02M54m44j39N00j47n29L06M76l34l45J94N3o5K61o9n18J16O52j50n90K34
$$ -202 252 -192 -331 169 22 -507 -201 275 -59 -404 -210 -157 -222 39 -30 -548 -432 220 70 -520 -286
904b86M10l17k34L89N8l90R9L11j79j99J84Qj09K91N3n46n8O74R3n83o7M04j31
$$ -286 124 -193 -427 -38 20 -370 -271 40 -139 -338 -154 -146 -255 36 89 -457 -515 159 252 -331 -398 6 -125
927a25k02L04J25l34j00J96j7NJ88j36k94J85K76k74j70M30J34m97j59M33J44
$$ -125 -327 -23 102 -232 -332 -136 -153 -148 40 -96 -390 -205 71 -203 -373 57 191 -306 -465 -32 112
948A12j90l0J3j42M7K06l2p6R4j19k29K44L83k37l93K14K70j94j65K27R3j62p9
$$ 112 -78 -108 -95 -237 -190 16 -16 -92 2 -117 -346 -102 281 44 -349 -135 135 -59 -224 3 96 -66 -145
971a45L0j5J37R6j82j23J85P1k26P4L13j29m04Q6L67L1k35n5P2J6L6Lm5O5L9j43
$$ -145 -115 -130 7 103 -79 -202 -17 54 -172 -98 215 86 -318 -232 135 166 -69 -124 -52 -36 0 3 -42 23 62 -81
997h1q3K28J20k26j36K29J05k02q7J98Q1j21j01M4R3O0r7j15J04J56j01j89J31
$$ -81 -164 64 184 -42 -178 51 156 -46 -133 65 146 25 -76 -32 61 121 24 -91 13 169 68 -121 10
1020A0J94j20j94J27J54r4j54P8J50%j48p4J01J67m9j64j2J83nj77L7K00l2k23
$$ 10 204 84 -110 17 171 77 -77 1 151 151 3 -71 30 197 148 -16 -28 155 150 -27 10 210 178 -45
1044d5j8K30P9j78r2R5J40n0j19J4J23Lj51l6J80N2j45r3J34J15r6j38O8J72l3
$$ -45 -63 167 246 68 -24 71 211 161 42 56 179 182 31 -5 175 227 82 -11 123 238 142 4 72 244 211
1069B11j84j8J71L8j62p3J15J03j13p9J29R5j14j47Q1J78pj81q5J35J16j15r5
$$ 211 27 9 180 218 56 -17 98 201 88 9 138 233 119 -28 53 231 224 43 -42 93 209 94 -1
1092aP5Q8r7r9J05J85q5k20nK06O6j56j13J04P8q1r4R8J24q9j86N5J92K8j91n1
$$ -1 74 162 65 -34 71 256 171 -49 -54 152 218 62 -51 53 131 50 -44 54 178 89 -97 -42 150 178 -13 -64
1118f4J34N3j15o6J20J10r4j74N3J88J7j85m3J55N8j62n2J74J00j87j30J35J59
$$ -64 70 123 8 -58 62 172 78 -96 -43 145 162 -23 -66 89 147 -15 -67 107 207 20 -110 25 184
1141A84p3j26NR7J5j18k7J13R6j28j53J23K05o9k08K7K02m1j70L4J52j0j76JJ47
$$ 184 111 -15 -10 87 102 -16 -43 70 166 38 -115 8 213 144 -64 -37 165 124 -46 -12 140 130 -46 -45 102
1166A02P6q5j37N0J53K0j49n1J78L8j83m1J80N1j68o9J36R2n6r7J4J06M6j33q8
$$ 102 178 93 -44 6 159 179 30 -21 157 195 12 -29 151 202 34 -35 101 193 137 40 54 160 206 73 -15
1191a5J84J27k31j85K43J48j80j46J54J08j12o1R7L2n3j7m9J2J49m4k24N6K75
$$ -15 169 296 65 -120 123 271 91 -55 99 207 95 34 131 163 110 93 44 56 205 161 -63 -7 268
1214B68p6k93J00K90q4k32O0J51n6o2L6j4m1K0m1k2J59L2k79o2L40R7l40q3K66
$$ 268 192 -101 -1 289 205 -27 33 184 128 66 102 88 47 67 26 4 163 195 -84 -146 194 291 -49 -132 134
1239A34K5j82K5P8n4k6O3n7JJ08p9j54J66K08k87k25L14K33l06k08K18J09j46
$$ 134 159 -23 2 80 26 0 63 6 7 115 36 -118 48 256 -31 -256 58 291 -15 -223 -5 104 -42
1262d2PO1r8%J22q8r5J89kk60P0L25j41l88K07L54k29k62J52J53r7OK5j44J7K22
$$ -42 -35 26 -72 -72 50 -38 -133 56 54 -206 -136 189 48 -340 -133 221 -8 -270 -118 35 -62 -56 -31 -175 -158 64
1288F4q3j93J58J27l05j5L84j9m63N6M04p6k81P1J26r6P0O9k35m2L10ml05R9K33
$$ 64 -19 -212 -54 73 -232 -247 137 118 -345 -289 115 39 -242 -171 -45 -141 -71 -2 -237 -279 31 27 -278 -179 54
1313E4k60j52M05J21m79j13M14R3k34k2K1j05J41J98k50j86L13J08l49M9L46j95
$$ 54 -206 -358 47 168 -311 -424 -10 83 -151 -173 -152 -257 -116 82 -168 -354 -41 67 -282 -233 113 -82
1335h2l21L27K69l76j91L07J09j76J6kj74J74L13k80l29L16K52l41q6L61j12l89
$$ -82 -403 -76 193 -183 -374 -67 42 -134 -118 -120 -294 -120 193 -87 -416 -100 152 -189 -275 86 -26 -415
1357d15K40L70k88k85K43J35j33R6rk84P7M63j82m94K25L82k62k22L53j9l75J43
$$ -415 -175 195 -93 -378 -135 0 -133 -37 -46 -330 -253 210 28 -466 -241 141 -121 -343 10 -9 -384 -241
1379b41M08j94l12J51J19j01J42O2m10o3N42M9n37K6M08j20k61K98R2l87PL77
$$ -241 167 -27 -339 -188 -69 -170 -28 34 -376 -439 103 152 -385 -359 49 -71 -332 -34 58 -329 -322 55
1401E5p1k58R3N7j28J81J84l88k02N12K03n08j18M21k7k72J99J27l47l1L73m3
$$ 55 -16 -274 -181 -124 -252 -71 113 -275 -477 35 238 -270 -388 33 6 -266 -67 60 -287 -318 55 12
1423A2k69J28O0k31J96L48l68l91M30L91m24k64L30N9k46J73J76l45r4L80L6k75
$$ 12 -257 -129 -69 -300 -104 244 -124 -515 -85 306 -118 -382 -52 7 -239 -66 110 -235 -329 51 87 -188
1445a88J26Q5k89Q7M69k00n43K17N04k17l38K37R3k14J15K20k50j68K96O7k37
$$ -188 -62 23 -266 -179 290 90 -453 -236 268 51 -287 -50 43 -171 -56 164 -86 -254 42 109 -128
1466a28J15J34l08m5M74mn28L3M59m7k90J11P1j62J23K07k46j83K90P4k81J03
$$ -128 -13 121 -187 -232 242 238 -290 -257 202 155 -135 -24 47 -115 8 215 -31 -214 76 150 -131 -28
1488b8K32k99j78M47J57n15j03M14M9k45N8N9k11J30K92k19k75K53J46k70M0K90
$$ -28 204 -95 -273 174 331 -184 -287 127 176 -69 -11 48 -163 -33 259 40 -235 18 164 -106 -66 224
1510B24k05l17L16L15l34k48K64J20j53M4L9j99N5K79j29k63J69K08k73n6L13
$$ 224 19 -298 18 333 -1 -249 15 135 -18 26 65 -134 -79 200 71 -192 -23 185 -88 -144 169
1531A69p2l45J66L05j73k39J57J01q8N3J0k09K0L36p3l42J23K54j92j25K68J4
$$ 169 97 -248 -82 223 50 -189 -32 69 -19 34 44 -165 -145 191 118 -224 -101 153 -39 -164 104 118
1553A18l19N5L08q2k07N7O1o8J20P9k69n3L27L5l33J5K89j01j99K10J08k59l9
$$ 118 -201 -146 162 80 -127 -70 -9 -77 43 122 -147 -200 127 162 -171 -156 133 32 -167 43 151 -108 -147
1576a47K43Nj44L0kp2J33J53k32j78K73J40k54n8K32l5j86J01J44j25j04J29J5
$$ -147 96 101 -43 -13 -15 -87 46 199 -33 -211 62 202 -52 -110 122 87 -99 2 146 21 -83 46 61
1599F1p3O8k4j35J16J89j73k20K11K01j89j52J68O8j65N0R7p8o2Q0%n6R9%j64
$$ 61 -12 56 32 -103 13 202 29 -191 20 221 32 -120 48 116 -49 1 98 20 -42 38 38 -18 81 81 -83
1624h3L5K47p7k62Q9K25q4j64Q9R2r2k3Q0l1k5N8l5p0J10N7j87k5K06J8k33k1
$$ -83 -48 199 122 -140 -51 174 90 -74 15 107 15 -8 72 41 16 74 39 -31 79 136 -51 -76 130 148 -85 -106
1650a06K15J3j43nO5k1QJ7m8J3M8n3r0J20J07j62j08J58J13j59q8J36M0q5k3L5
$$ -106 109 122 -21 -26 39 18 26 43 -5 8 56 3 -87 33 140 -22 -130 28 141 -18 -106 30 70 -15 -38 -3
1676cJ4J4Op3qJ07k2j45N6J66q0j63Q7J43p7j13O2P7k5n3qJ9O3Oj04k8J23L7j33
$$ -3 11 25 31 -42 -50 57 35 -110 -54 112 32 -131 -44 99 22 -91 -29 48 23 -30 -38 -19 44 50 -54 -82 41 78 -55
1705e5j5J19J4j31KJ31Rj08j6M7N0qo7k9P6M9j00o3J07O8j14o0J21N4j13m4P8
$$ -55 -70 49 63 -68 -66 65 74 -34 -50 -3 47 39 -28 -57 19 68 -32 -95 12 80 -34 -94 27 81 -32 -76 2
1732BN1n1n2qO2N9m7r6M9Q6m7q2N8J13q1j21O5J26k3j27QO9L1l1k7J8M9j2q9K5
$$ 2 53 2 -50 -58 4 63 16 -80 -31 55 8 -74 -16 97 16 -105 -40 86 63 -64 -56 13 44 13 -14 4 53 41 -48 -23
1762b3J00pj33j4J41J8j16k5Q0L4n1m5L6O8k3q8MR0K7j13m2J22N3j26n1Q6P4o5
$$ -23 77 70 -63 -77 64 82 -34 -59 21 55 4 -41 -5 63 40 -48 -44 46 73 -40 -82 40 93 -33 -84 2 76 11
1790A1o2L2N5j1m7pN8L4r4o7Q4J07p0j32O1J21m5r8L9P9j8o5KO7K5o6n6N0R1k1
$$ 11 -51 -19 36 25 -22 -29 29 63 -31 -98 -14 93 23 -109 -48 73 28 -70 -31 48 30 -35 -33 34 59 -7 -63 -13 78 57
1820E7j32J7J10Lj04J0R4Oj07j3R5L4n9q4L4R1Lq8l1Q6M7j12m8J39K9j19m3J25
$$ 57 -75 -58 52 55 -49 -39 55 61 -46 -59 36 70 11 -73 -39 52 55 -33 -64 22 69 -43 -91 48 77 -42 -85 40
1848D0L9q8n0L9N9on1m3N7Q1o9q6O2J09q0j01R2J03r3r0P0Q0m0n0qK3N0k3o5R
$$ 40 79 -9 -59 -20 39 33 -18 -61 -4 77 8 -78 -16 93 13 -88 4 107 14 -76 -6 74 34 -16 -24 -1 49 26 -39 -30
1878c0J00j7j42K3J54k0j40K1J11j1r2K8M2j3j6k2MN2K9j12l8J34O8j42r0J40
$$ -30 70 53 -89 -66 88 68 -72 -51 60 49 -43 -15 27 14 -2 -24 -20 32 61 -51 -89 45 113 -29 -119 21
1904B1P2j11m5Q1Ln5J9M0k8J1k9l9O5J01r0j59J25J49p9j50Q6J01r5m4R0K1p4
$$ 21 93 -18 -63 18 21 -34 -15 25 -3 8 -21 -60 5 106 16 -143 -18 131 52 -98 -12 89 -6 -50 40 61 -13
1931a3jK8rL5J1r5OJ61j9j94J9K00l5j62L8J19o5n1O3J2n4M5qn3N4O7j03p9J69
$$ -13 -14 14 5 40 51 -44 -38 123 104 -90 -71 129 94 -68 -30 89 24 -27 36 48 -6 39 31 -22 32 99 -4 -83 86
1960H6N9j95m1J87L4j62%J13l2l2L9j1p8P4N3j13MJ14p3j13J29J48j76j39J69
$$ 86 145 -50 -91 96 130 -32 -32 81 49 17 56 45 -33 41 94 -19 -15 99 26 -87 42 190 14 -125 44
1985D4J12j03o1M1oPP8n0r6P2N6j01jJ53n7k00J05J98r7j76R8R9p1l6L0n6NJ22
$$ 44 156 53 -8 33 27 34 112 62 -34 38 94 -7 -8 145 88 -112 -7 191 94 -82 16 115 44 8 38 -18 -13 109
2013A09m9j35O2J24r7r2J79K3k15PK35k9k06N6J04m7l5O8o8o8J54K2j80J8J78
$$ 109 60 -75 -13 111 14 -78 101 124 -91 -84 151 122 -84 -28 76 29 -6 62 -6 -74 80 102 -78 -60 118
2038A18o2j65J22J02j68n2K03K6j79j2R9mLK8j07o1J72Q5k08m9J80k6j30Q9J16
$$ 118 56 -109 13 115 -53 -105 98 124 -55 -67 32 28 31 59 -48 -109 63 148 -60 -109 71 45 -85 4 120
2063A20j63q7J88O6j59k0M6l3M7J12j34j67J50J87j62j21J57M4j69N6J66j10j56
$$ 120 -43 -130 58 124 -35 -55 -9 -42 5 117 -17 -184 -34 153 -9 -130 27 71 -98 -42 124 14 -142
2086a42J33J03r6k0M1p8kJ76n1k10Q4K10r6j59J17R0j51kJ50n7j19P0P7o5ON0
$$ -142 -9 94 -2 -22 19 -59 -61 115 64 -146 -62 148 52 -107 10 100 -51 -53 97 40 -79 -9 68 3 9 59
2112E9j16pJ96nk52K6K43l0j91O7R8r8qJ26m9j38Q6P8r2J1Q7j35p3K23Q4k54p9
$$ 59 -57 -64 132 127 -125 -99 144 114 -77 -10 88 -10 -18 108 59 -79 7 85 -7 4 91 -44 -117 106 190 -64 -143
2139a43K25N3j70QR4o5l4J34j5j44M3Q9q1J6J21j03j59J56J89j79j56J62R0j14
$$ -143 82 135 -35 -27 67 2 -32 102 87 -57 -14 75 -6 10 131 28 -131 25 214 35 -121 41 131 17
2163A7j5O9o1k3R9j4j18N0R3j17j3J55m9j96R6K12j03j88P7J25p1j7N5q8k1J29
$$ 17 2 71 10 -13 86 72 -46 4 97 -20 -33 122 73 -123 -27 185 82 -106 -29 96 25 8 63 -25 -46 83
2189H3j4j38M1J09r1o6J58J8j92%K18l5j68K2J01l3nM2p9n5J44K6j36RJ17o4r5
$$ 83 69 -69 -28 81 -10 -76 82 100 -92 -92 126 91 -77 -55 46 13 8 50 -29 -84 60 86 -50 -41 76 12 -83
2216h3J26Q0j74p1J86L4j18k9O7j2J3N2q4o6J18N6j38l6J45m3j19Q2J10j14r7
$$ -83 43 123 -51 -122 64 98 -20 -49 18 6 19 71 -13 -79 39 95 -43 -79 66 23 -96 -14 96 -18 -115
2241a15J13Q0q1k7J4l1L3P5p3j07J08J00j25p2J38J6j26J6J54o5j07M8O2m2JO
$$ -115 -2 78 -3 -30 -16 -47 -14 61 -12 -119 -11 89 -36 -108 30 46 -80 -64 90 25 -82 -34 28 -14 -13 -7
2267gn8L6R0n0j09O0J22q2j00Q0P8r5l2Q7J1p6J1L0MJ4lq0J1J24j5j44NJ52l0
$$ -7 -65 -29 61 11 -98 -38 84 2 -98 -18 60 -35 -67 20 31 -45 -34 -4 0 14 11 -69 -58 66 51 -93 -88 64 34
2296C4j19M1P9n5m0N5J0m7JQJK7L0r3l3J19M7j14n9J25L7j01mO7qp0K4M4k5J2
$$ 34 -85 -44 35 -20 -60 -5 5 -42 -41 -33 -32 -5 25 -68 -101 18 65 -49 -108 17 54 -47 -51 16 8 -62 -38 6 -19 -7
2326gk2j9M2O3p2p7Q6R3q8q3R1N4o5n2M8L6k5nkLL3j1n1J2Q8l4j06N6R5m2r6J9
$$ -7 -29 -48 -6 57 -15 -92 -6 87 -1 -84 7 61 -4 -56 -8 28 3 -2 -4 -1 32 21 -30 -18 70 36 -70 -14 81 39 -57 -38
2358c8R3k6m6%J5J4Rk4j0L2K7p5pQ6K3j08j4J11J2o8l8N5L8m5l5L3K1J1k9m2N5
$$ -38 55 29 -17 -17 -2 12 21 -3 -13 19 46 -29 -36 50 73 -35 -49 62 74 6 -32 23 61 16 -19 14 35 46 17 -25 30
2389C0M7o5l6O5N6p5n8N3O3n7m5J6N1Mm1l0M6L7l6n5L4P1k3r9L6P0k2p0J3O2m
$$ 30 77 12 -24 41 97 22 -36 17 80 23 -22 -6 45 49 8 -22 24 61 25 -30 4 75 52 -47 -11 59 37 -33 -20 42 38
2420C8n6j3N2L0l0n3QM6Mn3j0P2K4q1j8P1J7n8m3N0N3m4l5jM8J8m6l1N5M0n8n7
$$ 38 -18 -31 21 51 21 -32 -24 22 26 -27 -37 35 59 -22 -40 31 48 -10 -53 -3 50 6 -29 -30 18 36 -10 -41 14 54 -4 -61
2452f1O5M8m6n1L6L9k6m3K7L2nm3j3M0L4l2m9K1O9l6n8J6O4j4p1J1O5%n4j6L1
$$ -61 4 52 6 -45 -9 30 4 -39 -12 20 15 -28 -41 -1 33 1 -48 -27 42 6 -52 -36 28 14 -57 -46 19 19 -35 -51 -20
2483b0L9k8m1J6N3Ko5jO0J8o0k4O5J8m2m3N4L8k6l2jN3J0o1j0O9J3n6l2O3L6o0
$$ -20 19 -9 -50 -34 19 21 -44 -45 15 33 -27 -51 14 32 -10 -53 1 39 13 -19 -20 33 43 -18 -28 41 54 -2 -34 29 65 5
2515El9L2O4k9n1NL5J9m1k1L9M3l2n3K9O2l4o4L1N1ro5NM1J8k7l7K9M1j2m2JO7
$$ 5 -34 -2 62 33 -18 -13 22 41 0 -21 18 61 29 -24 5 67 33 -31 0 51 42 -23 -18 23 41 14 -23 6 47 35 -7 -6 61
2548F1j0o8kO8ko1mM7K0l4k9K9M6j6m8MM7J7o7j1L8L9n2k7M9K4n4l1N7J9j3m2
$$ 61 51 -17 -19 49 47 -14 -18 29 49 15 -14 15 61 45 -3 1 48 65 -2 -13 25 64 12 -15 34 58 4 -27 30 49 36 -6
2580flL8K1l2n5L4P0m9o1M2M5j9n9K2M4l1k2ML7Rj7m8K7N4j2p6%P9J2q5jP2nn8
$$ -6 -9 29 50 18 -37 -3 67 18 -43 -1 44 25 -34 -12 32 1 -21 -17 20 29 12 -36 -9 45 33 -43 -43 36 48 -37 -38 34 29 -29
2614b9K1K9j1j9kJ0K9J4n4j9O3L1p2m0P1M8o6l3N0J5l8oJ6QKkk6J9M2n3n3N4P5
$$ -29 -8 21 10 -9 -11 -1 28 42 -12 -31 32 63 -9 -49 22 70 4 -29 21 36 -2 -8 8 16 18 16 -10 9 51 -2 -55 -1 74
2647G4o3q7O7O5m9n0M2J1j4J4j8%MK5n0RN1kq6K6R3k3j01K2Q5j4l8RK1k3K3Ql7
$$ 74 11 -76 -9 56 7 -43 -1 10 -4 10 -8 -8 -4 21 -29 -20 31 29 -57 -31 62 39 -62 -40 45 31 -7 2 23 0 23 31 -6
2680fRM5o1l3R2J7j12j4J03L4p9m2O1K5k9jj8lL4J6o1KP1l8o4N5O1q6n3P9M6o1
$$ -6 3 48 -13 -46 46 63 -49 -63 40 74 -5 -47 14 39 10 9 -9 -12 22 38 -23 -21 50 12 -52 3 64 -22 -75 4 50 -11
2712a1l4K4J9RPl7l4P2L2q1j4Q5j1r1M4Q0n1q0O4P2m0m6J8lJ7M5m1o2L4R2o0r0
$$ -11 -45 -21 -2 7 14 -23 -57 15 47 -34 -48 37 26 -65 -21 59 8 -72 -8 64 24 -22 -4 -7 10 55 14 -48 -14 78 18 -72
2744g2P7M1p4nR3k8q0J5P9j5k6qrjO0kq7J2Q7j2r9M8N6p2j7Q9np5J5K6QJnl7j6
$$ -72 5 46 -28 -33 60 32 -48 -33 46 31 5 -3 -12 -13 47 45 -42 -30 57 45 -54 -6 50 -22 -39 50 45 -30 -15 11 19 20 15 -22 -38
2779c8Q5J4j05j3J03J6j02K4O9m7l9Q1J4p6J1L7j8ML1n4n0Q9P4j11p2R8N7r2j4
$$ -38 47 61 -44 -57 46 62 -40 -16 53 6 -33 48 62 -14 -3 34 16 20 51 -3 -53 36 110 -1 -73 25 82 -10 -24
2808b4N2j7l9L8K9m2KJ3k3K1M2l6q4N3J23q4j01P4O3n1l1L7j4k3L7J7l0j3L6n2
$$ -24 28 11 -28 10 39 -3 -1 12 -11 10 52 16 -68 -15 108 24 -77 -3 60 9 -22 15 1 -22 15 32 2 -11 25 -27
2838b7oR0j6j15J4J19lj04jQ9k2k5K7j9k0M4Jm3J4M5m3m0Q3L2j19k5J07L2r2l3
$$ -27 -33 57 41 -74 -60 59 56 -48 -49 40 18 -7 20 1 -19 25 26 -17 -3 42 -1 -41 42 74 -45 -70 37 69 -23 -56
2868e6P5Oj7Ok4k3M4L3n6mN4k8p5P1O8q8o7O8Q4p0l3L2KJJ7k4l0M6L1n1j8O8j5
$$ -56 19 25 8 14 -10 -33 11 44 -12 -16 38 10 -65 6 74 -14 -81 -13 71 1 -32 0 2 3 20 -4 -34 12 43 -8 -26 42 27
2901B7q5M6R7n5q5M4O6k1l3KkJ4K6k2n3M5M2m2l5N1L4p5j7Q8po7%M7J6k6j7j5
$$ 27 -58 -12 85 30 -55 -11 55 34 1 3 1 15 41 19 -34 11 53 11 -24 27 61 -14 -31 57 50 -17 -17 30 46 20 3 -12
2933a2J7N1k3p6K4P3m2n0M3M0n1k8O0K4m7l1L9J2Jnk7k3O9Mp3mP6Np2RO2k4n0
$$ -12 5 56 33 -43 -19 54 12 -38 5 45 -6 -34 26 50 3 -28 11 23 24 19 -8 -31 38 42 -31 -35 41 46 -26 -17 45 21 -29
2966b9L8L5k1l0jkL5J7n2l3P2K9p4n0Q1L6o6k3O2kl9NM1k1j2olPM1n6n1N9O3o1
$$ -29 9 44 23 -7 -8 -10 25 42 -10 -43 29 58 -16 -66 15 51 -15 -38 24 22 -17 -12 29 8 -4 -10 -13 -6 35 -21 -72 -13 50 -11
3000a1l6K8L5k2l2K5K1j6lnJ4N%m0K1N1j9p5L3O4no7J7N3k1k3J3J5kj0j7RK6n
$$ -11 -47 -19 16 -6 -38 -13 8 -8 -11 -16 -2 3 3 -37 -16 35 16 -59 -26 38 33 -34 -17 36 15 -8 5 20 18 8 -9 0 26 21
3034B1m6QM8J0o4j1N6K4n7k6M4L0l2j8OL2k3qj3K9K7n0l2N2L8m0m0L1M9l1m3K7
$$ 21 -25 -17 31 41 -23 -34 22 46 -11 -37 7 37 5 -13 -7 25 2 -6 -19 10 37 -13 -45 7 45 5 -35 -4 45 14 -29 -2
3066bK2Jk2j4OK9j9j7PM3pn2J5N8j1n6PM9Om6oL3Mj3l1KM2%m0nM6rm3LL1K4m5
$$ -2 20 21 -1 -15 -9 20 1 -16 -9 34 27 -25 -10 48 37 -19 -12 37 43 -3 -9 24 28 15 -16 -14 28 28 -12 -17 29 20 -23 -20 11 35 -10
3103a0k1L4K6k6l5K4K2ml1j2L8K1m3k0L4L6l1l6K8K3k3k9K2L0Nl5j6L2J9k6l0
$$ -10 -31 3 29 3 -32 -8 14 10 -21 -33 5 26 -17 -37 -3 33 2 -34 -6 17 -6 -35 -13 17 22 -13 -29 3 22 -4 -34
3134c4NM7k2l4J9N0on0KK6J8l2j4L6J0k4l1J9K6Ll5j6N3Pl7j4K7J8l1k5L6J7j8
$$ -34 -29 18 -4 -38 -19 31 25 -25 -23 3 21 -11 -25 11 21 -3 -34 -15 11 14 -21 -37 16 23 -14 -28 -1 17 -14 -39 -3 14 -4
3167dk8JL3J1l3k4L0L1l5j9L2L0k9k1J7L8k1l5J3J7Pk8kRL5j9m1K8L6k0m7L4L2
$$ -4 -32 -31 2 13 -20 -44 -14 17 -18 -37 -5 25 -4 -25 -8 30 9 -26 -13 4 11 -17 -19 -10 25 6 -35 -7 29 9 -38 -4 28
3200B8lm0JL6Rl4j0J0L5j6k1nL3Kl8kM6rl1j8L6J6k9j6J0J9Nm1NL1J0l5j8M0K0
$$ 28 25 -15 -14 22 31 -3 -13 -3 32 16 -5 -10 23 25 -13 -15 31 22 -9 -27 9 25 -4 -20 -10 9 14 -27 -22 9 19 -16 -34 6 26
3235B6l8j0K1K7k8k2J6K7ml5JK2K0k0l9K6M1k0l6QN1k4k7J3L1rk7KRRj2k2K3J6
$$ 26 -12 -22 -1 26 -2 -24 -8 19 15 -20 -19 3 23 3 -36 -10 31 11 -25 -17 34 10 -17 -4 27 18 -9 -7 2 11 -1 -23 0 16
3269A6Jm1kM4J6n5LM1nk8j7L4Rk5njK8ql5mL7K1l7j6K7L1l6j6K1J8k1pPJ8j1k
$$ 16 17 -24 -26 18 34 -21 -18 23 18 -10 -27 7 16 -9 -14 -15 13 5 -30 -34 3 24 -13 -29 -2 29 -7 -23 -2 16 -5 -12 -5 13 2 0
3305@nJ5J3j6l1J7N5j6m5J9L6k3l5L2Pk2rK0nOJ0l0JL1Km8lN3Rn5pN3Lm0LJ9q
$$ 0 -5 10 23 7 -24 -7 48 32 -13 6 42 19 -16 16 23 1 -8 12 7 13 23 -7 -6 25 27 -21 -24 29 38 -17 -24 29 32 -8 -5 14 6
3342FnNp%J7j4k5M2J6m0l3N4K9n1k2L3Pk4MLrL1Jk5jL3j4m5M0L8l0m6L6L9k5m0
$$ 6 1 6 -1 -1 16 2 -23 19 35 -5 -38 16 45 -6 -28 5 12 -12 -8 -5 -14 17 18 -7 -8 25 11 -34 6 44 14 -32 4 43 18 -22
3378b2J5J2nJ1rj6J0K2k3j2K6On4oP6po7J8M4Jl9j3K6KlJk7K7K9j7l4L0J8l4l1
$$ -22 -7 5 0 11 2 -14 -4 18 -5 -17 9 15 -39 -45 31 24 -43 -25 19 20 -19 -32 -6 -4 -7 -6 -33 -6 23 6 -28 2 20 -14 -45
3413d5N2K2o1ML4Pj1j4MMK1J8o3J0N3%n0J6L7l7l5M9K7m1k8L2J8j2%k5qM2K2n4
$$ -45 7 29 -32 -28 6 13 2 -12 -8 -4 17 35 -28 -18 35 35 -15 1 38 1 -34 15 42 1 -27 5 23 11 11 -14 -22 20 42 -12
3447a2k2M4K7n5rN9j9l7K1L6k6l8J9J2%J9l1k4L5L8l2m1M3L9n1j9L3K0m4JL9k0
$$ -12 -34 10 37 -18 -27 32 13 -24 -3 33 7 -31 -12 0 0 19 -12 -36 -1 37 5 -36 7 46 -5 -24 9 29 -15 -14 25 5
3479EoRj3J3K0j6m8K6N4k1n3L7K8j6l2J9J8k7pL5k1Njj0j2L7K0p5j2P6J1o6j3
$$ 5 -1 8 -5 8 28 12 -36 -10 44 23 -30 7 35 19 -13 6 24 -3 -10 25 4 9 8 -2 -14 23 43 -32 -44 32 43 -23 -36
3512c6N7on1J5J7j4lK9nlJ5k8j2M0K7n3m3O3L3m7k3L8Pk6KLj5K2jj1OM1l8l0K9
$$ -36 21 15 -36 -21 -4 -18 -21 8 3 0 15 -13 -25 15 42 -11 -54 9 42 -5 -28 10 17 -9 -7 -4 -19 3 2 -9 -3 38 0 -30 -1
3547aN2l3n6M3L7l6l5K9J3j9J1%j7RK6l3qL4Po7K1O2mp2OO3j7m0PJ5j2J6J2l8
$$ -1 51 18 -38 5 42 6 -29 0 13 -6 5 5 -12 -3 23 -10 -18 16 23 -44 -23 39 35 -37 -31 32 15 -25 -18 -3 -15 1 13 -25
3581b5QK2qj2K5J8m4l0Q2km8j7M3Nrj9LJ7J2%m3J7K9km4K6L1l4l1K9M2m4j0J5
$$ -25 -17 5 -3 -15 10 28 -16 -46 36 34 -14 -31 12 17 8 -11 -8 9 21 21 -22 -5 24 22 -22 4 35 1 -30 -1 41 -3 -13 2
3615BJ5lpj4rL1Ql3qM4nm5kN3j3m0JM5j8k6j0K1J2Mk7rJ9K7k8l0N1Ml2j1L1J8
$$ 2 17 14 7 -7 -16 15 23 -10 -18 26 21 -24 -26 27 14 -26 -25 20 2 -24 -34 -13 -1 3 -24 -33 -14 13 -15 -45 6 10 -22 -33 -2 16
3651A6l8LL1Lk4kj2K6K0k9j2K4K2j7m6K9M5l5k7K0L3m1j6K8Lpjj5J4K5Lo4J8M1
$$ 16 -22 -19 12 15 -9 -11 -23 3 23 -6 -18 6 28 11 -35 -6 39 4 -23 -3 30 -11 -27 1 4 -3 -4 -19 -5 20 23 -41 -23 18
3685A8nl7kL6j5k4KL9j9oKLJ5lk3MK3J2m7lM7Ll3j4L3J1k9oK3J0j0lj3J8K4k3
$$ 18 13 -24 -26 10 -5 -29 -27 12 -7 -13 -11 -8 7 4 -19 -15 8 20 -27 -30 17 20 -13 -27 6 17 -12 -18 5 15 5 2 -11 7 31 8
3721Hj4J6J6j9k5L3K5k1k8J5J2j2mPKj0Pk1J2L4k2m3J5L7%m4PK8Kk6j3K1J0kk0
$$ 8 -6 10 26 7 -18 15 40 19 -9 6 18 6 2 9 11 1 8 -13 -1 33 11 -32 -17 20 20 -24 -17 11 13 -13 -26 -5 5 3 -17
3756a7J7PLk3lK4J9m2rM2%k4k7M1%pj7J1K4Nj7pJ2J2j0k9L2J5j7k0K1Oj8j3RJ0
$$ -17 0 7 10 -13 -16 8 27 -15 -24 18 18 -6 -33 8 8 1 -16 -5 19 24 7 0 12 24 14 -15 17 32 15 -5 16 22 4 -9 0 10
3792A0Nlj3J0Rj5j8J2K6j1k0LK6j4k7J7J1jk5LJ5Nmj3J0J8jk8J0K6j0k2oL2lj1
$$ 10 15 12 -1 9 18 3 -15 -3 23 12 -8 -5 21 7 -20 -3 8 7 -18 -15 0 5 1 -12 -2 16 15 -13 -3 23 13 -9 -15 17 14 3
3828Cj3J6J5k4LNJ2Mj4j1J6J9k0k8L5Nk1j5L0Qj0j1j4K2Nk3kJ5Okk3NK1jl1kL1
$$ 3 -10 6 21 -3 0 5 17 21 7 -4 12 31 11 -17 18 23 2 -13 17 25 15 4 -10 12 17 -6 -8 7 13 11 -12 -7 14 13 -18 -20 11
3865A1j4k1J6J2qLj9K2J0qk6QJ7Oj8mL1Kl4OK1Jj0j7J6K0k0%RJ3Jk5j0J6J2j5
$$ 11 -3 -24 -8 4 -4 -1 -20 2 12 4 -22 -14 3 9 -9 -13 18 20 -14 -8 13 14 4 -13 3 23 3 3 12 25 26 1 -9 7 19 4
3901Dk4K5J3j4k8J5K0jk0J3OPj4j5JK7qj8mK4kk0JJ8j5k2J3K8rqlrK8pj1oJ8J1
$$ 4 -20 5 18 4 -24 -9 11 10 -10 3 9 16 2 -13 -12 15 7 -11 -15 9 7 -13 -12 6 -9 -31 -18 10 1 -7 -10 -19 9 2 -9 -15 3 14
3939A4l1RRJ6k6JJ7lJpJ3kJ0j9nK5J1k7j8J6J2j0k0J5L1j9l2J1J7kj3qPK3j4k8
$$ 14 -17 -8 1 17 -9 -8 9 6 7 0 13 11 21 2 -3 22 33 6 -12 4 16 6 -14 1 32 13 -19 -8 9 7 -6 -14 -7 16 2 -26
3975b6J1K9lk9NL5j3k6J3RJj8J0PLjrJ5j0Pk0oL8J0m1kJ4K5k9nK3lj5mJ5Rjj2
$$ -26 -15 14 11 -18 -13 22 9 -17 -4 5 6 -12 -2 5 8 7 -2 13 3 10 -10 -16 22 32 -9 -11 3 28 -1 -6 17 14 -1 -5 10 19 18 6
4013Fj6K8J3l2pRJ7k2j1K6J1k5rLQRj9PlJ4j7j3JK9Lm5J9K9j4k4J0K2%qqJ6j2
$$ 6 -10 18 31 -1 -8 1 18 -4 -15 11 22 -3 -12 -9 -1 8 -11 -4 -7 7 -10 -23 -22 7 10 -35 -16 13 -1 -25 -15 7 7 -1 -9 7 -5
4050eOkj0MK0l6JL1J5m0pL0J2k3mRLLpj9K3J6j8j1J8J1k6j2L0J6l2j6K7Rj1kn
$$ -5 1 -1 -11 -7 13 -23 -22 9 24 -16 -23 7 19 -4 -8 1 4 7 0 -19 4 20 2 -9 9 20 -6 -18 12 28 -4 -20 7 16 5 3 -2
4087bKQok4ML8j4l9K5M1l1m3K9M3k3k9J4J1Mqj3LJ9J1k1qJ2J5k1j0K8Mk7mL8r
$$ -2 0 8 2 -22 -18 20 6 -33 -8 33 2 -41 -12 31 8 -21 -7 4 8 0 -13 -10 9 20 -1 -9 3 18 -3 -13 15 19 -8 -12 26 17
4123A7k2j4L6mJj9lJ0K3j8l0L0J4k9j6M0Kk0j7L0Pj6mKKOmk7J3K3%m1QL6k6j2
$$ 17 -5 -19 17 13 14 -5 -8 2 25 7 -23 7 21 -8 -24 16 18 -2 -19 11 18 2 -2 0 2 8 4 -23 -10 13 13 -28 -20 16 -10 -22
4159b2J6K6l1j1K3MJk3kJ0K1Ll5PK6%k8mL4mk6RK0lj6MMPnj9jJ5J8k5k4L6J6k2
$$ -22 -6 20 -11 -22 1 5 6 -17 -19 -9 12 15 -20 -13 13 13 -15 -19 15 11 -15 -6 14 11 -5 -1 3 10 5 -14 -15 0 18 -7 -31 5 21 -1
4197ak8K8K1k1qPqJlJOJ6k1j6J7L2j8m1J2L5j9rPQ%j1pK3jlNoJ1J4m4jN2pm0n
$$ -1 -29 -1 20 -1 -9 -2 -10 -9 -12 -11 -5 11 -10 -26 -9 23 5 -36 -24 11 -8 -17 -10 -2 -2 -13 -20 3 2 -1 4 -2 9 23 -21 -22 30 23 -17 -22
4237b2M6oj5nJ1Qk3J9noRj0j2J5J8k3j4K4K2l6k8L4J0ok0PlJ0okLQJk7K3K9l3
$$ -22 24 18 3 -2 9 17 -6 13 8 2 11 1 -11 4 22 -1 -15 9 31 -5 -33 1 11 5 -15 -8 -11 -1 -7 -9 -6 2 3 -24 -1 28 -5
4274ej6J8L0k6k8J7K5kk7J5J2jmj4KQMj6J1K7j3k2OK2mpj9K0J0j4j4%J7J3k7m
$$ -5 -21 -3 27 1 -27 -10 15 13 -14 1 13 12 8 -6 -4 4 8 -8 3 30 17 -5 1 23 19 12 -7 13 23 9 -5 -5 12 25 -2 -6
4310fPK1k5j5L2Nl9%K1J9l6nNJ3Pj4j0J0J1Kj7J5J6j8j8J1J9pk2K6Rj7JrRJ9j6
$$ -6 1 22 -3 -18 14 19 -20 -20 1 20 -16 -21 -16 -3 4 -10 -20 -10 1 3 -14 1 17 -1 -19 -8 11 4 -18 8 17 0 1 -8 1 20 4
4347Dnj2K7J1k6%K2%l1J5J0%l4J5RMMk3J1J7lj0j8J9J6k5j6K8Kj5nPJ5j8qJ4Q
$$ 4 -1 -13 14 25 -1 -1 21 21 -10 5 15 15 -19 -4 5 9 13 -10 1 18 15 5 -13 6 22 -3 -19 9 11 -4 -9 -2 13 -5 -13 1 9
4384Ij9okJ3K2k1k3K1L1j8j7KK7j8j3MK3nk1MJ2Oqj3JK9nk2kK7kk5J5%Kkj2J4
$$ 9 -10 -16 -18 -5 17 -4 -27 -6 25 7 -10 -8 19 1 -12 -8 15 10 -11 -7 5 11 3 -10 -9 20 15 -7 -9 18 16 -9 6 6 8 6 -6 8
4422HJj2jpJ8Pk1oOK8k8jJ0Prk2J0J7k1j0QJ9%j3j1J5J6qj3JK9k4kJJ7oqoJ8j4
$$ 8 9 -3 -4 -11 7 14 -7 -13 -7 21 -7 -8 2 9 0 -22 -12 5 -16 -26 -18 1 1 -12 -23 -8 8 0 -13 -12 17 -7 -9 -8 9 3 -5 -11 7 -7
4462gqkJ9J2rj8PK9j0j1j5K5nj0MJ2J0k1oj0K4%j2jJ1kj1j3K2J3j7qJ0J0k1oK0
$$ -7 -15 -17 2 14 5 -13 -6 23 13 2 -13 12 7 -3 1 13 23 2 -4 -14 10 10 -2 -3 8 6 -5 -18 4 17 0 -8 2 12 -9 -15 5
4499ELoj7j0L2noqOPLkj1L1k5j0J3K1k2r%PRj8LJ6J8qj7LRJ3k4kK1Kk8J1mNj0
$$ 5 8 2 -15 -25 7 2 -4 -12 -6 1 4 2 -9 22 -3 -13 0 21 -1 -10 -10 -3 6 -12 -9 7 25 17 0 3 12 25 1 -1 20 22 -6 5 1 6 -4
4540dkNQJ1j7qJ1J2j5j4J6J1k8RlNnrRLQj8lJ0J0mj8J8Nj0rK0J2j4j6lJ5NoLl
$$ -4 -6 -1 7 18 1 -7 4 16 1 -13 3 14 -14 -5 -8 -3 -8 -17 -8 -5 3 -15 -18 -8 2 -2 -20 -2 3 -7 -16 4 16 2 -14 -17 -2 3 -3 0 -3
4581cPmj4J7J7pj2J3lPk7J1J7j0j3mJ8Lmk3J7Pjj0jJ1lprJ2K1k9j3J2J1j0pRm
$$ -3 4 0 -14 3 20 13 1 14 11 18 -9 2 19 9 -4 -8 10 13 9 -14 3 10 9 -1 -2 9 6 -1 -10 2 23 -6 -19 -7 4 -6 -13 -4 -8
4620hJ4j1mJ9Loj9K3Jlj3QQmj1kRRllKJ4j2k0K4KOj8pK9Jl8J5J2jj7JMJLj4JJ6
$$ -8 6 -5 -9 10 13 7 -12 11 12 9 -4 4 12 8 -3 -5 4 13 10 7 9 23 11 -9 15 17 23 5 -2 27 28 -10 5 17 16 -1 0 4 5 8 -6 -5 11
4663A1Pj8j7L7mk7jJ0Ok3OkJ3%rpJ1J1j1qJ7Mrk3L0KJj2QRoj1KJ6mj0LpJ9Ml1
$$ 11 18 0 -17 20 16 -11 -12 -2 4 -19 -13 -15 -2 -2 -11 -18 -7 4 -7 -15 2 6 -3 -26 4 6 7 -5 3 12 6 -5 -3 13 9 -1 2 -5 14 18 -13
4704a3NJ2Rk7J0lKk0J6RllpPQj1lj3K6J8l3mJ7Rj7j7J9ljj4J1J5j8NLjPMk3K0
$$ -13 -8 4 13 -14 -4 -7 -5 -25 -9 0 -3 -6 -13 -6 2 -9 -12 -25 1 19 -14 -18 -1 8 -9 -26 -7 -10 -11 -25 -14 1 -17 -12 -9 -10 -3 1 -22 -2
4744bJ5j7k1K1Qj0KKQp%MJMjj2ML2Jm2K1LKk6QK2k6JnJ5%qRj2J8pj5qL2Mk6NJ8
$$ -2 13 -4 -25 -4 4 -6 -4 -2 6 -1 -1 3 4 8 7 -5 -1 31 32 -10 11 14 16 -10 -2 20 -6 -5 -10 5 5 -3 6 -6 12 5 -10 -18 14 18 -8 -3 15
4787A5rk1kJ0PkrJmJ5lpLQkj2PJ5k1j3L0orMJJ5jjpjJ6m%j3PLj7J3J6j6j7J7L
$$ 15 6 -15 -17 -7 0 -2 -11 -10 -14 1 -2 -9 -6 2 0 -12 -5 10 -11 -24 6 0 -9 -5 -4 11 10 9 2 1 17 13 13 0 7 10 -7 6 22 6 -11 6 9
4830INk0j7K1KMj4kJ6Pj7j4K1Mk5J1J7pk0KK4j3J0pj0J8%pj9J8L3l1k2J4K4k1
$$ 9 14 -6 -23 -2 0 4 -10 -12 4 11 -6 -20 1 5 -20 -9 8 1 -19 -17 7 -6 4 -3 -13 5 5 -2 -21 -3 30 -1 -23 -9 15 -6
4866fjRJ0j7PlJ3oKonL4j8k8K1J5j0qoJ3mk4J7J8lrj6lK2Jj5%J7lk1MK4j0j1m
$$ -6 -7 2 12 -5 2 -1 12 6 8 2 -3 31 13 -15 6 21 11 3 -3 10 6 -18 -1 17 14 5 -11 -14 8 9 -6 -6 11 8 -13 -9 15 5 -6 -10
4906a0KJ8k4lRK9k6Nj1K3Rk1j3J9Rk1lJ4Pkj4LPnJPnJMj3J5J3pk2PK7k6jJqJ3
$$ -10 -8 10 -14 -17 -8 21 -5 0 -11 12 21 0 -13 6 15 -6 -9 5 12 10 -4 -1 6 1 2 9 4 5 9 -4 11 24 17 -5 2 29 3 2 3 -5 8
4947HqJKOj1j1KJ3lk0kK7mm1K3J8lrLJ6j6Mpj2L5j4lkK4j7nj7L0Ok2j1K7Rj0p
$$ 8 0 1 3 9 -2 -13 -11 2 -1 -21 -23 4 0 -41 -18 0 -3 -12 -9 7 -9 -5 -12 -24 11 -3 -6 -8 16 -1 -6 -23 7 13 -9 -20 7 16 6 -1
4987aJ5Ok3RmqJ5%k4J9Nj4JJ1Nk0JJMPj1%J0JJk3QNJ7k6%J2opROj5nKRLo%NJR
$$ -1 14 20 -3 6 2 -6 9 9 -15 4 9 -5 -4 7 12 -8 -7 -6 -2 5 -6 -6 4 5 6 -17 -9 -4 13 -13 -13 -1 -7 -14 -5 1 -14 -19 -17 -8 -5 -11 -11 -6 -5 4
5033Djj3J4joLPJ7k2nJ0JqmJ2oPj1k%J3mo%J6k2qNJ6qj2NJ2mOj4K0kj9omJ6Lj3
$$ 4 3 -10 4 3 -3 0 7 24 2 -3 7 8 0 -4 8 2 9 -2 -4 -4 9 5 -1 -1 15 -7 -15 -10 6 -2 -14 -9 3 -1 5 -9 11 9 -10 -16 -20 -4 -1 -14
5077a4lK2Mj8J0kJj3JJ3mJj0JJ0mqmK2opj4J6J0j4J4JJkJLjQrqJ4mrj1J1KnmM
$$ -14 -17 5 9 -9 1 -1 0 -13 -12 1 -3 -2 -12 -11 -1 -5 -13 -17 5 -1 -8 -22 -6 4 -10 4 5 6 4 5 8 7 15 6 -2 12 8 -1 -12 -1 1 -4 -8 -4
5121dNLj1NJNppOPj3j4J4Pmj4MJ7MpkORj4k%LPrRpQk1kK4JqkJ2Mn%lJ8j1mj5P
$$ -4 1 4 -7 -2 -1 4 -3 -10 -4 3 -10 -24 -10 -3 -7 -21 -17 0 4 -3 -5 1 10 -4 -6 -6 -3 4 -5 4 -3 5 -16 -18 6 7 -1 -3 9 13 8 8 5 23 12 8 -7 0
5169@J2mpJ8j2JplmNj4J8J5pnj4J4jj1KmPj3KmJ9Kj7pJ6J0lk7K4Npl%RoJrL2k2
$$ 0 12 8 1 19 7 8 1 -2 -6 -1 -15 3 18 11 6 -8 6 5 -6 -4 -8 -1 -14 -12 -16 3 5 -12 -19 -3 7 4 -23 1 6 -1 -4 -4 5 -1 0 -9 23 1
5213AlLJ0mjj2RMNj3J0J4j5k3KK2Jpj6J5Mjj7J3J2r%nJ3oqpLJLrJ7j0lqLJ2Nj5
$$ 1 -2 1 11 7 6 -6 3 7 12 -1 9 23 8 -15 -13 9 10 3 -13 2 6 5 -12 1 13 4 4 -1 12 6 -2 -9 -6 -5 -2 -11 6 -4 -7 -15 -12 0 5 -10
5257a0%J2Jj0kJ8ojoMJ4j3kjK0nj0qK1lqj0J7jnj0QJ0j7J0j3J2NmrK1j3%j8J1
$$ -10 -10 2 3 -7 -9 9 3 2 -4 0 14 1 -1 -2 18 13 3 -5 16 13 5 -5 12 11 6 -4 4 14 -3 7 -6 6 11 7 -2 19 6 6 -12 -1
5297aPj0LLK%kqQpPrjkOj0LK3ll1J1J0MokoK5j8qRJ8%k8J0PJ6k4oK3oMqMQpj4
$$ -1 6 -4 -1 2 4 4 2 -6 2 -5 2 -7 -8 -10 -4 -14 -11 12 9 -22 -11 -1 3 -3 -5 -11 14 -4 -12 -3 15 15 -13 -3 4 20 -4 -10 13 7 11 3 7 15 8 -6
5343fNQnj1lJ4J6j1j9K0mj7kRQ%j2nJ0J0j6lLJ0j2oJ0J9j1j0mK6j4rLJJ3j1%N
$$ -6 -1 7 2 -9 -12 2 18 7 -12 8 4 -13 -15 -6 2 2 -10 -15 -5 5 -11 -14 -11 -1 -13 -19 -9 10 -1 -11 -15 11 -3 -12 -9 -8 5 -6 -6 -1
5383aJ7j9nMJ0Qlj5J6NnnLjj%nN%%j6K3j0j1LJ4Mk9mQK7j8j3J5KOk0J0JLrj0R
$$ -1 16 -3 -8 -4 6 14 11 -4 12 17 12 7 10 9 8 8 3 8 8 8 -8 15 5 -6 -3 11 15 -14 -18 -10 17 -1 -14 1 3 9 -11 -1 0 3 -6 -16 -7
5426gP%mPPrj6OOomRkQ%j2%J4j1J2j4J7Kj6kK9lk6%J9J2pj3oJ7kj3Oj0J7j2j1
$$ -7 0 0 -4 3 10 1 -15 -9 -3 -9 -13 -4 -6 2 2 -10 -10 4 -7 5 -9 8 10 -6 -8 21 18 -8 -8 11 23 16 3 -3 14 12 -1 5 -5 12 0 -11
5468a1J1J3k7mJ9JrqJ0q%PrpJ0J1j6Rm%lQJ2Ok3RJ%kJlKoMJLPj%%mnOJ5Mk8RJ1
$$ -11 0 13 -14 -18 1 2 -7 -15 -5 -13 -13 -6 -15 -22 -12 -1 -17 -8 -12 -12 -15 -7 5 11 -12 -3 -2 -2 -4 -3 -6 -4 -10 -6 -5 -2 5 4 4 4 0 -5 1 16 20 -8 1 12
5516A2ljj0lJkkQ%L%lNlopJ6lpJ4j0lqNqJ1NqJKJ0pmQJ0j2nLQJ0j9PLlNj1JRJ5
$$ 12 9 8 -2 -5 -4 -6 -8 0 0 3 3 0 5 2 -4 -11 5 2 -5 9 -1 -4 -12 -7 -15 -4 1 -7 -6 -4 6 -1 -5 3 13 1 -4 -1 7 17 -2 5 8 5 10 -1 0 9 24
5565B4j6rLRj5MK0j2jqMJ4qj4J1jKj6MRJ0j3jPMk7%K5j1lNMpJLj6RJ5k1Pj2J5
$$ 24 8 -1 2 11 -4 0 20 8 7 -1 3 17 9 -5 6 5 7 -9 -5 4 14 1 0 7 11 -16 -16 9 -2 -5 0 4 -3 -2 1 -15 -6 9 -12 -5 -17 -2
5607bKqMQpj0J6rJ5omjJ0oKj6L3j3r%K8rj3pJ6kk0PJOlJoJ5Mj9j0J9lqlK2ok5
$$ -2 0 -8 -4 4 -3 -13 3 -6 9 3 -1 -2 8 2 4 -12 21 8 -1 -1 27 18 5 -2 14 12 -8 -1 0 6 3 4 -2 13 17 -2 -12 7 4 -4 -7 15 9 -16
5651a6OK4j9KoP%J0qj4J7lJ2k5K2Lqj7J1K2j0j9J5oRMj5PJ2lj2QJ0j5qjK8rk1
$$ -16 -10 14 -5 -3 -9 -2 -2 8 0 -14 3 0 12 -13 9 12 4 -13 -2 20 10 -9 6 0 9 13 -2 5 17 14 2 10 20 5 -3 -4 24 15 -6
5690fJ8oknQnPJ0j0mJ3oj2mJ5pkLJjj1lQkNOOk0J0Lj8J4J2j1k1K0J5j2oMRj5Q
$$ -6 12 6 4 -1 7 2 9 19 9 5 18 12 0 -4 11 4 2 5 6 5 -6 -9 -1 -3 2 8 14 -6 4 7 -11 3 15 4 -17 3 18 6 0 4 13 -2 6
5733FKN%qqQJ9j1pJ0J5j3qLOj0%j9J8rMokKOpnJ7oNj3%Nrj4J7J5k1OlPopLJ1J4
$$ 6 8 13 13 5 -3 5 24 13 6 16 31 18 10 13 19 9 9 -10 8 -1 3 -3 -5 -3 3 -4 -9 8 2 7 -6 -6 -1 -10 -24 -7 8 -13 -7 -10 -3 -9 -16 -13 -2 12
5779A2k1oRL2j4nlJ1Jk4J7lj0J0LjKKj4MJ7jj6nJ9Oj5j1J3Mk7J8JKJ2k1kJ0Jp
$$ 12 -9 -15 -6 26 12 7 4 15 16 -8 9 6 -4 6 9 8 10 12 -2 2 19 18 2 -3 16 22 7 -4 9 13 -14 4 5 7 19 -2 -4 6 7 0
5819@pM%ONqNj2j8J7J5rqjPJ2ookJ1n%RJ0qk7K2Pnr%J7j0QjpJ3Lj1LPj0k0KK2
$$ 0 -7 -3 -3 3 8 0 5 -7 -25 -8 7 -2 -10 -11 -4 8 2 -4 -6 5 0 0 9 19 11 -16 6 13 8 -1 -1 16 6 14 13 6 19 22 11 14 21 11 -9 -7 15
5864A5pnjJ1lrk0K0Nmj0J0j2K2lj2rJ6J0k3J6Jj5%Q%rQO%Oj1lJ1Jj3MlJ1pJjQ
$$ 15 8 3 2 13 10 1 -19 1 6 2 -8 2 -10 12 9 -3 -12 4 14 -9 7 8 -7 -7 1 1 -8 0 6 6 12 1 -2 9 10 -3 1 -2 9 2 3 2 10
5907A0Oj4LQkJk3J6Oj0jMkJ3j1kPJ6k4lRkkj4J4MJnLj2J5j7lJ6Pj1j8J6Lj1Mj
$$ 10 16 2 5 13 11 12 -11 5 11 1 0 4 2 15 4 2 9 25 1 -2 7 5 3 -11 3 7 8 3 6 -6 9 -8 -11 5 12 1 -17 -1 2 -9 -5 -6
5949fQoQj3J7Jj2J0MJKj9MJ4lj8QJ6kj4J9j8J7krj0K6j0nqJ4lKj1J6pqnMJ2j3
$$ -6 2 -4 4 -9 8 9 -3 7 11 12 14 -5 -1 13 10 -8 0 16 14 0 19 1 18 16 7 -3 23 13 8 0 14 11 13 2 18 11 3 -2 2 14 1
5990AKmmJ3j1j0K1Ok1RLnkPj4NNj2RJJ1pokJ1p%MRok6K4J5j8j0OJ4KqPNqJ2k0
$$ 1 3 -1 -5 8 -3 -13 8 14 -7 2 5 0 -2 5 -9 -4 1 -11 -2 -1 10 3 -3 -5 6 -1 -1 3 12 6 -20 4 19 1 -9 -3 11 13 5 12 17 9 21 1
6034AJK7j5nkLlrlJ6%j1MrJ2nkLLqpj3K7j2rkJ6J3k5LK5oqpJ3lMj9j1K3KmjLM
$$ 1 2 29 14 9 7 10 7 -2 -5 11 11 0 4 -5 7 2 0 3 6 -2 -9 -22 5 -7 -16 -18 -2 11 -14 -11 14 8 0 -7 6 3 7 -12 -23 0 2 -2 -3 0 4
6079D%o%MJ1j1mRJmoJ6Llk1J8jjnjOJj1pPJ4oj1J3j2jjmJ4Lj4j6K8kj2j4J4LJ
$$ 4 4 -2 -2 2 13 2 -2 7 8 4 -2 14 17 14 -7 11 10 9 4 3 9 10 -1 -8 -1 13 7 -4 9 -3 -4 -5 -9 5 8 -6 -22 6 4 -8 -22 -8 -5 -4
6123dqQLkOoOJrrJ3J2Kj7PJ8k4NJJ7nk2QJ2NrMoOok1J2J1%j7Q%J2j3KNJj1OLj
$$ -4 -12 -4 -1 -3 3 -3 3 4 -5 -14 -1 11 13 -4 3 21 -3 2 3 20 15 -7 1 13 18 9 13 7 13 7 -14 -2 9 9 -8 0 0 12 -1 1 6 7 -4 2 5 4
6169DpkoPLj4oJ7%qPjQNj6QJ3rkrJ4jj5PLORom%OkPj%n%%%%Qj6J2lj8LJ2nj3N
$$ 4 -3 -5 -11 -4 -1 -15 -21 -4 -4 -12 -5 -6 2 7 -9 -1 12 3 1 -8 6 5 -10 -3 0 6 15 9 5 5 11 9 16 15 15 10 10 10 10 10 18 2 14 11 -7 -4 8 3 -10 -5
6219eJ4Jj0QOlopmKRojLj1mOJ%NlJ5pj4PLRqorRMKrJ0J4pj3MK3nj0LmMj3J1Mj2
$$ -5 9 10 0 8 14 11 5 -2 -6 -4 5 -1 -2 1 -10 -14 -8 -7 -7 -2 -5 10 3 -11 -4 -1 8 0 -6 -15 -6 -2 0 -9 1 15 8 -5 -1 22 17 7 10 6 10 -3 8 12 0
6268@%lKRj4kK1rJmrPklKjNjlqPqjqK2J2l2QJ5mmQj2J4j0PKrJ6j6LPj%jnJ5j4
$$ 0 0 -3 -1 8 -6 -8 13 4 5 1 -8 -1 -3 -6 -4 -5 0 -1 -4 -12 -5 -13 -14 -22 0 12 -20 -12 3 -1 -5 3 -9 5 -5 2 4 -5 11 -5 -2 5 4 4 3 -2 13 -1
6316aKNjNj2J3MKnjMqJ1k6nK9k5RNOqJlQOk0MPokmOj2QlLMOrJ0mjnlPJ6oqlJJ3
$$ -1 1 6 5 10 -2 11 15 17 12 11 15 7 18 -8 -13 16 -9 0 5 11 3 4 1 9 15 -5 -1 6 0 -2 -6 0 -12 -4 -7 -4 0 6 -3 7 3 2 -3 -6 1 17 11 3 0 1 14
6367A4rj9K2KqpRMqMMJJmKMKonJQj4j3J1J3qrPLJqj2K2J0j0j5JJ0%j2oROpJ3o
$$ 14 5 -14 8 10 2 -5 4 8 0 4 8 9 10 6 8 12 14 8 3 4 12 -2 -15 -4 9 1 -8 -1 2 3 -5 -17 5 15 5 -10 -9 1 1 -11 -17 -8 -2 -9 4 -2
6413blJ4j0J1Kj7mJ2JO%j4QJjqJ8Qj6nJ2jpKKmlJl%KLpPKqJmNJkJJ5j4qLKNj5
$$ -2 -5 9 -1 10 12 -5 -9 3 4 10 10 -4 4 5 4 -4 14 22 6 1 13 12 5 7 9 5 2 3 0 0 2 5 -2 5 7 -1 0 -4 1 2 0 1 16 2 -6 -3 -1 4 -11
6462a1%J2j5J3j9J6%nRnnJ7pNljnJ1oNknKQ%LjnK3rj4LMllkJ0j1j0jQ%Jj7JK4
$$ -11 -11 1 -14 -1 -20 -4 -4 -9 0 -5 -10 7 0 5 2 1 -4 7 1 6 4 -1 1 9 9 12 11 6 29 20 6 9 13 10 7 5 15 4 -6 -7 1 1 2 -15 -14 10
6508A0pj4J1OkLj3KMQj0lJ9j5oj0J0Lj0PK3j6lNklj1J0RnKnkJ4LLkkjoJ4j1Jj
$$ 10 3 -11 0 6 4 7 -6 -4 0 8 -2 -5 14 -1 -7 -17 -7 -4 -14 -7 16 0 -3 2 0 -3 -14 -4 5 0 2 -3 -5 9 12 15 13 11 10 4 18 7 8 7
6552GkoJ7knkJoooJJ4rrOJPj1PJJ1nj3RJoLJ%mrMJ4Mr%MjNj3J0%jlP%nNnmJ0r
$$ 7 5 -1 16 14 9 7 8 2 -4 -10 -9 5 -4 -13 -7 -6 1 -10 -3 -2 9 4 -9 0 1 -5 -2 -1 -1 -5 -14 -10 4 8 -1 -1 3 2 7 -6 4 4 3 0 7 7 2 7 2 -2 8 -1
6604aJQRmnnRrKLOpj2kJ3oMj1RJpj0J4Jmj3OJ1kj6PlK0j8kpJ0Pj2J4llnOJ4Lk1
$$ -1 0 8 17 13 8 3 12 3 5 8 14 7 -5 -7 6 0 4 -7 2 3 -4 -14 0 1 -3 -16 -10 1 -1 -17 -10 -13 7 -11 -13 -20 -10 -3 -15 -1 -4 -7 -12 -6 8 11 -10
6651a0jK1mj3kPJ2mj3J0MLj8J0NKjjJjjj2J3klonK2k0J2j3J8nkj2mK8j5j2J4k0
$$ -10 -11 10 6 -7 -9 -2 10 6 -7 3 7 10 -8 2 7 9 8 7 8 7 6 -6 7 5 2 -4 -9 13 -7 5 -8 10 5 3 -9 -13 15 0 -12 2 -18
6692a8J1omRLj8K0qNLRqoJ5j6OJ1nj4QRKPj0pJ1mrPlJ1j2lK4nj6moJ4lJoRmoj3
$$ -18 -7 -13 -17 -8 -5 -23 -3 -11 -6 -3 6 -2 -8 7 -9 -3 8 3 -11 -3 6 8 15 5 -2 9 5 -4 3 0 11 -1 -4 20 15 -1 -5 -11 3 0 1 -5 4 0 -6 -19
6738a9J6Kmj6J4J2j0nNqOpoOPj2PLMrQkJJ1j6LNjmMOMnj0RRrJRLj2MNlJ3j1qM
$$ -19 -3 -1 -5 -21 -7 5 -5 -10 -5 -13 -7 -14 -20 -14 -7 -19 -12 -9 -5 -14 -6 -8 -7 4 -12 -9 -4 -5 -9 -5 1 5 0 -10 -1 8 -1 0 9 12 0 4 9 6 19 8 0 4
6786DMqJpRj5%J7mMoj2JJ4oj2OJ8j4mMOj3QrlJ1opJ0LJnjJ0Lj1OJ1jj7KNNnMn
$$ 4 8 0 1 -6 3 -12 -12 5 1 5 -1 -13 -12 2 -4 -16 -10 8 -6 -10 -6 0 -13 -5 -14 -17 -6 -12 -19 -9 -6 -5 -10 -11 -1 2 -9 -3 8 7 -10 -8 -3 2 -3 1 -4
6833dkJ3qlQMrPJRqoRjpojJ1Jj9NNoKnRRpj1J8j3Or%MqJ9j0kj2J5j4J2PoOj0J1
$$ -4 -6 7 -1 -4 4 8 -1 6 7 16 8 2 11 10 3 -3 -4 7 8 -11 -6 -1 -7 -5 -10 -1 8 1 -10 8 -5 1 -8 -8 -4 -12 7 -3 -5 -17 -2 -16 -4 3 -3 3 -7 4
6881DKj0JJ3jlpQJ1pj0QQnjj2J2J0j6pK0Lj5L%JLj8J3LjprJ0nMj1J7Lj5j5J1L
$$ 4 6 -4 -3 10 9 6 -1 7 18 11 1 9 17 12 11 -1 11 21 5 -2 18 21 6 9 9 10 13 -5 8 11 10 3 -6 4 -1 3 -8 9 12 -3 -18 -7 -4
6924drLj4K2Jj4J0mjOLkPkj4K6j8Qj3kLQj4J4ONj8J1KNj%j1PjKrJ3olmMKj2%J
$$ -4 -13 -10 -24 -2 -1 -15 -5 -9 -10 -4 -1 -3 4 2 -12 14 -4 4 -9 -11 -8 0 -14 0 6 11 -7 4 6 11 10 10 -1 6 5 7 -2 11 5 2 -2 2 4 -8 -8 -7
6970gLMLj2NjLj2RL%j0RMj6KNj1K0pj2K7j2J4j8J9rJ0j8rJ5K%%OQqKj2J3J3j6
$$ -7 -4 0 3 -9 -4 -5 -2 -14 -5 -2 -2 -12 -3 1 -15 -13 -8 -19 1 -6 -18 9 -3 11 -7 12 3 13 -5 -14 1 3 3 3 9 17 9 11 -1 12 25 9
7012IoJ1Qk4%J1Pj5mPRj6KM%L%rNNj1j3K2Mj9PjJqjRNj3J6j3RrQj0JJ4noKJ5j0
$$ 9 3 14 22 -2 -2 9 16 1 -3 4 13 -3 -1 3 3 6 6 -3 2 7 -4 -17 5 9 -10 -3 -4 -3 -11 -12 -3 2 -11 5 -8 1 -8 0 -10 -9 5 0 -6 -4 11 1
7058A%MOqlNLJNj4LNmJ%PnolJ6j9rOJ%Nn%lJ5kj3LJ0j1j2MJ0%Rkoj0j0J3%JlJ2
$$ 1 1 5 11 3 0 5 8 9 14 0 3 8 4 5 5 12 7 1 -2 14 -5 -14 -8 -7 -7 -2 -7 -7 -10 5 3 -10 -7 3 -8 -20 -16 -6 -6 3 1 -5 -15 -25 -12 -12 -11 -14 -2
7107bpMJKnJ5j1jjQlqjK6j3nlkJ5nnJJ9nk2J1Qkj6jJ4plj0J3Lr%lMJkKJNJoj0
$$ -2 -9 -5 -4 -2 -7 8 -3 -4 -5 3 0 -8 -9 17 4 -1 -4 -6 9 4 -1 0 19 14 -8 3 11 9 -7 -8 6 -1 -4 -14 -1 2 -7 -7 -10 -6 -5 -7 -5 -4 1 2 -4 -14
7155a4J6j0o%MML%j0J0lkJ2J0pj3NK2qj9OpJ4j0oOpJ3MpJJoPKJ5k5MPJmj0K6j7
$$ -14 2 -8 -14 -14 -10 -6 -3 -3 -13 -3 -6 -8 4 14 7 -6 -1 21 13 -6 0 -7 7 -3 -9 -3 -10 3 7 0 1 2 -4 3 5 20 -5 -1 6 7 3 -7 19 2
7199BrlMLPqPKj4j0J3mjlRJKJj6K1o%qMNJPj5J0Rj1kQJolPnMkmMnqJJ7Pj2klJ7
$$ 2 -7 -10 -6 -3 4 -4 3 5 -9 -19 -6 -10 -11 -14 -5 -4 -2 -1 -17 4 -2 -2 -10 -6 -1 0 7 -8 2 11 0 -2 6 7 1 -2 5 0 4 2 -2 2 -3 -11 -10 7 14 2 0 -3 14
7250A4jrj0OLRj4RRl0J7j0RnoOlMj0nNJ1kLnOqpRNnnRPMj3j6K7KnrJ0KJqNPpk
$$ 14 13 4 -6 0 3 12 -2 7 16 -14 3 -7 2 -3 -9 -3 -6 -2 -12 -17 -12 -1 -3 0 -5 1 -7 -14 -5 0 -5 -10 -1 6 10 -3 -19 8 10 5 -4 6 8 9 1 6 13 6 4
7299DoJ2Mj0j0MJ0J1j8j%omjLkJmJ3j2K0rj1J4j1k%LPk0KJ5pooJ4RRj7MN%mmJ1
$$ 4 -2 10 14 4 -6 -2 8 19 1 0 0 -6 -10 -11 -8 -10 -9 -13 0 -12 8 -1 -12 2 -9 -11 -11 -8 -1 -21 -19 -4 -11 -17 -23 -9 0 9 -8 -4 1 1 -3 -7 4
7344DLMqQ%lj6K5jooLLJk0JK3nLk0kJ4j0nQrJ6j9QJ3%ronORpqJ7j3mJ0j2J7rl
$$ 4 7 11 3 11 11 8 -8 17 16 10 4 7 10 11 -9 -8 15 10 13 -7 -9 5 -5 -10 -2 -11 5 -14 -6 7 7 -2 -8 -13 -7 2 -5 -13 4 -9 -13 -3 -15 2 -7 -10
7390a0LNj1oPPKmlRJpMQkj1NJ0PqnKMLmOmlqJ1J1j7rNk1L5nj0OPk0MnLLlnJ2J
$$ -10 -7 -2 -13 -19 -12 -5 -3 -7 -10 -1 0 -7 -3 5 3 -8 -3 7 14 6 1 3 7 10 6 12 8 5 -3 8 19 2 -7 -2 -23 12 7 -3 3 10 -10 -6 -11 -8 -5 -8 -13 -1 0
7439@plKRjj3LNjrjoJ5MrJ4%%j5PJ1lqJ5pNj0mP%MpJ0KmNJnJpkMllJjJ1nj1NP
$$ 0 -7 -10 -8 1 0 -13 -10 -5 -6 -15 -16 -22 -7 -3 -12 2 2 2 -13 -6 5 2 -6 9 2 7 -3 -7 0 0 4 -3 7 9 5 10 11 6 7 0 -2 2 -1 -4 -3 -4 7 2 -9 -4 3
7490Cj3J3j1J4nolJLqOj0OjjnMMopK0QnPj2JoJ0PoMj0pJ7jkj2J2Pnj3J6MrkKK
$$ 3 -10 3 -8 6 1 -5 -8 -7 -4 -12 -6 -16 -10 -11 -12 -17 -13 -9 -15 -22 -2 6 1 8 -4 -3 -9 1 8 2 6 -4 -11 6 5 3 -9 3 10 5 -8 8 12 3 1 3 5
7537E%j0J7rjRj3%MLj8J0MJ2k5J4kNrjjoLpNPj4J3nlMmJ5kPnoLmMKmlJ4j8%J3
$$ 5 5 -5 12 3 2 11 -2 -2 2 5 -13 -3 1 13 -12 2 0 5 -4 -5 -6 -12 -9 -16 -11 -4 -18 -5 -10 -13 -9 -13 2 0 7 2 -4 -1 -5 -1 1 -3 -6 8 -10 -10 3
7584Cj9J3kOJLkjPj1jNJlkpJ4j3MlrJ8Mj6jJ0JlMoPj0j%NLj5OOjj%kMJrJ4j1M
$$ 3 -16 -3 -5 1 2 5 3 2 9 -2 -3 2 3 0 -2 -9 5 -8 -4 -7 -16 2 6 -10 -11 -1 0 -3 1 -5 2 -8 -9 -9 -4 -1 -16 -10 -4 -5 -6 -6 -8 -4 -3 -12 2 -9 -5
7633eMpROj7J0J1j1JnLQMj0qK2krjNmKlp%KnkKKOqjJ3ojPj5JkKPLrlK0j1j7PL
$$ -5 -1 -8 1 7 -10 0 11 0 1 -4 -1 7 11 1 -7 15 13 4 3 8 4 6 3 -4 -4 -2 -7 -9 -7 -5 1 -7 -8 5 -1 -2 5 -10 -9 -11 -9 -2 1 -8 -11 9 -2 -19 -12 -9
7683iPJj4J2J3pj5K4jj7Pj0MJ6rj%MlKOj0J2qLPj2oPPmj6MnJ1%ljqOLj0kJ6j0
$$ -9 -2 -1 -15 -3 10 3 -12 12 11 -6 1 -9 -5 11 2 1 1 5 2 4 10 0 12 4 7 14 2 -4 3 10 6 -10 -6 -11 0 0 -3 -4 -12 -6 -3 -13 -15 1 -9
7728iPQrJpjJ1oqKPkLj0J0J5j0qOPj2J4qLjjmJ0nkpONkjJ3KqnLMomQNrnqJj2J9
$$ -9 -2 6 -3 -2 -9 -10 1 -5 -13 -11 -4 -6 -3 -13 -3 12 2 -6 0 7 -5 9 1 4 3 2 -2 8 3 1 -6 0 5 3 2 15 17 9 4 7 11 5 1 9 14 5 0 -8 -7 -19 0
7779@oj3J4KkljJ4k5JJ4kJ0j1Pnj0MNLOj3lJ3KPjnJ3j0j4J1lRj2j%J1Qj0JJ4j2
$$ 0 -6 -19 -5 -3 -5 -8 -9 5 -20 -19 -5 -7 3 -8 -1 -6 -16 -12 -7 -4 2 -11 -14 -1 1 8 7 2 15 5 -9 2 -1 8 -4 -5 -5 6 14 4 5 19 7
7822G%onJ0j7NOMlJOj5OnNJ1j8kPPokJmjKk2QJ5MJj1QlKjOj1QMRnlpOMNrqK4j6
$$ 7 7 1 -4 6 -11 -6 0 4 1 2 8 -7 -1 -6 -1 10 -8 -10 -3 4 -2 -4 -3 -7 -8 -6 -28 -20 -5 -1 0 -11 -3 -6 -4 -5 1 -10 -2 2 11 6 3 -4 2 6 11 2 -6 18 2
7873BJ6j4rJ6rLQmjpqOlnjJ2kJlNj4nNJ4o%j0OJNLj3QmoJKLlOJ%JmjnK4j2qJ1
$$ 2 18 4 -5 11 2 5 13 9 8 1 -7 -1 -4 -9 -10 2 0 1 -2 3 -11 -16 -11 3 -3 -3 -13 -7 -6 -1 2 -11 -3 -7 -13 -12 -10 -7 -10 -4 -3 -3 -2 -6 -7 -12 12 0 -8 3
7923CKoO%QlrJ5mojMJ0j2Nj2nK4roj3kJ9qloPKoJ0qNMJrOj4J2rKpMOp%LJMPj2
$$ 3 5 -1 5 5 13 10 1 16 12 6 5 9 19 7 12 0 -5 19 10 4 -9 -11 8 0 -3 -9 -2 0 -6 4 -4 1 5 6 -3 3 -11 1 -8 -6 -13 -9 -3 -10 -10 -7 -6 -2 5 -7
7973gkMjJ5j9qJ9j1KPLj1J0pJ0Kn%RNqkNJ1k1j9K3Jj0LPqLlmRklnKNklLrQqMJ7
$$ -7 -9 -5 -6 9 -10 -18 1 -10 -8 -1 2 -9 1 -6 4 6 1 1 10 15 7 5 10 21 0 -19 4 5 -5 -2 5 -3 0 -3 -7 2 0 -3 -8 -6 -1 -3 -6 -3 -12 -4 -12 -8 9
8022Ij5oNJ3mj9LMKK0j4Rj3J6j3NLj3OJ0mjoLNJOlMj5OmnQkNj1QJ0j5J0j3%Jp
$$ 9 -6 -12 -7 6 2 -17 -14 -10 -8 12 -2 7 -6 10 -3 2 5 -8 -2 8 4 3 -3 0 5 6 12 9 13 -2 4 0 -5 3 1 6 -5 3 13 -2 8 -5 -5 -4 -11
8067a1MLPqnJ4on%Qj6J0j7J3JJloJ5j1M%QKJ3poJ6qj6MMklJJ0%j0P%MpkLPNkj7
$$ -11 -7 -4 3 -5 -10 4 -2 -7 -7 1 -15 -5 -22 -9 -8 -7 -10 -16 -1 -12 -8 -8 0 2 15 8 2 18 10 -6 -2 2 0 -3 -2 8 8 -2 5 5 9 2 0 3 10 15 13 -4
8115dMMKJKj0NKj7QJ0orLNLklRrm%pKQj1J0j0kJ3LkLKJmLLqORmj5jR%j3J3KLk
$$ -4 0 4 6 7 9 -1 4 6 -11 -3 7 1 -8 -5 0 3 1 -2 7 -2 -6 -6 -13 -11 -3 -14 -4 -14 -16 -3 0 -2 1 3 4 0 3 6 -2 4 13 9 -6 -7 2 2 -11 2 4 7 5
8166EoQjKj1J2JqJKjJj2jOJNnOj2PmjOL
$$ 5 -1 7 6 8 -3 9 10 2 3 5 4 5 -7 -8 -2 -1 4 -1 5 -7 0 -4 -5 1 4
8191D
$$ Imaginary data points
##PAGE= N=2
##DATA TABLE= (X++(I..I)), XYDATA
0@%%%%%%%%%%%%%%%%qJ6j6J6j6J6k0K8l2L2m0M8m8N6o4P2q0Q8j02J12j23J37j52
$$ 0 0 0 0 0 0 0 0 0 0 0 0 0 0 0 0 0 -8 8 -8 8 -8 8 -12 16 -16 16 -24 24 -24 32 -32 40 -40 48 -54 58 -65 72 -80
39h0J70j90K10k32K57k84L14l50L91m36M88n50O23p11Q22r64J154j423J842k585
$$ -80 90 -100 110 -122 135 -149 165 -185 206 -230 258 -292 331 -380 442 -522 632 -791 1051 -1534
59a534M300j5428r919J4176o958k431k89k327m101Q074N412m453m850L423m18
$$ -1534 2766 -12662 -22581 -8405 -15363 -17794 -18083 -20410 -24511 -16437 -11025 -15478 -20328 -16905 -17323
74a7323k529K730M306k766j415K454p30l392L451N006j319l569J59L20Q11L086
$$ -17323 -19852 -17122 -12816 -15582 -16997 -14543 -15273 -18665 -15214 -10208 -11527 -15096 -14937 -14617 -13806 -10720
90a0720P37l578n33K853J59m07K736l52l968J595N287j402l775K696K605l249
$$ -10720 -9983 -13561 -14094 -11241 -11082 -11489 -8753 -9105 -13073 -11478 -6191 -7593 -11368 -8672 -6067 -9316
106i316o02L960l57k440L117J947m588p98N968Q45m324J174K871l220j167N698
$$ -9316 -9918 -5958 -6315 -8755 -5638 -3691 -8279 -9077 -3109 -2264 -6588 -5414 -2543 -5763 -6930 -1232
122a232J163n644l36M757l71k470K009J133k344R76K869k325k744L055K601k150
$$ -1232 -69 -5713 -6049 -1292 -1663 -4133 -2124 -991 -3335 -2359 510 -1815 -4559 -1504 1097 -1053
138a053o13J555j738j519L529K345k994j876J616M03j95J598k06k376P27K142
$$ -1053 -1666 -111 -1849 -3368 161 2506 -488 -2364 -748 -345 -540 1058 852 -1524 -797 1345
154A345j548j293K622O96k834J96K357j554j767K739J371l048p88K294l67j203
$$ 1345 -203 -1496 1126 1822 -1012 -816 1541 -13 -1780 959 2330 -718 -1506 788 421 -782
170g82J865K11l112M56L498j157l180J808K184k490j075K834j75k863J168K571
$$ -782 1083 1294 -1818 -1362 2136 979 -2201 -393 1791 -699 -1774 1060 885 -1978 -810 1761
186A761j783j874J774P46j447O63J021k044p64K778N13k757j62K041m79j124J181
$$ 1761 -22 -1896 -122 624 -823 -160 861 -1183 -1947 831 1344 -1413 -1575 466 -13 -1137 44
203D4L19j726J51J729l67j204K76J32k15J213L73k280p50K445Q79j709k61O80
$$ 44 363 -1363 -1212 517 150 -1054 -778 -646 -861 352 725 -1555 -2305 140 1019 -690 -951 -271
221b71j087j91K209L39k174l64J197k61L2J491o25k296P64K170j041j510J656
$$ -271 -1358 -1549 660 999 -1175 -1539 -342 -603 -571 920 295 -2001 -1237 933 -108 -1618 38
238C8R17k144n51K154K05j477N89R74j247o53J398L43r19K98L08j166m9J738J43
$$ 38 955 -1189 -1740 414 619 -858 -269 705 -542 -1195 203 546 -373 -75 233 -933 -982 756 899
257H99j515M0J068l35n44P99M62p51m36K07R7L34L70n53n77N38L48m97L41R22
$$ 899 -616 -576 492 157 -387 412 874 123 -313 -106 -9 325 695 142 -435 103 451 -46 295 1217
277A217o89j261O46J218l12o46N4l14k85Q98N31r29l73P35j43n60R04P31j356
$$ 1217 528 -733 -87 1131 819 173 227 -87 -372 526 1057 128 -245 490 347 -213 691 1422 66
296F6r57J294Q24j080m70P79p5p54L56O81l04l20K47j38k55M99K96o66l06N81
$$ 66 -891 403 1227 147 -323 456 381 -373 -17 664 360 40 287 149 -106 393 689 23 -283 298
316B98J6o17J68O70k09o67K2N53J58k66j99J36J51k18l14K64N15k09o50KM83M3
$$ 298 314 -303 -135 535 326 -341 -319 234 392 126 -73 63 214 -4 -318 -54 461 252 -398 -396 87 130
338A30k01J00M5l14j19K35J76R1j2m80m22N74O96m14o91K74M20m35j98O39K03
$$ 130 -71 29 74 -240 -359 -124 52 143 131 -349 -771 -197 499 85 -606 -332 88 -347 -545 94 297
359B97p42l36O37L63l36k29J43J01OJ0j02r8K30J40l09j82K97J20l26lN02L6o20
$$ 297 -445 -781 -144 219 -117 -346 -203 -102 -96 -86 -188 -286 -56 84 -225 -407 -110 10 -316 -319 183 219 -401
382d01k15O29M32m14m89J31K62j30q8K45Q0l36k60K33M03O9k73k59N7K54P5k07
$$ -401 -616 13 445 31 -458 -327 -65 -195 -283 -38 42 -294 -554 -321 82 151 -122 -381 -324 -70 5 -202
404b02j52J80O7l21j62M00K59m05k95M07K60m43k91M15L22l90m34J43K75l2j56
$$ -202 -354 -174 -107 -428 -590 -190 69 -336 -631 -224 36 -407 -698 -283 39 -351 -785 -642 -367 -399 -555
425e55qno4l1M0J20J91j49m65l7N01K08m60k81L08K10l01r8L67J74l82k97L27
$$ -555 -563 -568 -632 -663 -623 -503 -312 -461 -926 -963 -462 -254 -714 -995 -687 -477 -778 -876 -509 -335 -717 -1014 -687
448f87M05j80l63O3K51m5k08M4K01nj83j10J10J89kk45j43L08J98l60k83M07L38
$$ -687 -282 -462 -825 -762 -511 -556 -764 -720 -519 -524 -707 -817 -707 -518 -520 -765 -908 -600 -402 -762 -1045 -638 -300
471c00m62l38M37K96l81j71L75J25l45j01K61J73kj41j76J12L94J2l91mL95k6
$$ -300 -762 -1100 -663 -367 -748 -919 -544 -419 -764 -865 -604 -431 -433 -574 -750 -638 -244 -232 -623 -627 -232 -258
493b58l47J36M06j47l74J19L40M8j96j26J41K85m7l87N1N07k4n14N3N20m1l85
$$ -258 -605 -469 -63 -210 -584 -465 -125 -77 -273 -399 -258 27 -20 -407 -356 151 127 -387 -334 186 145 -240
515b40J48K77r8j23J33joK09j32k92L25M19m87m67O44M90p01m10O80K88n53p9
$$ -240 -92 185 87 -36 97 96 90 299 167 -125 200 619 132 -335 309 799 98 -312 368 656 103 24
537B4L81j36k25K44M9k41J09J08l39P7N47k52p40K85P83k99o60K06M12k02q7J42
$$ 24 405 269 44 288 337 96 205 313 -26 51 598 346 -394 -109 674 375 -285 -79 333 131 44 186
559A86j31r7K09j0k06K46P6n59MQ03r7r52J34Q69j49n91J73K04k51J55L05m51
$$ 186 55 -42 167 157 -49 197 273 -286 -282 521 424 -528 -394 475 326 -265 -92 112 -139 16 321 -130
581a30k89N02L9n48K78N08p01m91R97M79j074l77R67J74p33L5L35l15OM56l42
$$ -130 -419 83 122 -426 -148 360 -341 -832 165 644 -430 -807 160 334 -399 -364 -29 -344 -338 118 -224
602b24n56N31M03n93k5O59l80o96P11P27q52p29O48M37l87p7M7l62K23O37l72
$$ -224 -780 -249 154 -439 -464 195 -185 -881 -170 557 -295 -1024 -376 61 -326 -403 -356 -718 -495 142 -230
623b30o80N33N11o38j13P71l32r69N97R64o96q31N78M33l05J88J22p03K4J094
$$ -230 -910 -377 134 -504 -617 154 -178 -1147 -550 414 -282 -1113 -535 -102 -407 -219 -97 -800 -776 318
643C18j32j076K93Q14n83m60Q70O1j090K31J200k75r51L11M97k40K02K57q26l03
$$ 318 186 -890 -597 217 -366 -826 44 105 -985 -754 446 171 -780 -469 28 -212 -10 247 -579 -882
663h82J187K80j168o7R12k95n70P97L57j036r8J092j7q22J27L22k40L03M39q80
$$ -882 305 585 -583 -650 262 -33 -603 194 551 -485 -583 509 492 -330 -203 119 -121 182 621 -259
683b59n91J202O72j136m25Q63l3n65O77M25j067m00J044K27o39J00Q7n21M03R43
$$ -259 -850 352 1024 -112 -537 326 293 -272 405 830 -237 -637 407 634 -5 95 182 -339 64 1007
703A007p42j127R03R91r15o16Q46O9p75M43O69q44n68R14L32o61M5K34o11J35
$$ 1007 265 -862 41 1032 117 -499 347 416 -359 84 753 -91 -659 255 587 -74 -29 205 -406 -271
723b71J120m15j437M70J353m73q97M68K04o46L74P98o74p82O36M28m36J48K49
$$ -271 849 434 -1003 -533 820 347 -550 -82 122 -524 -150 648 -26 -808 -172 256 -180 -32 217
742B17q30j43J269J07j405m8J227j08p95L07K27n50K69P62n68p88N52M30m29K03
$$ 217 -613 -756 513 620 -785 -833 394 286 -509 -202 25 -525 -256 506 -62 -850 -298 132 -297 -94
762i4L68r19m85J360N89j330n25R88J09n54L73K45p57JQ69k55p43M74M51o27K1
$$ -94 274 -645 -1130 230 819 -511 -1036 -48 61 -493 -120 125 -632 -631 238 -17 -760 -286 165 -462 -441
783d41P30m91q21Q96R10j016q24P91M81m43N7J59n97k0Q54p3p50K56M23m71j7
$$ -441 289 -202 -1023 -127 783 -233 -1057 -266 215 -228 -171 -12 -609 -629 225 152 -598 -342 81 -390 -407
804d07P54l58r60N50J012n80q17M02L84k06K39J30p18j10R55J23p94J23M92n28
$$ -407 347 -11 -971 -421 591 11 -806 -404 -20 -226 13 143 -575 -685 270 393 -401 -278 214 -314
824c14k06R22J4j081R2J018j74o78K55L05k46K00K91o15k92Q14K82p92q5N39k90
$$ -314 -520 402 416 -665 -573 445 271 -407 -152 153 -93 107 398 -217 -509 305 587 -205 -290 249 -41
845d1l39P13K81q97k60Q03K09m54K2Q1k88K27M12m75m33O47L42o86j47O23q1m39
$$ -41 -380 333 614 -283 -543 260 469 15 37 118 -170 57 469 -6 -439 208 550 -136 -283 340 259 -180
867a80M36L48o58l00O30K49l77m6k2k90K96N98l93o95M21N84m09k95M55k6n15
$$ -180 256 604 -54 -354 276 525 148 102 80 -210 86 684 291 -404 17 601 192 -103 352 326 -189
888a89K41M99l36m43K73K22j37J08j7m01Q5O28j42o41J84N00k79l31L42J44l99
$$ -189 52 551 215 -228 45 267 130 238 221 -180 -95 533 391 -250 -66 434 155 -176 166 310 -89
909h9J1L56j48k71J95J04j60J35N9m38l8O22P4o69r0M85k9k80K10J50l43j26K81
$$ -89 -78 278 130 -141 54 158 -2 133 192 -246 -284 338 412 -257 -347 138 109 -171 39 189 -154 -280 1
932AO0j11Q8p7k43J64K97k23k40L52J49m87j46M98J50l33q9P1o2M5J99n3j68N1
$$ 1 61 -50 38 -39 -282 -118 179 -44 -284 68 217 -270 -416 82 232 -101 -190 -119 -181 -136 63 10 -158 -107
956a07k3j52K09L10k67m24K24L36j90k11J99J17k08q5J19M5K9N8j49j54J83J29
$$ -107 -130 -282 -73 237 -30 -454 -230 106 -84 -295 -96 21 -187 -272 -153 -108 -79 -21 -170 -324 -141 -12
978a2j96j5K60j15l62J21M01k7l19l5J44L5orm5J1M7r4o6J80J13k49j27K35J22
$$ -12 -208 -223 37 -78 -440 -319 82 55 -264 -299 -155 -120 -126 -135 -180 -169 -122 -216 -282 -102 11 -238 -365 -130 -8
1003hk17p7K00P3j68q3R0J01J1r3q7Q9J42j02j78J46J80j27j81J19J69j11j39
$$ -8 -225 -302 -102 -29 -197 -280 -190 -89 -78 -171 -258 -169 -27 -129 -307 -161 19 -108 -289 -170 -1 -112 -251
1026b51Q5J62l1j55m2J33J26q1j69RJ85Qj66K4J74k3k22L9K33L4j91q0J31J07
$$ -251 -166 -4 -35 -190 -232 -99 27 -54 -223 -214 -29 -21 -187 -163 11 -12 -234 -195 38 72 -119 -199 -68 39
1050C9o8j18K0J27oj34k0J77M7j77o6J63J02j21j30R1J64p3j58OJ69L1j57o1J51
$$ 39 -29 -147 -127 0 -6 -140 -160 17 64 -113 -179 -16 86 -35 -165 -74 90 17 -141 -135 34 65 -92 -153 -2
1075bR0j14r6J26J00j28j30J07J77o5j84l6J61R9j00j26P8R8p4r0J07J24j09j91
$$ -2 88 -26 -122 4 104 -24 -154 -47 130 65 -119 -155 6 105 5 -121 -43 55 -19 -109 -2 122 13 -178
1099a78L1K28M4j97r6J32Q9q0q6J08R4j05j48O8J97j9j96l3J39O9j25m5J14Q8
$$ -178 -147 81 125 -72 -168 -36 53 -27 -113 -5 89 -16 -164 -96 101 82 -114 -147 -8 61 -64 -109 5 93
1123I3j17j35P4J82j4j79m2J55N4j44n2J59P3j77j11J59J42r8j40K9J08kr6j8
$$ 93 -24 -159 -85 97 83 -96 -138 17 71 -73 -125 34 107 -70 -181 -22 120 22 -118 -89 19 17 -79 -97
1147i7J07O2j01j43J31J87p5k25L6K11l5j81M0J60l3j59J9J69N2j26j03P4J52
$$ -97 10 72 -29 -172 -41 146 71 -154 -118 93 58 -123 -83 77 44 -115 -96 73 125 -1 -104 -30 122
1170A22qj70n0J74M4j86l8K06L7j96l5J54R7r3r1L5Q6L2j22q0J76R7j93j41K20
$$ 122 114 -56 -106 68 112 -74 -112 94 131 -65 -100 54 151 58 -33 2 88 120 -2 -82 94 191 -2 -143 77
1195G7J96j90j55J71J39j29q0J11L3q4k3jJ6J10l6j89N5K46n3k90Q6L10j02k66
$$ 77 273 83 -72 99 238 109 29 140 173 89 66 65 81 191 155 -34 21 267 214 -76 10 320 218 -48
1219d8N7K00n5j07M3K6m0K0J4j6J01Qk19k3L09R1l60q7K84Q5k27oJ45m5n8P8p
$$ -48 9 209 154 47 90 116 76 96 110 94 195 203 -16 -39 270 361 1 -86 198 283 56 50 195 150 92 170 163
1246A63l1Q1m6j27J46J83k48k17L11K48l31k23K72J63j86m3J12o9l6J05k5j18
$$ 163 132 213 167 40 186 369 121 -96 215 463 132 -91 181 344 158 115 227 158 122 227 202 84
1268H4J26O1k32L9L20j20l42J72L59k07l23J88K23j28p1O4r3%J91l7k28J14J68
$$ 84 210 271 39 78 398 278 -64 108 467 260 -63 125 348 220 149 213 120 120 311 274 46 160 328
1291C28k39o5L45lm42L2M39o6l43P0J91p6j5P1j57n9K76L4l37N7K87j76k06L42
$$ 328 89 24 369 366 -76 -44 395 329 -14 56 247 171 156 227 70 11 287 321 -16 41 328 152 -54 288
1315B88J28m56j18M69J09l48n1J21m4P3J47k03k03K88J46l32j5L23j31l51K76
$$ 288 416 -40 -158 311 420 72 21 142 98 171 318 115 -88 200 346 14 -1 322 191 -160 116
1336A16K94l66k25L44J63k64m7Q8j05J08K35k35l50L03L14l27j91L58k3l68J77
$$ 116 410 44 -181 163 326 62 15 103 -2 106 341 106 -244 59 373 46 -145 213 190 -178 -1
1357aL83k66l44K84J89j72l5Q2k07L8L93j52m96J96M58k32l11K96R9l64O8M43
$$ -1 382 116 -228 56 245 73 38 120 -87 -49 344 192 -304 -108 350 118 -193 103 202 -162 -94 349
1379C49j78l98J69K32j34J5O9k76o1M83N0n40k5M82n8l20J87J67l51m8M02m1l45
$$ 349 171 -227 -58 174 40 55 124 -152 -213 270 320 -220 -245 237 179 -141 46 213 -138 -186 216 175 -170
1402a70P8J80j43P5J67k93j95M72K05n34j66M63N5l51J15J91k92q4L87Ll35P1
$$ -170 -92 88 -55 20 187 -106 -301 171 376 -158 -324 139 194 -157 -42 149 -143 -227 160 163 -172 -101
1424a01J57j62Q1K78k88l85M11M09m47l43L86J69k97O3K13k73j32L76O5l38M6
$$ -101 56 -106 -25 253 -35 -420 -9 400 -47 -390 -4 165 -132 -69 144 -129 -261 115 180 -158 -112
1445a12J63j96J0L72j52n22K24N33k23m35K51K04k12NK25k17j90K85J21k72RJ90
$$ -112 51 -145 -135 237 85 -437 -213 320 97 -338 -87 117 -95 -90 135 -82 -272 13 134 -138 -129 61
1467F1k05p6L80J4n12K4N10m0l75P9J72j40K7K00j91k04K78J39k83%K51j89j98
$$ 61 -144 -220 160 174 -338 -314 196 156 -219 -140 32 -108 -81 119 -72 -276 2 141 -142 -142 109 -80 -278
1490b78L99J45m98j26M90Q4l44qJ50j36M5K65j83k80K39K07k46o5K77j37k99K88
$$ -278 121 266 -232 -358 132 216 -128 -136 14 -122 -77 188 5 -275 -36 171 -75 -140 137 0 -299 -11
1512a1L18l43k85K97K10k31l5J00j35JK77r9l03J74K30k28j09K88j4l43J23L43
$$ -11 307 -36 -321 -24 186 -45 -80 20 -115 -114 163 64 -239 -65 165 -63 -172 116 102 -241 -118 225
1534B25j78k90J84J66j20k6N8j37J2K75o0l32J02K93j35k07K23Q6l12K8L35o7
$$ 225 47 -243 -59 107 -13 -39 19 -118 -106 169 109 -223 -121 172 37 -170 53 139 -173 -145 190 123
1556A23k77O4J31n1K2Q2k09o0L08M0l40kL06o7k27J60J34k29q2K64L8k12OQ2n8
$$ 123 -154 -90 41 -10 12 94 -115 -175 133 173 -167 -169 137 70 -157 3 137 -92 -174 90 128 -84 -78 4 -54
1581e4P5J19j93j70K48J75k75r4K46J3k15O7J71j19j25J23O0r5OM4r2P3J39j29
$$ -54 21 140 -53 -223 25 200 -75 -169 77 90 -125 -58 113 -6 -131 -8 52 -43 -37 7 -85 -12 127 -2
1605bj99J86J93j90j70J79R9j58jJ30p6o5Q8K5o6L7K9j28K4K12o6k56Q3K46r1
$$ -2 -201 -15 178 -12 -182 -3 96 -62 -63 67 -9 -74 14 39 -27 10 39 -89 -65 147 81 -175 -92 154 63
1630F3k08J02J18r1m6Q5jn7L3Mo3P6N5j42l4J88L4k34qK16K1j75JJ03k2k3J9l4
$$ 63 -145 -43 75 -16 -62 23 22 -35 -2 2 -61 15 70 -72 -106 82 116 -118 -126 90 111 -64 -63 40 18 -5 14 -20
1658b0jN5l1p3Q6J12j48j15J60J17j52q7J44M4r9l3O3KROo0kR6j5j10K8J48o0
$$ -20 -21 34 3 -70 16 128 -20 -135 25 142 -10 -97 47 91 -8 -41 22 24 33 39 -21 -23 73 58 -52 -24 124 64
1686F4j55P4J55p9j41P2J06l9p1KL9L0Jp4k2J18K6j15m5J38Mj29mJ45j1j16k2
$$ 64 -91 -17 138 59 -82 -10 96 57 -14 -12 27 57 58 -16 -38 80 106 -9 -54 84 88 -41 -45 100 89 -27 -49
1713d9R2L4m0o3j1R1M3r5p7J16N3r8o2J11L6r4m0Q0O1q1o4K7O1M1o1o9L1R3k8
$$ -49 43 77 37 -26 -37 54 97 2 -75 41 94 -4 -66 45 81 -13 -53 27 88 7 -57 -30 31 72 11 -58 -27 66 38
1742C8r9N3R9q2j07O5J24m5j20MQ8K3n0l8L2M7k9p1M2Q6l0j23PJ30J1j10l4J04
$$ 38 -61 -8 91 9 -98 -33 91 46 -74 -70 18 41 -9 -47 -15 32 3 -68 -26 60 30 -93 -86 44 55 -55 -89 15
1770A5K7n9l5M1O4l8o9%Q8L2j23l3J38K9j30l6J03O6q0o2L7O3k3n6MN3J8p0m4
$$ 15 42 -17 -52 -11 53 15 -54 -54 34 66 -57 -90 48 77 -53 -89 14 80 0 -62 -25 38 15 -41 -37 16 34 -36 -80
1799h0R6O7p4j08P4J24o7j11M8J02n3p2L0O6Mo7l8O0Q0k8j16QJ21pj05J0J04k5
$$ -80 16 83 9 -99 -25 99 32 -79 -31 71 18 -54 -24 42 46 -21 -59 1 81 53 -63 -55 66 59 -46 -36 68 43
1827D3r7J4R9J8q4o3N0R2Jj12k5J10M0r9m9J18L4j24k7J15L2j01m2O7M7j6o3j7
$$ 43 -54 -40 59 77 -7 -70 -20 72 73 -39 -64 46 86 -13 -62 56 90 -34 -61 54 86 -15 -57 10 57 41 -22 -39
1855c9N9M0m7q5O1R9o3j08Q1J06q1j14R1Q0m9p2OM8L4l5o0K6P6j3j11J4J43j2
$$ -39 20 60 13 -72 -11 88 25 -83 -2 104 23 -91 0 80 31 -41 -35 13 47 12 -48 -22 54 41 -70 -56 87 75
1883G5j71K5J27j2r8KO1ok3j4J1K6J4p6l8J27O1j55p0J55P9j41n5J00J9p9K2N1
$$ 75 -96 -71 56 44 -54 -52 9 3 -20 -34 -23 3 17 -59 -97 30 91 -64 -134 21 100 -41 -96 4 23 -56 -34 17
1911A7l1k9jj8M9Q5r0j28Q7J61r1j45O6J26r8m9P5L5p6j0N4llJ2p1J0J24Pj88
$$ 17 -14 -43 -44 -62 -13 72 -18 -146 -59 102 11 -134 -68 58 -40 -89 -14 21 -55 -65 -11 -14 -17 -5 -76 -66 58 65 -123
1940a23J3K01l2j70M4J16m7p3N1M8n8OL8n1L4P1j06p3J51P9j81o6K03N7k02l3
$$ -123 -110 91 59 -111 -67 49 2 -71 -20 28 -30 -24 14 -37 -3 68 -38 -111 40 119 -62 -128 75 132 -70 -103
1966a03J70j3q5M5Rn3M2N1q1l2J09l3j15J05J30j43j53J73J42j51j05J05K2l2
$$ -103 67 54 -31 14 23 -30 12 63 -18 -50 59 26 -89 16 146 3 -150 23 165 14 -91 14 36 4
1990DN3k1r8N5R1q0l2J18k9j48O2K08j07k05J16J28p4q4O4k2oQ3pj43N0J41q8
$$ 4 57 36 -62 -7 84 4 -28 90 61 -87 -25 183 76 -129 -13 115 41 -43 21 -1 -7 76 69 -74 -24 117 29
2017B9j01J43M0k05nK47j5k47L6J68k9q7O2k6n1R8L3j58oJ88m8j77R5J17j45p8
$$ 29 -72 71 111 -94 -99 148 133 -114 -78 90 61 -26 36 10 -41 57 90 -68 -74 114 66 -111 -16 101 -44 -122
2043a22J90N0j92k6J38J5n2J7o6l6J45P6j94p7J87K5j54O4J22j40j03J83P7j57
$$ -122 68 118 -74 -100 38 53 1 18 -48 -84 61 137 -57 -134 53 78 -76 -12 110 -30 -133 50 127 -30
2067c0m5Q8jJ1O9r8j40J45J93j65j70J73Q4j81J5J79j02j69J26J39j12o0N8k1
$$ -30 -75 13 12 23 92 -6 -146 -1 192 27 -143 30 114 -67 -52 127 25 -144 -18 121 9 -51 7 -14
2091a4j2J25k9k11Q0K18r7j85J02J27j34m1J42k2j37N6J12r0k0N9n4k5J42Qk29
$$ -14 -26 99 70 -141 -61 157 60 -125 -23 104 -30 -71 71 49 -88 -32 80 -10 -30 29 -25 -50 92 100 -129
2116a29K3K61l5k32M3J63q4m2J04k7j32Q3R7r2l7Q1o1q1J87P3k51q9K55P3k05
$$ -129 -106 155 120 -112 -69 94 10 -32 72 45 -87 -4 93 1 -36 45 -16 -97 90 163 -88 -177 78 151 -54
2141e4k6J40n2n9J25jj50K2J21o2m3J12o2j54J48J71j80j60J65J31j49m3R7k3
$$ -54 -80 60 8 -51 74 73 -77 -55 66 4 -39 73 11 -143 5 176 -4 -164 1 132 -17 -60 37 14
2165A4n3P7kj07L2J05o9m0R6Kj70P4J93r7j84P8J47o8o2N5k7k7J01K1j43J1J39
$$ 14 -39 38 36 -71 -39 66 -3 -43 53 55 -115 -41 152 55 -129 -51 96 28 -34 21 -6 -33 68 89 -54 -43 96
2192I6o2r1J23L3j91K1K10k9k02M9J38k7o7L1l3m7J13N4j32l2J26k5j13R1R2j58
$$ 96 34 -57 66 99 -92 -71 139 110 -92 -43 95 68 1 32 -1 -48 65 119 -13 -45 81 56 -57 34 126 -32
2218c2o9J76N0j42m2R9Rk2K9n4m5J04O1j20o6J38J0j29N8J11r9j22J27J00j02
$$ -32 -101 75 125 -17 -59 40 49 27 56 2 -43 61 122 2 -64 74 84 -45 13 124 25 -97 30 130 28
2243B8n4N1j1J4P8q1r4R2J03r6r3J27L6j39J0J31l8j25N6Q9m7m1J6j1oQ1l3j23
$$ 28 -26 25 14 28 106 25 -69 23 126 30 -63 64 100 -39 -29 102 64 -61 -5 84 37 -4 12 1 -5 76 43 -80
2271h0N7J33p9j22R6P5q3n7Q8J8r2PO9j3k8J0l3OJ00j9j46L6J30k4j38M4R6n5
$$ -80 -23 110 31 -91 5 80 -3 -60 28 46 -46 -39 30 17 -11 -1 -34 -28 72 53 -93 -57 73 49 -89 -45 51 -4
2299dn0O2K7o9nL1kRJ1p0l7J06O3j36o2J45N2j23k2Q9lo9K8M2k4j5Ol4M1M3o1
$$ -4 -54 8 35 -34 -39 -8 -10 -1 10 -60 -97 9 72 -64 -126 19 71 -52 -74 15 12 -57 -29 13 -11 -26 -20 -54 -13 30 -31
2330c1p1P6R6q8r5R8P1r1n1N9M6m2k9K3jJ8jn2RP1pr2L9Q9l4j02M2Q6j1q0J3M2
$$ -31 -102 -26 70 -18 -113 -15 56 -35 -86 -27 19 -23 -52 -29 -30 -12 -13 -65 -56 15 8 -84 -45 44 10 -92 -50 36 25 -55 -42 0
2362@Nnk8PL0Qn1pP8J8j00j7J00K7j03k1P3K8m7k2K1K3lk8rL0M4m9n2O0M7o2n8
$$ 0 5 0 -28 -21 9 17 -34 -41 37 55 -45 -62 38 65 -38 -59 14 42 -5 -27 -6 17 14 -14 -23 7 51 2 -50 10 57 -5 -63
2395f3O6N7n3o0L0O2j7k7j7L0K5k6m5J8P6l1q9M5P0j4p4J9P2k9m3jM2K1l4l8J2
$$ -63 3 60 7 -53 -23 39 22 -5 -22 8 33 7 -38 -20 56 25 -64 -19 51 37 -37 -18 54 25 -18 -19 23 44 10 -28 -16
2426a6N9qo9j4R5rn8k9P7J3o3j5M4N1n2l8J5M2J1n8j8O2K4p0k3M9M5m4p4O2N0
$$ -16 43 35 -34 -48 47 38 -20 -49 28 41 -22 -37 7 58 6 -32 -17 25 36 -22 -40 22 46 -24 -47 2 47 3 -71 -9 41
2457D1l6m7K9L5No5J0K6L7m5l7L3N1j4p6L4N0ko3J7M8km5k5M4K6k0m0K0L9%o1
$$ 41 5 -42 -13 22 27 -38 -28 -2 35 -10 -47 -14 37 23 -53 -19 31 29 -34 -17 31 29 -16 -41 3 29 9 -31 -11 28 28 -33
2489c3NO5Jn6k1O0J7n6k3L8L0k9l8J7M4Mn2j2N5J4n1k7O5K8n7n1N4M7l2m0JM1
$$ -33 -28 37 38 -18 -39 21 38 -18 -41 -3 27 -2 -40 -23 21 25 -27 -39 16 30 -21 -48 17 45 -12 -63 -9 38 6 -34 -33 8
2521HK0n2qL7L6m5m4L1N3k4n9K6P5m8n2L4L3Nm0k2K9L5j1m9K7L8lo4MQ0qo6lO3
$$ 8 28 -24 -32 5 41 -4 -48 -17 36 12 -47 -21 54 6 -46 -12 21 26 -14 -36 -7 28 17 -32 -5 33 30 -34 -30 50 42 -24 -27 36
2555C6jn3rK6L6k7l9KN5J3n8l6P0L7p9j7O5J9m8j5M6J3k3l0mM6J9m3m6N5M7l6
$$ 36 35 -18 -27 -1 35 8 -31 -29 26 39 -19 -55 15 52 -27 -44 21 40 -8 -23 23 36 13 -17 -21 25 44 1 -45 10 57 21
2587B1o4L8P2n1l4K8M8l8m3L3K6qk4rJ4K6J8q0lQ9mp0%O7j0o5K7M8l9j5mK6J2
$$ 21 -43 -5 67 16 -18 10 58 20 -23 10 36 28 4 -5 9 35 53 -27 -30 59 55 -15 -15 52 42 -23 4 52 13 -2 -6 20 32
2620C2Lm7j3N2M3p8m4P6M2o0m0O1J9m7pJ3MJ2mj0J4J5k4l8L9P3o6p3O6P4n5m9
$$ 32 35 -12 -25 27 70 -8 -52 24 66 6 -34 27 46 -1 -8 5 9 21 17 7 21 36 12 -26 13 86 20 -53 13 87 32 -17
2652a7K5K8k0mJ2j1QJ4k6j8N7j0q1K5R5j5j08K0Q7po7LJ3RJ1Jm7J6L8l1l9N7L9
$$ -17 8 36 16 12 24 13 21 35 9 -9 48 38 -43 -18 77 62 -46 -26 61 54 -13 -10 3 12 23 24 -23 -7 31 0 -39 18 57
2685E7q7m3J14J6r2l3Q9K5n0j4J5k3M4Qm8j6O1j7n3M6O3o0p9Q4N3p3m2N1L2l1
$$ 57 -30 -73 41 57 -35 -68 21 46 -4 -18 -3 -26 18 26 -22 -38 23 6 -47 -1 62 2 -77 7 60 -13 -55 -4 28 -3
2715cPk4k0O2K7p3k5P6Qq1J8R2o5q3O9Q0n8n2K4L7j7L9l3n9N2O6n2p6N8O6p4k4
$$ -3 4 -20 -40 22 49 -24 -49 27 35 -46 -28 64 -1 -84 -15 65 7 -45 -21 16 -1 38 5 -54 -2 64 12 -64 -6 60 -14 -38
2747c8Q8j8j02K0J05j8o1%J2RM2qn7qR5k2q3L6N6n3l9Q5J3q2LO0Nl8oj9jP3J9
$$ -38 50 32 -70 -50 55 37 -24 -24 -12 -3 39 31 -26 -34 61 39 -44 -8 48 -5 -44 41 54 -28 -25 35 40 2 -4 -23 -24 49 68
2780F8j06k2J23%j03MQ7m3n0O5K0o6k0N2mk0L5l4l6O8N8q7p8J11O3r2m4Q0j2m4
$$ 68 -38 -60 63 63 -40 -36 51 8 -42 23 43 -23 -43 9 5 -15 20 -14 -50 18 76 -11 -89 22 85 -7 -51 29 17 -27
2810b7K9L1m6l2N0j3ML6k4q0O0R7o4r3N7Q4o0n1M2J2m5K8M0n3%K6j7rN9j4j01
$$ -27 2 33 -13 -45 5 -8 -4 32 8 -72 -12 85 21 -72 -15 69 9 -42 0 12 -33 -5 35 -18 -18 8 -9 -18 41 27 -74
2841g4J2J39k9j25K3R9k7m7K7Rk6QL8l6pL5k6l5N7M0r6l1J08L7j12qO6J3l9jp
$$ -74 -62 77 48 -77 -54 45 18 -29 -2 7 -19 -11 27 -9 -16 19 -7 -42 15 55 -41 -72 36 73 -39 -47 19 32 -7 -8 -15
2872a5j6M2K1n7%N1j2n2M7O7r0n7P2P1o9o0O4J8j2jj6k8L4M5n2k4O1Pq7L0Q2l5
$$ -15 -31 11 32 -25 -25 26 14 -38 9 76 -14 -71 1 72 3 -57 7 25 13 12 -4 -32 2 47 -5 -29 32 39 -48 -18 64 29
2904B9j03N5O8l5o3L4J7%K9k2m8K6N2k9m6M1M6p7pP4%q3RO3Ml2k1J2NL9k8m6L0
$$ 29 -74 -19 49 14 -49 -15 2 2 31 9 -39 -13 39 10 -36 5 51 -26 -33 41 41 -42 -33 30 34 2 -19 -7 -2 37 9 -37 -7
2937gN1j0o9K8O1n4l5O0J8n7k2M4J1kpj9JM7Rq0j2Q5Qq6J9O8k6n8L0M6l2m0J8
$$ -7 44 34 -35 -7 54 0 -35 25 43 -14 -36 8 19 17 10 -9 -8 39 48 -32 -44 41 49 -37 -18 50 24 -34 -4 42 10 -30 -12
2970a2J7J5Pm7k5N8M2q0k7Q0K2o6j8O2j0l8ML0%k7PqK9J8l3l7M5N7n6o0O6L5m1
$$ -12 5 20 27 -20 -45 13 55 -25 -52 28 50 -16 -34 28 18 -20 -16 14 14 -13 -6 -14 15 33 0 -37 8 65 9 -51 15 50 9
3003Il5K9L3l7j4J6J8j7oj4J7K8pn4J2O6j1q0K5N7j2m2jM1%k1qRJ9%l3j2O2j8
$$ 9 -26 3 36 -1 -15 1 19 2 -4 -18 -1 27 20 -34 -22 44 33 -47 -22 35 23 -19 -20 21 21 0 -8 1 20 20 -13 -25 37 19
3037A9l5k5P1J3n9j8L7K7k6j2%K7rk2rL5K1m6j7M0K9m0m6N7L7m3l7K4L1mk9KJ7
$$ 19 -16 -41 30 43 -16 -34 3 30 4 -8 -8 19 10 -12 -21 14 35 -11 -28 12 41 1 -45 12 49 6 -31 -7 24 20 -9 -7 10
3070A0J4k0k9K5L4k0m9J5N1rm8QM8j1m1j2M6J7l9k5J4M2Jm2j0M8J3m8k0N3J5l7
$$ 10 24 4 -25 0 34 14 -35 -20 31 22 -26 -18 30 19 -22 -34 12 29 -10 -35 -21 21 22 -20 -30 18 31 -17 -37 16 31 -6
3102fk4L5K1l2j3J7K3mk9nK6K2l3k1L8L3n3j0L1K3l2k2K1J3J5l2j1J2L8l1k9K0
$$ -6 -30 5 26 -6 -19 -2 21 17 -12 -17 9 31 -2 -23 15 48 -5 -15 16 39 7 -15 6 19 34 2 -9 3 41 10 -19 1
3134AL4j8m9K0M9rn7J6L6%l9KK7Rqk3kL6qm0J2L6jk9j4L0K1l4qK1J1j4k4JL9M
$$ 1 35 17 -32 -12 37 28 -29 -13 23 23 -16 -14 13 22 14 -9 -11 25 17 -23 -11 25 24 -5 -19 11 32 -2 -10 11 22 8 -16 -15 24 28
3170B8m2MK0J7l2j7L0K1k4k5K2K2j0k5MK6jk4j1K1J4j8j9OM1j9l9J9L4qm5NL3
$$ 28 -14 -10 10 27 -5 -22 8 29 5 -20 2 24 14 -11 -7 19 18 -6 -17 4 18 0 -19 -13 28 9 -30 -11 23 15 -30 -25 8
3203Hrj7pJ3K1pk2JJ8Rl6%M1ol5qM4J2m1lJ4L2j8k8KL7oj5j5K9J7l5j6J2K8j8
$$ 8 -1 -18 -25 -12 9 2 -20 -19 -1 8 -28 -28 13 7 -28 -36 8 20 -21 -24 -10 22 4 -24 -22 15 9 -6 -21 8 25 -10 -26 -14 14 -4
3239dk7K5J8Km9J2K8J2j9k1K0K8j9m4L2L0rl7RM1l0k3K5J8j5j5oJ0L7j4l7pN3
$$ -4 -31 -6 12 14 -35 -23 5 17 -2 -23 -3 25 6 -38 -6 24 15 -22 -13 28 -2 -25 0 18 3 -12 -18 -8 29 15 -22 -29 24
3272B4ml7j1M3jm7K0L1pk9kK4K2ok9kJ3L0l0l5L8L5m0k5K8K5m1mJ7J2j3nMJK5
$$ 24 20 -17 -28 15 14 -33 -13 18 11 -18 -20 4 26 20 -9 -11 2 32 2 -33 5 40 0 -25 3 28 -13 -17 0 12 -1 -6 -2 -1 24
3307B4j6k6RL8j3n8K7N3l5l3OM4l0j5K7kn%nj2K4J0l8rO1Ln8%N3ok9j5L5nj5M
$$ 24 8 -18 -9 29 16 -42 -15 38 3 -30 -24 20 -10 -25 2 0 -5 -5 -10 -22 2 12 -26 -35 26 29 -29 -29 24 18 -11 -26 9 4 -11 -7
3343gN%J6rj5K2K6m3k2M1L2n1k8L7J8k6j8K0kK1lk2nK2nl6K0N0l0n9L2O0l9m3
$$ -7 -2 -2 14 5 -10 12 38 -5 -27 14 46 -5 -33 4 22 -4 -22 -2 -4 17 14 -8 -13 9 4 -32 -12 38 8 -51 -19 41 2 -41
3377d1K5K4j4J0%j5J9Nj2j7K6J0m2qO5j0n9PO5j4m6PL1mQj4k4K0K1j1l7L6L3m6
$$ -41 -16 8 -6 4 4 -11 8 13 1 -16 10 20 -22 -30 35 25 -34 -27 38 24 -22 -15 16 12 20 6 -18 2 23 12 -25 11 44 -2
3411bk3M6J5m6oN1Qm3lJ1LQjm1JN8pm6NM1j4m4M4K6m7l0M2J2j4JqqK8J7m9k6N5
$$ -2 -25 21 36 -10 -16 35 43 0 -3 8 11 19 18 -23 -22 36 29 -17 -12 29 15 -29 15 41 -6 -36 6 18 4 5 -3 -11 17 34 -15 -41 14
3448A4L6o4j5N4j2m2J6M5k9k5RL1lj0j1k4L7K9l3m4L1N5o3j7M7J2m1kM8l3qJ1
$$ 14 50 -14 -29 25 13 -29 -13 32 3 -22 -13 18 15 5 -6 -30 7 36 3 -41 -10 45 -18 -35 12 24 -17 -19 29 -4 -12 -1
3480aj2J1J4j5l4J9N9j7p0J9M2rm8L3J7k4j7K7Rk6J1jj0L4J7p2MO7J5p8JO0lm3
$$ -1 -13 -2 12 -3 -37 -18 41 24 -46 -27 15 6 -42 -9 8 -16 -33 -6 3 -23 -12 -13 -23 11 28 -44 -40 27 42 -36 -35 25 22 -21
3514b1J3J1poK5momlj8M1K4n3l4N7M4n7m0N3J7k1j3J1qLK0k8J3Lol4L6L3j9p6
$$ -21 -8 3 -4 -10 15 11 5 1 -2 -20 21 45 -8 -42 15 59 2 -38 15 32 11 -2 9 1 4 24 -4 9 12 6 -28 8 41 22 -54
3549e4N8N8l8n4K1K8j5j2K1j5oL1ml2L8Ln7lO9j1n9MO1kn0lM5j4mJ2k5RK3qk9
$$ -54 4 62 24 -30 -9 19 4 -8 13 -2 -8 23 19 -13 25 28 -29 -32 37 26 -33 -29 32 30 -20 -23 22 8 4 16 -9 0 23 15 -14
3584a4K7J3m5pN1K0n8j0M2J7m5pJ6OjJ2k4j6M2om7J8M4l5k8M5K4m6k3L3K4j2j3
$$ -14 13 26 -19 -26 25 45 -13 -23 19 36 -9 -16 0 6 5 17 -7 -23 19 13 -34 -16 28 -7 -35 10 34 -12 -35 -2 22 10 -3
3617ck0LK8Lk3k8N4J1m6j1N2Mo3J5N7k0l6J7J7Ppk0j2L3J1k2k9K6L4l3k1L9J4
$$ -3 -23 -20 8 11 -12 -40 14 25 -21 -32 20 24 -39 -24 33 13 -23 -6 11 18 11 -9 -21 12 23 1 -28 -2 32 -1 -22 17 31
3650C1m4j1M7mk6rJ3J0Qkl5PL8k0m1M7L2m4k6K5L3k4k2K1J1j4Lj3MK0jm7J2N1
$$ 31 -13 -24 23 19 -7 -16 -3 7 15 13 -22 -15 23 3 -38 9 41 -3 -29 -4 29 5 -17 4 15 1 4 -9 -5 15 14 -33 -21 30
3684C0j0m5J3M5k0l7J6K2nl3J2L1jrqj0K3J7l2j9L5K3m6j8K7K9l5qK0Kj1j7J3
$$ 30 20 -25 -12 33 13 -24 -8 14 9 -24 -12 19 18 9 1 -9 14 31 -1 -20 15 38 -8 -26 1 30 -5 -13 7 9 -2 -19 -6
3717fRPk1j2K5K3k7l0K7L7l9k3J3M2l1j4K0kOoj1mK6qm0K5L4j1l8RM2j1l2MJ1
$$ -6 3 10 -11 -23 2 25 -2 -32 -5 32 -7 -30 -17 25 -6 -20 0 -2 4 -2 -13 -17 9 1 -39 -14 20 9 -29 -20 22 11 -21 -17 -6
3752fPpoJ0k%qjK3J4l9oK7J8k7k7M4lk1rJ8Qj9pQJ1J2k0k0K2J9k9rK9Qj3j6J7
$$ -6 1 -6 -12 -2 -4 -4 -12 -13 10 24 -15 -21 6 24 -3 -30 14 11 -10 -19 -1 7 -12 -19 -11 0 12 -8 -28 -6 13 -16 -25 4 12 -1 -17 0
3790@J4j7j4J0RJ2j9n%J9Kl1PL5qk6%M0ok8nK2Lkj2PJJ0j3j6J6J8m7PL7rj4j0
$$ 0 14 -3 -17 -7 2 14 -5 -10 -10 9 11 -20 -13 22 14 -12 -12 28 22 -6 -11 11 14 12 0 7 8 18 5 -11 5 23 -24 -17 20 11 -3 -13
3828a3K0Qj6kNJ8rk3P%L4k7j5J0J2rk5K7J7j2k0NJ8qj9RJJ1j0j%K9j5j5j3L5L
$$ -13 7 15 -1 -3 2 20 11 -12 -5 -5 29 2 -13 -3 9 0 -25 2 19 7 -13 -8 10 2 -17 -8 -7 4 -6 -7 -7 22 7 -8 -21 14 17
3865A7k9J6J2nk7J0J2Orj1lJ5Kj3%QJ4k3KJ8oj3qJ3J2nj7OJ8pj5PLK1k4k5L3K7
$$ 17 -12 4 16 11 -16 -6 6 12 3 -8 -11 4 6 -7 -7 1 15 -8 -6 12 6 -7 -15 -2 10 5 -12 -6 12 5 -10 -3 0 21 -3 -28 5 32
3903C2k7l4J5K7rk0J1NLkrNJ2jk8J5K2nk1MK8qk2J3K3k4Lj2KJ7Lj9JLK4k9j6K8
$$ 32 5 -29 -14 13 4 -16 -5 0 3 1 -8 -3 9 8 -20 -5 17 12 -9 -5 23 15 -7 6 29 5 8 -4 -2 15 18 -1 0 3 27 -2 -18 10
3941A0Rl1LL3ok8jPRLk0jK8Ork0J8Rj2l2L3J5j9j4J8J0j6kj2J7l%rRNRk8jL5k1
$$ 10 19 -12 -9 24 18 -10 -11 -4 5 8 -12 -13 15 21 12 -8 10 19 7 -25 8 23 4 -10 8 18 2 0 -12 5 2 2 -7 2 7 16 -12 -13 22 1
3981Ak3K4J1rlLQjq%lJ6Lk1qK7J1l1j2K2Qj2pMJKqJ1mmojK6Mk1j9J4K4j7k0K4
$$ 1 -22 2 13 4 1 4 12 11 3 3 0 16 19 -2 -10 17 28 -3 -15 7 15 3 -4 0 1 3 -5 6 2 -2 -8 -9 17 21 0 -19 -5 19 2 -18 6
4022FJ6j3j7QPomNLK0j0k4NL5j6l6K2L1k3k1J6L0j8k4J3j2J8lj4KJ6J1j7l5M5
$$ 6 22 9 -8 0 7 1 -3 2 5 25 15 -9 -4 31 15 -21 1 32 9 -12 4 34 16 -8 5 -7 11 8 -6 -4 12 23 6 -29 16
4057A6Nl6qL0J4l0nK2Nj6Nj2J2Lpj2PK0k2j2K7J9m2kK0J7k4j0J0NJ0mnoK4mk3
$$ 16 21 -15 -23 7 21 -9 -14 8 13 -3 2 -10 2 5 -2 -14 -7 13 -9 -21 6 25 -17 -19 1 18 -6 -16 -6 -1 9 5 0 -6 18 14 -9
4094iJL4qm0K5K8j0m1J9K3j8ojJ7LJj1j9K2J2k3j2L9lm7J7K6ql3QK7qKj3jKL8
$$ -9 -8 26 18 -22 3 31 21 -20 -1 22 4 -2 -3 14 17 18 7 -12 10 22 -1 -13 26 23 -24 -7 19 11 -22 -14 13 5 7 -6 -7 -5 33
4131C3k7l6K7K4l9j1L5Pl2oL5Rk7j1J2KJ1j4njL5ol2jL2ml4J3L2k5j8K7Qj6mj
$$ 33 6 -30 -3 21 -18 -29 6 13 -19 -25 10 19 -8 -19 -7 -5 6 -8 -13 -14 21 15 -17 -18 14 10 -24 -11 21 -4 -22 5 13 -3 -7 -8
4167hOJKj2j3M5lm3jL5Nl5jK9jj5lK6mj0pJJ0Rj8l1M2J7k4l4N0jk2KJ3jk2J6%
$$ -8 -2 -1 1 -11 -24 21 18 -25 -26 9 14 -21 -22 7 6 -9 -12 14 10 0 -7 -6 4 13 -5 -36 6 23 -1 -35 15 14 -8 -6 7 6 -16 0 0
4206@NQj3mOL4j5m1K0L2j6m4K3K6k0jJ3kMl%j1OOl0J1K3kl9PL9j9j9MK8j3mmJ1
$$ 0 5 13 0 -4 2 36 21 -20 0 32 16 -28 -5 21 1 0 13 11 15 12 12 1 7 13 -17 -6 17 15 -24 -17 22 3 -16 -12 16 3 -1 -5 6
4245FJomj2K2Pk9lL0J4l9j2K8K0l0rJ6nLQj7LJ5nj8J2K4j9l2K4L8l1k7K3K7j1
$$ 6 7 1 -3 -15 7 14 -15 -18 12 26 -13 -25 3 23 -7 -16 0 -5 -2 6 -11 -8 7 2 -16 -4 20 1 -31 -7 31 0 -27 -4 23 12
4281A2k6J9Mk0K0rrJ8nl5K2J7Jk3OK5j1j4mJ3J1j6mJ3j6K2k2jJ8Qk5qK5J1l5j
$$ 12 -14 5 9 -11 9 0 -9 9 4 -31 -9 8 9 -14 -8 17 6 -8 -12 1 12 -4 -8 5 -11 11 -11 -12 6 14 -11 -19 6 17 -18 -19
4317a9K7Qk3MJJ3Nj9mJ3J3j3j6OK5j7j4J0PMk5J4K8k0j0jQ%J4j9oK2mk7J0J9j
$$ -19 8 16 -7 -3 -2 11 16 -3 -7 6 19 6 -10 -4 21 4 -10 0 7 11 -14 0 28 8 -2 -3 5 5 19 0 -6 16 12 -15 -5 14 13
4354A3k1%L7k9ooK2J3k8qJ3J1lk0kJ9Kk5mL1nj5jQJ0qjJ%Rj2j0K0Kk1mJ1J3J2
$$ 13 -8 -8 29 0 -6 -12 10 23 -5 -13 0 11 8 -12 -14 5 7 -18 -22 9 4 -11 -12 -4 6 -2 -3 -2 -2 7 -5 -15 5 7 -14 -18 -7 6 18
4393A8k8J1J6j4j1J6j1%KQLjJj5J0J6j2j2pJ2J1k6JK2j2Nj6J5klj0NL1j7j8LK2
$$ 18 -10 1 17 3 -8 8 -3 -3 -1 7 10 9 10 -5 5 21 9 -3 -10 2 13 -13 -12 10 -2 3 -13 2 0 -3 -13 -8 23 6 -12 -9 13
4430A3%k4JJ3J8j6j3J2OlpjNPqmkJ8j1j2J0K2j0j8kK7j4olOJ0k0J2J3Lrj5mK6
$$ 13 13 -11 -10 3 21 5 -8 4 10 7 0 -1 4 11 3 -1 -3 15 4 -8 2 24 14 -4 -6 21 7 1 -2 4 14 -6 6 19 22 13 -2 -6 20
4469B0Mk8KRNj2j2J9Rqj0mK0pnnQJ0k4nJ4J2k2rK0J6nj6MJ9mj0%J5nj5MJJ8j4
$$ 20 24 -4 -2 7 12 0 -12 7 16 8 -2 -6 14 7 2 -3 5 15 -9 -14 0 12 -10 -19 1 17 12 -4 0 19 15 5 5 20 15 0 4 5 23 9
4509IoJJ3jk0%J7j1j5NRJ1j6Oj0K1rj0%K3oj3j4K1kk3J7LLlqK0lopkJ5Ll0LL0
$$ 9 3 4 17 16 -4 -4 13 2 -13 -8 1 12 -4 2 -8 13 4 -6 -6 17 11 -2 -16 5 3 -20 -3 0 3 0 -8 12 9 3 -4 -6 9 12 -18 -15 15
4550A5jk0lQJ1mj5OJ8jj4lQPKj0kJ8k9NJ5J0pk0kK4j7PmPlKj1J3kNj8%K0j9j6
$$ 15 14 -6 -9 -1 10 6 -9 -3 15 14 0 -3 5 12 14 4 2 20 -9 -4 11 21 14 -6 -8 16 -1 6 2 9 6 8 -3 10 8 13 -5 -5 15 -4 -20
4591b0J9J8lj4j3L0Jj1j5J1J9rj9KJ2Lk0mJ9KjqQPrlj2J9jj3oOK2j2lJJ1rj5J4
$$ -20 -1 17 14 0 -13 17 18 7 -8 3 22 13 -6 -4 8 11 -9 -13 6 8 7 -1 7 14 5 2 -10 9 8 -5 -11 -5 17 5 2 3 14 5 -10 4
4631DJ7p%j6K0qj2LJ0Kj7lMJ0oj7PK2j3j5J9JJj3R%j2MkmK5oj8lJ5J0oj2J8Qj7
$$ 4 21 14 14 -2 18 10 -2 1 11 13 -4 -7 -3 7 1 -16 -9 13 0 -15 4 5 6 -7 2 2 -10 -6 -8 -12 13 7 -11 -14 1 11 5 -7 11 19 2
4672Bj6J3J5qj8RJ7roj0QK4j3k0RM%qJ2J0onoPJ3kk5mK7nk5J1KJ0j4kK5mk2%J1
$$ 2 -14 -1 14 6 -12 -3 14 5 -1 -11 -3 21 8 -12 -3 1 1 -7 5 15 9 4 -2 5 18 16 -9 -13 14 9 -16 -5 -3 7 -7 -9 16 12 -10 -10 1
4713AOj1J1j3J2Jk0mK3%j2MJ1Nj2j4K1jnjnJ3%pj5K2J0k2rK0K1k4k6L2Qj4j5J8
$$ 1 7 -4 7 -6 6 7 -13 -17 6 6 -6 -2 9 14 2 -12 9 8 3 2 -3 10 10 3 -12 10 20 -2 -11 9 30 6 -20 12 20 6 -9 9
4751IjNj8J2NOrrJ1J1j7rQPQl1PL1j7koNRMl0J4J9ok2J3J0j2qJJ7mj8QJ1Nj2J
$$ 9 8 13 -5 7 12 18 9 0 11 22 5 -4 4 11 19 -12 -5 26 9 7 1 6 15 19 -11 3 22 16 -6 7 17 5 -3 -2 15 11 -7 1 12 17 5 6
4793FlROqj3J7lnj6K7Pnk8K0Lj9qJ3LqkLJ4j5J4j9OL1k5j8J6Pmk1J0J3J5k8LO
$$ 6 3 12 18 10 -3 14 11 6 -10 17 24 19 -9 11 14 -5 -13 0 3 -5 -7 -4 10 -5 9 -10 -4 27 2 -16 0 7 3 -18 -8 5 20 -8 -5 1
4833AJ2jrj7L8Jl8J4J1%k0KJ7Jj6RJ2lj3qOnJ6%j2J5KKj3J1Rj7kRLpqKJ1mlrJ6
$$ 1 13 12 3 -14 24 25 -13 1 12 12 -8 -6 11 12 -4 5 17 14 1 -7 -1 -6 10 10 -2 13 15 17 4 15 24 7 5 14 17 10 2 4 15 11 8 -1 15
4876A5Llk3OK4j8j2QJ4Kj0j0J9j2kJ0j8K3oj9J4J3jl0NJ4JnlJ9nrpJ1RJq%JOj4
$$ 15 18 15 -8 -2 22 4 -8 0 14 16 6 -4 15 3 1 11 -7 16 10 -9 5 18 17 -13 -8 6 7 2 -1 18 13 4 -3 8 17 18 10 10 11 17 3
4917Cj5K8lj3j0J7J0j3j0OQj5OKn%JpJ2J1j6rRJ3qj6QJ1lnLJMLkpnJ5k0J0J6o
$$ 3 -12 16 13 0 -10 7 17 4 -6 0 8 -7 -1 1 -4 -4 -3 -10 2 13 -3 -12 -3 10 2 -14 -6 5 2 -3 0 1 5 8 6 -1 -6 9 -11 -1 15 9
4959IrJ3PNk6lJ9Mj8J3k0J0KMjkJ6l1RJ6Qj9KJJ1j3%j2K0jmp%Mj0RoJ9k5nJ2Q
$$ 9 0 13 20 25 -1 -4 15 19 1 14 -6 4 6 10 9 7 23 -8 1 17 25 6 8 9 20 7 7 -5 15 14 10 3 3 7 -3 6 0 19 -6 -11 1 9
5001Imk5J8R%j3lK9j1Jj1ONMj5mJ7qrjJ7Nj6LMKrqRJ1%j8pK6Mj3j1OK1k6KkJ1
$$ 9 5 -20 -2 7 7 -6 -9 20 9 10 -1 5 10 14 -1 -5 12 4 -5 -6 11 16 0 3 7 9 0 -8 1 12 12 -6 -13 13 17 4 -7 -1 20 -6 -4 -6 5
5044Ej2mJ3KjnMkJ3j3mLQKj5JJ2nrJJ8j4jMJ0j4OrJ1Mmj0lJ7Qj5%PRj7MKKpmJ4
$$ 5 -7 -11 2 4 3 -2 2 0 13 0 -4 -1 7 9 -6 -5 7 2 -7 -6 12 -2 -3 1 11 -3 3 -6 5 9 5 -5 -8 9 17 2 2 9 18 1 5 7 9 2 -2 12
5090A2J0j4loJ6rj0KJ1%j5jRJMj6KJ1%%pO%jj1RMjj0%J6qj4QRlKj2J8Lk1ORNj
$$ 12 22 8 5 -1 15 6 -4 -2 9 9 -6 -7 2 3 7 -9 -7 4 4 4 -3 3 3 2 -9 0 4 3 -7 -7 9 1 -13 -5 4 1 3 -9 9 12 -9 -3 6 11 10
5135A0j6kJ8%Jj9J8%j8NJ6%lj6J0Rlpj0K3mqJJ0Oj9j0OJ8j9Mj5K1Jj7kJ3Rj4o
$$ 10 -6 -8 10 10 11 -8 10 10 -8 -3 13 13 10 -6 4 13 10 3 -7 16 12 4 5 15 21 2 -8 -2 16 -3 1 -14 7 8 -9 -11 2 11 -3 -9
5175ioK6Lk6J4k%nJK4j5o%KOo%%Rqj1J0%LJoK1oj4LMNj5J0j6KJ1moJ7nprJ6j0
$$ -9 -15 11 14 -12 2 0 0 -5 -4 20 5 -1 -1 1 7 1 1 1 10 2 -9 1 1 4 5 -1 20 14 0 3 7 12 -3 7 -9 -7 4 0 -6 11 6 -1 -10 6 -4
5220dPj3J5Oj4pJkJ7j0lJ3koj6K1JLj5OJ5j9oJ6NJpj7K3lJ3k1J5%%j1j0K3lj2
$$ -4 3 -10 5 11 -3 -10 -9 -11 6 -4 -7 6 4 -2 -18 3 4 7 -8 -2 13 -6 -12 4 9 10 3 -14 9 6 19 -2 13 13 13 2 -8 15 12 0
5260@LQJ0qj7J4Qqj0%J2Rj4rLJ5j2pJ4RorJMPj6nK0j7j1LLoJ1j5K2mkj6LJ9lq
$$ 0 3 11 21 13 -4 10 18 10 0 0 12 21 7 -2 1 16 4 -3 11 20 14 5 6 10 17 1 -4 16 -1 -12 -9 -6 -12 -1 -16 6 2 0 -16 -13 6 3 -5
5303eLPLj2kLMmjPRqJk0K1Ok2jJ3Mj3OlJ5jpqJ0Jj4PJ3j5j1%K5nj8MKJ4j0kj1
$$ -5 -2 5 8 -4 -6 -3 1 -3 -4 3 12 4 5 -15 6 12 -10 -11 2 6 -7 -1 -4 11 10 3 -5 5 6 -8 -1 12 -3 -14 -14 11 6 -12 -8 -6 8 -2 -4 -15
5347a5J0Qoj8K2Loj4J0J7qk2K3kmjnK9lk1oPJ3%qLJ5oqLoRj1J2kKj1mrJ6J0j9
$$ -15 -5 3 -3 -21 1 4 -2 -16 -6 11 3 -19 4 2 -2 -3 -8 21 18 -3 -9 -2 11 11 3 6 21 15 7 10 4 13 2 14 12 14 3 -1 -10 6 16 -3
5389cJJ1Pj5RqJ3k6K3j1KKj1lJ1KnqPRlj2QRj1kmJ9j5qJJ1mPlJRKj8MOMj7K1L
$$ -3 -2 9 16 1 10 2 15 -11 12 1 3 5 -6 -9 2 4 -1 -9 -2 7 4 -8 0 9 -2 -4 -8 11 -4 -12 -11 0 -4 3 0 1 10 12 -6 -2 4 8 -9 12 15
5434A5Nj8klK3lk0QjkkQMj7JjK0Kk0j2K2kj2RLOj5lLJnJ5j7RJ8j8KP%ql%K2j5
$$ 15 20 2 0 -3 20 17 -3 5 4 2 0 8 12 -5 -4 -5 15 17 -3 -15 7 5 -7 2 5 11 -4 -7 -4 -3 -8 7 -10 -1 17 -1 1 8 8 0 -3 -3 19 4
5478DrJQnM%jKpqJ4K3j8j5LJ7Jnj5K5nnnJL%j7J7Qnk1J3PJ0l5JLJ9p%Lj3J6j1
$$ 4 -5 -4 4 -1 3 3 2 4 -3 -11 3 26 8 -7 -4 13 14 9 -6 19 14 9 4 5 8 8 -9 8 16 11 -10 3 10 20 -15 -14 -11 8 1 1 4 -9 7 -4
5522dNlJ6j7%%J4rmrK7j2KJ1j3J3k5PJ2nPj3LRj7rJ4J1mlQ%nrJ1jJNkrPLk9PJ2
$$ -4 1 -2 14 -3 -3 -3 11 2 -2 -11 16 4 6 17 4 17 -8 -1 11 6 13 0 3 12 -5 -14 0 11 7 4 12 12 7 -2 9 8 9 14 12 3 10 13 -16 -9 3
5567Cj4J0LNj1KQMnJj5J2j3J4nj0RMjk5L3pj1pK4j0LKLLMj1LkJ8j5joRlpNQlj3
$$ 3 -11 -1 2 7 -4 -2 6 10 5 6 -9 3 -10 4 -1 -11 -2 2 1 -24 9 2 -9 -16 8 -2 1 3 6 9 13 2 5 3 21 6 5 -1 8 5 -2 3 11 8 -5
5612eRJ0qmQj0J%mJ0%LppJ3lnj1K1pj1qJ7NrLJ%lmj0K6jk0lK5rMj5J0OoOlJ5o
$$ -5 4 14 6 2 10 0 1 1 -3 7 7 10 3 -4 9 6 1 -10 11 4 -7 -15 2 7 -2 1 2 2 -1 -5 -15 11 10 -10 -13 12 3 7 -8 2 8 2 8 5 20 14
5658A4j1kJQ%j7MK9j8MpJ2nj3%J6j7LJLNNqj6K3rj9lJ8Oj1nJ8Jk0OJ0nJNj0J0
$$ 14 3 1 2 10 10 -7 -3 26 8 12 5 17 12 -1 -1 15 -2 1 2 5 10 15 7 -9 14 5 -14 -17 1 7 -4 -9 9 10 -10 -4 6 1 2 7 -3 7
5700G%j8NRPj6nPMonJ3MKpnJ7oklJMJ0j7JJ2kj4J1JomJ2qJ0j3jjMOj6nJ4Mlj6
$$ 7 7 -11 -6 3 10 -6 -11 -4 0 -6 -11 2 6 8 1 -4 13 7 5 2 3 7 17 0 1 13 11 -3 8 9 3 -1 11 3 13 0 -1 -2 2 8 -8 -13 1 5 2 -14
5746a4K6j6PpKLj2JMJ4lj1lQOqpJ3ljnN%M%RmmKoJ3jrlJJ4j5rJ8N%j9QRKk1RN
$$ -14 12 -4 3 -4 -2 1 -11 -10 -6 8 5 -6 -9 -1 5 -3 -10 3 0 -1 -6 -1 -1 3 3 12 8 4 6 0 13 12 3 0 1 15 0 -9 9 14 14 -5 3 12 14 -7 2 7
5794GKnNj7MJqOJ8lrj0J8j6qPJ3j1Qj4NJ1qOj2R%n%J0NopJ5jmj1qJ4J1roJ4j3
$$ 7 9 4 9 -8 -4 -3 -11 -5 13 10 1 -9 9 -7 -15 -8 5 -6 2 -12 -7 4 -4 2 -10 -1 -1 -6 -6 4 9 3 -4 11 10 6 -5 -13 1 12 3 -3 11 -2
5838bPmqK6j7%J0NnrqJ0Lmj5RJ0lj4MK4k0lNJJj0JOnj0JOJ5j0lrJ4Rj4nJ4jno
$$ -2 5 1 -7 19 2 2 12 17 12 3 -5 5 8 4 -11 -2 8 5 -9 -5 19 -1 -4 1 2 3 -7 -6 0 -5 -15 -14 -8 7 -3 -6 -15 -1 8 -6 -11 3 2 -3 -9
5883iNJ4k0jJ0LlPjJ0onj6K2Kj3rQPOprJ8mj5jN%MqKOljLNpmnK2qk0PJ0knJ5m
$$ -9 -4 10 -10 -11 -1 2 -1 6 5 15 9 4 -12 10 12 -1 -10 -2 5 11 4 -5 13 9 -6 -7 -2 -2 2 -6 -4 2 -1 -2 1 6 -1 -5 -10 12 4 -16 -9 1 -1 -6 9 5
5931EqQqKPLkrRNj5NJ0j%qJ5j8NNoJ8mpk3J8Jm%j0K8j3LpRj1jqJ4lmj4LK1j3r
$$ 5 -3 5 -3 -1 6 9 7 -2 7 12 -3 2 12 11 11 3 18 0 5 10 4 22 18 11 -12 6 7 3 3 -7 21 8 11 4 13 2 1 -7 7 4 0 -14 -11 10 -3 -12
5977a2oK3%mnN%pj2J4LnKKRorjJ0Pj8LNRpqJ9lmJJ1j1mjjRMpnJ1njj2POPj1J1
$$ -12 -18 5 5 1 -4 1 1 -6 -18 -4 -1 -6 -4 -2 7 1 -8 -9 1 8 -10 -7 -2 7 0 -8 11 8 4 5 16 5 1 0 -1 8 12 5 0 11 6 5 -7 0 6 13 2 13
6025A3q%pKOqJ1qrQJ0j1lQoj4K2Kj4J7j4LMmKjNj1QoLJ4k4j3K6LomJ5kNk8J5N
$$ 13 5 5 -2 0 6 -2 9 1 -8 0 10 -1 -4 4 -2 -16 6 8 -6 11 -3 0 4 0 2 1 6 -5 3 -3 0 14 -10 -23 3 6 0 -4 11 9 14 -14 1 6
6069FKj6OlQplJ7Kj1mlK5j0j3j2L1qk4J0Qoo%LJ3j2j3%K5Mj4KnJ2j0JOllljJ3
$$ 6 8 -8 -2 -5 3 -4 -7 10 12 1 -3 -6 19 9 -4 -16 15 7 -17 -7 1 -5 -11 -11 -8 5 -7 -20 -20 5 9 -5 -3 -8 4 -6 -5 1 -2 -5 -8 -9 4
6112DmnqJ7oPpJ2Pk0KJ0Jj0jQjjNj3J2jMj8J4Lj6MoJ8j8OoK1j1rMO%lqJ%Rj4j1
$$ 4 0 -5 -13 4 -2 5 -2 10 17 -3 -1 9 10 0 -1 7 6 5 10 -3 9 8 12 -6 8 11 -5 -1 -7 11 -7 -1 -7 14 3 -6 -2 4 4 1 -7 -6 -6 3 -11 -22
6158b2K8nj3jLJ3jooP%lLNRk3kK2pNkPq%pJ5nLj7J4KNj2%JPqj1J6Mrj7J1J4j6
$$ -22 6 1 -12 -13 -10 3 2 -4 -10 -3 -3 -6 -3 2 11 -12 -14 8 1 6 4 11 3 3 -4 11 6 9 -8 6 8 13 1 1 2 9 1 -10 6 10 1 -16 -5 9 -7
6203gmOONj4pK1%pj2J1LJj4J0mPj2QpJ2lpNJ3%j6qRK3k5NRRk6MJ1Pj9pRJ1Opj0
$$ -7 -11 -5 1 6 -8 -15 6 6 -1 -13 -2 1 2 -12 -2 -6 1 -11 -3 -10 2 -1 -8 -3 10 10 -6 -14 -5 18 -7 -2 7 16 -10 -6 5 12 -7 -14 -5 6 12 5 -5
6248eJ1Lj3noL1k3OL%Jj6kRPmmNkNkLJrj0J1P%j8J1oQMo%jjLOJ2j0Mj5J0Ljj1
$$ -5 6 9 -4 -9 -15 16 -7 -1 2 2 3 -13 -15 -6 1 -3 -7 -2 -4 1 -1 2 3 -6 -16 -5 2 2 -16 -5 -11 -3 1 -5 -5 -6 -7 -4 2 14 4 8 -7 3 6 5 -6
6295fJ4Lj0Q%Qj8Qj0J1Mj0mLJ2noJ2lnj4RJ1mj3POJrLqRoqMJ0j2NJ2mJ3j0j1J2
$$ -6 8 11 1 9 9 17 -1 7 -3 8 12 2 -2 1 13 8 2 14 11 6 -8 1 12 8 -5 2 8 9 0 3 -5 4 -2 -10 -6 4 -8 -3 9 5 18 8 -3 9
6339IlplkJ4Lkj0QrqLK1qj3lK0%%k4QJ7mnQnJlJJLj7QMQrmjPj1okRJ1JmnKQnj0
$$ 9 6 -1 -4 -6 8 11 9 -1 7 -2 -10 -7 14 6 -7 -10 10 10 10 -14 -6 11 7 2 10 5 6 3 4 5 8 -9 -1 3 11 2 -2 -3 4 -7 -13 -15 -6 5 6 2 -3 -1 7 2 -8
6390hJ8rk0J9JqJ9j5KJ3Jj3qJ9orRLPj6NNKk6J0NJ0nj0MNL%mJ5j5J2j1KJ0j2r
$$ -8 10 1 -19 0 1 -7 12 -3 -1 12 13 0 -8 11 5 -4 5 8 15 -1 4 9 11 -15 -5 0 10 5 -5 -1 4 7 7 3 18 3 15 4 6 16 4 -5
6432eK0j0jj0J8ppK%MMjk4RJ4Qk7J2OrkMoKJRJ3lqJj4J2Pk0MJ7nMj4J4Jj4JKJ1
$$ -5 15 5 4 -6 12 5 -2 0 0 4 8 7 -17 -8 6 14 -13 -1 5 -4 -6 -2 -8 -6 -5 4 17 14 6 7 -7 5 12 -8 -4 13 8 12 -2 12 13 -1 0 2 13
6477A3%j5PJ1qolMK5j4j2qK4j5j0KJ7j4j1J7JPj5J9mJroMLj1%JOlLlNjLjj5R%
$$ 13 13 -2 5 16 8 2 -1 3 28 14 2 -6 18 3 -7 -5 12 -2 -13 4 5 12 -3 16 12 13 4 -2 2 5 -6 -6 -5 1 -2 1 -2 3 2 5 4 -11 -2 -2
6521bj4J7QkolNjLrJ9Kj9JJ5mjmKoMmnRLj8QJ5kj1prK0Jj9J1j0K5k1LJ0kj1Ok
$$ -2 -16 1 9 7 1 -2 3 2 5 -4 15 17 -2 -1 14 10 9 5 7 1 5 1 -4 5 8 -10 -2 13 11 0 -7 -16 4 5 -14 -3 -13 12 -9 -6 4 2 -9 -3 -5
6566eJ1j9lJ5Mkmj0J9jj4J1J2mnoMLJ3j2jPpJjKJ3j4QomOoKkOj8MRRj8jMJ3qj6
$$ -5 6 -13 -16 -1 3 1 -3 -13 6 5 -9 2 14 10 5 -1 3 6 19 7 6 13 6 7 6 8 21 7 15 9 5 11 5 7 5 11 -7 -3 6 15 -3 -4 0 13 5 -11
6612a1OQmJJJKrPjJ5j1j5lK7j1kQj1J4j3nL%pRJJ5k2LnJ7rj2J1J3Kk0J5LqJJn
$$ -11 -5 3 -1 0 1 2 4 -5 2 1 16 5 -10 -13 14 3 1 9 -2 12 -1 -6 -3 -3 -10 -1 0 15 -7 -4 -9 8 -1 -13 -2 11 13 -7 8 11 3 4 5 0
6656@LJ3k0JkPooJ3%Kl0K4Jj0LKKjj1J8j5J1j0PJ0rNpOlJ2j4%%J5jkkJ4j6%JP
$$ 0 3 16 -4 -3 -5 2 -4 -10 3 3 5 -25 -1 0 -10 -7 -5 -3 -4 -15 3 -12 -1 -11 -4 6 -3 2 -5 1 -2 10 -4 -4 -4 11 10 8 6 20 4 4 5 12
6700A2oj0J2Ojj1lJ3knpK0mj3MJjNkj0KJj3J2J5j0Qj7N%mj2J9jKj5LNj%oOJ0n
$$ 12 6 -4 8 14 13 2 -1 12 10 5 -2 18 14 1 5 6 5 10 8 -2 0 1 -12 0 15 5 13 -4 1 1 -3 -15 4 3 5 -10 -7 -2 -3 -3 -9 -3 7 2
6744Bm%Oj1JQNlrJ6qK%oKQj5%JMJ3k3RJnK%MjJMj2J0pOmPPj5qJ4Nj0j0KjKRJN
$$ 2 -2 -2 4 -7 -6 2 7 4 -5 11 3 5 5 -1 1 9 -6 -6 -5 -1 12 -11 -2 -1 -6 -4 -4 0 -1 0 4 -8 2 -5 1 -3 4 11 -4 -12 2 7 -3 -13 -11 -12 -10 -1 0 5
6794EMj0lJjOj1J4J2j7mLNojoPKJoRmoLKMjolJ5ojlRJ4k1nN%olQjNr%OJrqJ5N
$$ 5 9 -1 -4 -3 -4 2 -9 5 17 0 -4 -1 4 -2 -3 -9 -2 0 1 -5 4 0 -6 -3 -1 3 2 -4 -7 8 2 1 -2 7 21 0 -5 0 0 -6 -9 -1 -2 3 -6 -6 0 1 -8 -16 -1 4
6846DrlJ8k0qPJ0j0MNnnK8j8j1JJ4Nk1jJ3JlkOKqNJQjmMLqloJ3qjJ4nJ0j5NKk
$$ 4 -5 -8 10 -10 -18 -11 -1 -11 -7 -2 -7 -12 16 -2 -13 -12 2 7 -14 -15 -2 -1 -4 -6 0 2 -6 -1 0 8 7 3 7 10 2 -1 -7 6 -2 -3 11 6 16 1 6 8 6
6893FJj6%J0mjk%Pj4kJ8j0MmJJ1jj6NJ3jj4KJJ1Lmj3NOnOnkjLmlQkRoqNmJ8pn
$$ 6 7 -9 -9 1 -3 -4 -6 -6 1 -13 -15 3 -7 -3 -7 -6 5 4 -12 -7 6 5 -9 -7 -6 5 8 4 -9 -4 2 -3 3 -2 -4 -5 -2 -6 -9 -1 -3 6 0 -8 -3 -7 11 4 -1
6942aqJ6ppJ1%mNqJ1Kj0kkkJJj3J0Mnj2J1MkjLP%qKqJ1J7k1QJ4j7kJ1j0MKLkj2
$$ -1 -9 7 0 -7 4 4 0 5 -3 8 10 0 -2 -4 -6 -5 -4 -17 -7 -3 -8 -20 -9 -5 -7 -8 -5 2 2 -6 -4 -12 -1 16 -5 3 17 0 -2 9 -1 3 5 8 6 -6
6988fLKkRj3J4pK1j1moLJ0k0RKLj4J2j0RRj3lJ5lnj6J9kj4Rjj1LmJ5mpj0LJ6q
$$ -6 -3 -1 -3 6 -7 7 0 21 10 6 0 3 13 -7 2 4 7 -7 5 -5 4 13 0 -3 12 9 4 -12 7 5 -9 0 -1 -12 -9 -13 2 -2 -9 -19 -16 0 -8
7031hNj0MkOqJ7KqKrRjrKJ4lO%%JMk4RPj1oJ6%%kj4K1j7N%J2jj2J1j8JQMoLjj7
$$ -8 -3 -13 -9 -11 -5 -13 4 6 -2 0 -9 0 -1 -10 -8 6 3 9 9 9 10 14 -10 -1 6 -5 -11 5 5 5 3 -11 10 -7 -2 -2 10 9 -3 8 -10 -9 -1 3 -3 0 -1 -18
7079a8K1pRmKj5J6%j0QpNNJnNj1OMNo%jOMmpJ1nLj3J5Jlj1jQko%Rj4PNmOnj0j
$$ -18 3 -4 5 1 3 -12 4 4 -6 2 -5 0 5 6 1 6 -5 1 5 10 4 4 3 9 13 9 2 13 8 11 -2 13 14 11 0 -1 7 5 -1 -1 8 -6 1 6 2 8 3 -7 -8
7128hJ4j2%PPpJj3J0loJ5j0J4pklJ5j5Mjnj0J3rKJ4j3J2LkQj2kPlKj0J9knpJ0
$$ -8 6 -6 -6 1 8 1 2 -11 -1 -4 -10 5 -5 9 2 0 -3 12 -3 1 0 -5 -15 -2 -11 -9 5 -8 4 7 5 13 1 -1 6 3 5 -5 14 12 7 0 10
7171A0j4J0j2MJ0loKJ3qk3J5oJ0j1nKRQk1K0mJj2mJ0jOj0lJ4mj1J0NLj9RJ0j0
$$ 10 -4 6 -6 -2 8 5 -1 1 14 6 -17 -2 -8 2 -9 -14 -12 -3 5 -16 4 0 1 -11 -15 -5 -6 0 -10 -13 1 -3 -14 -4 1 4 -15 -6 4 -6
7211fnJ3Jlk%nNMnKOj2RMqkJ1j8J0J2qmJRqk%RKj6oMLJ0j8PKqPoMPLqPjJj9PJ1
$$ -6 -11 2 3 0 -2 -2 -7 -2 2 -3 -1 5 -7 2 6 -2 -4 7 -11 -1 11 3 -1 0 9 1 -1 -1 8 10 -6 -12 -8 -5 5 -13 -6 -4 -12 -5 -11 -7 0 3 -5 2 1 2 -17 -10 1
7262AKJnoMK%Qj4%J5Nm%j3J3lj3NRj7PJ3oKKpqJ2J2oKj3KJ0j8O%OokRjjlJJor
$$ 1 3 4 -1 -7 -3 -1 -1 7 -7 -7 8 13 9 9 -4 9 6 -7 -2 7 -10 -3 10 4 6 8 1 -7 5 17 11 13 0 2 12 -6 0 0 6 0 -2 7 6 5 2 3 4 -2 -11
7311a1qK4Pk0QJj1J4k1K1%Kj8NJ9lqRrJ9j4JMj3lJNmMMoJ1klmjJ6rpj0K0%mj4
$$ -11 -19 5 12 -8 0 1 -10 4 -17 4 4 6 -12 -7 12 9 1 10 1 20 6 7 11 -2 -5 -4 1 -3 1 5 -1 10 8 5 1 0 16 7 0 -10 10 10 6 -8
7355hJ0Mj9MQLj0oJ2J4j4J0qkkJ2qOj6Nj2K0%nmkJ0%qjOkJJ1rrOQLKOk1J4mOl
$$ -8 2 6 -13 -9 -1 2 -8 -14 -2 12 -2 8 0 -2 -4 8 0 6 -10 -5 -17 3 3 -2 -6 -8 2 2 -6 -7 -1 -3 -2 9 0 -9 -3 5 8 10 16 -5 9 5 11 8
7401HnPqKoNQj4j0NJ5j1KnOJll%J0lplJJ2kplJ%KNMj6JRJ7l1JJ2KoNpN%J0nmK0
$$ 8 3 10 2 4 -2 3 11 -3 -13 -8 7 -4 -2 -7 -1 0 -3 -6 -6 4 1 -6 -9 -8 4 2 -5 -8 -7 -7 -5 0 4 -12 -11 -2 15 -16 -15 -3 -1 -7 -2 -9 -4 -4 6 1 -3 17
7451A7j9mjJ7qpJ0NnNj3QJ7k4J1n%loPmRlmmNlMkLpJ3%jj0nJ0KlqKJ0nj1J5mk
$$ 17 -2 -6 -7 10 2 -5 5 10 5 10 -3 5 22 -2 9 4 4 1 -5 2 -2 7 4 0 -4 1 -2 2 0 3 -4 9 9 8 -2 -7 3 5 2 -6 -4 6 1 -10 5 1 -1
7498aJ3pklJ2k5K5j4J6j3mJ2j6J5j6J5MJqLl%NlMkj3jJKJ0j7PNmjj1J3pkMmRp
$$ -1 12 5 3 0 12 -13 12 -2 14 1 -3 9 -7 8 -8 7 11 12 4 7 4 4 9 6 10 8 -5 -6 -5 -3 7 -10 -3 2 -2 -3 -14 -1 -8 -10 -6 -10 -1 -8
7542hJkJ6kr%JP%lOpmJ1pOlRkj2Pn%J0k%lJ3j0JNj4jJ1npPJ2j6NlJ4j4QnjJ2j8
$$ -8 -7 -9 7 5 -4 -4 -3 4 4 1 7 0 -4 7 0 6 3 12 10 -2 5 0 0 10 8 8 5 18 8 9 14 0 -1 10 5 -2 5 17 1 6 3 17 3 11 6 5 17 -1
7590aOKrLjQo%mMp%KKjrlJ4Rk0mQM%J0j1J3JmjNkrPonJ9j7Ljj%QmJJ5k7PMnMk
$$ -1 5 7 -2 1 0 8 2 2 -2 2 -5 -5 -3 -1 -2 -11 -14 0 9 -11 -15 -7 -3 -3 7 -4 9 10 6 5 10 8 -1 6 0 -5 14 -3 0 -1 -2 -2 6 2 3 18 -9 -2 2 -3 1 -1
7642aLPqkNNqmKjkPnJ2lj0KLJ1j2j3MjRj2%RMKkj0J4jj1NlJ7r%nJ0j4OJ6jj2L
$$ -1 2 9 1 -1 4 9 1 -3 -1 -2 -4 3 -2 10 7 -3 -1 2 13 1 -12 -8 -9 0 -12 -12 -3 1 3 1 -9 5 4 -7 -2 -5 12 3 3 -2 8 -6 0 16 15 3 6
7689FmJ3j6J2j3J1noJ1qJ4j0o%JrqK9pj5OnKJ0j3nJ4J0k3KO%N%kkJ3j2j0J9kq
$$ 6 2 15 -1 11 -2 9 4 -2 9 1 15 5 -1 -1 0 -9 -17 12 5 -10 -4 -9 -7 3 -10 -15 -1 9 -14 -12 -6 -6 -1 -1 -3 -5 8 -4 -14 5 3 -5
7731eJ3j7J0Qk4J5nJ6joJOloPmmLKqKMLK%qMj2J1j1mPJ2rj3RNmqJ9pNQj7NjJ1
$$ -5 8 -9 1 9 -15 0 -5 11 10 4 5 11 8 2 9 5 1 4 6 -2 0 4 7 9 9 1 5 -7 4 -7 -11 -4 8 -1 -14 -5 0 -4 -12 7 0 5 13 -4 1 0 11
7778A1j4kJ5j0k0RPPNoJJ1j9MMjpKP%%j1MJ6qjoMKlJQj0JOlJLnj1KOJ%llLnPJ
$$ 11 -3 -5 10 0 -20 -11 -4 3 8 2 3 14 -5 -1 3 2 -5 -3 4 4 4 -7 -3 13 5 4 -2 2 4 1 2 10 0 1 7 4 5 8 3 -8 -6 0 1 1 -2 -5 -2 -7 0 1
7828Aj5JJ1MpOk2J8oJ2kj2K0opLkPLMj8K4j7j0J9pPqJlQ%oJ5o%k1K2%knqJ3j2
$$ 1 -14 -13 -2 2 -5 1 -21 -3 -9 3 1 -11 9 3 -4 -1 -3 4 7 11 -7 17 0 -10 9 2 9 1 2 -1 7 7 1 16 10 10 -11 11 11 9 4 -4 9 -3
7872cNKkOjnKJrqJJ1kmQJ0j7qJ0QKlj7K5j8LkMNLn%MLJoJ0Qj7lJ4qJ3k2jJ8oj
$$ -3 2 4 2 8 7 2 4 5 -4 -12 -11 0 -2 -6 2 12 -5 -13 -3 5 7 4 -13 12 -6 -3 -5 -1 4 7 2 2 6 9 10 4 14 22 5 2 16 8 21 -1 -2 16 10 9
7920In%Qj0%Qjj3JLjPoJ0jNj8kKKj1J1kJ1mOj3OpQqQqKKj5QQjjJ5k3J2KMpoLR
$$ 9 4 4 12 2 2 10 9 -4 -3 0 -1 6 0 10 9 14 -4 -6 -4 -2 -13 -2 -4 7 3 9 -4 2 -5 3 -5 3 -5 -3 -1 -16 -8 0 -1 -2 13 -10 2 4 8 1 -5 -2 7
7969GjrMOnQooJQKpJ1qp%qJ8pNpqJ0j5nJ7Rj7OKMkmLj%jLj1J1RqMkj0pPMLj3J6
$$ 7 6 -3 1 7 2 10 4 -2 -1 7 9 2 13 5 -2 -2 -10 8 1 6 -1 -9 1 -14 -19 -2 7 -10 -4 -2 2 0 -4 -1 -2 -2 -3 0 -11 0 9 1 5 3 -7 -14 -7 -3 0 -13 3
8020CjJnJOPj5LLLJlljjOoLJ0j0oJ6%j1NJj1J1jj0OJj0NJ%Qj6NJ0mj5J1MlJ3j9
$$ 3 2 3 -2 -1 5 12 -3 0 3 6 7 4 1 0 -1 5 -1 2 12 2 -4 12 12 1 6 7 -4 7 6 -4 2 3 -7 -2 -1 -1 7 -9 -4 6 2 -13 -2 2 -1 12 -7
8067gJ8j1JlJJ1%j1jJ3j2QKRj2LrM%oPmJ1J3k7MJ2Kj5J3Kj5QpOom%mKPpMoJ4n
$$ -7 11 0 1 -2 -1 10 10 -1 -2 11 -1 7 9 18 6 9 0 4 4 -2 5 1 12 25 -2 2 14 16 1 14 16 1 9 2 8 2 -2 -2 -6 -4 3 -4 0 -6 8 3
8113CrQj4J0mQMk0J4j3J3j7J8kJNlnpJ1LKj2J2J6k4PkJ5k1QNoJ3k2J5MLknjlP
$$ 3 -6 2 -12 -2 -6 2 6 -14 0 -13 0 -17 1 -1 0 5 2 -3 -10 1 4 6 -6 6 22 -2 5 3 18 -3 5 10 4 17 -5 10 14 17 15 10 9 6 13
8156A3pmOqJ5mPnj7PNpjNnQoOj1%OjLJ0k1OjMOqLpQkj
$$ 13 6 2 8 0 15 11 18 13 -4 3 8 1 0 5 0 8 2 8 -3 -3 3 2 5 15 -6 0 -1 3 9 1 4 -3 5 3 2
8191B
##END NTUPLES=NMR FID
##END=
