##TITLE=1H_SA_PPh3vCl(CCl4)
 CDCl3, 8 sc, 
 17.9.2019
##JCAMPDX= 6.0         $$ Bruker NMR JCAMP-DX V2.0
##DATA TYPE= NMR FID
##DATA CLASS= NTUPLES
##ORIGIN= UXNMR, Bruker Analytische Messtechnik GmbH
##OWNER= root
$$ XWIN-NMR		Version 3.5
$$ Tue Sep 17 15:39:16 2019 Russian Standard Time (UT+4h)  she@DPX200
##.OBSERVE FREQUENCY= 200.1315
##.OBSERVE NUCLEUS= ^1H
##.DELAY= (6, 6)
##.ACQUISITION MODE= SIMULTANEOUS
##.ACQUISITION SCHEME= undefined
##.AVERAGES= 8
##.DIGITISER RES= 18
##SPECTROMETER/DATA SYSTEM= spect
##.PULSE SEQUENCE= zg30
##.SOLVENT NAME= CDCl3
##.SHIFT REFERENCE= (INTERNAL, CDCl3, 0, 15.7039)
##AUDIT TRAIL= $$ (NUMBER, WHEN, WHO, WHERE, WHAT)
$$ ##TITLE= Audit trail, XWIN-NMR		Version 3.5
$$ ##JCAMPDX= 5.01
$$ ##ORIGIN= Bruker BioSpin GmbH
$$ ##OWNER= she
$$ F:/spectra/data/she/nmr/H-F/1/audita.txt
$$ ##AUDIT TRAIL=  $$ (NUMBER, WHEN, WHO, WHERE, WHAT)
(   1,<2019-09-17 15:37:57.40 +0400>,<she>,<DPX200>,
      <created by zg, POWCHK disabled, PULCHK disabled
       configuration hash MD5:
       00 E9 B6 7A A2 85 ED C7 34 08 36 98 17 FE 4E 26
       data hash MD5: 16K
       7C C0 0D D0 33 8F 37 97 11 AE C9 DA 02 00 7A B6>)
$$ ##END=
$$ 
$$ hash MD5
$$ 9C 2A 91 C3 D3 E8 BB D4 F1 8F AD 43 A9 35 46 D1
##$RELAX= 
##$RELAX= 
##$RELAX= 
##$RELAX= 
##$RELAX= 
##$RELAX= 
$$ Bruker specific parameters
$$ --------------------------
##$DU= <F:/spectra>
##$EXPNO= 1
##$NAME= <H-F>
##$PROCNO= 1
##$TYPE= <nmr>
##$USER= <she>
##$AMP= (0..31)
100 100 100 100 100 100 100 100 100 100 100 100 100 100 100 100 100 100 
100 100 100 100 100 100 100 100 100 100 100 100 100 100 
##$AQSEQ= 0
##$AQ_mod= 1
##$AUNM= <au_zg>
##$AUTOPOS= <>
##$BF1= 200.13
##$BF2= 200.13
##$BF3= 200.13
##$BF4= 200.13
##$BF5= 200.13
##$BF6= 200.13
##$BF7= 200.13
##$BF8= 200.13
##$BYTORDA= 1
##$CFDGTYP= 0
##$CFRGTYP= 5
##$CHEMSTR= <none>
##$CNST= (0..31)
1 1 145 1 1 1 1 1 1 1 1 1 1 1 1 1 1 1 1 1 1 1 1 1 1 1 1 1 1 1 1 1 
##$CPDPRG= <>
##$CPDPRG1= <>
##$CPDPRG2= <>
##$CPDPRG3= <>
##$CPDPRG4= <mlev>
##$CPDPRG5= <mlev>
##$CPDPRG6= <mlev>
##$CPDPRG7= <mlev>
##$CPDPRG8= <mlev>
##$CPDPRGB= <>
##$CPDPRGT= <>
##$D= (0..31)
0 1.2 0 0 0 0 0 0 0 0 0 0.03 0 0 0 0 0 0 0 0 0 0 0 0 0 0 0 0 0 0 0 0 
##$DATE= 1568720276
##$DBL= (0..7)
120 120 120 120 120 120 120 120 
##$DBP= (0..7)
150 150 150 150 150 150 150 150 
##$DBP07= 0
##$DBPNAM0= <>
##$DBPNAM1= <>
##$DBPNAM2= <>
##$DBPNAM3= <>
##$DBPNAM4= <>
##$DBPNAM5= <>
##$DBPNAM6= <>
##$DBPNAM7= <>
##$DBPOAL= (0..7)
0.5 0.5 0.5 0.5 0.5 0.5 0.5 0.5 
##$DBPOFFS= (0..7)
0 0 0 0 0 0 0 0 
##$DE= 6
##$DECBNUC= <off>
##$DECIM= 24
##$DECNUC= <off>
##$DECSTAT= 4
##$DIGMOD= 1
##$DIGTYP= 9
##$DL= (0..7)
0 120 120 120 120 120 120 120 
##$DP= (0..7)
150 150 150 150 150 150 150 150 
##$DP07= 0
##$DPNAME0= <>
##$DPNAME1= <>
##$DPNAME2= <>
##$DPNAME3= <>
##$DPNAME4= <>
##$DPNAME5= <>
##$DPNAME6= <>
##$DPNAME7= <>
##$DPOAL= (0..7)
0.5 0.5 0.5 0.5 0.5 0.5 0.5 0.5 
##$DPOFFS= (0..7)
0 0 0 0 0 0 0 0 
##$DQDMODE= 0
##$DR= 18
##$DS= 0
##$DSLIST= <SSSSSSSSSSSSSSS>
$$ [...]
##$SUBNAM2= <"">
##$SUBNAM3= <"">
##$SUBNAM4= <"">
##$SUBNAM5= <"">
##$SUBNAM6= <"">
##$SUBNAM7= <"">
##$SUBNAM8= <"">
##$SUBNAM9= <"">
##$SW= 24.0689530833862
##$SWIBOX= (0..15)
0 0 2 0 0 0 0 0 0 0 0 0 0 0 0 0 
##$SW_h= 4816.95568400771
##$TD= 16384
##$TD0= 1
##$TE= 0
##$TE2= 300
##$TE3= 300
##$TEG= 300
##$TL= (0..7)
0 120 120 120 120 120 120 120 
##$TP= (0..7)
150 150 150 150 150 150 150 150 
##$TP07= 0
##$TPNAME0= <>
##$TPNAME1= <>
##$TPNAME2= <>
##$TPNAME3= <>
##$TPNAME4= <>
##$TPNAME5= <>
##$TPNAME6= <>
##$TPNAME7= <>
##$TPOAL= (0..7)
0.5 0.5 0.5 0.5 0.5 0.5 0.5 0.5 
##$TPOFFS= (0..7)
0 0 0 0 0 0 0 0 
##$TUNHIN= 0
##$TUNHOUT= 0
##$TUNXOUT= 0
##$USERA1= <user>
##$USERA2= <user>
##$USERA3= <user>
##$USERA4= <user>
##$USERA5= <user>
##$V9= 5
##$VALIST= <valist>
##$VCLIST= <CCCCCCCCCCCCCCC>
##$VD= 0
##$VDLIST= <DDDDDDDDDDDDDDD>
##$VPLIST= <PPPPPPPPPPPPPPP>
##$VTLIST= <TTTTTTTTTTTTTTT>
##$WBST= 1024
##$WBSW= 4
##$XGAIN= (0..3)
0 0 0 0 
##$XL= 0
##$YL= 0
##$YMAX_a= 293022
##$YMIN_a= -310738
##$ZGOPTNS= <>
##$ZL1= 120
##$ZL2= 120
##$ZL3= 120
##$ZL4= 120
##$ABSF1= 10
##$ABSF2= 0
##$ABSG= 5
##$ABSL= 3
##$ALPHA= 0
##$AQORDER= 0
##$ASSFAC= 0
##$ASSFACI= 0
##$ASSFACX= 0
##$ASSWID= 0
##$AUNMP= <proc_1d>
##$AZFE= 0.1
##$AZFW= 0.1
##$BCFW= 1
##$BC_mod= 2
##$BYTORDP= 1
##$COROFFS= 0
##$CY= 11.3945322036743
##$DATMOD= 1
##$DC= 2
##$DFILT= <>
##$DTYPP= 0
##$F1P= 20.1720416913024
##$F2P= 0.152960286110954
##$FCOR= 0.5
##$FTSIZE= 0
##$FT_mod= 4
##$GAMMA= 1
##$GB= 0.15
##$INTBC= 1
##$INTSCL= 1
##$ISEN= 128
##$LB= 0.24
##$LEV0= 0
##$LPBIN= 0
##$MAXI= 10000
##$MC2= 0
##$MEAN= 0
##$ME_mod= 0
##$MI= 1.114404
##$NCOEF= 0
##$NC_proc= 0
##$NLEV= 6
##$NOISF1= 3.799351
##$NOISF2= 2.8
##$NSP= 1
##$NTH_PI= 0
##$NZP= 0
##$OFFSET= 15.70392
##$PC= 1
##$PHC0= -9574.729
##$PHC1= 15.20096
##$PH_mod= 1
##$PKNL= yes
##$PPARMOD= 0
##$PSCAL= 0
##$PSIGN= 0
##$REVERSE= no
##$SF= 200.130013532006
##$SI= 16384
##$SIGF1= 3
##$SIGF2= 2
##$SINO= 400
##$SIOLD= 16384
##$SREGLST= <1H.CDCl3>
##$SSB= 0
##$STSI= 0
##$STSR= 0
##$SW_p= 3612.71676300578
##$SYMM= 0
##$S_DEV= 0
##$TDeff= 0
##$TDoff= 0
##$TI= <>
##$TILT= no
##$TM1= 0
##$TM2= 0
##$TOPLEV= 0
##$USERP1= <user>
##$USERP2= <user>
##$USERP3= <user>
##$USERP4= <user>
##$USERP5= <user>
##$WDW= 1
##$XDIM= 8192
##$YMAX_p= 0
##$YMIN_p= 0
$$ End of Bruker specific parameters
$$ ---------------------------------
##NTUPLES= NMR FID
##VAR_NAME=  TIME,          FID/REAL,        FID/IMAG
##SYMBOL=    X,             R,               I
##VAR_TYPE=  INDEPENDENT,   DEPENDENT,       DEPENDENT
##VAR_FORM=  AFFN,          ASDF,            ASDF
##VAR_DIM=   8192,          8192,            8192
##UNITS=     SECONDS,       ARBITRARY UNITS, ARBITRARY UNITS
##FACTOR=    0.0002076,     1,               1
##FIRST=     0,             0,               0
##LAST=      1.7004516,     0,               0
##MIN=       0,             -310738,         0
##MAX=       1.7004516,     293022,          0
$$ Real data points
##PAGE= N=1
##DATA TABLE= (X++(R..R)), XYDATA
$$ plain form
0 0 0 0 0 0 8 -8 8 -8 16 -16 16 -24 32 -39 42 -50 64 -78 88 -104 125 -145 168 -193 223 -256 292 -330 374
29 374 -425 478 -535 602 -675 752 -839 933 -1036 1151 -1275 1413 -1564 1731 -1916 2123
45 2123 -2355 2616 -2912 3253 -3649 4113 -4667 5350 -6203 7311 -8815 10987 -14412 20639
59 20639 -35619 147453 47074 -175820 216633 293022 -19404 -78508 246300 222310 -60470
70 -60470 -25127 254126 175433 -77114 2604 246692 137828 -82936 25181 217553 81876
81 81876 -72889 68187 185807 23246 -70957 79017 153748 8116 -62776 58585 125726
92 125726 7275 -66683 44294 114299 -13612 -79850 61625 110797 -57381 -92819 85559
103 85559 100623 -84667 -84661 92818 76214 -96190 -66471 99204 53890 -111000 -46682 121631
$$ packed form
0@%%%%Qj6J6j6K4l2L2m0N6p1Q1r2J14j42J66j92K29k70L13l61M16m79N48o22P04
29C74p99R03j013J137j277J427j591J772j969K187k426K688k977L295l647M039
45B123m478M971n528O165o902P762q780J0017j1553J3514j6126J9802k5399L5051
59B0639n6258J83072j00379k22894L92453P6389l12426n9104L24808k3990k82780
70f0470L5343K79253p8693k52547P9718K44088j08864k20764J08117J92372j35677
81H1876j54765J41076J17620j62561r4203J49974P4731j45632p0892J21361O7141
92A25726j18451p3958J10977P0005j27911o6238J41475M9172j68178l5438J78378
103H5559J5064j85290OJ77479j6604j72404K9719J65675m5314j64890O4318J68313
$$ plain form
115 121631 32509 -138395 -21977 144974 3942 -144677 19517 138990 -39123 -120076
125 -120076 64913 112678 -67767 -83735 91120 89949 -74076 -60752 97964 81858 -67755
136 -67755 -41121 102989 63339 -71016 -8918 117205 37468 -73701 21194 117391 19627
147 19627 -58844 35264 103510 20510 -40386 34904 94855 21136 -39549 43380 106899 8536
159 8536 -52542 60418 114190 -9390 -48331 78060 98898 -25171 -30507 87972 79676 -35470
171 -35470 -19285 96060 72962 -49224 -19569 107047 64382 -65505 -5458 116922 33945
182 33945 -76176 26240 115260 -3060 -71081 51002 97963 -24075 -57662 56805 79176
193 79176 -30299 -47398 58528 67300 -43021 -42564 70884 55334 -61252 -30719 80771
$$ packed form
115A21631q9122j70904J16418J66951j41032j48619J64194J19473j78113q0953
125a20076J84989M7765j80445j5968J74855j171j64025J3324J58716j6106j49613
136f7755K6634J44110l9650j34355O2098J26123p9737j11169R4895R6197r7764
147A9627p8471R4108O8246q3000o0896P5290N9951p3719o0685Q2929O3519r8363
159H536o1078J12960N3772j23580l8941J26391K0838j24069n336J18479q296j15146
171c5470J6185J15345k3098j22186K9655J26616m2665j29887O0047J22380q2977
182C3945j10121J02416Q9020j18320o8021J22083M6961j22038l3587J14467K2371
193G9176j09475j7099J05926Q772j10321M57J13448j5550j16586L0533J11490
$$ plain form
204 80771 33239 -68116 -11050 75138 12223 -60463 746 62104 3735 -53824 2192 60661
216 60661 913 -61820 5868 69199 -9486 -68306 20950 67926 -28991 -59888 39145 53945
228 53945 -42943 -46154 46433 43711 -45500 -40358 48770 41357 -50948 -37746 59111 35055 -64255
241 -64255 -23021 73108 13703 -73365 887 75463 -7519 -66964 16909 62011 -18200 -52868
253 -52868 23713 52822 -23295 -50153 29747 53569 -32814 -49449 43610 48324 -47944 -38583
265 -38583 55319 32372 -53325 -19564 54602 14992 -49309 -9209 50020 12109 -46504 -8768
277 -8768 52383 10548 -52041 -1314 60242 -2068 -56367 16423 59569 -20445 -49372 32141
289 32141 48985 -28950 -37992 35069 40909 -28891 -32930 37259 40055 -34182 -31647 48938 35825
$$ packed form
204H0771m7532j01355N7066Q6188o2915p2686O1209O1358n8369n7559N6016N8469
216F0661n9748o2733O7688O3331p8685n8820Q9256M6976r6917l0897R9033J4800
228E3945r6888l211R2587k722q9211N142Q9128p413r2305J3202R6857k4056r9310
241f4255M1234R6129n9405q7068P4252P4576q2982n9445Q3873M5102q0211l4668
253e2868P6581K9109p6117k6858P9900K3822q6383j6635R3059M714r6268R361
265c8583R3902k2947q5697L3761P4166l9610o4301M0100N9229l7911n8613L7736
277h768O1151m1835o2589N0727O1556o2310n4299P2790M3146q0014k8927Q1513
289C2141J6844p7935r042P3061N840o9800m039P0189K796p4237K535Q0585j3113
$$ plain form
302 35825 -48035 -22044 60699 20377 -54519 -3334 60236 2569 -49231 8889 51422 -4834
314 -4834 -42103 11910 48230 -8279 -44995 16920 51925 -18556 -47137 30408 46709 -34662
326 -34662 -37880 42502 32381 -42401 -23970 42617 19434 -40872 -17483 39560 16673 -41247
338 -41247 -16943 42892 12164 -49589 -8624 50793 -1436 -54681 6959 49179 -17412 -47767
350 -47767 18907 38795 -23778 -38156 20021 32644 -24503 -35997 22671 33499 -30958 -37002
362 -37002 33387 30510 -42607 -27717 43910 16963 -47887 -12014 43761 3775 -43242 -2317
374 -2317 39456 -149 -39784 -710 40306 -1451 -43569 5671 45679 -12145 -45796 20572
386 20572 43941 -26527 -37159 32199 32246 -32595 -24730 33739 23210 -30286 -19795 33013 21990
$$ packed form
302C5825q3860K5991Q2743m0322p4896N1185O3570n7667n1800N8120M2533n6256
314d834l7269N4013L6320n6509l6716O1915L5005p0481k8581P7545J6301q1371
326c4662l218Q0382j0121p4782J8431O6587k3183o0306K3389N7043k2887n7920
338d1247K4304N9835l0728o1753M0965N9417n2229n3245O1640M2220o6591l0355
350d7767O6674J9888o2573j4378N8177J2623n7147j1494N8668J0828o4457o044
362c7002P0389k877p3117J4890P1627k6947o4850L5873N5775l9986m7017M0925
374b317M1773l9605l9635L9074M1016m1757m2118M9240M0008n7824l3651O6368
386B0572K3369p0468j0632O9358M7o4841P865N8469j0529n3496J0491N2808j1023
$$ plain form
399 21990 -32783 -18252 39924 18521 -42001 -10020 47923 5872 -45530 4739 46039 -7858
411 -7858 -38953 14387 37281 -12659 -31701 15619 33554 -13339 -32320 18054 35715 -20544
423 -20544 -33797 28488 32234 -32636 -25670 37156 19990 -37654 -13314 36797 9081 -34875
435 -34875 -7259 32591 6390 -34084 -7460 34913 3706 -40151 -1515 40722 -7320 -43882
447 -43882 11475 38305 -21156 -37166 21200 28072 -26433 -27506 22003 20805 -25946 -25576 22383
460 22383 21275 -30851 -25457 29898 17280 -39882 -17675 37822 5246 -43422 -4086 35545
472 35545 -6452 -37753 4006 29530 -9285 -32541 4804 28341 -9867 -34329 8815 31583
484 31583 -17179 -34931 19948 29498 -27887 -26575 29485 19774 -31303 -15747 29784 12394 -27672
$$ packed form
399B1990n4773J4531N8176k1403o0522L1981N7943m2051n1402N0269M1300n3897
411g858l1095N3340K2894m9940j9042M7320J7935m6893j8981N0374J7661n6259
423b0544j3253O2285L746o4870O966O2826j7166n7644K4340N0111k7716m3956
435c4875K7616L9850k6201m0474K6624M2373l1207m3857L8636M2237m8042l6562
447d3882N5357K6830n9461j6010N8366O872n4505j073M9509j198m6751L70M7959
460B2383j108n2126N394N5355j2618n7162K2207N5497l2576m8668L9336L9631
472C5545m1997l1301M1759K5524l8815k3256L7345K3537l8208k4462M3144K2768
484C1583m8762j7752N4879R550n7385J312N6060r711n1077J5556M5531j7390m0066
$$ plain form
497 -27672 -10757 28193 12211 -28060 -9603 33678 10547 -34318 -2687 40302 938 -36127
509 -36127 10458 39269 -10210 -29295 19483 31307 -14081 -21473 20599 27393 -14193 -20608 22880
522 22880 28148 -19068 -20582 31287 25060 -28192 -12885 37779 13862 -31321 -1647 35793 3690
535 3690 -27032 3678 30054 1003 -24839 2958 29861 -1066 -28832 6597 33012 -9323
547 -9323 -30819 16781 29963 -20771 -25520 23259 20629 -24483 -17452 22157 14159 -22711 -15698
560 -15698 21740 14055 -26203 -15899 26960 10697 -33640 -9501 33104 373 -36299 1962
572 1962 30634 -10529 -30713 9320 24068 -13679 -26076 9761 21789 -14259 -25528 12853
584 12853 22913 -20666 -25612 21425 19255 -28977 -17994 27838 9247 -30936 -7773 25427
$$ packed form
497b7672J6915L8950j5982m0271J8457M3281k3131m4865L1631M2989l9364l7065
509c6127M6585K8811m9479j9085M8778J1824m5388p392M2072O794m1586o415M3488
522B2880N268m7216j514N1869o227n3252J5307N0664k3917m5183K9674L7440l2103
535C690l0722L0710K6376k9051k5842K7797K6903l0927k7766L5429K6415m2335
547i323k1496M7600J3182n0734m749M8779k630m5112P031L9609p998l6870P013
560a5698L7438p685m0258J0304M2859j6263m4337K4139M2605l2731l6672L8261
572A962K8672m1163k0184M0033J4748l7747j2397L5837J2028l6048j1269L8381
584A2853J0060m3579m946M7037k170m8232J0983M5832j8591m0183K3163L3200
$$ plain form
596 25427 1515 -26067 -3765 21971 654 -25045 -3641 23723 -325 -29081 526 27499
608 27499 -8653 -30208 10235 24705 -17994 -25066 16129 17556 -19845 -19119 14923 14269 -18554
621 -18554 -18240 15475 14670 -22713 -18510 22974 12343 -30738 -11888 28862 2443 -32569 -995
634 -995 27023 -6945 -28139 5460 22380 -8629 -24221 5924 22087 -9341 -25206 10240
646 10240 24205 -15932 -24259 19127 20212 -23802 -16691 24842 11462 -24424 -7197 23067 5675
659 5675 -20307 -3597 20795 5642 -19992 -3716 24262 4785 -24125 774 27885 -2274
671 -2274 -24509 10286 25774 -9865 -18851 15466 20287 -11143 -14052 14253 18146 -9953 -14900
684 -14900 15613 19915 -14757 -15496 22865 17128 -22900 -10034 28245 8258 -24870 -848 25998
$$ packed form
596B5427k3912k7582K2302K5736k1317k5699K1404K7364k4048k8756K9607K6973
608B7499l6152k1555M0443J4470m2699p072M1195J427l7401P26L4042o54l2823
621a8554L14L3715q05l7383M203M1484j0631m3081J8850M0750k6419l5012L1574
634i95K8018l3968k1194L3599J6920l1009j5592L0145J6163l1428j5865L5446
646A0240J3965m0137q327M3386J085m4014P111M1533j3380l5886J7227L0264j7392
659E675k5982J6710K4392j5153k5634J6276K7978j9477k8910K4899K7111l0159
671b274k2235L4795J5488l5639q986L4317M821l1430k909K8305L893k8099m947
684a4900L0513M302l4672p39L8361n737m0028J2866L8279j9987l3128K4022K6846
$$ plain form
697 25998 494 -21452 3666 22112 -2009 -20751 3315 22588 -3800 -23875 6952 24263
709 24263 -11656 -23722 15287 19673 -20705 -17568 19643 10600 -21636 -10091 17236 5243 -19167
722 -19167 -8213 15662 5038 -20866 -8771 19489 3007 -25503 -3637 22098 -4679 -25258
734 -25258 4585 19169 -11386 -19905 8219 14126 -10799 -16136 6670 13373 -9394 -17437 8947
747 8947 15936 -14092 -17560 16629 14269 -20928 -11720 22237 7606 -21928 -3474 20847 1742
760 1742 -18382 61 19448 1545 -18269 481 21947 210 -21209 5863 24731 -7249
772 -7249 -20543 14936 21133 -14394 -13584 19737 14128 -14636 -7215 17593 10427 -12296 -5691 17825
786 17825 10820 -14262 -5314 22216 8900 -18544 370 24863 1493 -17943 7760 21504
$$ packed form
697B5998k5504k1946K5118J8446k4121j8742K4066J9273k6388k0075L0827J7311
709B4263l5919j2066L9009M386m0378L137L7211r043l2236J1545K7327j1993k4410
722a9167J0954K3875j0624k5904J2095K8260j6482k8510K1866K5735k6777k0579
734b5258K9843J4584l0555q519K8124N907k4925n337K2806O703k2767q043K6384
747H947O989l0028l468L4189k360l5197R208L3957j4631k9534J8454K4321j9105
760A742k0124J8443J9387j7903j9814J8750K1466k1737k1419K7072J8868l1980
772g249j3294L5479O197l5527Q10L3321n609k8764P421K4808p166k2723O605K3516
786A7825p005k5082Q948K7530j3316k7444J8914K4493k3370j9436K5703J3744
$$ plain form
798 21504 -3514 -12628 10548 17072 -2798 -10521 8117 17753 -2207 -12220 10466 20072 -7866
811 -7866 -13186 17465 17358 -14645 -8463 21106 10650 -15432 -2673 19234 6059 -13435 -1419
824 -1419 17753 5795 -15369 -2044 20861 3491 -19692 2877 22767 -5167 -20075 10304
836 10304 18358 -12814 -14886 13365 11379 -13881 -10942 11096 8009 -13078 -11293 10878 7951
849 7951 -16887 -11602 14996 4587 -21587 -6784 16459 -2895 -21179 -636 12759 -7492
861 -7492 -16915 820 8838 -6612 -15839 -811 10399 -6503 -18626 1881 12651 -11648 -18681
874 -18681 8792 10409 -17179 -13611 12377 5343 -16723 -8316 11085 2995 -14463 -7571 11585
887 11585 4584 -16235 -6597 16305 2624 -19770 -419 19524 -4494 -18704 7981 16783 -9939
$$ packed form
798B1504k5018r114K3176O524j9870p723J8638R636j9960j0013K2686R606k7938
811g866n320L0651j07l2003O182K9569j0456k6082J2759K1907j3175j9494J2016
824a419J9172j1958k1164J3325K2905j7370k3183K2569J9890k7934j4908L0379
836A0304Q054l1172k072K8251j986k5260K939K2038l087k1087J785K2171k927
849G951k4838N285K6598j0409k6174J4803K3243j9354j8284K0543J3395k0251
861g492r423J7735Q018j5450r227J5028J1210j6902j2123K0507J0770k4299p033
874a8681K7473J617k7588L568K5988p034k2066Q407J9401q090j7458O892J9156
887A1585p001k0819R638K2902j3681k2394J9351J9943k4018j4210K6685Q802k6722
$$ plain form
900 -9939 -12692 11119 12156 -9005 -9016 10294 11088 -7962 -9264 11930 12255 -11366 -8104 16900
914 16900 9061 -14826 -2064 18779 2648 -13580 3001 15177 -430 -9641 3849 12459 878
927 878 -9430 2414 14608 421 -12766 5258 17357 -5012 -13346 11124 14075 -10146 -8624
940 -8624 13427 8874 -9868 -5090 11442 7124 -9132 -6044 11817 8156 -12422 -6040 16448
953 16448 5145 -16788 -362 18724 -2435 -16634 6064 14915 -6981 -11742 8049 10355 -7058
966 -7058 -9620 6266 10245 -6783 -10918 8227 11501 -11150 -10510 12991 7086 -15174 -5144 14136
980 14136 1126 -13841 -199 10653 -1047 -10518 -539 8862 212 -11264 -1692 11817 -1030
993 -1030 -14366 1398 13846 -6240 -14805 7133 10909 -10207 -9848 8829 6206 -9835 -7480
$$ packed form
900i939k753K3811J037k1161j1J9310P94j9050j302K1194L25k3621L262K5004
914A6900p839k3887J2762K0843j6131j6228J6581J2176j5607r211J3490Q610j1581
927H78j0308J1844J2194j4187j3187J8024J2099k2369q334K4470K951k4221J522
940h624K2051m553j8742M778J6532m318j6256L088J7861l661k0578O382K2488
953A6448j1303k1933J6426J9086k1159j4199K2698Q851k1896m761J9791K306j7413
966g058k562J5886L979j7028m135J9145L274k2651O40K3501n905k2260J0030J9280
980A4136j3010j4967J3642J0852j1700r471R979R401q650j1476R572J3509j2847
993a030j3336J5764J2448k0086q565K1938L776k1116L59J8677k623j6041K355
$$ plain form
1006 -7480 7328 5603 -8809 -8524 8130 7310 -12281 -8124 13449 4376 -16492 -2147 15361
1019 15361 -2094 -15432 3592 12136 -5118 -10703 4658 9395 -4072 -9574 3758 10715 -4376
1032 -4376 -11133 6772 11919 -8565 -10017 11898 8681 -12123 -4209 13308 3129 -10525 -124
1045 -124 10671 1735 -7781 -879 9871 3831 -8925 -1082 13028 2202 -12188 2987 14946
1058 14946 -2947 -11215 8030 11686 -6573 -6995 8537 7918 -5684 -5313 6944 7742 -5288 -7199
1072 -7199 8397 9321 -9170 -6910 12884 6132 -13481 -2062 14284 -158 -12339 2302 10805
1085 10805 -2885 -9257 2671 8357 -1925 -9521 1102 10106 -3328 -12079 4260 11069 -8370
1098 -8370 -11035 9191 7081 -11628 -5921 9952 2179 -10113 -3113 6989 1191 -8571 -4362 6961
$$ packed form
1006g480J4808j725j4412K85J6654q20j9591M157K1573r073k0868J4345J7508
1019A5361j7455j3338J9024Q544j7254n585J5361M737j3467n502J3332O957j5091
1032d376o757J7905N147k0484j452K1915l217k0804P914J7517j0179j3654J0401
1045a24J0795q936r516O902J0750o040j2756P843J4110j0826j4390J5175J1959
1058A4946j7893q268J9245L656j8259m22J5532o19j3602L71J2257P98j3030j911
1072g199J5596R24j8491K260J9794o752j9613J1419J6346j4442j2181J4641Q503
1085A0805j3690o372J1928N686j0282p596J0623R004j3434q751J6339O809j9439
1098h370k665K0226k110j8709N707J5873p773j2292P000J0102n798r762M209J1323
$$ plain form
1112 6961 3120 -10515 -4541 10496 721 -13906 -83 11527 -4537 -12125 4416 8255 -6948
1125 -6948 -7899 4754 5603 -5638 -7130 3539 6535 -5345 -8899 5786 8229 -9613 -8603 10323
1139 10323 4992 -12721 -3566 11357 -232 -11245 250 8452 -1773 -8444 82 7239 -568
1152 -568 -9711 -763 9707 -2243 -11874 3312 10543 -7163 -10347 7825 6990 -10208 -5793 8229
1166 8229 2428 -8105 -3391 5717 2546 -7220 -5105 6505 3822 -9646 -4634 9746 1492 -12367
1180 -12367 -177 10666 -3643 -10663 3629 7059 -5265 -6626 3126 4960 -3621 -6552 2137
1193 2137 6624 -4081 -9138 4854 8033 -7951 -8149 9485 4847 -10885 -3285 9873 444 -9161
1207 -9161 31 7391 240 -7021 -616 7139 1262 -8440 -854 10101 -791 -10979 3565 10919
$$ packed form
1112F961l841j3635N974J5037r775j4627J3823J1610j6064p588J6541L839j5203
1125f948r51J2653Q49j1241j492J0669K996j1880l554J4685K443j7842J010J8926
1139A0323n331j7713R155J4923j1589j1013J1495Q202j0225o671Q526P157p807
1152e68r143Q948J0470j1950r631J5186P231j7706l184J8172q35j7198M415J4022
1166H229n801j0533M714R108l171r766K115J1610k683j3468N012J4380q254j3859
1180a2367J2190J0843j4309p020J4292L430j2324j361R752J834q581k931Q689
1193B137M487j0705n057J3992L179j5984j98J7634m638j5732P600J3158r429r605
1207i161R192P360p151p261O405P755n877r702P586J0955j0892j0188J4544P354
$$ plain form
1221 10919 -5934 -9078 7401 7002 -8035 -4580 7336 3083 -5884 -3137 5204 3564 -5623 -5038
1235 -5038 6711 4855 -8886 -4419 9523 1669 -11379 -66 9451 -3038 -9185 2723 6018
1248 6018 -4095 -6392 1883 4345 -2628 -7030 711 6709 -3754 -9658 3693 7432 -8077 -8597
1262 -8597 7142 3683 -10373 -4441 7656 306 -8521 -2263 4950 76 -6970 -3172 5091 1137
1276 1137 -9254 -2807 8362 -1365 -11331 1930 9027 -6155 -9307 5418 5357 -7080 -5304 5102
1290 5102 3267 -5066 -4288 3669 4018 -4786 -5797 5573 5171 -8104 -4469 9017 2084 -9545 -53
1305 -53 9223 -1931 -7601 2773 6149 -2095 -4680 1673 5444 -226 -5837 1270 7849 -1884 -7720
1320 -7720 4216 8493 -5589 -6448 7859 5103 -7038 -2134 7529 1976 -5394 -1030 5410 2726
$$ packed form
1221A0919j6853l144J6479l99j5037L455J1916m253q967K747Q341j640r187N85
1235e038J1749j856j3741M467J3942p854j3048J1313R517j2489o147J1908L295
1248F018j0113k297Q275K462o973m402P741N998j0463n904J3351L739j5509n20
1262h597J5739l459j4056N932J2097p350q827O258P213m874p046L798Q263l954
1276A137j0391O447J1169r727r966J3261P097j5182l152J4725o1j2437J776J0406
1290E102j835q333P78P957L49q804j011J1370m02j3275L635J3486o933j1629R492
1305e3R276j1154n670J0374L376q244k585O353L771n670n611P107O579r733n836
1320g720J1936M277j4082q59J4307k756j2141M904R663n553p370M364O440k684
$$ plain form
1334 2726 -4684 -2299 6423 3516 -7062 -1816 9450 575 -9550 2258 9395 -3716 -7375 5054
1348 5054 5843 -5062 -4312 4197 3789 -3590 -4643 3146 5367 -3990 -6063 5003 5382 -7507 -4396
1363 -4396 8039 1866 -9291 -525 7796 -2062 -7035 1097 4418 -1741 -5334 -380 4292 -671
1377 -671 -6636 -552 6476 -2097 -8692 2745 6685 -5876 -6904 5620 3345 -7117 -3299 4963
1391 4963 1330 -5199 -2691 3790 2336 -4870 -4234 5397 2795 -7620 -3142 8060 418 -9151 1290
1406 1290 8084 -3118 -7209 3680 5433 -3358 -4278 2808 3865 -2139 -4432 2633 5909 -3100 -5920
1421 -5920 5419 6362 -6383 -3607 8667 2707 -7362 497 7815 -191 -4996 1675 5106 579
1435 579 -3354 391 5675 1601 -5008 658 7887 -620 -6633 3800 7878 -3816 -4633 6162 4348
$$ packed form
1334B726p410K385Q722k907j0578N246J1266q875j0125J1808P137j3111l659J2429
1348E054P89j0905P50Q509m08p379j053P789K221r357k073J1066L79j2889L111
1363d396J2435o173j1157Q766Q321r858m973Q132L321o159l593M954M672m963
1377f71n965O084P028q573o595J1437L940j2561j028J2524k275j0462L818Q262
1391D963l633o529K508O481j454p206O36R631k602j0415M478J1202p642r569J0441
1406A290O794j1202m091J0889J753q791r20P086J057o004k293P065L276r009k820
1421e920J1339R43j2745K776J2274n960j0069P859P318q006m805O671L431m527
1435E79l933L745N284m074o609N666P229q507o013J0433M078j1694q17J0795j814
$$ plain form
1450 4348 -4278 -1697 5118 2473 -2759 -1958 3647 4054 -2996 -3765 5639 4451 -5996 -2618 8267
1465 8267 1137 -7793 1067 7770 -2253 -5949 3104 4705 -2248 -3864 2009 3937 -1387 -5155 1899
1480 1899 5913 -3072 -6656 4389 5376 -6458 -4240 6638 1455 -7659 -943 5390 -1315 -5313
1494 -5313 -138 3144 -589 -4125 -1632 3428 675 -6524 -1229 5945 -1873 -7813 1795 5255 -5007
1509 -5007 -5716 3489 2230 -4832 -2783 2312 1393 -3094 -3744 1559 3034 -3796 -5439 3758 3489 -6885
1525 -6885 -3773 6515 439 -7980 339 5965 -2097 -5545 1682 3467 -1866 -4150 508 3833 -964
1540 -964 -5301 1186 5974 -3187 -6076 4369 5471 -5905 -3615 6692 2084 -5819 -129 5310
1554 5310 372 -3892 -109 3899 1209 -2847 -1221 4920 2357 -4777 -70 6906 36 -5844 3021
$$ packed form
1450D348q626K581O815k645n232Q01N605M07p050p69R404j188j0447L378J0885
1465H267p130q930Q860O703j0023l696R053J601o953j616N873J928n324l768P054
1480A899M014q985l584J1045R87j1834K218J0878n183r114O716O333o705l998
1494e313N175L282l733l536K493N060k753p199N295P174p818n940R608L460j0262
1509e007p09R205j259p062K049N095r19m487o50N303J475o830j643R197k69j0374
1525f885L112J0288o076q419Q319N626q062l448P227J785n333k284M658L325m797
1540i64m337O487M788r161k889J0445J102j1376K290J0307m608p903N690N439
1554E310m938m264L783M008k690m056J626O141k563p134M707O976o870n880Q865
$$ plain form
1569 3021 6268 -2883 -3316 4276 3624 -2572 -1415 3082 3197 -1105 -2494 2592 4689 -2057 -4392 4859
1585 4859 4962 -5298 -2522 7066 1735 -6036 766 5861 -712 -4064 1187 3980 -649 -3665 131
1600 131 4018 -2 -5351 789 5818 -2579 -6181 3584 5152 -5464 -3936 5180 1412 -5817 -1115
1615 -1115 3494 -221 -3944 -1629 1954 812 -4262 -2960 3336 849 -6317 -1753 5070 -1962 -6485
1630 -6485 1235 3629 -3735 -4563 2092 1536 -3335 -3235 391 1479 -1798 -4283 458 3541 -3541 -5659
1646 -5659 3173 3198 -6072 -3535 5225 416 -6359 -389 3567 -1270 -4468 -97 2633 -433 -3882
1661 -3882 -1008 3932 252 -5396 472 5606 -2398 -5846 3430 4557 -4475 -3617 4497 1901 -4058
1676 -4058 -1065 3574 990 -2630 -991 2706 2339 -2408 -2023 4356 2294 -4992 -371 6136 13
$$ packed form
1569C021L247r151m33P592o52o196J157M497J15m302j389N086K097o746k335R251
1585D859J03j0260K776R588n331p771O802N095o573l352N251K793m629l016L796
1600A31L887m020n349O140N029q397l602R765J568j0616J528R116l768p229M702
1615a115M609l715l723K315L583j142n074J302O296k487p166M564O823p032m523
1630f485P720K394p364q28O655n56m871J00L626J088l277k485M741L083p082k118
1646e659Q832K5r270K537Q760m809o775N970L956m837l198M371K730l066l449
1661c882K874M940l680n648N868N134q004l448R276J127r032Q58Q114k596n959
1676d058K993M639k584l620J639L697l67m747L85O379k062p286M621O507o123
$$ plain form
1691 13 -4720 2403 4767 -1938 -2662 3056 2914 -864 -1560 1306 3589 103 -3250 1676 5016 -1599
1707 -1599 -3786 4495 4180 -4232 -1972 5694 1439 -4313 512 4760 450 -2548 454 3434 1231
1722 1231 -2851 -547 4723 1240 -4750 835 5991 -1443 -4949 3372 4639 -3808 -2695 4187 2018
1737 2018 -3305 -938 2504 1656 -1838 -1800 2105 2630 -2585 -2607 4104 2176 -4825 -1016 5552 -384
1753 -384 -4912 1525 4017 -1896 -2715 1365 1804 -894 -2601 138 2878 -157 -3890 727 4187 -2227
1769 -2227 -4194 3335 3384 -4409 -1816 4708 948 -4022 -181 3431 229 -2269 -631 2629 1787 -3024
1785 -3024 -1326 4425 1263 -4809 443 5696 -1013 -4375 3233 4074 -3122 -2261 3445 2133 -2029
1800 -2029 -458 2706 2288 -595 -1691 2636 3574 -2113 -1628 4648 3040 -4029 -182 5770 453 -3247
$$ packed form
1691A3m733P123K364o705p24N718j42l778o96K866K283l486l353M926L340o615
1707a599k187Q281l15q412K260P666m255n752M825M248m310k998L002K980k203
1722A231m082K304N270l483n990N585N156p434l506Q321J267q447J113O882k169
1737B018n323K367L442q48l494L8L905N25n215k2O711j928p001L809O568n936
1753c84m528O437K492n913q19M080M39k698j707K739K740l035l733M617L460o414
1769b227j967P529M9p793K593O524l760m970L841L612l202k498J638L260q42m811
1785c024J698N751l162o072N252N253o709l362P608Q41p196Q61N706j312m162
1800b029J571L164m18k883j096M327R38n687M85O276j608p069L847N952n317l700
$$ plain form
1816 -3247 2352 4399 -479 -1434 2188 3100 817 -1291 1004 4064 1345 -2662 1828 5245 -1023
1831 -1023 -2886 4179 3989 -2847 -757 5133 2019 -2310 619 3684 1899 -828 -279 3088 2724 -1941
1847 -1941 -779 5257 2239 -3838 693 5928 -425 -3635 2892 3839 -1987 -1759 3214 2412 -1122 -848
1863 -848 1715 2856 -1084 -2353 2104 3062 -2829 -2736 4235 2423 -4495 -760 4517 -468 -3517 1030
1879 1030 2991 -1179 -2130 409 1657 150 -2379 -373 2810 -328 -3889 633 4069 -1970 -4083
1894 -4083 2954 2506 -3634 -1826 3449 754 -2776 -669 2036 885 -1520 -1677 1956 2195 -2352 -1950
1910 -1950 4039 1342 -4061 223 4981 -532 -3337 2340 3471 -1544 -1277 2589 2645 -327 -682 1913
1926 1913 3306 205 -1638 3027 4645 -1467 -1780 5137 3215 -2861 497 5444 1115 -1645 2102
$$ packed form
1816c247N599K047m878r55L622R12k283k108K295L060k719m007M490L417o268
1831a023j863P065j90o836K090N890l114m329K929L065j785k727N49L367l64m665
1847a941J162O036l018o077M531N235o353l210O527R47n826K28M973q02l534K74
1863h48K563J141l940j269M457R58n891R3O971j812o918L735N277m985l049M547
1879A030J961m170r51K539J248j507k529K006L183l138l561M522L436o039k113
1894d083P037m48o140J808N275k695l530K107K705j151k405j57L633K39m547M02
1910a950N989k697n403M284M758n513k805N677J131n015K67L866N6k972l55K595
1926A913J393l101j843M665J618o112l13O917j922o076L358M947m329k760L747
$$ plain form
1941 2102 3882 867 -355 1694 3405 2266 -853 1098 4639 1711 -2137 2188 5235 -367 -2096
1956 -2096 4425 3673 -1835 -17 3972 1720 -975 406 2562 2344 -115 -586 2628 2913 -1659 -1100
1972 -1100 4007 2072 -3347 527 4350 -219 -3206 2196 2463 -1409 -1759 1236 1931 -573 -1891 276
1988 276 2578 -149 -3213 1317 3489 -2622 -3013 3379 2153 -4006 -953 3317 -103 -3075 255
2003 255 2171 -355 -1547 -129 1673 882 -2304 -817 3315 568 -3185 1435 4167 -1629 -2762
2018 -2762 3129 2778 -1994 -453 2720 1435 -662 -234 1774 2243 -18 -1160 2581 2997 -1442 -900
2034 -900 4555 2431 -2350 1196 4495 650 -1419 2593 3443 -10 -47 2001 3304 1604 -365 1369
2050 1369 4245 1163 -1665 2788 5027 -1049 -1032 4886 3490 -2008 769 4612 1298 -881 1743
$$ packed form
1941B102J780l015j222K049J711j139l119J951L541k928l848M325L047n602j729
1956b096O521p52n508J818L989k252k695J381K156k18k459m71L214K85m572N59
1972a100N107j935n419L874L823m569k987N402K67l872l50K995O95k504j318K167
1988B76K302k727l064M530K172o111l91O392j226o159L053M270l420k972L330
2003B55J916k526j192J418J802p91l186J487M132k747l753M620K732n796j133
2018b762N891l51m772J541L173j285k097M28K008M69k261j142L741M16m439N42
2034i00N455k124m781L546L299l845k069M012Q50l453l7K048J303j700j969J734
2050A369K876l082k828M453K239o076J7N918j396n498K777L843l314k179K624
$$ plain form
2065 1743 3164 1924 68 641 3351 2475 -1051 643 4649 1542 -2449 2237 4512 -372 -1524
2080 -1524 3188 3011 -1153 -38 2852 1796 53 -5 1056 2383 -138 -1570 2101 3254 -1965 -1620
2096 -1620 3606 1429 -3281 331 3638 -425 -2125 1227 1818 -636 -1370 328 1663 270 -2564
2111 -2564 -420 2940 -776 -3437 1108 3298 -2442 -2882 2667 1058 -3268 -1196 2054 -208 -2399
2126 -2399 -758 1019 103 -1995 -1504 1335 737 -3207 -1168 2612 -141 -3869 134 2705 -2077 -2757
2142 -2757 1684 1290 -2045 -1381 629 647 -674 -1638 -76 1624 -577 -2303 1066 2261 -2242 -1890
2158 -1890 2951 1269 -2860 204 2972 83 -1741 1024 1918 409 -619 34 2154 1175 -1735 284
2174 284 3632 463 -2471 2009 3727 -1296 -1207 3281 2083 -1788 436 2863 1229 -522 302 2193
$$ packed form
2065A743J421j240j856N73K710q76l526J694M006l107l991M686K275m884j152
2080a524M712j77m164J115K890j056j743n8J061J327k521j432L671J153n219L45
2096a620N226k177m710L612L307m063j700L352N91k454p34J698J335j393k834
2111b564K144L360l716k661M545K190n740m40N549j609m326K072L250k262k191
2126b399J641J777r16k098M91K839n98l944K039L780k753l728M003K571m782o80
2142b757M441l94l335O64K010J8j321r64J562J700k201j726L369J195m503L52
2158a890M841j682m129L064K768k889j824K765Q94j509j028O53K120r79k910K019
2174B84L348l169k934M480J718n023Q9M488j198l871K224K427j634j751Q24J891
$$ plain form
2190 2193 2161 -271 -367 3105 2637 -1510 -46 4151 1193 -2023 2102 3874 -409 -1100 2604 2256 101
2207 101 260 1675 1975 574 -459 995 2665 263 -1533 1923 2703 -1624 -1202 3221 1398 -2201
2223 -2201 574 2628 110 -1707 712 1423 272 -1140 -656 1592 894 -2473 -420 2896 -353 -3486
2239 -3486 907 2612 -2452 -2413 2075 762 -2844 -882 945 -186 -1966 -1468 203 550 -1842 -2180
2255 -2180 955 652 -3306 -1712 2284 -480 -3835 109 1749 -1963 -2225 613 510 -1786 -1312 -202
2271 -202 824 -366 -1912 -414 1795 -794 -2807 1080 2156 -2284 -1695 2886 628 -2600 -55
2286 -55 1922 -140 -1263 175 1343 926 -639 -400 1787 1504 -1839 -190 3518 377 -2184 1725
2302 1725 3197 -1222 -996 2646 2205 -794 521 2307 1511 50 223 1628 2281 -296 -958 2727
$$ packed form
2190B193l2k432r6L472m68m147J464M197k958l216M125J772m283o91L704l48k155
2207A01J59J415L00j401j033J454J670k402j796L456P80m327M22M423j823l599
2223b201K775K054k518j817K419P11j151j412M84K248o98l367K053L316l249l133
2239c486M393J705n064L9M488j313l606J962J827j131j780M98J671L47k392l38
2255b180L135l03l958J594L996k764l355L944J640l712k62K838j03k296M74J110
2271b02J026j190j546J498K209k589k013L887J076m440N89M581k258l228K545
2286e5J977k062j123J438J168m17j565K39K187k83l343J649L708l141k561L909
2302A725J472m419K26L642m41k999J315J786p96j461J73J405O53k577o62L685
$$ plain form
2318 2727 2672 -1539 -224 3829 1211 -1599 1901 3256 -240 -262 2037 1723 -26 466 868 1995 1014
2335 1014 -1020 419 3079 185 -1706 2030 2936 -1450 -995 2862 1269 -1410 343 1854 222
2350 222 -677 310 1195 1066 -537 -1112 1863 1311 -2573 -297 3114 -21 -2798 989 2202 -1679 -1773
2367 -1773 1318 635 -1489 -807 497 474 -874 -1678 386 1148 -1607 -2519 1001 1091 -3004 -1585 2006
2384 2006 -802 -3316 -360 733 -2025 -2333 -217 -124 -1249 -1900 -1305 -183 -810 -2896 -1073 1283
2400 1283 -1618 -3512 176 763 -3383 -2712 905 -966 -2981 -1148 -214 -1128 -1696 -1670 -722 -206 -2489
2417 -2489 -2632 327 221 -3423 -1959 1827 -1300 -3320 24 1213 -2342 -2155 404 395 -1353 -1054 -311
2434 -311 642 -535 -1474 433 1570 -1215 -1730 1736 1547 -2215 -544 2972 380 -1717 944 2160
$$ packed form
2318B727n5m211J315M053k618k810L500J355l496k2K299l14j749M92M02J127r81
2335A014k034J439K660k894j891L736R06m386M55L857j593k679J753J511j632
2350B22q99R87Q85j29j603n75K975n52l884K276L411l135k777L787J213l881r4
2367a773L091o83k124O82J304k3j348q04K064P62k755r12L520R0m095J419L591
2384B006k808k514K956J093k758l08K116R3j125o51N95J122o27k086J823K356
2400A283k901j894L688N87m146O71L617j871k015J833R34r14n68K6R48N16k283
2417b489j43K959j06l644J464L786l127k020L344J189l555J87K559rj748K99P43
2434c11R53j177r39J907J137k785n15L466j89l762J671L516k592k097K661J216
$$ plain form
2450 2160 -259 -341 1154 1469 1067 -184 329 2085 1397 -976 790 3373 128 -1541 2075 2411 -1004
2467 -1004 -2 2462 982 -709 693 1321 419 99 -139 851 1505 -612 -1507 1862 1307 -2234 -346
2484 -346 2593 -556 -2659 673 1505 -1591 -1784 266 223 -1132 -1331 -804 -80 -796 -2698 -813 672
2501 672 -2492 -3245 403 423 -3299 -2361 765 -1782 -3436 -1071 -179 -2215 -2499 -1606 -997 -1005 -2365 -2173
2519 -2173 -186 -1150 -3440 -1504 684 -2092 -3482 140 280 -2919 -1791 396 -951 -2327 -869
2534 -869 -240 -385 -1080 -1257 -167 1162 -1115 -1742 1295 898 -2138 -773 1970 -214 -1955 876 1302
2551 1302 -1097 -405 845 750 42 -282 72 1579 605 -1503 701 2638 -488 -1683 1966 1930 -1673
2568 -1673 -73 2367 370 -1290 801 1334 133 -302 233 581 972 -824 -762 1701 638 -1972 40
$$ packed form
2450B160k419q2J495L15m02j251N13J756o88k373J766K583l245j669L616L36l415
2467a004J002K464j480j691J402O28r02l20k38R90O54k117q95L369n55l541J888
2484c46K939l149k103L332Q32l096j93K050m3j355j99N27P24p16j902J885J485
2501F72l164p53L648K0l722R38L126k547j654K365Q92k036k84Q93O09qj360J92
2519b173J987r64k290J936K188k776j390L622J40l199J128K187j347j376J458
2534h69O29j45o95j77J090J329k277o27L037l97l036J365K743k184j741K831M26
2551A302k399O92J250r5p08l24L54J507r74k108K204J937l126j195L649l6l603
2568a673J600K440j997j660K091N33j201m35N35L48L91j796O2K463j063k610K012
$$ plain form
2585 40 2306 -828 -1917 1415 1239 -1382 -797 1284 116 -473 -350 93 347 -94 -1178 338 1218
2602 1218 -1207 -1403 1362 1185 -2407 -635 2015 -671 -1931 617 623 -878 -874 157 271 134 -749 -513
2620 -513 1212 55 -2059 26 2037 -1158 -2109 1341 1046 -1805 -700 1592 -285 -1357 259 501
2636 501 16 -496 -565 301 983 -1086 -1144 1508 640 -2279 92 2160 -796 -1740 1250 1247 -1303 -534 898
2655 898 153 -325 -206 115 710 354 -1276 684 1727 -982 -1219 1861 1222 -1928 23 1910 -132
2672 -132 -1208 1037 1031 -7 -26 667 915 658 -229 124 2048 1018 -1128 819 2551 -172 -904 2361
2690 2361 2118 -1206 306 2136 838 6 926 1399 1082 537 81 1650 1903 -136 70 2593 1800
2707 1800 -1192 635 2747 100 -698 2410 1960 -269 663 1733 914 516 563 630 1775 872 -577
$$ packed form
2585D0K266l134j089L332j76k621N85K081j168n89J23M43K54m41j084J516Q80
2602A218k425j96K765j77l592J772K650k686j260K548Oj501MJ031J14j37q83K36
2620e13J725j157k114K085K011l195r51L450k95k851J105K292j877j072J616K42
2636E01m85n12o9Q66O82k069n8K652q68k919K371K068k956r44K990lk550P69J432
2655H98p45m78J19L21N95l56j630J960J043k709k37L080o39l150J951J887k042
2672a32j076K245oj038j9O93K48k57q87L53J924j030k146J947J732k723p32L265
2690B361k43l324J512J830j298q32R20M73l17n45m56J569K53k039K06K523p93
2707A800k992J827K112k647p98L108m50k229R32J070q19l98M7O7J145r03j449
$$ plain form
2724 -577 733 2510 -456 -654 2044 1345 -1222 227 2199 -3 -736 801 915 43 60 229 661
2741 661 896 -350 -454 1743 878 -1616 316 1567 -657 -1411 1347 1024 -1515 -411 1290 -69
2757 -69 -890 -41 581 333 -458 -1019 338 1037 -955 -862 1772 551 -1900 144 1852 -735 -1368 931
2775 931 604 -813 -49 691 334 -24 -330 -143 978 467 -1448 773 1820 -833 -1216 2122 1175 -1134
2793 -1134 282 1566 -62 -578 779 771 238 330 140 752 1096 -361 -119 1954 837 -1685 841 2462
2811 2462 -465 -985 2054 1231 -751 331 1382 894 222 432 652 1000 556 -531 936 1469 -642
2828 -642 -534 2332 662 -1683 765 1743 -319 -835 1288 1074 -629 -18 466 456 194 -234 -504 1225
2846 1225 -111 -1659 332 1484 -1198 -1369 1440 200 -1969 -348 1163 -520 -694 -61 -161 -279
$$ packed form
2724e77J310J777k966j98K698o99k567J449J972k202p33J537J14q72J7J69M32
2741F61K35j246j04K197q65k494J932J251k224p54K758l23k539J104J701j359
2757f9q21Q49O22k48p91n61J357O99j992R3K634j221k451K044J708k587o33K299
2775I31l27j417P64P40l57l58l06J87J121n11j915K221J047k653l83L338r47k309
2793a134J416J284j628n16J357qn33R2j90O12L44j457K42K073j117k522K526J621
2811B462k927n20L039q23j982J082J051m88o72K10K20L48m44j087J467N33k111
2828f42J08K866j670k345K448R78k062n16K123k14j703O11M84j0k62m28k70J729
2846A225j336j548J991J152k682j71K809j240k169J621J511j683j74O33j00j18
$$ plain form
2862 -279 -471 -968 -14 594 -1741 -1070 1288 -113 -2420 -135 1430 -1250 -1860 519 419 -1775 -807
2879 -807 226 -167 -563 -850 -195 464 27 -1310 531 829 -1671 -1093 1685 331 -1428 306 1507
2896 1507 -511 -839 1001 460 -208 338 650 361 892 -334 -108 1971 779 -495 1072 2228 -269
2913 -269 -356 2242 1224 -435 1015 1833 524 618 1035 1048 1470 703 143 1544 1878 -151 -107 2468 1276
2932 1276 -830 1191 2313 152 -117 1647 984 -61 603 1169 848 430 43 637 1189 254 -619 1090
2950 1090 1682 -734 -771 1729 722 -1307 529 1336 -312 -554 533 497 -266 -295 44 282 448 -724
2968 -724 -477 1204 41 -1480 380 1382 -906 -1225 1087 188 -1118 -189 764 -145 -481 39 81 169
2986 169 -561 -914 319 559 -1051 -805 1645 226 -1553 612 1363 -667 -986 918 354 -616 -99
$$ packed form
2862b79j92m97R54O08k335O71K358j401k307K285J565k680o10K379j00k194R68
2879h07J033l93l96k87O55O59m37j337J841K98k500N78K778j354j759J734J201
2896A507k018l28J840n41o68N46L12k89N31j226K26K079j192j274J567J156k497
2913b69q7K598j018j659J450Q18j309R4M17J3M22p67n60J401L34k029M4K575j192
2932A276k106K021J122k161k69J764o63j045O64N66l21m18l87N94N52r35q73J709
2950A090N92k416l7K500j007k029J836Q07j648k42J087l6p63k9L39K38J66j172
2968g24K47J681j163j521J860J002k288l19K312q99j306R29R53r09l36N20M2Q8
2986A69p30l53J233K40j610K46K450j419j779K165P51k030l19J904n64r70N17
$$ plain form
3003 -99 265 347 323 -598 1 1183 -132 -1388 782 1484 -938 -754 1487 379 -1505 -39 1244 -203
3021 -203 -401 523 368 -30 -240 -397 457 431 -1034 -474 1379 -181 -1698 459 1306 -1056 -556 1097
3039 1097 363 -1188 174 293 -271 -325 -334 -133 463 -335 -1050 538 935 -841 -493 1445 152 -1462
3057 -1462 772 1090 -356 -810 679 391 -110 -175 51 546 280 -409 24 1334 112 -935 952 1524
3075 1524 -693 -249 1467 875 -870 680 1323 242 -15 455 566 310 179 37 672 841 -581 -78
3093 -78 1767 -73 -1063 918 1301 -819 -883 1173 211 -872 286 418 -171 -22 -474 78 409 -345
3111 -345 -1229 433 527 -1307 -893 805 -669 -1721 -204 349 -1344 -1222 82 -754 -1045 -913 -910 -374
3129 -374 -296 -1632 -1174 251 -1133 -2414 -126 -42 -1918 -1486 226 -897 -1857 -582 -554 -1265 -957 -941
$$ packed form
3003i9L64Q2k4r21N99J182j315j256K170P02k422J84K241j108j884J466J283j447
3021b03j98R24j55l98k10j57Q54k6j465N60J853j560j517K157Q47k362N00J653
3039A097p34j551J362J19n64n4rK01N96p98p15J588L97j776L48J938j293j614
3057a462K234L18j446m54J489k88n01o5K26M95k66o89M33J310j222j047J887N72
3075A524k217M44J716n92j745J550O43j081k57M70J11k56j31j42O35J69j422N03
3093g8J845j840r90J981L83k120o4K056r62j083J158J32n89J49m52N52L31p54
3111c45q84J662R4j834M14J698j474j052J517N53j693J22J304q36k91J32LN36
3129c74P8j336M58J425j384j281K288Q4j876M32J712j123r60J275K8p11L08J6
$$ plain form
3147 -941 -768 -539 -1175 -1733 -9 -383 -2152 -1014 41 -1306 -2235 -32 55 -1749 -1310 133 -617 -1327
3165 -1327 -512 -471 -366 -328 -851 -407 257 -742 -1451 496 397 -1399 -820 930 -442 -1172 346 644 -664
3184 -664 -385 454 -37 3 -123 -179 651 631 -590 -311 1448 -206 -1046 1178 1598 -549 -319 1068 473
3203 473 -417 701 958 394 165 36 514 630 193 -572 1325 1107 -944 27 1523 191 -852 1036
3221 1036 1345 -383 129 657 275 -111 177 -80 315 267 -434 -169 717 -403 -1305 759 619 -1036 -728
3240 -728 1052 -497 -1355 34 178 -642 -709 -384 -509 -274 -996 -1144 -105 -253 -1648 -891 680 -744
3258 -744 -1577 118 -369 -1876 -1366 -136 -703 -1365 -840 -133 -866 -978 -1058 -568 -125 -1339 -1876 -171 144
3277 144 -1885 -756 633 -758 -1677 128 -6 -1194 -824 68 -109 -603 -248 -549 -211 -27 -944 -397
$$ packed form
3147i41J73K29o36n58J724l74j769J138J055j347r29K203Q7j804M39J443p50p10
3165a327Q15M1J05L8n23M44O64r99p09J947r9j796N79J750j372p30J518K98j308
3184f64K79Q39m91M0j26n6Q30k0j221K79J759j654q40K224M20k147K30J387n95
3203D73q90J118K57n64k29j29M78J16m37p65J897k18k051R71J496j332j043J888
3221A036L09j728N12N28l82l86K88k57L95m8p01K65Q86j120r02K064j40j655L08
3240g28J780j549q58J389J44q20o7L25j25K35p22j48J039j48j395P57J571j424
3258g44q33J695m87j507N10J230n67o62N25P07p33j12q0M90M43j214n37J705L15
3277A44k029J129J389j391r19J805j34j188L70Q92j77m94L55l01L38J84r17N47
$$ plain form
3295 -397 761 -463 -1019 601 456 -1223 -174 995 210 -627 447 599 -49 250 478 169 367 286
3313 286 32 880 877 -619 312 1391 33 -650 986 966 -353 52 1086 348 -173 411 678 693 350
3332 350 231 381 1563 45 -290 1168 1000 -681 155 1605 176 -540 871 736 -429 439 720
3349 720 170 41 314 33 493 332 -455 287 1203 -376 -702 1170 699 -815 -322 1095 73 -763
3367 -763 187 27 -309 191 -131 38 652 -202 -727 674 692 -1046 -440 1030 -493 -964 478 441 -895
3386 -895 -253 588 62 -253 -192 -38 234 -96 -504 130 738 -619 -635 727 522 -1181 -473 993 -261
3405 -261 -770 414 350 -567 -184 318 133 -58 -249 -423 545 133 -1060 216 857 -623 -378 789 339
3424 339 -1030 -131 909 -171 -491 171 406 14 -6 -13 193 586 -177 -433 761 659 -811 22 1083
$$ packed form
3295c97J158j224n56J620j45j679J049J169p85q37J074J52o48K99K28l09J98q1
3313B86k54Q48lj496R31J079j358o83J636k0j319M05J034p38n21N84K67J5l43
3332C50j19J50J182j518l35J458j68j681Q36J450j429p16J411j35j165Q68K81
3349G20n50j29K73k81M60j61p87P42R16j579l26J872m71j514M93J417j022q36
3367g63R50j60l36N00l22J69O14q54n25J401J8j738O06J470j523m71J442l7j336
3386h95O42Q41n26l15O1J54K72l30m08O34O08j357j6J362k05j703P08J466j254
3405b61n09J184o4r17L83N02j85j91j91j74R68m12j193J276O41j480K45J167m50
3424C39j369Q99J040j080l20O62K35l92k0pK06L93p63k56J194j02j470Q33J061
$$ plain form
3443 1083 -255 -669 1016 688 -670 252 984 348 321 126 423 717 434 1 279 1205 261 -445 1060
3462 1060 982 -647 47 879 -39 -482 826 526 -130 118 408 344 509 -92 121 910 275 -629 250 905
3482 905 -394 -686 801 518 -869 -103 606 -33 -319 -7 -83 -150 -55 -398 -291 477 -586 -929 430
3501 430 -12 -1119 -405 715 -740 -956 68 13 -837 -885 102 -652 -444 -584 -438 255 -371 -802 57
3520 57 590 -1025 -1308 484 265 -1235 -396 483 -742 -669 177 37 -343 -23 -426 -178 253 -561 -608 669
3540 669 177 -1213 -69 757 -674 -898 680 183 -759 127 592 -140 -36 -158 -105 164 262 -359 -3
3559 -3 839 -310 -587 1144 520 -833 83 1237 -45 -299 638 357 -260 261 272 128 -16 -154 212
3578 212 467 107 -526 113 823 -239 -545 597 97 -1041 158 679 218 -610 214 156 41 22 -24 63
$$ packed form
3443A083j338m14J685l28j358R22P32o36k7j95K97K94k83m33K78R26r44p06J505
3462A060p8j629O94Q32r18m43J308l00o56K48K90o4J65o01K13P89o35r04Q79O55
3482I05j299k92J487k83j387P66P09o39k86L12p6o7R5l43J07P68j063l43J359
3501D30m42j107P14J120j455k16J024n5q50m8R87p54K08j40J46O93o26m31Q59
3520E7N33j615k83J792k19j500Q39Q79j225P3Q46j40l80L20m03K48M31q14m7J277
3540F69m92j390J144Q26j431k24J578m97r42Q86M65p32J04j22N3K69R8o21L56
3559cQ42j149k77J731o24j353R16J154j282k54R37k81o17N21J1j44j44j38L66
3578B12K55l60o33O39P10j062l06J142n00j138J199N21m61q28Q24n8j15j9m6Q7
$$ plain form
3598 63 247 -317 -431 701 208 -1199 193 716 -444 -660 509 504 -791 83 116 -433 -312 89 152 183
3618 183 133 -292 37 499 -618 -714 754 -163 -870 100 539 -844 -720 120 -162 -391 -97 -231 -323 -2
3638 -2 -620 -672 420 -56 -1077 -103 754 -963 -900 614 -215 -771 -274 308 -369 -370 -206 32 -279 -211 -266
3659 -266 -54 378 -706 -613 698 240 -861 183 890 -571 -513 889 36 -429 240 212 49 -143 -67
3678 -67 -122 234 253 -529 256 930 -187 -185 824 437 -720 538 838 -390 -336 364 312 -142 133 -484 350
3699 350 342 -170 -260 832 218 -812 200 876 -738 -513 1004 478 -827 345 496 -432 -465 35 43 -53
3719 -53 -80 -584 169 79 -575 -794 625 52 -945 -94 447 -878 -653 406 -224 -312 -8 108 -312 -82
3739 -82 -164 -302 347 -118 -1035 -65 255 -855 -760 315 -237 -863 26 -40 -546 -673 66 -402 -526 -336 -627
$$ packed form
3598F3J84n64j14J132m93j407J392N23j160k16J169nj295Q74L3n49J21M01O3L1
3618A83n0m25L29M62j117r6J468r17p07R70M39j383J24Q40k82k29K94j34r2L21
3638bo18n2J092m76j021R74Q57j717O3J514q29n56M97N82o77jJ64K38l11O8n5
3659b66K12M32j084R3J311m58j101J044P07j461N8J402q53m65O69k8j63j92P6
3678f7n5L56J9p82P85O74j117KJ009l87j157J258L00j228N4P00n2m54K75o17Q34
3699C50qn12r0J092o14j030J012O76j614K25J517n26j305J172J51r28l3N00Qr6
3719e3k7n04P53r0o54k19J419n73r97Q51N41j325K25J059o30q8L04J16m20K30
3739h2q2j38O49m65r17R70L20j110R5J075n52o26Q89o6n06j27P39m68j24J90k91
$$ plain form
3760 -627 -141 227 -472 -690 575 -312 -1254 -79 403 -869 -587 339 82 -1028 -358 203 -461 -389 -341
3779 -341 -569 -80 -327 -835 -162 261 -911 -874 824 -149 -907 -46 490 -843 -538 92 -196 -694 -185
3798 -185 -14 -132 -43 -520 -193 341 -252 -605 394 572 -691 -342 625 -161 -965 121 574 -416 -298 304
3818 304 -159 76 122 -299 9 488 -372 -180 977 43 -704 563 690 -315 -241 453 -12 -330 32 411
3838 411 -129 -58 143 217 684 445 -415 487 600 -501 -389 826 130 -499 355 371 -651 2 308 147
3858 147 -123 39 -109 -54 159 -209 -117 612 -57 -755 266 596 -846 -460 584 -331 -888 107 318 -574
3878 -574 -162 202 -316 -289 -19 -624 65 254 -606 -276 658 -325 -1091 149 24 -586 -643 177 -348 -574
3898 -574 -118 -246 -200 -134 -309 -618 307 -339 -927 165 468 -989 -671 689 -201 -813 207 401 -550
$$ packed form
3760f27M86L68o99k18J265q87r42J175M82j272K82R26k57j110O70N61o64P2M8
3779c41k28M89k47n08O73M23j172L7J698r73p58Q61N36j333L05O30k88m98N09
3798a85J71j18Q9m77L27N34n93l53R99J78j263L49R67p86q04J086M53r90J18O02
3818C04m63K35M6m21L08M79q60J92J157r34p47J267J27j005P4O94m65l18L62L79
3838D11n40P1K01P4M67k39q60R02J13j101J12J215o96o29Q54J6j022O53L06j61
3858A47k70J62j48N5K13l68R2P29o69o98J021L30j442L86J044r15n57R95K11q92
3878e74M12L64n18K7K70o05O89J89q60L30R34r83p66J240j25o10n7Q20n25k26
3898e74M56j28M6O6j75l09R25o46n88J092L03j457L18J360q90o12J020J94r51
$$ plain form
3917 -550 -70 148 -149 -243 -230 -85 99 28 -361 -71 541 -137 -531 389 691 -636 -97 593 26 -348 226
3938 226 464 -128 264 149 43 422 230 -134 502 554 -441 45 905 247 -431 635 915 -394 199 742
3958 742 243 138 462 207 229 662 -32 404 577 -72 -182 405 819 -99 32 1058 104 -300 701 662
3978 662 -239 66 405 164 474 177 -71 142 508 -228 -112 757 -182 -748 502 719 -390 -142 435
3997 435 -415 -416 307 -35 -415 114 -80 -190 124 -482 -793 250 284 -672 -527 226 -652 -936 -129 12 -886
4018 -886 -411 27 -192 -670 -368 -409 -366 -257 -393 -698 -13 -481 -1068 240 135 -847 -670 569 -792 -900
4038 -900 -247 -123 -670 -147 -142 -537 -420 -305 -824 6 39 -638 -100 685 -58 -559 236 468 -539 -5 585
4059 585 -229 -173 -8 216 -78 177 -69 149 502 254 -170 650 690 -291 164 857 389 -111 374 602 -221
$$ packed form
3917e50M80K18k97r4J3J45J84p1l89K90O12o78l94R20L02j327N39O90n67l74N74
3938B26K38n92L92j15j06L79j92l64O36N2r95M86Q60o58o78J066K80j309N93N43
3958G42m99j05L24k55K2M33o94M36J73o49j10N87M14r18J31J026r54m04J001l9
3978F62r01L05L39k41L10k97k48K13L66p36J16Q69r39n66J250K17j109K48N77
3997D35q50jP23l42l80N29j94j10L14o06l11J043L4r56J45P53q78k84Q07J41q98
4018h86M75M38k19m78L02m1M3J09j36l05O85m68n87J308j05r82J77J239j361j08
4038i00O53J24n47N23Nl95J17J15n19Q30L3o77N38P85p43n01P95K32j007N34N90
4059E85q14N6J65K24k94K55k46K18L53k48m24Q20M0r81M55O93m68n00M85K28q23
$$ plain form
4080 -221 297 384 207 317 430 -28 385 393 -25 221 879 383 -529 793 690 -353 6 657 35 -372
4100 -372 350 291 -139 297 130 -188 182 40 -324 270 75 -309 -27 668 -230 -454 428 136 -1033 -71
4120 -71 109 -304 -361 -310 23 -323 -56 -586 -219 307 -458 -976 115 96 -770 -326 364 -507 -850 124 -90
4141 -90 -568 -228 -25 -287 -68 -373 -503 -103 307 -1154 -502 440 -399 -997 198 223 -392 -532 404 -333
4161 -333 -704 108 -233 -693 -38 -385 -373 52 -199 -576 230 194 -835 -131 311 -380 -279 231 228 -460 -158
4182 -158 222 -91 1 474 349 43 336 -267 -73 574 85 -380 426 263 -481 -133 800 118 -436 538
4202 538 293 -316 90 197 -9 367 167 -244 398 332 -544 488 929 -139 -108 484 519 -411 59 501
4222 501 106 16 361 -35 34 515 169 337 593 178 -235 566 309 -738 326 599 -564 -325 250 268
$$ packed form
4080b21N18Q7j77J10J13m58M13Qm18K46O58m96r12J322j03j043L59O51o22m07
4100c72P22n9m30M36j67l18L70j42l64N94j95l84K82O95q98k24Q82k92j169R62
4120g1J80m13n7N1L33l46K67n30L67N26p65n18J091j9q66M44O90q71l43R74k14
4141i0m78L40K03k62K19l05j30M00M10j461O52R42q39n98J195K5o15j40R36p37
4161c33l71Q12l41m60O55l47J2M25k51l77Q06l6j029P04M42o91J01N10lo88L02
4182a58L80l13R2M73j25l06K93o03J94O47m89m65Q06j63p44L48R33o82n54R74
4202E38k45o09M06J07k06L76k00m11O42o6q76J032M41j068L1N92L5r30M70M42
4222E01l95r0L45l96O9M81l46J68K56m15m13Q01k57j047J064K73j163K39N75J8
$$ plain form
4242 268 -385 205 302 -487 -18 -24 -205 1 -212 -662 -407 229 -450 -477 -33 -99 -840 38 370 -550 -479 -180
4264 -180 247 -377 -338 -193 -145 207 -225 -830 129 -269 -610 -86 306 -550 -768 67 -144 -697 3 334 -266
4285 -266 -358 459 -335 -311 -126 -372 -270 382 -322 -359 423 239 -667 -276 478 -629 -554 201 247 -718 98
4306 98 118 28 103 177 -31 97 305 -385 169 433 21 -303 626 149 -109 314 417 139 -139 449 83 57
4328 57 562 197 225 544 201 6 635 412 -244 364 1094 108 -252 693 525 170 384 368 27 365 220
4349 220 209 157 123 -40 -17 759 -98 -122 516 354 -429 523 910 -80 -116 618 92 -262 272 5 110 444
4371 444 306 -356 127 20 -540 125 596 -246 -221 295 -269 -634 -18 148 -273 -311 146 -420 -35 -526 -577
4392 -577 -186 316 -445 -623 40 200 -711 -342 111 -657 -617 222 -230 -651 -294 -28 -581 -373 -80 -643
$$ packed form
4242B68o53N90R7p89M69oj81K06k13m50K55O36o79k7M44o6p41Q78L32r20P1K99
4264a80M27o24L9J45M8L52m32o05R59l98l41N24L92q56k18Q35k11n53P00L31o00
4285b66r2Q17p94K4J85k46J02O52p04l7P82j84r06L91P54j107P5P55M6r65Q16
4306I8K0r0P5P4k08J28K08o90N54K64m12l24R29m77k58M23J03k78k78N88l66k6
4328E7N05l65K8L19l43j95O29k23o56O08P30r86l60R45j68l55K14j6l41L38j45
4349B20j1n2l4j63K3P76q57k4O38j62p83R52L87r90l6P34n26l54N34k67J05L34
4371D44j38o62M83j07n60O65M71q42K5N16n64l65O16J66m21l8M57n66L85m91n1
4392e77L91N02p61j78O63J60r11L69M53p68M0Q39m52m21L57K66n53K08K93n63
$$ plain form
4412 -643 39 -216 -691 -49 121 -563 -669 108 -8 -590 -82 119 -289 -456 119 16 110 164 -27 -126 273
4433 273 -327 -34 455 133 -329 290 659 -246 -45 884 151 -99 527 682 133 463 501 135 622 546 333
4454 333 242 295 424 132 503 320 -106 586 588 65 123 559 170 -219 301 311 -19 238 -39 12 287 84
4476 84 -275 123 444 -362 12 416 192 -366 19 654 -458 -34 282 -319 -268 205 -17 -301 -1 -729
4496 -729 -634 -14 -342 -666 33 403 -699 -492 -31 -383 -617 -351 -339 -531 -254 -346 -399 -448 -119 -462 -344
4517 -344 -189 -594 -485 152 -314 -877 -190 207 -564 -246 -43 -309 -387 -153 -183 -243 -104 -395 -413 -73 -277
4538 -277 -653 -375 419 -475 -191 13 -78 -680 -195 18 -219 -288 233 -63 -317 161 -282 -232 461 -215 -148
4559 -148 577 102 -574 349 369 -455 12 385 227 -383 276 98 195 119 104 -124 318 331 -212 233 615 -205
$$ packed form
4412f43O82k55m75O42J70o84j06P77j16n82N08K01m08j67N75j03R4N4j91r9L99
4433B73o00K93M89l22m62O19L69r05K01R29p33k50O26J55n49L30L8l66M87p6k13
4454C33r1N3J29k92L71j83m26O92Kn23N8M36l89l89N20J0l30K57k77N1K75k03
4476H4l59L98L21q06L74M04k24n58L85O35j112M24L16o01N1M73k22k84L00p28
4496g29R5O20l28l24O99L70j102K07M61l52k34K66J2j92K77r2n3m9L29l43J18
4517c44J55m05J09O37m66n63O87L97p71L18K03k66p8K34l0o0J39k91j8L40k04
4538b77l76K78P94q94K84K04r1o02M85K13k37o9N21k96k54M78m43N0O93o76O7
4559a48P25m75o76R23K0q24M67L73j58o10O59j78R7p6j5k28M42J3n43M45L82q20
$$ plain form
4581 -205 32 208 71 -274 325 356 -316 155 403 -139 44 288 104 -62 189 -237 -228 445 2 -552 198
4602 198 228 -145 -257 43 267 -593 254 210 -297 26 187 -256 176 -254 -316 -240 176 -351 -239 -171 74 -638
4624 -638 -247 329 -457 -398 -91 -246 -598 34 -26 -221 -321 -307 -509 -144 -308 -799 -328 -153 -831 -553 -3
4645 -3 -298 -884 -212 -152 -386 -361 49 -488 -519 -215 -330 -528 -334 -181 -612 150 -267 -634 140 115 -578 -116
4667 -116 270 -324 -447 223 17 -298 -70 -117 -248 -180 -132 -248 11 157 -325 -185 517 -80 -389 58 330
4688 330 -392 -183 294 85 -126 202 -33 89 29 78 -2 567 -363 -398 247 228 -297 24 284 -50 -303 305
4710 305 69 21 53 225 63 64 162 -75 1 -19 17 -189 564 273 -392 176 367 -226 -19 318 -249 -248 -120
4733 -120 -136 -350 133 -26 -158 199 -186 -293 410 168 -354 195 194 -56 -175 75 425 -214 -24 413 -127
$$ packed form
4581b05K37J76j37l45N99L1o72M71K48n42J83K44j84j66K51m26RO73m43n54P50
4602A98L0l73j12L00K24q60Q47m4n07L23J61m43M32m30o2P6M16n27J12O8K45p12
4624f38L91N76p86N9L07j55l52O32o0j95j00J4k02L65j64m91M71J75o78K78N50
4645ck95n86O72O0k34K5M10n37l1L04j15j98J94J53m31P62m17l67P74k5o93M62
4667a16L86n94j23O70k06l15K28m7j31O8M8j16K59J46m82J40P02n97l09M47K72
4688C30p22K09M77k09k11L28k35J22o0M9q0N69r30l5O45j9n25L21K60l34k53O08
4710C05k36m8L2J72j62JR8k37P6k0L6k06P53k91o65N68J91n93K07L37n67JJ28
4733a20j6k14M83j59j32L57l85j07P03k42n22N49jk50j19K50L50o39J90M37n40
$$ plain form
4754 -127 137 186 19 -142 -88 -346 24 533 -34 5 155 151 -218 7 360 -266 -385 128 70 -254 33 -165
4776 -165 -360 -155 151 -380 176 307 -443 -113 437 -133 -234 383 290 -446 -197 220 -153 -325 166 -181
4796 -181 -101 160 -134 -76 414 33 36 261 49 -161 67 700 -424 -45 237 279 -384 -73 233 231 -171 -18
4818 -18 -88 -44 371 -247 96 476 85 -152 709 428 -389 -29 660 42 -140 291 195 -19 500 533 112 383
4840 383 228 3 -39 448 238 108 455 253 -259 621 435 -269 485 708 67 -140 432 141 124 709 236
4861 236 46 350 293 233 480 550 -265 388 282 -10 135 357 455 -107 285 308 54 184 101 125 461 150
4883 150 -83 115 886 188 -144 369 290 -142 210 682 -16 -107 230 -101 -51 -74 159 -15 213 294 -64 361
4905 361 181 -222 184 251 -228 -110 202 362 -283 187 179 30 81 215 287 -55 112 -147 -70 251 140 -295
$$ packed form
4754a27K64M9j67j61N4k58L70N09n67L9J50ml69K25L53o26j19N13n8l24K87j98
4776a65j95K05L06n31N56J31p50L30N50n70j01O17r3p36K49M17l73j72M91l47
4796a81Q0K61k94N8M90l81LK25k12k10K28O33j124L79K82M2o63L11L06km02J53
4818a8p0M4M15o18L43L80l91k37Q61k81q17L60O89o18j82M31r6k14N19L3m21K71
4840C83j55k25m2M87k10j30L47k02n12Q80j86p04P54K23o41k07N72k91j7N85m73
4861B36j90L04n7o0K47P0q15O53j06k92J45K22R8n62L92K3k54J30q3K4L36l11
4883A50k33J98P71o98l32N13p9m32L52M72o98r1L37l31N0k3K33j74K28Q1l58M25
4905C61j80m03M06O7m79J18L12J60o45M70qj49N1J34P2l42J67k59P7L21j11m35
$$ plain form
4927 -295 271 199 -375 148 467 -202 17 641 107 -200 189 -108 109 311 335 20 348 180 -255 106 623
4948 623 76 -123 399 480 -184 88 750 14 -71 212 491 101 257 19 290 476 299 116 306 370 -301
4969 -301 548 663 70 179 694 553 -170 218 499 -48 234 385 181 405 497 181 136 589 107 -101 665
4990 665 122 -187 -61 470 145 -307 406 378 -187 68 -163 270 253 -222 81 194 328 -301 186 216 -80
5011 -80 -205 114 335 -102 54 127 -471 -193 50 -150 -141 111 -527 -116 268 -106 -232 71 156 -268 -128 423
5033 423 -228 -275 84 -321 -319 -29 -46 -480 -61 -172 -107 30 84 -299 5 295 -155 -202 207 42 -463 88
5055 88 -22 -92 -297 379 60 -170 230 -392 -318 127 69 -200 170 -31 -86 -86 178 -49 -173 401 130 -277
5077 -277 -98 158 -109 -103 202 27 147 268 159 251 109 137 -115 129 -21 -226 63 453 -36 9 326 -11
$$ packed form
4927b95N66p2n74N23L19o69K19O24n34l07L89k97K17K02K4l15L28j68m35L61N17
4948F23n47j99N22Q1o64K72O62p36q5K83K79l90J56k38K71J86j77j83J90O4o71
4969c01Q49J15n93J09N15j41p23L88K81n47K82J51k04K24R2l16m5M53m82k08P66
4990F65n43l09J26N31l25m52P13k8n65K55k31M33j7m75L03J13J34o29M87L0k96
5011h0j25L19K21m37J56P3n98K78K43k00RK52o38M11L84l74j26L03Q5m24J40N51
5033D23o51m7L59m05KK90j7m34M19j11O5J37N4l83L04K90m50m7M09j65n05N51
5055H8j10p0k05O76l19k30M00o22P4M45n8k69L70k01n5%K64k27j24N74k71m07
5077b77J79K56k67OL05j75J20J21j09R2j42K8k52K44j50k05K89L90m89M5L17l37
$$ plain form
5099 -11 -166 135 79 -156 194 -121 -148 296 -109 -282 -110 85 31 -444 194 -53 -90 47 345 -88 264 173
5121 173 59 -44 32 -23 -19 242 -161 -28 246 -205 -408 95 -66 -431 -267 339 -112 -300 -11 -149 -397
5142 -397 -185 -139 -43 -26 -177 -453 -19 187 -96 -597 -114 -325 -363 82 -338 -510 -18 -42 -375 -483 47 -430
5164 -430 -124 -321 -289 -91 -15 317 -498 -318 73 -284 -170 156 -305 -406 -214 109 -321 -64 -110 -346 -18
5185 -18 167 -181 -240 208 -35 -121 228 -185 -343 114 250 -498 -22 565 225 -39 289 81 -234 250 72
5206 72 126 264 520 61 405 147 218 -198 285 244 -220 231 247 -295 44 459 116 52 500 348 64 219
5228 219 172 -94 140 304 -202 94 203 -251 234 274 277 -155 -167 -204 -8 38 -6 -167 96 -11 -274 159 222
5251 222 -103 -105 258 -12 -695 12 -88 -165 -449 -195 -354 -349 -33 -240 -352 -360 -86 -190 -133 101 -264 8 36
$$ packed form
5099a1j55L01n6k35L50l15k7M44m05j73J72J95n4m75O38k47l7J37K98m33L52r1
5121A73j14j03P6n5MK61m03J33K74m51k03N03j61l65J64O06m51j88K89j38k48
5142c97K12M6R6J7j51k76M34K06k83n01M83k11l8M45m20j72M92k4l33j08N30m77
5164d30L06j97L2J98P6L32q15J80L91l57J14L26m61j01J92L23m30K57m6k36L28
5185a8J85l48n9M48k43q6L49m13j58M57J36p48M76N87l40k64L28k08l15M84j78
5206G2N4J38K56m59L44k58P1m16M83m1m64M51J6n42L39M15l43o4M48j52k84J55
5228B19m7k66K34J64n06K96J09m54M85M0Lm32j2l7J96M6m4j61K63j07k63M33O3
5251B22l25kL63k70o83P07j00p7k84K54j59NL16k07j12qK74j04N7K34l65K72K8
$$ plain form
5274 36 -416 -229 178 -264 -468 43 -203 -399 -88 196 -195 -508 -238 -24 -73 104 -158 -191 -23 -70 -399
5295 -399 13 52 -371 67 206 -29 -119 -122 56 -46 5 91 -163 71 80 -24 150 450 -67 52 251 236 -99
5318 -99 217 530 -339 188 249 171 53 186 27 225 491 -95 283 204 426 130 312 406 89 57 201 170
5340 170 -41 171 115 118 240 206 85 -45 49 -151 69 495 -161 -161 474 -128 38 131 -54 -72 -31 81 17 -121
5364 -121 42 308 -99 97 90 -137 129 63 -81 170 372 -12 134 43 133 -396 27 340 -441 8 109 -106
5386 -106 -113 -286 -239 240 -123 9 -142 165 -226 -326 141 415 -240 -331 216 -334 -108 5 -186 -189 -168 -177 -162
5409 -162 -129 -267 -318 -88 191 -179 -595 22 -83 -255 -268 -235 -249 -269 246 -334 107 79 139 -432 65 78 -123
5432 -123 -182 -1 -260 -265 225 -240 -24 233 131 -90 398 -30 -246 -177 98 -245 -402 119 -52 125 261
$$ packed form
5274C6m52J87M07m42k04N11k46j96L11K84l91l13K70K14m9J77k62l3J68m7l29
5295c99M12L9m23M38J39k35r0lJ78j02N1Q6k54K34Rj04J74L00n17J19J99j5l35
5318i9L16L13q69N27O1p8j18J33j59J98K66n86L78p9K22k96J82R4l17l2J44l1
5340A70k11K12n6LJ22l4j21j30R4k00K20M26o56%O35o02J66R3j85j8M1J12o4j38
5364a21J63K66m07J96pk27K66o6j44K51K02l84J46r1R0n29M23L13p81M49J01k15
5386a06pj73M7M79l63J32j51L07l91j00M67K74o55r1N47n50K26J13j91lK1rJ5
5409a62L3j38n1K30K79l70m16O17j05j72j3L3j4k0N15n80M41k8O0n71M97J3k01
5432a23n9J81k59nM90m65K16K57j02k21M88m28k16O9K75l43j57N21j71J77J36
$$ plain form
5453 261 -268 -7 424 -9 -263 358 -43 -211 17 289 -83 -78 198 261 166 -20 355 44 70 358 -178 172
5475 172 298 -277 25 317 -31 159 63 -65 -4 77 283 91 335 274 14 -86 369 64 -28 447 81 44
5497 44 -46 249 -186 -69 564 47 55 226 81 -52 50 22 -310 45 -136 78 187 214 -445 -48 116 -575
5519 -575 -499 93 -228 -554 -419 -123 -120 -424 44 -215 -2 -186 -191 -222 10 -60 -203 -448 10 -106 -282 180
5541 180 -135 -542 -127 -48 -419 -385 -244 -751 -332 -74 -189 -213 -87 4 -86 25 -349 -20 122 160 -121 -222
5563 -222 133 -224 -49 611 50 -140 277 375 -170 32 245 -196 199 271 81 64 495 50 32 466 86
5584 86 59 290 311 27 90 290 170 161 544 368 229 436 370 184 376 495 268 195 545 -34 -303 366 430
5607 430 -110 122 395 309 180 218 134 237 407 224 -47 439 -213 -329 201 29 -89 -101 592 -253 -197 131
$$ packed form
5453B61n29K61M31m33k54O21m01j68K28K72l72NK76O3r5j86L75l11K6K88n36L50
5475A72J26n75L02K92l48J90r6j28O1Q1K06j92K44o1k60j00M55l05r2M75l66l7
5497D4r0K95m35J17O33n17QJ71j45j33J02k8l32L55j81K14J09K7o59L97J64o91
5519e75P6N92l21l26J35K96Ll04M68k59K13j84nl1K32p0j43k45M58j16j76M62
5541A80l15m07M15P9l71L4J41n07M19K58j15k4J26R1r0J11l74L29J42L8k81j01
5563b22L55l57J75O60n61j90M17R8n45K02K13m41L95P2j90j7M31m45j8M34l80
5584H6k7K31K1k84O3K00j20rL83j76j39K07o6j86J92J19k27p3L50n79k69O69O4
5607D30n40K32K73q6j29L8q4J03J70j83k71M86o52j16N30j72j18j2O93q45N6L28
$$ plain form
5629 131 -9 -356 278 166 -129 256 -278 64 241 496 278 327 103 -284 -200 217 -60 -300 42 -16 -326
5650 -326 -84 50 -136 -45 -114 -194 -138 -37 -89 -107 68 83 -360 -126 152 -435 -215 53 -166 -160 30 255 -443
5673 -443 -307 -321 -256 -103 190 -258 -109 -7 -311 -510 435 -121 -303 67 -137 -208 -124 186 -156 -122 -45 -103
5695 -103 -138 73 -141 205 95 247 -238 -42 268 135 188 206 29 -328 287 107 -269 63 193 102 256
5716 256 265 15 -21 237 -69 181 300 305 264 319 71 28 146 144 246 175 35 -131 119 188 280 11 -35 85 -388
5741 -388 129 169 -2 -104 323 47 15 -69 -54 107 -137 364 84 -37 203 -94 61 190 13 6 -132 166
5763 166 -460 90 93 -231 -107 206 -59 -59 -9 -204 -354 -76 -196 -115 -103 61 -392 167 -172 -125 -152 -29 56
5786 56 -405 6 141 -415 -477 260 -3 -214 -295 79 -265 101 -115 -445 -279 -231 -644 -235 53 -255 -267 73
$$ packed form
5629A31j40l47O34j12k95L85n34L42J77K55k18M9k24l87Q4M17k77k40L42n8l10
5650c26K42J34j86R1o9q0N6J01n2j8J75J5m43K34K78n87K20K68k19OJ90K25o98
5673d43J36j4O5J53K93m48J49J02l04j99R45n56j82L70k04p1Q4L10l42L4P7n8
5695a03l5K11k14L46j10J52m85J96L10j33N3J8j77l57O15j80l76L32J30r1J54
5716B56Rk50l6K58l06K50J19Nm1N5k48m3J18kJ02p1j40j66K50O9R2k69m6J20m73
5741c88N17M0j71j02M27k76l2q4J5J61k44N01k80j21K40k97J55J29j77pj38K98
5763A66o26N50Ll24J24L13k65%N0j95j50K78j20Q1J2J64m53N59l39M7k7J23Q5
5786E6m61M11J35n56o2P37k63k11q1L74l44L66k16l30J66M8m13M09K88l08j2L40
$$ plain form
5808 73 40 -341 -357 -207 -488 -502 -54 -365 -17 12 -161 -178 -170 21 -244 151 224 -489 -269 344 -154 16 180
5831 180 -47 264 130 303 11 64 11 -22 115 563 -229 222 247 281 309 433 178 126 23 391 190 153 432
5854 432 -10 -3 258 157 62 178 190 -151 572 389 69 316 491 134 -7 285 -28 -449 387 83 -24
5875 -24 -162 100 -11 321 45 -101 -258 256 -123 -58 -298 7 -149 153 77 -110 -364 -189 -488 -347 -225
5896 -225 -146 -172 -147 -139 -409 -77 -251 -754 -22 97 -328 -131 334 10 -604 -176 -60 -206 -14 72 -263 -47
5918 -47 -50 91 -96 -25 29 -45 -127 -39 -220 145 -24 133 206 261 -50 -57 96 295 190 142 421 80 418 274
5942 274 134 -41 378 63 401 419 462 64 520 334 -281 203 422 243 -14 -26 168 305 100 137 39 -87
5964 -87 74 -145 324 429 -32 7 312 20 -127 239 92 57 -25 463 -119 47 227 -58 192 -61 -46 -89
$$ packed form
5808G3l3l81j6J50k81j4M48l11L48K9j73j7QJ91k65L95P3p13K20O13m98J70J64
5831A80k27L11j34J73k92N3n3l3J37M48p92M51K5L4K8J24k55n2j03L68k01l7K79
5854D32m42PK61j01r5J16J2l41P23j83l20K47J75l57j41K92l13m21Q36l04j07
5875b4j38K62j11L32k76j46j57N14l79O5k40L05j56L02p6j87k54J75k99J41J22
5896b25P9k6K5Qk70L32j74n03P32J19m25J97M65l24o14M28J16j46J92Q6l35K16
5918d7lJ41j87P1N4p4q2Q8j81L65j69J57P3N5l11pJ53J99j05m8K79l41L38j44
5942B74j40j75M19l15L38J8M3l98M56j86o15M84K19j79k57j2J94J37k05L7r8j26
5964h7J61k19M69J05m61L9L05k92j47L66j47l5q2M88n82J66J80k85K50k53J5m3
$$ plain form
5986 -89 -193 -39 26 24 289 -68 -100 173 3 -273 266 -175 -254 13 -338 -367 -223 -96 -302 -395 182 -235 -143
6009 -143 -91 -498 -582 87 -384 65 -94 -75 -277 -22 -94 -127 -230 -130 -219 -228 -93 -150 -224 69 164 -14 -351 47
6033 47 -156 -446 -31 -45 -231 -311 -76 62 131 192 -235 -103 96 12 121 79 -228 -13 129 189 -112 48 356
6056 356 -67 -27 159 79 -235 176 185 151 270 234 -46 75 270 241 -9 218 4 -54 285 120 102 -218 407
6079 407 136 31 432 -102 61 -140 81 222 136 193 -219 246 232 -249 -28 82 -175 41 -5 206 -129
6100 -129 65 -276 -160 -142 94 -19 -18 70 15 -7 258 -27 -118 21 12 -265 -139 -112 -242 105 152 -293 -235 164
6124 164 -308 -452 188 -180 -299 -199 -4 -282 -398 -29 -92 -270 72 -290 -242 105 -79 71 -67 -48 -144
6145 -144 -336 -23 -176 -187 65 -336 -291 77 -174 -190 -114 -78 -221 125 -27 -6 -321 210 74 -101 1 -1 -481
$$ packed form
5986h9j04J54O5kK65l57l2K73j70k76N39m41p9K67l51k9J44J27k06r3N77m17R2
6009a43N2m07q4O69m71M49j59J9k02K55p2l3j03J00q9rJ35n7p4K93R5j78l37L98
6033D7k03k90M15j4j86q0K35J38O9O1m27J32J99q4J09m2l07K15J42O0l01J60L08
6056C56m23M0J86q0l14M11Rl4J19l6k80J21J95k9k50K27k14n8L39j65j8l20O25
6079D07k71j05M01n34J63k01K21J41q6N7m12M65j4m81K21J10k57K16m6K11l35
6100a29J94l41J16J8K36j13JQ8n5k2K65k85r1J39rk77J26K7j30L47M7m45N8L99
6124A64m72j44O40l68j19J00J95k78j16L69o3j78L42l62M8L47j84J50j38J9r6
6145a44j92L13j53j1K52m01M5L68k51j6P6L6j43L46j52K1l15N31j36j75J02km80
$$ plain form
6168 -481 178 198 -173 124 252 -187 -245 242 191 -126 -60 133 -283 12 11 1 -125 333 -222 -334 210 78
6190 78 -124 -107 3 111 -55 146 -442 -10 461 1 141 87 63 -53 24 68 -44 81 230 36 -182 151
6212 151 315 135 325 -148 274 229 126 108 -119 343 128 -123 56 222 -146 86 147 146 211 191 -153 -22
6234 -22 17 -214 -318 -123 262 3 24 -32 -139 -71 157 100 -44 47 -138 -64 30 146 -41 48 130 -322 -134 -85
6258 -85 -329 -217 225 53 -249 154 159 -179 20 -78 -355 -279 67 -324 -8 -125 -125 -128 15 -165 -167 -129 45 -365
6282 -365 84 -145 -367 47 -295 -386 101 -90 -320 -60 32 131 -238 -96 103 -315 -277 96 -317 148 -114
6303 -114 -158 -117 -240 -101 -28 -68 -14 -229 -82 -142 -98 -378 -37 -101 -122 369 49 -164 -178 358 41 -82 255
6326 255 -34 -81 336 -100 -72 124 215 -261 185 104 -6 187 362 125 -179 -26 425 29 110 340 242 -172
$$ packed form
6168d81O59K0l71K97J28m39n8M87n1l17O6J93m16K95jj0j26M58n55j12N44j32
6190G8k02J7J10J08j66K01n88M32M71m60J40n4k4j16P7M4j12J25J49j94k18L33
6212A51J64j80J90m73M22m5j03j8k27M62k15k51J79J66l68K32O1jO5k0l44J31
6234b2L9k31j04J95L85k59K1n6j07O8K28n7j44R1j85P4R4J16j87Q9Q2m52J88M9
6258h5k44J12M42j72l02M03Nl38J99r8k77P6L46l91L16j17%lJ43j80kL8J74m10
6282c65M49k29k22M14l42r1M87j91k30K60R2R9l69J42J99m18L8L73m13M65k62
6303a14m4M1j23J39P3m0N4k15J47o0M4k80L41o4k1M91l20k13j4N36l17j23L37
6326B55k89m7M17m36K8J96R1m76M46q1j10J93J75k37l04J53M51l96Q1K30r8m14
$$ plain form
6348 -172 -48 -71 124 568 176 98 257 -73 -276 104 58 -61 -139 298 45 -288 259 140 -206 131 145 -250
6370 -250 -39 -20 -109 116 417 -185 -175 296 127 -111 -247 -235 -231 -3 64 135 -98 149 -252 47 76 46 1 -183
6394 -183 -43 -297 -67 -225 -129 -133 227 40 -122 55 -212 -234 -119 -9 -510 -274 -226 -85 -268 30 -345 -203
6416 -203 67 -71 53 -284 -32 -281 -167 197 -326 -154 -234 -46 -215 -343 -325 -354 -328 126 -151 -116 55 -203
6438 -203 108 -83 46 -24 -322 120 -287 4 -52 -72 -355 180 -79 -150 35 14 116 126 140 -55 10 156 -130
6461 -130 -100 365 148 -238 149 19 72 -10 148 40 374 125 -127 262 287 76 -137 253 223 -85 102 544
6483 544 -13 38 314 -154 -194 108 -111 211 335 90 21 42 237 -95 117 92 -150 163 364 -185 -488 137
6505 137 -367 -354 72 89 -363 -63 -303 -121 -25 117 -96 -190 -54 -99 -140 -28 -5 -3 124 -120 29 -476 268
$$ packed form
6348a72J24k3J95M44l92p8J59l30k03L80m6j19p8M37k53l33N47j19l46L37J4l95
6370b50K11J9q9K25L01o02J0M71j69k38j36J2MK28O7P1k33K47m01K99K9l0m5j84
6394a83J40k54K30j58R6mL60j87j62J77k67k2J15J10n01K36M8J41j83K98l75J42
6416b03K70j38J24l37K52k49J14L64n23J72q0J88j69j28J8k9K6M54k77L5J71k58
6438b03L11j91J29p0k98M42m07K91n6k0k83N35k59p1J85k1J02J0J4j95O5J46k86
6461a30L0M65k17l86L87j30N3q2J58j08L34k49k52L89K5k11k13L90l0l08J87M42
6483E44n57N1K76m68m0L02k19L22J24k45o9K1J95l32K12k5k42L13K01n49l03O25
6505A37n04J3M26J7m52L00k40J82R6J42k13r4J36m5m1J12K3KJ27k44J49n05P44
$$ plain form
6528 268 -116 -65 -243 -174 -389 -272 87 -280 -87 9 -222 -185 -54 92 -338 -75 -187 -124 -29 272 -66 -299
6550 -299 -5 -127 127 -6 -293 -171 -32 215 -297 -119 -166 -77 92 -208 12 -51 13 263 100 125 143 -35
6572 -35 94 311 -254 -40 177 -69 -182 -83 -26 -203 -32 210 -56 -86 223 -209 -124 403 142 171 404 20
6594 20 -73 381 473 -130 108 236 -64 41 187 41 116 273 -87 -48 79 144 -154 123 256 184 -130 272
6616 272 62 163 130 14 75 192 405 44 407 71 37 -19 -187 158 305 377 113 -134 136 53 221 147
6638 147 -63 214 28 206 -334 211 66 102 -135 -121 22 25 -7 24 21 -285 358 -221 67 135 119 -349 -127
6661 -127 -18 -179 -275 68 15 -221 155 127 -2 -74 -32 -218 -145 -244 77 17 130 4 -57 147 -22 -187 49
6684 49 22 224 -308 34 97 405 329 320 -10 133 334 -148 400 153 80 325 354 154 -76 97 209 35 319
$$ packed form
6528B68l84N1j78O9k15J17L59l67J93R6k31L7J31J46m30K63j12O3R5L01l38k33
6550b99K94j22K54j33k87J22J39K47n12J78m7Q9J69l00K20o3O4K50j63K5J8j78
6572c5J29K17n65K14K17k46j13R9N7j77J71K42k66l0L09m32Q5N27k61K9K33l84
6594B0r3M54R2o03K38J28l00J05J46j46P5J57l60L9J27O5k98K77J33p2l14M02
6616B72k10J01l3j16O1J17K13l61L63l36l4n6j68L45J47P2k64k47K70q3J68p4
6638A47k10K77j86J78n40N45j45L6k37J4J43Ll2L1ll06O43n79K88O8j6m68K22
6661a27J09j61r6L43n3k36L76k8j29p2M2j86P3r9L21o0J13j26o1K04j69j65K36
6684D9k7K02n32L42O3L08p6rl30J43K01m82N48k47p3K45K9k00k30J73J12j74K84
$$ plain form
6707 319 371 277 -25 221 -34 193 172 258 67 168 424 93 234 250 263 171 625 238 263 261 364 -17 290
6730 290 233 -176 365 -80 78 330 -30 130 -21 202 -229 -108 48 -46 -71 -38 115 -4 62 333 113 282
6752 282 144 227 85 118 163 87 85 126 -212 -12 337 180 -35 377 -79 -288 349 -23 158 -274 252 -4
6774 -4 -278 33 -89 -51 415 -224 63 92 -20 -237 265 -264 113 122 239 32 52 481 54 -43 -141 -77 48
6797 48 38 58 -478 24 -272 97 100 336 -73 -350 264 265 -111 142 179 -188 -3 103 -11 105 220 -107 -253
6820 -253 132 250 72 355 53 44 214 210 -64 -50 132 102 -121 267 312 -4 -16 290 160 -46 -26 418 82
6843 82 329 377 -122 113 214 -146 24 -97 -33 473 393 207 75 112 212 31 -50 214 257 278 4 250 3
6866 3 196 244 -87 230 25 123 61 19 -209 208 368 -31 233 138 12 -81 233 161 75 128 5 -183 316 70
$$ packed form
6707C19N2r4l02K46k55K27k1Q6j91J01K56l31J41J6J3r2M54l87K5kJ03l81L07
6730B90n7m09N41m45J58K52l60J60j51K23m31J21J56r4k5L3J53j19O6K71k20J69
6752B82j38Q3j42L3M5p6kM1l38K00L49j57k15M12m56k09O37l72J81m32N26k56
6774dk74L11j22L8M66o39K87K9j12k17N02n29L77RJ17k07K0M29m27r7r8O4J25
6797D8j0K0n36N02k96L69LK36m09k77O14Jl76K53L7l67J85J06j14J16J15l27j46
6820b53L85J18j78K83l02rJ70mk74J4J82l0k23L88M5l16j2L06j30k06K0M44l36
6843H2K47M8m99K35J01l60J70j21O4N06q0j86j32L7J00j81q1K64M3K1k74K46k47
6866CJ93M8l31L17k05R8o2m2k28M17J60l99K64r5j26r3L14p2q6N3j23j88M99k46
$$ plain form
6890 70 62 -242 72 -6 16 -127 -160 -258 123 287 -301 -189 204 -159 -174 246 -106 -99 -196 -105 -276 -311 87 -171
6914 -171 -131 1 -114 18 -319 -107 -35 -99 -178 -255 14 129 -49 169 -18 83 175 239 -21 -103 -112 -1 -142
6937 -142 -240 11 41 314 233 -31 99 -108 -423 -100 167 -71 -157 -29 64 -324 41 248 402 -77 -220 79
6959 79 -88 156 133 18 161 126 -196 -106 212 64 83 119 99 228 163 114 -137 -38 -36 -50 -102 38 -31 -92 159
6984 159 18 -122 330 17 -166 163 170 -89 -88 393 -102 -151 74 411 -18 19 -15 -234 14 2 -48 25 -130
7007 -130 -5 -404 -132 -287 -112 -37 -23 234 61 297 -144 -45 28 -114 -77 -5 -240 -52 -279 260 -157 -127
7029 -127 130 -193 -150 325 -377 -182 268 -290 -316 200 49 -101 -95 -89 -55 56 -119 -33 26 -52 41 -165 -6 -25
7053 -25 -91 -91 100 -205 -393 60 -238 -236 -144 -31 -79 64 -284 -196 101 440 -267 -153 -336 -41 37 127 118 -326
$$ packed form
6890G0ql04L14p8K2j43l3r8L81J64n88J12L93l63j5M20l52Pr7R1j71l5L98k58
6914a71M0J32j15J32l37K12P2o4p9p7K69J15j78K18j87J01R2O4k60q2rJ11j41
6937a42r8K51L0K73q1k64J30k07l15L23K67k38q6J28R3l88L65K07J54m79j43K99
6959G9j67K44k3j15J43l5l22R0L18j48J9L6k0J29o5m9k51R9Kj4n2J40o9o1K51
6984A59j41j40M52l13j83L29Pk59JM81m95m9K25L37m29L7l4k19K48j2n0P3j55
7007a30J25l99K72j55J75P5J4K57j73K36m41R9P3j42L7P2k35J88k27N39m17L0
7029a27K57l23M3M75p02J95M50n58k6N16j51j50OOL4J11j75Q6N9p8R3k06J59j9
7053b5o6%J91l05j88M53k98KR2J13m8J43l48Q8K97L39p07J14j83K95P8R0rm44
$$ plain form
7077 -326 -136 8 252 -66 -47 -135 -199 240 -75 -156 296 35 -94 107 176 16 -132 8 75 -138 46 21
7099 21 254 -249 -147 163 -107 128 -42 176 102 8 -244 200 277 -271 119 40 -69 324 138 -48 146 347
7121 347 -85 143 -74 86 -171 231 -60 -146 -144 193 -60 -329 179 -183 -187 -166 25 -274 -45 113 -125 69
7143 69 114 -313 -298 185 -77 -307 -60 -282 -175 -134 -105 -122 -41 313 -186 -71 96 -224 -84 -147 -129 -168 63
7166 63 -44 -144 -409 -74 -248 -24 48 -372 -230 -78 121 -27 -105 43 221 -240 3 67 -99 98 -143
7187 -143 -100 -128 -205 -226 -52 64 112 -240 198 85 -88 131 293 -103 -128 252 -6 198 165 71 -204 268 103
7210 103 -51 47 77 -72 54 212 -98 110 298 -39 -152 271 179 -221 103 -100 -321 -42 -84 23 342
7231 342 103 485 -66 257 81 -96 198 30 -307 168 303 0 105 65 -264 16 178 309 -50 216
$$ packed form
7077c26J90J44K44l18J9q8o4M39l15q1M52k61j29K01O9j60j48J40O7k13J84k5
7099B1K33n03J02L10k70K35j70K18p4r4k52M44P7n48L90p9j09L93j86j86J94K01
7121C47m32K28k17J60k57M02k91q6KL37k53k69N08l62mK1J91k99K29J58k38J94
7143F9M5m27J5M83k62k30K47k22J07M1K9j7Q1L54m99J15J67l20J40o3J8l9K31
7166F3j07j00k65L35j74K24P2m20J42J52J99j48p8J48J78m61K43O4j66J97k41
7187a43M3k8p7k1J74J16M8l52M38j13j73K19J62l96k5L80k58K04l3r4k75M72j65
7210A03j54R8L0j49J26J58l10K08J88l37j13M23r2m00L24k03k21K79m2J07L19
7231C42k39L82n51L23j76j77K94j68l37M75J35l03J05m0l29K80J62J31l59K66
$$ plain form
7251 216 0 79 -166 36 -66 281 39 41 -107 106 -106 -61 139 -12 -54 -126 -158 -33 -47 15 -130 -7 -98
7274 -98 78 12 135 23 -202 46 31 -22 6 -188 -439 -310 148 -207 -166 -151 -38 -312 -156 124 -296 -197 -137
7297 -137 -178 -26 146 35 -105 -91 -6 100 -84 60 -32 -151 -44 -100 -201 -179 188 -30 -114 100 -83 71
7319 71 194 -92 135 -260 -114 -142 77 -153 100 -2 203 119 174 91 75 95 135 -40 48 290 90 -29 129
7342 129 109 -46 -58 93 185 54 7 -18 -12 382 151 -123 222 -1 -113 98 142 53 42 63 238 -41 -79 378
7366 378 48 190 240 191 96 155 -42 -63 -177 579 -60 36 380 34 172 -75 134 -51 132 -40 138 82
7388 82 -54 -160 62 -45 243 122 34 -21 -151 123 -18 -294 -229 -38 84 211 161 137 -76 -53 -30 10 -320
7411 -320 -103 59 44 94 -178 -233 98 -436 -272 -104 39 315 -106 -273 -215 27 -10 -336 -300 106 -164 62
$$ packed form
7251B16k16P9k45K02j02L47k42Kj48K13k12M5K00j51m2p2l2J25j4O2j45J23r1
7274i8J76o6J23j12k25K48j5n3K8j94k51J29M58l55M1J5J13k74J56K80m20R9O0
7297a37m1J52J72j11j40J4Q5J06j84J44r2j19J07n6j01K2L67k18q4K14j83J54
7319G1J23k86K27l95J46k8K19k30K53j02K05q4N5q3j6K0M0j75Q8K42k00j19J58
7342A29k0j55j2J51R2j31m7k5OL94k31k74L45k23j12K11M4q9j1K1J75k79l8M57
7366C78l30J42N0m9r5N9j97k1j14P56o39R6L44l46J38k47K09j85J83j72J78n6
7388H2j36j06K22j07K88j21q8n5j30K74j41k76O5J91J22J27n0k4k13K3K3M0l30
7411c20K17J62j5N0k72n5L31n34J64J68J43K76m21j67N8K42l7l26L6M06k70K26
$$ plain form
7433 62 86 57 -150 332 -279 126 45 -71 -166 -175 -110 -249 -41 -16 -10 107 165 -308 35 88 -182 59 135 -22 19
7458 19 -222 67 -244 3 21 -70 55 -201 -168 -131 -211 84 -309 -102 96 -44 117 -33 96 18 80 4 131
7481 131 37 214 170 26 89 -98 229 171 -174 88 -64 399 124 105 126 50 -207 119 16 -60 130 59 41
7504 41 -196 109 -150 1 171 -160 -87 412 -164 -20 -99 61 -71 54 18 113 35 -133 -39 -222 153 204 -129
7527 -129 329 -262 67 -111 161 -169 225 240 -347 67 10 -80 -256 -196 -126 -309 -159 19 -270 63 -163 -256
7549 -256 -101 366 -323 -86 61 -47 -201 35 36 -360 30 -99 -372 101 176 -213 -170 -6 262 -51 244
7570 244 27 50 -19 85 -20 8 109 99 269 10 203 -292 131 -22 76 -156 119 -95 -167 48 -119 443
7592 443 32 321 161 89 -185 202 181 188 124 52 170 85 71 112 -69 -55 159 273 -14 267 206 277 -17 143
$$ packed form
7433F2K4k9k07M82o11M05q1j16r5rO5j39K08K5OJ17N8m73L43N3k70K41P6j57M1
7458A9k41K89l11K47J8r1J25k56L3L7q0K95l93K07J98j40J61j50J29p8O2p6J27
7481A31r4J77m4j44O3j87L27n8l45K62j52M63k75j9K1p6k57L26j03p6J90p1j8
7504D1k37L05k59J51J70l31P3M99n76J44p9J60j32J25l6R5p8j68R4j83L75N1l33
7527a29M58n91L29j78K72l30L94J5n87M14n7r0j76O0P0j83J50J78k89L33k26r3
7549b56J55M67o89K37J47j08j54K36Jl96L90j29k73M73P5l89M3J64K68l13K95
7570B44k17K3o9J04j05K8J01j0J70k59J93m95M23j53R8k32K75k14p2K15j67N62
7592D43m11K89j60p2k74L87k1Po4p2J18q5j4M1j81J4K14J14k87K81o1P1k94J60
$$ plain form
7616 143 157 -137 199 171 105 136 174 44 -73 352 173 55 130 -206 -223 163 -124 -20 95 36 90 -121 -18
7639 -18 253 9 94 106 -79 -25 223 53 16 83 -243 -277 6 231 -48 70 27 -260 -164 298 -88 -47 97
7662 97 -118 -89 -51 -197 -56 148 -279 -209 -266 -147 -261 169 -180 -152 10 -55 -203 -51 -227 -216 -329 142 193
7685 193 -413 -15 63 19 -266 88 -258 -359 -126 -82 135 97 -79 -292 -52 338 -42 -119 132 -13 241 -27
7707 -27 -229 67 -29 296 89 19 2 219 299 239 279 -3 72 -60 -78 152 221 65 278 35 148 134 135 143 -270
7732 -270 275 37 -217 222 -37 -185 -50 125 -220 198 -186 -30 -102 196 177 -348 131 242 -97 -73 257
7753 257 132 -31 -8 -51 -195 236 26 65 -143 502 -50 -110 141 -43 -261 -14 -64 -89 84 80 -27 -173 -237
7776 -237 -229 -165 189 159 62 -102 -11 -229 9 214 -177 -187 -56 -41 325 135 -117 -448 14 15 18 137 -105 -267
$$ packed form
7616A43J4k94L36k8o6L1L8j30j17M25j79j18P5l36j7L86k87J04J15n9N4k11J03
7639a8K71k44Q5J2j85N4K48j70l7O7l26l4K83K25k79J18m3k87R6M62l86M1J44
7662I7k15K9L8j46J41K04m27P0n7J19j14M30l49K8J62o5j48J52j76J1j13M71N1
7685A93o06L98P8m4k85L54l46j01K33M4K17l8j76k13K40L90l80p7K51j45K54k68
7707b7k02K96r6L25k07p0j7K17Q0o0M0k82P5j32j8K30O9j56K13k43J13j4JQm13
7732b70N45k38k54M39k59j48J35J75l45M18l84J56p2K98j9n25M79J11l39K4L30
7753B57j25j63K3m3j44M31k10L9k08O45n52o0K51j84k18K47n0k5J73mj07j46o4
7776b37QO4L54l0r7j64R1k18K38K05l91j0J31J5L66j90k52l31M62JLJ19k42j62
$$ plain form
7800 -267 -278 -158 -72 -650 -360 -1 175 -229 -175 -143 102 184 68 -169 37 155 -175 142 -125 -133 161 -102
7822 -102 64 277 6 83 11 27 -16 -298 -102 114 4 -47 -94 -251 24 168 -118 -30 121 -39 71 -36
7844 -36 140 -87 193 320 -72 -98 215 -56 76 -32 116 69 -24 150 -51 300 84 -126 150 416 -184
7865 -184 -20 298 -183 49 260 82 26 120 -67 72 71 167 383 160 -115 -44 -57 240 -121 -256 80 5 -64
7888 -64 -357 -24 274 27 -171 -184 44 52 -77 -253 -23 -118 -153 15 -11 -165 -189 -127 -238 -267 20 97 -225 82
7912 82 -254 -40 -296 19 -202 79 70 -274 -231 86 -199 -126 53 -38 -82 108 115 127 120 -120 -234 -408 -42 -175
7936 -175 -17 -193 -29 -57 -214 28 -138 -63 -148 -191 -330 18 -57 -245 -43 59 78 -219 -25 -112 -193 294 191
7959 191 -232 -104 -318 -212 52 366 -104 -317 93 202 -145 171 -52 -134 -108 47 67 108 74 111 -217 -170
$$ packed form
7800b67j1J20Q6n78K90L59J76m04N4L2K45Q2j16k37K06J18l30L17k67qK94k63
7822a02J66K13k71P7p2J6m3k82J96K16j10n1m7j57K75J44k86Q8J51j60J10j07
7844c6J76k27K80J27l92k6L13k71J32j08J48m7r3J74k01L51k16k10K76K66o00
7865a84J64L18m81K32K11j78n6R4j87J39jR6K16k23k75P1j3K97l61j35L36p5o9
7888f4k93L33K98k47j98j3K28Qj29j76K30r5l5J68k6j54k4O2j11k9K87P7l22L07
7912H2l36K14k56L15k21K81rl44M3L17k85P3J79r1m4J90PJ2pk40j14j74L66j33
7936a75J58j76J64k8j57K42j66P5q5m3j39L48p5j88K02J02J9k97J94q7q1M87j03
7959A91m23J28k14J06K64L14m70k13M10J09l47L16k23q2K6J55K0M1l4L7l28M7
$$ plain form
7981 -170 -105 145 80 50 17 61 78 -354 39 6 -115 -122 204 114 -95 -2 114 102 -51 76 -133 -254 38 -59
8005 -59 -94 -345 37 -58 232 10 -190 -340 195 -138 -107 21 -265 -77 -54 196 -71 122 82 -152 -145 195 -143
8028 -143 -94 -4 114 8 -64 116 -354 -119 -97 -161 -126 -30 -355 -53 183 -3 -397 -14 -134 78 -233 39
8050 39 50 -170 73 -166 62 -114 -199 -148 79 -155 -229 214 -16 -46 -148 133 180 284 48 78 -224 -109 -88
8073 -88 -222 96 302 36 12 49 -1 -270 94 30 -211 138 116 88 222 280 37 50 145 -80 41 106 -74 -21
8097 -21 160 -162 -173 51 -328 -109 95 -78 -94 56 273 46 -11 -44 131 -5 -139 151 -247 -120 226 169
8119 169 24 -290 -95 162 135 276 -256 42 69 -161 181 -254 -2 77 291 -47 -249 -73 103 -278 10
8140 10 78 -42 155 37 -226 330 168 175 143 231 15 257 -114 120 -104 -110 33 -77 242 -149 229 -247 297
$$ packed form
7981a70O5K50o5l0l3M4J7m32L93l3j21pL26r0k09R3J16j2j53J27k09j21K92r7
8005e9l5k51L82r5K90k22k00j50N35l33L1J28k86J88K3K50k67J93m0k34PL40l38
8028a43M9R0J18j06p2J80m70K35K2o4L5R6l25L02K36j86l94L83j20K12l11K72
8050C9J1k20K43k39K28j76q5N1K27k34p4M43k30l0j02K81M7J04k36L0l02J15K1
8073h8j34L18K06k66k4L7n0k69L64o4k41L49k2k8J34N8k43J3R5k25J21O5j80N3
8097b1J81l22j1K24l79K19K04j73j6J50K17k27n7l3J75j36j34K90l98J27L46n7
8119A69j45l14J95K57k7J41n32K98K7k30L42m35K52P9K14l38k02J76J76l81K88
8140A0O8j20J97j18k63N56j62Pl2Q8k16K42l71K34k24oJ43j10L19l91L78m76N44
$$ plain form
8163 297 -327 -311 -202 269 -75 -111 -14 46 -33 -363 130 57 116 -26 84 -251 -205 59 -299 -151 -97 337 -158
8186 -158 -99 -354 443 -143 -89
$$ packed form
8163B97o24J6J09M71l44l6R7O0p9l30M93p3N9j42J10l35M6K64l58J48N4M34m95
8186a58N9k55P97n86N4
8191h9
$$ Imaginary data points
##PAGE= N=2
##DATA TABLE= (X++(I..I)), XYDATA
$$ plain form
0 0 0 0 0 0 0 0 0 8 -8 8 -8 8 -16 16 -16 24 -28 32 -37 44 -52 57 -67 80 -89 104 -116 132 -151 169 -189
31 -189 213 -237 269 -295 330 -366 406 -451 499 -552 611 -675 749 -832 924 -1026 1146 -1285
49 -1285 1448 -1641 1878 -2174 2555 -3064 3785 -4882 6734 -10435 20619 -102320 -310738 67857
63 67857 196674 -136271 -210038 120534 133421 -160533 -129969 158525 100896 -157603 -77717
74 -77717 176047 82032 -146831 -37675 173808 53189 -117849 21171 159265 6443
84 6443 -95499 62694 147569 -899 -71685 61603 130338 10544 -60137 52162 124451
95 124451 5377 -65247 67103 124101 -32490 -76427 96408 119493 -64999 -74383 106270
106 106270 95810 -81019 -59278 107175 68600 -97481 -45366 119315 41361 -130475 -28764
$$ packed form
0@%%%%%%%Qj6J6j6J6k4L2l2M0n2O0o9Q1r6J09j24J47j69J93k20K48k83L20l58
31a89M02m50N06n64O25o96P72q57R50j051J163j286J424j581J756j950K172k431
49a285K733l089L519m052M729n619O849q667J1616j7169L1054j22939k08418L78595
63F7857J28817l32945p3767L30572J2887k93954L0564K88494n7629k58499P9886
74g7717K53764r4015k28863J09156K11483j20619j71038J39020J38094j52822
84F443j01942J58193Q4875j48468p0786J33288O8735j19794p0681J12299P2289
95A24451j19074p0624J32350N6998j56591m3937J72835K3085j84492r384J80653
106A06270j0460j76829K1741J66453l8575j66081N2115J64681p7954j71836J01711
$$ plain form
117 -28764 139967 9648 -151279 737 134446 -38398 -139873 42340 105367 -79152
127 -79152 -110757 66868 72293 -97379 -88924 71916 56739 -97386 -75994 70594 39096
138 39096 -100067 -49025 81754 10890 -107660 -18548 86006 -10957 -97362 264 73853
149 73853 -13925 -77312 1872 62587 -9738 -69473 8889 71791 -17467 -79542 26948 86237
161 86237 -32076 -78433 48258 78958 -46526 -58492 63338 61794 -53721 -40573 74777
172 74777 55414 -62608 -36204 88898 53420 -75158 -24138 102879 31798 -85308 8416
183 8416 108373 -3179 -81521 39442 96908 -26228 -65994 52544 79743 -31922 -52139
194 -52139 54825 67871 -40159 -45109 66504 58522 -57477 -34813 79412 39655 -67712
$$ packed form
117b8764J68731j30319j60927J52016J33709j72844j01475J82213O3027j84519
127g9152l1605J77625N425j69672Q455J60840j5177j54125K1392J46588l1498
138C9096j39163N1042J30779p0864j18550Q9112J04554r6963q6405R7626P3589
149G3853q7778o3387P9184O0715p2325n9735P8362O2902q9258o2075J06490N9289
161H6237j18313m6357J26691L0700j25484j1966J21830j544j15515J3148J15350
172G4777j9363j18022K6404J25102l5478j28578N1020J27017p1081j17106R3724
183H416R9957j11552p8342J20963N7466j23136l9766J18538K7199j11665k0217
194e2139J06964J3046j08030m950J11613p982j15999K2664J14225l9757j07367
$$ plain form
205 -67712 -15115 78930 17280 -62241 -116 65972 5533 -53217 3078 60264 2626 -57831
217 -57831 4512 67779 -5424 -67129 16931 70203 -23697 -63041 35338 57838 -40452 -49054
229 -49054 45503 45127 -45417 -41186 47465 41262 -48855 -39003 55616 37845 -60414 -28444 70283
242 70283 20258 -72303 -4502 76988 -2664 -69529 14795 66924 -14818 -54055 24335 56185
254 56185 -19755 -47756 30072 55815 -26896 -47208 42426 53686 -41451 -39376 56153 40205
266 40205 -49773 -21134 58789 21059 -47487 -7325 54000 14726 -43490 -6195 53199 13911
278 13911 -48171 -2437 59861 3202 -55516 12626 61396 -15907 -52107 29161 51866 -28411
290 -28411 -41044 34329 41670 -29453 -34730 34631 38631 -33405 -34323 42875 35664 -47145 -28303
$$ packed form
205f7712N2597R4045o1650p9521O2125O6088o0439n8750N6295N7186n7638o0457
217e7831O2343O3267p3203o1705Q4060N3272r3900l9344R8379K2500r8290q602
229d9054R4557l76r0544M231Q8651o203r0117R852R4619j7771r8259L1970R8727
242G0283n0025r2561O7801Q1490p9652o6865Q4324N2129q1742l9237P8390L1850
254E6185p5940k8001P7828K5743q2711k0312Q9634J1260r5137K075R5529j5948
266D0205q9978K8639P9923l7730o8546M0162O1325l9274n8216L7295N9394l9288
278A3911o2082M5734O2298n6659n8718O8142M8770p7303l6200Q1268K2705q0277
290b8411j2633P5373P341p1123n277O9361M000p2036r18P7198p211q2809J8842
$$ plain form
303 -28303 55924 22152 -57303 -11032 58804 3820 -53538 4430 50905 -6288 -45733 9039
315 9039 45588 -9353 -46285 12851 48991 -17253 -49786 24155 47323 -32641 -42955 38656
327 38656 34862 -42945 -28664 42069 20730 -42536 -18915 39030 15735 -41302 -18152 40856
339 40856 13746 -47431 -12216 48793 1997 -54733 2659 50763 -14098 -50607 16639 41350
351 41350 -23044 -40069 20575 33303 -23691 -35613 21741 33348 -28015 -36956 30736 32899
363 32899 -39292 -30679 42637 21817 -47267 -15296 45790 7319 -43908 -2937 40989 1079
375 1079 -38581 280 40800 1016 -40672 4543 46235 -7205 -44129 18425 47216 -21405
387 -21405 -38465 32478 37236 -29920 -25233 36628 27202 -28305 -17568 35256 24749 -28167 -16077
$$ packed form
303b8303Q4227l3772p9455M6271O9836n4984n7358N7968M6475n7193l9445N4772
315I039L6549n4941l6932N9136L6140o6244l2533P3941K3168p9964j0314Q1611
327C8656l794p7807J4281P0733k1339o3266K3621N7945k3295n7037K3150N9008
339D0856k7110o1177L5215O1009m6796n6730N7392M8104o4861l6509O7246K4711
351D1350o4394j7025O0644J2728n6994j1922N7354J1607o1363q941O7692K163
363C2899p2191Q613P3316k0820o9084L1971O1086l8471n1227M0971M3926l9910
375A079l9660L8861M0520l9784m1688M5215M1692n3440l6924O2554K8791o8621
387b1405j7060P0943M758o7156M687O1861r426n5507J0737N2824j0507n2916J2090
$$ plain form
400 -16077 40530 23205 -36526 -10147 49597 12686 -42744 4258 50848 -1874 -37932 16034
412 16034 42790 -8864 -29835 18866 37073 -10015 -28607 19832 38303 -14842 -31331 27941
424 27941 36972 -27112 -25878 38212 26000 -35089 -14087 40023 13189 -33947 -5967 35196
436 35196 8332 -31777 -6020 35456 6333 -37442 -2840 40524 -2880 -42955 8941 40599
448 40599 -17513 -38967 19694 30804 -25599 -29793 22087 22314 -26086 -25773 21387 20565 -29053
461 -29053 -26792 26925 18845 -38767 -21643 35304 7873 -44684 -8415 35867 -5542 -40955
473 -40955 1438 29044 -11280 -35213 2762 25830 -11736 -35655 4659 28977 -16954 -37853
485 -37853 14381 28536 -28158 -32315 24929 19561 -34239 -21074 27124 11075 -31687 -14406
$$ packed form
400a6077N6607j7325n9731K6379N9744l6911n5430M7002M6590n2722l6058N3966
412A6034K6756n1654k0971M8701J8207m7088j8592M8439J8471n3145j6489N9272
424B7941R031o4084J234O4090j2212o1089K1002N4110k6834m7136K7980M1163
436C5196k6864m0109K5757M1476k9123m3775L4602M3364m3404m0075N1896L1658
448D0599n8112k1454N8661J1110n6403m194N1880K27m8400L13M7160q22m9618
461b9053K261N3717q080n7612J7124N6947k7431n2557L6269M4282m1409l5413
473d0955M2393K7606m0324k3933L7975K3068l7566k3919M0314K4318m5931k0899
485c7853N2234J4155n6694m157N7244n368n3800J3165M8198j6049m2762J7281
$$ plain form
497 -14406 25074 9188 -29863 -13227 28738 8840 -35253 -7806 36696 1222 -38515 4973
509 4973 38352 -9995 -33587 16503 31626 -14878 -24091 20175 27078 -14121 -20537 21612 28771
522 28771 -16691 -20319 29715 27489 -24880 -14042 38773 19261 -29179 -1539 39608 8859
534 8859 -25099 6681 34809 4805 -20620 7674 33580 4713 -22986 9878 37130 -1916
546 -1916 -26604 18776 36231 -13306 -22622 27514 27769 -19652 -14411 27630 19698 -18704 -11505
559 -11505 25069 17607 -20598 -12934 28663 15528 -28901 -9409 34397 5732 -34562 1031
571 1031 33786 -6716 -31328 9506 26729 -12820 -26092 10455 22114 -13502 -25636 11490
583 11490 22719 -18265 -27007 18633 20333 -27767 -21638 25829 11463 -32015 -11207 25870 1935
$$ packed form
497a4406L9480j5886l9051J6636M1965j9898m4093K7447M4502l5474l9737M3488
509D973L3379m8347k3592N0090J5123m6504r213M4266O903m1199o416M2149P159
522B8771m5462l628N0034k226n2369J0838N2815j9512m8440K7640M1147l0749
534H859l3958L1780K8128l0004k5425K8294K5906k8867k7699L2864K7252l9046
546a916k4688M5380J7455m9537r316N0136K55m7421N241M2041p932l8402P199
559a1505L6574p462l8205P664M1597j3135m4429J9492M3806k8665m0294L5593
571A031L2755m0502k4612M0834J7223l9549j3272L6547J1659l5616j2134L7126
583A1490J1229m0984q742M5640J700m8100O129M7467j4366m3478K0808L7077k3935
$$ plain form
596 1935 -28059 -4937 21564 47 -25459 -4433 22130 228 -28320 -1483 27027 -5932
608 -5932 -30566 7986 27123 -15213 -25604 16539 20655 -18635 -18444 17520 16242 -16769 -15840
621 -15840 17499 16949 -18793 -16368 23343 16497 -26250 -11684 30673 8418 -29857 -226 31253
634 31253 -1846 -26273 7534 26534 -5928 -21629 8905 24271 -5973 -22403 10814 25972
646 25972 -11439 -22840 19026 23753 -20071 -17149 26125 15493 -23236 -7501 25237 7875
658 7875 -20001 -3050 21949 6017 -18710 -3194 23373 5825 -23178 -976 27771 1
670 1 -25152 7616 26331 -9390 -21319 14149 20524 -11908 -16221 13268 17231 -10932 -15922 13531
684 13531 18085 -14194 -17427 19396 17107 -22426 -12913 26116 9350 -26386 -4052 25632 562
$$ packed form
596A935k9994K3122K6501k1517k5506K1026K6563k1902k8548K6837K8510l2959
608e932k4634L8552J9137m2336j0391M2143M116l9290J91L5964j278l3011R29
621a5840L3339n50l5742K425L9711o846m2747J4566M2357k2255l8275K9631L1479
634C1253l3099k4427L3807J9000l2462j5701L0534J5366l0244j6430L3217J5158
646B5972l7411j1401M1866M727m3824K922M3274j0632l8729J5735L2738j7362
658G875k7876J6951K4999j5932k4727J5516K6567j7548k9003K2202K8747k7770
670Ak5153L2768J8715l5721j1929L5468O375l2432m313K9489L963k8163m990K9453
684A3531M554l2279l233L6823k289l9533R513L9029j6766l5736K2334K9684k5070
$$ plain form
697 562 -23173 2086 21655 -2448 -21230 2570 21507 -3114 -23557 5062 23953 -9657
709 -9657 -24591 13367 21458 -18854 -19139 19649 13250 -22025 -11628 18403 6054 -19591 -8047
722 -8047 15684 5074 -19934 -8511 17979 4055 -24715 -5689 22090 -2824 -26391 2445
734 2445 20028 -10568 -21688 7762 14811 -11839 -17031 6875 12741 -10178 -17416 7188 14827
747 14827 -13210 -18655 13781 14484 -20737 -14265 20764 8358 -23032 -6551 20645 1876 -20140
760 -20140 -829 18522 629 -18945 -588 20731 337 -21284 3187 23830 -5623 -21987
772 -21987 12466 22087 -13677 -16080 18791 15311 -15779 -8707 18061 10538 -12940 -5564 16934
785 16934 10318 -13762 -6124 20139 9437 -18405 -2288 24144 2980 -19284 5112 21482
$$ packed form
697E62k3735K5259J9569k4103j8782K3800J8937k4621k0443K8619J8891l3610
709i657j4934L7958Q091m0312k85L8788o399l5275J0397L0031j2349k5645J1544
722h047K3731j0610k5008J1423K6490j3924k8770J9026K7779k4914k3567K8836
734B445J7583l0596j1120K9450P049k6650n192K3906N866k2919p238K4604P639
747A4827k8037n445L2436P03l5221O472L5029j2406l1390J6481K7196j8769k2016
760b0140J9311J9351j7893j9574J8357K1319k0394k1621K4471K0643k9453j6364
772b1987L4453R621l5764k403L4871l480l1090P072K6768p523k3478P376K2498
785A6934o616k4080P638K6263j0702k7842J6117K6432k1164k2264K4396J6370
$$ plain form
797 21482 -3828 -14811 9152 16899 -4264 -11791 7388 15949 -2811 -13161 7808 18563 -6803
810 -6803 -15365 14505 17536 -14409 -11380 19804 11293 -16776 -4877 19454 5927 -14548 -2023
823 -2023 17207 5547 -14958 -2385 19835 4457 -18811 1197 22785 -2029 -19933 9400
835 9400 20828 -10161 -15112 14851 14510 -12165 -9671 13888 10880 -10632 -8425 12655 10370 -12943
849 -12943 -9070 16762 8817 -18036 -5365 19496 2602 -18622 1495 16899 -3968 -14985
861 -14985 4083 12513 -4141 -12377 2187 12187 -3473 -14883 3198 14774 -7561 -17188 9346
874 9346 13738 -14012 -13207 13702 8166 -16124 -7788 12972 4310 -13602 -6327 11682 5156 -14767
888 -14767 -6770 15540 4124 -18961 -2509 19508 -2489 -19796 5773 17663 -8989 -14954
$$ packed form
797B1482k5310j0983K3963P747k1163p527J9179Q561j8760j0350K0969J0755k5366
810f803q562K9870L031l1945L029L1184q511k8069J1899K4331j3527k0475J2525
823b023J9230j1660k0505J2573K2220j5378k3268K0008K1588k4814j7904K9333
835I400J1428l0989m951K9963l41k6675K494K3559l008k1512K207K1080k285k3313
849a2943L873K5832p945k6853J2671K4861j6894k1224K0117J5404k0867j1017
861a4985J9068Q430j6654q236J4564J0000j5660j1410J8081J1576k2335r627K6534
874I346M392k7750Q05K6909n536k4290Q336K0760q662j7912P275J8009o526j9923
888a4767P997K2310j1416k3085J6452K2017k1997j7307K5569J1890k6652n965
$$ plain form
900 -14954 10607 12504 -9982 -10132 9812 10156 -8392 -9527 10318 11480 -10333 -9560 15006 9631
914 9631 -15057 -4590 18312 3743 -15496 1911 15707 -719 -10979 3504 12349 -81
926 -81 -9485 1844 13015 376 -12595 3370 15989 -3968 -14424 8963 14650 -10251 -10520
939 -10520 12768 8943 -11447 -6843 11005 6406 -10027 -6184 10116 6623 -12410 -7538 13741
952 13741 5007 -17163 -3692 17125 -1967 -18947 3236 14753 -8024 -14499 6527 9667 -9020
965 -9020 -11406 5096 8626 -8166 -12162 5787 9599 -11328 -12318 10683 7445 -15715 -7717 13506
979 13506 1507 -15260 -2053 11007 -1875 -11431 -693 8508 -523 -10977 -1979 10932 225
992 225 -13741 597 14117 -4065 -14595 6698 12809 -9227 -10615 9493 8296 -9045 -6389
$$ packed form
900a4954K5561J897k2486j50J9944L44j8548j135J9845J162k1813P73K4566n375
914I631k4688J0467K2902j4569j9239J7407J3796j6426j0260J4483Q845j2430
926h1r404J1329J1171j2639j2971J5965J2619j9957j0456K3387N687k4901k69
939a0520K3288l825k0390M604J7848m599j6433L843J6300l493j9033M872K1279
952A3741q734k2170J3471K0817j9092j6980K2183J1517k2777o475K1026L140j8687
965i020k386J6502L530j6792l996J7949L812k0927r90K3001l238k3160P998K1223
979A3506j1999j6767J3207J3060j2882r556J0738R201r031j0454Q998J2911j0707
992B25j3966J4338J3520j8182j0530K1293O111k2036j388K0108j197j7341K656
$$ plain form
1005 -6389 8669 6805 -7127 -6877 8863 8622 -9762 -7152 13602 6955 -14007 -2584 16920
1018 16920 1258 -14718 4088 14815 -3473 -10071 6327 11188 -3468 -8142 5109 11313 -2812
1031 -2812 -9898 6641 12890 -6478 -9984 11622 10848 -10783 -5186 14028 4870 -10701 -505
1044 -505 11701 1841 -7727 -163 9429 3352 -8173 -1422 12255 2736 -11930 997 14754 -2290
1058 -2290 -12218 6591 12319 -6896 -8706 8314 7994 -6703 -5793 6748 6876 -5631 -7596 7202
1072 7202 8137 -8795 -8018 10890 6490 -13436 -4200 13665 409 -13793 1122 11152 -3397
1085 -3397 -10533 1991 7885 -2813 -9719 516 8836 -3302 -12176 2892 10520 -7351 -12150
1098 -12150 7649 7988 -11993 -7959 9496 2732 -11468 -3952 7258 962 -8690 -3948 6425
$$ packed form
1005f389J5058j864j3932K50J5740k41j8384K610K0754o647k0962J1423J9504
1018A6920j5662j5976J8806J0727j8288o598J6398M861j4656m674J3251O204j4125
1031b812p086J6539O249j9368l506K1606p74k1631N597J9214r158j5571J0196
1044e05J2206r860r568P564R592o077j1525O751J3677r519j4666J2927J3757j7044
1058b290r928J8809N728j9215j810J7020l20j4697R10J2541J28j2507j965J4798
1072G202R35j6932P77J8908m400j9926R236J7865j3256j4202J4915J0030j4549
1085c397p136J2524N894j0698o906J0235Q320j2138q874J5068P628j7871m799
1098a2150J9799L39j9981M034J7455o764j4200P516J1210o296r652M742J0373
$$ plain form
1111 6425 2367 -9477 -5033 9183 1818 -12937 -1434 12079 -2881 -12720 3934 9773 -6210
1124 -6210 -8471 5630 6262 -5375 -6146 4411 6731 -3827 -7235 6039 9038 -6837 -7820 10658
1138 10658 7876 -10510 -2905 13398 2822 -9977 1887 11476 556 -6570 2501 9547 1707
1151 1707 -6429 1924 11540 1059 -8661 4768 13575 -3041 -8814 9781 10629 -7158 -4143 11468
1165 11468 6019 -6173 -961 9193 4684 -5034 -2123 8206 5978 -6640 -3260 11125 4123
1178 4123 -10284 -185 12315 -1183 -9947 4036 9212 -4809 -7098 4244 5472 -3673 -6456
1191 -6456 2106 5642 -4085 -8928 3256 7527 -8121 -9628 7349 4898 -12171 -5747 8727 -386
1205 -386 -11899 -2297 6088 -2516 -9353 -2664 4494 -1295 -10257 -3567 6996 -1987 -12901 -56
$$ packed form
1111F425m058j1844M444J4216p365j4755J1503J3513j4960r839J6654N839j5983
1124f210k261J4101O32j1637p71J0557K320j0558l408J3274K999j5875r83J8478
1138A0658k782j8386P605J6303j0576j2799J1864R589j0920p126R071P046p840
1151A707q136Q353R616j0481r720J3429Q807j6616n773J8595Q48j7787L015J5611
1165A1468n449j2192N212J0154m509r718K911J0329k228j2618L380J4385p002
1178D123j4407J0099J2500j3498q764J3983N176j4021k289J1342J228r145k783
1191f456Q562L536r727m843J2184M271j5648j507J6977k451j7069O424J4474r113
1205c86j1513R602Q385q604o837O689P158n789q962O690J0563q983j0914J2845
$$ plain form
1219 -56 8530 -7118 -11867 4853 5751 -10121 -7545 6050 1953 -8776 -4731 3958 1795 -7003
1233 -7003 -5686 4625 3577 -8421 -6054 8316 2337 -11191 -1463 9912 -2006 -10053 2772
1246 2772 7506 -3720 -6144 2799 5331 -1870 -5515 1746 7058 -1413 -7486 3940 9077 -5114
1260 -5114 -7153 8463 7259 -7930 -2919 9734 2562 -7091 222 7932 2038 -4913 -429 7047
1274 7047 3375 -6021 -1081 9730 1763 -9109 2527 11563 -2814 -8553 6783 8480 -5625
1287 -5625 -4275 6938 4971 -4550 -2731 5134 4999 -3830 -4588 5793 5912 -6401 -4790 8753 3432
1302 3432 -9566 -869 9356 -944 -8431 2088 6469 -2820 -6004 1448 4611 -1441 -6115 16
1316 16 6044 -1978 -8523 1944 7209 -5766 -8438 5362 4419 -9080 -4909 5992 640 -8009
$$ packed form
1219e6Q586j5648m749J6720Q98j5872K576J3595m097j0729M045Q689k163q798
1233g003J317J0311j048j1998K367J4370n979j3528R728J1375j1918q047J2825
1246B772M734j1226k424Q943K532p201l645P261N312q471o073J1426N137j4191
1260e114k039J5616j204j5189N011J2653p172r653P313P710n894o951M484P476
1274G047l672r396M940J0811p967j0872J1636R036j4377n739J5336J697j4105
1287e625J350J1213j967r521J819P865j35q829p58J0381J19j2313J611J3543n321
1302C432j2998Q697J0225j0300p487J0519M381r289l184P452L163o052m674O131
1316A6O028q022o545J0467N265j2975k672J3800r43j3499M171J0901n352q649
$$ plain form
1330 -8009 -2757 3579 228 -6511 -4229 3500 1584 -8390 -4591 6485 -188 -11169 -1198 8067
1344 8067 -4830 -10252 2882 5065 -6727 -6844 3001 1871 -5383 -5514 1617 3302 -4779 -6789 3351
1359 3351 4755 -7692 -6390 7008 2300 -9847 -2073 7834 -1572 -8295 1005 4845 -2364 -5342
1373 -5342 72 4072 -552 -6090 -315 6576 -829 -8002 2312 7971 -4420 -6786 6199 5413
1387 5413 -6258 -2931 6407 2244 -4864 -1174 4434 2987 -3566 -2937 5361 4415 -5766 -2531 8600
1402 8600 2424 -7910 1111 9698 -1413 -6963 4536 7048 -2848 -3630 4259 4921 -1539 -3683 2901
1417 2901 5861 -2135 -5015 4996 7236 -5526 -4428 8212 3996 -7746 -711 8179 44 -6077
1431 -6077 1202 5422 -135 -3781 -127 4514 898 -5167 -759 6647 -648 -7746 1847 7119 -4009
$$ packed form
1330h009N252O336l351o739K282P729j916r974L799J1076o673j0981R971R265
1344H067j2897n422J3134K183j1792j17R845j130p254j31P131J685q081k010J0140
1359C351J404j2447J302J3398m708j2147P774R907r406o723R300L840p209k978
1373e342N414M000m624n538N775O891p405p173J0314N659j2391k366J2985p86
1387E413j1671L327R338m163p108L690N608j447o553O29Q298r46j0181L235J1131
1402H600o176j0334R021Q587j1111n550J1499K512r896p82P889O62o460k144O584
1417B901K960p996k880J0011K240j2762J098J2640m216j1742P035Q890q135o121
1431f077P279M220n557l646L654M641l616o065M408P406p295p098R593N272j1128
$$ plain form
1446 -4009 -6569 4984 4206 -5785 -3390 4402 1699 -4305 -2923 2560 2237 -4090 -4638 3386 3600 -6966
1462 -6966 -4419 6875 853 -8997 -978 7066 -2704 -7815 1725 4486 -3564 -5147 1303 3050 -2440
1477 -2440 -5446 279 4435 -2985 -7123 3507 5606 -6354 -5488 6159 2465 -7655 -1484 6072
1491 6072 -736 -6082 -74 4185 -290 -3712 -994 3723 1414 -5153 -991 6569 27 -6633 1995
1506 1995 6845 -3187 -5204 4884 4519 -3716 -2029 4060 2883 -1988 -1561 2904 4555 -1676 -3252
1521 -3252 4889 5506 -4445 -2968 8027 3133 -6316 715 8209 -204 -5081 3064 5817 -541 -2468
1536 -2468 1926 4921 321 -3772 1727 6643 -901 -5538 4391 6781 -4293 -3902 7089 3432 -5834
1551 -5834 -385 6159 781 -3865 491 3846 1155 -3067 -986 4066 2016 -4508 -876 5810 -178
$$ packed form
1446d009k560J1553p78r991K395P792k703o004J382N483l23o327n48Q024K14j0566
1462f966K547J1294o022r850Q019Q044r770n111R540K761q050j583O450J747n490
1477b440l006N725M156p420m138J0630K099j1960Q66J1647l694j0120O171P556
1491F072o808n346O008M259m475l422K718M717k309o567M162P560o542o660Q628
1506A995M850j0032k017J0088l65q235J687O089j177m871M27M465J651o231j576
1521c252Q141O17r951J477J0995m894r449P031P494q413m877Q145K753o358j927
1536b468M394K995m600m093N499M916p544m637R929K390j1074L91J0991l657r266
1551e834N449O544n378m646M356L355k691m222K081N052k050o524L632O686n988
$$ plain form
1566 -178 -6304 1718 5972 -2881 -4868 3191 3035 -3710 -2581 2378 1786 -2127 -3150 1282 3701 -2666
1582 -2666 -5048 2898 3979 -5655 -4354 5666 1659 -7133 -988 5465 -1145 -5609 393 3607 -1462
1597 -1462 -4020 -252 3244 -458 -5458 59 5019 -2222 -6640 2800 5368 -5154 -4566 5112 2185
1612 2185 -6143 -1584 4164 105 -4033 -983 2671 1204 -2903 -1968 3695 1935 -4728 -1238 6061
1627 6061 413 -5988 1862 5562 -2655 -3847 3542 3157 -2375 -1759 2490 2698 -520 -2489 1837 4745
1643 4745 -1178 -3973 3894 5174 -4026 -2551 6353 2539 -5178 419 5586 353 -3453 1485 4128
1658 4128 497 -2445 564 4466 1343 -4063 777 6108 -594 -5177 3302 5829 -3425 -3781 5195
1673 5195 2991 -4111 -1106 4043 1041 -2783 -626 2451 1716 -2776 -2279 3612 2279 -5014 -1620
$$ packed form
1566a78o126Q022M254q853j987Q059j56o745J129M959n92l913j023M432K419o367
1582b666k382P946J081r634J301J0020m007q792O145O453o610m464O002L214n069
1597a462k558L768L496l702n000N517M960p241m418R440K568j0522N88R678k927
1612B185q328M559N748m059m138L050L654j467m107R35N663j760o663L490P299
1627F061n648o401P850L700q217j192P389l85n532O16M249K08l218j969M326K908
1643D745n923k795P867J280r200J475Q904l814p717N597N167n233l806M938K643
1658D128l631k942L009L902l123n406M840N331o702m583Q479K527r254l56Q976
1673E195k204p102L005N149l002l824K157L077p35m492M97N891j333p293L394
$$ plain form
1688 -1620 5247 -214 -5804 1070 4676 -2821 -4391 1770 1922 -2650 -2795 349 1291 -1620 -4247 -41
1704 -41 3085 -2611 -5576 1771 2991 -5348 -4412 3700 367 -6618 -1790 2818 -1625 -4769 -1321 1412
1720 1412 -1239 -4474 -2508 2173 -354 -6175 -1742 3780 -2730 -7016 866 3618 -5103 -5357 2748
1735 2748 754 -4910 -2637 1913 72 -3362 -2722 959 1137 -3375 -3642 2854 1669 -5392 -2010 4487
$$ packed form
1688a620O867n461n590O874L606p497j570O161J52m572j45L144R42k911k627M206
1704d1L126n696k965P347J220q339R36Q112l333o985M828M608m443l144L448K733
1720A412k651l235J966M681k527n821M433N522o510m286P882K752q721k54Q105
1735B748j994n664K273M550j841l434O40L681J78m512k67O496j185p061L382O497
$$ [...]
8191A60
##END NTUPLES=NMR FID
##END=
