##TITLE=1H_SA_NO2CN2
 CDCl3, 8 sc, 
 29.07.2021
##JCAMPDX= 6.0         $$ Bruker NMR JCAMP-DX V2.0
##DATA TYPE= NMR FID
##DATA CLASS= NTUPLES
##ORIGIN= UXNMR, Bruker Analytische Messtechnik GmbH
##OWNER= root
$$ XWIN-NMR		Version 3.5
$$ Thu Jul 29 09:21:39 2021 Russian Standard Time (UT+4h)  she@DPX200
##.OBSERVE FREQUENCY= 200.131506
##.OBSERVE NUCLEUS= ^1H
##.DELAY= (6, 6)
##.ACQUISITION MODE= SIMULTANEOUS
##.ACQUISITION SCHEME= undefined
##.AVERAGES= 8
##.DIGITISER RES= 18
##SPECTROMETER/DATA SYSTEM= spect
##.PULSE SEQUENCE= zg30
##.SOLVENT NAME= CDCl3
##.SHIFT REFERENCE= (INTERNAL, CDCl3, 0, 15.7039)
##AUDIT TRAIL= $$ (NUMBER, WHEN, WHO, WHERE, WHAT)
$$ ##TITLE= Audit trail, XWIN-NMR		Version 3.5
$$ ##JCAMPDX= 5.01
$$ ##ORIGIN= Bruker BioSpin GmbH
$$ ##OWNER= she
$$ F:/spectra/data/she/nmr/H-F/1/audita.txt
$$ ##AUDIT TRAIL=  $$ (NUMBER, WHEN, WHO, WHERE, WHAT)
(   1,<2021-07-29 09:20:26.45 +0400>,<she>,<DPX200>,
      <created by zg, POWCHK disabled, PULCHK disabled
       configuration hash MD5:
       00 E9 B6 7A A2 85 ED C7 34 08 36 98 17 FE 4E 26
       data hash MD5: 16K
       19 B4 D8 4C 7F 25 3A 40 D4 19 D2 56 07 05 14 79>)
$$ ##END=
$$ 
$$ hash MD5
$$ 5E 45 E4 53 AC D8 22 9A EC 83 80 23 65 58 2C A2
##$RELAX= 
##$RELAX= 
##$RELAX= 
##$RELAX= 
##$RELAX= 
##$RELAX= 
$$ Bruker specific parameters
$$ --------------------------
##$DU= <F:/spectra>
##$EXPNO= 1
##$NAME= <H-F>
##$PROCNO= 1
##$TYPE= <nmr>
##$USER= <she>
##$AMP= (0..31)
100 100 100 100 100 100 100 100 100 100 100 100 100 100 100 100 100 100 
100 100 100 100 100 100 100 100 100 100 100 100 100 100 
##$AQSEQ= 0
##$AQ_mod= 1
##$AUNM= <au_zg>
##$AUTOPOS= <>
##$BF1= 200.13
##$BF2= 200.13
##$BF3= 200.13
##$BF4= 200.13
##$BF5= 200.13
##$BF6= 200.13
##$BF7= 200.13
##$BF8= 200.13
##$BYTORDA= 1
##$CFDGTYP= 0
##$CFRGTYP= 5
##$CHEMSTR= <none>
##$CNST= (0..31)
1 1 145 1 1 1 1 1 1 1 1 1 1 1 1 1 1 1 1 1 1 1 1 1 1 1 1 1 1 1 1 1 
##$CPDPRG= <>
##$CPDPRG1= <>
##$CPDPRG2= <>
##$CPDPRG3= <>
##$CPDPRG4= <mlev>
##$CPDPRG5= <mlev>
##$CPDPRG6= <mlev>
##$CPDPRG7= <mlev>
##$CPDPRG8= <mlev>
##$CPDPRGB= <>
##$CPDPRGT= <>
##$D= (0..31)
0 1.2 0 0 0 0 0 0 0 0.06 0 0.03 0 0 0 0 0.0002 0 0 0 0 0 0 0 0 0 0 0 0 
0 0 0 
##$DATE= 1627536025
##$DBL= (0..7)
120 120 120 120 120 120 120 120 
##$DBP= (0..7)
150 150 150 150 150 150 150 150 
##$DBP07= 0
##$DBPNAM0= <>
##$DBPNAM1= <>
##$DBPNAM2= <>
##$DBPNAM3= <>
##$DBPNAM4= <>
##$DBPNAM5= <>
##$DBPNAM6= <>
##$DBPNAM7= <>
##$DBPOAL= (0..7)
0.5 0.5 0.5 0.5 0.5 0.5 0.5 0.5 
##$DBPOFFS= (0..7)
0 0 0 0 0 0 0 0 
##$DE= 6
##$DECBNUC= <off>
##$DECIM= 32
##$DECNUC= <off>
##$DECSTAT= 4
##$DIGMOD= 1
##$DIGTYP= 9
##$DL= (0..7)
0 120 120 120 120 120 120 120 
##$DP= (0..7)
150 150 150 150 150 150 150 150 
##$DP07= 0
##$DPNAME0= <>
##$DPNAME1= <>
##$DPNAME2= <>
##$DPNAME3= <>
##$DPNAME4= <>
##$DPNAME5= <>
##$DPNAME6= <>
##$DPNAME7= <>
##$DPOAL= (0..7)
0.5 0.5 0.5 0.5 0.5 0.5 0.5 0.5 
##$DPOFFS= (0..7)
0 0 0 0 0 0 0 0 
##$DQDMODE= 0
##$DR= 18
##$DS= 0
##$DSLIST= <SSSSSSSSSSSSSSS>
$$ [...]
##$SUBNAM2= <"">
##$SUBNAM3= <"">
##$SUBNAM4= <"">
##$SUBNAM5= <"">
##$SUBNAM6= <"">
##$SUBNAM7= <"">
##$SUBNAM8= <"">
##$SUBNAM9= <"">
##$SW= 20.0188882624521
##$SWIBOX= (0..15)
0 0 2 0 0 0 0 0 0 0 0 0 0 0 0 0 
##$SW_h= 4006.41025641026
##$TD= 16384
##$TD0= 1
##$TE= 0
##$TE2= 300
##$TE3= 300
##$TEG= 300
##$TL= (0..7)
0 120 120 120 120 120 120 120 
##$TP= (0..7)
150 150 150 150 150 150 150 150 
##$TP07= 0
##$TPNAME0= <>
##$TPNAME1= <>
##$TPNAME2= <>
##$TPNAME3= <>
##$TPNAME4= <>
##$TPNAME5= <>
##$TPNAME6= <>
##$TPNAME7= <>
##$TPOAL= (0..7)
0.5 0.5 0.5 0.5 0.5 0.5 0.5 0.5 
##$TPOFFS= (0..7)
0 0 0 0 0 0 0 0 
##$TUNHIN= 0
##$TUNHOUT= 0
##$TUNXOUT= 0
##$USERA1= <user>
##$USERA2= <user>
##$USERA3= <user>
##$USERA4= <user>
##$USERA5= <user>
##$V9= 5
##$VALIST= <valist>
##$VCLIST= <CCCCCCCCCCCCCCC>
##$VD= 0
##$VDLIST= <DDDDDDDDDDDDDDD>
##$VPLIST= <PPPPPPPPPPPPPPP>
##$VTLIST= <TTTTTTTTTTTTTTT>
##$WBST= 1024
##$WBSW= 4
##$XGAIN= (0..3)
0 0 0 0 
##$XL= 0
##$YL= 0
##$YMAX_a= 41178
##$YMIN_a= -32487
##$ZGOPTNS= <>
##$ZL1= 120
##$ZL2= 120
##$ZL3= 120
##$ZL4= 120
##$ABSF1= 10
##$ABSF2= 0
##$ABSG= 5
##$ABSL= 3
##$ALPHA= 0
##$AQORDER= 0
##$ASSFAC= 0
##$ASSFACI= 0
##$ASSFACX= 0
##$ASSWID= 0
##$AUNMP= <proc_1d>
##$AZFE= 0.1
##$AZFW= 0.1
##$BCFW= 1
##$BC_mod= 2
##$BYTORDP= 1
##$COROFFS= 0
##$CY= 11.3945322036743
##$DATMOD= 1
##$DC= 2
##$DFILT= <>
##$DTYPP= 0
##$F1P= 2.36226072786647
##$F2P= -0.459571619588291
##$FCOR= 0.5
##$FTSIZE= 0
##$FT_mod= 4
##$GAMMA= 1
##$GB= 0.15
##$INTBC= 1
##$INTSCL= 1
##$ISEN= 128
##$LB= 0.24
##$LEV0= 0
##$LPBIN= 0
##$MAXI= 10000
##$MC2= 0
##$MEAN= 0
##$ME_mod= 0
##$MI= 1.114404
##$NCOEF= 0
##$NC_proc= 0
##$NLEV= 6
##$NOISF1= 3.799351
##$NOISF2= 2.8
##$NSP= 1
##$NTH_PI= 0
##$NZP= 0
##$OFFSET= 15.70392
##$PC= 1
##$PHC0= -12994.78
##$PHC1= 10.60099
##$PH_mod= 1
##$PKNL= yes
##$PPARMOD= 0
##$PSCAL= 0
##$PSIGN= 0
##$REVERSE= no
##$SF= 200.130013532006
##$SI= 16384
##$SIGF1= 3
##$SIGF2= 2
##$SINO= 400
##$SIOLD= 16384
##$SREGLST= <1H.CDCl3>
##$SSB= 0
##$STSI= 0
##$STSR= 0
##$SW_p= 3612.71676300578
##$SYMM= 0
##$S_DEV= 0
##$TDeff= 0
##$TDoff= 0
##$TI= <>
##$TILT= no
##$TM1= 0
##$TM2= 0
##$TOPLEV= 0
##$USERP1= <user>
##$USERP2= <user>
##$USERP3= <user>
##$USERP4= <user>
##$USERP5= <user>
##$WDW= 1
##$XDIM= 8192
##$YMAX_p= 0
##$YMIN_p= 0
$$ End of Bruker specific parameters
$$ ---------------------------------
##NTUPLES= NMR FID
##VAR_NAME=  TIME,          FID/REAL,        FID/IMAG
##SYMBOL=    X,             R,               I
##VAR_TYPE=  INDEPENDENT,   DEPENDENT,       DEPENDENT
##VAR_FORM=  AFFN,          ASDF,            ASDF
##VAR_DIM=   8192,          8192,            8192
##UNITS=     SECONDS,       ARBITRARY UNITS, ARBITRARY UNITS
##FACTOR=    0.0002496,     1,               1
##FIRST=     0,             0,               0
##LAST=      2.0444736,     0,               0
##MIN=       0,             -32487,          0
##MAX=       2.0444736,     41178,           0
$$ Real data points
##PAGE= N=1
##DATA TABLE= (X++(R..R)), XYDATA
0@%%%%%%%%%%%%%%%%%%kJ0j6J6j6J6j6K2l0L2l5M3m8N4o3P1q0R1j02J13j27J42
40G5j59J78j97K19k42K67k95L24l59L96m35M79n29N83o42P11p89Q78r81J099j241
61f60J415j629J903k267K783l576M966q164L3685M392o671J5001j2573K595J22
76C1322P82o024q19O810o727r170J1395r056q702N224n265o614j024j156p74j0734
92a0532L344K148j4389K810M214j2335K017K048l409k462j416N313m916m922J1188
107b1299n380m006J1114k296j621N135K196J758l158O374N644q097Q774P674p791
122d979O991O451l437K120K283L857k983n63J0182n618k564J0863m810l020N635
137B0408k550j196k191K037Q92p780N242J795j0047M649J106q087J380p08j343
$$ y = [0, 0, 0, 0, 0, 0, 0, 0, 0, 0, 0, 0, 0, 0, 0, 0, 0, 0, 0, -2, 8, -8, 8, -8, 8, -8, 14, -16, 16, -19, 24, -24, 30, -33, 38, -42, 49, -53, 60, -67, 75, -84, 94, -103, 116, -126, 141, -154, 170, -189, 207, -228, 251, -278, 305, -337, 374, -415, 463, -518, 581, -660, 755, -874, 1029, -1238, 1545, -2031, 2935, -5229, 28456, 32848, 26177, 41178, 28605, 31200, 31322, 32104, 26080, 25261, 32071, 25344, 16174, 27569, 18513, 9811, 15035, 9770, 3156, 2132, 976, 202, -10532, -7188, -5040, -19429, -16619, -12405, -24740, -22723, -20675, -24084, -26546, -27962, -22649, -27565, -32487, -21299, -26679, -30685, -19571, -21867, -23488, -18353, -16157, -14399, -17557, -11183, -5539, -13636, -4862, 2812, -4979, 2012, 8463, 5026, 7146, 9429, 13286, 10303, 9740, 19922, 14304, 11740, 22603, 17793, 14773, 20408, 17858, 16662, 14471, 16508, 17400, 9620, 14862, 16657, 6610, 11259, 12365, 4278, 5658, 4950, 3607]
152C607k956j888M620o579k822P284p607k738N448m135j411O88R46L50m943M884
168g252J073p817O658J573o256M619J695j143N84M96M249m699J2P627n919j40
184d640P153l979R3L086J55k8k396M203L65o105O582O99o154N541L88l059J063
201B967J34J216l678O8N370o198n1O269o189j65L406k847j57j042J881k02m349
218c567N780o24o085N929m94l844K450K39k51j220L40M036n094N77N725o142P94
235a451L973l589P04O24J141j79k951M864j277m789O128j788l829M377p71j022
251A65J95J16K364m158R96L959o139J915L604m779R41J749j187J70j868L111j316
268a62l642N464j959l282M793j568j481J620n56Q31k304P16L682n115J921L385
$$ y = [3607, 651, -1237, 3383, -3196, -6018, 1266, -6341, -9079, -3631, -7766, -9177, -8489, -7543, -7193, -12136, -7252, -6179, -13996, -7338, -5765, -12021, -7402, -5707, -6850, -6266, -5770, -1521, -6220, -6208, 1419, -4500, -4640, 2513, -1466, -1373, 1713, 1868, 1840, -556, 3647, 4012, -2093, 4489, 5188, -966, 4575, 4963, 1904, 2967, 3101, 4317, 639, 707, 6077, -121, -172, 6097, -92, -257, 3149, 302, 145, -897, 984, 782, -3567, 2213, 1589, -4496, 1433, 939, -2905, -455, -216, -467, -1687, -1347, 2689, -2405, -1828, 3897, -2245, -1451, 2522, -1067, -363, 261, 1402, 1223, -1728, 3136, 1859, -2930, 3198, 1410, -2419, 1958, 1187, 165, 360, 476, 2840, -1318, -322, 3637, -2502, -587, 3017, -1762, -821, 928, -259, -89, -1957, 1154, -162, -3804, 1660, -299, -3581, 1212, -356, -1837, -217, -773, 58, -2246, -1530, 2152, -2963, -1042, 2343]
284B343n192K082K416k410N43j114K509r77k401M372j887k911N160k495j602K595
300A031j053M13j253R58J730m180K141K727n094K459J802l152J011J16M42n40
316d42j778L923k361k144N133l097j506L750j972k71O44K46J130l050K443K003
332B651n032L160J731l776K088M58m83K45j068K896j627j914M408l020j473M019
348C263k510r4J198l59P18k378J675J463m450K881J101m184K441Q48k025R09q59
365c62J440j808j351L582k956j305M229l097m46K092j679M33j195J014R47l241
381c703K675Q18l710L174m0k238J863k16P0n00n95K956k613k56M029l194k85K703
399I38j869O06J40J50R06k252K771O82l343L285l8k774K527l37m64N73l51J848
$$ y = [2343, -2849, -767, 1649, -761, -218, -1332, 1177, 200, -2201, 2171, 284, -2627, 2533, 38, -1564, 1031, -22, 391, -862, 96, 1826, -2354, -213, 2514, -2580, -121, 1681, -1471, -460, -344, 98, -442, -2220, 1703, -658, -2802, 2331, -766, -2272, 1478, -494, -765, -121, 125, 1255, -1795, 648, 2651, -2381, 779, 2510, -1266, 822, 1280, 797, 1042, -26, 2870, 1243, -671, 3737, 717, -756, 3263, 753, 659, 1857, 1498, 2216, -162, 1513, 2976, -1474, 1407, 2508, -1676, 765, 1613, -412, 497, -362, 1078, -730, -2081, 1501, -1455, -2760, 1469, -1628, -2074, 18, -1661, -1228, -2423, -1409, -462, -3703, -1028, -210, -3920, -746, -786, -3024, -1161, -1377, -1307, -1807, -2402, 554, -2059, -2315, 1714, -1480, -1765, 938, -931, -325, -185, -35, 871, -1381, 1390, 2072, -1271, 2014, 1976, -798, 1729, 1392, 928, 1501, 1150, 2998]
417B998j874m81L548l486k13L034k779M49P63p59R40j520J345K17l418K981q7
434A658k908L191j126j268J249r69J126j666m37K334l313L81K989k944Q41P43
450a19j410M83q77Q48L37k423K592K15k726L140p25j580J788j041P03m80j28K164
468G61k433R63K515l052Q38J778k318J143j49K79N80j823K843n94k659L619j357
485I34j545K200j054LQ2m67J605j944M45J796l068J004J628k509J145J62m57N86
503E46j201J473p45k090K854j126j610K542j206j90P32n90J009j328K5J902k757
520a760J318J906k711J610O94j126O72r01J037j48j602K971j266j368K974j357
536I43p12J272j017R42p22j10J766k731J458J468k924J263P85k065J275p53L30
$$ y = [2998, 1124, 643, 4191, 705, 492, 3526, 747, 1196, 1959, 1200, 2140, 620, 1965, 2182, -1236, 1745, 1658, -1250, 1941, 815, -453, 796, -173, 953, -713, -1150, 1184, -2129, -1748, 1241, -1703, -862, -119, -1529, -1046, -1923, -1075, -738, -3161, -569, -354, -3080, 60, -665, -2245, -457, -1498, -795, -1275, -1403, 761, -1672, -709, 1806, -1246, -408, 1370, -948, 195, 46, 325, 905, -918, 1925, 1331, -1328, 2291, 934, -611, 1589, 535, 538, 620, 153, 1758, -186, 259, 2055, -1013, -9, 1619, -890, 255, 417, -40, 546, -655, 818, 73, -2017, 837, -289, -1899, 643, -563, -753, -21, -611, 398, -930, -905, 997, -1760, -442, 1464, -1247, 363, 1057, -69, 603, -298, 739, 591, -1011, 1960, 694, -674, 2300, 943, 231, 1503, 486, 1428, 706, 596, 2362, -369, 1089, 2557, -367, 896, 1681, -384, 891, 138, 468]
553D68o2j364K065j232j378K523k111m44J449j326M15n93k0J121k052J169J153
570b19l029J817K29j577J615n81j45N46p99J609r82p51K613j805m83K300j065
587g07N58M33n69J017j150J143Q10k174K162O12k031J962J4p20P85n50O68k00
605B063r71J976j400o80K509k101k4J101j454R19r39J34R15j898J125L45k365
622g45J818k82j355N42o04M64r00o16J650j083j097K108j945J78J023j316O64
639a496l88j73R91j996J673P39k549K181M7j113J325n46M3M60n33J724j214j70
657i95J844j990O03J622j503R50Q7k61O03q84J011M66j863K087k87j222J657r49
675I76j87O66p50P62n75m32J442k032M15J366j953O93O95j480Q88r29N59L52j836
$$ y = [468, 406, -958, 1107, -125, -1503, 1020, -1091, -1535, -86, -1412, -997, -1590, -1610, -489, -2541, -1372, -219, -3248, -1431, -1202, -2779, -1164, -1745, -1890, -1344, -2143, -534, -1516, -2267, 346, -1459, -1942, 358, -707, -149, 284, -285, 732, -418, 725, 1535, -639, 1523, 2135, 104, 2066, 2080, 1360, 2145, 1595, 2263, 2063, 1092, 3068, 1668, 988, 3497, 1396, 1372, 2473, 1019, 1938, 999, 1133, 2048, 150, 1275, 1620, -745, 1073, 791, -564, -22, -626, -162, -1062, -1678, -28, -1111, -2208, -100, -2045, -1867, -844, -2160, -1496, -1884, -2057, -1066, -3062, -1389, -650, -3199, -1018, -971, -2084, -759, -1305, -1262, -802, -1335, 389, -825, -995, 849, -1141, -538, 1084, -419, 531, 618, 357, 960, 76, 1087, 1553, -310, 1777, 1490, 268, 1925, 976, 789, 1455, 705, 1467, 892, 460, 1902, -130, 285, 1651, -302, 391, 1086, -394, 494, -435, 124, 476, -1360]
694a360J843m28j487J612r48j57P21p48N20n7n59J283j572M84J490j812R32M27
712A84j207J246q42O70L56j073J576l67j103J944j007m62J486r80M76k10k09J046
730A524j269L48J053j776J102K46j507J080k46m62N42j139Q63p0j385J735r21
747b82j156J803j139k72L46p26J017j098K52J099k083P89J082j953J105Ll04P22
765g95q85J124j92j094J725q40p39K157r96L4P04n16O96k42n3J285j281Q24Q50
784A766j411J177mo58J173j006M87N24r55J324n82r28J518j074j12Q93j460O08
802A280m78k3Q20j511M90N84j881J333k64j330J176j153J92L96p49Q39o37p27
820a643J371j406j9J172j500O40r8k47J037j263P37M59j413J271K82j319J330
$$ y = [-1360, 483, 55, -1432, 180, -768, -925, -204, -952, -432, -489, -1048, 235, -1337, -853, 637, -1175, -243, 184, -1023, 223, -619, 51, 407, -666, 910, 543, -560, 1384, 377, -85, 1401, 421, 897, 687, 478, 1524, 255, 603, 1656, -120, 982, 1228, -279, 801, 555, 93, 635, -504, 359, 289, -1096, 639, -282, -1438, 365, -774, -1046, -700, -1426, -409, -1507, -1255, -156, -2239, -1450, -368, -2321, -1216, -1213, -1517, -795, -1680, -556, -748, -1842, -117, -957, -1696, 461, -535, -501, 203, -313, 383, 141, 88, 1373, 92, 916, 1766, 355, 1532, 1528, 870, 2043, 1037, 1524, 2048, 1093, 2417, 1835, 907, 2425, 1351, 1239, 2132, 672, 1280, 802, 779, 1599, 88, 578, 1162, -719, 614, 350, -980, 196, -957, -765, -369, -1118, -279, -916, -1643, -272, -1678, -1697, -525, -2025, -1385, -1483, -1730, -693, -1956, -1219, -760, -2173, -902, -620, -1939, -609]
837f09j31K5O24r57R25r0q63J707j111J04J421j389M78N93p27P27p20j4Q80j308
857d35J128M53j237J333m87q82J021q81O72k2p95J242q68k09J291j411L82P43
875A038q81Q07m56J1M25r68J004J33j020J026m26p31J089n48K1J84m32J011o58
894F29m09J090j393K11N97r55R51m27l51P91j009O1M52j579J220l10j116J328
912b19j107N76K35r57P97p15j89R09j307O56M70j056Q95j43o29J024q98M18N04
931g36r83J271j12p17J386n22L8O77p75Q75k92J18P83o21P48J026j509R11K88
950A854o32Q94o24M13Q2q89J456n52p28J001j151J12L87p67N71k92m23P58j376
969I4J78O22j314M02J71j266R49n81l55M23r06P71o10q53J133q63k16R02q28M35
$$ y = [-609, -740, -715, -91, -1048, -123, -213, -1076, 631, -480, -376, 1045, -344, 134, 727, 0, 727, 7, -7, 873, -435, 693, 1146, -91, 1242, 755, -127, 894, 13, 685, 663, -132, 1110, 242, 33, 1324, -87, 295, 1038, 157, 964, 508, 519, 944, -24, 980, 1113, 93, 1119, 693, -38, 1051, 503, 524, 708, 276, 1287, 629, 220, 1310, -83, 128, 725, -230, 721, 294, -57, 734, -275, -214, 238, -1341, -121, -431, -1547, -219, -1326, -750, -515, -1472, -675, -1390, -1579, -670, -1977, -1321, -851, -1907, -1012, -1155, -1784, -760, -1658, -1240, -736, -1719, -448, -560, -1277, 109, -413, -375, 302, -473, 402, 110, 228, 1011, 390, 1138, 2164, 655, 1566, 1854, 1222, 2116, 1492, 1905, 1987, 1098, 2554, 2002, 1274, 2275, 1124, 1236, 1623, 856, 1427, 1135, 712, 1470, 94, 272, 894, -420, -18, 153, -1113, -164, -745, -1100, -677, -1583, -812, -1422, -2275, -1142, -2005, -2221, -1319, -2147, -1712]
989a712J11k69O00m11J14P38j143J239K57n87O85J99j76O31m41N74N9p18J528
1008A278n30o3J087j029L79N96n97N77o02J68P32j222Q16K22j276J050o88m17
1026D81P44q67K92q7r15R98o40o14R07r89j04L15q48P97p59q1O30r72O96K03j016
1047a829P29o3m00N76m19J26O05p46J330m74m52J281p99K85P83r20J009rj03Q32
1067A342r63Q88po21O94J75o00Q73m49k04L33m79M74n88k36Q90q59l05J042j340
1087F0N67j32p17R88r24L13L93j312N93m09p43J219r05k54N10p88P40m14m23M11
1107a227k44j21P19j097Q43%l69N92l13K45M91p08N57M41j018J463n15l29J185
1126E95q48O31Q5l95Q54l00K2P72p38N48K67q31R32k44k87N31n96L33P3o18Q07
$$ y = [-1712, -1601, -1870, -1270, -1681, -1567, -829, -1972, -733, -476, -1063, -378, -179, -355, 276, -165, 409, 468, -250, 1278, 748, 685, 1772, 743, 1122, 1718, 1121, 1698, 1096, 1264, 1996, 774, 1590, 1812, 536, 1586, 898, 481, 1225, 358, 650, 563, -352, 646, 6, -608, 299, -690, -794, -479, -1327, -530, -1289, -1370, -740, -1712, -1016, -813, -1829, -1100, -1163, -1563, -987, -1406, -1280, -675, -1421, -91, -565, -1017, 264, -535, -250, 533, -387, 622, 613, 510, 1342, 379, 1267, 1260, 639, 1333, 1508, 908, 1781, 1332, 1128, 1461, 982, 1456, 868, 632, 1522, 663, 358, 1400, 60, 627, 495, -222, 766, -158, 155, 548, -764, -171, -580, -1323, -104, -1009, -1263, -753, -1541, -801, -1215, -1638, -1227, -1471, -1592, -873, -1970, -1127, -1127, -1496, -904, -1217, -972, -481, -1189, -632, -191, -1209, 254, -261, -590, 595, -253, 378, 463, 68, 922, 622, 644, 1416, 678, 1226, 1493, 662, 1594, 1350, 1063, 1594, 998, 1331, 1404, 786, 1593]
1147A593m50m12O66q82J98K59p10N74m53j13M45j119O07J15r78P61m90k82M29
1166b42r11L84L75j315J082m02n89R25p80JN84q32R68m13k38Q11o06M00L65p48
1186a181Q92k69k25P78n88O08L21o92R82j32k94J055q51J87P37p74O73k17m1P66
1206A735p21J51N67r79M35k80l05O95p53K17J0q21Q26l12o34Q27j366J19N18q88
1226i59M26k46m76Q11r19J27N43q49L85k55n97R77n77L23N53o13O35l1l08N93
1246d57l60K8P42p62R04L2k81J068n43J64N47n19O83Q1m65R49k72J3N59m74J51
1267A788L84n82N18o79M1P69j168K64L19j019N99r56J87M06j075P6K47j144O14
1286d11l77n09N30r48L46p8q38O08l56k31O85p31q2L71m66P92l71k6P74r74P52
$$ y = [1593, 1143, 731, 1397, 515, 713, 972, 262, 836, 383, 270, 715, -404, 203, 318, -660, 101, -389, -671, -242, -1153, -769, -394, -1709, -627, -1029, -1618, -693, -1473, -1472, -888, -1720, -752, -1165, -1403, -592, -1198, -798, -433, -1181, -289, -558, -783, -5, -593, 15, 336, -356, 626, 494, 200, 1255, 404, 591, 1328, 554, 1227, 1010, 969, 1735, 1014, 1165, 1732, 753, 1188, 908, 603, 1298, 545, 762, 772, -49, 777, 465, -169, 658, -708, -589, -71, -959, -533, -779, -1255, -444, -1363, -1236, -693, -1542, -1157, -1412, -2009, -1032, -1609, -1286, -733, -1346, -711, -742, -1050, -457, -817, -789, -47, -809, 95, 127, -154, 914, 371, 535, 1082, 563, 1246, 1327, 862, 1811, 1539, 1552, 2111, 1637, 1788, 2172, 1590, 2108, 1429, 1470, 2239, 1071, 1335, 1654, 635, 1234, 278, 465, 871, -204, -128, 119, -1025, -411, -788, -1297, -767, -1715, -1369, -1447, -2285, -1677, -2033, -2264, -1579, -2310, -2392, -2021, -2487, -1695, -2066, -2092, -1318, -2292, -1540]
1307a540M36m40O49J55j24O92p5M63M95m60M94lr2P71k64M61O44q91P27J11k37
1328A972M64p27M38L10r77Q79l18n69O81p38q8M46q47K16m76l20K34o66J43k3
1348C4o86M36p72k05N85p78M5L87q10M17k44m59O75p11M16K53m57N85j69j68P64
1369h62o77L42M10o35O70L25m53Q33n24L11M80m17M12P1o0O94p22K27M71n73O11
1390I34j16J9M63o39Q0K30n12L35N8k78R5k57j61O68o75K55K1o18P28m47j14M98
1412E67r07N62N5p48O37l64j57O63n93M87J39q59R04l53l72M83m98M24m3l66M89
1433A50q6k26N42o95M55J50q09P01j61k94N82m62r3L25n81N99o2l37L20o46N42
1454h6J54q45O97q9n28O65n82M2P03r32N09j17l62Q57o72M57J88q44R91m40l22
$$ y = [-1540, -1104, -1544, -895, -740, -864, -172, -247, 216, 711, 251, 745, 742, 650, 1421, 1157, 1618, 2262, 1371, 2098, 2209, 1972, 2436, 1709, 2147, 2457, 1480, 2359, 2041, 1472, 2153, 1415, 1327, 1773, 926, 1142, 666, 346, 580, -86, 57, 34, -652, -216, -988, -1193, -608, -1386, -1341, -954, -1764, -1347, -1591, -2050, -1375, -2086, -1670, -1417, -1874, -1289, -1458, -1626, -862, -1539, -1197, -787, -1422, -752, -427, -880, -47, -571, -260, 220, -197, 215, 286, 226, 920, 198, 425, 896, 323, 934, 818, 837, 1300, 661, 741, 971, 459, 794, 852, 574, 669, 412, 251, 919, 244, 499, 520, -98, 630, 183, 69, 567, -340, 222, 277, -471, 166, -198, -355, 308, -285, 202, 341, -518, 386, 33, -339, 144, -354, 70, 27, -339, 150, 64, -162, 380, -315, 140, 290, -519, 182, 21, -273, 309, -153, -246, 79, -502, 97, 35, -302, 18, -628, -86, 68, -777, -80, -169, -697, -32, -614, -572, 131, -801, -292, -409, -771, 86, -586, -129, 59, -785, 206, -234, -556]
1475e56Q42n93K88L78p00N40P1k07M39l69M1N13m35K46J74o59L51j47J10M20n93
1496A54L51J18p44P33l93J63L56m10m2k9l38P16p22k13P96p57L20j9l26L65l36
1517b57l94O67o31N17j45nK98l89K44M3n83N87K43n18L26M8j66O2m07M50j35l08
1539d53Q66n15q2N37n14K89J56j27M73n21o7M81n80J23L09m25N28o95oN03n52
1560b72L98o0k40M82k71j51P61j009N66n0o90N99n25k16N86l82M28j50l95N33
1580e8k44l14P13n45L10O7j02L26j62k18K01j40L12j51l22M24j10N7M25o77K54
1601D6L75m26N49m02R9M59l42J26K6j12L80j6k20J4k31J64j2m71O32k75l34L65
1623C94k98l53O86p73K77K39m82K56j21j22K59m75L01j50l43L57k59j76N38n91
$$ y = [-556, 286, -307, -19, 359, -341, 199, 270, 63, 502, 133, 174, 687, 252, 498, 672, 13, 364, 217, 327, 747, 154, 505, 623, -121, 612, 219, 382, 738, 328, 286, 257, -81, 635, -87, -300, 496, -261, 59, 40, -286, 79, -257, -651, 16, -615, -98, -243, -248, 50, -339, -95, -52, -635, -48, 195, -323, 3, 51, -115, -53, -460, -10, -145, -453, 413, -102, -184, 353, -161, 128, 284, 157, 630, 109, 42, 523, -57, 66, 375, -50, 478, -217, -223, 280, -272, 126, 66, -174, 308, 37, -114, 647, -362, 204, 154, -536, 63, -462, -678, -92, -474, -46, -196, -591, -58, -302, -616, 97, -448, -138, -71, -173, 153, -9, -227, -26, -166, 146, -5, -327, 97, -13, 44, 469, -208, 46, 421, -5, 544, 142, 241, 700, 358, 484, 510, 398, 778, 762, 542, 556, 325, 489, 477, 6, 638, 363, 29, 394, 96, -257, 429, -344, -67, 172, -310, -54, -175, -297, -38, -513, -212, -362, -705, -348, -607, -783, -245, -836]
1643h36M03j27n36N62j65N1N15r26P23k49m61Q25m51L68K46p61O58K90n60N01
1663G0O6L5J17l45M44r0j79N52l65M48L55m38j38J81l03N48j00k63M63n19M32
1684I71j58k92K68k74l06N64m43J20q6m58N14m04j25M66m52k27L25o14K63k07
1704e55J16M28q02K63P4l67M39j35j7K47k63O5J29k97M34k17l22P42m69n7O34
1725G0l62N10k82J43M43n09L09J2k18L61J31l23M91n69K56L1l79L88k13j53M60
1746E97l33O7K91m08N2J76n77O02o27K21J13m15L80l8m22K16k98L3J18j07p7J77
1768b59l43K03j14j18N80l17L8J29p0M29n92M53L88o98M21O6k42M53m40L28L29
1789F24l30o7R0J96p0p2k92N02l59J27L76p12O37n73K40K28l47K7j87R8L37j54
$$ y = [-836, -433, -560, -1096, -534, -699, -648, -133, -1059, -336, -585, -1046, -221, -672, -304, -58, -819, -161, 129, -431, 70, 136, 171, 288, -57, 387, 297, 118, 670, 305, 753, 1108, 670, 532, 713, 410, 958, 858, 595, 1058, 539, 971, 813, 521, 789, 515, 209, 773, 330, 450, 364, -94, 420, 16, -109, 357, -95, -322, 3, -611, -348, -555, -439, -11, -813, -550, -476, -843, -404, -539, -556, -309, -572, -507, -378, -675, -241, -458, -780, -38, -507, -564, 70, -292, 218, -64, 79, 522, 13, 322, 334, 116, 477, 608, 285, 776, 207, 463, 494, 115, 503, 290, 137, 597, 264, 331, 622, 214, 266, 442, -135, 467, -160, 61, 174, -241, 139, 101, -321, -105, -403, -370, -252, -359, -436, -259, -602, -399, -513, -631, -51, -368, -330, -201, -271, 158, -434, 19, 407, -291, 130, 196, -46, 407, -33, 295, 624, 294, 227, 317, 513, 443, 371, 79, 581, 222, 349, 725, 13, 650, 77, 317, 545, 198, 225, 38, 136, 473, 319]
1811C19l45J16n20M50j84l32L40Q5j82L48l41k6L6n64O41j52k19L30l84J03M58
1832b3n34N34k56k22M16o83L77P8k19M95p4j61M91n79N51o1l94K48N9k55N56m63
1854a19P2L78l59M24k16j8K32j74j43L07m34K50R6k71L26j22k46M58m69M19k52
1875A39j37K58k70K47k7L9j2k10j36M60m35RM19n52N25k50j91K51k04M5M34o84
1897b82N10j55k33J21l44Q2M40k70K30j89n6K77m65m1L22k99K54N7l95K94j81
1918c23J01P8l13L63qk16K92l40Q3j05j95L34k7k01N30n03J35J77j77K64Pk20
1940b64N29l41j40N11m66K13J73n6J48j77N5L28l65M09O4r0Oo1k59K43k63M72
1962F69j12r9M29l59k53M08n56N4K58o88O81k07j72J61l27K27j32m39M04J67j80
$$ y = [319, -26, 90, -430, 20, -164, -496, -156, -71, -253, 95, -246, -272, -236, -800, -159, -311, -530, -200, -584, -481, -23, -557, -23, -279, -501, -85, -768, -391, -313, -532, -37, -111, -272, 219, -360, 191, 130, -264, -16, 43, -212, 344, -119, -47, 331, -28, 396, 180, 162, 394, 220, 77, 384, -50, 200, 296, 25, 351, 229, -17, 441, -28, 391, 139, 2, 260, -10, 237, 210, 249, 237, 27, -109, 351, -84, -75, 344, -208, 317, 67, -124, 127, -77, -32, 402, -282, 228, 73, -160, -39, -383, -301, 139, -131, 99, -90, -146, 131, -334, -375, -53, -352, -98, -41, -436, -142, -323, -222, -144, -457, -94, -102, -318, -26, -366, -283, -388, -583, -249, -276, -477, 53, -450, -315, -138, -315, -51, -44, -264, 265, -76, -216, 295, -171, 42, 215, 159, 307, 130, 185, 513, 148, 557, 621, 531, 537, 476, 217, 460, 197, 669, 557, 458, 887, 528, 275, 683, 127, 181, 439, -249, 432, 225, 53, 214, -113, 114, -18, -457, -53, 114, -66]
1983f6j05l67M19J3m95M36k94k09N28k28o5J36n15N47J5l45L60k44K65P5l40M33
2005d6on04M45l11J52K54m11O55j19l65L09j0J36K80l97M95m84J54M07o44J2N78
2027E80p11M28J39l96K50j17m4J76n08O19l88n4K94r1k03J90m72N68l08l29M75
2048I8l88P9K21k63J63j46j00L62m40M5M54n36J18K46l16L61j99p4N02l95L70
2069A62j70J86J12j58j52L01j18J83k8l02L88j90m1O9l92P76l43l39N58l63r4
2090D5L33l39R7j16j0K01m61J17K44k55K33j00m60N16l15k73N98n51L17J60o66
2111f85M24jl28L43k87J50K00m12J89j67J67M16l83j1K51l49N08l12Q0L03k66
2132a70R1M17k91K58j22k96O09k75K77n2j57K07Q7K9J32k39jK35l30K92k05J2
$$ y = [-66, -171, -538, -119, -106, -601, -165, -459, -668, -140, -368, -433, -297, -812, -265, -250, -595, -235, -479, -214, -139, -479, -46, -52, -556, -111, -422, -270, -16, -427, 228, 109, -256, 53, 43, 179, 459, 62, 557, 73, 227, 634, -10, 2, 580, -131, 297, 436, 40, 290, 173, 129, 305, -203, 416, 28, -26, 268, 177, -26, 164, -308, 260, -48, -377, 98, -290, -211, 10, -253, -90, -236, -336, 26, -414, -369, 85, -451, -333, -87, -403, -42, -241, -315, 187, -208, 162, -8, 178, 290, 132, -20, 281, 163, 346, 318, 16, 404, 214, 173, 242, -150, 626, 283, -56, 502, 139, 45, 378, 39, 136, 20, 10, 211, -250, -133, 111, -144, 89, -11, -471, 45, -270, -543, 55, -496, -179, -19, -685, -261, -262, -590, -247, -534, -384, -184, -596, -407, -574, -407, 9, -374, -385, -134, -483, 25, -287, -207, 96, -170, -79, 338, 47, 305, 183, -113, 496, 221, 498, 446, 289, 496, 583, 612, 744, 505, 504, 739, 409, 701, 496, 508]
2154E08J68k49J2j93j6J0j70M0M7j36j38K86l37J28l75l13O39l51j83K42m30L13
2176d98k12j37M88m14m2L33l80L1P4l05L68l3k5L98o32N39j1M8L56m34L88K04
2198A04j79M15p1j68L69m06L61J94j39L39m09k4L40p4L3K1j66Q1J75k56K28k73
2220D95m85O81l64j81M18k86l6k05N8J08l11k32N34l84J91Q9m83J67j41O5l00
2241f02K84J47l79J73O3m93O30k82l5K18p9m7L38l14K85j46j20O34k99j99L44
2262A21m0k25N01m68L94k77J91J99j04J05J01n66K15J76M7K31l20K5J70p88M98
2283A86Q7j55K56m69K93j03j41Q1K60n91M97m78J30K44k17P8r6j52K34j88K41
2304cJ04k84R6O6l68M61l83K88o0L8J73j93Q6J25j56PJ95j77J82J25o39M03j12
$$ y = [508, 676, 427, 439, 246, 230, 240, 70, 110, 157, 21, -117, 169, -168, -40, -415, -728, -89, -440, -623, -381, -811, -498, -710, -847, -359, -773, -815, -482, -862, -831, -757, -1062, -694, -727, -752, -354, -986, -447, -458, -410, -54, -488, -100, 104, -75, 340, 269, 101, 470, 64, 425, 619, 480, 819, 410, 386, 726, 652, 685, 706, 540, 621, 796, 540, 768, 495, 10, 691, 327, 146, 564, 278, 242, 37, 95, 203, -108, -340, 194, -190, 1, 90, -393, -226, -367, -302, -602, -318, -171, -550, -377, -314, -807, -177, -459, -494, -276, -355, -402, -64, -378, -93, -239, -359, 275, -24, -223, 121, 81, -144, 357, -111, 283, 6, 197, 396, 292, 397, 498, -68, 147, 323, 370, 601, 281, 306, 476, -312, 186, 273, 118, 374, -95, 198, 95, -46, 35, 295, -296, 201, -277, -147, 97, -120, -42, -138, -290, -56, -244, -3, 101, -183, -87, -21, -389, 72, -311, -23, -83, -45, 128, -65, 21, 146, -10, -3, 192, 15, 197, 322, -317, 86, -26]
2327b6Q9j7L2K35k5j36J96l96K7J23m2k01K39j67K02m1l39M33m33K75j33k07L76
2350F4K6p2k01J20M2P8j36j26M5J88J55k30KQ5n3jk21L4J86l59M66k04K17j75
2374g0J90m54M72n57lM53k08K93k14j17K68l28L99K85n82L23q2N6J54k06j65M59
2396C66m87L19j14n7L88k50r1J29k28K44j42l47O11j45J40l59j21K68j60l14N23
2417A73K8m7J26o1j78j0j25K82k03PK18l24J29J59n91J98L7J34M8j62K6J12j40
2440a64J09Lj47K65k78K70l09Q6K50k85j7J60j81J52L04k80J48P7%r4k02M09k5
2463B51l79K36Pk56L20j68m0M0k27L60k83N1K52j83J47j98n1L39k94j50L02k69
2485a93J54K37o41M69l68r7L18j49L06n3j50K71k31l41K53m9R6L11k35J84m42
$$ y = [-26, 63, 46, 78, 313, 288, 152, 348, -48, -21, 102, 60, -141, 98, -69, 133, 92, -247, 186, -247, 28, -105, -312, 64, 90, 18, -183, -63, -21, 57, -79, -205, -160, 28, 183, -47, -45, 40, -13, -14, -235, -201, -15, -374, 92, -112, 105, -70, 120, -334, 138, -419, -422, 31, -177, 116, -98, -215, 53, -275, 124, 409, -173, 150, 68, 124, 278, 72, -93, 366, -121, 198, 84, 27, 415, 165, 74, 203, -25, 219, 77, -270, 341, 196, 336, -23, -144, 124, -36, -350, 173, 201, 154, 280, 219, 41, 31, -94, 188, -15, -8, 210, -114, 15, 174, -417, -219, -182, -48, 0, -162, -136, -24, -164, -55, -52, -199, 66, -212, 58, -251, -165, 85, -200, -217, -57, -238, -86, 218, -62, 86, 163, 163, 69, -133, 276, 251, -128, 108, 115, -141, 179, 11, -29, 11, -216, 144, -139, -88, 164, -19, 128, -70, -121, 218, -76, -226, 76, -193, -39, 198, -443, 26, -342, -439, -121, -270, 36, -17, -167, 104, -127, -468, -215, -264, -168, 143, -92, 92, -350]
2506c50L09J33l19M62q1l70M77m5p9K07l83L15L5k71K35L6j42L21P9l76M6j90
2528D9J49K79m00L31j19l54J37Q0L34l83r8K48o51M20o0j2N4k00j94L44m18n7
2550e21K35Q8L4k62j54J09pK74j02j03k15L91l12L30l27L25J6l49N37l10K80j61
2572b04J13M6J38k02K41J48O7J90m1j90j56j3K55j55J41K95o87N81L7m92K76q1
2594C07k50K63k73J5L76m37M99o61K61J11j85o5J08k68L7J62j83J25j04j03M64
2615A99n84K97n7j99L88k30m9K92l44j04L92n28N22k25k4R3R6j83K28l34J29J32
2637i3j19J72q0q9L67m93N75j92j13O6j96J77M2k41M63M6j69Oj28P2j38j19L42
2660A58o6l28L74k76K29k8k64L46k91J46J07Q3%K34m57R2J82k57K59l39K27K85
$$ y = [-350, -41, 92, -227, 235, 154, -216, 261, 216, 137, 344, -39, 276, 311, 40, 275, 311, 169, 490, 569, 193, 239, 49, 198, 477, 77, 408, 289, -65, 72, 152, 486, 103, 5, 253, -398, 22, -38, -50, 4, -196, -390, -46, -464, -521, -286, -198, -164, -426, -580, -471, -478, -204, -306, -409, -624, -233, -545, -215, -542, -217, -201, -550, -13, -323, -43, -204, -91, -45, 93, -109, 132, 280, 347, 537, 496, 306, 150, 137, 392, 237, 378, 673, -14, 567, 604, 112, 388, 307, 57, 320, 47, 62, 438, 1, 500, -161, 100, 211, 26, -39, 69, -199, -162, 0, -183, -58, -162, -265, 199, -385, -88, -145, -344, 44, -186, -235, 57, -287, -391, 1, -527, -5, -230, -254, -161, -65, -248, -20, -354, -225, -93, -212, -40, -120, -209, 158, -335, 240, 48, -65, 1, -195, -18, 24, -217, 246, 292, 123, 129, 1, 73, -65, -184, 158, 92, -236, 138, -138, 91, 63, -201, 145, -146, 0, 107, 190, 190, 424, -33, 59, 241, -16, 243, -96, 131, 416]
2682D16p01N11m7j64K69l58Q1L52m57K84l26K30J40k17Q0oP1k7k05O7K00k24m6
2705g7N6j51Q9J49k25L5J05j51j08q9J23J10j50M70n00J64j79k7L58r0l5P8o5
2728a10k7J98n37N44j94r7K44k67K58R9m32K38J6JJ90r9j78L90q2p4L4j78J94
2751A31pk61J85M9j33L25n00O74n27j67L43j66K09j38k11L25j30k23M37j92J46
2772A69J53q09N76j00k43K05j34oJ81k26N6nK87Rl15k9K58J24o55L06p7J78Q6
2795a1NK59l56J91Q5j92L62m64J12L7k3M6K26j40L21o33M9L24k95R7j30J01J85
2818A56J94l69O9j53O7L53m08J84j16l6m9r7K70J32k99l3m9Ml7m0L53o9j43J53
2842C7k25J60K26l26K82j1j3j19k93L11n5R7k3j11K3N8K76pp7P3j74K17m95M62
$$ y = [416, -285, 226, 179, 15, 284, -74, 7, 359, -98, 186, -140, 90, 230, 13, 93, 87, 158, 131, -74, -7, 193, -31, -77, -21, -172, -83, 66, -159, -124, -19, -170, -278, -367, -244, -134, -284, 186, -314, -150, -329, -356, 2, -88, -123, -45, -110, -137, 61, -476, 68, -126, -223, 21, -246, 12, 111, -321, -83, -67, -66, 124, 25, -153, 237, 155, 81, 115, -63, 131, 124, -137, 48, 97, -36, 289, -211, 463, -64, -231, 112, -54, 155, 17, -194, 131, 1, -222, 215, 23, 169, 322, -487, 89, -11, -254, -49, -183, -189, -8, -234, -178, -183, 104, 113, -202, -231, 27, 151, -504, -198, -275, -97, -11, -6, 253, -103, 88, 173, -19, 343, -121, -9, 28, 5, 51, 277, 137, 458, -175, -126, 198, -97, 0, -130, -29, 156, 350, -19, 50, -103, -36, 317, -91, 93, -23, -59, -108, -205, 65, 197, -102, -135, -184, -180, -217, -257, 96, 27, -116, 37, -188, -28, 198, -128, 154, 143, 130, 11, -282, 29, -26, 71, 48, -63, -40, 18, 294, 287, 210, 283, 109, 326, -169, 293]
2866B93j92m6mM3K00k24J46k15K54R7j03l54L31J94m40O4J57j82J00j90O2J8j82
2889a73J08k4j81K06j02m7K09l66R4j20L94m8k35J53J2J09k83J80k74M31m30K7
2911c60M24l47M7PJ33K17k49n0M83k12j1J53l59M21j87K46l30j62L73j25m8N25
2933E89k79k11k9m6J69n2j09K49k18K71o7l59L65l99J62O9j1L8nN4k28J80n3K06
2957B86l52KL70m42K23j90L8%o5j00Kj15L82j92m0rL6J06n2o1K3J17k59M22k30
2982a00r4K90j88Q7qk59M34l12J97J12k10O0J66l69N94p3k11J77m77K48k58j98
3004c92M03o4p0J9N4L65l12l21L99l89L46k69M7K28q7j21L03k67K71K23k31k72
3026a37O4r2K52l0P6j40n3O8K73k92J98j12mp3j44K40j31m4N2J83m9N5k18n9J41
$$ y = [293, 101, 55, 51, 94, 294, 70, 216, 1, 255, 352, 249, -105, 226, 420, -20, 44, 201, 19, 119, -71, -9, 9, -173, -65, -89, -270, -64, -166, -213, -4, -370, -276, -396, -2, -50, -285, -132, -120, -11, -294, -114, -388, 43, -387, -360, 64, -283, -236, -229, -96, 121, -128, -178, 305, 93, 82, 235, -124, 297, 110, 356, 26, -136, 237, 112, 64, 589, 310, 99, 70, 24, 193, 141, 32, 281, 63, 334, 267, -92, 273, -126, 36, 105, 94, 132, 127, 181, -47, 133, 80, 286, -66, -64, 306, -136, 87, -103, -65, -65, -130, -230, -228, -343, 39, -153, -193, -202, -166, -60, -112, -173, -150, -33, -292, 130, -100, -194, 96, -92, -5, -13, -272, 162, -150, 47, 159, -51, 9, 175, -194, 400, 327, 116, 293, -184, 64, -194, -392, 11, -53, -123, -104, -50, 315, 3, -318, 81, -308, 38, -231, -184, 44, -43, -164, 139, -128, 143, 366, 135, -137, -73, -165, 87, 57, 133, -7, -60, 8, 281, -11, 187, 75, 71, -2, -146, 94, -37, -81, -29, 154, 105, 160, -58, -117, 24]
3051B4k47L21j29q4Q1r2O0J93m53M6N29j20P2l18o3J55m6k67K41m4L85n42K69
3074b9j71J56M2m6o8N30n62J8K47l5J70j28k63L47k17L16M9n22L52k0O3l9j11
3097G9J37O5l79L77j89j96J81j99K59O2l34J11O8PJ14k93k63L52j21m5J13k94
3119c88K80q1R8rj22r5J03j47K06Rj97J89J63K25j75q7k5n1J54J4j26R0N07l59
3143A76j20o5K59lj30J24Q4j58J69q5j74K64P3l68K00o3L2p4N2l7j59J09l41L12
3167G7k85K68R2r6l5j36K1j61J34j28R4j46k07K44k19O91l97K10m06M0L52r4k25
3190c12o6J32j6J1j04J23L1K87j98J09K0j74L25j09J7j9N6j96K26k35K61J29k2
3213B76M84o52J78k0j47M91m47k77M94l14J04J25k52J01j61J79j9j61J37J7j21
$$ y = [24, -223, 98, -31, -115, -34, -126, -66, 127, -326, -280, 249, 129, 201, -117, -180, -25, -71, -338, -97, -141, 244, -298, -29, -200, -44, -2, -48, -116, 414, -148, -130, 117, 82, 252, 124, -139, 208, -9, 307, 356, -166, 186, 166, 229, 190, 79, 216, 281, -98, 279, 90, -106, 75, -124, 135, 197, -137, -26, 42, 49, 163, -130, -393, -41, -162, -207, -94, -388, -108, -189, -91, -100, -222, -317, -214, -361, -155, -146, -343, -154, 9, 234, 59, -28, -53, -104, 50, 64, -62, 28, 535, 176, 56, -9, 250, 247, 117, 241, 325, 167, 336, 251, 77, 341, 414, 46, 246, 183, 215, 141, 193, 156, -3, 106, -235, 77, -208, 60, 152, 56, 21, -115, -94, -255, -121, -249, -155, -301, -508, -264, -483, 208, -189, 21, -385, -345, 7, -87, -312, -378, -246, -262, -251, -355, -232, -201, 86, -112, -3, 17, -157, 168, 59, 76, 57, 113, -83, 143, -92, 169, 298, 276, 760, 108, 286, 266, 119, 610, 163, -114, 380, 66, 170, 295, 43, 144, -17, 162, 143, -18, 119, 136, 15]
3234A5K89m13RK0L5L7q7j6K80m90RM13m47K25J61k24K31L3j31pj29n5nj18J51
3259b14K01k81L20P4j82L1P8L6j99O9k5Km7K72q0J59j61L6p1j58L38P6j13l47
3283a86J73R3L44m38KJ01k35K85j22LQj63N0K2L1k11M0L68k3l67M91j39j47K59
3307B39l87K28Q2q3j25Q0k18l5L68j5J41j02q5N0j45j41K50j47K99j54j1j25j0
3330d6PJ96j36J09k79L7K04j30p2J51l28M64n57K79J68M0P6k31j16J31L43m80
3352a70J60J32k00M5k51M23m00K52j60j02L73r6q6P1k04j5j86L03l7P1O8P5j96
3375a30k54M10k66M39j73J9j44j49L16J50n06K57oJ69k58N4L03j24k87J55K37
3396B12k85K23k18J60j7j00j73K62p6J67%l2m4m3j33M6OJ48J72l90P7L45k78k91
$$ y = [15, 304, -109, -100, -80, -45, -8, -95, -111, 169, -321, -312, 101, -346, -121, 40, -184, 47, 80, -51, -58, -187, -242, -247, -365, -214, -13, -294, 26, 100, -82, -51, 27, 63, -136, -67, -92, -90, -137, 135, 55, 214, 53, 89, 18, -140, 198, 274, 161, -186, -13, 80, 424, -14, -12, 89, -146, 139, 17, 20, 28, -135, -85, -63, -32, -243, -203, 165, 142, -225, 266, 127, -20, 239, -148, 80, 162, 79, -46, 34, -184, -219, 149, 134, 275, 173, 88, 138, -7, -148, 102, -45, 254, 100, 89, -36, -46, -39, 157, 21, 130, -149, -112, 92, -38, -110, 41, -287, 177, -380, -101, 67, 107, 183, -48, -164, -33, 310, -170, -10, 122, -78, -33, -284, 139, -261, -9, -169, -271, 102, 6, -80, -9, -213, -228, -414, -111, -148, -77, -9, 66, -130, -384, 26, -240, 199, 26, 45, -99, -248, 68, 218, -288, -31, -37, 132, -126, -72, 231, 107, -180, -25, 212, -73, 150, -68, 92, 75, -25, -198, 64, -12, 155, 155, 123, 79, 36, -97, -51, -45, 103, 275, -115, -38, 307, 29, -262]
3420b62L4L93k53lJ75j91J39j82n8M18k24m8J94p9j40j6J46k17j43L43j70p2R0
3443a26q7N4Q8JM6p0J31J58k98j80J86k7J52J40j81K57l0l98L90r9l14R2J4k9
3467a30L36j47j32K24k36L42m66K44J08k50L28j27k43K8K7K06q0k18L03j77K28
3488A68k7l23j3J25J65L1pl13J21j03K77N7k51M0J41n05L75r9K69o4j82M4K50
3511A76l79Q7J68J70j74k23L55j6l21L12j20j59K72l22L42k15P9J67l13J55J90
3532B31l77NJ03O4k05M6P6j59J70J72P7n06K67N9L9J01k12J91l61K57J19k83o7
3555a93K48l86L33O1j82J25kk72M10j22K78k74J06j18j21qM32k57j1J02o2K58
3577C45l44%J22j13q4k55J42M88k57J65J06j53j56K53j64J36k27P9J64J45o1j75
$$ y = [-262, -228, 165, -88, -91, 84, -107, 32, -150, -208, 210, -14, -62, 132, 53, -87, -103, 43, -174, -317, 26, -144, -216, -126, -213, -159, -71, -70, -24, -94, 37, 195, -103, -283, -97, -124, 28, 168, -13, 244, 214, -184, 206, 107, -207, -115, -101, -130, 206, 59, -73, 151, -85, 257, -209, 35, 143, -107, 221, 94, -149, -121, -94, 112, 32, -186, 117, -60, 168, 141, -182, -195, -70, 95, 126, 119, -194, -73, -176, 101, 158, -93, -53, 88, -417, -42, -141, 128, 64, -118, -74, 176, -203, -116, 52, 222, 48, -175, 180, 164, -157, 155, 35, -124, 148, -174, 168, -47, 32, 199, -114, 41, 231, -146, -141, -38, 26, -179, -133, -57, -216, -46, 126, 203, -303, -36, 23, 62, 163, -49, 142, -219, 38, 157, -126, -193, 55, -331, 2, 63, -119, 6, 4, -268, 142, 20, 298, 24, 130, 12, -109, -117, 315, 58, 47, 149, 87, 345, 1, 1, 123, 10, -74, -329, -187, 301, 44, 209, 315, 162, 6, 259, 95, 231, 4, 83, 247, 392, 331, 156]
3599A56j21Qo5K12j97p4J57N3j60n0K2j89L14k64K19jLp3Rj69O6r6K26k52k7L86
3625I3k52N4K46l73J1L26k88J1L5m5J38J31K7q6m05M86k22J36o4J12m01O30k44
3648E6J51J22k88N2K14l76J40J59k45L10k83L15m33P8J00k1O2k0n4k9Q7j35K17
3671A79k82K98k57M7k06M57j35O4j92k9K00k29j80K00J5J06j90K76j26j20K59
3692A55j74r8lj12r0M83j93K35o07M86R6j72N0o5k18M31m40P3J39J21J3QQ2k69
3716f9J67k46L46n55O30N8l43n1J86m2j16P3M3r7k35L38j35j70Q3KL37k88j47
3739b31K94kk97R4K05K9k37j26J34R7nJ40l4l60J67R7lJ4k32J21J26j61K83k3
3763I0J38j70Mk65L26k4J12m4l4o6k93O50k68j41R4k43L52l70M16k96kL0J56j52
$$ y = [156, 35, 43, -22, 190, -7, -81, 76, 129, -31, -81, -59, -248, 66, -198, 21, 20, 23, -50, -41, -210, -144, -240, -14, -266, -293, 93, -159, -105, 141, -232, -221, 105, -183, -172, -137, -182, -44, 87, 114, 28, -377, 109, -113, 23, -41, 71, -330, 300, 56, 207, 329, 41, 93, 307, -69, 71, 230, -15, 295, 12, 327, -106, -28, 72, 51, 113, 93, 39, 10, 97, -38, 179, -103, 195, -62, -15, -221, 236, 101, 165, -27, -56, 144, -85, -265, -65, -50, 56, -134, 142, 16, -104, 155, -19, -117, -120, -232, -322, 161, -32, 203, -404, 82, 178, 6, 56, -9, -227, 204, -236, -163, -24, 97, 110, 118, 200, -69, 98, -148, 198, -357, 273, 331, -12, -63, 123, 81, -35, 38, 81, -16, -251, 87, -48, -218, -135, -133, 204, -84, -231, 63, 61, -236, -142, 63, 92, -145, -271, -137, -40, -45, 95, 61, -299, -132, -35, -38, -24, -256, -135, -9, -170, 113, 90, 228, 58, 62, -203, 123, 99, 211, 167, 133, 67, -226, 424, 156, 15, 109, -134, 218, -152, 264, -32, -34, -4, 152, 0]
3787@Q7J8j64L99l52j56L56r0k46M34l21K69l31K63n2m03J02j6J63J82m14n0L88
3810F6m17L43k22j3p0K38l38N98L3l91m8K11j02K22j75J38q4j1J68m80O90j30
3832B26k49J21j58K34k92K91p1J92m01k4n7j20M93j92J02J17j02k49J78k00O36
3853D75m51J12K25l45Kp5j06K35j18R7J13p7p2j80L4K46j15J90j7l29K74N8k93
3876a17N9rl9K21l9j1J1k7N1J3Q0k06K97q5k43j52K36j21K30o7j99K20j99rkK02
3902I5j62pJ45k4j27M7J46j88J76k03K52J52k87j56j05J42P1R2lk19j04L32o4
3925Aj13K27j05l7J92j33k18K90J17J0M7p4k0l52L15m4q0K21k13j08K26m29L20
3948D0q9m1K29j61J15N0R6k08J77j45j67K73J42k36k34j03N47k89j13K50j56J23
$$ y = [0, 87, 105, -59, 340, -12, -168, 188, 98, -148, 286, -35, 234, -97, 166, 114, -289, -187, -203, -40, 142, -272, -322, 66, -351, -8, -230, -243, -313, -75, -413, 185, 218, -173, -221, -10, -112, 110, -65, 73, -11, -22, 146, -334, 356, 226, -23, 98, -60, 174, -118, 173, 102, 294, -107, -131, -188, -308, 185, -7, 95, 212, 110, -139, 39, -161, 475, 24, 136, 361, 16, 18, -57, -163, 72, -46, 51, 164, 87, 15, -165, -131, 115, 0, 190, 173, -156, 118, 176, -117, -58, -67, -106, 115, 76, 65, 76, 49, 100, 113, 193, -13, 284, 199, -44, -196, 40, -81, 149, 82, -117, 103, -96, -105, -107, 95, -67, -74, 71, 47, -80, -33, 113, -75, 101, -102, 150, 302, 15, -141, -246, -104, -33, 59, 56, -163, -267, 65, 1, -112, 115, 10, -27, 165, 32, -186, 104, 221, 231, 278, 204, 184, -168, 147, 103, 23, 244, 31, -77, 149, -280, 40, -49, -90, 139, -22, 93, 143, 239, 31, 208, 63, -104, 169, 311, 75, -159, -262, 285, -4, -117, 133, -23, 100]
3970A00p6k67K62j57K36n7l3j15r9J89L9qp4J8J04p1o2j98M19j73R8o6q1K72k38
3995c8m18J84K89j2j3J52rj86J39j88j91Q8K06l43L20J29j1N9l0k79M9ln1L56
4019A99j85n6K37j66J35l2j39K60l55N3o1M43l20K4L2K74n50L41j86j27L56j46
4041C1p1K79k77J77p7k71K27j48J70q9j48J18J33j03M6j48PM30m53Q0Q8k33J9
4064b13J54k6k1J46N4j51j22K57k2j07j27L19r1P7m20J92j48K40q2K12Opj92j0
4088h2J27J94l47n1O8rl6N48n60M3L56m71K34M6p1J03K08m6l54M6PM6J95j93K3
4113B4N3L3k35L89n14J04n2J78j7n5J46q7P3k65N17j50j28J76l25K89k90J47m4
4136c3k14N63j06k95K53K09n62K34j51J82k53K73K4j06j0O0L0l09K66k04K66j65
$$ y = [100, 24, -243, 19, -138, 98, 41, 8, -107, -206, -17, 22, 14, -60, -42, 62, -9, -71, -269, 150, -23, 75, 9, -72, 200, -38, -456, -272, 17, 5, -8, 144, 135, -51, 88, -100, -291, -203, 3, -340, -20, 109, 98, 157, 127, -152, -103, -106, -157, 199, 14, -42, 195, 29, 164, 132, -7, 253, -102, -49, -110, 333, 13, 37, 69, 343, -207, 134, -52, -179, 177, 31, -40, 239, -38, 139, 62, -209, 18, -130, 40, -49, -197, -79, 54, -49, -3, -151, -144, 286, -167, -87, 1, -232, -213, -59, -85, -106, 40, 94, -57, -179, 78, 56, -51, -178, 141, 50, 127, -293, -101, -249, -9, -91, 121, 127, 120, -72, -82, 45, 239, -108, -159, -91, -100, -136, 412, -148, -105, 251, -220, 14, 60, -11, 92, 300, 254, -100, -54, -47, -1, 194, 1, 24, 77, 110, -125, 264, -250, -146, -198, -20, -37, -92, 54, -33, 40, -225, 292, 142, 14, 190, -135, 154, -136, 11, -33, -247, 316, 210, -85, 168, 377, -185, 49, -102, 80, -173, 100, 124, 18, 8, 68, 98, -211, 55, -149, 117, -48]
4158d8K36o1l84M25j0m35K97J13l85K31k52K94j80j00J55p1P6L61l87K59k81j87
4180c34L55K3k52J81j48K14J0l7Q4k39R7L1K00k75n6K76j79J75k45K1J62j55L16
4203B25j42L18k88m56M78K5j9k37J15l7J1k13M71k60o7l7K35k58M51k35J4r3j7
4226a6nO4K89k25n1j33J08j77N9Q7k04L82o8j63K13k4j79K14j60j24j16j5J60
4249h4L6L30m00J9J56j28Q3J64Pj30J01j17j6J28k6m22K15l5L39l22L85k34%q1
4273c2k34J6J92J19pj7J19k58O0Nm2J21l2P1p1l65L16l5m6k5J70J0l6L00l62P3
4299A0K23r2P4l39K43j01J38J60j22kj20J29m01K64k23L20pk16J63K0l53L10k22
4322a44J80j97K38p4K4m7J21j91K77q6j69N6R8k97K78j92L64m55K47r3J40r9q2
$$ y = [-48, 188, 127, -257, 168, 158, -277, 20, 133, -252, -21, -273, 21, -159, -259, -104, -175, -99, 262, -125, 134, -147, -334, 21, 44, -208, -27, -175, 39, 49, 12, 96, -143, -46, -15, 185, -90, -146, 130, -49, 126, -119, -98, 64, -91, 225, 83, 401, 113, -343, 135, 160, 141, -96, 19, -18, -7, -220, 251, -9, -76, -113, 122, -136, 315, 80, 94, 1, -16, -21, 43, 332, 107, 56, -77, 31, -146, -87, 0, -204, 178, 110, -53, 160, 136, -43, 171, 11, -113, -229, -244, -84, -48, 282, -118, -99, 57, -71, 12, 176, 183, 53, 154, 37, 21, 149, 123, -299, -84, -119, 220, -102, 283, 49, 49, -32, -266, -250, -58, 61, 54, 37, 156, -102, -42, -37, -79, 42, 10, 81, 10, -355, -39, -74, -120, -145, 25, 35, -1, 299, -63, 10, 233, 141, 215, -124, 119, 18, 156, 316, 194, 192, 72, 201, -200, 64, -159, 161, 154, -62, 101, 121, -232, 78, -144, 36, -161, 77, 3, 27, -20, 101, -90, 187, 101, -68, -12, 86, -211, 67, -125, 239, -216, 31, -62, 78, -21, -103]
4345a03n9K94j01n6Q9l07p5K57j08L75k54k5K14J64l90J47P8j03k60j29L61j7
4367hJ9J6O3j12o9j27J68O7J0k83Q4K78j60j25J64M3j23J56k61L6L73n18L64j00
4391d5N7M43m07J06j35P6N5k9j43j3J03o8K05j35L2J23j22J15k84J11J00j18L6
4414F3j17J79K6l81N65l55J34k4j13k54K18j30j78J44J42r7J13j80K88p2j97K84
4436E8j72l4J0k6Q0L28n04K69j21J68k23m4K07n0j82M20l76J29R2j92L06l1j7
4459I5j96O6J74J07q5n3k65J6k8R4K58j63Pj5O6r0K88l79O2J37J20k04j42mK88
4484A54n2l0l5J00p9j79L66k61j23J82K9j32K01k15J17J57m31K86N5j07P2m61
4506c86O89k13j40lqnJ63J6m16O01m84m6qK55K65k62j95J50J55j81R9j37j84L04
$$ y = [-103, -162, 132, 31, -25, 64, -243, -318, -61, -169, 206, -48, -73, 141, 305, -85, 62, 140, 37, -223, -352, 9, -8, 11, 27, 90, -22, -91, -218, -50, 17, 27, -256, -172, 106, -54, -179, -15, 28, -95, 61, -200, -164, 209, -309, 55, -45, 12, 455, 48, 154, 19, 95, 150, 121, -22, -35, 68, 0, 205, 70, 102, 225, 103, 218, -66, 45, 145, 27, 63, -54, 125, 151, -230, 335, -20, 114, 90, -23, -277, -59, -189, -367, -223, -81, -178, -65, -245, 43, -29, -226, 58, -114, -148, -138, -164, -84, 244, -260, 9, -112, 56, -167, -211, -4, -54, -236, 184, -192, -63, 29, -163, 143, 112, 95, -101, -35, 139, 246, 161, 108, -157, -141, -169, -75, 183, 20, 27, 12, 78, -12, 276, -103, -41, 96, 216, 12, -130, -134, 154, 102, 72, 37, 137, 58, -121, 245, -16, -139, 43, 72, -60, 141, -74, 43, 200, -231, 55, 110, 3, 75, -386, 303, 90, -50, -53, -61, -66, 97, 113, -303, 298, -186, -232, -240, 15, 280, 18, -177, -27, 128, -53, 46, -91, -275, 29]
4530B9j70J93k13Q9L5j46N0K15J2l38L32r8J08%j54j49j37J65J57M5j61J61MJ0
4554C9j7q4j3j24O3J3J10k8L2L6m3k9p5J22Pj99M08j32j51k0L7M7Qj34P8J53l21
4581b17N48n31J42L14l49L61k36k43K21O2R2j60M2P9pJ1j71J82p8j84Q7M5n7o7
4605a14J50q4O4P0j35J1nNj58K82j36R2P4m7J03n34J34J22P5k4P5j20J04j3P3
4630F4m9j95p0K86l41J07qk0L11j36J64j62J40j01l7j5L3J35J27m4l74L80j40
4653E5l22K77M0J03P6k75N20n86J64j18K26Om1k96K55J01l55L19Kq9J29n6r4L9
4677H0k28K30k49K63j3p5J27j02m21M13J65j40j1j72P2K8o9J21j07J06O5k71M9
4700a39K4n0L51k38q5K82j53j42l4J19k5j2K40j97k2n5J51j86K88k77L9J41P2
$$ y = [29, -141, 52, -161, -72, -37, -183, -133, 82, 94, -244, 88, -10, 98, 98, -56, -205, -342, -177, -20, 25, -136, 25, 29, 39, 22, -62, -75, -199, -136, -123, -13, -41, -9, 27, -16, -45, -120, 2, 9, -190, 218, 86, -65, -85, -48, -1, 7, -127, -49, 104, -217, 331, -200, -58, 256, -93, 268, 32, -211, 10, 72, 164, 4, 46, 125, 118, 129, -42, 140, 62, -122, -35, 10, -47, -114, 36, -48, 16, 86, -49, -38, -43, -38, -196, 86, -50, 42, 116, 69, 172, -362, -228, -106, -31, -55, 20, -100, 4, -9, 64, 15, -180, -250, 36, -305, -198, -206, -226, 85, -51, 113, -49, 91, -10, -47, -62, -29, 106, 233, 189, -185, 195, 55, -267, 10, 50, 153, 229, -46, 474, -112, 52, -66, 160, 166, 125, -171, 84, 185, -170, 149, 151, 62, 191, 135, 41, 80, -148, 82, -167, 96, 83, 8, 135, 33, -388, 25, 190, 50, 39, -133, -61, -33, -102, 19, -88, 18, 83, -188, -139, -115, -165, 186, -52, -137, 145, -8, -150, -184, -65, -90, -102, 138, -59, -81, -136, 15, -171, 117, -160, -121, 20, 92]
4723I2j48L5n7M6J70j73p4Q2j50L75M2j81j46J15P6l75L76P5j75L3l87K40K61
4746A52k96J54k12m3N55Ok53k62K74RJ51k31J52n7J4j13J02l29L87q7o4J79j73
4769A5J38j45m6J6j61J03j00K25Q3j69J55rk46o6J40Ooo5J05j88K04J12k54J75
4793B2k30J64k00K81k5M5q4k57L43o6N3P8k44M02k14oQ6k74K44J07k33k3N2J15
4817A36l13J39j78K24P8n6o7J2j4Q9K0p6k20K41k49K41M8l6J65L8l90K3J85n5
4841a5J14j20L34j69j36L4K43k40K25j73J07j84k59K75j73J81J9l66M00J56l61
4862a08K21m2j34L7Q1o6o0ML05m31L66l03R6R1m59M05n1J32kj86k21J80J05k7
4886f7j16J05M6j02o9N78l52ql5m7j38O5J90j38j07q7J21K35n2o1M71m25L13l51
$$ y = [92, -56, -21, -78, -32, 138, -35, -109, -27, -177, 198, 240, 59, -87, 28, 104, -271, 105, 180, 5, 38, -349, -109, 152, -144, 10, -202, -245, 310, 316, 63, -199, 75, 84, 235, 4, 156, 99, 113, 0, 102, -227, 160, 73, 9, 188, 15, 153, 8, -38, -22, -183, -80, -180, 45, 128, -41, 114, 105, -141, -207, -67, -61, -67, -132, -27, -215, -11, 101, -153, 22, -208, -44, -244, 37, 12, 57, -27, -284, 59, -7, 46, 124, -120, 282, 68, 62, 148, -126, 118, 225, -8, -31, 21, 136, -177, -38, -216, 8, 86, 30, -37, -25, -39, 50, 70, -6, -226, 15, -234, 7, 55, 19, 184, 222, -168, -145, 40, -15, 99, -21, 313, 144, 8, 42, 285, 45, 270, 97, 204, 20, -239, 36, -137, 44, 63, -303, 97, 253, -108, 113, 71, -63, -26, 55, -11, -71, -67, 238, -193, 173, -130, -34, 57, -402, 3, -48, 84, 82, -104, -325, -145, -40, -67, -183, -78, -32, -134, -203, 375, 23, 15, -20, -67, -205, -140, 50, -88, -195, -282, -161, 74, 22, -39, 432, 7, 320, -31]
4910c1K27j79R0q1j41L45k01r4J46r2n9K36k1j90M33k65N1j49J5K78l38J92l43
4933a71j08J17J27R7Qq4p0j75J0L19j03J36j25Jk02J96N3ko6j79J46J14j54O4
4957e1l5J36j90k02M76kP8k55M5K8P3M0N1l23n5K57Nm8J33jp7m8K5j17N8kq6J38
4985E1K49k72J26l92J08K77k22j04J63k36M6L6J85j0K47k72L4k76M8L30N8l61
5007a87L15k99J81l56J37R7O4J86m0p4N5K22m61J60j47K64m25O22l06K05kk68
5029e7J05K73k3k74L23k03J56m6k41k8QJ34O1j05j92L04j05L4J18j49l26K40Q1
5052H8M9k32O3n0k19L49m1J95n8m21J02k19N3K10K33k62K29j59m3l1J93Q5k66
5075a52M3J68j70p3K10j63k05L32k3K23n59K17q5N1K46N4k24P2J6P8K71k54J77
$$ y = [-31, 196, 17, 107, 26, -115, 230, 29, -65, 81, -11, -70, 166, 145, -45, 388, 123, 174, 25, 40, 318, -20, 172, -171, -279, -162, -35, 62, 70, -14, -84, -259, -249, 70, -33, 103, -22, -21, -223, -27, 26, 24, -42, -221, -75, 39, -115, -51, -86, 50, -140, -342, 134, 132, 210, -45, 0, 28, 101, 141, 192, -131, -186, 71, 76, 28, 161, 160, 83, 35, 60, -57, 1, -1, -87, 51, 300, 28, 154, -238, -130, 147, -75, -179, -16, -252, -206, -170, 15, 5, 252, -20, 14, -262, -214, 116, 174, -187, 128, -171, 10, -346, -209, -112, -48, 138, 98, 24, 79, 301, -160, 0, -147, 117, -308, 314, 8, 213, 211, -57, 48, 321, 298, 24, 347, 144, 300, 254, 13, -15, -7, 127, 188, 83, -109, 195, 90, 124, 242, 93, -233, 7, 88, 137, -95, -32, -82, -301, 48, 7, 202, 144, -277, -175, -394, -341, -131, 102, -160, 69, -90, -133, -164, 29, 114, -152, -109, 59, -111, -184, 26, -137, -342, -10, -33, 190, -369, -152, -237, -186, 60, 114, -110, -38, -22, 56, 327, 73, 250]
5098B50l11L24k87j68L74j78r8K98j12m0j14k71K16J90m7k52K03L5JL1n4J55l0
5121A15j85K03m88L43L26j10l35m2L5K62j38J41k41J82K79m59K30o8jo7j58j36
5143c12K57j5k5M72m07o9q9J35j81J39K69j90J0Lj03J12j25J39j74M84m57j26
5165b53N4L55p8j47R6k20K77j16L02k46ok17K24K05l71L99k51j88J56l74M69K3
5187I3r9j13J42l08J89J8M47j88j81k7p5L61k28j40K67r2j68k83K85N6L00j63
5209I3k13K57j49J94n6q8n4q8J53J38k29K79m41L62k17j9R4j14RM69m52K73j02
5232I9j01Q8K00j66K4l4k04K64m42L03n3l27K49K20R1j85k86J81l3j19M7O9N5
5255f0j34K09p3q5P7j34M0n9l1L45p3k7l9j41L66m0j75m0K16Rn26K77o2K33K08
$$ y = [250, -61, 263, -24, -192, 182, 4, -94, 204, 92, 52, -62, -333, -117, 73, 26, -226, -23, 12, 13, 44, -10, 145, 115, -70, 133, -355, -12, 314, 204, -131, -173, -138, 124, -14, 127, -114, 68, 347, -112, 118, 50, 49, -18, -176, -312, -55, -70, -95, 377, -30, -99, -188, -53, -234, -95, 174, -16, -6, -3, -106, 6, -119, 20, -154, 330, -127, -253, -199, 156, 78, -69, 27, -193, 84, -32, 270, 24, 18, -199, 25, 230, -141, 258, 7, -181, -25, -399, 70, 93, -6, -119, 23, -285, -96, -78, 369, 181, 0, -27, -102, 259, 31, -109, 158, 66, -102, -385, -100, -44, 256, 93, -120, 137, -12, 182, 126, 38, -16, -104, 49, 187, -42, 237, -204, 158, -59, -78, 16, -98, -89, 380, -72, 201, 99, -2, 86, 286, 120, 144, 110, -94, 170, -272, 31, -22, -349, -100, 120, 211, 26, -260, -79, -112, -231, -184, -115, -60, -194, 15, -58, -143, -66, -200, -160, -219, -250, 95, 22, -5, -44, -185, 181, 141, -34, -74, 142, 151, -375, -98, -160, 73, 281]
5280B81p1j55k0K0j21K42k28l1L02j75J22m60K58n4Q6R3J8j86K28j19n4O7j84
5303a41J06K14j39j96K09q7l2L09j93O9lj11m7P8j34o4J45R3j13nk4K93k96J42
5327G3j58%K70j49p6K27m74M8M41l11j24K43j77k08M18J1j73K26m1oj28qK76k84
5351h4j48J40J10q2K15j61j28J79mJ82m09K48K8j14J20j63J01j04L04k38J11j6
5373H7N1k24L5R4J04j6j06nj99N91m65J04k39J24L5K13l01LK24j87j16L97j94
5396A0J0O2J47p6k01P6L84k29j90n1J57n72K46L26R0k95J56j59J07k62N9k7K74
5419D2p7j62K50l66K29j38L86j98m0n4k00L77l10L61j88Q5k55K48J40q0j40p4
5441a64J51P6j6K62J02m94J68K3l2K08l26J34r3J03K0j05K17lk15P4q8j37L86
$$ y = [281, 210, 55, 35, 55, -66, 176, -52, -83, 219, 44, 166, -294, -36, -90, -4, 89, 107, -79, 149, 30, -24, 43, -141, -35, 179, 40, -156, 53, -34, -66, 243, 50, 119, 116, 5, -42, 36, -98, -162, -17, 76, -37, -42, -66, 227, -69, 73, -85, -85, 185, 36, -40, 187, -287, -239, 202, -109, -233, 10, -167, -375, 43, 54, -119, 107, 66, 60, -68, -76, 200, -84, -232, -92, 18, -64, 151, -10, -138, 41, 37, 219, -190, 58, 86, -28, 92, -71, 30, -74, 230, -8, 103, 87, 138, -86, -51, 43, 147, 131, 25, 20, -179, 412, -53, 51, -188, -64, -29, 184, -117, -114, 110, -77, -193, 204, 10, 20, 82, 229, 153, -48, 28, 412, 183, -7, -58, 99, -473, -227, 99, 189, -106, 50, -109, -2, -264, -205, -232, 42, -35, -197, 53, -313, -84, -222, 164, -34, -74, -128, -328, 49, -261, 100, -88, -3, -258, -10, 130, 50, -90, -164, -13, 63, 47, 309, 411, -83, 85, 108, 76, 284, -42, 92, -1, 102, 122, 17, 234, 231, 16, 90, 2, -135, 251]
5464B51mk46n1K51k27J77k38K02l3j93k4j39M25P3n45J65L39k19J77k25j75J98
5486f1n3J73k21J69Jq6rOK00j49J84j14K1k53J55k4j1L12l47o4N5L03k18K74k5
5511B18k12l3M9j17K40k06M2K7J6r3j06M46m19j9M0r7q8M75l53J53mj09p6n0K40
5536c6J39n20K56J59k06K91j11o4J25q2J14l62J67J57l12N8n6M15J08j54j7J26
5558A95j21j60K87k5j09Q2k50J10rq5L48L0l42K59J45l60q7o1J87K9KK11l50J54
5582H0J61k79M8k2J41J13k95K54j76j98K48j70K8N6K9J27j32j47J98l15K11n2
5604i2Oj26M77l57J94m19L10J92l26J20L49m82o3K87O5O4k62J13k1oj93p3K04
5627c9O2jok21Q9K28j31j84PK32M9j24K21k84J70j77K60m39K82k61L70n5k53J70
$$ y = [251, 247, 1, -50, 201, -26, 151, -87, 115, 82, -111, -135, -274, 151, 224, -321, -156, 183, -36, 141, -84, -259, -61, -114, 59, -162, 7, 8, -78, -87, -81, 119, -30, 154, 40, 61, -192, -37, -61, -72, 240, -107, -171, -116, 187, -31, 243, 218, 6, -27, 22, -95, 145, -61, -19, 8, 24, -69, -175, 271, -148, -167, -127, -224, -312, 163, -190, -37, -41, -150, -226, -276, -36, 103, -417, -161, -2, -208, 83, -28, -92, 33, -49, 65, -297, -130, 27, -285, -227, -283, 132, 240, 86, 69, 195, 74, -86, 201, 176, 67, 149, -101, 9, 0, -85, 263, 293, -49, 210, 355, -5, -92, -153, 34, 63, 65, 276, -74, 80, 241, -38, 10, -12, 129, 242, -53, 201, 25, -173, 75, -95, -67, -11, 18, 145, 13, -134, 64, -251, -40, -92, -86, -212, 265, -92, 102, -317, -7, 185, -141, -21, 328, -154, -217, 70, 135, 199, -63, 50, 29, 23, -170, -243, -39, 23, 22, 16, -205, -116, 112, -19, -203, -196, 36, 85, -39, 182, -102, 68, -109, 151, -288, -6, -267, 103, 48, -205, -35]
5651c5K50p4Qj58r5K41k56J38R9k79L55j60j4O8r6O6J02k83K10j07J06J13j62
5674C7j59M12m16J16L51j33j10l91O7O5J50Lj29O5k12M79j81j8j03L96k15J6j53
5697f3l43K37L2J82q9RL3j53K27l3Q7j37N0o1j16J49j41J13m4L2j18J08j77K2
5721a94L67k32K32j55P1l0m7K1J33k45J45J08k13J27m9J70j76J64j94j34K4M7
5743f0J2n8M0J21J12k44J22k29J10J13r1o3m8J82J77j96k11J6J92l6K53k64o8
5766a18m4J61q9J16P0O7k55j4R0k12J64j22K04j03K45j19J10l41K87J6P6m65J51
5789a25K23m2R0J71j78l2O9m85K80Q1j87J49q2l1J49j41p7R8L8o3J40j66O3rJ09
5814D2l9r8J03j0P3l07j3L51K15l70Nl9p3J56L02l86Q9m9R5J5o8J8j92qK15j37
$$ y = [-35, 215, 141, 149, -9, -104, 137, -119, 19, 118, -161, 194, 34, 20, 88, -8, 58, 160, -123, 87, -20, 86, 199, 37, -122, 290, -126, -10, 341, 208, 98, -293, -226, -161, -11, -8, -137, -72, -284, 195, 14, -4, -107, 289, 74, 90, -63, -406, -169, -137, 45, -44, -35, -2, -155, 72, 39, 126, -11, 39, -22, -138, 11, -130, -17, -61, -29, -147, -39, -216, -194, 173, -59, 173, 18, 89, 59, 12, 33, 166, -79, 66, 174, -39, 88, 39, 209, 33, 197, 3, -131, -107, -60, -48, -106, -66, 55, 167, -77, 45, -184, -74, 39, -52, -115, -163, 19, 196, 0, -211, -195, -3, -39, 214, -50, -118, -162, -1, -90, 26, 96, 163, -92, -106, -16, -228, -64, -186, 18, -85, 160, 41, 151, -190, 97, 113, 189, -276, -125, 98, 56, 146, 317, 139, 107, 176, -309, -29, 52, -135, 14, -68, -99, 50, -91, -168, -70, -32, -95, 45, -121, -58, -67, 42, 3, -95, 8, -2, 71, -236, -249, 102, 317, -53, -48, -87, -160, -4, 298, -88, 1, -48, 47, 62, -6, 12, -180, -188, 27, -110]
5840a10J97Nk56K21k96O2N5J21O5n5J02m9J7r3N1J09j21J73j2j27J58l25L33j28
5864I7J2j29Q5j61J33j05m5J43m20N74j31k36N8J93j47K10l38L74l43K37J28J79
5886C68l20j15K73j37k62J01r5J44J73k86j39L78k93J61J15j38K89l03J45N7j91
5907g5J87j10J4K20k86J90m5o2j62J76K4N5k85j31M02N3mk03k7L66m06R7m0%J02
5932E0O8l57M13l28j1J55p7J83j83j76K70J05J84l53j25L85k38N1k95K76p9P9
5954ck59L95k55J47Q7k92N12L9o34N02l92r2L32j52k8J88j53J2J15m0j06Rj12
5977a80K58L7k58l2J02J75m9Rj82L84n87N32k57N4P9N3l6k23M08j85R3l66p3K90
6001D6j35k79L70R3j27J2p8j11M1k5K04l2o7J52j23N1N2q6Q0L8Q5k82K87k67K37
$$ y = [-110, 87, 92, -164, 57, -239, -177, -122, -1, 64, 9, 111, 62, 79, -14, 37, 146, 25, 198, 186, 59, 217, -108, 225, 97, 109, -20, 65, -96, 37, -68, -113, 30, -390, 184, 53, -183, -125, 68, -79, 131, -207, 167, -176, 61, 189, 368, 48, -67, 206, 69, -193, -92, -187, -43, 130, -156, -295, 83, -210, -49, 66, -72, 217, -86, 59, 116, -75, 112, 2, 16, 236, -50, 140, 95, 33, -129, 47, 71, 126, -159, -290, 112, 165, 161, -42, -69, 297, -109, -12, -52, -52, 50, 118, -239, 174, -154, -165, -10, -87, 96, -87, -263, 7, 112, 296, -57, -182, 203, -35, 16, -279, -3, -82, -3, -262, 133, -122, 25, 112, -180, 332, 371, -263, 239, -153, -245, 87, -65, -93, 95, -58, -46, 69, 29, -77, -68, -180, 78, 115, -143, -175, -73, 102, 53, 62, -120, 264, -323, 209, -48, 6, 85, 138, 102, -121, 287, 102, 195, -171, -244, 46, -89, -368, 2, 95, -32, -20, -98, -209, -168, -193, 11, -21, -88, 64, -59, -8, 44, -42, 38, 76, 161, -121, 166, -101, 136]
6026A36K2k29n4j57MJ22K14j24N0J42r8mP5k48J76l4r5K09j16j67J96Nm4J20J75
6051B76j44k27L36k05J42j19k29J39L5j19L16l86L0J14q0P5J78n7K16n08j13J11
6073b19J27L8J51L9j83k15J67J64J80j84p7Q4j07j8k0J07r4N5m4K50m08L43o9
6096F7l0K71j60j49J25L3l42L57j35jJ22r5J1J1J05k27J26O9l29J5K07K22K0j78
6120A15j34K67R1k36j62j76K39K25j85L6k28J19m8p9K56j38K6M3j28K49l37K56
6142G1k22n3K68j62m5L16k27p5l7M0J38j24o9O8j2p8L68j89l84M77Lq6p2J33Q1
6167A28k39K5K32R1j87Qp4L2J58j01M2k63n2K50k27K35K68k40k06m6Q6J24L19
6190C63k78j26R6p6M1j46N6j63J43q0Q5J23k44j04M05l91M07k27J26Q2k02K78
$$ y = [136, 158, -71, -125, -282, -278, -156, 58, -66, -16, 126, 28, 24, 99, -149, 27, -7, -102, 107, -9, -176, 20, 25, -19, 101, 276, 132, -95, 241, 36, 178, 59, -170, -31, 4, -115, 201, -185, -155, -41, -121, -46, 132, 75, 291, -217, -330, -219, -92, -54, 97, 136, -47, -262, -95, 69, 249, 65, -12, 72, -35, -53, -73, 34, -60, -5, -49, 201, -207, 136, 67, 37, 308, 148, -1, 124, 157, -185, 172, 37, 36, 158, 63, 74, 85, 190, -37, 89, 158, -171, -156, 51, 273, 293, 115, -19, 248, 339, 103, -59, -235, 4, 229, 44, 80, -148, -29, -77, -156, 100, -38, -12, 31, -97, 152, -185, 71, -151, -204, 64, -98, -143, 173, -54, -129, -166, -126, 12, -112, -181, -113, -125, -203, 165, -24, -408, 69, 72, -14, -86, 47, 128, -111, -86, 146, 237, 50, 58, -16, 16, 174, 73, 115, -148, -200, 50, -177, 58, 326, 86, -120, -166, -80, 44, 363, 85, -41, 55, -21, 20, -126, -70, -233, -90, -170, -85, 38, -206, -310, 95, -296, 111, -116, 10, 92, -110, 168]
6212A68n7l50J16K7q0K03k28j9L44j39M3qk4K5q8q7k63K05J2K62j08Q3M2j40j2
6237g3Q9O0j64L31k4J98n70L09j51R1jk66J75l5RP1j04J48M1j26J55j78k07J31
6261i1J1O1R4l44O2K7k50O47j96p9J01j92J84k77J76J15j7P5J4kk63K23J29l6
6285A72j82j16N01j6j84k51J31O3J69k46J2k65L41j81j32K44j74K24k01n8J42
6306gQ9l0j03J46j28J35N4j39M12l37k02L83j06k05j39J24P7n7j87L11j60O8r4
6329i5J21q2J33j76J14j13j48L83P1o0m2l27J52J7J3J00k41L09l69J78l8j01J12
6352h9M72m81j68J56J15n3M3kk4N4J93k28N6N1J8K7k82N25k07p7j27J88j65J21
6376A16j27r1j46K08K62l26j9K27o3K23l69P4Nn8k8J84l2J09Q3m86K29J16p5N2
$$ y = [168, 111, -239, -123, -96, -176, 27, -201, -220, 124, -15, 28, 20, -4, 21, -67, -154, -417, -212, -200, 62, -46, 37, 79, -61, -73, 16, 76, -88, 243, 219, 417, -153, 156, 5, 96, 95, -171, 4, -31, -22, 49, -55, 93, 134, 8, 163, -15, -222, -91, -80, -19, 75, -269, -207, -180, -430, 217, 21, -58, 43, -149, 35, -242, -66, 49, 32, 107, 121, 119, -144, 79, 208, 172, -10, -126, 375, 359, 175, -76, 55, 118, 287, 41, 53, -212, 129, -52, -184, 60, -114, 110, -91, -149, -7, 82, 52, -51, 95, -33, 102, 156, 17, 429, 92, -110, 273, 167, -38, -177, -53, 24, -33, -220, 91, -69, -1, -95, 26, -56, 77, -99, 15, -98, -246, 137, 208, 148, 106, -221, -69, -52, -39, 61, -180, 129, -240, -62, -100, -201, -89, 383, -98, -266, -110, 5, -48, -5, -7, -31, 23, 216, -12, 44, 95, 113, 140, -142, 383, 176, 99, -28, 160, -5, 116, -11, -102, -248, -40, 222, -104, -123, 104, 41, 264, -105, -31, -26, -84, -112, 72, 40, 149, 232, -254, -25, 91, 16, 68]
6400F8j3m3K53j56j13K45k19p4K86l42Q4k15L21j27K8J68k53J2P4J28k13O8N7
6423B4K04l58M6l2j57J53R8j3o0r4j07L79k23M39l02n1o5J9J71Q8q3j06P0K7j03
6448c6K38j39K03m17L7K33m24K25L47k86K69j52n2R4k59JM49o87L71J39l6j25
6470gJ65k18j7r0K53Rm3m0j37L09j97j63pL02j52P5R3j84J04j6j14J38j6Q2j44
6495a5Qk14R8K79k46j07L88j84kj47L06o5J48l32K42R2k64k88L11j83J82r0P9
6518dN4J7j44K26j57J03j90J27J3j6l2k65L03KJ10N0k58Q2R4j21J97l00K27r9
6542A9j98O6J11j65M81m50M6Q1j25J01N1j04J80J40J4k69N1K79k95J03k46J90
6564F1J94l33Q4J51j43J03k80J33k14M14k28J62j17J65k59J15j83J93J34k59J71
$$ y = [68, 55, 12, 265, 109, -4, 241, 22, -52, 234, -108, -24, -239, 82, -45, -17, 151, -102, -90, -16, 112, -101, -33, 24, 228, -130, -84, -116, -273, -120, -22, -35, -95, -189, -296, 83, -140, 299, -3, -54, -119, -100, 71, 159, 76, -30, 40, 67, -36, 202, 63, 266, -151, -114, 119, -305, -80, 267, -19, 250, 98, 46, 140, -119, -118, 331, -356, 15, 154, 118, -7, 158, -60, -77, -167, 86, 95, 52, 12, -125, 184, -13, -176, -183, 119, -33, 42, 135, -49, 55, 39, -75, 63, 47, 129, -15, -7, -221, -123, 156, -90, -197, 191, 7, 5, -142, 164, 99, 247, -85, 157, 249, -15, -303, 8, -175, 7, -83, -4, 50, 67, -77, 149, -8, 95, -95, 32, 45, 29, -3, -268, 35, 37, 147, 197, -61, 21, 115, -6, 191, -109, 118, 19, -179, -113, -2, -167, 314, -136, -90, -9, -134, -33, 18, -86, 94, 234, 248, -21, 30, 309, 14, 117, -129, 61, 255, -78, 6, 157, 14, 117, -163, -30, -244, 170, -58, 104, -13, 152, -107, 8, -175, 18, 152, -107, 64]
6585F4j05J55k27R3j14L59l51J88j49K7K16k59K10k75J15q1L99k72j4K45k72n3
6607a01n5R5O9K9qj77K64J52m77K73M2M5k64K68m9j80P3k71L49k96L59m1R3l23
6631a31J93J24m19L73j30J29Ok7k05J46j22p1N0P3M0n4K36j9q0k16r1R7J09J14
6655A25J12q1l00K97q6j9j99K38oK00k99Q4j36q3M37l66J59k91L32q4L7J0q2j55
6679a56P1K03R5l88L9K87j20K06n14K98K88n28K4L66j7k08qR3j00J32j52L76l50
6702f3K29l46K08j19J00j21K34oP1j03j63J06J37nl91J78n0R3MK8l34K09M2J77
6726A15j72M74l77j58K36j54m8j0L96l22J06j64q1K26j50o1M8K76k3j76p5o5P5
6749h4p6K37R3p9k00K82j69j0r4L01j29p8K09k58J5q4k0o2J91j01J10Q5K9k23
$$ y = [64, -41, 114, -113, -20, -134, 225, -126, 62, -87, -60, 156, -103, 107, -168, -53, -134, 265, -7, -21, 224, -48, -101, -156, -61, 8, 37, 29, -148, 116, 268, -209, 64, 106, 151, -113, 155, 106, -74, -1, -272, 77, -219, 140, 99, 192, -131, 62, 186, -233, 140, 10, 139, 145, 118, -87, 59, -63, -134, -84, -11, 29, -25, 211, 192, 112, -104, -195, -98, 11, 125, 237, 156, -144, 153, 67, 48, -151, 87, 81, 281, -18, 66, -70, -153, 284, -82, 77, -214, 118, 34, 71, 81, -1, -156, -85, 118, 213, -175, -136, 151, 31, 237, -277, 21, 309, -219, -195, 171, 154, -54, -62, 31, -69, 63, -89, 287, -63, 166, -180, 28, -91, 9, -112, 122, 116, 187, 84, -79, 27, 164, 159, -232, -54, -104, -11, -7, 21, -313, -104, -62, 115, -57, 417, 40, -118, 118, -36, -84, -94, 302, -20, 86, -78, -159, 67, -83, -144, -96, 180, 157, -19, -94, -159, -84, -160, 77, 170, 91, -109, 173, 4, -6, -100, 201, 72, -6, 203, -55, -40, -124, -144, -206, -15, -116, -6, 79, 108, -115]
6773a15N21j43j36m3K24m00J33j3j33O1pJ18k42J01m3K74j72q7K85Q0j98K2M44
6796E31n84j80K39m8J5j11J38K02o5j30O6k79L78j58lP8l14L85K36n27P9P6j43
6819a19qJ75Q3Pj04q8o9j96L58J56m22L71k64L98k60M1P3j03o0J19k63J41J39
6842A05k15R3j01L2j11K74J83l92p6J98K4J3O3j3m0k09J71J37n3m8R2k0q8J47
6866A66j24m5J46k96J5KQ6M72m51Ko9N7J09j44Q3K97l11J5N2m3o5j75O4K42j25
6891d0l9n0L12k9n2k24L24k37J97o3k41L45j63l24K84j72J71K4Q7NP7k08o2M44
6915C66m44J57O5q7j96K32j82R0J1N2Kk62n2M03j71J03J7J21q6k96k0N05k71l70
6939c13N89l52k67M77k08L20l90M6N8j74J61l8J24k66P9J34J5j08J22j22j98Q5
$$ y = [-115, 406, 263, 127, 84, 308, -92, 41, 28, -105, -44, -51, 67, -175, -74, -117, 157, -15, -102, 183, 263, 65, 87, 531, -53, -233, 6, -42, -27, -138, 0, 202, 137, 7, 73, -206, 172, 14, 11, 89, -225, 160, 396, -131, -52, 24, -119, -127, 48, 131, 138, 34, -54, -123, -319, 39, 195, -227, 144, -120, 278, 18, 59, 132, 29, -31, 88, -175, -34, 105, -110, -17, -118, -86, -197, 77, 260, -132, -208, -10, 14, 27, 90, 77, 37, -172, -1, 136, 83, 35, 127, 107, 19, 166, 42, -3, 143, -153, -138, -136, -50, 422, -29, -27, -96, -39, 70, -74, 9, 306, -5, 10, 62, 19, -46, -221, -157, 85, -40, -79, -129, 183, 154, 102, -122, 202, -35, 162, 99, -142, 203, 40, -284, 0, -172, -1, 23, 110, 115, 192, -16, -78, 366, -78, 79, 144, 57, -139, 93, -89, 1, 12, 64, 66, -196, -248, 155, -16, 87, 104, 225, 139, -157, -177, 328, 57, -313, 276, -76, -343, 134, -74, 246, -144, -98, -40, -214, -53, -91, 33, -233, -154, -20, -5, -113, 9, -113, -311, -226]
6961b26K07n1k65M53k56K67l29L39l39K6L82o0k13J10l4p1O7m7M06l04j35K58
6983A85j91J6r7j32K81l0o4Q9J64m9k70o7L20Q7l20L79M4l78l0K93k31P1j63L33
7007B40j15l36K72j27L8J35j27J20q2m9L53m62j33K20l6J36l37L23J29j48j25
7028a11j39k3M81m40R2n1J64Jq5L2k1p3K80K00j46q7P9k36L0K13j14j56N5J98
7052A43Qj1k75R2K7J48J66k52k31J41K52k59o9K04q8K81k66k10q3K71N5n3j90
7075a99J19K1M5o2M7K4j90K29j36Q7j02K04j90j7K0J74j75RJ38J11m5k18J93j54
7099f7J64k82q2K07n3L1P0q4J05J06q9k31K20o6J17P2J96j12j40K68j58k86J10
7122A6r7k3j8K35PK44j31j28j22m9J10k06l6J44K27k82J34K11k65m7MjJ68l9J72
$$ y = [-226, -19, -70, -335, 118, -138, 129, -200, 139, -200, -174, 208, 148, -65, 45, 11, -60, 7, -40, 366, 62, -73, 185, -6, 10, -87, -219, 62, 32, -32, 57, 221, 172, -98, -165, 155, 242, -78, 301, 345, -33, -63, 230, -1, 70, -93, 240, 125, -211, 61, -66, -28, 107, -20, 100, 18, -31, 322, -140, -273, -53, -89, 47, -290, 33, 162, 14, -111, -250, -273, 208, -232, -140, -191, -27, -26, -111, -79, -100, -173, 107, 307, 161, 74, 153, -83, -53, 160, 46, -110, -55, 143, 151, 140, -135, -43, -16, 132, 298, 46, -185, -44, 208, -51, -120, 84, -4, 277, 11, -199, -282, -11, 44, -9, -199, -80, -59, -14, -76, -29, -5, -195, 34, -102, -15, -117, 87, -103, -120, -100, 74, -101, -92, 46, 157, 112, -106, 87, -67, 97, -185, -267, -60, -113, -82, -12, -96, 9, 115, 26, -205, 15, -51, 66, 138, 334, 222, 82, 350, 192, -94, 16, -81, -104, -122, 113, 120, 364, 233, 105, -17, -66, 44, -162, -198, -54, 173, -109, 25, 236, -29, -76, -72, -73, 95, 56, 228]
7147B28m09L19j90k71J98j22J69N7m9P6m9J64p4p5Q5o5o2K50j41K8o3m8J47j13
7171a0Qo5K34k91J12K94O5m11q9K29j49j76J13n9K69K80m76L93l06k6L61m12O0
7194e2J24J41p2n8N8o6K53n14J88Op5k3M9K45l62K72N9l35J94l20J92j63K22J63
7218A26q3J01p0j63J3K44k55K05j39P5J06k17K8J34r7j09J96l62J69p0L84q1j14
7241B1L4k10M30j05K0j99J30j00j59J64l6J07q1l42L54o8k4J45k3jK11k91J95
7264A72k33J27L7l32J93L33k78j50J22n8O4kj1R7j1mK14k91j97J34J80K3j31P8
7288G6k03jN2k4k93N23J24j92Q0q9j22K2L44n22M1M11Qm76L01j05N2j19L22l50
7312a40J88k1j68M99m49L8p2J55N1k13n0o1L28j95R8J80l82K94j17mj94J74O1
$$ y = [228, -181, 138, -52, -323, -125, -247, -78, -21, -70, 6, -43, 121, 47, -28, 57, -8, -70, 180, 39, 67, 4, -44, 103, -10, -2, -67, 167, -124, -12, 282, 347, -64, -153, 76, -73, -249, -136, -195, 74, 354, -122, 271, -35, -61, 300, -112, -52, 72, 213, 141, 83, 141, 75, 328, -186, 2, 8, -67, -90, -41, 204, -158, 114, 173, -162, 32, -288, -96, -259, -37, 126, 43, 144, 74, -89, -76, 168, -87, 118, -21, 54, 160, -57, -29, 105, 8, -101, 95, -267, -98, -168, 216, 135, 21, 55, -155, 275, 170, 190, -9, 121, 21, -138, 26, -10, 97, 16, -326, 28, -40, -64, 81, 58, 57, 268, -23, 172, -61, 66, 103, -229, -36, 297, 19, -131, -9, -67, -3, -5, -16, 81, 70, 66, 280, -11, -208, -74, 106, 129, -2, 76, -127, -128, -76, -100, -393, 130, 254, 62, 142, 53, -69, -47, 297, -225, -184, 227, 235, -241, 60, -45, 7, -112, 210, -140, 48, 27, -141, 358, -91, -53, -125, 30, 81, -132, -182, -243, 85, -110, -12, 168, -214, 80, -37, -41, -235, -61, 0]
7335@R9M0j72j89K62p1nL50m00N9L6k27J34L7k6M12l14q8m9Q2R7j04r2P2m5J08
7361Fj04J2K01r8J0j18J96l17K79j42K4M5j27J97k30PK01o8J57j05j98J96m6K90
7385B68l32m2J92k07L06m56M26J56n39M21k01K04j17p6j04J94j63j13K1K26q5
7406b1K68k67q3J29J75l0m01L80j89o1L63n2j57j53K76O6k75n0K39j85N3K28m38
7429a85K19L1o7j69J4J50K45k90J68j59P6l9j5J43J00l04j56J82p6M2N2L18j04
7452A76k83J3J6Q6q2K00j97j59K30j15j9j5L80n17M02l60L07l05M41l14o5p3K62
7475Ij58K03O8j57Q0j04O1m2K6l23L96n0J71k74J54j13O2K11k03J13n2K8j06m7
7499d7j31N09k14M0j26k24J47k45K57N0J36l45M63k78j94L96k33L8mRK8N7j05
$$ y = [0, 99, 139, -33, -222, 40, -31, -36, 314, -86, -27, 9, -218, -84, -47, -73, 339, 25, -63, -112, -30, 67, -37, -129, -57, -102, 6, -98, -86, 115, 17, 27, -91, 105, -212, 67, -75, -51, -6, -133, 64, -166, -159, 42, -26, 131, 26, -172, 24, -22, 268, -64, -106, 86, -121, 185, -271, 155, 311, -228, 193, -8, 196, 79, 3, -101, 93, -70, -183, -162, 64, -21, 247, -20, -103, 26, 201, 171, -230, 150, -39, -100, 263, 211, 54, -99, 177, 243, -32, -82, 157, -28, 25, 253, -185, 34, 65, -2, -171, -157, -7, 238, -52, 116, -43, 33, -6, -21, 122, 222, -82, -238, -56, -132, -90, -38, 280, 176, -107, -94, -78, 8, -74, 126, -71, -230, 0, -115, -134, -149, 231, -286, 116, -244, 63, -242, 199, -115, -180, -253, 9, -149, 54, 122, -35, 45, -59, 2, -40, -14, -337, 59, 9, 180, -94, 60, -53, 9, 220, 17, 130, 78, 106, 0, -47, -178, 331, 117, 157, 31, -193, -46, -291, -34, 16, 152, -193, 270, -8, -202, 194, -39, -1, -5, 4, 32, 89, -16]
7522a6J74k40o9k44L80J15j09n2n9J95q4L6O1J92l63M5K07j93j27J85N7j42L0
7545b1L37k55J4k08K00O8n2q8P0N4k5q5J12j88N6j5p7n9K50j95K97LN5q7j71k
7571a2l9K68j3k93J17O3n2L3j31J28J84k18Q4j22K26k71j68M02m18L42L1k20l07
7594c86M54j50J34M2Jl58M17l30J75J23j02k30J15k50K38K47l47K85K22k16j71
7615h7J38j42k17j0L31J34k01K40j04l10K59L9L8l08M22O9k22q5J43k83M73l04
7637A3L09j02k44J47J61j48M3j68o3J02rj9j05K00k82O0J09K22k48pL52m14O5
7660b6J36J07k82P0Rl4l8J57j52L30l65q2N8j22Q5K34M3j46J25k27J62M2m4j94
7684a54O6J97k63K59k54J06J63p9R1p1Q1k29o4J70j78l03M52N3q6oJ1J02r7n0
$$ y = [-16, 158, -82, -151, -395, -15, 100, -9, -61, -120, 75, -9, 27, 88, 280, -83, -38, 169, -24, -151, 34, 91, -51, -21, 316, 61, 75, -133, 67, 135, 83, -5, 65, 119, 94, 9, 121, -67, -11, -26, -103, -162, 88, -107, 190, 193, 248, 161, -10, -12, -51, 217, 204, -89, 28, 91, 39, 72, -59, 69, 253, 35, 119, -3, 223, -48, -216, 186, -232, 110, 141, -79, -386, 68, -82, 52, 94, 95, -263, 154, -176, -1, 122, 20, -210, -95, -345, -107, 140, -207, 78, 300, 84, -87, 51, -91, -308, -318, 13, 147, -54, 186, 82, -228, 31, 70, 108, -200, 222, 291, 69, -16, 127, -156, 317, 13, 322, 220, -24, 123, 284, 136, 179, 11, -52, 50, 41, 22, -83, 117, -165, -105, 4, 226, -22, -29, 323, -91, -26, 110, 217, -65, 5, 14, -20, -58, 99, -53, 277, -88, -170, -112, -234, -149, 85, 128, -18, 107, -120, 42, 84, 40, -154, -88, 109, -154, 105, -149, -43, 120, 41, 132, 61, 142, -87, -151, 19, -159, -462, -10, 43, -43, -49, -38, 64, -33, -83]
7708h3J42J45k48K59k45J61m34M84j77J93k71Pmm7J36j40M90n94J68K06k21J14
7730D1%rNn0Q5J05j34m4j72L20k55J62j15j19K03J52m52K81J76k92j75K30J55
7753I8O7j53J82j93J75o8J30j01J36k71J11r1r5P5m8K1O1P0J7j65rqK67l73N9
7778a06q0K91r8q2m1q0N5O9J00l4J22j02R6k64L45j04Pl05K19p3J64o2j41J93
7802H9j01J05J66k32J9j99K43k34J83N3j48n9J49j49K13j83K00R8k64j80J57K31
7824A57k54O4j29r8K77q8n1L40j38j76j33L36q5J27k87R9m0K74j06q8l5J67j74
7847d1N6q1n2J03j04J53J34j54m1J07L9n7J23l04K58p7j64J07j98J59p7jQ3j4
7871d3Jj65J21M11k88J51j03m16J74J6M3J9R0k0j39J53J89K4k2k44MJ02On1K2
$$ y = [-83, 59, 204, -44, 215, -30, 131, -303, 181, 4, 197, -74, -67, -71, -118, 18, -122, 368, -226, -58, 148, -73, 41, 41, 32, 37, -13, 72, 177, 43, -1, -173, 147, -108, 54, -61, -180, 23, 175, -277, 4, 180, -112, -287, -57, 98, 165, 12, 194, 1, 176, 108, 238, 137, 273, 2, 113, 22, -73, 2, -46, -25, 36, 106, 123, -42, -51, -59, 208, -165, -106, -186, 105, 7, -75, -116, -196, -141, -72, 28, -6, 116, 14, 110, -154, 191, 87, 94, -211, 8, -65, 99, 37, -104, 89, -12, 93, 259, 27, 46, -153, 90, -144, 39, 92, -56, -115, 34, -115, 98, -85, 115, 213, -51, -231, -74, 157, -97, -33, -162, -260, 17, -71, -122, 218, 80, -96, -229, 107, 22, 149, -138, -39, -79, 195, 89, 1, -34, 133, -41, 15, -66, -118, -15, -119, 34, 168, 14, -27, 80, 119, 62, 185, -119, 139, 62, -102, 5, -193, -34, -111, -112, -29, -43, -42, -207, -86, 325, 37, 188, 85, -331, -157, -141, -98, -79, 11, -9, -148, 5, 194, 218, 196, -48, -44, 58, 64, 13, 35]
7896C5j3oj09J4R1j24J05p6J70k57p9M23k80O9J67K0j79L6J79k64J01r3o7J37
7920@K44l43J66o9L0q7K03k56j6J95k63K27j5J98j27l00J45J27n3L8J17l79K05
7943a3j52K82j30j56M6K81k41Qj8J44J34O4k47K95l60Q5j8J15k29K07N7j68J77
7966A63l42M9J62p9P2J01j01K8Pj00k6N9J82l39K36J79k35j11K64k79J72k3J3
7989E2K40m10K30j62J35j94K41p9r6K01J1R2l15N8J76j75J16k38N0l4K48k94R6
8012e1k01M17l95O0K98j30n3J73j80N1J67o7j00q9L8j11K41r3Q7o1p0R9n8J32
8036A04L0k18o3K88k15N6k4R5Q8l27K52p9k0J51j60K28R8k41J10k24J10R7L9k99
8060a24J16K00L6k69K5Q6m2k8k07JJ00K12k30j23J38J54m81K77K3K86p1J17j08
$$ y = [35, 22, 16, -93, -79, 12, -112, -7, -83, 87, -170, -249, 174, -106, -37, 130, 150, -29, 7, 186, -78, 23, -70, -137, 0, 244, -99, 67, -2, 28, -59, 144, -112, -128, 67, -196, 31, 16, 214, 87, -213, -68, 59, 6, 44, 161, -218, -13, -165, 117, -13, -169, -123, 158, -83, -75, -93, 51, 185, 249, 2, 297, -63, 22, 4, 119, -110, 97, 154, -14, 163, -179, -130, 32, -47, 25, 126, 25, 53, 60, -40, -66, -7, 175, -164, 72, 251, 16, -95, 169, -110, 62, 39, 52, 292, -118, 112, -50, 85, -109, 132, 53, -43, 158, 169, 261, -54, 4, 180, 5, 121, -117, -67, -101, 147, -147, -51, -252, 165, -230, -170, 128, -2, -55, 118, -62, -11, 156, 89, -11, -100, -62, -173, 68, -25, 62, 1, -69, 30, -28, 104, 134, -84, -147, 141, -74, -18, -42, 53, 141, -186, 66, -13, -33, 118, -42, 186, 284, 43, 153, -71, 39, 136, 175, -124, -8, 192, 228, -41, -16, 70, 28, 0, -207, -206, -106, 106, -124, -247, -109, 45, -436, -159, -136, 150, 79, 196, 88]
8083H8k25J73l8l9Q5j15J14K75k44k13P7p3R7K6R4PJ87k00k82J13rqQ1L4J41J71
8109C17j99j64J05R3n2j51l23M02j95J43r1M15k98L3LJ56j94N5l19L52j8j08R0
8132E2k75L61j37K1M6k33J15n5P2J45O2k19m5P1K89l08%q4k2J47m6k4RK31l67
8157a94OL19q9j01J73k28J69k2p5J01n4P2k14L61k50q9Q9K46j00Lj39J93k60j34
8181b17L58q4Q9j36J65Pj72K32j73j54
$$ y = [88, -137, 36, -2, -41, 44, -71, 43, 318, 74, -139, -62, -135, -38, -12, 82, 89, 276, 76, -206, -93, -102, -110, -29, 5, 146, 317, 118, -46, 59, 152, 100, -51, -374, 28, -167, -24, -115, 300, 2, 35, 38, 194, 0, 55, -264, 88, 70, -38, 52, -223, 138, 1, 22, 68, -165, -50, -105, -33, 112, 174, -45, -90, -19, 270, -38, -38, -122, -144, 3, -43, -67, -58, 173, -194, -188, 131, 42, -59, 114, -114, 55, 33, -42, 59, 5, 77, -137, 224, -26, -115, -26, 220, 120, 123, -16, 177, -83, -217, 141, 57, 146, 10, 175, 182, 10, 242, 69, -85]
8191h5
$$ Imaginary data points
##PAGE= N=2
##DATA TABLE= (X++(I..I)), XYDATA
0@%%%%%%%%%%%%%%%%%%%%%jOj3J6j6J6j6J6k0K6l0L2l6M2m8N5n9O5p5Q4r3J04
43E5j14J24j38J53j68J87k08K30k52K77l06L39l75M14m62N19n84O58p53Q72j023
64e55J228j521J981k806M745j8271q516K3704o787J347P764J788p04J365Q208
79A2970J617p773J4493K756r000J0443K441o317M083P65J076n166N75P368j0154
94B0177j178Q990j1424k672N206o387l250j740J166k852r145O477k992j1982O888
109d718k073r075L344l30j875l673N83M271q834k43Q806j0225J162Q485n150R38
125a8607L802J964l19k264Q575r50o142J1465R4n055R125J333j343K400K144L578
141I800m959L040P486q430L356P567o784J779L076k083o37k066M179k590n425
$$ y = [0, 0, 0, 0, 0, 0, 0, 0, 0, 0, 0, 0, 0, 0, 0, 0, 0, 0, 0, 0, 0, 0, -1, 5, -8, 8, -8, 8, -8, 8, -12, 14, -16, 16, -20, 22, -26, 29, -30, 35, -40, 44, -49, 55, -59, 65, -73, 80, -88, 99, -109, 121, -131, 146, -160, 179, -196, 218, -244, 275, -309, 349, -404, 468, -555, 673, -848, 1133, -1673, 3072, -15199, -23715, -11, -6798, -5451, 2313, 4101, 3397, 4762, 12970, 14587, 6814, 21307, 24063, 15063, 25506, 27947, 21630, 25713, 26478, 27554, 22388, 22963, 30331, 20177, 18999, 27989, 16565, 13893, 19099, 12712, 9462, 7722, 8888, 6036, -3109, 3368, 376, -11606, -4718, -6791, -15866, -12522, -12852, -14727, -18400, -17817, -13546, -22380, -22623, -13817, -24042, -22880, -14395, -19545, -18607, -14805, -12841, -13160, -15424, -6849, -7799, -13941, -2476, -2382, -7437, 1688, 3021, 1678, 4078, 6222, 9800, 4841, 7881, 15367, 6937, 10293, 17860, 11076, 12855, 15931, 13848, 13211, 11145, 15324, 12734, 7309]
156G309P767l327o699O563l116m655J664j084o54m207Q67L480q869K275L989q765
172g462J323L002m194n50m92K655k173l405P268l561n205P928l197l260M977m25
188f771l96P4K000K767n366L718M268p339M061L967m135K249J746M14o35r95N275
205D902l390k759P949l878k569N819j663j093P36M18P98l933K655L002p021M169
221D142K484n662K683Q11j792l83j117K959k923k426O559m181k833N654l260j437
237g22J981o81K9k585K602J315n519M099J930n862L318R66l127J165n9J239j996
254a907q63M887m102j893N775m141r15L336k127J00o50J154O86l931L524J217
270A50n702M516P20l790K502j00J11o51n59L362l314p40N411m363m69M415k932
$$ y = [7309, 15076, 11749, 5050, 11613, 8497, 3842, 5506, 4422, 3768, -439, 428, 3908, -4961, -2686, 1303, -7462, -6139, -3137, -7331, -7881, -8373, -5718, -7891, -11296, -4028, -7589, -12794, -4866, -8063, -11323, -6346, -6771, -7167, -7093, -5093, -2326, -7692, -3974, 294, -7045, -2984, 983, -3152, -903, 843, 1257, 622, -373, 4902, 1512, -1247, 6702, 2824, 255, 6074, 4411, 3318, 4054, 4472, 5270, 1337, 3992, 6994, -27, 4142, 6626, 964, 3647, 4458, 2666, 2283, 1166, 4125, 1202, -1224, 5335, 1154, -1679, 3975, 715, -722, 1259, 578, 607, -1978, 624, 1939, -3580, 519, 2449, -3413, -95, 871, -2256, -1091, -1150, 89, -1907, -2770, 2117, -1985, -3878, 1897, -2244, -3159, 177, -1950, -1850, -2500, -1346, -660, -4591, -1067, 150, -5552, -1036, -316, -4106, -1604, -1704, -1593, -2244, -2803, 559, -2755, -3495, 1916, -2447, -2916, 1499, -1433]
287a433L40P70M91N71k566L317P46m553M485M64l783L741j15j137K98J61J990
304C787k837N6M088m413L2M250l561L42J482r06J74j689K201j92l991M377m76
321B724m281L884p15k024J244r07R69j828l27L421m423N67L453m159O11J750k067
338b108O49l95R60O8l229L991o12l547M343r64k538K601o61J22n66R9K438l276
356b625J116L248m178Q31K754k803J075L29L47J20j867L325o96l263M267j217
372G63k382L370j054n71M12j98J791k796O58K890m150J524K106l174J455P40j325
389E9R65j994K454n93k650L921j563k314L758j505q46J050q04Q74j655O34K186
406A977l679J969K126l788K125N60j804P75o06J229k07j953L503j698j914L586
$$ y = [-1433, -1093, -323, 168, 739, -1827, 1490, 2236, -2317, 2168, 2632, -1151, 2590, 2475, 1338, 1636, 1797, 3787, 950, 1006, 5094, 681, 713, 4963, 1402, 1744, 3226, 2320, 2494, 805, 3006, 2814, -1177, 3200, 2724, -1557, 2327, 1612, -412, 832, -75, 894, -934, -1261, 2160, -2263, -1696, 1757, -2402, -1791, -41, -2108, -1459, -1854, -894, -826, -4055, -64, -676, -4223, 120, -844, -3382, -781, -1442, -1320, -1886, -1787, 651, -2625, -1509, 1739, -2439, -1608, 1146, -1657, -582, -253, 94, 214, -1653, 1672, 976, -2287, 1980, 763, -1619, 1751, 697, 126, 538, 340, 2131, -665, -7, 2883, -1267, 257, 2363, -811, 644, 1384, 59, 1024, -970, 1484, 891, -1759, 2162, 599, -1715, 2043, 538, -308, 742, -62, 812, -843, -209, 1977, -1702, 267, 2393, -1395, 730, 1290, -514, 261, -345, 884, 677, -1276, 2227, 529, -1385, 2201]
422B201j614j507K002q21J37j88J32J441k568J491J603l799K062P12k494J523
438C13l91O0K36j673K619j312j962L130k187r65K609j808L10K44k29J079k587
455b514Q69J522l237K505K20k143J847l2n26L87q61J686j275j161L242k223j79
472a873L162k174J54J156p74R45j381R45J491k684K795P26k735K238L22j576J274
489B011o62R18l28q98K699j922n12K456k441J14J022j114N54q63N93J000k332
506B95J520O08l199K176n17j821J611q95L22j44j145K043k222r71K717l074M45
523b251J665j696P91m23Q3O82j932J572L34k746K756k38j646K156p70QL03n77
541a929J564j532L05K280k295P96J759j638O54O42p43R51q82Q05P82j834K258
$$ y = [2201, 587, -920, 1082, 261, 398, 210, 342, 1783, -785, 706, 2309, -1490, 572, 1284, -1210, 313, -78, -18, 218, -1455, 1164, -148, -2110, 1020, -1167, -2132, 477, -1331, -1021, -777, -1006, 73, -2514, -1645, -123, -3360, -855, -635, -2778, -931, -963, -1489, -1102, -1963, -277, -1552, -2713, 529, -1694, -1873, 1289, -885, -731, 425, -349, 596, -785, 160, 1651, -1033, 1762, 2488, -247, 1991, 2313, 737, 2011, 1349, 2267, 1939, 1041, 3740, 1818, 1306, 3762, 1321, 1435, 2457, 1343, 1897, 1034, 1627, 2627, 295, 1815, 2423, -776, 1400, 883, -938, 673, -222, 100, -44, -1189, 854, -1368, -2339, 378, -2696, -2251, -586, -2282, -1491, -1914, -1831, -1149, -3081, -1509, -1175, -3921, -1165, -1403, -3049, -893, -1663, -1655, -1352, -1929, -365, -1897, -1592, 688, -1607, -811, 948, -690, -36, 606, -137, 814, -68, 737, 1519, -315, 1943]
558A943k94j650K390p89p14Q24q15Q44p28l7J751k269K83J934k384M12P18j363
576E6J206q05L80oj724K094n31k214K256q83j113J685j345Q44n73m30J369k102
594a836P12J758k614Q61J420j855J140j89K16N30j718K225n77j868K678p96j220
611a133J832r33O38o0m41J429j335J79J591k319J209R54j674J100j92n59L81j264
629e97J399k06j828K380j312j041K193j336m42O65o26L10p34K48J146k463J104
646a140J153k095J527l30q07J014q97P66N5j277K135j043o52J975j375n0J330
663B89j107J096n25K50J364j768J090J073k087J629L25j097J106n24L69L10r39
680H54J562q28j010K144j574k46J375j178N80p2o64Q43j523O24O70k061J406J1
$$ y = [1943, 1649, -1, 2389, 1600, 886, 1710, 895, 1739, 1011, 974, 2725, 456, 739, 2673, 289, 701, 1419, 56, 1262, 457, 837, 831, -893, 1201, 670, -1544, 712, -171, -1284, 401, -944, -100, -673, -1103, 266, -1836, -1124, 634, -1980, -1119, 301, -1554, -414, -603, -387, 143, -1575, 650, 73, -1795, 883, 87, -1133, 699, -234, 404, 344, -97, 1332, -3, 176, 1767, -552, 657, 1611, -63, 1037, 845, 286, 667, -597, 802, 596, -1232, 1148, -164, -1205, 988, -348, -790, -125, -751, -441, -1175, -927, 219, -2244, -1140, 13, -2082, -555, -885, -1692, -678, -1575, -809, -754, -2031, 104, -939, -1591, 384, -991, -1041, 289, -818, 278, -247, 3, 1367, -401, 689, 1762, -325, 1304, 1629, 532, 1638, 1114, 1483, 1793, 854, 2416, 1588, 578, 2722, 1148, 902, 2277, 1099, 1679, 1607, 943, 1786, 263, 887, 1557, -504, 902, 913]
698I13j425J104m94m75K80j008J092q31r81J719j671n07J676j731O83N57q43N35
716a407p86N61O08j870J735J99j647J601k80j12N06o50Q70k12m75J731j042n8
734g28J644j163K83P23o55J086p58J64J212j660J531K35j441K050q18o97P92m30
752A370K66Ko55J376j154m80J706j730J91O75j037J31j68l16Q42j667R14L3j398
771a099J175n58q62J186j003M15J07q68J144r56k77J726j908M82Q80j184R28L2
789f40m93J062j042P01J41j229J958n43p34J499p48j45Q00o32Q49o90l28J476
807A262j397K92J176j441Q51M2o35O49q73M34L07j316J741p11j047J629j120k65
825d22Q57r85O17l78l15J151j334L44R12j625Q78J99o97Q53p52J89O40r81J206
$$ y = [913, -512, 592, 98, -377, -97, -1105, -13, -844, -1825, -106, -1777, -2284, -608, -2339, -1656, -1099, -1942, -1407, -2193, -1632, -1024, -2894, -1159, -960, -2607, -1006, -1286, -1398, -892, -1542, -672, -884, -1359, 372, -670, -728, 916, -247, 36, 759, 104, 1190, 432, 596, 1808, 148, 1679, 1914, 473, 2523, 1705, 1008, 1800, 1370, 1636, 1638, 983, 2359, 1205, 725, 2431, 701, 892, 1567, 530, 661, 493, 177, 1019, -648, 266, 299, -1099, 76, -482, -1344, -158, -1161, -746, -639, -1507, -363, -1319, -1596, 130, -1778, -1296, -416, -1600, -672, -640, -1133, -71, -1113, -412, -271, -1500, 458, -85, -819, 680, -68, -213, 587, -45, 804, 114, -214, 1262, -135, 157, 1333, -108, 743, 785, 150, 799, -74, 360, 667, -649, 1092, 381, -666, 963, -157, -422, 435, -550, 67, -311, -626, 525, -809, -465, 447, -1178, -300, -101, -798, 55, -697, -508, 132, -849, 357]
844C57m40q95J793o72m32Q60p30P06j48l89Q77q51M11O20j475J062J93q18J186
863A215m95j88N08j117Q52p4j039J384o64n74J139r69j79L48p40Q78j197N46O47
882B81j602J192K91j259J234n27n54Q74r21Q54lr64J472o47j18J064j285M63O03
901D48q92P60l80J54J020j756J305J40j065R11l87o02J276q30K88K62q12R49p40
920D9n87J076j048m4Q58p76J72j28Q2O90j459N33J69j056J029k43p33J117l79
939f78MK87r34J059k25o71J322n09k8Q65j000O32K42n87J064p51M69Q95j339J105
959A222L13q42J252n58j17N74p95O19l3n18J196j047m5Q92j020L70J24j014M91
978A064l52K2l4r15O28K1j444J031r33m65Q36j066L00J56r46R28j254K39P87j415
$$ y = [357, -83, -978, 815, 143, -289, 571, -159, 547, 399, 10, 887, 36, 447, 1067, -408, 654, 847, 29, 1215, 720, 532, 1040, -77, 775, 701, -338, 1046, 382, -192, 947, -22, -201, 147, -593, 285, -912, -366, 281, -1321, -129, 162, -1097, 137, -390, -944, -70, -991, -137, -140, -1104, 368, -279, -397, 667, -618, -155, 448, -444, 316, -64, 90, 1110, -646, 659, 799, -266, 645, 258, -344, 932, 102, 390, 652, -160, 789, 49, -538, 538, -510, -554, 304, -472, -300, -428, -346, 344, -1115, -582, -413, -1469, -440, -683, -1416, -299, -678, -674, -387, -1321, -262, -487, -1158, 164, -345, -373, 492, -508, 124, 366, -221, 843, 92, 561, 1456, 117, 1222, 1535, 693, 1945, 1387, 1270, 1844, 1049, 1668, 1635, 1117, 2313, 1266, 1221, 2113, 1093, 1463, 1587, 573, 1064, 712, 734, 700, -215, 413, 434, -1010, 21, -912, -1377, -541, -1607, -1307, -1151, -2097, -1169, -2423, -2184, -1397, -2812]
998b812N90L50q88R05j88o2P55j056Q06J76q95J546l0n17R48o96Q77M30p81J416
1018H74o02K34R76r90Q91M91r99J173k67J5L87q32R04K75r57J363p91k74M43o90
1038A624K97q1r55R61n46n66Q63j327R5M31j200L35lq14N58n93J91J43j054P63
1058h78m73l55R79j098J81K80p65O60j33l40Q36j088N95P77r21J098o4n87R26
1077c70m46L96M04n59R22l27m52J273p93L14P65q03O50k7k24P90r11L70P23j432
1097B63P74P1n92R07n05q9J81q58Q64n29m43Q68p30j62N48j045Q13k85o95Q72
1117B28p41K81K50q02M00L2q39J093m14j88O15m88K12k55l74J152n70j28O59p69
1137f46O48J69p52P87j79RP70q65R42K37j249J137j73n73R72q54N07Q4n88J205
$$ y = [-2812, -2222, -1872, -2760, -1855, -2043, -2105, -1350, -2406, -1600, -1424, -2319, -773, -803, -1320, -372, -1068, -191, 239, -542, 874, 272, 506, 1482, 492, 1383, 1874, 875, 2048, 1781, 1796, 2183, 1351, 2255, 2530, 1573, 2936, 2145, 1871, 2314, 1624, 1921, 1840, 885, 1846, 1300, 734, 1597, 270, 365, 796, -404, -69, -72, -886, -328, -921, -730, -587, -1641, -878, -1351, -1706, -727, -1825, -1644, -1364, -2129, -1469, -1602, -1942, -1106, -2194, -1599, -822, -1743, -645, -709, -1296, -370, -816, -420, -16, -575, 347, 20, -432, 841, 48, 362, 1127, 324, 974, 947, 723, 1513, 602, 972, 1695, 263, 1037, 1108, 516, 1423, 918, 829, 1010, 152, 1016, 487, 44, 912, 182, 20, 568, -477, 336, 51, -644, 228, -513, -232, 18, -784, -384, -352, -1191, -98, -512, -700, -85, -573, -361, -616, -990, 162, -408, -536, 123, -646, 2, 171, -581, 206, 27, 36, 806, -59, 883, 1120, -129, 1008, 835, 262, 1234, 380, 887, 971, 383, 1588]
1157A588j135M5R30j398N14L32p48L38k24k71J013j174J26N38j686J318n02p18
1175a114J240j130L19K03q58P59n94n26J027o91j63R09j225R02k29m22R15p27
1193a405N24J53o96Q92r8j78R72p29K90O59o84J097n33p8Q69n94O00N74q73R26
1213A688q3k63Q32p74K25N11n50P33l62m43Q12n71l11M87q85K17j0m91O84j142
1233C04J71K74j154M32O0j054N50m25l08L82p84N14k68p30O72j091Q4O79n41L22
1253a911q0o97P68l47K16M92q37O96L09m37Q56n3J49O29q80J212K7j47Q67k25
1273F07j25J008n19N64N6k12Q91n69J89N50p17O16K90q78P32o98j94N11q36L32
1293A598j4q72P97n67m50N61r19j39k2o49O43p98j34K38o27K55K54r69P01l09
$$ y = [1588, 453, 498, 1428, 30, 544, 876, 128, 466, 242, -29, 984, -190, -64, 474, -1212, 106, -396, -1114, 126, -1004, -685, -482, -1340, -581, -1175, -1701, -674, -1365, -1528, -619, -1844, -942, -1171, -1593, -678, -1405, -881, -728, -1424, -532, -630, -808, 164, -565, -275, 384, -300, 797, 264, 186, 1055, 461, 1061, 1635, 762, 1688, 1605, 1342, 2174, 1400, 1625, 2136, 1586, 2319, 1957, 1514, 2326, 1755, 1444, 1931, 1046, 1263, 1253, 762, 1446, 304, 475, 749, -405, 27, 87, -967, -417, -842, -1150, -768, -1552, -1038, -1306, -2036, -1364, -2455, -2371, -1692, -2233, -1911, -1991, -2688, -1920, -2267, -2051, -1559, -2396, -1700, -1391, -1828, -972, -1025, -876, -247, -1127, 85, 112, -35, 832, 607, 482, 1490, 971, 1535, 1591, 1379, 2270, 1701, 1890, 2440, 1723, 2339, 2629, 1751, 2483, 1785, 1591, 2102, 1266, 1598, 1584, 712, 1509, 942, 492, 1053, 134, -5, -27, -676, -33, -831, -965, -727, -1354, -1099, -845, -1814, -1113, -1422]
1313a422n90O73p05K80K48o24Q33k50j94Q31m66L93K78n16P40k81K78R07q17Q94
1333D90L13q17Q25J20j62N14j66J57M32r80O83K6l09N64n77RL28p00O29l05o26
1354D48M69o14L72J30j000M75k78n72N86o28j29M51p11J73J48o38P31o07K04M24
1374e66q32M57k33j28O61n13L37M80q89Q88j41k73P60l56Q0K11j62N20J44m61
1394a6N25j56l1P88r11N84k54QO75o20K2L06m37M78k5o26L86j47m26J004r93L34
1416D68K00n70M22n19j6J16o09M51K52j000O30k40o8O19n23J87n7m17N42l17j08
1437e57N23q06M00J80n18J034n57l14M11k96L87J70n99O82m47j66L93l18M20K9
1457E1l32J04N2N0K39n42L26L79n86M60Om37N87o51J07K13j89L16k84p5L76l89
$$ y = [-1422, -2012, -1339, -2044, -1764, -1516, -2140, -1307, -1557, -1751, -920, -1386, -993, -715, -1231, -491, -772, -494, 413, -404, 490, 803, -14, 811, 931, 769, 1283, 1117, 1274, 1706, 726, 1409, 1435, 1126, 1690, 1113, 1122, 1450, 750, 1379, 1074, 448, 917, 303, 675, 805, -195, 280, 2, -570, 16, -612, -741, -290, -1001, -828, -680, -1318, -587, -1194, -990, -566, -1398, -941, -1174, -1302, -641, -1154, -817, -337, -1226, -338, -479, -752, 8, -348, -268, -57, -219, 301, 445, -16, 509, 353, 322, 1110, 199, 783, 529, 537, 1212, 592, 614, 920, 483, 961, 936, 310, 696, 549, 123, 1127, 134, 468, 668, 98, 520, 1, -15, 101, -508, -57, 195, -805, -175, -415, -483, 136, -387, -200, -257, -674, -132, -449, -557, -34, -840, -440, -260, -778, 256, -301, -615, -204, -500, -113, 57, -542, 140, -307, -473, -80, -398, 22, 51, -281, -177, -125, -75, 164, -378, -52, 327, -259, 201, 207, -230, 357, -294, -187, 26, -163, 153, -131, -206, 170, -219]
1479b19M16K84p69O00j23l54P88l92l62R65p63N25k33j55L96l58J51N24o39K75
1499E57J86o05N17p6k8K76n34J22k16k4O11n40k20M95q23K29J20j11K96n72K03
1520a37J54n94M14r2n46O26m19J32J54m22K42M6l48M62m20K6O21p78L00O0l09
1541h28N61k52J09L50o08P00j00n80J018o85J07M02n20N43K86o35P53l33l81R16
1561H23n99L73K72p94N78k57L8O25p39K30K17l03L20j49l58N46o64K16m8k88M42
1582D81l72r5L87n78K89k50j34L65j18l86N06m60L11k92l18P53n00n07P11l25
1602e32j0J45K1O0k69J02L81n69M11pk86N32l02p7L69m46M21M03p96Q05k01l68
1624b13M37j57j31L88l46M15j27M0L80o17J35K98m49M99l78k27M85n34J49K88
$$ y = [-219, 197, 481, -288, 312, 189, -165, 623, 231, -131, 834, 71, 596, 363, 208, 604, 246, 397, 921, 282, 557, 743, 138, 655, 579, 551, 827, 293, 415, 199, 175, 786, 246, 26, 521, -302, -73, 47, -64, 232, -340, -137, 17, -577, -163, -255, -801, -175, -594, -462, -308, -730, -488, -442, -790, -328, -748, -722, -101, -879, -579, -519, -828, -267, -519, -410, -60, -668, 32, -68, -648, 370, -315, -208, 194, -326, 217, 503, -132, 621, 288, -93, 823, 224, 597, 869, 75, 653, 396, 434, 1059, 320, 550, 767, 464, 784, 635, 277, 823, 159, 375, 327, 39, 481, 109, 14, 401, -177, 112, -138, -272, 93, -25, -411, 95, -365, -54, -346, -664, 89, -411, -918, -207, -532, -542, -397, -376, -316, -585, -483, -102, -671, -260, -267, -553, -21, -323, -400, -31, -477, -56, 347, -449, 356, 155, -213, 224, 67, -64, 324, -22, 393, 266, 306, 686, 69, 204, 502, 53, 552, 174, -53, 432, -102, 47, 335]
1644C35o21O76j73p05P24n21l97P92l22J88J63o24M90m17j00L81m17J74L36n22
1664e60O27m70o4N80o27N50j05k01N36n76P4N70p53N97K38m23N00j63J9K61k37
1685C73K26J8l91N81k57k03N75q62P14P6m99K41j49n8L16o46J49K24o35N17l69
1706e9l80O35p23L32J75m77M22m97r6M28m25J23N9k96K25k40k94L37j78L01M9
1727e79k66L13n2j69N83k52J29P7n29Q56l22J80L83l25J9L07l18O59j20j79L61
1748G56P8k44M21o24N08n9k45M52l24O8L58p61L49J00o54J001o14j64r5l1L9L8
1770C53l78L00n1n12M20n48J48K25o19N36m16K06R4n51L18O6j92L47m39K78J93
1791b22o10N72j14n19O41l05l4L73n57Q10l34k73P39k00l56O31p15M21M27l77
$$ y = [335, -286, 390, 217, -488, 236, -285, -682, 110, -212, -24, 139, -485, 5, -412, -512, -131, -548, -374, -38, -560, 67, -403, -467, 113, -514, 36, -69, -270, 266, -310, -236, 334, -419, 178, 416, -7, 493, 330, 349, 610, 373, 599, 617, 226, 807, 550, 347, 922, 60, 774, 850, 351, 592, 443, 385, 701, 55, 204, 428, -207, 310, -59, -439, 196, -527, -195, -20, -497, -75, -572, -668, -240, -665, -542, -483, -779, -554, -794, -1088, -751, -929, -628, -579, -845, -532, -584, -753, -170, -422, -293, -216, -745, 111, -211, -31, 352, 27, 46, 353, 35, 694, 574, 395, 756, 834, 590, 1011, 387, 895, 836, 591, 1043, 719, 787, 1145, 384, 733, 833, 179, 1180, 566, 402, 307, 276, 315, 353, -25, 275, 224, -288, 132, -416, -268, -43, -662, -126, -542, -336, -242, -793, -475, -409, -601, -254, -693, -415, -222, -832, -260, -374, -893, -252, -557, -591, -218, -775, 35, -299, -572, 167, -33, -389, 242, -473, -52, 375, -2]
1811bL57m61j23O89l96r6L61m04N11j7j97M4k80J51L63m18K26k94K0K17k53J90
1833A88K42n31M34n16L14j90R7J16j34m8N51q89R2P07o53L58J64m61M94l04j66
1854a35K69P5q6K40k16J34j74q4M42o70J71J78l00J81m3j76M47m09K24kn05L94
1876d5L6m77O89m43K8m1k57K42M4l56M76m41l8N06n18K08K82l45P55p47J51M02
1898A11m27L60M5l54M94n58K66K72m38K72n2j07L58j88m05M34k42M20K23o06N90
1919D68j42J02P1m56K39r1m71Q32m57j22L65j22l19M30n85M51k10K50l36k04M77
1940A70m18j1O25o47k05M56k47J44L71n59K89k96M5O10n33K91J01m07L42k28N6
1961e1L63n32M64N6m40M80m38K6K77j63K24M7l42J50p7p0M61l53k8L83k78j93
$$ y = [-2, 355, -106, -229, 460, 64, -32, 329, -75, 436, 419, 222, 266, -14, 137, 500, 82, 308, 14, 34, 251, -2, 188, 430, -101, 333, -183, 131, -59, 38, 154, 20, -28, 523, -366, -274, 433, -220, 138, 302, -159, 335, 31, -135, 134, 209, 123, 363, 147, 281, 107, 23, 465, -205, -34, 144, -156, 25, -18, -194, 253, -156, 68, 66, -439, -45, -9, -486, 203, -240, -212, -253, -510, -268, -224, -580, -104, -545, -583, -77, -595, -387, -105, -450, 305, -442, -291, 111, -316, 44, 89, -265, 229, -329, -63, 209, -229, 43, -9, -116, 242, 54, -351, 83, -159, 261, 484, -122, 468, 326, 428, 499, 43, 282, 191, -280, 552, 95, -27, 338, 216, -103, 327, -258, 193, -17, 233, -103, -307, 170, -248, -259, 366, -281, -486, -30, -277, -133, 238, -321, -32, -328, -283, 327, -206, 85, 186, -221, 121, -107, -51, 312, -220, 244, 300, -140, 340, -98, -72, 205, 42, 266, 313, -29, 121, 44, -26, 435, 82, 54, 437, 159, -34]
1983c4O4J00R4l09O4Q6l97L38o8j01K80n73JK62j93N37l22j01J56m52L61nj83
2006c95P8Q8k71N33m05N41J22o70M13P5k24Q6l7K12N7j54K3J91k7J20k83K56J61
2029D90k56J63q6k0L69Ok05P2o17N58L9l95M35j31L0j29k25L03j16p50Q62m13
2051a6k3J18j50K49n00j24L71j51k72K05k01K81j79j30L06l22q3N66o22N2N6k52
2073h21P29l66n5K1p7J55J54m8L04k33J3L50m45K04J16j97N88k19k49L83k6K52
2095E33k27k02M99k66J05N6l4n5N1j17K02l29O5L42k07j30J86m54O38l00m14K12
2117A54j62J00J73l41J42k91L49m6p30L92j94L6L06l18j83K01k92L5Q3l6N01l86
2139e07j02L20j33RK88o02J024m97j67M30l67L59J72l38q9J46P5O07m51J93p7
$$ y = [-34, 30, 130, 224, -85, -21, 65, -332, 6, -62, -163, 117, -456, -455, -193, -386, 151, -171, -272, -116, -568, -207, -212, -395, -317, -229, -500, 33, -372, 169, 291, -379, 34, 109, -115, -29, -66, 146, 203, 49, 72, 263, 236, 356, 73, 329, 490, 234, 397, 311, 291, 660, 666, 461, 533, -84, 474, 513, 118, 553, 422, 452, 323, 98, 401, 285, -465, 397, -16, -39, 79, -71, 178, -322, -446, -75, -226, -498, -293, -494, -213, -392, -522, -216, -538, -621, -55, -677, -625, -569, -821, -92, -458, -513, -492, -569, -414, -260, -308, -4, -237, -224, 126, -319, -115, 1, -196, 392, 173, -76, 307, 281, 533, 306, 104, 603, 337, 442, 498, 464, 409, 460, 343, 545, 216, 281, 623, 416, 286, 472, 18, 656, 356, -58, 154, -8, 92, 265, -76, 66, -225, 124, 78, -652, -260, -454, -418, -112, -430, -613, -412, -704, -669, -586, -622, -121, -507, -609, -289, -422, -413, -125, -727, 297, -200, -367, 63, -304, 55, 227, -111, -200, -54, 21, 628, 177, 370, 293]
2160B93K1J67j50J20K5j6k1J87l79K28k78N6L01k10j62K88q10O44j65j26l7J10
2182H6n2M5l23Oj25j26L59q2k39L86m69J35L0o5R0j57L5K38o34L59L86k44R4l5
2206c02O1J23n31R20k76J07n5j03J34M09j90L20l8k21L85j91N4J32k27J19j51
2227D79J18L7k25K04J2m65N58j82n26N06k15r2K7j66k15K12j72L07l56j38L24
2248C2m03P2k7l32K86M5q7k81L20m2k32P8K99k69k99L97OO4M8j11L07p2JN00o57
2273c57K43N2P2L83k41j15K60k49J66J51j85K79l93J70M33l28K23J15j23J41k02
2294D95n03Q17m75j2R9l59N42m49Q2L8j23k67L22r9Q5l42J49M56n15O5j8k35L28
2317H1k37l8K56k46m0K06k01J27Rl82L17k14M1L70l35L98m89O7N28l51r4M68n37
$$ y = [293, 314, 481, 331, 451, 476, 460, 439, 626, 247, 475, 197, 253, 554, 344, 182, 470, -340, 304, 139, 13, -24, 86, 34, 79, -244, -238, -363, -489, -130, -212, -451, -65, -534, -399, -369, -434, -344, -501, -466, -228, -862, -503, -117, -361, -267, -302, -241, -118, -649, 271, -5, 102, 47, -56, 78, 487, 297, 617, 579, 358, 743, 552, 606, 738, 511, 630, 479, 597, 634, 409, 613, 625, 160, 718, 536, 10, 516, 301, 209, 236, 70, -145, 67, -105, 202, -154, -292, 32, -371, -299, -326, -658, -372, -327, -414, -695, -375, -417, -649, -571, -272, -541, -840, -443, -437, -373, -325, -436, -129, -201, -200, 300, -357, -114, -62, 10, 393, 152, 37, 297, 48, 214, 365, 180, 459, 66, 236, 669, 341, 564, 679, 556, 697, 495, -8, 809, 334, 322, 421, 62, 604, 155, 237, 275, 152, -115, 207, 108, 193, -149, 0, 456, -59, 6, -12, -247, 81, -156, -194, 62, -184, -224, -18, -219, -92, -83, -465, -148, -362, -321, 49, -286, 112, -377, -310, 218, -133, -227, 241, -296]
2340b96K31N4j57J4O3j13L1J48N2m7j53K73k71j55M10q9j0Pj43J74j77j56L20
2363A0l89L12K29l49L31j81R4j2J06Q3k1k76K06n3k7L44l32K03k76l5N02m68j06
2386a05L29k48q4L24l94K69j37k63M60j40l7J81k51R9J12k11R0q5K19O7m87N68
2408B76n19J55K39k37j4L65k79L9k37q6M12j38n5P5j19K04k03k0J10L0L3j79q7
2431b35n3l8m5L71l85M97j47j38K7J32l74L90k3j64P8k17L24k74P9J18l6p6K12
2454B3l02K64K46l23J90r4p8K19k19J26L80n08L56j15k5O7j00O2L40l24J70l24
2476C1j95N60l3J1j74j65M27k52P3L13o19J11M08n17J86j18n2N28p98L71j18j94
2498b16P0r0m1K48l26K34j25p2K08n09K23J64j69j9k48Q9J78j09l1J77j08J81
$$ y = [-296, -65, -11, -168, -154, -91, -204, -173, -25, 27, -20, -173, 100, -171, -326, 84, -5, -15, -8, -151, 23, -154, -310, 10, -379, -67, 162, -187, 144, -37, 57, 45, 151, 234, 213, -63, 143, 90, 63, 407, 75, 278, 2, -33, 469, 1, -105, 224, -24, -108, 216, -178, 91, -46, -309, 151, 11, -26, 155, -96, 3, 115, -96, -6, -91, 128, 195, -292, 276, -243, -88, 151, -86, -100, 265, -14, 25, -212, -298, 114, -24, -79, -4, -123, 81, -122, -142, -32, -2, 31, -148, -235, -288, -326, -371, 0, -385, 112, -35, -173, -146, -14, -388, 2, -21, -185, -107, -324, 0, -274, -195, -77, -113, -189, 23, -279, -15, 231, -92, 98, 4, -74, 145, -74, 52, 432, -76, 280, 165, 140, 207, 107, 169, 509, 185, 355, 31, -164, 396, 363, 374, 200, 35, 462, 210, 283, 596, -23, 88, 496, -21, 165, 47, -5, 523, -275, 96, -22, -216, -146, -236, -277, -29, -355, -121, -246, -318, -110, -619, -396, -232, -401, -420, -668, -579, -401, -510, -541, -364, -472, -291]
2520b91J74k38J10j07j4O21l28J96k5k35O9K5J06L50j84J6P5j24l5K99k74O4L38
2543E88j50Pj71J76j51j92M09k79o6M73o18L48j54m5Q5k24n3K85o60L65J66n3
2565H6j16ml74M72m21m9Qp8L23m30L73M9k60O39l66k35K99l5L1K42j46l2p7j49
2589b50M18m10L14J75n20M08l8qQ2j74J86J52k24J86j17m9J81j96P9o0m7Q7l2
2612A43k19K50k99P2J70k73K69P1m02R8m2r8L81m05K56k53k1J04j66N0L75k13
2634a52n4L15l75j6J42J56k6L7l78M40j50Q8P1k4R6m95M36J51j89K95j97j31J57
2657A97j18k6L00p8P3j51o6K9j22J6J77P4k87l2j8K32l96K06J79l38J23k0J76
2680A30o2n76O55k50O8K96m44j96O05l24l5K9k3K71Q8n04L26k46J77K2l20M25
$$ y = [-291, -117, -355, -245, -352, -366, 255, -73, 123, 98, -137, -68, -43, 63, 413, 229, 245, 320, 196, 161, 460, 186, 250, 588, 438, 445, 274, 450, 299, 107, 516, 237, 171, 644, 26, 374, 220, 175, 260, 36, -17, 268, -392, -27, 139, 86, -30, -34, -408, 64, -357, -406, -398, -476, -153, -583, -210, -161, -421, 218, -148, -383, -84, -119, -88, 154, 8, -24, -101, -250, 168, -242, 72, 247, -273, 135, 97, 89, 171, -3, 183, 335, 111, 297, 180, 131, 312, 116, 195, 135, 88, 175, 143, -76, 174, -125, -53, 117, -156, 113, 184, -218, -120, -162, -260, 121, -284, -28, -281, -302, -198, -364, -314, 61, -152, -206, 109, -266, -282, -140, 16, -10, 27, -351, 89, -61, 27, 98, 74, 170, -325, 111, 262, 73, 368, 171, 40, 197, 79, 53, 353, 275, 348, 197, 131, 160, 38, 54, 231, 305, 18, -14, -32, 200, -196, 10, 189, -149, -26, -46, 130, 68, -508, 147, -103, -35, 261, -183, -379, 226, -98, -133, -104, -127, 144, 232, -272, 54, -192, -15, 7, -313, 112]
2702A12j18j33J89q9q1m3k2J38L2k30J12MKM03n30K57p7M2l5l7q0L85m37J94j27
2727a69J48L6K5k35M37m36K25p2n1o0J0J20k28M08j41pM5J95j55N5K63l53o2j62
2751a64K20J81p0m5L58k28j96L04l90M30j80J68%k72Q1k0l52K07k07J84L16j62
2773A63k24J57k23K2N7k34K29L5L08l56q5K3r4r4Q1k7k4K47j06o5o9K5K26j47
2797a75r0j6L86l28j01k2M88m21J04K34j44J50m2N7j38K07j59J46j50J18n4j19
2819f9M39m17K02M5J21l62L45l14J15J25O9l50K49K1j04J3j50N9Q9K93j76q7K0
2842A76n25K98J49j08K97n57Q7J31j12K28K7j33P5m9J6j8o4K26m33K82J41j74
2864d0O9M5k42Q8LJ35k84o5L40Mk24L00o2k52K6R2J65J30m13J67J36K0m1k26M1
$$ y = [112, -6, -139, 50, -39, -120, -163, -185, -47, -15, -245, -133, -129, -127, 276, -254, 3, -74, -32, -67, -104, -184, 201, -236, -42, -169, -21, 15, 40, -195, 242, -194, 31, -41, -92, -152, -142, -22, -250, 158, 17, 10, 55, 250, 95, 150, 413, 60, -2, -164, 56, 237, 167, 122, 480, 252, 56, 360, -30, 400, 220, 388, 388, 116, 197, 177, -175, 32, -175, 9, 325, 163, -61, 96, -127, -105, -48, -282, -53, -18, 290, -66, -151, -128, -222, -316, -235, -262, -286, -39, -145, -210, -279, -254, -28, -175, -265, -281, 105, -223, -324, -346, 142, -279, -175, 59, -85, 65, 23, 80, -58, 149, -10, 136, -14, 104, 50, -69, 370, -47, 155, 200, 321, -41, 304, -10, 105, 230, 299, -51, 198, 219, 115, 128, -22, 37, 126, 419, 243, 156, 176, -349, -51, 98, -10, 287, -270, -183, -52, -164, 64, 91, -42, 33, -16, 0, -18, -82, 144, -289, -7, 134, -40, 29, 74, -168, -80, -77, 58, -226, -291, 49, 53, -171, 129, 67, -185, -159, -67, 98, 228, -185, -18, 118, 138, 97, -129, -88]
2889h8M56k62J70j50k47J99J17k1O7m18M36m15L65J2l10j09L09k66J01jq3K12
2911G4k98K89O6n77M73k25j74K66l1J32O6m92N03J7kj06j10K22j32j58L92j14
2933H1l53K19L74j60m6j09J92K51o0J03k96j82M29m89J20Q5k09L41k19K1j02J51
2955A42j7j10l37M35j19k3J74l68K36j0l08L80k96L47M4m00K20k29P6J38k20j01
2977c46L92l35p1L55k56J47j91L82r0j54K31j06j74Q1o3K79n8m0K25J14n61L22
2999H3o1n2L62o18L65rk45K37J96k12J64j75J49j7l48M46l15K59J04k92P4l3j68
3022a06P8n0k00N43j30K54k41P1P2j06l08L25k84j19L09l29L24Q5l00M02l24K1
3044a3k38K34J63m22RM94k94K32j58j63J70J56k52K6O9j35J35K43m68J54j05J70
$$ y = [-88, 368, 106, 276, 126, -121, 78, 195, 174, 241, -177, 259, -156, 209, 221, -89, -198, 111, -155, -54, -55, -138, 74, -224, 65, 131, -446, 27, -198, -372, -106, -137, -5, 61, -431, 72, 89, 87, -19, -129, 93, -39, -197, 195, 81, -272, -53, 321, 161, 115, 6, 198, 449, 389, 492, 196, 14, 443, -46, 74, 159, -50, 291, 72, 93, -9, 142, 125, 15, -322, 113, -6, -29, 145, -223, 13, 3, -305, 75, -221, 126, 170, -230, -10, -239, -163, -25, -245, -346, 46, -289, -360, -5, -261, -114, -305, 77, -13, -167, 64, -42, -216, -135, -198, 81, 23, -17, 208, 322, -239, 83, 22, -30, 332, -286, 79, 70, -175, 62, 258, 46, 210, 35, 184, 167, -181, 265, -50, 209, 313, 21, 95, 62, -106, -28, -78, -278, 265, 135, 389, 148, 219, 291, 185, -123, 202, -82, -201, 108, -221, 103, 188, -112, 290, -34, -13, -251, -17, 146, -276, -267, 227, -67, 165, 7, -156, 14, 170, -82, -56, 13, -122, 13, 256, -212, -58, -163, 7]
3066Gl12K03R0k89J89r0m03M44j32J42K15n69K38O3j11L45k59J48l6n9N6N4j78
3089b44K57k85OM92j25J22J54k97J25l43L16K05q7J53k49k39M00k96m7L85l33
3110G0K77j25k6ML50m63o7K43K8j45n2K95j42m65K04k18L10q0o2k5j57J21o9K1
3134a73p2L56k42J0k44J33J83j66O7j2k72L90j72J00j65L6J49J8o0om8K05J43
3157A58m84M24k02M00j62k61J33L34j01J89q7j74r1J94R4o6j23o1J39M6j79K01
3179C21j80o0j14J00o4J39n2k12O4O4J0k26J45j55K14J0J5K23l94J24P2k19P6
3202i9k49L32N2j73o2K94j37j84L28j48P0k57J13J89k85L75j80Q2K84l64J05j03
3224a7J79k09L85rk76j0M9j70J6K42J07l13M01m38l6J77j94L58k44j15K83k60
$$ y = [7, -305, -102, -12, -301, -112, -202, -605, -161, -293, -151, 64, -505, -267, -204, -315, 30, -229, -81, -117, -176, -120, -66, -244, 13, -272, -266, 226, 101, 223, 377, 80, 205, -138, 178, 383, 296, 449, 200, -39, 361, 65, 18, 403, 70, 347, 222, 196, 200, 550, 87, 20, 263, 291, 146, 94, 389, 247, -218, -14, -232, 78, -2, -64, -89, -246, -125, -194, -173, -245, 111, -131, -121, -365, -232, -49, -215, -148, -160, -432, -42, -214, -114, -279, -243, -94, -76, -136, -142, -190, 15, 158, -326, 98, -104, 296, 134, -127, 6, 340, 239, 428, 341, 167, 76, 270, 364, 298, 175, 114, 253, 299, 120, 321, 141, 81, -33, 67, 3, 142, 90, -122, -58, 6, 16, -210, -65, -220, -6, 4, 19, 242, -152, -28, 44, -175, -99, -348, -16, 36, -137, -199, 95, -42, -226, 102, -46, 24, -233, -120, 69, -216, 159, -21, 61, 345, -19, 86, -17, 162, -47, 338, 329, 53, 43, 92, -78, -62, 180, 287, -26, 375, -63, -99, 78, -116, 242, -2, -117, 166, -94]
3246i4o8K54J6O8k39k41K94j82LR1J25o1p8K0Lk6P7j94L51q7n9O0K19j35R0n3
3272A54k16j24L40j85J42j57N3P0J82k62M36l96K10j63O4P5j47j9J14j71k7J56
3294A29k08K88j28J49p2j89L9P4QK38l61J44l2j88K55p5p9K33j44q5J06l03K34
3317C3n5k22K94o3r9N3J54l81P9Q0O0j94K43j6Q8p0M7j45K26j69q8J13r6K15l02
3342b15K35J2m05J69L36k04M7L18l51K06j12l0K32k88J57K1k0K3j62P1j2j6j0
3365Bj10O5P8j30J36L22m53L18l46K60J04J57k70R3l88M91j00k01K65k78K1J32
3387A68J3j35l0k55N19l91J39N0M6QJ91l30P5p0p6K86k13j59L6L1Qpk1J09K05
3412A97k28K57j99j37MJ33J81l59J44Q7j78K69k59N2K41m20L2K62J0K36m77J44
$$ y = [-94, -162, 92, 108, 176, -63, -304, -10, -192, -189, -98, 27, -34, -112, -92, -89, -115, -38, -232, 119, 32, -27, 33, 252, 117, 207, 154, -62, -186, 154, -31, 111, -46, 7, 77, 259, -3, 433, 37, 247, 84, 148, 223, 76, 57, 171, 0, -27, 129, -79, 209, 81, 230, 158, -31, 8, 82, 90, 328, -33, 111, 79, -109, 146, 71, -8, 225, 81, -4, 102, -201, 33, -22, -244, 50, -13, -112, -59, 95, -286, -207, -127, -67, -261, -18, -34, 54, -16, 31, -114, 112, -57, -145, -32, -128, 87, -215, 20, 32, -373, -204, 132, -72, -25, 293, -58, 148, 36, 6, 238, -50, 107, 128, 108, 131, -31, 40, 28, 12, 2, -108, -43, 35, -95, 41, 363, -90, 228, -118, 142, 246, 403, 133, 226, -162, 329, 229, 28, 293, 15, 36, 168, 181, 46, 16, -239, 280, -111, 28, 78, 124, 132, 323, -7, 68, -2, -78, 208, -5, -164, -128, -97, -89, -96, -117, -8, 197, -31, 226, 27, -110, -106, 27, 208, -151, -7, 80, -98, 171, -88, -36, 205, -215, -183, 79, 89, 325, -152, -8]
3434hJ91j97j18J48Nk00K23k27L34kk84K76k96N3M8n8K95j03l87J94M2K74k46
3457d3J37J0m08L09N1o8O7r4k1J10q4k3r0J35q2r0J8O37k35k23J44k84K79L9k53
3482f2P3M19l79J66l53L6M52p43M30J32k69K18m9j27K6p2n0Q2J32J3k13J77j68
3505a29p0J94p5L6J41j83ko1J50j84O7k73N99n44L81k38pL30k53Q6K39j22j10
3528b8k58p4M52q9J01J74l90j88L53j0J0j0J55R4j44k51q4J96J42k43K22j65J1
3551b4J58J50k49N7K14j21O3l93K01N2k69K99k41R0J0Kj26K82j44J44OL4o0k19
3575h4J1P1k30J94K69o46O19k85O9o1k35L61L2o1k00K87j44O0k2n3JJ6N0j78J89
3600C0J08k17m9J65o7P2j60J41O3k30R6n5L1n1L9j12J09L57L6j0n69L22K82k48
$$ y = [-8, 183, -14, -132, 16, 21, -179, 44, -183, 151, 149, -135, 141, -155, -102, -54, -112, 183, 80, -307, -113, -71, 203, -43, 94, 104, -304, 5, 56, -12, 55, -39, -60, 50, -34, -57, -147, -12, -94, -184, -166, 471, 236, 13, 157, -127, 152, 191, -62, 11, 430, 51, 217, -136, -100, 352, -391, 39, 171, -98, 120, 71, -56, -30, -102, -152, -70, 62, 75, -138, 39, -129, -199, -5, -80, -44, 97, -86, -88, -149, 1, -183, -116, -389, 210, -334, 47, -191, -198, 132, -121, -35, 204, 82, -28, -286, -360, 92, 3, 104, 278, -112, -300, 53, 43, 53, 43, 198, 292, 148, -103, -187, 9, 151, -92, 130, -35, -24, 134, 284, 35, 92, 306, 185, 248, -145, 56, 108, -161, 138, -103, -13, -3, -1, -127, 155, 11, 155, 161, 195, 135, -84, -73, -2, -232, -38, 231, -415, 204, -81, -12, -73, -308, 53, 85, 24, -176, 111, -33, 27, 5, -48, -47, -31, 19, -159, 30, 138, -79, -128, 37, -30, 42, -118, 23, 86, -144, -48, -103, -72, -123, -84, -196, -87, 270, 306, 296, -273, 49, 331, 83]
3624H3j85J57k48J03k89J75J39J65m1k48N58l90j03j7j00Q1L40k44K38k3p0j81
3646a00J87n0mqQ4j35N7K28k45J64ok17J60J5l99O9K88m4K96l37N2M8k77M58j67
3671A17l65K26L26l52J82k16j53J76K19k04k0L5K19l18N16m61J30J37p8J09j24
3692A01k27K7K85m41K94j71O3J05J70j19m7k36j3J79k40J13j2rJ08L0q0m6K32
3715F6r7l01M90j48o3j4L85l8r5m5j12J61k46J46j40J23J27q7J41j8N3l9l24M59
3739C84k71o7K84k66M6j05M5n4L82m29K17j04j10L67m20n4L61q0mk20j84K88j44
3762a38Q8k42L04p2k5k02K54k35L20k34n3K53k59L22r2m0P2K0k4P9l30L00j77
3785a11J72n2J92l44J63lQ5j8M5j03J47k92K88n4J94m61K47j59L25j69m6L68m19
$$ y = [83, -102, 55, -193, -90, -379, -204, -65, 100, 59, -189, 369, -21, -124, -141, -241, -160, 180, -64, 174, 151, 81, -100, 87, 37, 33, 25, 109, -26, 31, 259, 14, 178, 172, -45, 115, 130, -269, -200, 88, 44, 340, 3, 55, 103, -174, 284, 117, -248, -22, 304, -48, 134, -82, -235, -59, 160, -44, -64, -29, 190, -128, 388, -73, 57, 194, 116, 225, 101, -126, -99, 186, -255, 39, -132, -69, 36, 206, 87, 40, -196, -209, -30, -270, -157, -169, -178, -70, -40, -120, -166, 66, -31, -332, 158, 10, -53, -67, 318, 280, 185, 140, 28, 189, -57, 89, -51, 72, 199, 112, 253, 235, 288, 249, -75, 384, 113, 46, 330, 64, 110, 5, 50, -4, 378, -51, 166, 62, -48, 319, -101, -155, 206, 126, 122, -98, -282, 6, -138, -50, -292, 12, -60, -85, -287, -33, -268, 52, -182, -235, 18, -241, 81, -11, -51, 21, 41, 17, 96, -234, 66, -111, 61, 9, 201, -143, 20, 17, 102, 84, 129, 26, 173, -119, 169, 115, 309, -152, 95, -64, 261, 92, 46, 414, -5]
3808eLj31L33N8k78J00l4M7K3j6l15M52j73j01J17j36j29O7R0j32J27r8L21j41
$$ y = [-5, -2, -133, 200, 258, -20, 80, 46, 93, 116, 100, -215, 237, 64, -37, 80, -56, -185, -118, -28, -160, -33, -131, 190, 49]
$$ [...]
8191a12
##END NTUPLES=NMR FID
##END=
