##TITLE=1H_SA_NO2CN1
 DMSO-d6, 8 sc, 
 29.07.2021
##JCAMPDX= 6.0         $$ Bruker NMR JCAMP-DX V2.0
##DATA TYPE= NMR FID
##DATA CLASS= NTUPLES
##ORIGIN= UXNMR, Bruker Analytische Messtechnik GmbH
##OWNER= root
$$ XWIN-NMR		Version 3.5
$$ Thu Jul 29 09:28:56 2021 Russian Standard Time (UT+4h)  she@DPX200
##.OBSERVE FREQUENCY= 200.131506
##.OBSERVE NUCLEUS= ^1H
##.DELAY= (6, 6)
##.ACQUISITION MODE= SIMULTANEOUS
##.ACQUISITION SCHEME= undefined
##.AVERAGES= 8
##.DIGITISER RES= 18
##SPECTROMETER/DATA SYSTEM= spect
##.PULSE SEQUENCE= zg30
##.SOLVENT NAME= DMSO
##.SHIFT REFERENCE= (INTERNAL, DMSO, 0, 15.7039)
##AUDIT TRAIL= $$ (NUMBER, WHEN, WHO, WHERE, WHAT)
$$ ##TITLE= Audit trail, XWIN-NMR		Version 3.5
$$ ##JCAMPDX= 5.01
$$ ##ORIGIN= Bruker BioSpin GmbH
$$ ##OWNER= she
$$ F:/spectra/data/she/nmr/H-F/1/audita.txt
$$ ##AUDIT TRAIL=  $$ (NUMBER, WHEN, WHO, WHERE, WHAT)
(   1,<2021-07-29 09:27:49.25 +0400>,<she>,<DPX200>,
      <created by zg, POWCHK disabled, PULCHK disabled
       configuration hash MD5:
       00 E9 B6 7A A2 85 ED C7 34 08 36 98 17 FE 4E 26
       data hash MD5: 16K
       F3 0C 09 CC 66 FC FB 26 5C 40 7F 44 16 25 12 EE>)
$$ ##END=
$$ 
$$ hash MD5
$$ F0 8B D9 48 E1 05 07 75 D3 02 C2 C5 30 D3 88 D6
##$RELAX= 
##$RELAX= 
##$RELAX= 
##$RELAX= 
##$RELAX= 
##$RELAX= 
$$ Bruker specific parameters
$$ --------------------------
##$DU= <F:/spectra>
##$EXPNO= 1
##$NAME= <H-F>
##$PROCNO= 1
##$TYPE= <nmr>
##$USER= <she>
##$AMP= (0..31)
100 100 100 100 100 100 100 100 100 100 100 100 100 100 100 100 100 100 
100 100 100 100 100 100 100 100 100 100 100 100 100 100 
##$AQSEQ= 0
##$AQ_mod= 1
##$AUNM= <au_zg>
##$AUTOPOS= <>
##$BF1= 200.13
##$BF2= 200.13
##$BF3= 200.13
##$BF4= 200.13
##$BF5= 200.13
##$BF6= 200.13
##$BF7= 200.13
##$BF8= 200.13
##$BYTORDA= 1
##$CFDGTYP= 0
##$CFRGTYP= 5
##$CHEMSTR= <none>
##$CNST= (0..31)
1 1 145 1 1 1 1 1 1 1 1 1 1 1 1 1 1 1 1 1 1 1 1 1 1 1 1 1 1 1 1 1 
##$CPDPRG= <>
##$CPDPRG1= <>
##$CPDPRG2= <>
##$CPDPRG3= <>
##$CPDPRG4= <mlev>
##$CPDPRG5= <mlev>
##$CPDPRG6= <mlev>
##$CPDPRG7= <mlev>
##$CPDPRG8= <mlev>
##$CPDPRGB= <>
##$CPDPRGT= <>
##$D= (0..31)
0 1.2 0 0 0 0 0 0 0 0.06 0 0.03 0 0 0 0 0.0002 0 0 0 0 0 0 0 0 0 0 0 0 
0 0 0 
##$DATE= 1627536468
##$DBL= (0..7)
120 120 120 120 120 120 120 120 
##$DBP= (0..7)
150 150 150 150 150 150 150 150 
##$DBP07= 0
##$DBPNAM0= <>
##$DBPNAM1= <>
##$DBPNAM2= <>
##$DBPNAM3= <>
##$DBPNAM4= <>
##$DBPNAM5= <>
##$DBPNAM6= <>
##$DBPNAM7= <>
##$DBPOAL= (0..7)
0.5 0.5 0.5 0.5 0.5 0.5 0.5 0.5 
##$DBPOFFS= (0..7)
0 0 0 0 0 0 0 0 
##$DE= 6
##$DECBNUC= <off>
##$DECIM= 32
##$DECNUC= <off>
##$DECSTAT= 4
##$DIGMOD= 1
##$DIGTYP= 9
##$DL= (0..7)
0 120 120 120 120 120 120 120 
##$DP= (0..7)
150 150 150 150 150 150 150 150 
##$DP07= 0
##$DPNAME0= <>
##$DPNAME1= <>
##$DPNAME2= <>
##$DPNAME3= <>
##$DPNAME4= <>
##$DPNAME5= <>
##$DPNAME6= <>
##$DPNAME7= <>
##$DPOAL= (0..7)
0.5 0.5 0.5 0.5 0.5 0.5 0.5 0.5 
##$DPOFFS= (0..7)
0 0 0 0 0 0 0 0 
##$DQDMODE= 0
##$DR= 18
##$DS= 0
##$DSLIST= <SSSSSSSSSSSSSSS>
$$ [...]
##$SUBNAM2= <"">
##$SUBNAM3= <"">
##$SUBNAM4= <"">
##$SUBNAM5= <"">
##$SUBNAM6= <"">
##$SUBNAM7= <"">
##$SUBNAM8= <"">
##$SUBNAM9= <"">
##$SW= 20.0188882624521
##$SWIBOX= (0..15)
0 0 2 0 0 0 0 0 0 0 0 0 0 0 0 0 
##$SW_h= 4006.41025641026
##$TD= 16384
##$TD0= 1
##$TE= 0
##$TE2= 300
##$TE3= 300
##$TEG= 300
##$TL= (0..7)
0 120 120 120 120 120 120 120 
##$TP= (0..7)
150 150 150 150 150 150 150 150 
##$TP07= 0
##$TPNAME0= <>
##$TPNAME1= <>
##$TPNAME2= <>
##$TPNAME3= <>
##$TPNAME4= <>
##$TPNAME5= <>
##$TPNAME6= <>
##$TPNAME7= <>
##$TPOAL= (0..7)
0.5 0.5 0.5 0.5 0.5 0.5 0.5 0.5 
##$TPOFFS= (0..7)
0 0 0 0 0 0 0 0 
##$TUNHIN= 0
##$TUNHOUT= 0
##$TUNXOUT= 0
##$USERA1= <user>
##$USERA2= <user>
##$USERA3= <user>
##$USERA4= <user>
##$USERA5= <user>
##$V9= 5
##$VALIST= <valist>
##$VCLIST= <CCCCCCCCCCCCCCC>
##$VD= 0
##$VDLIST= <DDDDDDDDDDDDDDD>
##$VPLIST= <PPPPPPPPPPPPPPP>
##$VTLIST= <TTTTTTTTTTTTTTT>
##$WBST= 1024
##$WBSW= 4
##$XGAIN= (0..3)
0 0 0 0 
##$XL= 0
##$YL= 0
##$YMAX_a= 134747
##$YMIN_a= -109841
##$ZGOPTNS= <>
##$ZL1= 120
##$ZL2= 120
##$ZL3= 120
##$ZL4= 120
##$ABSF1= 10
##$ABSF2= 0
##$ABSG= 5
##$ABSL= 3
##$ALPHA= 0
##$AQORDER= 0
##$ASSFAC= 0
##$ASSFACI= 0
##$ASSFACX= 0
##$ASSWID= 0
##$AUNMP= <proc_1d>
##$AZFE= 0.1
##$AZFW= 0.1
##$BCFW= 1
##$BC_mod= 2
##$BYTORDP= 1
##$COROFFS= 0
##$CY= 11.3945322036743
##$DATMOD= 1
##$DC= 2
##$DFILT= <>
##$DTYPP= 0
##$F1P= 2.36226072786647
##$F2P= -0.459571619588291
##$FCOR= 0.5
##$FTSIZE= 0
##$FT_mod= 4
##$GAMMA= 1
##$GB= 0.15
##$INTBC= 1
##$INTSCL= 1
##$ISEN= 128
##$LB= 0.24
##$LEV0= 0
##$LPBIN= 0
##$MAXI= 10000
##$MC2= 0
##$MEAN= 0
##$ME_mod= 0
##$MI= 1.114404
##$NCOEF= 0
##$NC_proc= 0
##$NLEV= 6
##$NOISF1= 3.799351
##$NOISF2= 2.8
##$NSP= 1
##$NTH_PI= 0
##$NZP= 0
##$OFFSET= 15.70392
##$PC= 1
##$PHC0= -12997.02
##$PHC1= 9.60099
##$PH_mod= 1
##$PKNL= yes
##$PPARMOD= 0
##$PSCAL= 0
##$PSIGN= 0
##$REVERSE= no
##$SF= 200.130013532006
##$SI= 16384
##$SIGF1= 3
##$SIGF2= 2
##$SINO= 400
##$SIOLD= 16384
##$SREGLST= <1H.CDCl3>
##$SSB= 0
##$STSI= 0
##$STSR= 0
##$SW_p= 3612.71676300578
##$SYMM= 0
##$S_DEV= 0
##$TDeff= 0
##$TDoff= 0
##$TI= <>
##$TILT= no
##$TM1= 0
##$TM2= 0
##$TOPLEV= 0
##$USERP1= <user>
##$USERP2= <user>
##$USERP3= <user>
##$USERP4= <user>
##$USERP5= <user>
##$WDW= 1
##$XDIM= 8192
##$YMAX_p= 0
##$YMIN_p= 0
$$ End of Bruker specific parameters
$$ ---------------------------------
##NTUPLES= NMR FID
##VAR_NAME=  TIME,          FID/REAL,        FID/IMAG
##SYMBOL=    X,             R,               I
##VAR_TYPE=  INDEPENDENT,   DEPENDENT,       DEPENDENT
##VAR_FORM=  AFFN,          ASDF,            ASDF
##VAR_DIM=   8192,          8192,            8192
##UNITS=     SECONDS,       ARBITRARY UNITS, ARBITRARY UNITS
##FACTOR=    0.0002496,     1,               1
##FIRST=     0,             0,               0
##LAST=      2.0444736,     0,               0
##MIN=       0,             -109841,         0
##MAX=       2.0444736,     134747,          0
$$ Real data points
##PAGE= N=1
##DATA TABLE= (X++(R..R)), XYDATA
$$ plain form
0 0 0 0 0 0 0 0 0 0 0 0 0 0 0 0 -8 8 -8 8 -8 13 -16 16 -23 24 -31 33 -40 48 -51 58 -69 81 -89 102 -114 129
36 129 -144 163 -179 201 -224 250 -275 306 -339 374 -413 455 -502 554 -611 671 -740 816 -903
55 -903 999 -1108 1235 -1382 1554 -1762 2016 -2334 2753 -3322 4151 -5475 7931 -14089 68477
70 68477 69563 -9423 73746 134747 104705 18245 16143 61280 80386 39010 -484 -19096 -4953
83 -4953 15626 9236 -50751 -91276 -50419 11228 -22142 -105021 -103784 -10439 23848 -49396 -101380
96 -101380 -42354 30610 14768 -44025 -43204 6851 35595 24105 1756 -9766 4467 38674
108 38674 48522 3568 -38295 -4368 58680 41947 -37558 -50174 27049 64665 2059 -53986
120 -53986 -17101 45243 38483 -10933 -21523 11801 38784 37262 18467 -1673 1627 36491 55520
$$ packed form
0@%%%%%%%%%%%%%%qJ6j6J6j6K1k9L2l9M7n5O4p3Q8r9J09j27J50j70J91k16K43
36A29k73L07l42L80m25M74n25N81o45P13p87Q68r57J056j165J282j411J556j719
55i03J902k107K343k617K936l316L778m350N087o075P473r626J3406k2020Q2566
70F8477J086p8986Q3169O1001l0042q6460k102M5137J9106m1376l9494j8612J4143
83d953K0579o390n9987m0525M0857O1647l3370q2879J237R3345L4287p3244n1984
96a01380N9026P2964j5842n8793Q21N0055K8744j1490k2349j1522J4233L4207
108C8674R848m4954m1863L3927O3048j6733p9505j2616P7223L7616o2606n6045
120e3986L6885O2344o760m9416j0590L3324K6983j522j8795k0140L300L4864J9029
$$ plain form
133 55520 13837 -35915 -11809 50022 39791 -37138 -62831 -1004 37028 -16912 -77526 -57112
145 -57112 -3789 -4465 -47285 -63423 -39852 -12840 -4440 -16207 -35259 -31122 9274 40498 14251
158 14251 -26970 -1919 64860 71845 10899 -12460 43070 85547 46961 -6905 2958 45739
170 45739 47517 10111 -13763 -7313 6605 10975 -2716 -32777 -45989 -18845 9948 -15464 -63601
183 -63601 -53420 5844 19902 -32573 -61017 -14229 32738 11316 -32244 -25003 16780 31582
195 31582 10893 -6386 -2774 13629 29022 24779 -3139 -19822 6044 38573 19148 -29844
207 -29844 -29152 23045 40180 -7915 -41946 -8266 34470 20035 -20591 -22578 10145 26870 13347
220 13347 -3590 -6346 5618 23711 25240 -1253 -22059 -1064 33066 19909 -28177 -34900 9682
$$ packed form
133E5520m1683m9752K4106O1831j0231p6929k5693O1827L8032n3940o0614K0414
145e7112N3323o76m2820j6138K3571K7012Q400j1767j9052M137M0396L1224k6247
158A4251m1221K5051O6779O985o0946k3359N5530M2477l8586n3866R863M2781
170D5739J778l7406k3874O450J3918M370j3691l0061j3212K7144K8793k5412m8137
183f3601J0181N9264J4058n2475k8444M6788M6967k1422m3560P241M1783J4802
195C1582k0689j7279L612J6403J5393m243k7918j6683K5866L2529j9425m8992
207b9844O92N2197J7135m8095l4031L3680M2736j4435m0626j987L2723J6725j3523
220A3347j6937k756J1964J8093J529k6493k0806K0995L4130j3157m8086o723M4582
$$ plain form
233 9682 29282 -12029 -48936 -26033 12164 3504 -32140 -39225 -14537 2852 -3269 -16208 -22473
246 -22473 -12999 9688 19852 -163 -20916 -926 38599 35916 -5030 -14522 26993 52883 21256
259 21256 -14480 -108 34713 31607 560 -13549 420 14972 11143 -4407 -18959 -18169 382
272 382 10502 -10787 -37083 -25103 12194 13258 -25401 -39420 -3712 24971 3376 -29214 -19022
285 -19022 14682 20361 -2228 -14623 -3584 12432 16628 7390 -7702 -9994 9435 24622 6897
298 6897 -21126 -14229 20652 26261 -9615 -28814 -351 27717 11301 -20346 -17152 10522 19310
311 19310 2380 -11828 -7451 6738 14223 8403 -7758 -14176 3659 21932 8069 -20578 -18277
324 -18277 14140 23527 -7930 -29464 -8020 19990 10003 -19269 -21546 1262 12624 1312 -12763
$$ packed form
233I682J9600m1311l6907K2903L8197q660l5644p085K4688J7389o121j2939o265
246b2473R474K2687J0164k0015k0753J9990L9525k683m0946r492M1515K5890l1627
259B1256l5736J4372L4821l106l1047j4109J3969J4552l829j5550j4552P90J8551
272C82J0120k1289k6296J1980L7297J064l8659j4019L5708K8683k1595l2590J0192
285a9022L3704N679k2589j2395J1039J6016M196r238j5092k292J9429J5187j7725
298F897k8023O897L4881N609l5876j9199K8463K8068j6416l1647L194K7674Q788
311A9310j6930j4208M377J4189P485n820j6161o418J7835J8273j3863k8647K301
324a8277L2417R387l1457k1534K1444K8010r987k9272k277K2808J1362j1312j4075
$$ plain form
337 -12763 -12675 -935 10646 8841 -7034 -15804 503 21420 13267 -14385 -16394 14031 28129
350 28129 2331 -20685 -4909 21717 16993 -8614 -15622 1416 14107 6784 -7119 -11960 -4215
363 -4215 8177 9409 -6803 -19726 -6542 15702 10517 -16551 -22177 4862 21145 1558 -21415
376 -21415 -11024 14572 15741 -5376 -13934 -1675 11877 10236 -1423 -8998 -3767 10132 14563
389 14563 -172 -14878 -5462 16786 14873 -10098 -19282 2652 20330 5160 -17720 -12987 9309
402 9309 13622 -3335 -15105 -7429 5853 8086 -1380 -11042 -9034 5008 13444 632 -15924 -8792
416 -8792 13344 16214 -6147 -17929 777 20118 9914 -11534 -10902 8361 15600 2620 -9485
429 -9485 -6426 5291 10621 3106 -8763 -10053 2725 12905 2305 -15565 -12319 8308 13959
$$ packed form
337a2763Q8J1740J1581j805j5875q770J6307K0917q153k7652k009L0425J4098
350B8129k5798k3016J5776K6626m724k5607p008J7038J2691p323j3903m841P745
363d215J2392J232j6212j2923J3184K2244n185k7068n626K7039J6283j9587k2973
376b1415J0391K5596J169k1117q558J2259J3552j641j1659p575N231J3899M431
389A4563j4735j4706R416K2248j913k4971r184K1934J7678j5170k2880M733K2296
402I309M313j6957j1770P676J3282K233r466r662K008J4042Q436j2812j6556P132
416h792K2136K870k2361j1782J8706J9341j0204k1448O32J9263P239j2980j2105
429i485L059J1717N330p515j1869j290J2778J0180j0600j7870L246K0627N651
$$ plain form
442 13959 -5610 -19544 -5374 14021 8531 -10884 -13628 2123 12441 4109 -8289 -8250 2551
455 2551 10650 6199 -5689 -9477 2605 14725 6422 -11113 -11236 7661 16058 -396 -15874 -5694
469 -5694 12797 11217 -6237 -12351 -85 10615 6167 -5790 -9043 -394 9415 8107 -4330 -10768
483 -10768 -95 13071 8318 -9325 -12518 4566 14483 1513 -14509 -8458 8330 9906 -5093
496 -5093 -13956 -5129 6154 4706 -5608 -11620 -5174 6034 7233 -3869 -11475 -2910 11398 9478
510 9478 -6441 -10737 4234 16144 6716 -7933 -5550 10124 14471 2490 -7507 -2745 8275
523 8275 9645 172 -8427 -4958 5744 8114 -2581 -12779 -6832 6927 6471 -8107 -15431 -2977
537 -2977 9479 3452 -10859 -11022 2898 9963 1456 -8938 -6254 4868 9311 2464 -6585 -4946
$$ packed form
442A3959j9569j3934J4170J9395n490j9415k744J5751J0318q332j2398L9J0801
455B551Q099m451j1888l788J2082J2120q303j7535j23J8897Q397j6454j5478J0180
469e694J8491j580j7454o114J2266J0700m448j1957l253Q649R809j308j2437o438
483a0768J0673J3166m753j7643l193J7084R917j2970j6022O051J6788J576j4999
496e093q863Q827J1283j448j0314o012O446J1208J199j1102p606Q565J4308j920
510I478j5919m296J4971J1910r428j4649K383J5674M347j1981r997M762J1020
523H275J370r473q599L469J0702K370j0695j0198N947J3759m56j4578p324J2454
537b977J2456o027j4311j63J3920P065q507j0394K684J1122M443o847r049J639
$$ plain form
551 -4946 6253 10836 2024 -8948 -5009 8472 10611 -2734 -11198 -2144 10358 7309 -6392 -9547
565 -9547 1446 9828 3721 -7067 -7401 2219 8770 3582 -6199 -6556 3535 10415 3360 -8218 -6821
580 -6821 5923 10028 -1309 -10996 -4706 7752 7226 -5389 -10752 -2740 6078 3059 -7182 -9872
594 -9872 -1776 6104 3120 -6074 -8868 528 9050 4301 -6678 -6697 5119 11697 3180 -6741 -2756
609 -2756 9164 11231 671 -6027 -422 8733 7817 -2115 -7191 -1334 6605 5517 -4763 -9291 -2142
624 -2142 6108 2668 -8173 -10616 -585 6719 502 -9552 -7758 3102 7362 -446 -8161 -4341
638 -4341 5281 7275 -245 -6250 -1744 7209 8069 -550 -6524 -597 8637 7030 -3107 -7442 845
653 845 8685 4324 -5812 -7075 2553 7286 1199 -7824 -6317 2410 6178 -240 -7372 -5094 3888
$$ packed form
551d946J1199M583q812j0972L939J3481K139j3345q464R054J2502l049j3701l155
565i547J0993Q382o107j0788l34R620O551n188r781l57J0091O880p055j1578J397
580f821J2744M105j1337r687O290J2458n26j2615n363Q012Q818l019j0241k690
594i872Q096P880k984r194k794R396Q522m749j0979j9J1816O578q517r921L985
609b756J1920K067j0560o698N605R155r16r932n076N857P939j088j0280m528P149
624b142Q250l440j0841k443J0031P304o217j0054J794J0860M260p808p715L820
638d341R622J994p520o005M506Q953Q60q619n974N927R234j607j0137m335Q287
653H45P840m361j0136j263R628M733o087r023J507Q727L768o418p132K278Q982
$$ plain form
668 3888 6419 -1204 -7945 -3617 5322 6211 -2916 -8206 -1351 7523 5553 -3556 -6055 1276 7646
683 7646 3879 -4589 -5486 2249 7823 2656 -5067 -4480 3338 7359 1064 -6460 -4559 4493 6610 -1083
699 -1083 -7395 -3004 5693 5450 -3220 -7378 -1243 5866 3548 -4574 -7001 -185 5848 2741 -5229
714 -5229 -5951 1370 6354 1719 -5985 -5270 2797 6653 368 -6644 -3261 4467 6033 -802 -6186 -1977
730 -1977 5720 5453 -1907 -5498 -437 6409 4854 -2614 -5106 1123 7035 3934 -4136 -4650 2210 7111
746 7111 1813 -5567 -4625 2650 5387 -786 -6989 -4455 2625 3696 -3066 -7965 -4058 3251 3033 -3905
762 -3905 -7399 -2095 4854 3400 -3519 -5322 1395 7202 4052 -2552 -2544 4302 8670 4213 -2300 -1025
778 -1025 5672 7980 2210 -3743 -1936 4502 5346 -1491 -6697 -3517 2558 1860 -5297 -8821 -4010 1715
$$ packed form
668C888K531p623o741M328Q939Q89r127n290O855Q874j970r109k499P331O370
683G646l767q468q97P735N574n167p723N87P818M021o295p524J901R052K117p693
699a083o312M391Q697k43q670m158O135P109k318q122k427O816O033l107p970
714e229p22P321M984m635p704P15Q067L856o285p012L383P728J566o835n384M209
730a977P697k67p360l591N061O846j555p468k492O229N912l101q070n14O860M901
746G111n298p380R42P275K737o173o203K534P080J071o762m899L907P309k18o938
762c905l494N304O949j454o919j803O717N807l150o604QO846M368m457o513J275
778a025O697K308n770n953J807O438Q44o837n206L180O075o98p157l524M811N725
$$ plain form
794 1715 120 -6749 -8402 -2302 2859 157 -5843 -5763 1417 5730 2072 -3544 -2157 4779 7509 2556
810 2556 -2256 334 6659 7606 1672 -2898 -54 5879 5195 -1228 -4753 -759 4531 2613 -3901 -5580
826 -5580 -505 4028 1126 -4917 -4930 919 4342 686 -4611 -3570 2817 5015 -168 -4847 -2777 3181
842 3181 3778 -2193 -5801 -2459 2645 1922 -4432 -7310 -2707 2006 340 -5279 -6419 -1071 3331 944
858 944 -4152 -3566 2735 6786 3285 -1188 170 6566 9099 4539 554 2756 8021 8382 3020 -1352
874 -1352 1016 5497 4225 -2262 -5560 -2425 1306 -859 -6946 -9161 -4601 -1160 -3985 -9208 -8705
889 -8705 -3542 -32 -3078 -6824 -5185 1295 3794 137 -2830 303 5703 7087 2692 126 3108
904 3108 8041 7486 1872 -534 3091 6968 4682 -1140 -2930 1422 4469 1125 -4342 -4585 22 2509
$$ packed form
794A715j595o869j653O100N161k702o000Q0P180M313l658n616J387O936K730m953
810B556m812K590O325R47n934m570K844N933o84o423l525L994N290j918o514j679
826e580N075M533k902o043j3N849L423l656n297J041O387K198n183m679K070N958
842C181N97n971l608L342N104p23o354k878M603M713j666n619j140N348M402k387
858I44n096N86O301M051l501m473J358O396K533m560l985K202N265L61n362m372
874a352K368M481j272o487l298L135L731k165o087k215M560L441k825n223N03
889h705N163L510l046l746J639O480K499l657k967L133N400J384m395k566K982
904C108M933n55n614k406L625L877k286n822j790M352L047l344n467k43M607K487
$$ plain form
920 2509 -1274 -5579 -4491 821 2732 -1458 -4682 -2565 2782 3506 -1192 -3870 -1053 3430 2739 -2285
936 -2285 -4519 -622 3082 1096 -4114 -5048 -993 1627 -812 -5032 -5117 -341 2353 -524 -3828 -2304
952 -2304 2519 4647 1240 -1683 948 6143 6797 2862 399 3473 7548 6464 1830 -183 2621
967 2621 5544 3201 -2071 -3533 -575 1754 -1462 -6291 -6973 -2944 -1066 -4660 -8401 -7107 -2335
982 -2335 -885 -3961 -6799 -3719 1466 1878 -1235 -2718 882 5117 4717 1249 260 3587 7119 5654
998 5654 1222 355 3886 6310 3509 -1410 -1352 2377 3608 -179 -4025 -2841 696 1690 -2218 -5107
1014 -5107 -2968 863 1128 -2612 -4471 -1568 2093 1639 -2331 -3257 -153 3315 1564 -2173 -2821 875
1030 875 3268 674 -2816 -2432 1182 2585 -688 -3581 -2568 1281 2125 -1039 -3652 -1545 2356 3059
$$ packed form
920B509l783m305J088N312J911m190l224K117N347P24m698k678K817M483o91n024
936b285k234L897L704j986n210r34M055K620k439m220q5M776K694k877l304J524
952b304M823K128l407k923K631N195O54l935k463L074M075j084m634k013K804
967B621K923k343n272j462K958K329l216m829o82M029J878l594l741J294M772
982b335J450l076k838L080N185M12l113j483L600M235m00l468r89L327L532j465
998E654m432q67L531K424k801m919N8L729J231l787l846J184L537R94l908k889
1014e107K139L831K65l740j859K903L661m54l970r26L104L468j751l737o48L696
1030H75K393k594l490L84L614J403l273k893J013L849Q44l164k613K107L901P03
$$ plain form
1046 3059 -710 -2659 405 3879 3338 -538 -1295 2229 4919 3063 -665 -956 2438 3887 1638 -1817
1062 -1817 -2001 1109 2374 -508 -4004 -2952 381 1085 -1995 -4955 -2982 1001 611 -3076 -4254 -1266
1078 -1266 1724 1152 -2051 -2740 717 3297 2119 -1190 -1302 1875 4012 2034 -1257 -703 2756 4158
1094 4158 818 -1954 -1046 2508 2651 -744 -2941 -1140 1908 1443 -2079 -3718 -1390 1438 414 -2779
1110 -2779 -3647 -1017 1877 417 -2684 -2764 503 2934 600 -2211 -1419 2358 3504 828 -1486 -52
1126 -52 3150 3347 702 -1171 249 3067 2605 -607 -2022 -254 2168 1549 -1788 -3185 -630 1497
1142 1497 -292 -3564 -3757 -867 998 -1402 -3742 -2869 188 1081 -1212 -3049 -1555 1664 2210 -150
1158 -150 -1533 247 3448 3358 435 -570 1583 3997 3064 90 -1057 2103 3485 1759 -1465 -1336
$$ packed form
1046C059l769j949L064L474n41l876p57L524K690j856l728k91L394J449k249l455
1062a817j84L110J265k882l496J052L333P04l080k960J973L983l90l687j178K988
1078a266K990n72l203o89L457K580j178l309j12L177K137j978l291N54L459J402
1094D158l340k772R08L554J43l395k197J801L048m65l522j639K328K828j024l193
1110b779q68K630K894j460l101q0L267K431k334k811P92L777J146k676k314J434
1126e2L202J97k645j873J420K818m62l212j415J768K422o19l337j397K555K127
1142A497j789l272j93K890J865k400k340Q73L057Q93k293j837J494L219N46k360
1158a50j383J780L201r0k923j005K153K414r33k974j147L160J382j726l224J29
$$ plain form
1174 -1336 972 2041 -131 -2813 -2442 283 1192 -957 -3605 -2470 686 1371 -1058 -3316 -1264 1526
1190 1526 1480 -1717 -2233 -59 2408 1221 -1591 -2254 431 1655 -1 -2129 -2336 -35 1760 -401
1206 -401 -2678 -2230 652 1762 -211 -2302 -717 2456 2690 486 -605 1581 4126 4227 1511 681
1222 681 2737 4383 3328 519 -65 1416 3015 893 -2050 -2616 -752 393 -2561 -5262 -4905 -2589
1238 -2589 -1891 -4487 -6352 -4226 -1885 -1297 -3582 -3920 -1862 1065 1403 -152 -468 2125 4774 4374
1254 4374 2335 2142 4765 6506 4697 2177 1908 4075 4724 2225 -306 12 1564 1461 -1259 -3363
1270 -3363 -2358 -839 -963 -3426 -4535 -3259 -960 -1143 -3086 -3883 -1523 832 -176 -2176 -1976 485
1286 485 2305 680 -1359 -848 1432 2091 197 -1583 -980 825 1154 -504 -2055 -1304 1032 1217 -792
$$ packed form
1174a336K308J069k172k682L71K725R09k149k648J135L156O85k429k258K052K790
1190A526m6l197n16K174K467j187k812o63K685J224j656k128k07K301J795k161
1206d01k277M48K882J110j973k091J585L173K34k204j091K186K545J01k716q30
1222F81K056J646j055k809n84J481J599k122k943n66J864J145k954k701L57K316
1238b589O98k596j865K126K341N88k285l38K058K927L38j555l16K593K649m00
1254D374k039j93K623J741j809k520k69K167O49k499k531L18J552j03k720k104
1270c363J005J519j24k463j109J276K299j83j943p97K360K355j008k000K00K461
1286D85J820j625k039N11K280O59j894j780O03J805L29j658j551P51K336J85k009
$$ plain form
1303 -792 -1886 -301 2500 2390 288 88 2385 4428 3451 1559 1928 3808 5147 3675 1274 1386
1319 1386 2739 3061 850 -1798 -1861 -463 -903 -3117 -5635 -4987 -3080 -3398 -5881 -6657 -5330 -3104 -3099
1336 -3099 -4735 -4563 -2091 330 -59 -697 45 2599 4519 4020 2618 3487 5755 6693 5203 3344 3600
1353 3600 5461 5209 3016 687 999 2329 1338 -951 -2683 -1750 -898 -1426 -3733 -4358 -2839 -1458 -2184
1370 -2184 -4098 -3921 -1546 48 -1093 -2463 -1876 847 1554 164 -1247 -813 1341 1505 -458 -1601
1386 -1601 -710 838 711 -1351 -2104 -1071 763 259 -1553 -1790 281 2220 1614 -23 262 2794 3864
1403 3864 3080 1851 2331 4566 4992 3392 1929 2256 3260 2849 1055 -1043 -668 394 -629 -3072
1419 -3072 -4695 -3791 -2734 -3605 -5821 -6368 -4501 -3358 -3752 -5047 -4548 -1979 -641 -1123 -1495 -243 2227
$$ packed form
1303g92j094J585K801j10k102k00K297K043r77j892L69J880J339j472k401J12
1319A386J353L22k211k648o3J398m40k214k518O48J907l18k483p76J327K226N
1336c099j636J72K472K421l89o38P42K554J920m99j402Q69K268R38j490j859K56
1353C600J861k52k193k329L12J330r91k289j732R33Q52n28k307o25J519J381p26
1370b184j914J77K375J594j141j370N87K723P07j390j411M34K154J64j963j143
1386a601Q91J548j27k062p53J033J834n04j812k37K071J939o06j637K85K532J070
1403C864p84j229M80K235M26j600j463L27J004m11j794k098L75J062j023k443
1419c072j623R04J057q71k216n47J867J143l94j295M99K569J338m82l72J252K470
$$ plain form
1436 2227 3671 2920 2148 3114 5438 5767 3838 3285 4121 5185 4787 2150 1207 1813 2547 1555 -1114 -1977
1454 -1977 -1019 -344 -1658 -3372 -3777 -2157 -1402 -2483 -3481 -3022 -1044 -591 -1401 -2355 -1274 771 1024
1471 1024 -25 -1087 383 1476 1085 -370 -1250 36 1117 565 -976 -1631 -40 938 -8 -1516
1487 -1516 -1512 363 1288 636 -653 140 2372 2799 1549 874 1916 3500 3825 2265 993 2059 3260
1504 3260 2395 540 -542 211 728 -348 -2231 -3054 -1950 -1557 -2910 -4334 -4761 -3214 -2377 -3426 -4343
1521 -4343 -3460 -1707 -749 -1292 -1827 -457 1690 2235 1621 1206 2372 4095 4179 2699 2145 3455 4230 3515
1539 3515 1732 1202 1817 2184 866 -857 -1026 -279 -38 -1245 -2389 -2336 -978 -919 -1985 -3003 -2208 -588
1557 -588 -358 -1129 -1946 -793 693 705 -813 -1109 292 1176 593 -506 -769 -37 1059 183 -1381 -992
$$ packed form
1436B227J444p51p72R66K324L29j929n53Q36J064l98k637r43O06P34r92k669q63
1454a977R58O75j314j714m05J620P55j081r98M59J978M53q10r54J081K045K53
1471A024j049j062J470J093l91j455q80J286J081n52j541o55J591R78r46j508
1487a516MJ875R25o52j289P93K232M27j250o75J042J584L25j560j272J066J201
1504C260q65j855j082P53N17j076j883q23J104L93j353j424m27J547Q37j049r17
1521d343Q83J753R58n43n35J370K147N45o14m15J166J723Q4j480n54J310P75p15
1539C515j783n30O15L67j318j723j69P47K41j207j144N3J358N9j066j018P95J620
1557e88K30p71q17J153J486J2j518k96J401Q84n83j099k63P32J096q76j564L89
$$ plain form
1575 -992 97 704 -175 -1658 -778 369 772 -87 -1009 -7 1723 1609 740 48 1109 2455 2223 1015
1593 1015 797 1469 2623 1462 143 5 852 1233 126 -1363 -1764 -504 -565 -1567 -2840 -2332 -1211
1610 -1211 -1321 -2427 -2926 -1964 -638 -307 -1455 -1550 -349 1023 939 331 21 1099 2602 2436 866 794
1628 794 2023 2664 1723 245 410 1245 1620 764 -750 -677 445 284 -623 -1504 -1330 -371 -197 -1600 -2129
1647 -2129 -870 92 -289 -1144 -1288 -226 943 351 -855 -747 926 1239 610 -368 -283 1004 1106 306
1665 306 -651 -433 827 696 -84 -974 -149 546 903 -589 -1051 -342 891 782 -477 -605 578 1121
1683 1121 435 -559 -453 562 1233 506 -550 -400 651 878 112 -894 -823 386 568 -506 -1390 -454
1701 -454 471 100 -697 -1315 -478 533 307 -793 -665 193 801 250 -411 -282 343 958 629 -327 -409 660
$$ packed form
1575i92J089O07q79j483Q80J147M03q59r22J002J730j14q69o92J061J346k32j208
1593A015k18O72J154j161j319j38Q47L81j107j489m01J260o1j002j273N08J121
1610a211j10j106m99R62J326L31j148r5J201J372q4o08l10J078J503j66j570p2
1628G94J229O41r41j478J65Q35L75q56j514P3J122j61r07q81J74R59J74j403n29
1647b129J259R62l81q55j44J062J169n92j206J08J673L13o29r78Q5J287J02q00
1665C06r57K18J260j31p80q90Q25O95L57j492m62P09J233j09j259j28J183N43
1683A121o86r94J06J015O71p27j056J50J051K27p66j006P1J209J82j074q84R36
1701d54R25l71p97o18Q37J011k26j100J28Q58O08n51o61J29O25O15l29r56q2J069
$$ plain form
1721 660 1104 524 -432 -91 1203 855 -300 -839 -20 988 260 -385 -789 -284 -96 -29 -531 -1134 -450
1740 -450 171 -28 -1213 -927 25 789 -42 -1044 -659 451 960 -240 -738 -18 744 784 120 -308 605
1759 605 593 945 187 -423 137 852 897 -106 -696 -124 710 281 -1024 -1024 139 793 -381 -1384 -757 182
1779 182 159 -425 -935 -230 375 520 100 -608 31 863 960 159 -367 12 1160 711 -82 -314 977 1211
1799 1211 432 -609 -368 630 371 -113 -601 -399 147 70 -403 -681 -1050 -64 -46 -619 -1167 -573 584 529
1819 529 -498 -1089 97 757 311 -540 -262 618 779 -41 -212 -76 455 743 698 -72 -540 260 809 233
1839 233 -378 -524 705 846 -426 -1011 170 900 328 -515 -129 151 490 166 -188 -283 52 291 265 -334
1859 -334 -695 -95 482 216 -1288 -1094 137 65 -657 -1173 -514 111 -316 -817 -439 -404 18 -1 -219 -346
$$ packed form
1721F60M44n80r56L41J294l48j155n39Q19J008p28o45m04N05J88O7n02o03O84
1740d50O21j99j185K86R52P64q31j002L85J110N09j200m98P20P62M0o64m28R13
1759F05j2L52p58o10N60P15M5j003n90N72Q34m29j305%J163O54j174j003O27R39
1779A82k3n84n10P05O05J45m20p08O39Q32R7q01n26L79J148m49p93k32J291K34
1799A211p79j041K41R98k59m84m88K02N46p7m73k78l69R86J8n73n48N94J157n5
1819E29j027n91J186O60m46q51K78Q80J61q20j71J36N31K88m5p70m68Q00N49n76
1839B33o11j46J229J41j272n85J181P30n72q43L86K80L39l24l54r5L35K39k6n99
1859c34l61O00N77k66j504J94J231p2p22n16O59O25m27n01L78L5M22j9k18j27
$$ plain form
1879 -346 -68 534 678 479 -695 429 1391 767 -198 -43 1047 1365 390 -543 404 872 654 -139 -255
1898 -255 -35 145 41 -291 -468 -803 -127 202 -585 -1293 -542 309 104 -865 -864 255 732 -62 -796 -151
1918 -151 652 464 -47 -165 482 542 203 547 48 -173 234 757 154 -732 -496 565 492 -622 -954 48
1938 48 865 -370 -802 -574 -112 115 -405 -542 -276 -27 97 257 -364 -466 138 689 373 -629 -248 993
1958 993 997 29 -280 568 1022 480 -252 77 405 521 136 -37 -159 -307 139 239 -372 -690 -535 369 -52
1979 -52 -584 -676 546 504 -566 -833 -82 643 54 -491 -480 26 26 -94 45 -31 -179 395 659 83 -493 73
2001 73 648 484 -495 -369 679 1032 -168 -622 126 872 244 -280 29 469 495 441 534 374 124 419 871
2022 871 306 -401 -242 852 586 -390 -987 -196 387 -588 -1241 -655 -363 -791 -1212 -981 -613 -626 -759 -216
$$ packed form
1879c46K78O02J44j99j174J124R62o24r65J55J090L18r75r33R47M68k18p93j16
1898b55K20J80j04l32j77l35O76L29p87p08P51Q51k05r69JJ119M77p94p34O45
1918a51Q03j88n11j18O47O0l39L44m99k21M07N23o03q86K36J061p3j114l32J002
1938D8Q17j235m32K28M62K27n20j37K66K49J24J60o21j02O04N51l16j002L81J241
1958I93Mr68l09Q48M54n42p32L29L28J16l85j73j22j48M46J00o11l18J55R04m21
1979e2n32r2J222m2j070k67P51P25n89n45J1N06%j20J39p6j48N74K64n76n76N66
2001G3N75j64r79J26J048L53j200m54P48P46o28n24L09M40K6n4R3j60k50K95M52
2022H71n65p07J59J094k66r76n97P91N83r75o53N86K92m28m21K31L68j3j33N43
$$ plain form
2042 -216 -561 -584 -281 385 494 -269 132 1434 1539 390 315 1456 2013 924 417 983 1401 1350 285
2061 285 455 519 -77 -274 139 -510 -1242 -879 -470 -653 -1716 -1701 -659 -347 -1249 -1629 -262 35 -657 -907
2081 -907 -87 415 535 215 471 757 487 603 694 794 225 415 1064 762 -369 -360 796 661 -103 -935
2101 -935 -117 497 24 -737 -101 386 87 -47 202 284 334 282 648 590 -266 -60 802 605 -675 -922 28
2122 28 198 -974 -1479 -1057 -459 -830 -1727 -1142 -776 -1090 -1200 -805 -621 -773 -285 353 408 -261 93 1337
2142 1337 1718 719 903 1843 2377 1503 949 1568 2041 1313 603 605 432 503 1 -351 -609 -1028 -1284 -889 -993
2163 -993 -2174 -2004 -892 -1058 -1934 -2016 -769 -205 -1288 -1337 -357 446 365 -41 474 997 927 909 1161 1073 679
2184 679 961 1259 1293 102 -49 919 1049 -45 -737 137 488 -309 -791 -224 358 -129 -378 -328 134 149
$$ packed form
2042b16l45k3L03O66J09p63M01J302J05j149p5J141N57j089n07N66M18n1j065
2061B85J70O4n96j97M13o49p32L63M09j83j063J5J042L12r02l80J367K97o92k50
2081i07Q20N02J20l20K56K86k70J16R1J00n69J90O49l02j131RJ156j35p64q32
2101i35Q18O14m73p61O36M87k99j34K49Q2N0n2L66n8q56K06Q62j97j280k47R50
2122B8J70j172n05M22N98l71q97N85L66l14j10L95J84j52M88O38N5o69L54J244
2142A337L81r99J84R40N34q74n54O19M73p28p10Kj73P1n02l52k58m19k56L95j04
2163i93j181J70J112j66q76q2J247N64j083m9R80Q03q1m06N15N23p0j8K52q8l94
2184F79K82K98L4j191j51R68J30j094o92Q74L51p97m82N67N82m87k49N0M62J5
$$ plain form
2204 149 445 402 205 -274 254 653 599 -612 -605 34 -7 -747 -1264 -804 -429 -959 -1556 -1144 -823 -995 -1375
2225 -1375 -918 -586 -469 -632 134 443 194 449 1054 1681 844 986 1917 2611 1443 1021 1780 2132 1701
2244 1701 719 791 884 549 79 -366 -232 -929 -1128 -976 -1168 -1851 -1934 -1269 -1304 -1843 -2230 -1260 -725 -921 -1338
2265 -1338 -451 221 -60 -175 262 923 910 598 948 1161 685 693 1366 1070 58 185 1042 899 78 -148
2285 -148 528 635 -465 -695 17 453 46 -305 -226 390 282 268 86 569 -143 42 762 435 -328 -301 552
2306 552 215 -705 -1167 -222 -154 -981 -1170 -943 -579 -1002 -1220 -1090 -464 -602 -806 -67 -80 -109 141 792 708
2327 708 448 583 1498 1696 973 911 1278 1727 1157 563 673 864 774 160 370 -28 -365 -347 -504 -975 -1324
2348 -1324 -1201 -947 -755 -1447 -1379 -708 -421 -913 -1179 -388 241 15 -466 -230 620 604 408 569 790 314
$$ packed form
2204A49K96m3j97m79N28L99n4j211PO39m1p40n17M60L75n30n97M12L21j72l80
2225a375M57L32J17j63P66L09k49K55O05O27q37J42R31O94j168m22P59L52m31
2244A701r82P2R3l35m70m45J34o97j99J52j92o83q3O65l5n39l87R70N35j96m17
2265a338Q87O72k81j15M37O61j3l12L50K13m76QO73k96j012J27Q57j43q21k26
2285a48O76J07j100k30P12M36m07l51P9O16j08j4j82M83p12J85P20l27p63K7Q53
2306E52l37r20m62R45O8q27j89K27L64m23k18J30O26j38k04P39j3k9K50O51q4
2327G08k60J35R15J98p23o2L67M49n70n94J10J91r0o14K10l98l37J8j57m71l49
2348a324J23K54J92o92O8O71K87m92k66P91O29k26m81K36Q50j6j96J61K21m76
$$ plain form
2368 314 689 879 681 217 457 577 717 -154 -101 460 558 -58 -568 226 403 -179 -205 -211 94 146 -69 -147
2390 -147 303 286 23 433 71 -367 190 462 245 -520 -574 -260 11 -649 -905 -529 -198 -326 -303 -756 -198
2411 -198 -532 -419 -30 -191 -183 -93 85 332 175 393 1095 615 275 139 651 1083 441 47 439 845 683
2432 683 -260 -213 293 -163 -197 -262 29 -507 -537 -279 -384 -534 -538 184 259 -461 -739 20 339 -114 -395 -29
2454 -29 403 66 28 -29 420 313 122 212 241 -99 -58 544 320 -338 -192 -26 337 -213 -437 -94 170 -41
2476 -41 -246 -125 -13 124 57 94 -14 195 186 144 -125 -95 -239 44 293 -38 -329 138 264 144 -155 130
2498 130 718 196 -320 -122 160 253 46 -5 139 32 -244 202 -63 -232 -269 249 193 -361 -440 -228 161 -110
2520 -110 -646 -213 323 17 -119 -273 374 222 -103 127 181 142 215 421 652 16 9 389 464 -18 -127 184
$$ packed form
2368C14L75J90j98m64K40J20J40q71N3N61R8o16n10P94J77n82k6oL05N2k15p8
2390a47M50j7k63M10l62m38N57K72k17p65n4L14K71o60k56L76L31j28K3m53N58
2411a98l34J13L89j61QR0J78K47j57K18P02m80l40j36N12M32o42l94L92M06j62
2432F83r43M7N06m56l4o5K91n36l0K58j05j50mP22P5p20k78P59L19m53k81L66
2454b9M32l37l8n7M49j07j91R0K9l40M1O02k24o58J46J66L63n50k24L43K64k11
2476d1k05J21J12J37o7L7j08K09rm2k69L0j44K83K49l31k91M67J26j20k99K85
2498A30N88n22n16J98K82R3k07n1J44j07k76M46k65j69l7N18n6n54p9K12L89k71
2520a10n36M33N36l06j36j54O47j52l25K30N4l9P3K06K31o36pL80P5m82j09L11
$$ plain form
2542 184 287 -103 -158 125 177 147 -614 -206 -324 -9 -143 -150 -304 -445 37 -62 156 -5 74 103 482 32 -231
2565 -231 293 245 243 -319 -264 361 30 -176 -576 -207 84 -174 95 -137 -365 -332 111 -45 -113 -212 236 438
2587 438 134 189 530 768 547 269 529 578 805 377 215 515 157 15 -138 -19 -440 -665 -286 -347 -1026
2608 -1026 -1031 -729 -537 -817 -907 -371 -289 -689 -558 -433 -36 35 170 104 -12 471 564 808 721 824 779 1037 704
2631 704 305 334 496 587 214 89 58 100 -36 -132 -235 -223 -344 -526 -527 -208 -509 -341 -390 -686 -194 -183 270
2654 270 -80 -227 -331 -41 148 103 -462 -372 -20 -248 -317 -238 -502 -253 -395 -464 -144 -257 -196 -28 -202 -238
2676 -238 -242 304 440 162 370 602 954 944 529 912 818 1082 459 367 405 335 188 76 -390 -273 -184 -444 -649
2699 -649 -1032 -1038 -995 -411 -1167 -968 -862 -444 -850 -643 -714 -244 60 139 58 265 649 605 746 763 734 735 992 722
$$ packed form
2542A84J03l90n5K83N2l0p61M08j18L15j34pj54j41M82r9K18j61P9K9L79m50k63
2565b31N24m8kn62N5O25l31k06m00L69K91k58K69k32k28L3M43j56o8r9M48K02
2587D38l04N5L41K38k21k78K60M9K27m28j62L00l58j42j53J19m21k25L79o1o79
2608a026nL02J92k80r0N36Q2m00J31J25L97P1J35o6j16M83R3K44q7J03m5K58l33
2631G04l99K9J62R1l73j25l1M2j36r6j03J2j21j82jL19l01J68m9k96M92J1M53
2654B70l50j47j04K90J89m5n65R0L52k28o9P9k64K49j42o9L20j13O1J68j74l6
2676b38mN46J36k78K08K32L52j0m15L83r4K64o23r2L8p0j47j12m66J17Q9k60k05
2699f49l83oM3N84p56J99J06M18m06K07p1M70L04P9q1K07L84m4J41J7k9JK57k70
$$ plain form
2723 722 383 500 680 595 338 -53 316 418 119 -170 -290 -376 -191 -220 -412 -347 -276 -114 -389 -291 -271 -1
2745 -1 -116 -43 -60 65 186 340 263 -72 3 77 -99 -470 -31 -68 -173 84 -137 -570 -152 -22 -72 -160 -170 -97
2769 -97 270 126 154 461 434 394 499 755 414 771 838 566 651 321 481 228 299 -187 -129 -71 -406 -461 -625
2792 -625 -888 -704 -726 -1078 -681 -779 -871 -645 -984 -471 -182 -238 57 313 -28 321 450 301 506 683 1003
2813 1003 1099 495 507 595 220 438 204 -27 360 4 -103 -484 -86 -88 -359 -412 -494 -672 -327 -50 -255 -261 -334
2836 -334 -142 -60 -65 -196 -257 23 -27 224 -207 10 -51 450 187 111 94 -128 -127 -168 -70 -191 224 -74 -252 -268
2860 -268 299 -65 57 286 84 317 505 319 123 186 344 209 348 568 103 -31 -34 -132 -37 116 -269 108
2882 108 -641 -390 -279 -295 -692 -411 -577 -355 -232 -553 -367 -394 -220 -133 -186 157 218 236 263 48 345 237
$$ packed form
2723G22l39J17J80q5k57l91L69J02k99k89j20q6J85k9j92O5P1J62k75R8K0K70
2745aj15P3j7J25J21J54p7l35P5P4j76l71M39l7j05K57k21m33M18J30n0q8j0P3
2769i7L67j44K8L07k7m0J05K56l41L57O7k72Q5l30J60k53P1m86N8N8l35n5j64
2792f25k63J84k2l52L97r8r2K26l39N13K89n6K95K56l41L49J29j49K05J77L20
2813A003R6o04J2Q8l75K18k34k31L87l56j07l81L98kk71n3q2j78L45K77k05op3
2836c34J92Q2nj31o1K80n0K51m31K17o1N01k63p6j7k22Jm1R8j21M15k98j78j6
2860b68N67l64J22K29k02K33J88j86j96O3J58j35J39K20m65j34lr8R5J53l85L77
2882A08p49K51J11j6l97K81j66K22J23l21J86k7J74Q7n3L43O1J8K7k15K97j08
$$ plain form
2904 237 597 420 306 500 419 389 268 436 145 138 -224 -216 0 -117 -288 -201 -63 -428 -63 -313 72 -49
2926 -49 -241 -224 79 -145 -15 -44 2 199 175 205 -24 -104 321 139 15 -74 -19 172 95 8 -221 245 335 25
2950 25 -85 -60 -273 -32 84 -230 -57 115 -39 -47 -170 29 274 -29 -37 426 68 152 59 -3 -120 192 25
2973 25 109 -53 43 -162 -32 -118 137 -86 -91 132 2 -53 -169 198 100 21 -88 118 63 -66 154 -94 94
2996 94 266 181 331 333 225 111 22 105 168 -14 61 137 -98 -236 113 -136 -480 -127 -398 -55 -160 -88 -253
3019 -253 -524 -32 36 -363 -112 62 -127 59 98 89 232 -39 173 33 162 173 85 170 355 206 -13 -14 -161
3042 -161 -197 190 -134 -125 202 5 -140 235 31 -447 -206 -19 -27 -340 -326 -194 -109 -91 -3 175 -69 -67 72 -60
3066 -60 101 86 118 134 96 -40 148 241 -234 28 0 34 349 131 -11 -76 -100 169 226 64 -115 -130 75 61
$$ packed form
2904B37L60j77j14J94q1l0j21J68k91pl62QK16j17j71Q7J38l65L65k50L85j21
2926d9j92J7L03k24J30k9M6J97k4L0k29q0M25j82j24q9N5J91p7q7k29M66R0l10
2950B5j10K5k13K41J16l14J73J72j54qj23J99K45l03qM63l58Q4r3o2j17L12j67
2973B5Q4j62R6k05J30q6K55k23nK23j30n5j16L67r8p9j09K06n5j29K20k48J88
2996I4J72q5J50Kj08j14q9Q3O3j82P5P6k35j38L49k49l44L53k71L43j05P2j65
3019b53k71M92O8l99K51J74j89J86L9rJ43k71K12j40J29J1q8Q5J85j49k19jj47
3042a61l6L87l24RL27j97j45L75k04m78K41J87ql13J4J32Q5J8Q8J78k44KJ39j32
3066f0J61j5L2J6l8j36J88R3m75K62k8L4L15k18j42o5k4K69N7j62j79j5K05j4
$$ plain form
3090 61 -121 90 -31 -314 -123 184 -267 55 -53 43 -166 -124 14 -83 59 -204 336 49 -208 19 -4 64
3112 64 -153 -284 34 -326 98 -8 1 -102 -42 252 32 -31 156 -172 482 14 210 -24 3 2 90 7 142
3135 142 55 292 -32 -37 -37 -230 -165 -111 -242 -418 -194 -321 -81 -132 -217 -39 -139 -279 -249 -145 101 38 -207 -134
3159 -134 159 103 385 148 147 -96 26 59 10 277 158 193 -35 -63 -62 -4 142 75 -93 -145 -49 -60 74 0 -1 -18
3185 -18 221 -159 -44 -98 -57 235 79 -174 253 -22 188 48 -152 -28 -90 94 19 -229 297 46 112 -180
3207 -180 -218 203 -28 74 127 17 54 -123 -71 276 -140 66 180 130 116 -114 126 225 9 128 320 164
3229 164 37 -74 1 -29 -399 -124 -213 0 -212 13 -46 -22 -131 -30 82 -28 64 150 225 287 -151 259 131
3252 131 177 -113 -101 -204 -176 137 6 -317 -130 275 129 161 -128 -112 -72 -206 122 -90 -47 -9 306 97 -258
$$ packed form
3090F1j82K11j21k83J91L07m51L22j08R6k09M2J38r7J42k63N40k87k57K27k3O8
3112F4k17j31L18l60M24j06Rj03O0K94k20o3J87l28O54m68J96k34K7jQ8q3J35
3135A42q7K37l24n%j93O5N4j31j76K24j27K40n1q5J78j00j40L0J04K46o3k45P3
3159a34K93n6K82k37jk43J22L3m9K67j19L5k28k8JN8J46o7j68n2R6j1J34p4jj7
3185a8K39l80J15n4M1K92j56k53M27k75K10j40k00J24o2J84p5k48N26k51O6k92
3207a80l8M21k31J02N3j10L7j77N2L47m16K06J14n0j4k30K40R9k16J19J92j56
3229A64j27j11P5l0l70K75q9K13k12K25n9K4j09J01J12j10R2Q6P5O2m38M10j28
3252A31M6k90J2j03K8L13j31l23J87M05j46L2k89J6M0j34L28k12M3L8L15k09l55
$$ plain form
3275 -258 -75 112 173 -113 -171 82 101 -72 -33 -252 -19 156 -111 -182 -200 -25 -23 -72 -59 -47 328 259 241 62
3299 62 -141 78 106 98 -304 -76 112 -104 -3 32 -340 47 246 -248 -344 -214 -178 -146 -9 -44 32 -132 -75 -252
3323 -252 -140 84 -82 60 248 -132 38 -42 92 -146 49 248 65 47 103 274 90 -23 -37 60 6 41
3345 41 -73 131 -175 -317 -20 -94 -170 -89 -13 -355 -160 -110 -253 -8 241 222 -1 196 175 116 -77 177 128
3368 128 59 76 165 -78 277 93 115 162 62 20 58 -118 -1 21 118 116 124 90 -115 52 189 -47 70 0 78
3393 78 -91 -297 -7 155 150 107 -137 108 -180 -271 -114 -182 -469 -281 -330 -16 -516 -136 25 -217 -134 -356 -259
3416 -259 -148 -106 101 234 168 214 577 66 265 623 445 404 508 339 306 76 438 209 264 -110 -122 -132 -346
3439 -346 -326 -461 -390 -310 -59 -90 -285 -127 -275 -98 -227 34 103 -176 -40 40 64 124 176 23 62 176 105 -15
$$ packed form
3275b58J83J87O1k86n8K53J9j73L9k19K33J75k67p1j8J75Km9J3J2L75o9j8j79
3299F2k03K19K8qm02K28J88k16J01L5l72L87J99m94r6J30L6L2J37l5P6j64N7j77
3323b52J12K24j66J42J88l80J70q0J34k38J95J99j83j8N6J71j84j13j4R7n4L5
3345D1j14K04l06j42K97p4p6Q1P6l42J95N0j43K45K49j9k23J97k1n9j93K54m9
3368A28o9J7Q9k43L55j84K2M7j00m2L8j76J17K2R7kQl4k05J67J37k36J17p0P8
3393G8j69k06K90J62nm3k44K45k88r1J57o8k87J88m9L14n00L80J61k42Q3k22R7
3416b59J11M2K07J33o6M6L63n11J99L58j78m1J04j69l3k30L62k29N5l74j2j0k14
3439c46K0j35P1Q0K51l1j95J58j48J77j29K61O9k79J36Q0K4O0N2j53L9J14p1j20
$$ plain form
3463 -15 112 200 23 -107 -3 53 55 -98 -137 -237 349 45 -59 -391 236 -31 60 270 30 156 -210 325
3485 325 114 -389 33 -10 319 -183 49 -38 -163 -43 -242 -314 -368 -371 -246 -299 -511 -341 -306 -325 -396 -53 -210
3508 -210 -155 -22 120 48 422 214 320 547 599 540 241 436 202 319 301 326 299 131 410 -170 -49 46 -84
3531 -84 -193 -71 -244 -169 -352 -349 -641 -152 -523 -210 -110 -3 40 -61 190 147 118 75 71 226 100 200 19
3554 19 285 51 5 75 -4 271 -47 -95 15 -81 -200 -16 102 -6 187 13 169 174 244 103 233 62 -87
3577 -87 233 52 198 -117 -109 -132 195 -302 18 9 -79 -228 -434 -100 -204 -549 -348 -181 -230 -260 -262 -316 -33 -8
3601 -8 -43 240 -55 88 120 215 201 211 415 328 517 321 201 232 223 308 86 212 90 -445 116 69 60 -251 -281
3626 -281 -190 -290 -58 -334 -168 -355 -211 -299 -167 -255 119 157 153 -31 157 112 89 -17 -109 9 18 -176 39 61
$$ packed form
3463a5J27Q8j77j30J04N6Kj53l9j00N86l04j04l32O27k67R1K10k40J26l66N35
3485C25k11n03M22m3L29n02K32q7j25J20j99p2n4lJ25n3k12J70L5j9p1L43j57
3508b10N5J33J42p2L74k08J06K27N2n9k99J95k34J17j8K5k7j68K79n80J21R5j30
3531h4j09J22j73P5j83Lk92M89l71L13J00J07M3j01K51m3k9m3mJ55j26J00j81
3554A9K66k34m6P0p9K75l18m8J10r6j19J84J18j08J93j74J56NP0j41J30j71j49
3577h7L20j81J46l15Qk3L27m97L20rq8j49k06L34j04l45K01J67m9l0kn4K83K5
3601hl5K83k95J43L2R5j4J0K04q7J89j96j20L1rQ5k22J26j22n35N61m7rl11l0
3626b81R1j00K32k76J66j87J44q8J32q8L74L8mj84J88m5k3j06r2J18Rj94K15K2
$$ plain form
3650 61 -47 -180 -382 185 -10 -28 67 28 -181 64 175 85 -25 22 377 160 63 70 69 210 130 -18 106 116
3674 116 54 181 -157 91 -98 -58 -215 -1 -423 -135 -163 -277 -5 -494 -153 -291 -116 68 -159 85 -224
3695 -224 59 -69 -56 121 199 394 342 106 230 120 313 182 215 235 112 -3 175 87 -46 78 161 -279
3717 -279 -206 25 -34 -178 -82 -98 -93 -333 -225 158 60 100 -73 91 31 9 196 51 0 125 -50 23 -5 -113
3741 -113 2 -21 11 -219 -125 -39 24 63 297 100 66 66 -19 21 53 94 -89 224 -28 188 -120 -82 -108 44 86
3766 86 87 -35 110 -48 -123 -5 -233 -273 7 28 -92 144 29 78 315 -1 1 -2 -144 -26 -96 20 161 94
3790 94 76 -206 225 90 -6 69 218 342 82 237 157 -38 -217 126 -213 68 53 -69 -14 -56 -205 -105 165
3813 165 -338 -38 93 -250 85 -60 29 -173 73 138 44 36 -21 57 103 -20 33 89 -241 -98 -20 5 15 93 -66
$$ packed form
3650F1j08j33k02N67j95j8R5l9k09K45J11r0j10M7L55k17r7PjJ41q0j48J24J0
3674A16o2J27l38K48j89M0j57K14m22K88k8j14K72m89L41j38J75J84k27K44l09
3695b24K83j28J3J77P8J95n2k36J24j10J93j31L3K0j23j15J78q8j33J24Q3m40
3717b79P3K31n9j44R6j6Nk40J08L83r8M0j73J64o0k2J87j45n1J25j75P3k8j08
3741a13J15k3L2k30R4Q6O3L9K34j97l4%q5M0L2M1j83L13k52K16l08L8k6J52M2
3766H6Jj22J45j58p5J18k28m0K80K1j20K36j15M9K37l16Klj42J18p0J16J41o7
3790I4j8k82M31j35r6P5J49J24k60J55q0j95j79L43l39K81j5j22N5m2j49J00K70
3813A65n03L00J31l43L35j45Q9k02K46O5r4qn7P8M6j23N3N6l30J43P8K5J0P8j59
$$ plain form
3838 -66 37 -5 4 180 -106 -57 256 -214 3 133 -140 223 -96 -23 145 47 -155 1 -97 167 310 -34 41
3861 41 -83 51 -165 341 -193 -40 -57 34 232 133 290 19 -343 342 86 -90 -43 27 111 129 176 100 -128
3884 -128 -298 -72 -162 71 -40 -221 108 -257 -112 -7 -68 129 95 321 -42 59 82 161 -17 158 90 5
3906 5 122 -227 99 -83 24 205 -73 199 20 259 -24 -67 73 123 12 24 -49 68 -145 -49 -148 -107 40
3929 40 -99 -113 -117 -311 -133 106 -164 -16 152 150 53 45 -36 -33 185 -32 -102 207 24 29 -5 169 263 -124 -65 -34
3955 -34 171 226 73 131 172 -125 27 435 186 -135 301 316 162 163 159 -67 29 202 -274 -120 -179 21 -66 -228
3979 -228 -313 -283 -242 -25 -76 -158 -144 -213 25 -187 50 -352 -22 200 -103 58 -43 -134 294 111 284 237 -266
4002 -266 -59 -81 -49 236 -207 -23 -6 39 -215 105 84 -60 122 -229 29 145 346 -127 -169 -13 105 -107
$$ packed form
3838f6J03m2RJ76k86M9L13m70K17J30k73L63l19P3J68r8k02J56r8K64J43l44P5
3861D1j24J34k16N06n34J53j7R1J98r9J57k71l62O85k56j76M7P0Q4J8M7p6k28
3884a28j70K26r0K33j11j81L29l65J45J05o1J97l4K26l63J01K3P9j78J75o8q5
3906EJ17l49L26j82J07J81k78K72j79K39k83m3J40N0j11J2p3J17k13R6r9M1J47
3929D0j39j4mj94J78K39k70J48J68kr7qq1LK18k17p0L09j83Nl4J74R4l87N9L1
3955c4K05N5j53N8M1k97J52M08k49l21M36J5j54Jmk26R6J73m76J54n9K00q7j62
3979b28q5L0M1K17n1q2J4o9K38k12K37m02L30K22l03J61j01r1M28j83J73m7n03
4002b66K07k2L2K85m43J84J7M5k54L20k1j44J82l51K58J16K01m73m2J56J18k12
$$ plain form
4024 -107 -189 118 -72 -11 17 100 -79 121 267 -126 -163 -68 12 -47 -100 6 6 -8 -157 -45 -116 14 39 79 -237
4049 -237 149 17 146 201 106 10 -74 109 -127 15 257 316 -160 152 -64 -98 128 -52 146 42 -56 -215
4071 -215 -148 -237 -174 -228 -154 -503 -85 -71 -169 23 -44 -19 244 -289 -18 318 350 78 -133 205 -104 85 -52
4094 -52 224 294 342 -37 167 32 267 84 -111 161 -79 -266 -31 -160 -30 -33 -250 -205 -104 -217 -206 32
4116 32 147 28 89 343 217 -98 -40 57 -254 -50 162 -86 68 -113 -20 317 123 132 -37 128 70 -68 -44
4139 -44 -91 245 200 -198 113 95 -19 -12 -126 -28 118 3 -122 -161 210 144 -58 -248 -6 -140 -253 211 -423
4162 -423 -17 -123 33 154 -114 53 -186 -221 -93 295 5 -19 -102 -89 -53 207 78 71 130 -233 136 311 104
4185 104 24 123 62 210 -107 189 217 -237 147 -66 146 -30 -178 5 -98 -138 -96 5 21 -30 -183 -89 -125
$$ packed form
4024a07q2L07j90O1K8Q3j79K00J46l93l7R5Q0n9n3J06%j4j49J12p1J30K5M0l16
4049b37L86j32J29N5r5r6q4J83k36J42K42N9m76L12k16l4K26j80J98j04r8j59
4071b15O7q9O3n4P4l49M18J4r8J92o7K5K63n33K71L36L2k72k11L38l09J89j37
4094e2K76P0M8l79K04j35K35j83j95K72k40j87K35j29J30lk17M5J01j13J1K38
4116C2J15j19O1K54j26l15N8R7l11K04K12k48J54j81R3L37j94Rj69J65n8j38K4
4139d4m7L36m5l98L11j8j14Pj14R8J46j15j25l9L71o6k02j90K42j34j13M64o34
4162d23M06j06J56J21k68J67k39l5J28L88k90k4q3J3L6K60j29pN9l63L69J75k07
4185A04q0R9o1J48l17K96K8m54L84k13K12j76j48J83j03m0M2J01J6n1j53R4l6
$$ plain form
4208 -125 -127 61 -131 -49 36 109 126 347 160 -178 196 6 -53 -49 93 -4 -69 10 -48 -12 21 -136 -158 301 -67
4233 -67 -40 83 57 18 -96 -80 -336 -51 210 -13 125 -206 -113 -46 52 59 51 100 -258 -90 -243 -84 -34 -268 149
4258 149 -110 -113 29 -23 -38 -201 85 53 75 -13 33 143 -141 216 209 261 -168 122 14 -2 -2 -48 -194 -113 181
4283 181 116 8 -9 -30 0 -177 373 -32 -100 -61 -292 -279 -301 -115 -146 133 -10 -174 -175 -120 112 124 14 108 14
4308 14 -63 -79 -48 296 126 197 -69 162 84 156 109 237 169 -95 171 -170 216 -222 -162 -5 -15 -54 -294 -66
4332 -66 64 -32 159 21 9 73 49 -94 25 -70 72 -251 18 144 37 68 109 -49 314 69 -232 1 31
4355 31 -296 -176 215 220 -34 133 -88 125 -12 211 -114 11 31 -100 119 17 -238 -257 217 41 -103 -76
4377 -76 40 102 -53 -73 -230 248 -233 -186 -140 -203 48 -247 -60 -241 -127 -272 -295 -173 224 -99 -197 -279 -198
$$ packed form
4208a25kJ88j92Q2Q5P3J7K21j87l38L74j90n9MJ42r7o5P9n8L6L3j57k2M59l68
4233f7K7J23k6l9j14J6k56K85K61k23J38l31R3O7R8PqM9l58J68j53J59N0k34M17
4258A49k59lJ42n2j5j63K86l2K2q8M6J10k84L57pN2m29K90j08j6%m6j46Q1K94
4283A81o5j08j7k1L0j77N50m05o8L9k31J3k2J86l1K79j43j64jN5K32J2j10R4r4
4308A4p7j6L1L44j70P1k66K31p8P2m7J28o8k64K66l41L86m38O0J57j0l9k40K28
4332f6J30r6J91j38j2O4k4j43J19r5J42l23K69J26j07L1M1j58L63k45l01K33L0
4355C1l27J20L91Nk54J67k21K13j37K23l25J25K0j31K19j02k55j9M74j76j44K7
4377g6J16O2j55k0j57M78m81M7M6o3K51k95J87j81J14j45k3J22L97l23r8q2Q1
$$ plain form
4400 -198 115 44 13 255 143 122 203 223 168 -153 -32 -47 -111 128 2 -266 -18 -101 -87 -205 -176 -180 -2 -30 -1
4425 -1 -150 92 -150 -134 -73 -71 303 -14 -57 115 159 -25 230 -153 139 -18 -209 -70 48 141 -83 196 -128
4448 -128 72 -165 99 174 17 -129 215 71 99 -144 -211 -167 63 53 -100 -75 -39 32 -152 107 -119 23 -13
4471 -13 -62 -2 -31 39 -41 -285 -221 -150 4 -73 -52 -270 -90 -230 -367 -179 97 94 -108 -50 -116 -277 304 -96 -17
4496 -17 99 112 325 2 30 16 58 143 -53 -60 492 174 -275 65 -108 125 -265 13 69 -215 77 66 110 -4
4520 -4 111 5 -32 -9 -8 139 51 126 -263 4 45 -125 304 79 299 121 -276 64 36 -109 97 90 98 6 -62
4545 -62 -148 126 159 -70 62 -34 -126 278 -117 -1 127 -146 310 -253 7 -231 216 165 50 -75 125 -19
4567 -19 38 -60 204 -197 330 -26 -86 95 -486 -103 -209 111 115 72 49 -135 -44 -157 -75 2 173 -330 -58 207
$$ packed form
4400a98L13p1l1K42j12k1Q1K0n5l21J21j5o4K39j26k68K48q3J4j18K9mJ78k8K9
4425aj49K42k42J6O1KL74l17m3J72M4j84K55l83K92j57j91J39J18R3k24K79l24
4448a28K00k37K64P5j57j46L44j44K8k43o7M4K30j0j53K5L6P1j84K59k26J42l6
4471a3m9O0k9P0q0k44O4P1J54p7K1k18J80j40j37J88K76lk02N8o6j61N81m00P9
4496a7J16J3K13l23K8j4M2Q5j96pN52l18m49L40j73K33l90K78N6k84K92j1M4j14
4520dJ15j06l7K3JJ47q8P5l89K67M1j70M29k25K20j78l97L40k8j45K06pQr2o8
4545f2q6K74L3k29J32r6r2M04l95J16J28k73M56n63K60k38M47n1j15j25K00j44
4567a9N7r8K64m01N27l56o0J81n81L83j06L20Mm3k3j84R1j13Q2P7J71n03K72K65
$$ plain form
4591 207 212 176 213 -73 112 -23 101 292 117 -88 -357 82 -99 16 81 38 -182 -298 -62 142 28 193
4613 193 -223 192 -244 -157 185 -15 -151 58 -50 62 93 -94 -151 46 -100 -115 -115 -24 -65 -147 92 -22 41
4636 41 139 -140 -48 -89 23 301 4 -38 26 278 69 -183 142 60 5 170 20 75 -298 -255 104 -15 99
4659 99 210 43 128 82 143 -170 256 90 -179 -88 -224 -171 13 135 -124 -6 -17 -278 28 -12 -30 9 218
4682 218 -208 -32 -251 -183 120 45 -182 -11 -65 -16 154 -162 20 -10 167 41 -49 -50 181 -46 -27 45 31 38
4706 38 -81 31 -95 123 111 -71 -57 64 -62 -37 94 -85 -332 -180 17 34 -140 -51 -19 -130 37 76 -124
4729 -124 -201 164 -50 97 -275 22 -168 207 197 14 -15 185 142 -93 -120 -104 -303 246 213 -184 183 20
4751 20 -233 -1 220 -132 -63 -154 100 161 -166 292 -11 -31 -219 -36 -50 120 5 -123 -142 -156 -10 -13 -198
$$ packed form
4591B07Nl6L7k86J85j35J24J91j75k05k69M39j81J15O5m3k20j16K36K04j14J65
4613A93m16M15m36Q7L42k00j36K09j08J12L1j87n7J97j46j5%R1m1q2K39j14O3
4636D1R8k79R2m1J12K78k97m2O4K52k09k52L25q2n5J65j50N5l73M3L59j19J14
4659I9J11j67Q5m6O1l13M26j66k69R1j36N3J84J22k59J18j1k61L06m0j8L9K09
4682B18m26J76k19O8L03p5k27J71n4M9J70l16J82l0J77j26r0jK31k27J9P2j4P
4706C8j19J12j26K18j2j82J4J21j26K5J31j79k47J52J97J7j74Q9L2j11J67L9k00
4729a24p7L65k14J47l72K97j90L75j0j83k9K00m3k35k7J6j99N49l3l97L67j63
4751B0k53K32K21l52O9r1K54O1l27M58l03k0j88J83j4J70j15j28j9j4J46lj85
$$ plain form
4774 -198 -71 -119 -35 149 66 -29 28 -205 217 112 13 88 93 333 99 274 -24 240 244 -119 30 13 -107 -84
4798 -84 109 151 -204 39 -29 -47 -53 -149 -175 97 -299 13 16 66 -217 -111 -143 71 41 -19 165 151 42 276 -159
4823 -159 179 -147 132 81 -90 193 -71 -300 70 -216 187 204 -106 -17 -93 278 -96 41 -235 -137 -128 219
4845 219 106 -45 92 -101 -45 13 -75 -325 -140 153 299 -82 -1 -85 119 227 -45 -59 -111 -61 62 -9 130
4868 130 -161 222 -411 -162 78 6 60 -105 -82 175 69 154 197 112 -10 -100 20 -123 173 35 0 367 122
4891 122 -54 18 -8 13 283 80 34 168 -158 -151 152 -62 -141 -109 45 -50 50 55 0 221 253 25 -80 129
4915 129 -54 -77 59 -56 140 70 188 -37 139 -46 80 -22 109 -29 -102 87 -192 195 -166 13 -158
4936 -158 198 -109 141 -13 -189 -257 28 -8 -168 262 -83 198 -99 -68 -40 -165 -123 -34 -265 -135 85 -221
$$ packed form
4774a98J27m8Q4J84q3r5N7k33M22j05r9P5NK40k34J75k98K64Ml63J49j7j20K3
4798h4J93M2l55K43o8j8or6k6K72l96L12LN0k83J06l2K14l0o0J84j4j09K34m35
4823a59L38l26K79n1j71K83k64k29L70k86M03J7l10Q9p6L71l74J37k76R8RL47
4845B19j13j51J37j93N6N8q8k50J85K93J46l81Q1q4K04J08k72j4n2N0J23p1J39
4868A30k91L83o33K49K40p2N4j65K3K57j06Q5M3q5j22r0J20j43K96j38l5L67k45
4891A22j76P2k6K1K70k03m6J34l26PL03k14p9L2J54r5J00Nn5K21L2k28j05K09
4915A29j83k3J36j15J96p0J18k25J76j85J26j02J31j38p3J89k79L87l61J79j71
4936a58L56l07K50j54j76o8K85l6j60M30l45K81k97L1K8j25M2Q9k31J30K20l06
$$ plain form
4958 -221 -71 129 -129 -73 -286 30 48 -47 -83 108 17 -45 -162 251 20 87 158 -5 6 -36 -158 67 106 138
4982 138 321 -55 117 -89 -133 -49 -42 16 -24 -48 -89 58 32 105 96 87 137 -72 -155 12 -88 -8 -3 -212 163 -84
5008 -84 -68 -84 -63 -67 44 -126 83 -47 12 -200 -72 -21 114 106 -155 2 -32 57 -51 -81 148 161 93 71 -166
5033 -166 -24 -256 -87 75 -222 -170 234 -105 69 -159 -39 -134 -94 98 -78 -83 -87 159 84 51 -23 -36 44 18
5057 18 149 57 72 -79 -82 16 196 122 20 24 254 87 -50 16 196 -84 -245 -202 -94 53 -62 16 227 -91
5081 -91 20 25 -182 -96 -70 -7 19 -27 29 -140 -232 238 -75 128 55 -6 -113 -194 -334 220 181 136 -21 40 -15 -122
5107 -122 110 127 42 -50 -96 97 -40 -113 52 -72 18 -172 -161 -18 273 158 364 -69 4 -133 -165 159 64
5130 64 242 -28 -104 9 -146 -64 -234 3 -217 103 71 108 -251 -27 143 -58 -252 114 241 73 -187 -127
$$ packed form
4958b21J50K00k58N6k13L16J8r5l6J91r1o2j17M13k31O7P1j63J1m2j22K25L9L2
4982A38J83l76J72k06m4Q4PN8m0k4m1J47k6P3rrN0k09q3J67j00Q0Nk09L75k47
5008h4J6j6K1mJ11j70K09j30N9k12J28N1J35qk61J57l4Q9j08l0K29J3o8k2k37
5033a66J42k32J69J62k97N2M04l39J74k28J20r5M0J92j76nmK46p5l3p4j3Q0k6
5057A8J31r2J5j51lR8J80p4j02MK30j67j37O6J80k80j61M3J08J47j15P8K11l18
5081i1J11Nk07Q6K6O3K6m6N6j69r2M70l13K03p3o1j07q1j40N54l9m5j57O1n5j07
5107a22K32J7q5r2m6J93j37p3J65j24R0j90J1J43K91j15K06m33P3j37l2L24r5
5130F4J78k70p6J13j55Q2j70K37k20L20l2L7l59K24J70k01j94L66J27j68k60O0
$$ plain form
5152 -127 25 109 -180 97 -69 -25 -37 243 -33 135 108 18 -229 11 -175 73 -34 -87 243 197 -74 52
5174 52 15 49 -109 238 31 -194 62 65 -152 56 173 138 -5 83 99 -140 -57 186 -92 363 -3 -14 35 -99
5198 -99 253 -7 185 -69 -57 19 107 95 260 331 79 -41 6 46 96 259 -17 15 -7 149 -115 -60 -179 304
5222 304 -209 -65 229 76 65 -109 163 -165 -92 28 157 179 94 -214 118 -110 152 -95 64 -121 6
5243 6 74 24 72 95 -125 -282 57 -221 -89 -73 -133 6 -19 4 -135 202 -20 112 59 -63 -25 -6 -135 57
5267 57 44 -5 190 54 22 15 204 -24 54 -5 150 180 11 103 37 -58 300 275 -108 -319 131 60 81 -111 271
5292 271 -92 12 222 -25 59 309 86 225 153 -80 -20 -125 52 -176 -29 173 47 91 347 -40 -385
5313 -385 -116 201 -220 -91 -37 -98 -59 -246 237 114 -114 2 188 -104 187 -239 51 64 48 229 206 314
$$ packed form
5152a27J52Q4k89K77j66M4j2K80k76J68k7r0k47K40j86K48j07n3L30m6k71J26
5174E2l7L4j58L47k07k25K56Lk17K08J17l5j43Q8J6k39Q3K43k78M55l66j1M9j34
5198i9L52k60J92k54J2P6Q8j2J65P1k52j20M7M0N0J63k76L2k2J56k64N5j19M83
5222C04n13J44K94j53j1j74K72l28P3J20J29K2q5l08L32k28K62k47J59j85J27
5243FO8n0M8K3k20j57L39k78J32J6o0J39k5K3j39L37k22J32n3j22L8J9j29J92
5267E7j3m9J95j36l2pJ89k28P8n9J55L0j69R2o6r5L58k5l83k11M50p1K1j92L82
5292B71l63J04K10k47Q4K50k23J39p2k33O0j05J77k28J47K02j26M4K56l87l45
5313c85K69L17m21J29N4o1L9j87M83j23k28J16J86k92K91m26K90J3j6J81k3J08
$$ plain form
5335 314 -122 27 -20 -116 -123 28 -33 -14 120 85 -66 -22 -96 105 -255 -42 -125 93 153 -60 -248 109 -124 -51
5359 -51 208 29 -139 -50 -97 -53 367 207 -80 -12 210 -81 -5 -316 99 83 -25 91 -32 -48 -212 -42 42
5382 42 209 301 -212 -66 340 15 -118 5 162 72 98 250 74 -180 -138 -37 245 -202 280 147 -174 89
5404 89 -22 -326 -323 97 -92 -217 -64 -58 110 -105 -89 -194 -94 34 9 -254 190 -124 -47 -141 -23 -45 86
5427 86 151 54 95 -249 75 219 264 207 21 -243 -54 4 -155 52 -177 -22 -20 -11 -193 -98 67 -199 -26 -20 -80
5452 -80 -159 54 40 -19 -41 -29 124 -72 42 -60 163 -6 14 -113 -31 -121 16 -47 -136 128 -59 57 100 -81
5476 -81 -107 -302 179 -24 -231 286 172 21 31 49 97 -100 -55 180 -12 -145 188 -76 -108 32 39 -242 38
5499 38 -15 242 122 -126 -212 163 -4 -20 -170 -18 15 116 126 -374 186 295 62 14 -71 110 -72 -24 30
$$ packed form
5335C14m36J49m7r6pJ51o1J9J34l5j51M4p4K01l60K13q3K18O0k13j88L57k33P3
5359e1K59j79j68Q9m7M4M20j60k87O8K22k91P6l11M15j6j08J16j23j6j64J70Q4
5382D2J67R2n13J46M06l25j33J23J57r0K6J52j76k54M2J01K82m47M82j33l21K63
5404H9j11l04LM20j89j25J53OJ68k15J6j05J00J28k5k63M44l14P7r4J18k2J31
5427H6O5r7M1l44L24J44M5n7j86k64J89N8j59K07k29J55KRj82R5J65k66J73Oo0
5452h0p9K13j4n9k2J2J53j96J14j02K23j69K0j27Q2r0J37o3q9K64j87J16M3j81
5476h1k6j95M81k03k07N17j14j51J0J8M8j97M5K35j92j33L33k64l2J40Pk81K80
5499C8n3K57j20k48q6L75j67j6j50J52L3J01J0n00N60J09k33m8q5J81j82M8N4
$$ plain form
5522 30 -231 76 -54 254 118 -34 32 -10 -175 205 165 -204 -114 -201 178 292 -145 -251 116 13 144 -15
5544 -15 16 99 97 -6 48 -52 109 26 -78 -48 -156 -117 -152 -77 50 -115 -10 -137 2 -3 50 131 -221 -117 -179
5569 -179 -165 -141 -120 -106 231 119 -127 -109 -185 -94 128 64 150 315 -47 -66 -6 113 -90 72 -264 166 -88 20
5593 20 -36 117 92 55 -183 240 1 -65 -138 64 68 -113 119 -81 -40 -276 -104 -21 38 -39 146 -16 32 -92
5617 -92 -88 44 -142 242 24 -92 208 60 195 122 -270 29 118 58 206 -212 250 -193 -50 -11 -36 69 -217
5640 -217 -418 100 -92 -145 69 168 -137 -130 78 -201 -97 -23 -371 79 63 -149 34 -99 -99 18 108 -121 -26
5663 -26 -170 15 -63 136 -75 -37 196 141 -136 30 172 275 -41 -127 -84 -21 -134 66 -182 64 4 0 -123
5686 -123 73 32 203 -11 -157 276 -184 -65 8 9 -516 -131 -318 12 -305 -126 -256 276 183 32 -112 95
$$ packed form
5522C0k61L07j30L08j36j52O6m2j65L80m0l69R0q7L79J14m37j06L67j03J31j59
5544a5L1Q3kj03N4j00J61q3j04L0j08L9l5P5J27j65J05j27J39nN3Q1l52J04o2
5569a79J4K4K1J4L37j12k46J8p6R1K22o4Q6J65l62j9O0J19k03J62l36M30k54J08
5593B0n6J53k5l7k38M23k39o6p3K02Mj81K32k00M1k36J72Q3N9p7J85j62M8j24
5617i2MJ32j86L84k18j16L00j48J35p3l92K99Q9o0J48m18M62m43J43L9k5J05k86
5640b17k01N18j92n3K14R9l05PK08k79J04P4l48M50j6k12J83j33%J17R0k29R5
5663b6j44J85p8J99k11L8K33n5k77J66J42J03l16q6M3O3j13K00k48K46o0mj23
5686a23J96m1J71k14j46M33m60J19P3Jn25L85j87L30l17J79j30N32r3j51j44K07
$$ plain form
5708 95 -45 131 185 -235 -15 213 91 -48 -32 35 22 -22 0 62 -132 -83 -73 49 -88 -87 -36 98 213 -62
5732 -62 180 63 123 131 -210 -103 -57 101 -246 -193 104 -78 187 -287 -56 -227 117 -81 -83 150 203 32 -135
5755 -135 368 100 184 265 19 -197 116 192 140 82 101 72 23 119 287 -111 -192 -144 -40 -113 93 -336 21 -3
5779 -3 28 114 -117 -86 -124 322 73 -86 57 -62 33 -84 -79 57 -42 208 -66 213 -35 71 260 184 -75 -114
5803 -114 65 19 -30 -168 80 65 -182 -173 111 31 -23 245 266 147 61 -102 144 -28 -23 59 82 -232 -214 -57 -64
5828 -64 122 170 31 297 -8 -196 48 114 -48 81 95 -12 59 6 64 -131 -126 -39 -87 19 171 -38 100 -93
5852 -93 59 176 40 131 76 -140 150 -92 92 -28 86 173 -33 171 0 243 63 130 -119 38 -149 14
5874 14 1 -138 -141 -332 -3 50 -48 128 93 67 -112 122 67 -53 229 -1 98 78 -1 163 -11 341 -111 -211
$$ packed form
5708I5j40J76N4m20K20K28j22j39J6O7j3m4K2O2j94M9J0J22j37JN1J34J15k75
5732f2K42j17O0Ql41J07M6J58l47N3K97j82K65m74K31j71L44j98kK33N3j71j67
5755a35N03k68Q4Q1k46k16L13P6n2n8J9k9m9R6J68l98q1M8J04p3K06m29L57k4
5779cL1Q6k31L1l8M46k49j59J43j19R5j17NJ36r9K50k74K79k48J06J89p6k59l9
5803a14J79m6m9j38K48j5k47RK84q0n4K68K1j19q6j63K46j72NQ2K3l14J8J57p
5828f4J86M8j39K66l05j88K44O6j62J29J4j07P1n3N8j95NQ7m8J06J52k09J38j93
5852i3J52J17j36R1n5k16K90k42J84j20J14Q7k06K04j71K43j80O7k49J57j87J63
5874A4j3j39lj91L29N3r8J76l5k6j79K34n5j20K82k30R9k0p9J64j74L52m52j00
$$ plain form
5898 -211 72 65 161 134 83 126 -123 -41 -185 126 108 96 -150 142 86 84 164 58 45 -24 1 24 -111 72 -100 34
5924 34 53 329 -150 -137 8 -270 174 -232 -108 30 -83 109 256 -42 -81 -18 -13 207 72 -21 -63 -20 149
5947 149 2 5 190 96 207 157 -123 -157 91 7 60 19 310 -94 40 -30 64 77 100 -249 -15 -55 -112 -95 0
5972 0 3 19 150 -60 84 163 -92 68 23 -154 13 -87 -97 -212 104 -194 -158 177 242 -199 91 -51 89
5995 89 7 -23 342 -220 46 157 -78 64 -236 37 253 72 197 -82 -51 32 51 -50 -108 148 58 22 211
6018 211 468 110 116 25 -9 -189 -274 -230 82 56 -16 -38 50 90 -144 30 82 393 94 99 10 -59 145 0 -63 -29
6044 -29 149 184 -51 -71 145 166 158 107 2 -108 166 198 -8 115 -121 179 -42 27 33 42 -183 -216 -193 -216 -14
6069 -14 64 96 -250 153 -159 -138 -198 -146 76 -115 -145 227 39 -208 -58 21 -88 122 171 -327 259 72 121
$$ packed form
5898b11K83pR6k7n1M3k49Q2j44L11j8j2k46K92n6kQ0j06j3o9K5K3j35J83j72J34
5924C4J9K76m79J3J45k78M44m06J24J38j13J92J47k98l9O3NK20j35r3m2M3J69
5947A49j47LJ85r4J11n0k80l4K48q4N3m1K91m04J34p0R4J3K3l49K34m0n7J7R5
5972@LJ6J31k10J44P9k55J60m5j77J67j00j0j15L16k98L6L35O5m41K90j42J40
5995H9q2l0L65n62K66J11k35J42l00K73K16j81J25k79L1Q3J9j01n8K56r0l6J89
6018B11K57l58Or1l4j80q5M4L12k6p2k2Q8M0k34J74N2L11k99Nq9o9K04j45o3L4
6044b9J78L5k35k0K16K1qn1j05j10K74L2k06J23k36L00k21O9ORk25l3K3k3K02
6069a4P8L2l46M03l12K1o0N2K22j91l0L72j88k47J50P9j09K10M9m98N86j87M9
$$ plain form
6092 121 -111 -56 68 -177 183 226 66 -79 198 -31 42 76 -116 89 115 82 -109 -23 67 -22 9 142 -36
6115 -36 -48 -159 108 93 34 52 -81 152 -176 -85 168 113 -132 -122 86 44 -291 -209 -44 43 -78 209 -179 -8
6139 -8 -28 139 135 -372 -111 180 113 -123 -45 -64 133 -263 26 -194 -251 189 120 73 85 90 -345 -133 4 87 -94
6164 -94 -62 61 -174 26 126 -1 49 -209 -30 381 69 -128 -120 176 52 -144 -234 12 -213 211 -145 171
6186 171 11 -52 -124 161 101 -132 67 36 211 -7 2 173 80 31 -39 -199 -30 -195 -16 -244 -176 4 -62 -42
6210 -42 -337 -211 -115 -114 -86 16 122 348 158 -47 125 118 156 -216 207 -9 -116 -1 -139 -108 -84 -82 168 -138
6234 -138 60 124 56 158 -78 -54 72 -98 -119 -130 228 -58 -52 -67 103 80 -97 31 -44 -63 -95 -83 2 94 147
6259 147 133 159 56 11 49 -15 216 123 104 -273 -6 -5 -4 -130 132 196 -160 200 -150 30 210 -36 54 -83
$$ packed form
6092A21k32N5J24k45L60M3j60j45K77k29P3L4j92K05K6l3j91Q6R0q9L1J33j78
6115c6j2j11K67j5n9J8j33K33l28R1K53n5k45J0K08m2l35Q2J65Q7j21K87l88J71
6139hk0J67mn07K61K91o7k36P8j9J97l96K89k20n7M40o9m7J2Nm35K12J37Q3j81
6164i4L2J23k35K00J00j27N0k58J79M11l12j97QK96j24j96r0K46k25M24l56L16
6186A71j60o3p2K85o0k33J99l1J75k18RJ71r3m9p0j60J69j65J79k28O8J80o6K0
6210d2k95J26R6JK8J02J06K26j90k05J72pL8l72M23k16j07J15j38L1K4KK50l06
6234a38J98O4o8J02k36K4J26j70k1j1L58k86Oj5J70k3j77J28p5j9l2J2Q5R2N3
6259A47j4K6j03m5L8o4K31r3j9l77K67JJj26K62O4l56L60l50J80J80k46R0j37
$$ plain form
6283 -83 -5 124 166 -138 263 -37 -44 -119 136 99 67 111 -54 -297 69 -343 -171 -156 -78 43 82 192 -139 -77
6307 -77 1 -143 119 -128 -167 129 77 -189 66 -270 -110 93 -122 -163 141 0 91 53 -275 -56 26 2 48
6330 48 -104 250 -16 90 -79 -163 114 271 146 -66 403 -125 302 -56 14 -163 57 5 -194 -33 26 -31
6352 -31 -71 16 -44 -39 -204 185 185 -207 96 196 -64 -238 42 350 281 -16 137 56 131 -138 -124 79 211 224
6376 224 57 92 246 144 -167 -37 110 87 -26 -3 -151 12 -308 89 -85 75 64 -55 26 -20 -71 -10 -4
6399 -4 40 23 -112 -107 -19 -180 -90 14 11 168 -106 6 126 -31 61 -10 -228 253 -134 -12 -76 -85 -38 194 48
6424 48 0 -156 -129 217 -199 -267 -357 -185 -83 -46 69 -77 2 15 -104 -57 231 -47 -184 -23 20 -118 -8
6447 -8 -326 -59 43 8 19 130 68 -50 263 13 -74 115 -62 -64 192 264 -37 -55 281 3 87 198 -49 318
$$ packed form
6283h3P8J29M2l04M01l00pp5K55l7l2M4j65k43L66m12J72J5P8J21L9J10l31O2
6307g7P8j44K62k47l9K96n2k66K55l36J60K03k15m1L04j41R1l8l28K19Q2k4M6
6330D8j52L54k66J06j69q4K77J57j25k12M69n28M27l58P0j77K20n2j99J61N9n7
6352c1m0Q7o0Nj65L89%l92L03J00k60j74K80L08o9k97J53q1P5k69J4K03J32J3
6376B24j67L5J54j02l11J30J47k3j13K3j48J63l20L97j74J60j1j19Q1m6n1O1O
6399dM4j7j35NQ8j61R0J04lJ57k74J12J20j57R2p1k18M81l87J22o4rM7K32j46
6424D8m8j56K7L46m16o8r0J72J02L7J15j46P9J3j19M7K88k78j37J61M3j38J10
6447hl18K67J02l5J1J11o2j18L13k50q7J89j77kK56P2l01j8L36k78Q4J11k47L67
$$ plain form
6471 318 -220 115 198 99 146 186 69 -142 -28 -5 -151 97 156 5 21 -145 -123 -76 51 15 -271 -180 -95 70
6495 70 3 90 19 -36 -181 84 -115 -238 61 -50 20 39 48 33 -84 16 427 -165 -37 -54 25 -2 -197 44
6519 44 141 108 -287 -93 42 -52 -105 29 -119 168 -410 -33 -253 -61 122 -167 56 -39 -93 220 36 -76
6541 -76 -199 -148 52 -105 -286 -121 3 17 26 -40 85 27 -103 -82 -102 59 -240 41 115 44 296 168 -110 6
6565 6 -193 287 -147 -63 -38 -20 35 100 -155 0 16 -7 207 -101 -243 -253 -22 -12 -248 -6 -152 -42 59 8
6589 8 145 -103 -96 44 192 -26 -68 7 209 -1 242 -66 44 -86 -78 -164 54 -15 -229 84 123 -61 -26 -69
6613 -69 -82 -80 -20 187 -57 -45 -9 79 138 -149 -135 38 -62 85 36 96 136 -65 -75 130 -188 -54 -46 -183 133
6638 133 -55 88 30 49 -48 186 167 -62 27 -53 -13 -136 -52 -61 -19 154 166 -337 187 150 0 62 62 -133 199
$$ packed form
6471C18n38L35Q3r9M7M0j17k11J14K3j46K48N9j51J6j66K2M7J27l6k86R1Q5J65
6495G0o7Q7p1n5j45K65j99j23K99j11P0J9Rj5j17J00M11n92J28j7P9k7j95K41
6519D4R7l3l95J94J35r4n3J34j48K87n78L77k20J92J83k89K23r5n4L13j84j12
6541g6j23N1K00j57j81J65J24J4Ro6J25n8j30K1k0J61k99K81P4p1K52j28k78J16
6565Fj99M80m34Q4K5J8N5O5k55J55J6k3K14l08j42j0K31J0k36K42j46J10J01n1
6589HJ37k48PJ40J48k18m2P5K02k10K43l08J10j30Qq6K18o9k14L13L9j84L5m3
6613f9j3KO0K07k44J2L6Q8N9k87J4J73j00J47m9O0M0k01j0K05l18J34Qj37L16
6638A33j88J43n8J9r7K34j9k29Q9q0M0j23Q4rM2J73J2n03N24l7j50O2%j95L32
$$ plain form
6663 199 -44 96 253 83 -221 -20 -43 -53 13 -168 -213 -36 238 -61 -31 172 -189 -321 -400 174 -70 -41
6685 -41 -282 -83 6 67 -27 246 87 -163 174 -82 -51 -146 -197 126 1 -331 -142 116 36 1 -118 -85 -84 -297
6709 -297 -103 -72 207 -53 -192 229 -162 6 114 82 70 -329 121 -128 73 32 -309 -31 171 -172 181
6730 181 424 -168 178 47 21 -81 -122 -43 3 -135 55 -29 27 112 -20 -135 -109 129 -86 51 89 -140 -18
6753 -18 -71 173 95 168 61 -113 -47 -238 187 55 28 225 27 -53 95 87 186 -2 -37 -35 -47 213 -148 -54 -258
6778 -258 50 -398 239 45 -3 -118 34 -94 107 80 47 188 -78 -8 -142 -38 36 -79 -32 92 -12 -21 -209
6801 -209 4 -13 -60 -77 3 -210 -1 5 -232 63 -19 51 30 10 -114 -39 -76 -25 -110 189 66 40 183 156 24
6826 24 126 60 -188 265 -171 363 125 -136 -85 35 -85 141 -217 -42 39 -271 135 225 -138 7 -89 -22
$$ packed form
6663A99k43J40J57j70l04K01k3j0O6j81m5J77K74k99L0K03l61j32p9N74k44K9
6685d1k41J99Q9O1r4K73j59k50L37k56L1r5n1L23j25l32J89K58q0l5j19L3Jk13
6709b97J94L1K79k60j39M21l91J68J08l2j2l99M50k49K01m1l41K78K02l43L53
6730A81K43n92L46j31k6j02m1P9M6j38J90q4N6Q5j32j15K6K38k15J37L8k29J22
6753a8n3K44p8P3j07j74O6j91M25j32k7J97j98q0J48qR9j88l5Kj2K60l61R4k04
6778b58L08m48O37j94m8j15J52j28K01k7l3J41k66P0j34J04P4j15M7J24j04rj88
6801b09K13j7m7j7Q0k13K09Ok37K95q2P0k1k0j24P5l7N1q5K99j23k6J43k7j32
6826B4J02o6k48M53m36N34k38k61N1J20j20K26l58J75Q1l10M06R0l63J45r6O7
$$ plain form
6848 -22 87 69 72 19 -88 -50 31 -3 -123 22 423 190 315 262 -30 -10 -267 252 189 93 -8 95 136 -48
6872 -48 147 -236 -232 -115 -16 -30 18 -260 54 15 -200 -98 -40 -98 -146 -17 -148 -142 72 175 189 -48 -56 112 207
6897 207 -111 -53 -66 6 81 189 286 -18 32 60 -7 -19 -103 -2 150 -71 86 248 123 -80 89 198 -178
6920 -178 71 -106 104 172 191 234 17 -137 -69 -5 -81 -252 -43 -186 -340 -51 -21 -57 -39 -69 -34 -58 -80 30
6944 30 0 -216 -140 -22 -86 9 63 307 42 81 22 288 -138 128 185 -193 143 -21 -159 90 110 -84 96
6967 96 -57 -53 84 98 -22 -136 -14 155 163 9 367 4 -118 31 5 -75 -31 112 269 87 109 120 219 205
6991 205 -91 122 -122 12 -163 -36 175 12 -234 -107 -193 35 -44 23 -209 71 -120 102 44 -137 79
7012 79 -120 -134 73 -101 285 157 110 -160 -126 42 87 -19 -529 -161 -69 -111 -84 3 106 36 21 -46 -97 -153 -41
$$ packed form
6848b2J09j8Ln3j07L8Q1l4j20J45M01k33J25n3k92K0k57N19o3r6j01J03M1j84
6872d8J95l83MJ17R9j4M8k78L14l9k15J02N8n8m8J29j31OK14J03J4k37qJ68R5
6897B07l18N8j3P2P5J08R7l04N0K8o7j2q4J01J52k21J57J62j25k03J69J09l76
6920a78K49j77K10O8J9M3k17j54O8O4p6j71K09j43j54K89L0l6J8l0L5k4k2J10
6944C0l0k16P6J18o4R5N4K44k65L9n9K66m26K66N7l78L36j64j38K49K0j94J80
6967I6j53MJ37J4j20j14J22J69Qj54L58l63j22J49k6q0M4J43J57j82K2J1R9j4
6991B05k96K13k44J34j75J27K11j63k46J27q6K28p9O7k32K80j91K22n8j81K16
7012G9j99j4K07j74L86j28m7k70L4J68M5j06n10L68R2m2K7Q7J03p0j5o7n1n6J12
$$ plain form
7037 -41 179 -208 44 -87 -28 -105 -48 79 -205 -132 -106 37 182 93 -28 12 -15 192 -23 -11 172 118 -2 -83
7061 -83 -25 -21 5 24 93 133 35 -32 150 38 -42 -181 116 -150 -133 246 180 -37 168 -91 28 -54 -100 -73 78
7086 78 62 -73 -43 -86 -8 101 104 -13 215 -51 31 16 -195 -9 -8 126 88 49 -28 16 13 -6 36 277 245 -36 217
7113 217 -269 54 42 -151 -205 -119 -26 -42 -196 139 -34 -115 80 -197 -165 256 -69 -206 109 -117 -30 -140 -157
7136 -157 194 121 -166 194 -96 47 -85 94 21 -34 46 186 -99 53 47 -104 -56 43 -46 -222 -149 -226 -111 -251
7160 -251 289 -79 -27 114 101 72 -63 68 168 174 17 92 -107 -108 111 -201 -41 -238 121 92 -102 -236 -8
7183 -8 98 -166 24 -67 -87 -15 173 98 -1 -404 89 21 -228 -81 -6 -77 196 42 -36 -6 -70 -127 60 166 -212
7208 -212 -112 95 61 59 122 -168 -92 33 77 -33 84 -11 -73 85 -61 72 -81 -157 -43 164 178 132 1 84
$$ packed form
7037d1K20l87K52j31N9p7N7J27k84P3K6J43J45q9j21M0k7K07k15J2J83n4j20q1
7061h3N8MK6J9O9M0r8o7J82j12q0j39K97k66J7L79o6k17K05k59J19q2m6K7J51
7086G8j6j35L0m3P8J09Lj17K28k66Q2j5k11J86JJ34l8l9p7M4lj9M2K41l2k81K53
7113B17m86L23j2j93n4Q6R3j6j54L35j73q1J95k77L2M21l25j37L15k26Q7j10j7
7136a57L51p3k87L60k90J43j32J79p3n5Q0J40k85J52oj51M8R9q9j76P3p7J15j40
7160b51N40l68N2J41j3k9j35J31J00Oj57P5j99jK19l12J60j97L59k9j94j34K28
7183hJ06k64J90r1k0P2J88p5r9m03M93o8k49J47P5p1K73j54p8L0o4n7J87J06l78
7208b12J00K07l4kO3k90P6J25M4j10J17r5o2J58j46J33j53p6J14K07J4m6j31Q3
$$ plain form
7232 84 -68 -109 -239 196 -67 -63 -76 -182 44 207 -13 -86 -81 -247 -80 -291 -233 -20 50 -42 173 81 232 80
7256 80 105 -179 348 51 141 -189 130 -147 -175 441 -97 14 120 -306 -16 190 -80 110 -5 203 331
7277 331 236 16 -8 163 -144 -82 138 114 379 17 235 155 32 -28 -310 -70 -223 148 87 -264 -92 -103 -114
7300 -114 -63 70 -117 143 72 -97 10 105 23 -177 89 -84 -73 138 277 -272 -129 -146 295 13 -237 -19
7322 -19 178 3 -110 -13 -4 229 89 -189 28 -75 43 59 -56 -56 -102 -153 -100 -142 9 28 -73 122 -221 97
7346 97 -106 45 159 -6 37 163 -55 88 -171 -137 -220 -62 -29 -135 165 97 65 -152 -249 -331 13 109 97 75
7370 75 -62 141 -154 -123 -79 103 -89 96 357 105 157 -31 73 33 183 123 169 -73 41 50 -44 -134 96 -97
7394 -97 65 159 30 -146 -118 -325 -49 -4 -159 19 237 -220 98 -84 -26 135 1 72 -46 -37 34 -54 -203
$$ packed form
7232H4j52m1j30M35k63Mj3j06K26J63k20p3Nj66J67k11N8K13P0r2K15r2J51j52
7256H0K5k84N27k97R0l30L19k77k8O16n38J11J06m26K90K06k70J90j15K08J28
7277C31r5k20k4J71l07O2K20k4K65l62K18q0j23o0k82K40j53L71o1l51J72j1j1
7300a14N1J33j87K60p1j69J07R5q2k00K66j73J1K11J39n49J43j7M41k82k50K18
7322a9J97j75j13R7RK33j40k78K17j03J18J6j15%m6n1N3m2J51J9j01J95l43L18
7346I7k03J51J14j65M3J26k18J43k59L4q3J58L3j06L00o8l2k17r7q2L44R6j2k2
7370G5j37K03k95L1M4J82j92J85K61k52N2j88J04m0J50o0M6k42J14Rr4r0K30j93
7394i7J62R4j29j76K8k07K76M5j55J78K18m57L18j82N8J61j34P1j18RP1q8j49
$$ plain form
7417 -203 362 19 259 33 -63 46 22 239 94 -29 -93 -47 -40 -168 -122 -117 24 168 -257 171 -149 142 184
7440 184 68 -127 -52 -19 -160 30 -128 179 -191 -290 89 116 -478 -280 -149 37 -194 -228 -34 304 -171 -246
7462 -246 243 -138 24 -65 -64 89 -45 -52 132 227 -36 -245 -46 48 141 221 -145 -242 115 128 109 -173 15 21 295
7487 295 -55 306 22 -60 222 -5 -124 -181 -74 -103 215 30 -137 -67 27 -264 -115 -176 118 -66 -123 -33 106
7510 106 -154 -76 -59 -141 -91 -15 8 52 180 32 -1 -11 105 -280 218 -28 58 89 131 256 -85 139 13 -144
7534 -144 -28 -77 -229 -251 -27 -17 -100 -129 -47 -117 -146 25 75 32 -116 367 -334 71 -85 27 86 186 176 109
7558 109 139 26 283 -61 -71 218 122 55 -7 211 175 -133 -130 -18 215 6 133 87 -44 -182 92 -193 -89
7581 -89 86 24 11 169 -93 208 -42 99 23 29 91 -8 -225 116 87 -96 10 333 -189 146 24 45 -34 -23
$$ packed form
7417b03N65l43K40k26r6J09k4K17j45j23o4M6Pj28M6NJ41J44m25M28l20K91M2
7440A84j16j95P5L3j41J90j58L07l70r9L79K7n94J98J31J86k31l4J94L38m75p5
7462b46M89l81J62q9JJ53j34pJ84R5k63k09J99R4R3Q0l66r7L57J3j9k82J88OK74
7487B95l50L61k84q2K82k27j19n7J07k9L18j85j67P0R4k91J49o1K94j84n7R0J39
7510A06k60P8J7q2N0P6K3M4J28j48l3j0J16l85M98k46Q6L1M2J25l41K24j26j57
7534a44J16m9j52k2K24J0q3k9Q2p0k9J71N0m3j48M83p01M05j56J12N9J00j0o7
7558A09L0j13K57l44j0K89r6o7o2K18l6l08LJ12K33k09J27m6j31j38K74k85J04
7581h9J75o2j3J58k62L01k50J41p6OO2r9k17L41k9j83J06L23n22L35j22K1p9J1
$$ plain form
7605 -23 -227 -127 164 -18 -124 132 -190 18 155 76 184 -331 246 -62 -124 -11 133 48 -13 -31 -103 -84 98
7628 98 11 7 153 64 -4 -224 -227 45 -33 50 -261 164 -136 9 -89 -110 -41 -9 116 -109 210 22 -121 -179 -6
7653 -6 -74 32 290 266 9 128 51 161 175 55 101 -264 157 129 -378 14 63 49 -295 -16 -38 -29 -89 242 -12
7678 -12 -14 -43 -23 -12 112 27 -43 65 -209 -80 37 -36 42 0 -284 -111 125 26 -167 -217 -160 62 -346 -318 -3
7703 -3 4 -65 228 185 65 -79 -199 88 160 204 -165 -121 -17 11 -90 131 6 -131 60 -152 107 133 23 -49
7727 -49 -225 26 -8 -63 156 81 -326 16 -69 -122 3 9 27 156 271 132 145 -302 -26 -72 -101 60 -87 -192
7751 -192 -116 82 172 127 137 123 -66 -162 -242 -104 -21 105 284 212 50 -23 -142 166 351 178 236 34 0 -45
7775 -45 314 -40 32 -96 72 8 -7 57 54 356 -41 69 13 240 214 60 57 -215 -189 -270 139 -83 -42 153 45
$$ packed form
7605b3k04J00K91j82j06K56l22K08J37p9J08n15N77l08o2J13J44q5o1j8p2J9J82
7628I8q7mJ46q9o8k20lK72p8Q3l11M25l00J45r8k1O9L2J25k25L19j88j43n8J73
7653fo8J06K58k4k57J19p7J10J4j20M6l65M21k8n07L92M9j4l44K79k2Ro0L31k54
7678a2kk9K0J1J24q5p0J08k74J29J17p3P8m2k84J73K36r9j93n0N7K22m08K8L15
7703cPo9K93m3j20j44j20K87P2M4l69M4J04K8j01K21j25j37J91k12K59K6j10p2
7727d9j76K51l4n5K19p5m07L42q5n3J25OJ8J29J15j39J3m47K76m6k9J61j47j05
7751a92P6J98R0m5J0j4j89r6q0J38Q3J26J79p2j62p3j19L08J85j73N8k02l4m5
7775d5L59l54P2j28J68o4j5O4lL02l97J10n6K27k6j54lk72K6q1M09k22M1J95j08
$$ plain form
7800 45 216 -147 24 -22 -149 303 -51 -127 81 121 226 27 -91 41 -113 -36 -241 43 50 146 237 -180 15
7823 15 -72 -153 -223 -98 -146 -163 136 -141 91 -191 219 129 -113 31 149 238 9 -205 57 69 74 52 69 -139
7847 -139 29 -155 150 298 -124 -266 19 2 -5 46 -190 -122 -71 -11 -195 -310 6 70 55 -228 33 -134 235
7870 235 67 -65 -14 -36 104 155 -200 -144 10 -90 -127 103 -80 57 299 193 -81 -186 36 -175 -60 71
7892 71 66 314 -241 -360 218 -186 -101 -155 124 -234 -7 48 -25 15 -81 -71 25 -89 65 -116 -224 33 7 110
7916 110 -70 -28 -45 38 60 -87 -142 -140 -7 171 36 112 132 64 -114 -58 -110 67 -159 -130 -20 221 76 -60
7940 -60 102 -120 -80 -108 46 249 -64 -122 157 -186 -133 67 -115 -35 224 -104 -176 -1 179 -102 -125 -6 96
7963 96 21 22 -231 108 294 277 -32 -336 -144 89 -48 -24 -13 -40 -41 -89 -87 109 408 51 55 -40 -64 34 78 -140
$$ packed form
7800D5J71l63J71m6j27M52l54p6K08M0J05j99j18J32j54P7k05K84PR6R1m17J95
7823A5q7q1p0J25m8j7K99k77K32k82M10r0k42J44J18Q9k29k14K62J2Nk2J7k08
7847a39J68j84L05J48m22j42K85j7pN1k36O8N1O0j84j15L16O4j5k83K61j67L69
7870B35j68j32N1k2J40N1l55N6J54j00l7K30j83J37K42j06k74j05K22k11J15J31
7892G1nK48n55j19N78m04Q5n4K79l58K27N5p3M0r6J0R6j14J54j81j08K57k6J03
7916A10j80M2j7Q3K2j47n5KJ33J78j35P6K0o8j78N6n2J77k26K9J10K41j45j36
7940f0J62k22M0k8J54K03l13n8K79l43N3K00j82Q0K59l28p2J75J80k81k3J19J02
7963I6p5Jk53L39J86j7l09l04J92K33j37K4J1k7jm8KJ96K99l57Mr5k4R8M4k18
$$ plain form
7989 -140 -106 -46 -168 94 43 185 47 98 116 7 54 -159 -125 -271 -24 -163 199 58 -77 -27 -106 -189 -19
8012 -19 -133 140 17 -28 -45 39 34 -152 -74 -370 -55 56 375 207 -290 -24 84 -42 177 -280 19 -44 -196
8035 -196 116 41 -24 -215 -276 -45 -20 16 47 210 -237 -197 14 -249 -94 -346 107 104 111 157 -144 -142 -220 7 -238
8060 -238 -155 -40 115 52 35 75 -204 -22 20 165 10 65 -274 43 101 39 132 -197 -81 194 -67 -92 18
8083 18 173 147 -86 -6 0 30 -15 -168 152 -64 123 -54 -97 23 -296 -26 159 5 -194 -73 -131 -59 -242
8106 -242 207 154 -33 104 -297 -229 -37 341 -85 140 -134 -114 -43 251 -41 -78 -268 156 151 320 20 134
8128 134 32 -162 1 98 36 -119 -99 -77 171 -162 134 -5 -233 -47 19 -126 264 -225 295 -77 123 30
8150 30 -92 53 -33 68 -147 43 48 83 -133 -116 -246 12 -43 -101 -118 -87 207 196 -298 -166 16 -104 -182 -211
$$ packed form
7989a40L4O0j22K62n1J42j38N1J8j09M7k13L4j46K47j39L62j41j35N0p9q3J70
8012a9j14K73j23m5j7Q4nj86P8k96L15J11L19j68m97K66J08j26K19m57K99o3j52
8035a96L12p5o5j91o1K31K5L6L1J63m47M0K11k63J55k52M53lPM6l01Kp8K27k45
8060b38Q3J15J55o3j7M0k79J82M2J45j55N5l39L17N8o2R3l29J16K75k61k5J10
8083A8J55k6k33Q0OL0m5j53L20k16J87j77m3J20l19K70J85j54j99J21n8P2j83
8106b42M49n3j87J37m01O8J92L78m26K25k74K0P1K94k92l7j90M24nJ69l00J14
8128A34j02j94J63R7o2j55K0K2K48l33K96j39k28J86O6j45L90m89N20l72K00r3
8150C0j22J45q6J01k15J90NL5k16J7j30K58n5n8j7L1K94j1m94J32J82j20p8k9
$$ plain form
8174 -211 -41 -102 84 -236 -138 -183 -219 -182 9 61 29 -91 65 4 219 -134 -2
$$ packed form
8174b11J70o1J86l20R8m5l6L7J91N2l2j20J56o1K15l53J32
8191b
$$ Imaginary data points
##PAGE= N=2
##DATA TABLE= (X++(I..I)), XYDATA
$$ plain form
0 0 0 0 0 0 0 0 0 0 0 0 0 0 0 0 0 0 3 -8 8 -8 8 -8 11 -16 16 -19 24 -25 32 -33 41 -46 51 -59 66 -75 84 -92
38 -92 105 -116 131 -143 159 -177 196 -216 239 -264 289 -318 351 -388 426 -471 521 -576 641 -716
58 -716 802 -904 1028 -1180 1372 -1629 1984 -2512 3380 -5061 9527 -49105 -109841 -532
72 -532 68212 32654 -32301 -355 71525 91148 52472 32369 45650 74731 92390 82321 36663
85 36663 11904 51173 94338 46132 -38764 -35688 44600 55007 -34642 -87587 -27485 33692
97 33692 -3384 -74384 -70679 -15659 3972 -22524 -47509 -45486 -18187 14329 16874 -23544 -47853
110 -47853 -2556 53604 24690 -50611 -47716 33867 59262 -15439 -65829 -14148 46251 20821
122 20821 -40416 -43951 1072 22834 5013 -16721 -20178 -1246 31670 41548 6899 -22119 15200
$$ packed form
0@%%%%%%%%%%%%%%%%Lj1J6j6J6j6J9k7L2l5M3m9N7o5P4q7R7j10J25j41J59j76
38i2J97k21K47k74L02l36L73m12M55n03N53o07O69p39Q14q97R92j097J217j357
58g16J518j706J932k208K552l001L613m496N892q441J4588n8632o0736J09309
72e32O8744l5558o4955L1946P1880J9623l8676k0103J3281K9081J7659j0069m5658
85C6663k4759L9269M3165m8206q4896L076Q0288J0407q9649n2945O0102O1177
97C3692l7076p1000L705N5020J9631k6496k4985K023K7299L2516K545m0418k4309
110d7853M5297N6160k8914p5301K895Q1583K5395p4701n0390N1681O0399k5430
122B0821o1237l535M5023K1762j7821k1734l457J8932L2916R878l4649k9018L7319
$$ plain form
135 15200 72758 55946 -11832 -17229 52389 83267 22368 -29900 2835 53765 35650 -19864
147 -19864 -36196 -11281 4023 -8637 -32857 -51785 -47242 -19059 -5842 -40473 -77381 -49797
159 -49797 9559 6357 -52841 -62505 4854 48891 9167 -34086 -4532 50861 53320 15342 2634
172 2634 25888 47803 48208 30896 9188 7214 33508 49093 14511 -31378 -18077 32170 28251
185 28251 -33450 -57932 -8047 28861 -7498 -54978 -40448 4759 10138 -20863 -35131 -19316
197 -19316 2065 11062 3307 -16082 -19237 9758 34801 11353 -29945 -19748 30759 37992 -13326
210 -13326 -39570 342 38378 12837 -30771 -25924 10443 20552 -2167 -18968 -12448 4889
222 4889 18957 15453 -5512 -14806 11337 40938 24171 -17524 -13520 34379 47970 3213 -27246
$$ packed form
135A5200N7558j6812o7778n397O9618L0878o0899n2268L2735N0930j8115n5514
147a9864j6332K4915J5304j2660k4220j8928M543K8183J3217l4631l6908K7584
159d9797N9356l202n9198r664O7359M4037l9724m3253K9554N5393K459l7978j2708
172B634K3254K1915M05j7312k1708j974K6294J5585l4582m5889J3301N0247l919
185B8251o1701k4482M9885L6908l6359m7480J4530M5207N379l1001j4268J5815
197a9316K1381Q997p755j9389l155K8995K5043k3448m1298J0197N0507P233n1318
210a3326k6244L9912L8036k5541m3608M847L6367J0109k2719j6801O520J7337
222D889J4068l504k0965r294K6143K9601j6767m1695M004M7899J3591m4757l0459
$$ plain form
235 -27246 3510 40491 21511 -20360 -24218 3193 13554 -5069 -24688 -27057 -16353 -2168
247 -2168 -3299 -26377 -41691 -19893 12087 1544 -37101 -37144 8910 30404 -3530 -31288 -4315
260 -4315 34936 28407 -3657 -7966 16294 32199 23259 7146 884 8375 24199 26725 3704
273 3704 -17444 -2714 26983 18787 -22048 -31585 5253 25997 -4114 -36088 -20480 13139 11614
286 11614 -16825 -26349 -8024 8221 6121 -6433 -15095 -9923 9314 18338 -589 -22183 -9525
299 -9525 22736 21992 -14263 -27045 5894 29982 6770 -24399 -14844 15244 18275 -4610 -17207
312 -17207 -5749 9466 11912 1588 -10224 -9482 8649 21485 5321 -18568 -10322 21504 25110
325 25110 -7680 -23812 2838 27438 11094 -18770 -15930 9929 16640 -1987 -15895 -10986 2498
$$ packed form
235b7246L0756L6981j8980m1871l858K7411J0361j8623j9619k369J0704J4185
247b168j131k3078j5314K1798L1980j0543l8645m3M6054K1494l3934k7758K6973
260d315L9251o529l2064m309K4260J5905q940j6113o262P491J5824K526k3021
273C704k1148J4730K9697q196m0835r537L6838K0744l0111l1974J5608L3619j525
286A1614k8439r524J8325J6245k100j2554q662N172J9237R024j8927k1594J2658
299i525L2261p44l6255j2782L2939K4088k3212l1169R555L0088L031k2885j2597
312a7207J1458J5215K446j0324j1812P42J8131J2836j6164k3889Q246L1826L606
325B5110l2790j6132K6650K4600j6344k9864K840K5859O711j8627j3908M909J3484
$$ plain form
338 2498 7893 697 -13983 -17443 -144 15536 2627 -21843 -17488 12632 21268 -6965 -24522
351 -24522 -2857 23408 13823 -12673 -13841 8293 18911 6564 -7754 -6971 4840 13433 9321
364 9321 -5908 -13516 1371 18640 8840 -16999 -17719 9544 20574 -3965 -24401 -8871 15607
377 15607 11448 -12293 -17714 -229 11919 4887 -8287 -11290 -2056 9696 9554 -4916 -14692 -1365
391 -1365 17802 12353 -11881 -16331 8419 22080 3095 -17961 -7733 15282 15123 -5137 -13839
404 -13839 -1659 11037 7835 -4451 -11021 -5132 7096 9724 -4286 -17035 -6550 13081 10903
417 10903 -12204 -19242 2052 17993 3631 -16765 -11160 10418 14558 -1917 -11779 -2887 9767
430 9767 10879 836 -8232 -4717 8338 13869 1533 -12729 -5742 13544 14282 -6726 -17377 -525
$$ packed form
338B498N395p196j4680l460J7299J5680j2909k4470M355L0120Q636k8233j7557
351b4522K1665K6265r585k6496j168K2134J0618j2347j4318P83J1811Q593m112
364I321j5229p608J4887J7269r800k5839p20K7263J1030k4539k0436J5530K4478
377A5607m159k3741n421J7485J2148p032j3174l003R234J1752j42j4470r776J3327
391a365J9167n449k4234m450K4750J3661j8985k1056J0228K3015j59k0260q702
404a3839J2180J2696l202j2286o570N889J2228K628j4010j2749J0485J9631k178
417A0903k3107p038K1294J5941j4362k0396N605K1578M140j6475r862Q892J2654
430I767J112j0043r068L515J3055N531j2336j4262O987J9286P38k1008j0651J6852
$$ plain form
444 -525 16279 5857 -14079 -13227 4464 11993 -274 -12563 -8176 3716 8377 517 -9944 -9014
458 -9014 4046 12083 2102 -12843 -8458 10309 14414 -4009 -15793 -2691 14897 9025 -9304
471 -9304 -11918 3525 12769 3481 -8539 -8165 2379 9662 4129 -7399 -9303 2880 13095 5174
485 5174 -10449 -8878 8858 15575 -52 -13329 -3209 13472 11312 -5035 -10787 1038 11340
498 11340 5899 -6587 -9747 -1269 6798 3697 -8254 -13051 -2312 8586 3191 -12317 -13536 2513
512 2513 11186 -907 -14534 -7711 9003 10709 -2640 -9389 -423 11048 9530 -850 -5756 695
526 695 10871 10317 -977 -7792 530 12772 9035 -6879 -10980 2550 12105 2145 -12469 -9537
540 -9537 4808 8609 -2936 -11904 -6295 4870 6103 -3475 -10382 -5141 5733 7834 -2065 -9968
$$ packed form
444e25J6804j0422j9936Q52J7691P529j2267j2289M387J1892M661p860j0461R30
458i014J3060Q037r981j4945M385J8767M105j8423j1784J3102J7588n872j8329
471i304k614J5443R244r288j2020L74J0544P283n533j1528j904J2183J0215p921
485E174j5623J571J7736O717j5627j3277J0120J6681k160j6347n752J1825J0302
498A1340n441j2486l160Q478Q067l101j1951m797J0739J0898n395j5508j219J6049
512B513Q673j2093j3627O823J6714J706j3349o749Q966J1471j518j0380m906O451
526F95J0176n54j1294o815Q322J2242l737j5914m101J3530R555r960j4614K932
540i537J4345L801j1545q968N609J1165J233r578o907N241J0874K101r899p903
$$ plain form
554 -9968 -2829 9823 8990 -4856 -10901 720 11598 5202 -8242 -8113 4330 10372 1809 -8288
568 -8288 -5986 4368 7993 193 -7915 -5755 5128 9329 419 -8325 -3803 8896 10018 -2305
582 -2305 -9576 -504 11076 7404 -5346 -7885 2541 9786 3656 -6618 -7480 1840 6995 730
596 730 -9031 -8744 931 6450 -807 -10688 -8388 3501 6952 -3558 -11461 -4421 7392 6953 -4000
611 -4000 -7881 864 9853 6835 -2843 -4926 2975 10206 6328 -2930 -4929 3868 10497 4702 -6172
626 -6172 -6048 4425 8636 -350 -9690 -5988 4629 6212 -3899 -9942 -4038 4701 3860 -5208 -9165
641 -9165 -2328 5686 4019 -4560 -7704 206 8295 4824 -5265 -6247 3061 9353 2710 -6076 -4519
656 -4519 5581 8896 760 -6385 -3039 5848 6937 -1316 -7370 -2720 5492 5577 -3031 -8162 -1634
$$ packed form
554i968P139J2652q33j3846o045J1621J0878o396j3444J29J2443O042q563j0097
568h288K302J0354L625p800q108K160J0883M201q910q744M522J2699J122j2323
582b305p271R072J1580l672j2750k539J0426P245o130j0274q62R320N155o265
596G30r761K87R675N519p257r881K300J1889L451j0510p903P040J1813m39j0953
611d000l881Q745Q989l018r678k083P901P231l878r258j999Q797O629n795j0874
626f172J24J0473M211q986r340L702J0617J583j0111o043N904Q739q41r068l957
641i165O837Q014j667q579l144P910Q089l471j0089r82R308O292o643q786J557
656d519J0100L315q136p145L346Q887J089q253o054M650Q212Q5q608n131O528
$$ plain form
671 -1634 6404 4402 -4988 -8189 -294 6705 2494 -6327 -6891 2133 6947 1267 -6507 -4875 3830
686 3830 6735 434 -6356 -3277 5160 7311 -443 -6217 -1838 6523 6514 -2197 -6791 -405 7238 4654
702 4654 -3981 -6172 1411 7270 3003 -5049 -5344 1845 6454 1312 -6224 -4747 2804 6386 -143
717 -143 -6959 -3963 4243 5679 -1904 -7314 -2467 5192 4191 -3238 -7024 -908 5535 3409 -4259
732 -4259 -6303 428 6249 2204 -4934 -5090 2281 6772 1989 -5234 -3663 3964 7042 1098 -4948
747 -4948 -1779 5740 6963 -127 -4944 -677 6084 5341 -1945 -5751 -610 5219 3175 -4827 -7112
762 -7112 -941 4128 424 -6906 -7236 -466 3595 -937 -7498 -5881 1660 4613 -570 -5789 -2779
777 -2779 5108 6328 467 -3280 1099 7687 7418 384 -2399 2806 8256 6034 -1297 -3292 2036
$$ packed form
671a634Q038k002r390l201P895O999m211q821n64R024M814n680p774J632Q705
686C830K905o301o790L079Q437K151p754n774M379Q361rq711m594O386P643k584
702D654q635k191P583N859m267q052k95P189M609n142p536J477P551L582o529
717a43o816K996Q206J436p583n410M847P659j001p429l786O116O443k126p668
732d259k044O731N821m045p138j56P371M491m783p223J571P627L078n944o046
747d948L169P519J223p090m817M267O761p43p286l806N141N829k044q002k285
762g112O171N069l704p330l30O770M061m532o561J617P541K953n183n219L010
777b779P887J220n861l747M379O588k69p034k783N205N450k222p331j995N328
$$ plain form
792 2036 6465 2363 -4599 -5371 574 3452 -1629 -7878 -6981 -237 1645 -3533 -8519 -5422 1100 2439
808 2439 -3411 -7021 -2234 3981 4032 -1954 -4053 1009 6716 4797 -1622 -2794 3021 7028 3696 -2246
824 -2246 -2757 3362 5948 1829 -4268 -2833 3113 4745 -540 -4897 -2379 3969 4738 -1316 -4347 -332
840 -332 5178 4705 -1381 -4010 991 5536 3350 -2976 -4072 863 4379 710 -5329 -5575 -637 1938
856 1938 -2443 -7903 -6831 -1162 686 -4046 -7980 -5226 977 2019 -2832 -5219 -998 5158 5269
871 5269 393 -814 4359 9265 7578 2264 1229 6667 9609 6466 551 36 4675 6671 1749
886 1749 -3839 -3311 986 1702 -3741 -8408 -6362 -1751 -1118 -6732 -9473 -5775 -783 -918 -5694 -6995
902 -6995 -2162 2721 1513 -2811 -2734 2527 6150 3914 -484 -86 4800 7444 3275 -1142 0 4715
$$ packed form
792B036M429m102o962p72N945K878n081o249Q97O744J882n178m986L097O522J339
808B439n850l610M787O215N1n986k099N062N707j919o419j172N815M007l332n942
824b246n11O119K586m119o097J435N946J632n285m357K518O348P69o054l031M015
840c32N510m73o086k629N001M545k186o326j096M935L516l669o039k46M938K575
856A938m381n460J072N669J848m732l934K754O203J042m851k387M221O156J11
871E269m876j207N173M906j687n314j035N438K942l143n915n15M639J996m922
886A749n588N28M297P16n443m667K046M611O33n614k741L698M992j35m776j301
902f995M833M883j208m324P7N261L623k236m398L98M886K644m169m417J142M715
$$ plain form
918 4715 5739 848 -2960 -652 3563 3408 -1830 -4337 -1212 2824 2526 -2626 -4212 126 4205 2745
934 2745 -2395 -2961 1939 4655 1816 -2487 -2234 2115 3968 -46 -4228 -3414 776 1602 -3028 -6782
950 -6782 -4648 -250 298 -4506 -7031 -3665 1197 594 -3668 -4800 50 4155 2908 -1142 -719 4395
966 4395 7301 5314 1532 2048 6384 8346 4630 559 1531 5479 5652 762 -2882 -1385 1973 1175
982 1175 -4137 -7087 -4040 -769 -2324 -6704 -7849 -3945 -406 -1980 -5649 -5816 -1349 1897 264
997 264 -3422 -2153 2812 5164 2156 -1105 624 5166 6065 2179 -740 1312 5342 4309 557 -1732
1013 -1732 736 3774 2465 -1993 -3265 -125 2694 879 -3171 -3663 325 2886 753 -3299 -2453
1028 -2453 1668 2953 -108 -3261 -1577 2444 2991 -838 -2843 -987 2417 1395 -2159 -3825 -1859
$$ packed form
918D715J024m891l808K308M215j55n238k507L125M036k98n152j586M338M079j460
934B745n140n66M900K716k839m303K53M349J853m014m182Q14M190Q26m630l754
950f782K134M398N48m804k525L366M862o03m262j132M850M105j247m050M23N114
966D395K906j987l782N16M336J962l716m071R72L948J73m890l644J497L358p98
982A175n312k950L047L271j555m380j145L904L539j574l669j67M467L246j633
997B64l686J269M965K352l008l261J729M542Q99l886k919K052M030j033l752k289
1013a732K468L038j309m458j272L140K819j815m050m92L988K561k133m052Q46
1028b453M121J285l061l153J684M021N47l829k005J856L404j022l554j666J966
$$ plain form
1043 -1859 1614 593 -3312 -4313 -1275 1848 311 -3230 -3371 456 2897 500 -2564 -1133 2821
1058 2821 4160 1368 -994 573 4164 4481 1235 -1052 513 3696 3658 -300 -2523 177 2959 1323
1074 1323 -2499 -3805 -778 1725 -413 -3847 -3772 -589 1064 -879 -3744 -3168 306 2091 -470 -3121
1090 -3121 -1430 2291 2649 143 -1987 255 3732 3290 -494 -1456 1135 3826 2395 -970 -1540 1130
1106 1130 2832 1343 -1989 -2547 535 2064 -220 -3468 -2921 597 1781 -1369 -3988 -2441 1334
1121 1334 1433 -1771 -3435 -1092 2263 1900 -1108 -2010 485 3075 2294 -817 -1036 1643 4058 2509
1137 2509 -489 -467 2640 3810 1523 -1500 -1118 2030 2585 -348 -2882 -1548 989 525 -2377 -3867
1153 -3867 -2063 531 -215 -2926 -4149 -1833 851 312 -2460 -3012 145 2448 897 -1709 -1394 2086
$$ packed form
1043a859L473j021l905j001L038L123j537l541j41L827K441k397l064J431L954
1058B821J339k792k362J567L591L17l246k287J565L183l8l958k223K700K782j636
1074A323l822j306L027K503k138l434P5L183J653j943k865N76L474J785k561k651
1090c121J691L721L58k506k130K242L477m42l784r62K591K691j431l365n70K670
1106A130J702j489l332n58L082J529k284l248N47L518J184l150k619J547L775
1121A334R9l204j664K343L355l63l008r02K495K590p81l111k19K679K415j549
1137B509k998K2L107J170k287l023L82L148N55k933k534J334K537m64k902j490
1153c867J804K594p46k711j223K316K684n39k772n52L157K303j551k606L15L480
$$ plain form
1169 2086 3678 1583 -821 11 2936 3577 1373 -804 278 2581 2992 20 -1809 -201 2344 1754
1185 1754 -1196 -2662 -285 2024 712 -2280 -2370 388 2340 292 -2396 -1733 1080 2337 204 -2224
1201 -2224 -1278 993 1517 -410 -3005 -1739 817 560 -2268 -3979 -1925 507 -405 -3047 -3748 -1084
1217 -1084 1075 223 -2141 -1869 1097 3029 1639 150 814 3558 5139 3238 1679 2157 4837 5525
1233 5525 2967 386 1534 3672 2569 -599 -2530 -1193 226 -1110 -4261 -5191 -3708 -2146 -3650
1248 -3650 -5757 -5948 -3658 -2057 -2895 -4516 -3926 -486 1167 74 -1348 323 3218 4463 2600 1382
1264 1382 2759 5142 5049 2593 1279 3105 4592 3407 717 -503 970 2367 947 -1802 -2642 -686
1280 -686 422 -1068 -3546 -3002 -471 379 -1348 -3086 -1887 609 1407 -780 -2024 -525 1217 1403
$$ packed form
1169B086J592k095k404Q32K925O41k204k177J082K303M11k972j829J608K545n90
1185A754k950j466K377K309j312k992r0K758J952k048k688O63K813J257k133k428
1201b224R46K271N24j927k595J266K556k57k828j711K054K432r12k642p01K664
1217a084K159q52k364K72K966J932j390j489O64K744J581j901j559M78K680O88
1233E525k558k581J148K138j103l168j931J337J419j336l151r30J483J562j504
1248c650k107j91K290J601q38j621N90L440J653j093j422J671K895J245j863j218
1264A382J377K383r3k456j314J826J487j185k690j220J473J397j420k749q40J956
1280f86J108j490k478N44K531Q50j727j738J199K496P98k187j244J499J742J86
$$ plain form
1296 1403 -888 -2010 -725 1002 293 -2420 -3283 -1574 3 -1177 -3356 -3287 -1110 273 -732 -2179
1312 -2179 -1407 1164 2498 1180 366 1837 4296 5112 3515 2401 3771 6080 5733 3401 1947 2908
1328 2908 4134 2676 -65 -1437 -246 615 -1946 -4605 -4916 -3908 -3108 -4914 -6910 -6467 -4365 -3226
1344 -3226 -4325 -5449 -4214 -1234 39 -1171 -1825 548 3353 3940 2355 1706 3830 5885 5316 3084
1360 3084 2579 4067 5060 3538 1054 944 2257 2467 777 -1494 -1626 42 279 -1605 -3271 -2434 -309
1377 -309 140 -1927 -2630 -1438 733 591 -1282 -1791 82 1325 488 -1420 -2042 -264 534 -460 -2658
1394 -2658 -2800 -1070 -512 -1972 -3810 -2863 -988 -382 -1703 -3002 -1306 1187 1678 513 109 1877
1410 1877 4209 4130 2971 2621 4212 6006 5154 3297 2475 3889 4638 2678 617 -145 591 527 -1665
$$ packed form
1296A403k291j122J285J727p09k713q63J709J577j180k179O9K177J383j005j447
1312b179P72K571J334j318q14J471K459Q16j597j114J370K309l47k332j454R61
1328B908J226j458k741j372J191Q61k561k659l11J008Q00j806j996M43K102J139
1344c226j099j124J235K980J273j210o54K373K805N87j585o49K124K055n69k232
1360C084n05J488R93j522k484j10J313K10j690k271j32J668K37j884j666Q37K125
1377c09M49k067p03J192K171j42j873n09J873J243q37j908o22J778P98r94k198
1394b658j42J730N58j460j838R47J875O06j321j299J696K493M91j165m04J768
1410A877K332p9j159l50J591J794q52j857q22J414P49j960k061p62P36o4k192
$$ plain form
1427 -1665 -3373 -3957 -2790 -3119 -5038 -6311 -5589 -3567 -3800 -4908 -5468 -3899 -1398 -1212 -2122 -1845 218
1444 218 2359 2136 1366 1806 3604 5056 4356 3137 2529 4066 4561 2991 1262 1278 2321 2336 343 -1313
1462 -1313 -737 240 -201 -1846 -2639 -1483 -276 -725 -2059 -2437 -1017 563 -28 -1453 -1652 301 1123
1479 1123 160 -1073 -1334 341 852 -493 -1980 -1707 -350 -182 -1718 -2605 -2161 -646 -443 -1657 -2313
1496 -2313 -909 588 734 -494 -245 1376 3007 2941 1500 2165 3550 4329 3612 2399 2083 3245 3614
1513 3614 2092 361 353 1014 973 -1100 -2616 -2381 -1576 -1933 -3745 -4680 -4001 -2779 -3011 -4097 -4290 -2674
1531 -2674 -1287 -1211 -2094 -1410 90 1888 1343 416 1154 2855 3765 2631 1509 2072 3564 3631 2031 770
1549 770 1315 1940 1633 -120 -917 -126 600 17 -1654 -2066 -850 -71 -581 -1794 -1700 -281 554 -249 -1406
$$ packed form
1427a665j708n84J167l29j919j273P22K022k33j108n60J569K501J86r10K77K063
1444B18K141k23p70M40J798J452p00j219o08J537M95j570j729J6J043J5j993j656
1462a313N76R77m41j645p93J156J207m49j334l78J420J580n91j425j99J953Q22
1479A123r63j233k61J675N11j345j487K73J357J68j536q87M44J515K03j214o56
1496b313J404J497J46j228K49J621J631o6j441O65J385P79p17j213l16J162L69
1513C614j522j731qO61m1k073j516K35Q05l57j812r35O79J222k32j086j93J616
1531b674J387P6q83O84J500J798n45r27P38J701R10j134j122N63J492O7j600j261
1549G70N45O25l07j753p97P91P26n83j671m12J216P79n10j213R4J419Q35q03j157
$$ plain form
1568 -1406 -1078 324 940 -17 -1015 -819 738 547 -316 -1402 -830 267 22 -1167 -2234 -1367 -68
1585 -68 -395 -1482 -1548 -642 484 421 -717 -559 1163 1883 1084 644 895 2378 2753 1936 965 1288 2473
1604 2473 2306 1176 -73 305 1240 1116 -557 -1602 -861 -95 -940 -2434 -2629 -2018 -864 -1867 -2464
1621 -2464 -2725 -1285 -566 -960 -1565 -1612 289 1140 293 -690 299 1819 1885 1260 434 960 2310 1740 695
1640 695 233 900 1916 990 -154 -702 2 679 109 -1187 -1333 -280 251 -613 -1487 -1020 185 490
1658 490 -537 -1325 -762 839 616 -293 -860 -306 770 733 -301 -660 85 1185 743 -732 -861 265
1676 265 736 460 -560 -956 456 964 93 -1145 -320 566 893 -154 -861 -11 799 904 109 43 23
1695 23 1105 892 -51 -811 227 991 625 -728 -1012 397 611 -229 -1179 -1069 -279 417 -291 -1253 -765
$$ packed form
1568a406L28J402O16r57r98J96J557j91q63j086N72J097k45j189j067Q67J299
1585f8l27j087o6R06J126o3j138J58J722P20p99m40K51J483L75q17r71L23J185
1604B473j67j130j249L78R35j24j673j045P41P66q45j494j95O11J154j003n97
1621b464k61J440P19l94o05m7J901Q51q47r83R89J520O6o25q26N26J350n70j045
1640F95m62O67J016r26j144n48P04O77n70j296j46J053N31q64q74M67J205L05
1658D90j027p88N63J601k23r09n67N54J076l7j034l59P45J100m42j475j29J126
1676B65M71k76j020l96J412N08q71j238Q25Q86L27j047p07Q50Q10J05p95o6k0
1695B3J082k13r43p60J038P64l66j353k84J409K14q40r50J10P90O96p08r62M88
$$ plain form
1714 -765 97 387 -210 -894 -400 235 583 -53 -767 97 902 931 -111 -291 552 1186 661 -178 21 725
1734 725 1040 688 -501 -249 285 695 250 -682 -642 172 577 -202 -1294 -794 468 264 -646 -1517 -389
1753 -389 528 99 -939 -761 -94 542 467 -347 -447 -37 808 310 -257 -571 647 1317 581 -616 -101
1772 -101 790 1146 104 -721 -220 600 306 -720 -754 -294 269 -35 -487 -1070 -604 205 347 -565 -1055 -446
1792 -446 665 316 -505 -558 722 1162 17 -595 182 975 1122 134 -352 617 704 573 313 -316 -157 508
1812 508 620 -252 -1124 -244 566 55 -1077 -1437 52 189 -633 -934 -501 -123 109 -699 -559 -181 93
1831 93 373 63 -477 -478 723 733 -158 -943 -101 928 564 -359 -491 217 1198 107 -600 -236 577 876
1851 876 7 -124 -164 240 647 633 91 -28 589 1130 379 -495 -470 1157 708 -561 -931 -33 691 -40
$$ packed form
1714g65Q62K90n97o84M94O35L48o36p14Q64Q05K9j042j80Q43O34n25q39J99P04
1734G25L15l52j189K52N34M10m45r32M0Q14M05p79j092N00J262k04r10q71J128
1753c89R17m29j038J78O67O36p5q14j00M10Q45m98n67l14J218O70p36j197N15
1772a01Q91L56j042q25N01Q20k94j026l4M60N63l04m52n83M66Q09J42r12m90O09
1792d46J111l49q21n3J280M40j145o12P77P93J47r88m86R69Q7j31k60o29J59O65
1812E08J12q72q72Q80Q10n11j132l60J489J37q22l01M33L78K32q08J40L78K74
1831I3K80l10n40jJ201J0q91p85Q42J029l64r23j32P08R81j091p07L64Q13K99
1851H76q69j31m0M04M07j4n42j19O17N41p51q74K5J627m49j269l70Q98P24p31
$$ plain form
1871 -40 -647 -892 -261 112 -471 -420 -764 -640 -8 -131 -356 -999 -323 543 377 -1038 -467 807 750 -265
1891 -265 -660 460 1183 642 -229 330 704 670 678 317 -37 173 325 654 -38 -567 7 985 161 -875
1911 -875 -885 206 780 -605 -1193 -546 92 -99 -539 -692 -315 302 337 -31 -93 -329 164 680 227 -632
1931 -632 -21 948 585 -324 -717 664 1006 79 -1049 37 492 539 -366 -583 -317 -137 -242 -69 -647
1950 -647 -631 -213 141 -252 -1184 -575 443 237 -980 -818 188 380 156 -694 -164 1002 1001 59 107 681
1970 681 402 659 476 195 -410 412 958 187 -516 -362 721 584 -470 -664 66 695 -287 -1048 -328
1989 -328 -12 13 -358 -424 -178 -345 13 37 -135 -557 -92 866 465 -733 -514 568 659 -387 -864 86
2009 86 676 15 -608 -69 133 -33 -140 338 338 80 358 590 344 -270 439 1251 955 -10 25 1119 1448
$$ packed form
1871d0o07k45O31L73n83N1l44J24O32j23k25o43O76Q66j66j415N71J274n7j015
1891b65l95J120P23n41q71N59L74l4Ql61l54K10J52L29o92n29N74R78q24j036
1911h75j0J091N74j385n88O47O38j91m40j53L77O17L5l68o2k36M93N16m53q59
1931f32O11R69l63r09l93J381L42r27j128J086M55M7r05k17K66J80j05J73n78
1950f47J6M18L54l93r32O09J018k06j217J62J006J92k24q50N30J166jr42M8N74
1970F81k79K57j83k81o05Q22N46p71p03J54J083j37j054j94P30O29r82p61P20
1989c28L16K5l71o6K46j67L58K4j72m22M65R58m01j198K19J082R1j046m77R50
2009H6N90o61o23N39K02j66j07M78%k58K78K32k46o14P09Q12k96r65L5J094L29
$$ plain form
2030 1448 244 -402 600 801 559 -128 -264 75 -166 -505 -639 -922 -1218 -904 -695 -983 -1564 -1078 -289
2049 -289 -427 -1189 -1026 -308 629 -174 -547 319 1056 1035 412 636 1153 926 1129 1158 1163 734 957 1253 659
2070 659 -66 -274 664 439 -861 -1163 -430 -83 -916 -1535 -1234 -404 -969 -1545 -845 -642 -555 -334 -329 -239 -622
2091 -622 241 593 568 -232 -271 1024 1089 -138 -481 601 914 143 -434 199 520 199 -166 -183 25 -323
2111 -323 273 79 112 -110 181 1047 821 35 173 989 1544 271 -2 674 1068 347 -144 -261 510 -92
2131 -92 -852 -818 -865 -1305 -1145 -937 -1628 -1819 -1776 -722 -973 -1661 -1538 -209 312 -77 -754 359 1265 950
2151 950 454 1266 1986 1906 1618 1553 1857 1423 1359 1421 1241 522 522 606 362 -623 -1221 -388 124 -1192 -2350 -1119
2173 -1119 -1018 -1159 -1709 -1038 -804 -831 -1001 -611 -390 -398 -287 428 503 159 58 1200 1079 90 37 919 1418
$$ packed form
2030A448j204o46J002K01k42o87j36L39k41l39j34k83k96L14K09k88n81M86P89
2049b89j38p62J63P18R37q03l73Q66P37k1o23K24N17k27K03K9Nm29K23K96n94
2070F59p25k08R38k25j300l02P33L47q33o19L01Q30n65n76P00K03Q7K21NR0l83
2091f22Q63L52k5q00l9J295O5j227l43J082L13p71n77O33L21l21l65j7K08l48
2111c23N96j94L3k22K91Q66k26p86J38Q16N55j273k73O76L94p21m91j17P71o02
2131i2p60L4m7m40J60K08o91j91M3J054k51o88J23J329N21l89o77J113R06l15
2151I50m96Q12P20q0k88o5L04m34o4O2j80p19%Q4k44r85n98Q33N12j316j158J231
2173a119J01j41n50O71K34k7j70L90K21qJ11P15P5l44j01J142j21r89n3Q82M99
$$ plain form
2194 1418 550 -447 262 816 315 -197 -337 276 -9 -40 -8 239 -74 -5 709 769 191 171 1272 1085 425
2215 425 72 940 1270 290 -230 -91 228 -353 -978 -758 -907 -1099 -1452 -1167 -1348 -2028 -1631 -873 -894 -1825
2235 -1825 -1810 -302 -42 -652 -709 599 1281 875 502 1430 2064 1908 1592 1964 1899 1762 1641 1391 1035 620
2255 620 565 695 905 -559 -704 -248 -437 -1118 -1732 -1046 -837 -1488 -1728 -1562 -1168 -1075 -1187 -843 -555 -629 -299
2276 -299 160 40 -188 18 938 849 -198 245 604 1139 208 -468 269 678 101 -120 26 178 95 36 -107
2297 -107 209 -26 3 625 647 -124 148 1023 1167 322 -49 843 1226 477 -122 18 396 216 -627 -240 -395
2318 -395 -754 -864 -1270 -1185 -1201 -1566 -907 -1144 -1303 -1269 -490 -173 -750 -860 255 546 387 277 746 1287 1367
2339 1367 789 1221 1513 1327 1025 1112 981 769 374 653 509 -231 -591 170 341 -806 -1129 -869 -401 -1026
$$ packed form
2194A418q68r97P09N54n01n12j40O13k85l1L2K47l13O9P14O0n78k0J101j87o60
2215D25l53Q68L30r80n20J39L19n81o25K20j49j92l53K85j81o80L97P58k1r31
2235a825J5J508K60o10n7J308O82m06l73R28O34j56l16L72o5j37j21k50l56m15
2255F20n5J30K10j464j45M56j89o81o14O86K09o51k40J66L94R3j12L44K88p4L30
2276b99M59j20k28K06R20q9j047M43L59N35r31o76P37M09n77k21J46J52q3n9j43
2297a07L16k35K9O22K2p71K72Q75J44q45l71Q92L83p49n99J40L78j80q43L87j55
2318c95l59j10m06Q5j6l65O59k37j59L4P79L17n77j10J115K91j59j10M69N41Q0
2339A367n78M32K92j86l02Q7j31k12l95K79j44p40l60P61J71j147l23K60M68o25
$$ plain form
2359 -1026 -1483 -812 -515 -305 -770 -570 -249 -408 -202 150 297 -359 -48 348 558 -317 191 349 643 166
2379 166 -429 275 743 387 -452 -59 277 199 -143 -78 304 -109 54 271 245 -3 -99 758 418 44 316
2400 316 711 1137 361 30 -45 434 44 -335 -210 123 -296 -505 -749 -461 -455 -620 -601 -340 -780 -410 82
2421 82 -75 -812 -653 -230 412 87 -445 471 811 658 38 8 755 458 328 212 461 198 166 486 440
2442 440 -65 -157 558 261 -285 -568 -21 169 89 -697 -232 -31 40 -352 -212 82 181 23 118 176 1 -33
2464 -33 556 152 -287 -106 312 317 -66 -231 140 539 116 -227 -2 224 133 -277 -26 -159 -110 -62 80 -211
2486 -211 -264 -32 185 -131 -225 -216 143 496 -218 -394 -297 251 -124 -199 -161 320 55 95 90 235 333 425 469 170
2510 170 -165 -28 489 399 -91 -278 358 530 -92 -483 -10 292 197 -845 -508 -67 -165 -283 -389 -286 -261
$$ packed form
2359a026m57O71K97K10m65K00L21j59K06L52J47o56L11L96K10q75N08J58K94m77
2379A66n95P04M68l56q39L93L36p8l42O5L82m13J63K17k6k48r6Q57l40l74K72
2400C16L95M26p76l31p5M79l90l79J25L33m19k09k44K88Oj65J9K61m40L70M92
2421H2j57p37J59M23O42l25n32R16L40j53o20l0P47k97j30j16K49k63l2L20m6
2442D40n05r2P15k97n46k83N47J90q0p86M65K01P1l92J40K94R9j58R5N8j75l4
2464c3N89m04m39J81M18Nl83j65L71L99m23l43K25K26r1m10K51j33M9M8J42k91
2486b11n3K32K17l16r4RL59L53p14j76R7N48l75p5L8M81k65M0nJ45R8R2M4k99
2510A70l35J37N17r0m90j87O36J72o22l91M73L02r5j042L37M41r8j18j06J03K5
$$ plain form
2531 -261 -208 80 -93 -390 -482 -27 260 -40 -367 249 360 45 56 69 648 385 78 -29 312 338 -65 25
2553 25 -14 112 -249 -38 -12 -166 -27 228 249 -212 -272 -75 437 92 -199 337 175 237 97 13 226 131 -12
2576 -12 -75 36 -237 -313 -231 -48 -632 -49 -376 -3 -840 -584 -393 102 -9 -393 -12 621 412 333 96 380
2598 380 782 865 740 543 659 646 749 562 234 18 614 254 -141 -498 -61 -175 -436 -920 -722 -741 -736 -761
2620 -761 -931 -847 -625 -378 -539 -376 -516 -221 -12 391 19 91 528 591 455 547 478 701 566 296 310 576
2642 576 159 409 180 149 28 65 63 -156 -183 -116 216 -331 -457 -280 122 527 35 -83 -368 -35 140 -169
2664 -169 46 -63 123 -103 -536 -100 -489 -456 -465 -776 -735 -713 -309 -434 -717 -766 -628 -55 -230 -293 -239 665 440
2687 440 445 325 690 735 610 723 919 940 1095 888 623 274 590 447 560 312 -519 -164 -242 -452 -981 -999
$$ packed form
2531b61N3K88j73k97r2M55K87l00l27O16J11l15J1J3N79k63l07j07L41K6m03R0
2553B5l9J26l61K11K6j54J39K55K1m61o0J97N12l45k91N36j62O2j40q4K13r5j43
2576a2o3J11k73p6Q2J83n84N83l27L73q37K56J91M95j11l84L81O33k09p9k37K84
2598C80M02Q3j25j97J16j3J03j87l28k16N96l60l95l57M37j14k61m84J98j9Nk5
2620g61j70Q4K22K47j61J63j40K95K09M03l72P2M37O3j36R2o9K23j35k70J4K66
2642E76m17K50k29l1j21L7kk19k7O7L32n47j26J77M02M05m92j18k85L33J75l09
2664a69K15j09J86k26m33M36l89L3rl11M1K2M04j25k83m9J38N73j75o3N4R04k25
2687D40Nj20L65M5j25J13J96K1J55k07k65l49L16j43J13k48q31L55p8k10n29j8
$$ plain form
2709 -999 -581 -440 -972 -977 -1045 -621 -668 -601 -709 -307 -386 -113 -9 -1 350 516 386 302 420 620 892 407 617
2732 617 666 281 327 158 84 231 121 89 52 -25 -102 -167 -289 -278 -497 -84 141 6 -180 -166 -92 -119 101 56
2756 56 -51 235 64 -148 -85 -50 -158 82 -105 -292 -185 -336 -465 -465 -418 -120 -106 -97 -258 -420 -67 10 293
2779 293 62 123 708 756 937 710 635 734 857 800 777 668 521 414 219 108 -81 -383 -322 -453 -579 -808
2801 -808 -267 -579 -745 -964 -653 -757 -504 -692 -643 -542 -230 -241 -289 58 392 367 407 136 529 615 806 830
2823 830 352 498 648 579 506 246 -172 149 142 93 -151 140 -113 -120 -47 -361 -142 132 -49 -147 -432 -331 -64
2846 -64 127 -32 -309 -168 -185 93 -113 -138 -38 -197 -103 -149 -438 -268 -181 -267 -481 -433 -157 -11 -612 -102 -146
2869 -146 -59 76 -14 195 188 260 462 402 277 410 396 398 -123 431 365 337 308 301 82 -244 -268 -101 -219 -317 -346 -330
$$ packed form
2709i99M18J41n32no8M24m7O7j08M02p9K73J04QL51J66j30q4J18K00K72m85K10
2732F17M9l85M6j69p4J47j10l2l7p7p7o5j22J1k19M13K25j35j86J4P4k7K20m5
2756E6j07K86j71k12O3L5j08K40j87j87J07j51j29%M7K98J4Rj61j62L53P7K83
2779B93k31O1N85M8J81k27p5R9J23n7k3j09j47j07j95j11j89l02O1j31j26k29
2801h08N41l12j66k19L11j04K53j88M9J01L12j1m8L47L34k5M0k71L93Q6J91K4
2823H30m78J46J50o9p3k60m18L21pm9k44K91k53pP3l14K19K74j81r8k85J01K67
2846f4J91j59k77J41j7K78k06k5J00j59R4m6k89J70Q7q6k14M8K76J46o01N10m4
2869a46Q7J35r0K09pP2K02o0j25J33j4Kn21N54o6k8k9pk19l26k4J67j18r8k9J6
$$ plain form
2895 -330 -442 -595 -254 -321 -320 -539 -372 -288 -374 -245 -170 -53 243 241 -53 43 274 515 472 138 214 235 263 322 67
2920 67 17 -47 366 228 -10 -306 -219 11 -160 -255 -284 -142 -213 -22 -179 -470 -158 89 -25 147 155 -14 228
2943 228 112 171 20 174 266 102 -52 -129 13 297 -138 -210 -107 168 35 -54 -115 83 242 -19 -123 21
$$ packed form
2895c30j12j53L41o7Jk19J67Q4q6J29P5J17K96kk94R6K31K41m3l34P6K1K8N9k55
2920F7n0o4M13j38k38k96Q7K30j71r5k9J42p1J91j57k91L12K47j14J72Qj69K42
2943B28j16N9j51J54R2j64j54p7J42K84m35p2J03K75j33q9o1J98J59k61j04J44
$$ [...]
8191B47
##END NTUPLES=NMR FID
##END=
