##TITLE=1H_SA_NO2(CN)2
 CDCl3, 8 sc, 
 26.07.2021
##JCAMPDX= 6.0         $$ Bruker NMR JCAMP-DX V2.0
##DATA TYPE= NMR FID
##DATA CLASS= NTUPLES
##ORIGIN= UXNMR, Bruker Analytische Messtechnik GmbH
##OWNER= root
$$ XWIN-NMR		Version 3.5
$$ Mon Jul 26 13:16:35 2021 Russian Standard Time (UT+4h)  she@DPX200
##.OBSERVE FREQUENCY= 200.131506
##.OBSERVE NUCLEUS= ^1H
##.DELAY= (6, 6)
##.ACQUISITION MODE= SIMULTANEOUS
##.ACQUISITION SCHEME= undefined
##.AVERAGES= 8
##.DIGITISER RES= 18
##SPECTROMETER/DATA SYSTEM= spect
##.PULSE SEQUENCE= zg30
##.SOLVENT NAME= CDCl3
##.SHIFT REFERENCE= (INTERNAL, CDCl3, 0, 15.7039)
##AUDIT TRAIL= $$ (NUMBER, WHEN, WHO, WHERE, WHAT)
$$ ##TITLE= Audit trail, XWIN-NMR		Version 3.5
$$ ##JCAMPDX= 5.01
$$ ##ORIGIN= Bruker BioSpin GmbH
$$ ##OWNER= she
$$ F:/spectra/data/she/nmr/H-F/1/audita.txt
$$ ##AUDIT TRAIL=  $$ (NUMBER, WHEN, WHO, WHERE, WHAT)
(   1,<2021-07-26 13:15:13.98 +0400>,<she>,<DPX200>,
      <created by zg, POWCHK disabled, PULCHK disabled
       configuration hash MD5:
       00 E9 B6 7A A2 85 ED C7 34 08 36 98 17 FE 4E 26
       data hash MD5: 16K
       39 54 A3 30 80 D0 24 A2 42 01 AA E7 E5 01 0D 48>)
$$ ##END=
$$ 
$$ hash MD5
$$ D6 8E FE 90 6D 84 B2 BE 91 E3 F8 AD F2 8A 9B B8
##$RELAX= 
##$RELAX= 
##$RELAX= 
##$RELAX= 
##$RELAX= 
##$RELAX= 
$$ Bruker specific parameters
$$ --------------------------
##$DU= <F:/spectra>
##$EXPNO= 1
##$NAME= <H-F>
##$PROCNO= 1
##$TYPE= <nmr>
##$USER= <she>
##$AMP= (0..31)
100 100 100 100 100 100 100 100 100 100 100 100 100 100 100 100 100 100 
100 100 100 100 100 100 100 100 100 100 100 100 100 100 
##$AQSEQ= 0
##$AQ_mod= 1
##$AUNM= <au_zg>
##$AUTOPOS= <>
##$BF1= 200.13
##$BF2= 200.13
##$BF3= 200.13
##$BF4= 200.13
##$BF5= 200.13
##$BF6= 200.13
##$BF7= 200.13
##$BF8= 200.13
##$BYTORDA= 1
##$CFDGTYP= 0
##$CFRGTYP= 5
##$CHEMSTR= <none>
##$CNST= (0..31)
1 1 145 1 1 1 1 1 1 1 1 1 1 1 1 1 1 1 1 1 1 1 1 1 1 1 1 1 1 1 1 1 
##$CPDPRG= <>
##$CPDPRG1= <>
##$CPDPRG2= <>
##$CPDPRG3= <>
##$CPDPRG4= <mlev>
##$CPDPRG5= <mlev>
##$CPDPRG6= <mlev>
##$CPDPRG7= <mlev>
##$CPDPRG8= <mlev>
##$CPDPRGB= <>
##$CPDPRGT= <>
##$D= (0..31)
0 1.2 0 0 0 0 0 0 0 0.06 0 0.03 0 0 0 0 0.0002 0 0 0 0 0 0 0 0 0 0 0 0 
0 0 0 
##$DATE= 1627290913
##$DBL= (0..7)
120 120 120 120 120 120 120 120 
##$DBP= (0..7)
150 150 150 150 150 150 150 150 
##$DBP07= 0
##$DBPNAM0= <>
##$DBPNAM1= <>
##$DBPNAM2= <>
##$DBPNAM3= <>
##$DBPNAM4= <>
##$DBPNAM5= <>
##$DBPNAM6= <>
##$DBPNAM7= <>
##$DBPOAL= (0..7)
0.5 0.5 0.5 0.5 0.5 0.5 0.5 0.5 
##$DBPOFFS= (0..7)
0 0 0 0 0 0 0 0 
##$DE= 6
##$DECBNUC= <off>
##$DECIM= 32
##$DECNUC= <off>
##$DECSTAT= 4
##$DIGMOD= 1
##$DIGTYP= 9
##$DL= (0..7)
0 120 120 120 120 120 120 120 
##$DP= (0..7)
150 150 150 150 150 150 150 150 
##$DP07= 0
##$DPNAME0= <>
##$DPNAME1= <>
##$DPNAME2= <>
##$DPNAME3= <>
##$DPNAME4= <>
##$DPNAME5= <>
##$DPNAME6= <>
##$DPNAME7= <>
##$DPOAL= (0..7)
0.5 0.5 0.5 0.5 0.5 0.5 0.5 0.5 
##$DPOFFS= (0..7)
0 0 0 0 0 0 0 0 
##$DQDMODE= 0
##$DR= 18
##$DS= 0
##$DSLIST= <SSSSSSSSSSSSSSS>
$$ [...]
##$SUBNAM2= <"">
##$SUBNAM3= <"">
##$SUBNAM4= <"">
##$SUBNAM5= <"">
##$SUBNAM6= <"">
##$SUBNAM7= <"">
##$SUBNAM8= <"">
##$SUBNAM9= <"">
##$SW= 20.0188882624521
##$SWIBOX= (0..15)
0 0 2 0 0 0 0 0 0 0 0 0 0 0 0 0 
##$SW_h= 4006.41025641026
##$TD= 16384
##$TD0= 1
##$TE= 0
##$TE2= 300
##$TE3= 300
##$TEG= 300
##$TL= (0..7)
0 120 120 120 120 120 120 120 
##$TP= (0..7)
150 150 150 150 150 150 150 150 
##$TP07= 0
##$TPNAME0= <>
##$TPNAME1= <>
##$TPNAME2= <>
##$TPNAME3= <>
##$TPNAME4= <>
##$TPNAME5= <>
##$TPNAME6= <>
##$TPNAME7= <>
##$TPOAL= (0..7)
0.5 0.5 0.5 0.5 0.5 0.5 0.5 0.5 
##$TPOFFS= (0..7)
0 0 0 0 0 0 0 0 
##$TUNHIN= 0
##$TUNHOUT= 0
##$TUNXOUT= 0
##$USERA1= <user>
##$USERA2= <user>
##$USERA3= <user>
##$USERA4= <user>
##$USERA5= <user>
##$V9= 5
##$VALIST= <valist>
##$VCLIST= <CCCCCCCCCCCCCCC>
##$VD= 0
##$VDLIST= <DDDDDDDDDDDDDDD>
##$VPLIST= <PPPPPPPPPPPPPPP>
##$VTLIST= <TTTTTTTTTTTTTTT>
##$WBST= 1024
##$WBSW= 4
##$XGAIN= (0..3)
0 0 0 0 
##$XL= 0
##$YL= 0
##$YMAX_a= 111784
##$YMIN_a= -88910
##$ZGOPTNS= <>
##$ZL1= 120
##$ZL2= 120
##$ZL3= 120
##$ZL4= 120
##$ABSF1= 10
##$ABSF2= 0
##$ABSG= 5
##$ABSL= 3
##$ALPHA= 0
##$AQORDER= 0
##$ASSFAC= 0
##$ASSFACI= 0
##$ASSFACX= 0
##$ASSWID= 0
##$AUNMP= <proc_1d>
##$AZFE= 0.1
##$AZFW= 0.1
##$BCFW= 1
##$BC_mod= 2
##$BYTORDP= 1
##$COROFFS= 0
##$CY= 11.3945322036743
##$DATMOD= 1
##$DC= 2
##$DFILT= <>
##$DTYPP= 0
##$F1P= 17.5019972093344
##$F2P= -2.517084195857
##$FCOR= 0.5
##$FTSIZE= 0
##$FT_mod= 4
##$GAMMA= 1
##$GB= 0.15
##$INTBC= 1
##$INTSCL= 1
##$ISEN= 128
##$LB= 0.24
##$LEV0= 0
##$LPBIN= 0
##$MAXI= 10000
##$MC2= 0
##$MEAN= 0
##$ME_mod= 0
##$MI= 1.114404
##$NCOEF= 0
##$NC_proc= 0
##$NLEV= 6
##$NOISF1= 3.799351
##$NOISF2= 2.8
##$NSP= 1
##$NTH_PI= 0
##$NZP= 0
##$OFFSET= 15.70392
##$PC= 1
##$PHC0= -12269.9
##$PHC1= 1.800994
##$PH_mod= 1
##$PKNL= yes
##$PPARMOD= 0
##$PSCAL= 0
##$PSIGN= 0
##$REVERSE= no
##$SF= 200.130013532006
##$SI= 16384
##$SIGF1= 3
##$SIGF2= 2
##$SINO= 400
##$SIOLD= 16384
##$SREGLST= <1H.CDCl3>
##$SSB= 0
##$STSI= 0
##$STSR= 0
##$SW_p= 3612.71676300578
##$SYMM= 0
##$S_DEV= 0
##$TDeff= 0
##$TDoff= 0
##$TI= <>
##$TILT= no
##$TM1= 0
##$TM2= 0
##$TOPLEV= 0
##$USERP1= <user>
##$USERP2= <user>
##$USERP3= <user>
##$USERP4= <user>
##$USERP5= <user>
##$WDW= 1
##$XDIM= 8192
##$YMAX_p= 0
##$YMIN_p= 0
$$ End of Bruker specific parameters
$$ ---------------------------------
##NTUPLES= NMR FID
##VAR_NAME=  TIME,          FID/REAL,        FID/IMAG
##SYMBOL=    X,             R,               I
##VAR_TYPE=  INDEPENDENT,   DEPENDENT,       DEPENDENT
##VAR_FORM=  AFFN,          ASDF,            ASDF
##VAR_DIM=   8192,          8192,            8192
##UNITS=     SECONDS,       ARBITRARY UNITS, ARBITRARY UNITS
##FACTOR=    0.0002496,     1,               1
##FIRST=     0,             0,               0
##LAST=      2.0444736,     0,               0
##MIN=       0,             -88910,          0
##MAX=       2.0444736,     111784,          0
$$ Real data points
##PAGE= N=1
##DATA TABLE= (X++(R..R)), XYDATA
0@%%%%%%%%%%%%%%%%qJ6j6J6j6J8k6L2l4M2m9N7o6P5q9J01j11J25j43J64j86K07
38A09k32K60k88L19l55L95m36M81n33N88o48P13p85Q66r53J050j160J283j423
57g49J582j766J983k242K557k947L450m130N096o598R283j5593O1209N5935j3469
72I3601J8183j1624K387l174J955r510j791p59p599j3370J291j1818j2676p439
86C7657q117j1660j0370p748n213j5320o820m111j3794q359l361r257o196m100
100g6769m89m476n140M190n30n696N716K742j001M864O526N562L072Q186J0756
115d2487J200P579J2739K589O695J1752O301O082P488R043N359K282R195M083
129D9900j38O810K987n4K671J341R17k735j819J876n852m230O94n903n000k646
$$ y = [0, 0, 0, 0, 0, 0, 0, 0, 0, 0, 0, 0, 0, 0, 0, 0, 0, -8, 8, -8, 8, -8, 10, -16, 16, -18, 24, -25, 32, -34, 41, -48, 53, -58, 67, -76, 88, -98, 109, -123, 137, -151, 168, -187, 208, -228, 253, -280, 308, -340, 373, -412, 454, -499, 551, -609, 674, -749, 833, -933, 1050, -1192, 1365, -1582, 1868, -2262, 2834, -3764, 5519, -10074, 51135, 107070, 93601, 111784, 100160, 102547, 99373, 101328, 91818, 90027, 89268, 81669, 68299, 69590, 57772, 45096, 37657, 29540, 17880, 7510, -238, -5451, -20771, -27591, -31702, -45496, -53855, -57216, -66473, -72669, -76769, -77258, -81734, -86874, -82684, -83214, -88910, -83194, -80452, -81453, -76589, -70063, -64501, -61429, -53243, -42487, -41287, -33708, -20969, -18380, -11685, 67, 6368, 12450, 19938, 28981, 34340, 36622, 45817, 49900, 49762, 56572, 59559, 59505, 62176, 63517, 64434, 61699, 59880, 61756, 55904, 51674, 52368, 46465, 41465, 38819]
145C8819m934n293o884l348m770r700k135l632q862k837k930o011m141l509j575
160c1742n038l281K410m260j959L571j873n41K186J166J632N01L843L759r0N304
176b4412M733N54M720L648K853L383K322N239K473J173O407J574O01M546R45M92
192B1251J562J175J714j723J336K047l475N59R50l556j011p61k103j789k863L32
208A3645k745l974J211l244l864L1l041k057j415j713k12k867o77P06l322k18
224a3756P63k177K44l77P26O43j083K452P63j438K837O10n97K587O93J413Q55
241d842J202K731p84J137L353j387J030K376m62J218Q54Q08Q12r44J675L52k107
258G022J949k48j551J215p78N3n77j049Q26j624j205Q81k105m28K33j235q6j391
$$ y = [38819, 33885, 28592, 21708, 18360, 13590, 3890, 1755, -1877, -10739, -13576, -16506, -22517, -26658, -30167, -31742, -36780, -40061, -37651, -41911, -43870, -40299, -42172, -42713, -40527, -39361, -37729, -37228, -33385, -29626, -29716, -24412, -19679, -19125, -14405, -10757, -7904, -4521, -2199, 3040, 5513, 6686, 13093, 14667, 15268, 19814, 20759, 21251, 22813, 23988, 25702, 23979, 25315, 27362, 23887, 24446, 25396, 21840, 20829, 20068, 17965, 16176, 13313, 13645, 10900, 6926, 8137, 4893, 1029, 1060, -1981, -4038, -5453, -7166, -7378, -10245, -10922, -10216, -13538, -13756, -12993, -15170, -14926, -15303, -14577, -13934, -15017, -12565, -11802, -13240, -10403, -9793, -10390, -7803, -7110, -5697, -4842, -3640, -909, -1693, -556, 2797, 1410, 2440, 4816, 4354, 5572, 6426, 7234, 8046, 7102, 8777, 9129, 7022, 8971, 8723, 7172, 8387, 7609, 7662, 7085, 6036, 6862, 5238, 4033, 4914, 2809, 2381, 2614, 1379, 1293, -98]
276i8l12J85k396L95J80k319Q32k15q98M59p54N90n32j133J936j144r55K256j139
295e062K38J005k34R13l18N15J027j093J359R32j048J619L63p5J211q25J069O55
313B251j135J586j41n90J532p20K66O56m84J000j052k13J286j757M27Q85j544
330B253Q01k82p35M38j227L58k88j514J473q17j149J114j074k27J46j000N82q23
348a971n01R40j370O29N42j094O86r9l50N61j011J021L89j090J409j1l78J184
366e14o99L07L12m60J305m84Q5J701j189M88J093j283P77O8k33P27q76Q87K72
385B284j023J293n13j052Q93o48j85M51j000P50n16l46N24j026L3K36j324Q96
403b73m94n51J157j270M59O64j407O00j79p89R96o51N88K65m87J097m77o30J537
$$ y = [-98, -410, -225, -2621, -2226, -2046, -4365, -3533, -3748, -4646, -4187, -4941, -4351, -4883, -6016, -4080, -5224, -6179, -3923, -5062, -4824, -3819, -4053, -3140, -3458, -2943, -1916, -3009, -1650, -718, -1766, -147, 216, 141, 1352, 527, 1596, 2251, 1116, 2702, 2561, 1971, 3503, 2783, 3049, 3705, 3221, 4221, 3169, 2956, 4242, 2485, 2912, 3797, 2253, 3054, 2772, 2037, 2475, 1248, 1606, 1318, -196, 1277, 460, -689, 425, -649, -876, -730, -1730, -1148, -1971, -2472, -1532, -2902, -2273, -1731, -2825, -2139, -2238, -2588, -2027, -3038, -2017, -1628, -2718, -1309, -1320, -1698, -514, -1213, -906, -594, -1054, 251, -233, -148, 1553, 364, 852, 1945, 662, 1439, 1507, 1274, 2001, 1125, 2012, 2284, 1261, 2554, 2041, 989, 1882, 1234, 1049, 1500, 500, 1250, 734, 388, 912, -114, -81, 155, -1169, -273, -767, -1318, -161, -1431, -972, -308, -1715, -1115, -1294, -2083, -1087, -1738, -1150, -885, -1372, -275, -752, -1382, 155]
422A55j290L53O56m72Q45r8J2Q92q74O57K02r48J047m1p37J269n87K08L21q45
442G25O59m00o81Q82r40J95N61q88O50n21m08O70j102P0N13j090O95J60m33O46
462c7p96L78J43q77P79m2q12J125l06J45O21p08N68k82k92Q13o47K50O45o57P82
483G93j56l98O69q19J70K94o08O26m5m02P57o64k01R9r46P11o62l43R02q43K22
504h44M21r11M77l55m94N03q04M75M99o50J062j10n72J043o31J05P33n95R28j09
524A71Q1J077k80J14O35o17O44j80k01J084n50K98N16o79O50k49n78P65o08l4
544B059K66p37N01l24p34P24j153j86J28j263K10j2n17K82q62j96K34j100K86
563b394k77o99O77o02r4P16q82P51m38k02O28m60K31Q45k66P63R2n4R26k57O6
$$ y = [155, -1135, -782, -126, -598, 247, 149, 161, 1053, 179, 836, 1038, 90, 1137, 1096, 359, 1628, 1041, 1249, 1570, 725, 1384, 984, 303, 1185, 245, 440, 1001, 113, 763, 242, -166, 504, -598, -528, -15, -1105, -410, -250, -683, -37, -833, -455, -312, -1189, -410, -452, -1264, -139, -445, -300, 321, -387, 181, -101, -393, 420, -227, 23, 668, 11, 793, 637, 239, 908, 89, 259, 553, -55, 571, 526, 124, 881, 217, 16, 115, -831, -120, -782, -1125, -223, -1066, -844, -423, -1334, -857, -1212, -1706, -1203, -2007, -1532, -1033, -1683, -621, -731, -1303, -260, -891, -786, -53, -648, 280, 171, 252, 1329, 1049, 1163, 1798, 1181, 1825, 1645, 1444, 2528, 1978, 2276, 2792, 2113, 2763, 2514, 1936, 2701, 2093, 2059, 2325, 1588, 2089, 1765, 1031, 1755, 602, 416, 544, -719, -509, -521, -1038, -756, -1618, -1814, -1580, -2680, -2394, -2671, -3370, -2693, -3295, -3389, -2673, -3555, -2804, -3242, -3444, -2816, -3276, -3045, -2200, -2466, -1703, -1611, -1665, -739, -996, -930]
584i30J054m66P55L87j60J209l15M90M54k13P19r9l21J044n70R7P64q51N89k22
604C415m44L68q14j49M10q66K94l12o40K22j043j63J05q28J8l26p09M97p64n6
624a785P1j053M50l95n79P28n49k04N99n20N52j07k43M56j43M30L60k89O90J38
644a393j16Q51o7J50N68l60P23L05J75N69j63L69O14l51N23Q8k73P10m17J66M22
665C093p10M10J06m97K19n87p0J04p20L14m40n95L63p17k11J63r34Q2k51p26M07
686a197o72m5R7o55J67j45m97N09l36j70N82m87L85J27k49O62n1J77N48j04N44
707h10J53o3Q91P3M38M90j64L09M60J7P13k00K99N26l26N53J02l10N02k77l07
728C069K40l69J6j27m06J43p51j88J25j021Q3m09o62K97j024l71Jp66q1l78n29
$$ y = [-930, 124, -342, 413, 800, 640, 1849, 1534, 2024, 2478, 2265, 2984, 2885, 2564, 3608, 3038, 3135, 3899, 3048, 3637, 3415, 2971, 3339, 2525, 2376, 2786, 1920, 2214, 1902, 1262, 1484, 441, 278, 383, -445, -427, -753, -1462, -965, -1729, -1785, -1714, -2767, -2317, -2712, -3291, -2563, -3112, -3316, -2717, -3237, -2685, -2792, -3035, -2579, -2722, -2292, -1932, -2221, -1531, -1393, -1509, -658, -725, -575, -7, -367, 356, 661, 836, 1405, 1242, 1611, 2225, 1874, 2397, 2485, 2212, 2922, 2505, 2671, 3093, 2383, 2793, 2899, 2402, 2621, 2034, 1964, 2068, 1348, 1662, 1222, 627, 990, 273, 62, 225, -709, -627, -878, -1604, -1197, -1869, -1914, -1817, -2472, -2305, -2450, -2947, -2438, -2774, -2944, -2362, -2849, -2464, -2337, -2586, -1924, -1975, -1798, -1250, -1354, -810, -657, -720, 171, 244, 682, 1172, 1008, 1317, 1777, 1794, 2507, 2307, 2606, 3132, 2806, 3359, 3461, 3151, 3653, 3376, 3069, 3309, 2940, 2956, 2829, 2423, 2566, 1815, 1627, 1752, 731, 814, 405, -257, 40, -984, -1355, -1354, -2120, -2201, -2579, -3108]
749c108L5o32k48K59p10L05k40m16P69k42p8N06l62O90K60r4O79K32M51O47mO70
771f31L65L59Q85J85N10P71L8Q82K48K3P70M8J12N72L2J01j8k41L15l22k02L0
793D832n03q8m61n61Q1q77k44m14q94l51n43p76l43p98l07k87r06k18k55q33j
814d747n44k34J30n54K30J59j74L81j77K88L23q4O49N03J29R86J40O03Q14J73
834a006P10Q32J72R74J20O55Q18Q4Q66L72n1Q07l46L29L73k15N59k25k41J94o08
855E173l16J88r45j65l35p81n4o93n60j76j310j10o18p75j84p80m61j83o45j21
875c851l10n50K05o68j25L91n20L59J01j20O75J76k7N71J67L77P22J1R64Q3P07
896f62Q91J38N56N40p5R39J63L14O35R4K15L09q2L94j13J78j8m20mJ16m70J89
$$ y = [-3108, -3073, -3705, -3953, -3694, -4404, -4099, -4339, -4755, -3986, -4228, -4306, -3800, -4162, -3472, -3212, -3306, -2627, -2395, -1944, -1297, -1301, -631, -266, 93, 978, 1163, 1673, 2444, 2482, 3364, 3612, 3635, 4405, 4453, 4565, 5137, 5169, 5270, 5252, 5011, 5326, 5004, 4802, 4832, 4329, 4241, 3780, 3219, 3300, 2423, 2179, 1765, 871, 520, -23, -799, -1142, -1940, -2247, -2534, -3440, -3658, -3913, -4746, -4747, -5291, -5525, -5395, -5949, -5719, -5560, -5734, -5353, -5530, -5242, -4919, -5003, -4354, -3851, -3722, -2736, -2596, -1993, -1179, -1006, -296, 536, 708, 1682, 1802, 2457, 3275, 3359, 4225, 4597, 4546, 5353, 5007, 5336, 5709, 5494, 6053, 5828, 5587, 5781, 5173, 4857, 5045, 4100, 3935, 3600, 2819, 2765, 2072, 1512, 1336, 26, -84, -702, -1477, -1661, -2441, -2902, -3085, -3730, -3851, -4161, -4711, -4506, -5174, -5299, -4908, -5428, -5069, -4968, -5088, -4413, -4237, -4264, -3693, -3526, -3149, -2427, -2416, -1452, -1369, -662, 229, 367, 923, 1463, 1388, 2327, 2490, 2804, 3439, 3533, 3748, 4057, 3975, 4369, 4256, 4434, 4416, 3996, 3992, 4108, 3638, 3827]
918C827l84m96J4p13j61m79o38J08o02m11k42o94j77l44n18K5m37m07K95o01Q1
939b954j5k86J48j72JM47k99L18K31p9M72K71j1O54k69M81K89j59O66K89K48M25
961F96jM61J28l19O55P3k7L12p9K45K01l34K67l49m9R3k42L3j29j97J66l24m00
984H80K52n97O0l14m36M06n02J80r4l05M1j14n21L19J6k31J57l05R1J47k11L88
1006f93j43J51j34k09M50j58j49L38j2k4L09l26K15K07j53L11j84J23L08l04J59
1027H2R1k67K94k61j19N25k61mJ94m39K61o2k89L89k10P0K17m08L47k1j37K48
1049B40k74L89j48m04N46j58N7K14j57J39J81k38J11ql30L60k57J62J09j73L30
1070F91l41j54L10k73p1R1j77J64j57k21K18j15J5o6m17M29l78L4L91o30J86K39
$$ y = [3827, 3443, 2947, 2961, 2248, 2087, 1608, 970, 1078, 476, 65, -177, -871, -1048, -1392, -1910, -1885, -2322, -2729, -2434, -3035, -2954, -2969, -3255, -3107, -3279, -3278, -2831, -3130, -2812, -2581, -2660, -2188, -1917, -1928, -1274, -1543, -1062, -773, -932, -266, 23, 271, 696, 695, 1156, 1284, 965, 1620, 1693, 1666, 1978, 1899, 2144, 2345, 2011, 2278, 1929, 1880, 1973, 1731, 1764, 1635, 1438, 1604, 1280, 880, 1132, 535, 595, 281, -155, 251, -251, -71, -165, -470, -429, -543, -1064, -745, -729, -960, -803, -1108, -1017, -870, -1081, -693, -836, -685, -819, -1028, -578, -736, -885, -547, -559, -583, -274, -600, -385, -178, -331, -20, -204, -81, 227, -77, 82, 173, -94, 200, -61, -180, 345, 84, 80, 274, -165, 96, 34, -255, 134, -76, -6, 211, -197, 150, 129, -8, 240, -34, 355, 207, -197, 349, 191, 248, 462, 305, 444, 625, 387, 498, 490, 160, 520, 263, 425, 534, 361, 691, 350, 196, 506, 233, 162, 253, 76, 240, 83, -138, 80, -35, -20, -86, -503, -74, -452, -418, -27, -657, -471, -232]
1092b32m37L35O5k71m6kJ57J44n21M84jj8O0r1M7J74j47K76l6k33L31l60K43K25
1116A46p5L9m8j03L61m33K09R2j53L65k90j80K93k24m4K77k76R3J2k42L12j77
1138d6L9R1l17M44j74mJ53m4k6R3l59M12O2j11L83l73J24n8k29O13k38o6L18l02
1162C85J91j16j35K38j16k3J74k45j66J20q4qk48J2j4r7j53J77k34l3J00l76K53
1185c98m21n3J43J0P0L6l73K84j43J74o3l62O01n2L0N0j78K79J12j51L56r2j7
1208a58K96q7J73K21k40M87l15J1K24p6K8L39m40L63p1j68L33m75K36Rj97N5O2
1231F10j33J25j55L9j22k21J69o5l86L59k66JJ71j18o7N0k24K15j77j82K46j46
1253b77M21k26r4O3p2J68Q7k89L13j23j48L15k47J26Q4k94J62j18j41J68k66J09
$$ y = [-232, -669, -334, -269, -540, -586, -588, -431, -287, -808, -324, -325, -343, -283, -374, -327, -153, -300, -24, -60, -293, 38, -322, -79, 146, 71, 110, 62, -41, 320, -113, 96, 188, 35, 400, 110, -70, 223, -1, -45, 232, -44, 49, 61, -181, 131, -46, -7, 84, -233, 211, 37, 33, 186, 142, 116, 209, -150, 262, 324, 213, 596, 223, 347, 289, 60, 673, 435, 369, 687, 385, 576, 460, 325, 563, 447, 424, 598, 353, 187, 307, 223, 215, -33, -21, -35, -132, -285, -108, -342, -375, -275, -651, -398, -819, -872, -729, -719, -649, -613, -986, -702, -845, -671, -734, -1096, -495, -547, -517, -467, -645, -366, -254, -405, -49, -141, -158, 138, 51, 224, 445, 205, 692, 377, 388, 612, 536, 564, 903, 463, 826, 755, 587, 920, 445, 681, 690, 493, 548, 610, 477, 602, 447, 486, 364, 143, 312, 247, -139, 220, -46, -45, 126, 8, -59, -9, -233, -18, -195, -377, -131, -277, 144, -82, -176, -113, -185, -17, 70, -219, 94, -29, -177, 138, -109, 17, 101, -193, -31, -149, -290, -122, -388, -279]
1275b79k2k41J08r0M1K09l86j6K4j32Q7q3p3K79k41P3P2j73J62J9L5K51k13L08
1299b81J31j06K77J41p4M34p1K93j7J18K37J44nJ40k06L98M1l32L42R5n1N3j64
1322A537j90L8j82J71j96k17j6k11p2k33l13l2l90k79J0m46j13j63j68J01k14
1343a578k71k9p2j93k9j96K88j46J18J63K8j00K54j08N37O3J75L43k2M10J72J52
1365d1L91K24J62L01M7L12L29L3K2L74Q0K94j63O1O7j52J53j61o8mk90Oj17l03
1389A557j07m17j43J7n51j48k0m46j59m29l31l5l66j73M2m34m6j18j46J06k81
1410b628J96jk25K43J97j11L01O8J13K22J97K44K18K21M45K78J23L11J95K69L21
1431A197J27L61k13L83L35k50L23N1j03J11M0j19K69m80k3R6k71P3k46j58j13
$$ y = [-279, -301, -542, -434, -524, -483, -274, -660, -676, -652, -784, -697, -780, -853, -574, -815, -742, -670, -843, -681, -662, -627, -376, -589, -281, -150, -256, 21, 162, 88, 522, 451, 744, 727, 845, 1082, 1226, 1221, 1361, 1155, 1553, 1594, 1262, 1604, 1699, 1648, 1701, 1537, 1347, 1385, 1203, 1374, 1178, 961, 945, 734, 662, 429, 116, 84, -306, -585, -575, -1021, -1134, -1297, -1465, -1364, -1578, -1849, -1878, -1950, -2143, -2172, -2368, -2080, -2226, -2108, -1945, -1917, -2017, -1763, -1871, -1334, -1271, -1096, -753, -775, -365, -193, -41, 350, 574, 736, 1037, 1084, 1396, 1725, 1758, 1780, 2154, 2234, 2528, 2365, 2426, 2493, 2341, 2494, 2333, 2265, 2261, 1971, 1977, 1860, 1557, 1450, 1033, 890, 907, 356, 208, 188, -258, -417, -846, -1177, -1212, -1578, -1751, -1709, -2143, -2189, -2307, -2453, -2347, -2628, -2432, -2433, -2658, -2415, -2218, -2329, -2028, -1960, -1847, -1625, -1428, -1184, -966, -745, -300, -22, 101, 412, 607, 876, 1197, 1324, 1685, 1472, 1855, 2190, 1940, 2263, 2314, 2211, 2322, 2362, 2243, 2512, 2032, 2009, 2105, 1834, 1907, 1661, 1503, 1390]
1452A390n33Q9m42l35L2k48m28j67k83j48j69l77J46m12j14j4k05J85j62j36K77
1473b054j79J52J95j32J22K25j23M42j0K90K79L6K09P1K59N55j72J92K74L02K47
1494A180J41L4K08L5N8K65k22L48j76j4K62j84NL8k71j37m1r0qk92k28j93l79
1517C39J6k32k21R7l87k45K09m56o5k59m5K06m98n7q2j59J52j13l9K97k15l4K33
1540a558l6K27K73l47M98j11K57K09K5J74M11j1M15J59J0R6P8J80J57q0L01R5
1562A422j03J07K2K2O4l35L82k17J19j18j61m8j61l4r6k46j30j24j37j8l8l50
1584a78J9l72j8j24l00K4j21o4P8l38j18K70j47O4p1k05K19O7P9K2k4K43K86j26
1608h35M09k10L14J51j45M67J24J24J54P4K63N1j13L85r2k9J87J34r4J75j86p4
$$ y = [1390, 857, 946, 504, 169, 201, -47, -475, -642, -925, -1073, -1242, -1619, -1473, -1885, -1999, -2013, -2218, -2033, -2195, -2331, -2054, -2233, -2081, -1886, -2018, -1896, -1671, -1794, -1352, -1362, -1072, -793, -757, -548, -477, -218, 337, 165, 357, 631, 933, 1180, 1321, 1355, 1563, 1598, 1656, 1921, 1699, 2047, 1871, 1857, 2119, 1935, 1940, 1978, 1707, 1570, 1529, 1439, 1431, 1139, 911, 718, 339, 355, 123, -98, -1, -388, -633, -424, -880, -945, -1204, -1249, -1043, -1541, -1598, -1680, -1839, -1687, -1800, -1839, -1542, -1757, -1791, -1558, -1594, -1367, -1094, -1441, -943, -1054, -797, -588, -563, -389, 22, 11, 426, 585, 595, 691, 769, 949, 1106, 1026, 1327, 1422, 1319, 1426, 1448, 1470, 1534, 1199, 1581, 1364, 1483, 1365, 1204, 1156, 995, 961, 865, 619, 489, 365, 228, 210, 172, -178, -159, -531, -549, -673, -973, -949, -1070, -1134, -1056, -1394, -1512, -1242, -1389, -1325, -1396, -1601, -1382, -1315, -1236, -1214, -1238, -995, -709, -835, -426, -636, -322, -171, -316, 151, 275, 399, 553, 627, 890, 941, 828, 1213, 1121, 1092, 1279, 1413, 1319, 1494, 1308, 1234]
1630A234J37j66J6l05J04J22l07l8k59L4j17k23r2k24j63J9j54k49mj8r4Om88
1653a229oJ13p1Q3k98N2M2p1J73j38rK01R4M5K73p6K75K11j07L03J0J54J45P7
1677B46K11J68n4K40J28J82L7j79K63J02q7J66k03N4M3j46Pj43j43P6o7o2k12
1700F27j1k67P9q9j28n8k62o8j56m0L9j48o0k69j78rJ22k47J14j98K82j40m8J43
1724i70j97K55P6K8Q5o8K05M2J1L02N6M6K95k20J06K62R7N8M9pl9J86n0K14k25
1749E97q6K32j73R4N1j02O6j00j16P5m5k01R5r8J6k53K18m3q7q5p3k12J88j44
1773a86j15J38j28K00l3r7j18P8M9n7n8J2J22j8Q6j57J19n7J22L1n3J83%n6L5
1798D2m1k26L56j59J40j96o2r0K49j10J5K4k13jJ8J38j54j3J40n2n2K6l7N4O6
$$ y = [1234, 1371, 1205, 1221, 916, 1020, 1142, 835, 797, 538, 572, 455, 232, 140, -84, -247, -228, -382, -631, -635, -653, -747, -741, -1229, -1235, -1122, -1193, -1110, -1408, -1356, -1314, -1385, -1212, -1350, -1359, -1158, -1064, -1019, -746, -822, -547, -336, -443, -140, -130, 24, 169, 246, 457, 625, 571, 811, 939, 1121, 1158, 979, 1242, 1344, 1257, 1423, 1220, 1274, 1317, 1171, 1178, 1035, 892, 968, 901, 839, 627, 616, 349, 428, 339, 211, 153, -109, -177, -333, -373, -334, -482, -542, -811, -989, -998, -876, -1123, -1009, -1207, -925, -1065, -1113, -970, -1167, -912, -836, -808, -723, -791, -586, -544, -533, -231, -175, -129, 166, -54, 52, 314, 411, 469, 518, 511, 472, 658, 608, 822, 597, 511, 743, 570, 664, 715, 613, 679, 579, 463, 538, 493, 292, 387, 289, 305, 52, 270, 227, 140, 55, -18, -230, -42, -186, -301, -163, -291, -91, -124, -221, -339, -261, -212, -269, -327, -315, -193, -211, -125, -282, -163, -220, -98, -67, -120, 63, 63, 7, 42, 1, -225, 131, -28, 112, -84, -146, -236, 13, -97, -82, -58, -271, -272, -254, -116, -270, -283, -143, -195, -247, -221, -258, -204, -138]
1823a38j8l8K59k46oJ15Q3Q9j33K97j31j1J06j85J75J29j34K87p1J15n1o7j9K9
1847D36j08K07R3j45k3R9J6j21j32J6p7j08K28l34J06k68J13k43q6q8J10lq0J3
1871c79q0o0j61K48j08j05j31%J69R0k44Q0J99l21K42j04O8J99J86P8J38j59L25
1894A70J28k06K00M7nJ61O1o0J89p0K00j0J06rq6RJ0j44K35k87j8j29J6m0l7r6
1920C35p6qr7k40K2ok92k27M40l78J45j99ML7l0k81K8L3J8j9j3P1J34k21J89R7
1946e34j00J89O4R4q4N2K48J30J4j1J51M6J4M8J79l0j2J90j70J37N6j12j4L21
1970H66k08Q6j29J72k3j71k9k52J51j36J19k61j33L6M9p8j68K9j57J11l33K5r8
1993e32p1j7M5oj7o4j03J96l6J8O1j59O3R9O4n5J98j72K67j98J05J90J25J40j33
$$ y = [-138, -156, -194, 65, -181, -187, -72, 11, 100, -33, 264, 133, 122, 228, 43, 218, 347, 213, 500, 429, 544, 493, 426, 407, 436, 328, 535, 628, 483, 460, 559, 575, 454, 322, 338, 261, 153, 381, 47, 153, -115, -2, -245, -331, -419, -309, -312, -392, -379, -459, -519, -680, -432, -540, -645, -776, -776, -607, -517, -761, -681, -482, -803, -561, -665, -597, -398, -212, -134, 4, -155, 170, 298, 92, 292, 339, 334, 495, 556, 496, 685, 615, 815, 805, 911, 902, 816, 825, 835, 691, 926, 639, 621, 492, 508, 468, 431, 335, 259, 251, 154, -86, -64, -70, -362, -589, -149, -527, -382, -581, -577, -540, -570, -851, -823, -790, -772, -791, -804, -733, -599, -820, -631, -534, -634, -445, -381, -287, -371, -319, -71, 59, 73, 62, 213, 259, 273, 321, 500, 470, 458, 648, 478, 615, 671, 559, 545, 866, 658, 744, 615, 787, 764, 593, 564, 312, 463, 327, 446, 185, 52, 88, 137, 59, -109, -80, -237, -126, -459, -434, -532, -603, -620, -575, -581, -598, -662, -765, -569, -605, -587, -526, -685, -622, -523, -459, -514, -316, -488, -221, -419, -314, -124, 1, 141, 8]
2018HK1J18l4J95j5k5K15L5K53j28k22K45j7rq4k1n0m2L7kK5j49Q7j10rL9k50
2045A11p9J79j37k5j64Oo7j62Q9k9j29J5j43N7l0m8J90j75j52K02N9J30l6k28
2069e66O8J30M0J04q8L07k6k39J01Q9J7Q5J07J23j86K8M8J78O9k2r7J55N7j2N4
2094E24o4j01J27O7l82J44P3L6j29j10K4j19M5oj35N3j42mP2k07mL8k50l5M6J14
2120c25j74J04j00J22p8K6n2L8J42j24Q2j63K32J8N2j27L62k69K37o7k8L55k51
2143A2j5J22J45k3Q5l5l4K50l8J07nk68J70m8J08K8k05J49r2l5n8m7Q8j17J5j69
2169I0j06L3M2j76L5m1R2j34o4j84R8K1j42O1j5j72J30O7j57k1L0J04j27J50L2
2194c54q8J12K8o1K79n1LnK2J67J3m3R4O4K44j27O7N9L8j72R9q0L9J34o8m5j02
$$ y = [8, 29, 147, 113, 308, 293, 268, 483, 518, 771, 643, 421, 666, 649, 640, 556, 535, 485, 443, 480, 478, 503, 354, 441, 331, 322, 361, 111, 32, 211, 74, 49, -115, -109, -176, -338, -249, -278, -407, -392, -535, -478, -508, -556, -366, -541, -693, -491, -432, -302, -338, -566, -498, -368, -328, -224, -312, -5, -31, -270, -169, -80, -63, 22, 129, 252, 66, 94, 142, 320, 389, 367, 270, 425, 482, 470, 524, 460, 359, 486, 553, 171, 315, 388, 424, 295, 185, 209, 90, 135, 129, -6, 47, -95, -99, -27, -234, -238, -200, -450, -485, -439, -325, -499, -395, -495, -373, -451, -425, -477, -439, -297, -421, -339, -502, -270, -252, -200, -327, 35, -234, 3, -64, -92, 263, 12, -3, 119, 264, 241, 326, 291, 257, 507, 469, 576, 571, 303, 473, 425, 533, 561, 356, 505, 413, 378, 320, 273, 361, 244, 259, 90, -16, 17, 59, -117, -82, -123, -31, -165, -229, -413, -315, -294, -436, -375, -390, -562, -432, -365, -522, -543, -513, -409, -536, -386, -354, -442, -330, -302, -363, -84, -135, -132, -137, -115, 52, 65, 22, 116, 180, 424, 297, 364, 423, 461, 289, 388, 308, 347, 481, 413, 368, 266]
2221B66J29r1J60j70q1P0J29j53M0k8q2k19K8p1K11j11k28P4O1l6j97o4J72j63
2245c54J38j26l9N2P9j06m4m0L0l7R5O5k8N4j37P7l5J81P0N6N3Q4r2P8M5K7o0
2272H6L6r1J5J52l1Q3N9k3k05J58j26J08j17R9j8PO6M4j59Q2p5k39K61k63K63
2297A72j19k97K44n4K4k9o8n7J96r2o7kj40R5N7R6R2k3j40M0j41K10k49M7K27
2322B2m4m2L1J6Q3j94M8J09k40K72j18J17O3n0J3j21J4N7j29P5Q6j83P2K9L7q0
2348e7k9M7K30o9j00k4R4J2k86J53O1L5k6m5R0j64j7N2p9R7j24P0n1K8j93K35
2374f0J33k08P5k00O7O4J16r9J54j15P2J7j49K06p2J31k26l0J17K2M3L4J19J3
2398B24M7nr8j25Pj1n9K42j12l3J59n8j14m8n7J14J2j63J09K54k48j4j07k6%N4
$$ y = [266, 395, 304, 464, 294, 213, 283, 412, 259, 299, 271, 189, -30, -2, -73, 138, 27, -201, -127, -66, -102, -299, -363, -191, -354, -216, -342, -381, -329, -250, -356, -400, -440, -410, -447, -352, -287, -315, -261, -398, -321, -356, -175, -105, -49, 4, 88, -4, 74, 119, 146, 86, 122, 31, 46, 198, 167, 250, 309, 286, 81, 239, 113, 221, 104, 203, 185, 192, 258, 302, 143, 225, 150, -89, 172, -91, 172, 53, -244, 0, -54, -30, -59, -127, -184, 12, -80, -147, -149, -289, -194, -137, -41, 51, 28, -112, -72, -213, -3, -252, -205, 22, -22, -64, -33, -17, 66, -128, -80, 29, -211, 61, -57, 60, 123, 73, 86, -35, -21, 36, -93, -18, 68, -115, -43, -14, 23, -57, -86, -39, 191, 122, 22, -2, 92, 104, -182, -29, 32, 67, 41, -4, 86, -78, -95, -43, -122, -25, -149, -79, -130, -102, -295, -60, 73, -135, -60, -260, -193, -129, -13, -112, 42, -73, -1, 16, -133, 73, 1, 132, -94, -124, -7, 15, 58, 92, 211, 224, 271, 266, 168, 43, 50, 39, -20, 222, 110, 77, 236, 178, 64, 16, -41, 73, 85, -78, 31, 285, 37, 23, -84, -110, -110, -56]
2424e6Q1j41M6J14j27j21j48J84n6J40j85L4P3j10K1l3J21j9J7J5r6K11n5N5k05
2449b40L94k17J51q1j44J48K7j0J67k6J6m6K9R9j60K43n7j49L0m0J69j73J31k59
2473BK11J0k49J01j41K13N9j85j10m3O6K7o2kP0p4K18k20qj35N3j02j5L2j3m8
2499c45l4L03q7O9k95K46RR7j60J47L0j49J52n8qj21J45N0jN7o3K79o9n1J79j37
2525A85R7n7k4J27r1j31J22n3L5j21k4K2N8L3Pj49O1n6j88J48K8j34k5Orl7N7
2552a13j93K65j03o8p4j12N3K6K19j58j06J61l4J46K2p2M0j02P8J1K24j47K22
2575A85j67j64K07J42j09k8J34J9k88J25J04K33l14J40l8p8J56o1O6j32L2j29
2597C5J28M4j80K03j21J1o4q7r1K52j97n8O8j5k11L34j92M4j4oj5rQ3j7O4q4J44
$$ y = [-56, 25, -116, -70, 44, -83, -204, -352, -168, -224, -84, -269, -235, -162, -272, -251, -284, -163, -182, -165, -150, -246, -35, -90, -35, -240, 154, -63, 88, 7, -137, 11, 38, 28, 195, 169, 185, 139, 168, 267, 107, 350, 293, 144, 174, 134, 303, 130, 261, 2, 213, 223, -26, 75, -66, 147, 206, 21, -89, -132, -66, -39, -101, -103, -33, -107, 111, -109, -117, -252, -199, -301, -316, -284, -297, -345, -379, -76, -163, -94, -389, -143, -134, -37, -197, -50, -20, -169, -17, -75, -83, -204, -59, -9, -10, 47, -16, 263, 194, 143, 322, 185, 282, 225, 201, 328, 237, 106, 228, 175, 210, 89, 65, 87, 145, 178, 185, 36, 97, 41, -147, 1, 29, -105, -130, -124, -133, -170, -113, -306, -41, -144, -212, -286, -398, -345, -319, -100, -258, -364, -203, -237, -91, -69, -141, -101, -203, -125, -114, 110, -37, 185, 18, -146, 61, 203, 94, 66, 200, 219, -69, 56, 160, 393, 79, 219, 181, 103, 259, 198, 264, 132, 164, 35, 163, 207, 27, 230, 109, 120, 56, -31, -122, 130, -67, -125, -57, -72, -283, 51, -141, -97, -111, -117, -132, -141, -58, -75, -11, -95, 49]
2624D9j53L8j20lRJ10J3R5j13P9p9o5j3J20N1j25K92k68Q2L0qJ23L6K7r6j03J8
2651B6m4P6j4L7M3oj6j24n8jr8K72j45k0J92j16j6l6J32j24l1nJ65k63J66r5j7
2678a20m2Q8O8Q5k21J37K0n9P3p7qo3J3N3l9J32J9j65J16n4PN4j11O8N6Q6k33
2705a17O2m0K08P1k44l3M6Q8p7L8M4j68R1qN9j8J15r2j91J61K8J19l4l03J54J1
2731c0O5J75j27J15j75qj9N3R0j70J11j56q0m1K52j74j7J03J33l5K6j7N6k08k8
2756a06O6J2K26j89L8k04J15L9M1n8J16j00J7m5P4O5r7Po3l3j18K14K5j4L8p0
2782dk3n2N5J12k49K19j01j02R5J7j05Q7J4M5m7J1R1j49J10m2k5K4l2L3O3k9k2
2809fN2j46M7J27j40o5O2k3J54n8J14Jp4j42O0Q3nk9l6l4M8N4Q8l8pj44oK14q3
$$ y = [49, -104, -66, -186, -189, -180, -70, -57, 38, -75, 4, -75, -140, -153, -33, 18, -107, 185, -83, -1, 29, 21, 144, 180, 207, 111, 8, 26, -18, 58, 44, 81, 124, 118, 102, -22, -80, -81, -179, 93, -52, -72, 120, 4, -12, -48, 84, -40, -71, -76, 89, -174, -8, -103, -120, -162, -74, -6, 79, -142, -5, 15, -44, 29, -48, -56, -119, -106, -53, -92, 40, 59, -106, 10, -44, -37, 17, -94, -26, 30, 116, -117, -55, -95, 113, 184, -60, -93, -47, 41, -36, 2, 46, -122, -31, -39, 20, 2, 117, 25, -166, -5, 23, 142, 108, -195, -41, -30, 35, 210, 83, 198, 23, 15, -4, 49, 139, -31, 80, -76, -156, -197, 55, -119, -136, -33, 100, 65, 91, 74, 130, -78, -106, -40, -28, 198, 9, 47, -157, -42, -3, 38, -20, 96, -4, 13, -32, 42, 107, 10, 17, -46, -79, -197, 17, 42, 28, 66, -4, -27, -79, -24, 88, -161, 58, -43, -145, -50, -33, -138, -51, -37, 8, -39, -28, 63, -86, 24, -18, -43, -19, -51, -18, 45, 16, -6, 46, -100, -53, 74, -66, -131, -69, -92, 62, 4, 118, 119, 45, -97, -37, 46, 41, 12, -24, -58, -10, 44, 132, 94, 87, -57, -63, 151, 68]
2838F8k97K70q8N6J11j84N9J56j61J20j23n4M2n9K80k61k6M1J7j3J2j14K5K26
2862A03j24l7P6J29k90K13k37J10J10j25P5l4qP8j06J3m8P5o3M9J25p8J12l45
2886b27J05R5q7K06r1o4J46j57M6J56J59k57k8r6K6PL4P4l3k2j10Q3j5L0K1l7
2912c6J41j7p9k4lK40m36K57K4n2k02K31k54K51L7O7j73M7P6j52J56q9o9R8J17
2937A56J9k61J45q2P3J02j74J57j50l1o5J53j10j8J82k19J60N6j39m3J18j17M
2960h4K16l79O4R1KO7N4N0N2j40j0o3K24j95J3J15j5r4Q2j49J35O4n7MJ46j51
2986D2Q3J39o4q3oL1k2k3p0J74j91L4j83J80K04l84Q4k6M1n8Q0k0m4j47K14l8
3012e3j05L2Q0j88J67m5N7p4o5J44nq1J73l9j00K7O9J78k48J05j73J18J89k08
$$ y = [68, -229, 41, -47, 9, 120, -64, -5, 151, -10, 110, -13, -67, -25, -84, 196, -65, -91, -50, -33, -46, -34, -148, -123, 103, -21, -58, 18, 147, -143, 70, -167, -57, 53, -72, 3, -31, -39, 39, -67, -54, -102, -27, -90, -41, 84, 6, 118, -227, -122, -27, -114, 92, 1, -63, 83, -74, -28, 128, 287, 30, 2, -94, -68, -61, -27, 47, 14, -8, -118, -35, -50, -20, 1, -36, 105, 88, 9, -15, -18, 222, -214, 43, 67, 15, -187, 44, -210, 41, 78, 145, -28, 19, 95, -57, 99, 10, -59, 39, 156, 175, -86, 59, -23, 50, 152, -22, 135, -15, -46, -111, 42, -68, -86, 96, -123, 37, 93, -46, -89, 29, -88, -84, 132, -247, -183, -92, -90, -23, 31, 81, 133, -7, -17, -80, 144, -51, -38, 77, 62, -32, 50, -99, 36, 100, 43, 47, 193, 42, 125, 264, 200, 117, 111, 142, 120, 97, 27, 201, 10, 44, -139, 41, 245, -139, -55, -81, -40, -98, -18, -38, -82, -229, -15, -53, -158, -126, -46, -234, -67, -112, -55, -129, -194, -50, -55, -136, 37, -2, -102, -75, -6, 172, -76, 29, -144, -26, 163, -45]
3036d5N8n8J79ML7J5l5q6L4J08r3q8K59n4n2j05o0N8K7J72k23k6n3PM2j2J28q1
3064E7Pj80P9LM1j36N2P8j01j49J16J35n8m3JN4L9k4m8NL3R5j64K47j26q%n2j3
3093f0K9K9P5j65J91K2j18J8j37J91j27J64N2M6j55j7K0k44J76o5J23j0L2n9l4
3118b3Qm9M1J42J49k63Q2j60L9Q1n8J02p2r3q5LK69k71PJ86J79k72NJ59o9m8J33
3145A22O0j44j08Q9l9R8K4pr5NP8l7o3oJ54K5l8l5j95J43O9k17m6J01p3J08N7
3172C0q4P8j2r8L0mj07K7P7l7J16lM8l0k6R8q0K8k12J95J76o3K2Pl71K85J07j43
3200E4M1lJ3j33J54P2q8k2Q9j77P6K3J06j56R5j93M9Q1k49J34K4j37L5r8J47K31
3226A68j99k03J74k62N93j42k79J71j38O9r3J08j8j42K80j75J4J04q8n1J17P5
$$ y = [-45, 13, -45, 134, 138, 175, 190, 155, 69, 103, 211, 118, 30, 289, 235, 183, 78, 18, 76, 103, 275, 52, 26, -27, -20, 22, 10, 138, 57, 64, -116, -37, -34, 7, -129, -77, 1, -100, -249, -133, 2, -56, -99, -98, -44, -5, -29, -77, -72, -39, 56, -108, 139, 13, 5, 5, -47, -60, -31, -2, 73, -92, 99, 121, 3, 21, -116, 75, -52, 112, 164, 210, 55, 38, 58, -186, -10, -75, 48, 38, 70, 11, -23, -15, -64, -23, 119, 268, 5, 87, -73, -34, 47, -11, 91, 19, -74, -159, -156, 113, -158, -151, 35, 214, -58, -53, 106, 37, -11, 122, 182, 38, -70, 19, -20, 78, 102, 95, 0, 5, 83, 46, -17, -23, 131, 156, 118, 83, -112, 31, 100, -117, -163, -62, -135, -27, 30, -54, 24, 12, -86, -56, -60, -167, -140, -63, -100, 16, 13, 61, 31, 5, 103, 23, 51, -161, 34, 210, 147, 169, 176, -195, 90, 197, 54, 95, 92, 105, -28, 126, 198, 110, 88, 177, 0, 76, 99, 205, 49, 144, -49, 0, 81, -168, -34, -10, -147, -112, -210, -63, 168, -31, -234, -60, -322, 271, 129, -150, 21, -117, -48, -141, -33, -51, -193, 87, -88, -74, 30, -58, -109, 8, 83]
3248H3o2P1k1K4o5K21k12Q5j85JR5m4r0K98l77K11qJ0K60k04j21O5P0j43J50Q
3274A20j29Q1Q4j51p3l2J26j24J88j70N0j29M0J16l4L4j54r5L29mm0l23J78l8
3298a50N3Rk37L04l9L4j59J20j11J41L5P8n4J44j54n7o2J58LQ6n0k7Q2j1j13J90
3324B13j32j5r0R5r8P0J86j32N2k9p8k91L14j88J59j69J78o4K6l9J86l28J27k39
3348b86M15j85k93K79o7J00J8q2p1Q7O1j45J05P8M6k01J55K8j39J57j01o6Q4k0
3372d3M2L9J9j50K18l8lK8j06K04r7q0l6j44L07j31j4M0L5j08L1P9R5k91j4L5
3398h3J50L6j13k51J83K7j18L20l34J93k5O6Mj37N0Q3j93q3J78j2n9M6j06M3Q3
3423e2q4J73n8j07O3Q7l1J1r4K36k06q5O7J4m8J38R3k01K07j30P6j31J25m9J57
$$ y = [83, 21, 92, 71, 95, 30, 251, 39, 124, -61, -60, 35, -9, -99, 199, -178, 33, 25, 35, 295, 91, -30, 35, 105, -38, 112, 120, -9, 72, 156, 5, -68, -100, 26, -98, 90, -80, -30, -159, -119, -3, -37, -3, -157, -252, 77, 73, 33, -290, -112, -150, -97, -88, -325, -21, -60, -26, -185, -65, -176, -35, 0, 78, 24, 168, 14, -43, -105, 53, 56, 142, 92, 65, 147, 136, 23, 213, 81, 66, -24, 71, -27, 43, 229, 97, 149, 120, 42, -249, 65, -123, 36, -133, 45, -19, 7, -32, 154, -174, -47, -286, 129, -56, -349, -70, -137, -37, -19, -101, -172, -85, -24, -169, -64, 14, 60, -141, 14, 42, -97, 60, -41, -107, -23, -43, -1, 38, 57, -93, 125, 87, 84, 112, 6, 210, 113, 33, -3, -147, 160, 29, 15, 55, 90, -18, 13, 92, 187, -104, -118, -83, 67, 103, -10, -261, -78, -51, -169, 151, -183, 10, -15, 51, 55, -82, -32, 51, -142, -225, -47, -59, -118, -72, -178, -135, -52, -136, 37, -21, -128, -65, 22, -9, 2, -92, 144, -62, -147, -80, -66, -114, 24, 117, -84, 123, -7, 69, -62, 63, 14, 171]
3448A71j18k0m5L8R0k82J53JM5k6k8J28n5lj07K02j62J5R5mN0k75J88j16j2N1
3474b6Ro5J4%J75j14j29J98j78R5j44J31J07m5L1Nj56m3J46O5P5k69K32l7j27
3499e0k9J82NqJ61l33K28k7k0j2j00P2J16j06j23K6L8K3k9J5m5M1n0J42o0j58
3525a01J41r2J08j99J22j00jO9j6j85K53j33M8K8op1L9J44j25o6J17j85L48k48
3549a11l4J80m9j09K50k97O7J8kJ54m4L5K8J12k07O2O1m2j42J87l6m1M2j58j1
3574h7K07o6q3J78k3j49L9J11j61o2J27K3J4j37J78o5j47m1K63j57L5J1J19j69
3598d2l4O0O3p0N3j01J72k5j11%j06O6J81O1r8p4k90L09j85J10P8k5J7pj62l8
3624a98K41J2k24L25k64l2J92J38l92K25N2N7j87J34l1j45J54r6L0O4n5l2j51
$$ y = [171, 53, 33, -12, 26, 116, -166, -13, -12, 33, 7, -21, 107, 52, 49, -58, 144, -18, -3, 92, 88, 138, -137, 51, -65, -77, -26, -17, -82, -68, -68, 107, -7, -136, 62, -116, -21, -165, -34, 73, 28, 59, 64, -92, -135, 11, 76, 151, -118, 114, 77, -50, -79, 103, 108, 100, 261, -72, 156, 129, 109, 97, -3, 69, 185, 79, -44, -18, 20, 43, 14, 29, -16, 25, -25, 117, 57, -101, 40, -52, 56, -143, -21, -121, -122, -53, -69, -254, -1, -134, -86, -58, -64, -135, -96, 48, -77, -143, -26, -211, 137, -111, -145, 35, -14, -123, 127, -170, -103, -85, -87, 67, 23, 58, 86, 198, -9, 53, 114, 72, -70, 117, 81, 40, 82, -76, -87, 120, 54, -29, 149, 126, -23, 16, 127, -34, -96, 31, 54, 68, -69, 109, 44, -103, -144, 119, -38, -3, 8, 127, -42, -76, -16, 47, -23, 30, -71, 101, 76, -35, -35, -141, -75, 106, 167, 69, -5, -295, 14, -171, -61, 17, -8, 9, 2, -160, -198, 43, 55, -169, 156, -108, -140, 52, 190, -202, 23, 75, 132, -55, 79, 48, -97, 57, -39, -9, 55, 0, -32, -183]
3647a83M47l77KN7K5n3J25J7j32n1J56q2j15J40nm9Q0N4M7k19J62k73L10j09J39
3672A13j48J09l2q6Q8j10R4K7J3l5K9k02J88l1J7k6Kj56N0R8j05P0m5J44j35J4
3698e5j8j45K24r3N9J29k52J07j30J84p5p4J69M6o1K2k9r3J04Pj65P5k9J39o8
3723b2j68J02R7m4l5L36n3k61L9k5K3O5j43P7J51j18j78J19n1O3K72m16J15j23
3747a78L10n8q6R3r2J22j37K4m5P8r7L9O8Q8k61Q3J03m5l9%J26r3j46J51K9N1
3773H8qk50rJ79j55J39M1k07K34k8m2QJ28l22J58N0j04j37J56J21j17r4O2n3o6
3798b28Q0k8K01L2R3j5r8j4J30k0k15M5l0R0Rj51J5J34pK3p3q8J19m6J86q3j0
3825E1p6J96k30J71p0j2l9J64r6RN2j11r4J50r7P9j36J83j31qK4j53J23p2P5n4
$$ y = [-183, 264, -113, -111, -54, -29, -82, 43, 60, -72, -123, 33, -49, -164, -24, -29, -78, 2, 56, 103, -116, 46, -227, 83, -26, 113, -35, 74, 42, -44, 44, -66, 28, 55, 68, 33, 62, -140, 48, 17, 34, 8, 10, -146, -96, 2, -103, -33, -78, 66, -69, -55, -73, -218, 6, -87, -28, 101, -151, -44, -174, 10, -65, -139, 30, 76, 15, 37, 8, -85, 19, 26, -139, -64, -93, 46, -22, -190, -88, 9, -35, -70, 266, 213, -48, -9, -34, -11, 54, -89, -12, 139, 21, -157, -38, -89, -26, 246, -170, -55, -178, 132, 74, -12, 81, -11, 111, -26, -2, -47, 31, -66, -27, 41, 129, -132, -49, 54, 9, -30, -30, 96, 3, -143, 8, 37, 88, 80, -170, -179, 0, -155, -16, 25, -182, 52, 24, -18, -10, 118, -204, -46, 4, -100, -237, -81, 40, -77, -171, -109, -162, -228, -148, -176, 25, 57, 150, 135, 37, 23, 153, 133, -82, -37, -67, 23, 32, -119, -104, 30, 23, 46, -27, -115, 4, -42, 144, 61, 51, -25, 171, -59, 112, 42, 30, -9, 155, 59, 68, 120, 9, -85, 65, -32, 47, -89, 94, -37, -45, -21, -174, -51, -123, -48, -102]
3851a02MJ70j42klj50K38j4m5K0jr6J33j39J73j5r6o2J77j62K10J9j74k9K28M2
3877A82j22N4j13K4J00j51M8j4n8j76L03j65k9J03K04j87j66J13J97j3j85O8p4
3900e7m0O5j0n8P9j12K13k6L4j26l3m5K17M1k47J47n8j00J13L7Ll7O9l4Om6J07
3927A02j05j6k5J32n0m4M2r2n5J76j29P6K5j06o2P3J03j41J23o6j6O8k61J66J42
3952F0k31K45j93J09m5J63o0J21j41j60K07o1M8j70K18j5j26L0J1J24p1J18j01
3975H0l8Q2p0n3Nl8o9P8K3Pn1P6J8J05O7j65j71J30j05J4K73k16j72K44k94K10
4001c0N3o0L4k30K82j17N0m8R7Q0k28O9j8o8L2K16k4j33R3k7r1R4J6J5O5o1j51
4028i0O7J67k42P5J48Q1k15N9q8J47j36J96k16j9M5m5O1k6K14j10m6K8O2j01j18
$$ y = [-102, -98, 72, -70, -72, -75, -225, 13, -1, -46, -26, -27, -123, 10, -129, 44, 29, -67, -129, 48, -114, 96, 115, -59, -88, 140, 182, 60, 114, 1, 25, 125, -26, 22, 8, -50, -226, 77, -88, -117, -14, 190, 3, -163, -50, 147, 134, -51, 17, -57, -97, -32, -42, -100, -21, -133, 80, 54, 88, -38, -71, -116, 101, 142, -105, 42, -16, -116, -3, 34, 37, 0, 69, 35, 41, -5, 102, -3, -19, -44, 88, 38, -6, 36, -56, -111, 65, -64, 12, 37, -69, -131, -58, 45, -96, 27, -39, -55, 13, -248, -82, 60, -171, 74, -119, -10, -55, 108, 48, 169, 28, -132, 75, 14, 62, -108, 110, 95, -31, -1, 10, 134, 63, 181, 80, 42, 124, 54, 1, 6, -32, -101, -23, 0, 7, -44, 32, 50, 155, 222, 57, -114, 16, -89, -75, 198, -18, -190, 54, -240, -30, 23, -37, -3, -233, 49, -68, -18, -66, 31, 111, -117, -48, -66, -134, -102, 114, 90, -43, 50, 23, -68, 26, 42, 57, 122, 61, -90, -23, 144, -98, -23, 125, 206, -9, 50, -38, 109, -27, 169, -47, -66, -21, -66, -5, -31, 183, 73, 27, 55, 117, 16, -102]
4053a02J58j9j17K19k3j26J89l9q7k04J77O4J1k68L19j68O0k19J53j7J34p3m6
4076b4P8k9J6j2k3l9j0K6P3j07J2K2l7O2J0j51K57k72J24p3J03M0n4J41j74p1
4102a12K23q2m6J28j68p3J16N2j3n7q3Q7O6k23L10j39l8J2K0O9j2p3R6K1J61k75
4128c3J57q0J36o9P0k14P7L8q9K87r0r6m9L4N9j19Jq7k0k6J38j44J54p3r7R3j46
4155a88J20P8j95L31k10J3Mm1l6j7j92L67j58p9O3J07l7M9LK1o5J42j4M4p3n6
4181a9Q5l7J7P6m8jR6R2k86K2J81j17k0J28n4j02J57m5j1M2J55k26n1P2j49K48
4207B05j93L3o7R6O0j98j11K21k64J69k4j74L83k66J90m6k40O2m2K46j68R5j11
4230a44J29M5j31P3l8n3N5J44N9k05J2m1N1K42j44M8q3K09j10n5M6J09k85M2P
$$ y = [-102, 56, 37, -80, 139, 116, -10, 179, 140, 53, -151, 26, 90, 101, -167, 152, -16, 44, -175, -22, -39, 95, 22, -24, 54, 25, 41, 29, 6, -33, -43, -17, 56, -51, -39, -17, -54, 8, 18, -133, 124, -148, -24, -97, 6, 46, -8, 133, -41, -112, 111, 29, -17, 111, -57, -130, -14, 38, 25, -32, -115, -28, 38, -185, 125, -14, -52, -40, -20, 49, 37, -36, 60, 81, 242, -33, 124, 44, 180, 111, 181, -33, 44, 82, -7, 280, 190, 94, 45, 79, 138, 19, 20, -67, -87, -113, 25, -119, 35, -38, -135, -42, -188, -68, 10, -185, 146, -64, -51, -47, -88, -124, -141, -333, 34, -124, -203, -140, -33, -70, -21, -18, 3, -62, 80, 66, 110, 37, -19, 66, 29, 46, 122, 74, 73, 169, 261, -25, -3, 178, 61, 41, 169, 115, 13, 170, 125, 114, 156, 311, 85, 34, 106, -43, 205, 12, 45, -22, 74, 134, -64, -175, 46, -218, -49, -73, -247, 136, -130, 60, 14, -226, -164, -206, 40, -128, -33, -144, -15, 30, -101, -28, -66, -119, -64, 80, 139, -66, -54, -95, -44, 198, 54, 102, 19, 228, 118, 63, 109, 218, -67, -25, -18]
4255a8NN7J84k00l8J2j7r7R0J03j01o3O4O2r8k3K20j04j32jJ45m4n9k5p1P7J27
4282E5j15K9r1P2k9m5JL7R2j97K48K4k28K50l41K80q2n7J27p3n3J6J86q7K5j05
4308f1J51o6k15J93J9j50Q6KK2m8K9k1J51M2j28l1J55j6j66n6K8J27j11P1J45
4333A52j89K32k01ql2J01j38J13q7K17r3O4j45Q3l0r9K31l17J22J44k09Q5Q4j20
4357d0lR7j59J02N3n7J7j12J85j84J14M0J44l40jJ94Pj22P0K8j30k1J72n6j0J02
4383I0j13Q6j0q8k2J94j0J2l9r2J7l4j51L06j16r3J37j31M8n6J36j9r8J51J03
4408B08k75n9J97p1Q3j02R3j09J69k10j8K51o3o2j76K00m4J1L5l06K22PK8j31
4432a22J9nP5m3L0J69r9j21M6O0lj75M5O9p9J45K5j04K21j69j7O0k1q8j25K77
$$ y = [-18, -13, 44, 228, 28, -10, 2, -15, -112, -22, 81, -20, -83, -19, 43, -55, -78, 142, 38, -94, -95, 50, 6, -53, -78, -149, -72, 55, -60, -31, -122, -50, -79, -124, -123, -86, 6, -191, 57, 81, -147, 103, -238, 42, -40, -97, 30, -43, -96, -80, 106, 19, 44, -61, 90, 24, -191, 2, 21, -129, -43, -41, -19, -67, -38, -59, 92, 134, 6, -25, 130, 114, -52, -108, -80, 47, -64, 7, 152, -37, 195, -6, -14, -46, 55, -83, 30, -57, 160, 67, 131, -14, 69, 39, -60, 171, -146, -24, 120, -89, -4, 80, -40, -43, 54, -105, -3, 50, -7, 10, -102, 83, -101, 13, 53, 197, -143, -144, 50, 57, -65, 5, 33, -97, -118, 54, -2, -12, 90, -23, 63, 53, -35, -57, 137, 127, 139, 100, 8, 25, -9, -160, 146, 30, -63, 74, -57, -9, -65, 71, 52, -46, 105, 208, -67, -126, 71, 0, 83, -19, 74, -35, 134, -76, -94, 157, 94, 32, -144, 56, 12, 23, 58, -248, -26, -19, 9, -122, -103, -108, -33, -76, -46, 123, 24, -97, -51, 9, 6, -169, -124, -55, -134, 11, 36, -68, 153, -16, -33, 27, 6, -82, -207, 70]
4458G0j57N6k1K30j84J8j76J32P5R0o6p9Rk06K02j7n4K72k01J2J8o3K37n5j91
4483d9J94k10M2K34j33J1k10J15o0R6K6Q2r8l59L13j23pJ89k20J15Q5j01j5J8
4507f5J27j89m2J56l8m3J50j59J30M8k07L07k47m7J02m2n0J66pj06q6J59J35q7
4531F5j62K8M9j4L4j08K57n8J0n2n4p4J24l9o7J28j94J23J5n4J48k14N1K3L5J2
4557A2j28P2Q7j28p%K08j41J09j59N4Nj20J16j23N8J15j89J55P6l14J50J85J63
4581B56l71J50k3M5m5m9J98j32J0Lo3N9M0j01P4M3R5k06L9n1p2J89n7k9Q3l6k00
4608a51K73l4q5k0k6J09K05m61J73J05j58j01J78nK3l8N1M8j27k40K62O0mo3J77
4633A51q4q8Q0l0k2j88J86p4K74k59p7N1Q1L5R6j07j70J54P0K0j38J40k0l3n4
$$ y = [70, -87, -31, -52, 178, -6, 12, -164, -32, 43, 133, 67, -12, -3, -209, -7, -24, -78, 194, -7, 5, 23, -40, 197, 142, -49, 145, -65, -23, 211, 78, 89, -121, -6, -66, 30, 56, 138, 40, -319, -6, -129, -136, 53, -167, -52, 33, -68, -83, -65, 62, -127, -169, -13, -51, -94, 56, -103, 27, 75, -132, 175, -72, -119, -17, -59, -109, 57, 50, -56, -142, 17, 152, 65, -97, -69, -20, -34, 0, -108, 149, 91, 101, 49, -5, -79, 45, 6, -61, 67, -127, -4, 11, -43, 105, -109, -58, -35, 0, 12, -116, -44, 43, -85, -92, -92, 116, -25, 84, -75, -21, -16, -136, -20, -143, -85, 30, -159, -4, 72, -242, -92, 93, 256, -115, 35, 12, 57, 12, -37, 161, 29, 39, 42, -21, 38, 78, -23, 51, 94, 189, -17, 22, -29, -101, 88, 31, 2, 85, 49, -151, 122, 88, 3, -17, -43, 66, 271, -190, -17, 88, -70, -171, 7, 2, 25, -13, 38, 86, -41, -281, -19, 41, 37, -26, 151, 67, -21, 59, 29, 7, -181, 5, -69, 205, -54, -131, -80, 1, 36, 132, 25, -145, 9, 79, 99, -39, 101, 81, 48, -6]
4658fK82l04J41R9k09J19J2k58K08N8m6Lp2l0J49j76K62l66Q1J71j5N2j16K0n9
4683@J32j00o9L3l9j09J41J7k6J75p0j67Q7K9Oj2MOQ0k31J02m0K7M8m7J90l16
4710a49J77r0K11j61pj84P8K38j72J70p7P7q2j69J00J19j02Q7j88J35jm0J55k50
4734a25J18j00N2p4J22j19J9J26l0m3J96L6K1j67j10J80k00K04n1Q5j47p1K81
4757B03l11K00O1k49q8J22K37J02q0l14L4J03n2J1J77k03n2K13q4M1k3j80L34
4780B02l25J7N9j02J53m7p7L2J1r8J36J39k9j04q3J07J40k55J07L7q8n0J68j51
4804a01R9m7J14P0q5oj13m9J00o1N0R1Qq5O7j98J39J25k49K07m4j8o3N8j14M2
4830f3J55K6l7m9p5K0J59j09O3k60J83J4n5q5K46L0j60J2j8o8%J55l7o4O8q9m5
$$ y = [-6, 276, -28, 113, 212, 3, 122, 134, -124, 84, 142, 96, 99, 27, -3, 146, -30, 232, -134, -53, 118, 103, 155, 39, 59, 0, 132, 32, -37, -4, -43, -152, -11, 6, -20, 155, 85, -82, 5, 34, 40, 28, 32, 38, 118, -113, -11, -51, -24, 24, -23, 167, -149, 28, -62, 149, -12, -19, -203, -125, 113, -59, 111, 34, 111, 29, -140, -40, 79, -23, 64, -124, 11, 10, -30, 125, -125, -7, -107, -55, -129, -7, -126, -107, 19, -11, -54, 142, 178, 199, 32, -78, 102, -98, 106, 55, 140, -7, -78, 203, -108, 92, 153, -96, -184, -62, 175, 277, 197, -117, -83, 20, -32, -21, 156, -47, -99, 114, 30, 71, 48, -132, 202, -123, -106, -47, -149, 4, -43, -120, -88, -77, -175, -39, 100, 71, -33, -116, -9, 131, -124, -17, 20, -68, -118, 50, -101, -2, -49, 65, 135, 50, 44, -69, -118, -18, -79, -29, 62, 70, -15, 52, -146, -7, 118, -131, 76, 32, 14, -49, 9, -105, -63, 92, 118, 81, 32, -43, -23, 136, 27, 90, -170, 13, 27, -28, -113, 133, 163, 3, 15, -3, -71, -71, 84, 47, -17, 51, -38, -83]
4857h3j4R4j11L3J36K4j12M4O8j9q9K8p3L56j33l48K12J01L2j81j6j12K29p3O5
4882E8r4R9j20j05K7K61j77l7J84j94J55nj08J8M3j74K28P3r4K6j59M05l81Q1
4906A0J01j9k13K30J36j13k66J24OJ66n1k37K12l0N4j99M1J97j31J07m9o9k3R7
4930H1p5J4j87K89k20NK61j27K7N8k65M5QJ25M7k77J93k2m3L2k8mN5q5P4j1J7
4957a3p2j9K26J2n9P8n8p0J04j60J59L4L3l2q0q8N8M5j9P4j71J65K7j18m5Q8j07
4984hm0K57j29j85K47l07R0J35j94J12M2j08q8J89j64M8Joj13N7R9K0J36k44n6
5009b09K33j23N6k25K96n5J64k87J16j99L01K22m18O7N2N9N6PL4m9p1J5N4M7j53
5034a0J73j46J46k02L48m01Q6J04Q5j25J47j8k69J69m4m8mj31J98j23Q4j20j0
$$ y = [-83, -97, -3, -114, -81, 55, 79, -33, 11, 79, 60, -29, -1, -74, 282, 149, -199, 13, 114, 146, -35, -51, -163, 66, -7, 58, -36, 63, -57, -162, -135, 126, -51, -88, 96, -98, 57, 52, -56, -38, 5, -169, 59, 132, 38, 64, -95, 310, -71, 10, 111, 92, -121, 109, 245, 132, -134, -10, -4, 162, 111, -126, 86, 56, 110, -89, -48, 149, 18, 125, 76, 7, -16, 81, 6, 20, -167, 122, -98, -93, 168, 41, 68, 126, -139, -94, -86, 39, 86, -191, 2, -20, -63, -31, -59, -63, -8, -93, -19, -30, -13, -85, -104, 122, 134, 75, 153, 95, 25, 129, -31, 128, 162, 195, 163, 83, -5, 53, 98, 79, 153, -18, 147, 174, 56, 11, 99, -8, -48, 209, 80, -105, 142, -165, -75, 60, -134, -22, 20, -88, -176, 13, -151, -103, -102, -108, -221, -164, -65, -45, 91, -153, -209, 24, -99, -43, -268, 28, -27, 137, -150, -34, -233, 68, 290, -128, -61, -9, 50, 106, 113, 147, 98, 27, 42, 96, 143, -10, 163, 17, 163, -39, 309, -92, -6, 98, 183, 58, 205, 187, -82, 87, 43, -5, -9, -140, 58, -65, 19, -101, -111]
5057a11P3M5j90J17J0J39j61j74K10k0j33q1J86R1l36L07j47J33J8j6M6j32R9
5080b7j80K14Q2j29O0o7O5R5o1q8L2J3J81L7j15J02K2k72J1K48r0l8Pp0K11j80
5106F3L9k09J01M6p1Q7j04J46r9L3n1Qo4O2N0j10J33k08M4J4n5P2J59j79l0J2
5132a11K14j10o5j9j03l4K27m2j34O1j02J96q5j19J73L0m6Q3N1j27N7O0J14j26
5156D3L3mJ35nM2k21J41j11J9L8k5n6L4M6q3J14n0j42J54Jj41N4q8K57k15j8P9
5183C1J04j40j0k4j93J37J14p4j2J37q4r9J90k03p3J95m7O9m1P6j96J44j30J49
5207B0j38K19j09p6l6K15J36l11P4l8R5m5J98K8k50J61j20o3k7L7K6K05k24J31
5231A08j44j43J06M6l7P2Q7j11j72O2K45r7Jl07K60o8Q1j03O1J63k22K42j61R6
$$ y = [-111, -38, 7, -183, -66, -56, 83, -78, -252, -42, -62, -195, -276, -90, 1, -335, -28, -175, -42, -24, -40, 6, -126, -27, -207, 7, 89, -40, 20, -47, 18, 113, 52, -36, -4, 9, 190, 227, 112, 214, 236, -36, -25, 223, 133, 95, 102, 32, 243, 63, 102, -107, -6, 40, -31, 56, -48, 98, -1, 32, -19, -11, -75, -13, 37, -73, 60, -148, -104, -90, -145, -73, 86, -93, -123, -111, 103, -7, -72, -91, -194, -228, -1, -43, -177, -116, -218, -22, -107, -226, -53, -23, -69, 14, 65, -62, -5, 55, 169, 43, 76, 72, 207, 202, 244, 23, 164, 53, 72, 110, 85, 29, 63, 109, 26, 140, 90, -52, 102, 103, -38, 16, -72, 185, -30, -48, 31, 135, -5, -15, -39, -232, -95, 19, -55, -67, 70, -14, -113, 77, -126, -199, -4, -51, 18, -23, 53, -143, 1, -129, 20, -118, 101, -8, -84, -120, 95, 231, -80, -6, -44, 51, 6, 204, 232, -18, 143, 23, -40, -67, -30, -4, 201, -23, 108, -36, -179, -73, -27, -64, 8, 95, -16, -188, -126, 119, 22, 23, -284, -24, -92, -11, -114, -53, 110, -112, 130, -31, 65]
5255F5k17K5P2n5Q9p0K3j51J48O0p9J31j61J38K1j02k3J24j21M0J18n5OJ37j01
5280F2k02J89m6K25r5j27K73j75o1R6j09k3m6O0p9P2N4o2j16J51q5J69o9Qj9k23
5306a78J35j55J29m5no5J12M7m2j06L9R1j89K48k5j45J62k03J52j74K25j40k3
5329a55J53j04j5J63j2j06R4J96k85L63j72K7Qn8J43l01Q6k4k2l5J31m2M0r2J52
5354A33j59J18o5j42J05p7J12J64r0n5L3n7j33N3j3l8r0m3K01L4j58J34R6j44
5378h1j20K12p4L2k02K56j9j24lO9r8J70r6J33P4j60J31j07k8J33l2K1l2p7%K03
5404A81j42j71rJ64j15J24N2o1J5j40QJ16j9r8N7P2j8p4k8o5L16l13l0J85q3Q1
5430EnJ4k5p5O0O7Kr4j11J49j3M3k5J14j15N7N4%j92J78j01p2K03k5j30K45j43
$$ y = [65, -152, -127, -55, -110, -21, -91, -68, -219, -71, -11, -90, 41, -120, 18, 39, -63, -86, 38, -83, -43, 75, 20, 26, 163, 62, -140, 49, 3, 228, 133, 6, 279, 104, 43, 139, 30, 7, -39, 21, -58, 14, 68, 6, -110, 41, -44, 125, 56, 64, 45, -178, -43, -198, -69, -114, -119, -184, -72, -25, -67, -173, -134, -43, -232, 16, -9, -154, 8, -195, -43, -217, 8, -132, -155, -2, -106, -121, 42, 30, -76, 18, 214, -71, 292, 120, 147, 155, 97, 240, -61, 25, 1, -21, -56, 75, 33, 73, -19, 133, -26, 92, 27, -115, -10, -87, 25, 189, 99, 44, 77, 20, -113, -60, -73, -111, -201, -244, -43, -9, -167, -33, 63, -81, -201, 11, -63, -31, -233, 23, 4, -120, -123, -54, -152, 18, -78, 55, 129, -31, 100, -7, -35, 98, 66, 87, 55, -22, -22, 181, 39, -132, -141, 23, -92, 32, 84, 23, 38, -102, -94, 22, 3, -95, -38, 34, 16, -58, -86, -151, 165, -148, -178, 7, -76, 5, 0, 14, -11, -86, -26, 41, 43, -51, -162, -13, -26, 17, -8, 106, -9, 48, 102, 102, -90, 88, -13, -85, 118, 93, -37, 208, 65]
5457F5o6l1l4J17n0J1lJ64k88P2L7J11k12J89l7nj21J39O3l2l1j06q7O4J27j17
5483f1K4K5N7J33k73J50J2J51j9j90mj1p6J41Jj15n4J55m9j0J66L8o8j78q2M5
5509i2J68r7j94K57l8jK9j75M1K36j70j74J53n1J73j1l0j06J53j18L8K6R3k00
5533i0J50j97J09K02j53J79m5p1m5M4n7N1q4j32J7J19J46j37J48k84J13K82l85
5556a20O7o3J16j2L5k36L56j16K8N1o6L6k5m2j14K05kj47J15l8K0L1M7J13k01
5581C8l5k8q7J62R5p7j64J05j5m4K30k9k26J56o6O8k35Q9M9q8kM8m3N1k3k8Q5
5608a4k3j63R1J28%Q8o8M2j16J17k4J47k78nK15q7J23k39J09j28K05MPj36n0q5
5634a40NK03j71J04Q9l4J1k58m0J91j2O9k13K16J41k30J0O3n5j11J29m8j74K14
$$ y = [65, -1, -32, -66, 51, 1, 12, 9, 173, -115, -43, -6, 105, -107, 82, 45, 40, -81, 58, 121, 89, 58, -48, -135, -71, 56, -61, -37, -12, 45, 178, -95, 55, 67, 218, 199, 9, 5, -6, -82, 59, 60, -55, -109, 46, -3, -13, 153, 191, 123, -55, -137, -92, 76, -21, -215, 42, 4, 3, 32, -143, -102, 134, -36, -210, -57, -108, 65, 54, 24, -82, 71, -47, -9, 17, 110, -90, 60, -137, -28, 174, 21, 200, 155, 84, 39, 83, 26, 77, -7, -139, -122, -3, 143, 6, 154, -130, -17, 265, -120, -53, -116, 0, -12, 23, -213, 143, 27, 55, 106, 40, 76, 51, 9, -105, 100, 98, -49, 66, 28, 48, 79, 126, 239, 38, 3, -25, -112, 50, 145, 68, -96, 9, -6, -50, 180, 151, -75, 81, 15, 83, -152, -63, -14, -102, -104, -56, -99, -48, -71, -99, -14, -37, -200, -109, 19, 19, 107, 39, 81, -35, 82, 58, 205, -73, -78, 137, 50, 173, -66, 43, -85, 120, 124, 131, -5, -55, -140, -135, 68, -103, 1, 90, 56, 67, -191, -231, -40, -52, 17, -196, 20, 161, -69, -59, 4, -51, -162, -33, -81, -255, -41]
5658d1m3R7q2p5J53Kq0P6P9m04K55o1O9J36j20Q4J02p8q0J57j1N7n3o4m2MM2n6
5686B3m7J13N4N2k87K64j98j07J56j22J23l8j85J75j94K39j53M9R8M0p1R4k83
5709b05L95j3k87Q3Rl9l0K36k71r6L78J4k97j35L01qq5K0J5K8p9N4n2J50j37j64
5735b15K40l1r7J69R7j40R6j96K43o2O6r5k6j20P5l4J48j02q3J07j94J04R3P2
5759A15n8j99L6J58p3J73k23J28j82J35n6R8K2j66J45O0k30P7j05K26k02M1k5
5782a05J4o7O6R4pL3M4j19k5J54k18J25oK11k03lj29J76k8m3P6Mj33J36j4m2J00
5809I1kM2n2Qj01m9J64p3J04q7P2k05J38m3O8Q0n7L6k03L12j93m1M7K9n9j66J26
5836a4J71k13RN9j12J29o8j44J12l4J91p9p6J7p2M1J29k17K25mj79P1k15L85k14
$$ y = [-41, -84, 13, -69, -144, 9, 11, -69, 7, 86, -318, -63, -124, -55, 81, -39, 45, 147, 69, -11, 146, 135, 192, 139, 75, 33, 37, 79, 23, -24, 89, 143, 195, -92, 172, -26, -133, 23, -99, 24, -14, -199, -24, -218, 21, -132, -83, 15, 55, -16, 78, -205, 190, 177, -110, -27, -18, -57, -87, 149, -122, -218, 160, 174, -123, -258, 43, 35, -50, -30, -15, 13, -66, -12, -64, 86, -51, -215, 25, -6, -103, 66, 163, 23, 119, -77, 166, 104, 170, 75, 49, -71, 4, -30, 118, 16, -67, 40, -154, -50, 43, 115, 57, -142, -106, 52, -21, 152, -71, 57, -125, 10, -46, 52, 74, -92, 53, 113, -117, -40, -145, 81, -121, -80, -105, -91, -158, -92, 2, -5, 28, 72, -47, -72, 82, -136, -11, -17, 194, -9, -12, -141, 35, 7, -36, 40, 44, -89, 47, 33, -9, 91, 89, 131, 79, 87, -14, -63, 101, 28, 132, 45, 117, -88, 50, 7, 75, 155, 98, 134, -69, 243, 50, 9, 56, 85, 26, -140, -14, 157, -56, -47, 12, -100, 29, -39, -183, -71, -105, 86, 7, -69, -52, -124, -83, 46, -171, 54, 50, -129, -58, -273, 112, -102]
5861a02J04J01j46L8j1j40J30J15O8k20J41M4j59J8q8J60J16j77L7nj18K39mj38
5885CL0J06j05l5m8j13J67m1R4q3N5j00K3J8J01o4j39M1K06j3k71K68K4Ok26J18
5911B2j31K29r2q0J47j53J91k21R3n3J28j19K2P4n1k5Q5j27P0L7r5K07j05Q4j06
5936C1p1K51k5l57P2K18k48K13r6j26O0J17j09J80r7m4Q6J46k45k2O0J34K7j24
5960C1NJ35j41O0j59J31j0j09J63k60L27O2k80o9P1N1%o5J95j12K8j30J81j42
5984c7k6J98l2n2N1n9q1Q5p5K4q8O7j05M9J14l5J57k34N0J20j95J36j60M8J7m4
6010a07KORK08j21O2j54O0J9j23K68L8j95J24j00K8OP3j38k7M2j20j06K35N6J9
6036F4jJ2Qm2J18j75k3R6j20J89j0j60Q7j51J32j80J63j3j79J69j28L9K5o9P4
$$ y = [-102, 2, 103, -43, -5, -16, -156, -26, 89, 157, -63, 78, 122, -37, -19, -107, 53, 169, -8, 29, 24, -94, 145, 141, 3, 33, 139, 34, -1, -49, -162, 5, -36, 58, -25, 30, -70, -47, -29, 72, 8, -131, -90, 116, 103, -168, 100, 124, 130, -96, 22, -109, 120, 28, -52, 95, -58, 133, -88, 5, -48, 80, -39, -17, 57, 6, -19, 66, -61, 9, 46, -49, 158, 53, 137, 31, -40, 211, 186, -171, -99, 119, -129, 84, -12, -138, -78, 39, -70, 110, 13, -31, 55, 201, -44, -66, -6, 128, 155, 31, 36, 171, 30, 90, -69, 62, 52, -57, 106, -154, 173, 235, -45, -114, -43, 8, 8, -57, 138, 26, 54, -76, 105, -37, -63, 135, 103, 51, 102, 43, -38, 47, -28, -4, -92, -25, -130, -81, 33, -2, 155, -79, -29, 91, -104, 32, -128, -80, -63, -107, -105, -99, -90, 118, -3, 59, -95, -35, -16, -139, 129, 167, -28, 96, -4, 24, 30, 103, -35, -62, -20, -140, -246, -11, 45, 64, 63, 75, 83, 41, 159, -16, -39, 57, -63, 126, 116, -44, 43, -108, 24, -156, 7, -6, -185, -16, -144, -105, -80, -149, -75]
6061g5r5J30o0J01K2O3M1L5j4k1mj44J45q3j27N6J45R7k32J16o6m7J08j46Q9p0
6087c6Q6P1j56J22j13j2nO2p1M4O8j9N4j25P4j29R3m8J67j64L2M6k01O1M2O5O9
6114G7j38O5j06R2J1Q8j62R5k5o0J7P3k13K66m1r8N5k14K65p1NQ6j12oR1O2l1
6141G1j12j38R5K43k22P7N7M9j91j27K08k4k2L3k27J83J22k2j96K26p6LKJ44j35
6166B1J74j25j78k5J51k01K92j3o7m9J09n4p3J53p2j3n5P5k1k21J93N5p4K3R8
6191A03j81Mk0J69L2m6j41K3r6J18O8R4O0j71l7m8J7O0R1l3j13J16J1n2K5PjL8
6219I7N5k24J74j24P8J04k59K00j20J26lj86Q3k0J52j65K3J9p6j39J55J13k86
6242b23K64j26O8kl8jM4q1K9J27j1Q3k02J4K7O7J94k09j16l7K8J50l6Q6j62j63
$$ y = [-75, -170, -40, -100, 1, 23, 86, 127, 162, 148, 127, 123, -21, 124, 41, -86, -30, 115, 212, -20, 96, 30, -17, 91, -55, 34, -36, 50, 121, -35, 87, -26, -38, -43, 19, -52, -8, 60, 41, 95, -30, 44, -85, 8, -40, 127, -37, -5, 41, -160, -99, -57, 8, 77, -61, 4, -102, -10, 1, 89, -73, 22, -3, -63, -46, 27, -186, 80, 39, -59, -4, -218, 47, -24, -19, 67, -45, -51, 40, 102, 71, -41, -179, -84, 159, -63, 14, 71, 120, -71, -198, 10, -14, -36, -3, -230, -47, 75, 53, -143, 83, 7, 10, 12, 156, 21, 195, 70, -108, -133, 18, -183, 109, 96, 29, -20, 89, 35, -38, 115, 43, 30, -25, 50, 29, -192, 1, 56, -18, 5, 103, -78, -74, -94, 75, 107, 61, -80, -57, -153, -35, 33, 127, 187, 16, -21, -69, -52, 8, 99, 66, -47, 69, 80, 28, 53, 60, 59, 97, 152, -72, 102, -22, 56, 160, -99, 101, -19, 107, 104, -82, 1, -19, 133, -32, -9, 10, -66, -205, -50, 63, -223, 41, -85, -17, -19, -57, -58, -14, -95, -66, 61, 50, 133, -69, -55, -28, 39, 233, 24, -92, -129, -101, 49, 13, 99, -63, -226]
6268b26L19j10p9lJ19J56j90K60o4j95k58M15k44J79n7K4J07k54J34O8J21k32
6290a0J74m4j07m7PoL1rn7R8p7J5j3N5k3j71O0J77r3Jl6Q4j30p6K89m4k18K49
6318G9j64J33j25Q0m2P5j46J38K1r4LQ9r6O5J8K9n9l4J16l9l6N5j31P0L02k83
6344B4L1jJ81j39n7J86l70K83k89K09o1K1K3n7j7L8L8q5J13M0Q0l21P8J62k54
6369a44M6J81n6j85l9K77j58L6o7M4j6p6J83o9j1j8J70k33J5J52J5j06moJ39J22
6395A92r2l1k06K03K1n7RO8N7j77O1q5Q5j5J25R0j22j73J88n5K4j36L7M8j2j40
6421i3J62j19M2n7J94m1j51J17m6j94J17J58L7l31L01l20K18n1J57j12k00J27
6443h5l3Q8J57k13q4J32j22R5N3M2j46J95j63K3J11Q9j99L9O9N7q0q5J5M2Mj05
$$ y = [-226, 93, -17, -96, -99, 20, 176, -14, 246, 182, -13, -271, 144, -100, 79, 22, 46, 153, -101, 33, 101, 222, -10, 164, 120, 13, -34, -27, -33, -2, -11, -68, 30, -47, -32, -45, 10, -13, -184, -124, 53, -40, -39, -75, 9, -121, -197, 92, 48, -170, 79, -85, 48, -77, 3, -39, 36, -110, 28, 49, -45, -42, 47, -49, 16, 34, 63, 4, -30, 86, 47, 11, 66, -65, 5, 307, 24, 55, 54, 235, 96, 39, 225, -145, 138, -151, 58, -3, 18, 41, -16, -33, 5, 43, -42, 71, 111, 191, -130, -52, 110, -144, -98, 83, 27, -158, -197, 80, -78, -42, -109, -65, -81, -157, 26, -43, -54, -72, 98, -135, -120, 32, 47, -59, -63, -69, 70, 192, 100, 69, -137, 66, 87, 30, 39, 107, 164, -13, 48, -37, 48, 33, 158, 248, 126, -47, 141, 86, 110, -26, 11, 59, 47, -93, 69, -50, -8, -65, 129, 88, -63, 54, 8, -186, -69, 89, 126, -205, 96, -224, -6, -57, 100, -12, -212, -85, -118, -30, 127, -86, -170, -38, -160, -65, -12, 30, -116, 79, -84, -61, 50, 139, -60, -21, 48, 105, 25, -60, -45, -3, 1, -104]
6469a04Q0J13O9j80MJ22n1j61J63p0k7J13j1n3K9jk69J64J10n5R2j57Q6N6k7J
6495C6r8m7l5J41j6Ol0K4j46J93j29L2J87j79J17k81L2P0R7r4O7j65O9J02Q5j19
6521h1J23P6k22K04q3K00l17K09Onj56J10J19k63K50l3Q9k61O2o0J75n0j82Q4
6545fO7j43L27l75O8Rm1R7Q1p2rq6J18k33J68m8k1J09JL4j04L5k9R7j95K25n5
6572A9%n5Q0p1K3J8j03J02M0m3j6kLM0j39J97p8N3R9j77N9j92N03k15j29Q2Jk6
6600G3o7Q4j30K42j11j0k43J63R8M7j06l4r2K08j48Mm7kP1L9k79J49j08K99j09
6625iJ05r7l0M8j55P6K8M1kj11PJ89j44Po9nP1N1o7j36K05l1p7N6O2l0M6q0K92
6654B41j13j33R8n7Q3K1L0Pj49l9j16J47o4J04n6m1N8j1R5j92R7L6M2l2o9J81
$$ y = [-104, -24, 89, 158, -22, -18, 104, 53, -108, 55, -15, -42, 71, 60, 7, 36, 35, -234, -70, 40, -15, 77, -80, 6, 62, 35, 36, -62, -109, -144, -3, -19, -13, -43, -19, -165, 28, -101, -69, 118, -61, 56, -225, -193, -123, -26, -120, -53, -218, -149, -47, 38, -81, 42, 118, -104, 100, 17, 217, -100, 109, 115, 110, -46, 64, 183, -80, 170, 137, 226, -35, 27, -33, 142, 92, -90, -6, 61, -82, 245, -130, -62, -53, -94, 3, 84, 12, 3, -83, 35, -198, -30, -78, -99, 10, 11, 45, -59, -24, -53, 44, -151, 74, 19, 19, -36, 44, -27, -4, 14, -89, 13, 53, 10, -6, -8, -5, 35, -104, 93, 15, 68, 167, -10, 49, -143, 360, 145, 16, 98, 99, 73, 6, 90, -40, 202, 91, 81, -162, 1, 99, 146, 40, 6, -86, 122, -26, -22, -69, -71, 0, 39, -240, -91, -199, 100, -9, 96, -1, -31, 17, -138, -62, -34, 7, 5, -106, -99, 90, -54, -47, -116, -121, -50, 1, -66, -202, 3, -28, -105, -49, 13, -17, 29, -51, 241, 128, -5, 93, 36, 119, 140, 170, 177, 28, -11, -127, 20, -44, 60, 4, -37, 21, 10, 105, -87, 10, 46, 88, 56, -13, 168]
6680A68k04Q3j99K68j15P4k17M9P7j2J4k33K63r1J06j90J6K64k24J93q9K0l8N3
6704C6rk0j39J48k6J57k20P9j28P6l1J60k25J5K28L6j95o4K32rJ8o6j28N3K7L1
6730C6l4K28q4Oj84J05n3J62j46r4p7l8J65L4j07J22j2M5k42J9J64q5P3M7Mr0
6756c6Q9n4j70P8J17Q8r4O2j66J38nj1j31k1J09mlJ20k9o7J08oo0Q6r6RO8k22
6784a03q0J02K7J37P3k21N7j87O9L07j39j6R9k04K56j11j84K7J61j09K4M5k1l8
6808b9K6Q7j29l9Q2O3P0Q6r7j05j0Rm6j9K8N5o0MJ45j8o0n0k04L29o8Pl1M3p6
6837gm9n4J17N8j75l8J48j18J79j20Qr7Q2J24k20K00N6r0j1p2J27j26J12k27J72
6862b1J00r3M6L7k6j4n0O8p2k9J5K7J09l5qJ18k19Q3q2N7P2lN5M2k13j5J35j02
$$ y = [168, -36, 47, -152, 116, 1, 75, -142, -93, -16, -28, -14, -247, 16, -75, 31, -159, -143, 121, -103, 90, 1, 21, -17, 36, 27, 7, -132, 16, -10, 147, -73, 6, -122, -46, -77, 83, -142, -127, 101, 137, -58, -122, 110, 101, 119, 53, -75, -22, 5, 36, 2, 230, 146, 152, -32, 73, 20, 182, 36, -58, -135, -173, -8, 26, -81, 41, 29, 74, -168, -149, 15, -70, 3, 50, 54, -36, 53, -1, -171, -93, 24, 112, 18, 80, -86, 52, 47, 36, -95, -116, -7, -11, -14, 106, 77, 10, 118, 112, 52, 138, 42, 51, 119, -103, -183, -81, -54, 83, 156, -65, -8, -195, -126, 181, 42, 26, 125, -79, 177, 66, -118, -91, 70, -39, -15, 30, 9, -29, -3, 84, -45, -84, -2, 61, 131, 217, 120, 15, 5, 14, -32, -51, -23, 32, -28, -24, 121, 103, 43, -7, -211, 118, 50, 57, 26, 69, -7, -56, -110, 7, 65, -110, -148, 0, -118, 61, -59, -51, -148, -66, 58, -162, 38, 94, 4, -7, -79, 48, -78, 34, -193, -21, 79, -14, 32, 69, 43, 29, -21, 47, -25, -54, -39, -12, 97, 62, 54, 172, -47, 36, -46, 11, 83, 80, 135, 177, -36, -51, 84, -18]
6890a8K25k15p3N9J30q4J78k61P6l9J03k20J47P1j04j49J08N0o5J45n4P3k2P5
6914A36l08J55M3r4j0J8L4k8m7J77j32N8qn5O9r1N7j25J11n5o5K88j78n8J64P4
6940A30j54O8k8j24J37j7R7J5L4j88J39q7j18k7R8j7l1P4Q1q8j4J2j2l6Q9J4n1
6967dQ6o0j23%J3K09j29n5o2O7L0K3q5j05M5N7K6j14J28J08j41J46j55M5J9Q9
6993E8q1N4M6q7k4P7n9K99l24N7J48k27J14j40J87j21N5p6J62n8k7j09J11k14
7017a79M49k53j73J99o3Po7Po7K07k40J91k5j19P3K1M8mJ42P1k84J05j22L2o1
7042a05L9kM3j27J66p7Q9j85K64j23J23o4K6k4NO2Mj18n0J62p4R0j70J38p0R7
7068A19q5j16K18K3k10N4oOJ3Q5j98K10p5J07k67K03j8kr1L8k4Q0j61N5N2j37
$$ y = [-18, 207, -8, -81, -22, 108, 24, 202, -59, 17, -22, 81, -139, 8, 79, -25, -174, -66, -16, -81, 64, 10, 83, 61, 136, -172, -17, 26, -68, -78, -60, -26, -54, -101, 76, -56, 2, -6, -61, 8, -83, -26, -151, -40, -95, -160, 128, -50, -108, 56, 130, -24, 44, 16, -108, 29, 12, 109, 124, 158, -30, 109, 22, -96, -123, -25, -42, -73, 1, 82, -6, -20, -8, -20, -56, 33, 47, -4, 82, 22, -101, -101, -88, 121, -8, -63, -125, -58, -28, -5, -90, -195, -150, -93, -67, -181, -53, 55, -86, 60, -95, -50, -31, 58, -23, 31, 77, -10, -34, 43, -16, 283, -41, 16, 164, -63, 51, -89, 98, -23, 32, -44, 118, 60, 33, -76, 35, -179, 270, 17, -156, 43, -20, -13, -80, -73, -140, 67, -173, 18, -7, -126, -53, -32, 16, 12, 154, 225, -59, 46, -76, -44, -105, -66, -68, -25, -152, 14, -63, 26, -159, 105, -18, 105, 41, 67, 43, 48, 110, 114, -4, -54, 108, 34, 124, -46, 92, 22, 119, 34, -82, 136, 159, -51, 3, -3, 3, 16, 101, -97, 113, 38, 145, -122, 81, 63, 61, -30, 8, -16, 64, -97, -42, 10, -127]
7094a27k5J70J43k21Q2k18K21o6m0j0J50l5j6j03R8j22P3oJ97k78J64j77J69Q5
7118A08k27J90k6pl3j7oK70k53n1J27P5K3j27K08k86K13n5o9o2Q7r4R2n7L7N7
7144A17j61J23L5k29K2L0o8Q6k6R3k6j38O1n0R7%k2K1o1J74k95R3Q4J51l92K31
7170e0j6O2j3P5n8M3p9n7R8J4l1M9K21k31k1pJ09J15j81R6j21j1j10K01N5pK5
7197A70J0n2j31m7l6K01l16J36J02q0k5K7L7J6L1j99K85j88j5J00k23N6o7n3J63
7222i8J55k49M4J3k7K00r6L9j80K4J32M0O5O6k39J48p9J22j30J10j06J31q1q2
7246g8L42o8l12J72L1l3L2J02o0j59m3J34L1Pj01P5k1q3N2L2p2PO2O0j9n7K4q8
7274c1J67m8j93J09q5m1oJ22L0k7j17K0o5J25p7J38Qo6J13j59J11k52J34P9m0
$$ y = [-127, -152, 18, 161, -60, 22, -196, 25, -41, -81, -91, 59, 24, 8, -95, 3, -119, -46, -52, 145, -133, 31, -146, 23, 108, -119, 71, 45, 38, 5, -12, -18, 252, -1, -52, 75, 150, 173, 46, 254, -32, 181, 126, 57, -5, 82, -12, 80, 23, 60, 117, -44, 79, 114, -115, -93, -63, -131, -45, -71, 22, -4, -142, -81, -131, -34, -34, -56, -35, -96, 78, -217, -124, -40, 111, -281, -50, -66, -4, -17, 58, 0, 43, -36, -93, 5, 19, -12, 37, 258, 27, 6, -1, 108, 223, 42, 138, 17, 6, -104, 97, 152, 145, 170, 180, 128, -3, -50, -86, 115, -201, -65, 37, -43, -68, -41, -4, 12, 43, -156, 129, -59, -74, 26, -197, -141, -208, -261, -98, 57, -192, -148, -135, -162, 38, -58, -19, -199, -175, -43, -3, 62, 128, -111, 37, -42, 80, -50, 60, -46, 85, 4, -78, 264, 196, -116, 56, 87, 54, 86, 188, 128, -31, -74, 60, 91, 98, -3, 72, 51, -32, 20, 52, -20, -13, 49, 109, 90, 33, 57, -31, 136, 88, -105, 4, -81, -122, -128, -6, 24, -3, -120, -100, -165, -40, -117, 21, 29, -37, 76, -83, 28, -224, -90, -11, -51]
7299e1l2J09r8r7J58j42L81j78J07j92KK8O7o2r9M2J56k4j50L1L02l48N0J54j58
7324d4P3K0o7n8L9jk9J06J0R6q6J8n7P6k30O4J53j44Q2q1K06j58o3K3J04k6N2
7351G8k07j0k5P7L4q3R7N2m1Q1N3k8j46L5Mj9Rq4J13O3j66J14j2J8q3J71K2j75
7379e8J27J14j78J97k17J57k17J48n9K63k15j34Q8OO8o1j14P1NL5J60l59J20r
7403f2Lp0K71j32k21K39j28p2J65P8j04J41k0j54Mo1J40l6K0M4p6m8L4j12L43
7428A86k19J83j67L4r0J27m4lj9l8j1nK9Q5j16j7Q5K39j85j18m7K02Mj91J83K1
7454A08q7o9P2O0j18J14Q0k90K67j64r0J21M3j00M7N3jj03O9Rm4j15K37l24J69
7479e6J52j84J81k84K84l5j03J05K9l4n2O9l1j98J41m8J7r7J89o0R7j16j25K37
$$ y = [-51, -83, 26, -72, -169, -11, -153, 228, 50, 157, -35, -33, -5, 62, 0, -99, -57, 99, 75, -75, -44, 258, -90, -40, 114, -44, 29, 49, -18, -76, -37, -38, -67, 39, 49, 145, 59, 77, 20, 96, -134, -70, 83, -61, 21, -60, 146, -12, -75, -52, 52, 26, 78, -129, -139, -164, -87, -53, -136, -39, 13, -28, 53, 106, 78, -68, -33, -29, -48, -39, -123, -10, 53, -113, 1, -11, 7, -76, 95, 117, -58, 69, 183, 5, 202, -15, 142, -75, 73, 14, 277, 62, -72, 16, 22, 90, 29, -85, -14, -9, 26, 186, -173, -53, -62, -59, -129, 142, 10, -211, 28, -100, -172, -7, 71, -33, 108, 88, -66, -62, -123, 17, -19, 1, 45, -31, -79, -45, -157, 186, -33, 150, -17, 17, -73, 54, 10, 7, -12, -50, -61, -66, -37, 48, -68, -85, 0, 239, 54, -64, -111, 91, 95, -96, 87, 108, 21, -48, 24, 84, -34, 80, 160, -130, 137, -27, -117, 4, 47, -53, -6, 47, 46, -57, 12, 21, -23, -138, 99, -225, -56, 96, -88, 93, -191, 93, 58, -45, 60, 89, 55, 3, 72, 41, -157, -16, -64, -47, -144, 45, -15, 82, -34, -159, 78]
7503G8j47MO7R9j9j17o8J2q6J95J5L2n4K46k40K8j23m4J78n1P9J0q7m7J28o6M4
7530F6l5R3j39K15j51j68QK76j45kJ13j1j20o7J97k22J21m8m4m4J35R4j89K55
7554A88j27N9K5j86M0M1j1r7J65j98k2J9N8K5J26j69p0JK93n2lJ7l21NK27j36
7580a03P1J36j27O0j99K03r1Q5N0j57K00l71K57l2J2q4Q6K2n5R0ln4P6M9k19J06
7606Hj2L2r1K03j60J16j78M9k8k1J6J19oj16J02j54k5J9kN4R1j5P6j38o0J31M4
7633E4o6j43J03O6O0K5p5n6m3K04K1p1j0j71J73l4o7O0q2J47j67J46O9j47j43
7658a47K47k2j02M5J01o7j52J80j99J1o0K23o3K9R0p5r1M4R5km6j8j9k08K34o9
7684d1p6K22j94K0O2LR1j47K47l8k22J6J88j81L8lN9j23K3QJ06J7L9j41O2Lop6
$$ y = [78, -69, -65, 2, 101, 82, -35, -103, -91, -177, 18, 33, 65, 11, 257, 17, 45, -78, -122, 56, 5, 84, 94, 7, -40, 88, 22, 66, 31, 124, -15, 200, 49, -119, -111, 165, 20, 18, 131, 120, 0, -67, 130, -92, 29, -19, -63, -107, 28, 122, -67, 188, 61, 120, 145, -41, -1, 40, 29, -68, 97, -101, -123, -104, -46, -21, 105, -64, -134, -133, 160, 108, 105, 122, -199, -194, 33, -103, -32, 104, -23, 37, -162, 41, -50, 35, 85, -72, 128, -243, 14, -18, -6, -90, -4, 18, -37, 53, 50, -4, 72, 121, -98, 8, -4, 28, -63, 140, -20, 96, -82, -33, -61, -82, -66, 53, 47, -69, 33, -121, -146, -127, -129, -75, 16, 1, 77, -61, -121, 10, 54, -12, -155, -52, 14, 74, 99, 24, -32, -75, 129, 150, 79, 69, -102, 71, 37, -30, 30, -52, 95, -72, 74, 143, -4, -147, 100, 78, -24, 21, 122, 55, -97, 83, -116, -105, -165, 58, -5, 24, 114, 39, -52, -8, 87, 85, 39, 21, 2, -206, 28, -41, -117, 105, -89, -69, -7, -4, 87, -60, 187, 149, -73, -57, 131, -50, -12, -15, 44, -79, -56, -48, 58, 75, 114, -27, 35, 38, 32, -44]
7712d4L13k49q0M0L4J6j43qMJ09j1j47J10M3P4k7Q0p0m9o6K5J24j97M5k8Q7q0
7739i5J79q1o8L9j13K68j58Q0K3J35j95j8J29k06J69l4j38P2Q5k54J61J16j84
7762h8J50r7n2J61k1j87j7oK19k66K60j17Kk6Q5o3K6L4P7j17K55j11k0p3Jp2K6
7789c7N1P6L1j8L9K2j82Rn7J99k72J94j49k4J12j46O4N3J15o4J68j16j40j07M2
7814a37J14l0l7J08k29J12P1j6np6Q6Q6n0n0M7o9p5J57r2K20k02nQ7J1p7k2L4
7841c9j6Q1j77N9K40j28q5jj03J39O6J33J2k0j16Op4J35j11j2j4p7J60L0j44Q1
7867B5J54j64o6L9K4j27m7K09N8K2k9L3m1j03QJ01p5j7k46K95j86J17nJ3N1J00
7893A43j47L0J07oj55J47p0K5j31J5J07k0j05J91%j22j25k9J89M3l8K7j26N5l5
$$ y = [-44, 269, 20, -60, -20, 14, 30, -113, -121, -117, -8, -19, -166, -56, -13, 61, 34, 114, 44, -5, -71, -46, 78, -119, -74, -102, -15, -95, 84, 3, -65, -26, -139, 129, -29, 51, 74, 209, 14, -4, 125, -81, 88, 54, -84, -12, 73, -181, -20, 96, -88, 62, -35, -87, 74, 53, -134, -151, -157, 62, -204, 56, -61, -59, -85, 0, -63, -37, -3, 74, -43, 212, 101, 81, 8, 9, -63, -37, 14, 90, 121, 103, 142, 164, -18, -9, -66, 133, -139, 55, -94, -118, -6, -152, -88, -35, 80, 16, 184, 68, -72, -179, -137, -23, -53, -90, 18, -211, -99, -28, -44, -49, -125, -39, 47, -3, -53, -6, -75, -150, 7, -85, 135, -67, -72, 15, 26, -51, -73, -39, -55, 26, -151, -92, 148, 20, -65, -66, -169, -30, 36, 169, 181, 161, 45, 51, -23, 112, 1, -11, -25, -102, 58, 88, -56, 25, 179, 15, -51, -12, 12, -115, -162, 47, 105, 127, 98, 131, 90, -13, -5, 96, 21, 4, -242, 53, -133, -16, -21, -8, 43, 143, -4, 26, 133, 127, -28, 119, 49, 74, -57, -42, 65, 45, -60, 131, 131, 9, -116, -145, 44, 87, 49, 76, -50, 5, -30]
7918c0J16k05M8R2j02J28n7M5K8q3K72j74j08K56k20o4j5J58k28M3J25J8r8p3
7942a28Pj08L61k14l6O1r5J33k4j8O6q1R0L2l5k07J58O6j75J64j0r8K56N2j74
7967D3m5n6O2O5p3J80j0o1j65R3M8l4j7j06J70j45J29J75j56j66J55j45O4L7j9
7992B3L4j85K09j08K6J1n7J02nq1J33k19K10k5j34Q8p2J62n0n8Oj62J67K49k23
8017D1Mj03R5j85MJ89K2j87K56k37K88r6q6q2j00J68o7J30k1n7K27k91Q5M2no3
8043b9P2p1K22P5j63l7k12K31m1j22Q7j50R9J64j18J87l16R5q5K44n0j25RJ09
8067G5m2j41J46p4m4lK7O2q2P0r6r1L25N3k83Q0j37k1J28K2J40j39N8j32J10n4
8093d3R6k38J88o8N7P8K4k4j72P2n9J48K6q2lk0m9j09P6J15J38l19L77k15j6M7
$$ y = [-30, 86, -119, -71, 21, -81, 47, -10, 35, 63, -20, 252, 78, -30, 226, 6, -58, -73, 85, -143, -100, 25, 43, -55, -128, -121, -229, 132, -82, -118, -57, -152, -19, -43, -61, 5, -76, 14, 46, 11, -196, -38, 28, -147, 17, 7, -91, 165, 217, 43, -2, -58, 4, 69, -4, 176, 166, 105, -60, 33, 81, 47, 30, -76, 94, -51, 78, 253, 97, -69, 86, -59, 5, 42, 23, 57, -128, 81, -27, -1, 10, -47, 55, 50, -31, 102, -117, 93, 68, -66, 22, -50, 112, 62, 4, 10, -152, 15, 264, 41, 45, -58, 37, -148, -144, 45, 67, -120, 136, -101, 187, 91, 5, -77, -177, -9, -76, 54, 33, -24, 203, -88, -3, 39, 34, -29, 43, -28, 194, 269, 106, 69, -143, 88, 47, -75, 12, -138, -39, 125, 7, 194, -122, -27, -112, 132, 82, -43, -34, 75, 33, -108, 38, -36, -80, -83, -56, 6, -76, -6, -102, -193, 132, 185, -98, -18, -155, -176, -48, -26, 114, -25, 33, -99, 11, -43, 53, -185, 3, -65, -8, 70, 94, 70, -102, -30, -89, 59, 85, 3, 0, -20, -69, -178, -102, 13, 151, -168, 209, -6, -22, 25]
8119B5o1J3J42j42k9K57k39K44k11K3p1J27k20J83k02J73K7j6k1j64K35m6M5j43
8143g1N9j26J25J18l1j08J32k6j26P4N7jp2J1K5jq8J55j79J83j28K8l7o5P4J71
8169A53m4n2o4j6J2K3L2k35K89Rj33L0m1J2l0P0j07M3k1j1J38o
$$ y = [25, -36, -23, 119, -23, -52, 205, -34, 210, -1, 22, -49, 78, -142, 41, -161, 12, 39, 23, 2, -162, 73, 27, 72, -71, -12, -138, -13, 105, 74, -34, 98, 72, -54, 20, 77, 76, 4, 15, 40, 39, -49, 106, -73, 110, -18, 10, -27, -92, -18, 153, 109, 57, -7, -23, -11, 12, 44, -191, 98, 107, -26, 4, -37, -25, -55, 15, -92, -49, -70, -81, 57, 51]
8191E1
$$ Imaginary data points
##PAGE= N=2
##DATA TABLE= (X++(I..I)), XYDATA
0@%%%%%%%%%%%%%%%%%%%qJ6j6J6j6J6j8K6l2L2l9M7n0N8o6P4q3R3j06J19j31J43
41G5j59J80k01K20k44K71k97L27l60L95m36M82n32N87o49P20q01Q96j007J138
61F05j298J499j758K105k605L380m766Q023k9736k4041L0325K316R494J1476J1997
76A7016M904Q890J2591Q609J345J5228Q094J16P167O603j010R96Q01K836n472
91H8714k443M201o951p093M12q263r051o189o660q842j1693m388n598j4821m952
106c617m706j3125p631n303p895q518n531m24p759n424L631m973m907M196r58
121g2944j394K905L890L765J000P078P192M15P577Q136K497P168P440O577N906
136b792M854R883M248K538R343L592J769O735L104K664J824K798L281k975J047
$$ y = [0, 0, 0, 0, 0, 0, 0, 0, 0, 0, 0, 0, 0, 0, 0, 0, 0, 0, 0, 0, -8, 8, -8, 8, -8, 8, -10, 16, -16, 16, -23, 24, -26, 32, -34, 40, -43, 50, -56, 63, -68, 75, -84, 96, -105, 115, -129, 142, -155, 172, -188, 207, -229, 253, -279, 308, -341, 379, -422, 474, -533, 605, -693, 806, -952, 1153, -1452, 1928, -2838, 5185, -24551, -48592, -18267, -15951, -6457, 5019, 17016, 21920, 30810, 43401, 52010, 53355, 68583, 76677, 76793, 83960, 90563, 89553, 90549, 91350, 94186, 88714, 86271, 90472, 83521, 76428, 76840, 68577, 59526, 53337, 46677, 37835, 26142, 21754, 16156, 1335, -3617, -8323, -21448, -29079, -34382, -42277, -50795, -56326, -56750, -64509, -69933, -66302, -71275, -76182, -71986, -72944, -74338, -71433, -67543, -63778, -62778, -55700, -48508, -48093, -40516, -32380, -29883, -22715, -15275, -8698, -2792, 2062, 11945, 16193, 18731, 28074, 31666, 33435, 40170, 43274, 45938, 47762, 50560, 53841, 50866, 51913]
151E1913K881n375j002J130m447k723k438k261m966n812j008n622p653p98m975
166F844o836k084l962m492m380l315j718n793k262K89m577j002Q48j888J1p52
182c5069J199O86j576L773J843r74M676K733J080L366K651L239J514K199N507
197c153K36K091N987N62K095L629J244J579R64K529J262j427L228R93k551K798
213B2066r3k008L57j374o44j396j921R43k894k192J008l197j869j033k220p40
229B793k953r25J6l717R3L7l232K54q27j453m10j077J190j014j231K845j077j154
247a1842K646r46K10J270J88J419k69J612J858j299K175J613j212J840O20L70
263B53J513m83J801M72p58K233n03n99J729n47l2L31l02J154j356m19J709k117
$$ y = [51913, 54794, 49419, 48417, 49547, 45100, 42377, 39939, 37678, 32712, 26900, 25892, 20270, 12617, 11819, 6844, 8, -2076, -6038, -10530, -14910, -18225, -19943, -25736, -27998, -27709, -32286, -33288, -32440, -34328, -34317, -35069, -33870, -33184, -34760, -30987, -29144, -30118, -25442, -22709, -21629, -18263, -15612, -12373, -10859, -8660, -3153, -2917, -826, 5161, 5723, 7818, 11447, 12691, 14270, 15234, 17763, 19025, 17598, 20826, 21819, 19268, 22066, 21973, 19965, 20322, 18948, 18304, 16908, 14987, 15930, 13036, 10844, 11852, 8655, 6786, 5753, 3533, 2793, -160, -1085, -1069, -4786, -4693, -4656, -7888, -7634, -8461, -9914, -10324, -11401, -10211, -11225, -12456, -9611, -10688, -11842, -9196, -10142, -9932, -8662, -8474, -7055, -7324, -5712, -3854, -5153, -2978, -1365, -2577, -737, -117, 253, 1766, 1283, 3084, 3556, 2798, 5031, 4528, 3929, 5658, 5111, 5079, 5410, 5108, 6262, 4906, 4487, 6196, 4079]
281D079qQ13j897K25j85n69j13j269Q65o34k057J419p77j507R66r90k47K11q04
300b479P55j182n9J217j957N52R91j127P60j61Q5J000j192J005O84j209J433j29
318a013n23J488n82Q81K98m46J775q93l65J780j054J85J035p80R42l76K11N27
336C090j381R74L56j997J684k15j058Q87o21K0j34j046Q11r71p05J008j633J82
354g49M75j065K78m82n21Q76j592L96L24j203Q95j74l70O66o63L27J15j079J582
373a964n43l55J459n65J59J044o12Q19k41J21J132q62R95Q02q99J302Qm08P74
392B166l14L96M67q66J079k25l90J045r93K65P3q07P51o75n06J097j116j4O01
411B034j188J98l98o71M52j108L78L51j182J102n29q98Q47q23n17N96p61R95m82
$$ y = [4079, 4071, 4884, 2987, 3212, 3027, 2458, 2345, 1076, 1941, 1307, -750, 669, -108, -1615, -649, -1639, -1886, -1675, -2479, -1724, -2906, -2965, -1748, -3705, -3153, -2162, -3289, -2529, -2690, -2605, -1605, -2797, -1792, -1108, -2317, -884, -1013, -1536, -48, -630, 251, 549, 103, 1878, 985, 620, 2400, 1346, 1531, 2566, 1786, 2728, 2352, 2563, 3090, 1709, 2683, 3039, 1042, 2726, 2511, 1453, 2340, 1719, 1739, 1605, 559, 1370, 399, -306, 702, -931, -749, -274, -1339, -1061, -1543, -2064, -1188, -2780, -2384, -2060, -3263, -2368, -2542, -2912, -2246, -2909, -2582, -2467, -3546, -1964, -2507, -2862, -1403, -1968, -1809, -765, -1377, -558, -799, -678, 454, -408, 587, 1389, 490, 1792, 1800, 1392, 2166, 1852, 2248, 2715, 1849, 2928, 2703, 2313, 3358, 2365, 2630, 2703, 1896, 2647, 1972, 1466, 2563, 1447, 1433, 2034, 846, 1044, 646, -25, 427, -681, -303, 48, -1134, -32, -561, -1459, -612, -1435, -1952, -1356, -2117, -1122, -1604]
430a604j67J044j152L75O99j326Q52M3o79J240n46N09O83r39R08l27n61R19q02
449h31N80M72n98R96m72m34R44j008O5P34j011N49J05l08P79r67M71J64j120Q32
469e8l09m35J019m31J35P28q30P17l36l27J063j011L69L97k67O98K2k08P34o71
489I99lO03o56Q31j17m58R68m03J7K84j020O19j97p07P64n42k11M60q98K89m65
510A57o49K38r40p3M51j159P26k93p07N31n32j99J51r52Q47k25l31J019o15K03
530b352N99o84O42r2k02Q63k15N49O66m44P22K54j62P01l43M94O86m09Q50N28
550B651n30R12n69L7O56o79N19l99n3O91q48J5L02r27M5k46p82K09m27l99L31
571E09q70K35l99q11L09q19j26N0p70P74k91n96P36o75q0M64o68N54m7k21R12
$$ y = [-1604, -1771, -727, -1879, -1504, -805, -2131, -1279, -1236, -1915, -675, -1221, -712, -29, -968, -60, -387, -948, -29, -831, -251, 221, -377, 619, 147, -287, 657, -351, -286, 448, -563, -14, 91, -217, 562, -405, 66, 230, -890, -58, -367, -802, 217, -214, -79, 649, -181, 536, 200, -127, 936, -75, 294, 691, 424, 1122, 1144, 936, 1670, 999, 996, 1599, 943, 1774, 1657, 1199, 2167, 1764, 1781, 2065, 1045, 1664, 1467, 760, 1524, 982, 771, 1231, 333, 622, 157, -492, -254, -1194, -1267, -816, -1975, -1249, -1542, -2249, -1718, -2250, -2449, -2298, -3250, -2403, -2628, -2959, -1940, -2555, -2352, -1753, -2437, -1795, -1887, -2089, -1226, -1441, -892, -226, -670, 52, 306, 144, 845, 502, 996, 1682, 1273, 2123, 2651, 2121, 3033, 2464, 2501, 3157, 2478, 2997, 2598, 2545, 3236, 2388, 2403, 2705, 1778, 1823, 1577, 795, 1004, 577, 178, 509, -361, -126, -525, -1336, -1027, -1846, -1972, -1922, -2692, -1918, -2209, -2805, -2069, -2744, -2824, -2360, -3028, -2474, -2521, -2742, -1830]
592a830k16J55P30o44P46K69m39Q31NN23O80l46P93n9L1Q98m19K19O12o54P39
613B624R5l17O83o26J07L11q65L75j2o59K95k19k78Q4r69J98l62q68N48n88l78
634h21J6p43K03k10m27J35n68q1K08n83L59N0o36P32k70q9M73m30L71J01k74J044
656a440k57J49P37l64O91L82l45J041p0J99P35l48P35K85l1O16l14J83M47n63
676B468P37k8n22P97n10P9N0o07J99k50m41K79m91l67J73j145M46k74q72K94q09
697g94m23J50q30J60j40p56J68m82j74K26o97J59jn03N06l16K31L94l25L56K83
718b808nR81l92M39O36J34O04K03P6Q67J49K84O12j37P98L74j37P32j11J99M90
739C988l97N88q8m54N86l81j61N5l85%k35p99L00p86m49J5r84J27m87p34o2q01
$$ y = [-1830, -2046, -1891, -1161, -1805, -1059, -790, -1229, -398, -393, 130, 810, 464, 1257, 1198, 1229, 2127, 1708, 1927, 2539, 1885, 2624, 2719, 2402, 3085, 2459, 2566, 2877, 2012, 2387, 2375, 1716, 2011, 1792, 1514, 1598, 629, 827, 465, -403, 145, -443, -821, -805, -1548, -1345, -1555, -1982, -1847, -2415, -2496, -2288, -2871, -2512, -2462, -3098, -2366, -2636, -2725, -2252, -2682, -2311, -2210, -2484, -1440, -1697, -1548, -811, -1175, -484, -102, -447, 594, 524, 723, 1458, 1110, 1845, 2130, 2099, 2715, 2401, 2584, 3031, 2468, 3205, 3177, 2655, 3452, 2942, 3021, 3071, 2464, 2663, 2413, 1972, 2251, 1760, 1393, 1566, 421, 867, 593, -279, 15, -794, -1217, -1067, -1897, -1737, -1877, -2633, -2465, -2947, -3121, -2895, -3592, -3433, -3434, -3937, -3431, -3747, -3516, -3122, -3447, -3091, -2808, -2813, -1832, -2224, -1785, -1149, -1015, -411, -208, -132, 735, 884, 1168, 1780, 1643, 2441, 2815, 2678, 3410, 3299, 3498, 3988, 3591, 4179, 4091, 3637, 4223, 3842, 3681, 3736, 3351, 3351, 3116, 2317, 2617, 1831, 1382, 1397, 413, 540, 53, -681, -743, -1544]
761a544k40k35r24o1m2o08J86n59k36J12m99K71j14j58M91m5J10N07k3N15L57
782b739k83J125k7N60R01j96R40P79l0P66M34K74Q29k06P81L04l48Q26N2K85M02
803E429n61L68j74n66L73n55j84K08j157J3m77o98o7q88m47k96r92l83l06r52
823b312R2p24o43j64p52p6k81o44L32k73j44L11m00M15Q7l12P43J97K13P16Q9
844c530Q05M70J63R84K23N90R90k5R96N23K29R66K92L25O27J17L74J31L6M89L1
865E806k96M35l67j48j08n88Q7p05m18N0q06l45m82p71j57q81p04j94r74l37l13
886b216q93Jn25m41L9p19j29j39m87N98m64O6N66l12L88L90j68P33J42L65N12
907b693J85P44L44J77J122kM16P51O6N04N12K67M77L21J35N52k44K57K32j54K51
$$ y = [-1544, -1784, -2019, -2943, -3004, -3046, -3654, -3468, -4027, -4263, -4151, -4650, -4379, -4493, -4651, -4160, -4205, -4095, -3588, -3611, -3096, -2739, -3022, -1897, -1924, -1364, -463, -659, 281, 1060, 1030, 1796, 2230, 2504, 3333, 3127, 3908, 4212, 3864, 4690, 4742, 5027, 5429, 4868, 5236, 5062, 4496, 4869, 4314, 4130, 4338, 3181, 3194, 2717, 2019, 1952, 1064, 617, 321, -671, -1054, -1360, -2312, -2220, -2944, -3587, -3751, -4503, -4579, -4860, -5504, -5172, -5445, -5589, -5278, -5678, -5263, -5176, -5488, -4745, -4548, -4335, -3619, -3530, -2725, -2255, -2092, -1108, -885, -295, 695, 670, 1666, 2189, 2418, 3384, 3676, 4001, 4628, 4745, 5119, 5250, 5286, 5775, 5806, 5510, 5945, 5578, 5430, 5322, 4734, 4821, 4116, 3698, 3748, 2942, 2597, 2115, 1344, 1187, 306, -398, -592, -1566, -1903, -2216, -3109, -3108, -3633, -4074, -4035, -4754, -4883, -5022, -5509, -4911, -5375, -5309, -4743, -5055, -4667, -4277, -4445, -3712, -3570, -3205, -2693, -2508, -1764, -1420, -1243, -121, -123, 293, 1044, 1110, 1614, 2126, 2393, 2870, 3191, 3326, 3878, 3634, 3891, 4123, 3969, 4220]
928D220k24j18M19p06O7k41o35J7l00l97Ro81j05j14q03m9n88l34j14o03p8j48
950a506m50ok30j86J79l50j35J75k89N64l84M9N04k77M70Oj37O02rn1N48j15L93
973f35K03o2N25J32m9M78k80N04M6j34M89j56L6K39m08K08J0l74M30j37l20L52
995A097l12J7om52N2m0q6O2k55K3J58m63N05l17k30M10m75K18n2k71M54j66k74
1018d03M20k40J14j6k94M10k32M6L35j89O2M52n41M96k80k39M26l00K9K29m8j51
1040H6l3r8K25k89j39K42n14L53p7k18L94l82K03Kl62L84r6k59L18j32K63rk62
1063d00K48k02K29Nj02K17q5k3K47j47k07M15j51R0J09j39J63p2r1L22k51J74
1085C49M5l72L48j10j97N15o10J60K09m06M04l27JK27l84K18j9j88K43r0OJ27
$$ y = [4220, 3996, 3878, 4297, 3591, 3658, 3417, 2782, 2799, 2499, 2102, 2111, 1430, 1325, 1211, 408, 359, -229, -563, -677, -1280, -1358, -1506, -1956, -1962, -2192, -2378, -2199, -2549, -2684, -2509, -2798, -2234, -2618, -2569, -2065, -2342, -1872, -1866, -2003, -1401, -1410, -1461, -913, -1028, -635, -432, -494, 31, 163, 114, 592, 312, 816, 862, 728, 1217, 1061, 1097, 1336, 928, 1136, 1146, 772, 1202, 1065, 745, 1097, 785, 802, 796, 344, 396, 356, 270, 332, 77, 100, 258, -205, 300, -17, -247, 163, -312, -94, -146, -417, 37, -129, -403, 17, -223, -109, -125, -419, -9, -241, -195, 140, -49, 13, 465, -76, 420, 140, -99, 327, 27, 56, 285, 237, 86, 53, -45, 180, -109, -248, -6, -520, -167, -244, -462, -68, -450, -247, -245, -607, -223, -319, -578, -260, -392, -129, -138, -400, -152, -354, -125, -120, -222, -5, -90, -113, 134, -13, -220, 195, 44, 134, 243, 104, 267, 195, 104, 426, 175, 349, 394, 22, 370, 260, 63, 578, -32, 128, 337, -69, 335, 8, 9, 236, -148, 70, 51, -137, 106, 16, 22, 149]
1107A49k71P3J30k60L00q1j35J46j13L23O1l75J99j34N8K62l74K36M5j93L36k00
1129A82j90L35l16l6J83l73L43j94j48L70m22J95m9k24K42n5m26L26k36J66Nj13
1151d35J76j47p7L67l90J38K94m05M63o2J16K6j43K48Nj25L56k72j37N01k21J84
1173D60O6j10K33k56q0L24n6n7L11m64L26j50k59K16l10Q4Q6k18J90j37k67mj68
1196b40P3rj74J27n7k77J97k87K22N2j92p8P4n6J68q7J2L00k45L23k94O6L91k63
1220b54J86J21k06K33J40k60L07r8J78N8l17L93j96j10J90J8n1J09j11r9j43q5
1242CL41n0j64l0j62o1J42k31L32k66r2J73k49K14p0K01J2Q0j54j2o3J01l1M9
1266A3K03k56J55K39l19K76j13j06L64n5n9J50k93K88j89q7J75l30J85L0l64K97
$$ y = [149, -122, -49, 81, -179, 121, 40, -95, 51, -62, 261, 322, -53, 146, 12, 70, 332, -42, 194, 239, 46, 382, 182, -8, 327, 11, -25, 158, -215, 128, -66, -214, 156, -266, -71, -120, -344, -102, -157, -583, -257, -493, -327, -322, -435, -259, -406, -483, -116, -506, -368, -74, -479, -16, -78, 38, 64, -79, 169, 174, 49, 405, 133, -4, 497, 276, 460, 526, 416, 649, 393, 313, 637, 581, 524, 835, 371, 697, 547, 288, 504, 194, 278, 364, 146, 336, 199, -68, -72, -240, -167, -176, -350, -223, -280, -557, -360, -647, -425, -373, -565, -643, -569, -625, -457, -544, -532, -232, -477, -154, -448, -382, 9, -254, -68, 53, -153, 80, 220, -40, 267, 169, 347, 405, 88, 481, 285, 175, 365, 383, 332, 441, 330, 231, 88, 3, 344, 294, 130, 100, -62, -123, 19, -212, 120, -146, -238, -65, -314, -100, -170, 31, 43, 123, -31, -43, -106, -5, -36, 13, 216, -40, 115, 354, 35, 311, 198, 92, 456, 401, 342, 492, 199, 487, 298, 211, 386, 56, 241, 271, -93, 204]
1288B04j93l63L63m00jk6k75P2j21l5J46l79K3K64m69L21L5l51J33k0J20R7J9
1311h36J76K60K2O8R8Q9L34r5M57j11m7N64j34J38M55n27M02K50P2K42j38O8J29
1334A936l14J31j00k63J36r0q8j22l12j4k55l72R5l62j19k88k29j94J01m56o0
1355a239m14o6l1m00R4o6k35j9r5J03J81k04L03Q7p7L80Q7L0J17M34M03K2N7N16
1379c2J05K09N34j24M49J74K22K85J50J40M39l55M21K3j05J61o5o1J84k07Pk18
1401B336j75j71k17l20j24n25N4l85k09k39l31k39k75l77j16j64m93J97m48o2
1421b283l0n26M06k30j40M35l24J15M8M5L55j1O4N35PQ2M13J53L45K65R8N39l4
1444C27K64L11L4N23N9N5K22J14J87J99j61J48k4J30p7L2o0J11l28K8k90l03m3
$$ y = [204, 11, -352, 11, -389, -390, -416, -691, -619, -740, -775, -629, -1008, -985, -721, -1190, -869, -834, -1185, -1052, -1072, -952, -855, -836, -660, -400, -378, -310, -212, -123, 211, 116, 573, 462, 415, 979, 845, 983, 1438, 911, 1313, 1563, 1635, 1877, 1739, 1807, 1936, 1622, 1753, 1653, 1390, 1526, 1436, 1348, 1226, 914, 900, 645, 273, 368, 6, -113, -401, -630, -824, -723, -1179, -1239, -1653, -1719, -1750, -2150, -2056, -2122, -2357, -2376, -2471, -2368, -2187, -2391, -2088, -2001, -2078, -1698, -1611, -1581, -1464, -1030, -627, -605, -548, -32, 73, 282, 816, 692, 1141, 1315, 1537, 1822, 1972, 2112, 2551, 2196, 2617, 2640, 2535, 2696, 2631, 2570, 2754, 2547, 2554, 2336, 2161, 1990, 1773, 1453, 1329, 804, 858, 473, 264, 25, -306, -545, -820, -1197, -1313, -1477, -1970, -1773, -2221, -2283, -2313, -2839, -2433, -2663, -2803, -2368, -2692, -2577, -2529, -2484, -2129, -2140, -2076, -1541, -1534, -1452, -1039, -886, -541, -276, -178, 361, 327, 591, 902, 936, 1459, 1518, 1573, 1795, 1909, 2096, 2295, 2134, 2282, 2258, 2388, 2311, 2343, 2283, 2394, 2066, 2094, 1804, 1501, 1458]
1467A458l04l4l22p3l16k53j36k21l80J3l12l92Q0k83k21J40k19j6J9k93K52j88
1489b001RK99l91K67J4J63K50q7J39K15K00K90J31M6L18M78m9K58J8K6M82j60
1511I15L21J31OJ59L2KJ43p5r8K34j33J61l99Oj00j93M9q3k40P0m32j22k4l35
1535ej5j79m42O8q0j93Ol00N8j62j81k8p3R3L5j70r5J93K5L60j68k3K19j70M88
1560g39O9o1J91L0K38M49j30L35O1K02l2P1L43K76j81K01p7J64J14k8m6J48k07
1583A391J31j15rJ1l16R7N2n72J22j10l45R1j14k08m3l86K0l23r5N7l85R6k52
1606a205l28K68nj46n3j09K6K17j98lL03k13K83p0J58J32O8J95m2R0K48L43m0
1629h1K27K1L51R5J19J22n2L40J23q2J92n6j53Q3K07k0O8k70J8J05k97P1N5j81
$$ y = [1458, 1154, 1120, 798, 725, 409, 156, 20, -201, -581, -568, -880, -1272, -1192, -1475, -1696, -1556, -1775, -1791, -1772, -2065, -1813, -2001, -1992, -1693, -2084, -1817, -1803, -1640, -1390, -1477, -1338, -1123, -923, -633, -502, -456, -138, 340, 291, 549, 567, 593, 1075, 915, 1236, 1367, 1373, 1532, 1564, 1566, 1709, 1634, 1536, 1770, 1637, 1798, 1399, 1405, 1305, 1112, 1161, 1078, 838, 908, 476, 354, 330, -5, -20, -199, -641, -573, -653, -846, -840, -1140, -1082, -1244, -1425, -1453, -1526, -1433, -1398, -1568, -1663, -1470, -1445, -1085, -1253, -1276, -1057, -1227, -739, -670, -731, -540, -510, -272, 177, 47, 382, 443, 645, 613, 684, 1027, 1303, 1122, 1323, 1246, 1410, 1524, 1496, 1450, 1598, 1391, 1522, 1407, 1398, 1409, 1093, 1190, 1242, 670, 792, 682, 337, 428, 314, 106, 63, -323, -303, -626, -721, -664, -1049, -953, -1205, -1533, -1265, -1270, -1416, -1469, -1578, -1552, -1335, -1533, -1536, -1233, -1446, -1163, -1233, -1075, -943, -875, -680, -722, -632, -384, -41, -81, 146, 167, 518, 613, 732, 854, 802, 1142, 1265, 1183, 1375, 1319, 1166, 1249, 1456, 1436, 1504, 1234, 1252, 1357, 1060, 1131, 1186, 1005]
1653A005o8k47j02j20k63%r9j36J67o03N8j08k77l6j65M6j45k04J94j42j57J60
1675a242q4M5Q9j4M0J45J47m0J90j1K48k4O0R0L91kL7J24J51J06M3K26n7M8N3
1700G59K55O8m8J96j21M5j04l6J34m9k16M3j12N7j68j32NL7k60K5k62j23j46k09
1724c62J16Nk19%l5k18P0q9k7Q7j38L1J03j06J15l4Q0R3j02J92M5l5J37K2K12
1749e7N3j07Q0J53k49J84O9J76O9j70K63j77J34m8n9QJ50j34K84k12L0l2j95J01
1773C14n3n4l3J64k98j9J24j71n3k4KR3j82K39r5n6l0k87L39l3j16NL5J55n4k73
1799c61K47P0Q4N1l4q5l4n1K44o0l0J95j25j0M8Oj70Mq1N3j2J10j19k07KO0j39
1826c44J4J7Pj41K44q9L1j77K29j60m6L82k39j11J41j50M07q0o0L10l13K10mK83
$$ y = [1005, 937, 690, 588, 468, 205, 205, 106, -30, 137, -466, -408, -516, -793, -829, -994, -948, -1093, -1297, -1103, -1245, -1402, -1242, -1326, -1281, -1192, -1206, -1166, -1021, -874, -914, -724, -735, -487, -511, -451, -361, 30, 28, 65, 189, 340, 446, 489, 715, 658, 706, 759, 1014, 1082, 1034, 1230, 1109, 1154, 1050, 1014, 1148, 1099, 883, 926, 814, 871, 703, 571, 576, 613, 353, 378, 116, -7, -153, -362, -246, -241, -460, -460, -495, -713, -643, -732, -759, -672, -810, -779, -676, -782, -667, -701, -621, -528, -630, -438, -393, -428, -291, -269, -57, -4, -111, -31, 122, -127, 57, 126, 302, 371, 201, 464, 287, 421, 373, 314, 322, 472, 338, 622, 410, 440, 408, 213, 314, 261, 207, 174, 338, 40, 21, 145, -26, -79, -103, -101, -8, -190, 49, -46, -102, -132, -419, -80, -113, -229, -224, -189, -34, -88, -361, -114, -44, 40, 91, 57, -28, -62, -113, 131, 71, 41, 236, 111, 101, 149, 155, -15, -11, -92, -39, -51, 59, -60, -267, -265, -205, -344, -330, -313, -306, -447, -203, -292, -261, -438, -209, -369, -415, -33, -272, -383, -242, -392, 15, -65, -125, 185, -128, 82, 78, 361]
1850C61m3k21j3K56J96o7J11N6m5M1oj18l6K21p7j8J5j70K19k32o1M1j79k5j1
1875A95j46P9m6l12k1Q7k37R1L9m52K11r9M1j36n2J31j65J19j73k7N9J30j35J11
1899g08J11O8O5P8J31J56O4l4m0P0K77j32P6J94rO6J48kO4O6J05j7kR3m2Qj33
1926G21N5j33J29j84m2j20K21j23l37J51jj68j57q5%l2m7n9j82m2j07j78k7J33
1950f14q5j98J29n4R1k35J86J16j02k8K00j26K37K25k48K44P6K0J11j39K05J40
1972A51n1J70M7J74m4P2J29O8j62J50j30J9J07j37O9J57k11J42l8p0k7m0j09j07
1996C29rM7p2k78o5R4j01k2o6L5k16O7nn6j60K2O4j11j56J31P6k06J81j21J88
2021d10j34QK10q3Q2Q0j37J19K86j03K26m5j25K54J8j39K83l8q3O9O5J15k9KJ48
$$ y = [361, 318, 97, 84, 340, 536, 469, 580, 636, 591, 632, 626, 508, 472, 693, 616, 598, 613, 443, 662, 430, 369, 410, 231, 206, 195, 49, 128, 82, -230, -251, -164, -401, -310, -271, -723, -512, -611, -570, -706, -758, -627, -792, -673, -846, -873, -814, -684, -819, -708, -597, -529, -464, -386, -255, -99, -35, -69, -109, -39, 238, 106, 182, 376, 367, 433, 581, 579, 643, 709, 814, 797, 795, 888, 846, 854, 721, 776, 643, 772, 588, 546, 426, 647, 524, 187, 338, 337, 169, 12, -73, -73, -105, -152, -211, -393, -435, -542, -720, -747, -614, -699, -897, -768, -822, -731, -966, -780, -664, -766, -794, -594, -720, -483, -258, -506, -262, -186, -166, -55, -194, 11, 151, 100, 270, 317, 491, 447, 519, 648, 716, 554, 704, 574, 593, 700, 563, 632, 789, 578, 720, 682, 612, 585, 545, 436, 329, 320, 367, 295, 17, -48, 46, -55, -77, -143, -108, -324, -257, -262, -318, -478, -456, -392, -503, -659, -528, -452, -658, -477, -598, -410, -544, -536, -326, -409, -327, -247, -384, -265, 21, -82, 144, 99, -26, 228, 246, 107, 390, 352, 269, 338, 403, 518, 489, 491, 639]
2046F39q7kp2Q7m1P6k31O1LK3r7k39K30m3k05j92P1qj23j26J29r5o4j67J21j61
2072e13J46p5N0j07j29L0P8j41K59j20J18l2qJ10J51k3j04J49K5J8N4J80N3K9
2096A98m6M9J75J6l1J10j12N5J78r7K6m0J63m9j81J59j54Om9L7p2Q1k8n3j95l7
2122A09m8N7k59J44j64j8M4j60N7j4l4j18Q1J5j77k1%J30j41LM8K5K1j5J5J53
2148b67k03J82R0J4l0P1K10j48K4J85N6j44K53K3j33K50j03Q3k7j59L04o9J4P9
2172E55j86O6oO4N0j66m7O5M0r9j21m9jj62R3m9k77K82j98J08k16l7J8p3K1J6
2198c09k0o9nm3K36j83n6r5J68N7k8k3N1J50o8J07oJ6j00N3J85j29K18r8R2K23
2224C24p1J4m9Q3OK7j74J07J14j00J13Lj24q5K3l7R6J7j12J17j81p0m7M8J40k86
$$ y = [639, 552, 550, 478, 565, 524, 600, 369, 430, 433, 456, 359, 120, 350, 307, 102, -90, -19, -27, -150, -276, -147, -242, -306, -473, -352, -513, -367, -442, -392, -499, -628, -598, -520, -661, -402, -522, -404, -436, -444, -334, -183, -206, -310, -161, -136, -118, -64, 116, 169, 198, 152, 201, 376, 392, 361, 471, 359, 414, 592, 495, 521, 481, 644, 595, 414, 573, 419, 425, 376, 413, 341, 422, 394, 341, 146, 109, 61, 118, -141, 3, -161, -179, -135, -295, -238, -252, -286, -404, -323, -308, -485, -506, -506, -376, -517, -514, -466, -441, -420, -435, -420, -267, -470, -288, -198, -184, -214, -143, 67, -81, -57, 128, 184, 40, 293, 316, 183, 433, 330, 413, 386, 227, 531, 462, 476, 555, 369, 435, 429, 493, 543, 377, 330, 395, 435, 336, 215, 166, 165, 3, 96, 47, -230, 52, -146, -38, -254, -291, -273, -346, -325, -309, -329, -398, -403, -446, -210, -393, -449, -544, -376, -319, -347, -370, -319, -169, -237, -130, -136, -120, -220, -167, 18, -111, 107, 9, 101, 324, 253, 267, 218, 301, 307, 334, 160, 267, 381, 281, 394, 397, 273, 188, 211, 174, 270, 287, 175, 292, 111, 41, -6, 42, 182, -104]
2250a04J12p3j19K17k36R4p2j72L0J44j01K0j95J7L53j91j91K95j51J54R3j96
2272b72M0p3J22R8l2J86n9Kj07J59K4q3M0J70j86K23J8j71J3J73j22j66K30j7
2296B10k2L2j13N3O8p9r4M0J81k55R4k01o8J32K6KM0j16J04q4L7L4j93J08p9R8
2322d5j66QkJ27M2j84J30k0QN1Pm6m1J6M1k1n1q2K13P1m1M7k19L35p9mo7M2j99
2351a29J91Mp0J19J05m4j2j33L5j48J12J18j60PM2O6j29pk0K20j28n8J39j90P
2376f3M2r4N9J3jJ59k71J03J34j77J3L9m6p1P9j38J40N2Km1LO0p0j22J02L3Q5
2403B4q4o5J21J2J38j10j1m8P9m7K80j40k31L85k95J82p9m6P0RM8p9L6J05k79
2428b5%J68j40M1k3k3J0j72K21o9r0p2lN7k9l5o8K16j34ln8P4q5P7p2R0J9J4M0
$$ y = [-104, 8, -65, -184, 33, -203, -109, -181, -353, -323, -179, -280, -260, -455, -438, -85, -276, -467, -172, -323, -169, -76, -272, -232, -305, -183, -85, -117, 69, 10, 12, -95, 64, 88, 5, 45, 215, 29, 252, 270, 99, 112, 285, 163, -3, 227, 210, 188, 220, 107, 160, 228, 149, 55, 95, 276, 21, 115, -86, -154, -22, 4, 6, 46, -70, 34, -50, -13, 21, -172, -64, -143, -45, -211, -203, -205, -78, -36, -220, -90, -110, -102, -51, -44, -90, -131, -115, -74, -95, -146, -228, -15, 56, 15, 62, -157, 178, 99, 95, 28, 70, -129, 62, 66, -4, 115, 220, 176, 164, 31, 66, -82, 30, 148, -12, -5, 37, 103, -26, -33, -53, 167, 39, -19, 120, -70, -63, -21, -115, -56, -43, -44, 115, -156, -53, 81, -96, -83, -44, -90, -161, -82, -220, -80, -28, -26, -67, -64, -4, -74, -196, -94, -61, 24, -60, -125, -4, 8, 146, 36, 25, -23, 56, 9, 289, 149, -82, 303, 8, 190, 111, 65, 135, 144, 192, 113, 149, 254, -25, -25, 143, 3, 44, 21, -2, 8, -164, 57, -12, -102, -174, -177, -120, -149, -184, -252, -36, -170, -173, -231, -157, -242, -165, -237, -147, -128, -114, -74]
2457g4j50J29j05mQ2K20j96J25o1kJ21j17J43k3k9q8J76K1K7O4P5p9PJ41k04n9
2483A40oK15j97n1k4J38j54J66K06k39j58n8P7j87P5L2O1p8q8R1l07J32R0k20
2507c44L6OR7M7j43Q4r0r9J64J02j21N6L0l9J42P1j14n0j1J83j3k1M9p0K82k70
2533c6m5L35j5n9J13J00k02j48K84m3K7q8q1J30Kk5P4j67l0K25j76m9j9K1k77
2558a49K29j8j8o6l6K8l2k65J57k9O7j56J0K5qQJ15N4n1j20k0N1m2J79O0o8L2
2585f3r5O0rM1L1O7JJ48r2j8o4J39n7M2j00J22o4K1N5r3J34q1j65J95Q8j96O1
2612A08nJ6p7K07j87k52K72m5r8J36r9j76K81mj25M4p0j4J06k02J50L1j30r9Q6
2637a46R4j13J47j26J55j48P8K4K22k83jJ86l5j0o2p2J18l5O8L1o9L4r0J02k4
$$ y = [-74, -224, -95, -200, -204, -122, 98, -98, 27, -34, -36, 85, -32, 111, 88, 59, -29, 147, 168, 195, 259, 334, 255, 262, 403, 199, 140, 134, 349, 152, 101, 77, 215, 61, 227, 433, 194, 36, -22, 55, -132, -57, -25, 36, -42, -130, -39, -346, -214, -124, -344, -308, -302, -205, -158, -301, -217, -307, -406, -242, -140, -261, -205, -175, -214, -72, -1, -115, -165, -176, 7, -6, -27, 22, -48, 234, -36, -81, 254, 239, 180, 293, 393, 191, 43, 327, 284, 311, 223, 142, 272, 274, 249, 323, 156, 126, 351, 175, 126, 107, 128, -149, 80, 62, 44, -22, -58, -30, -62, -327, -170, -199, -132, -288, -278, -253, -261, -253, -138, -84, -135, -255, -275, -224, -266, -87, -27, -95, -63, -158, -98, -107, -66, -35, 32, 33, 181, 89, 71, 7, 146, 89, 131, 31, 153, 89, 110, 165, 72, 206, 125, -40, 155, 243, 47, 108, 103, 119, 42, 249, 62, -190, 82, 37, -61, 75, -24, -200, 81, 77, -48, -4, -74, -88, 18, -184, -34, -3, -133, -232, -146, -52, -165, -18, -144, 11, -137, -59, -35, 187, -96, -97, 89, 54, 44, -18, -90, 28, -7, 61, 92, 23, 57, -33, 69, 45]
2662D5o7k9N5J50k36J83j13J37j70n1K19j75J43Ok48Q4J68k72J93j0P6j40j49
2685b01K39n9q8R1j34K07J03k62j59L12R5k05Q8K1j77O2J4J67j28J10m6k69K35
2708A6j43o7J62J2M1j0r2K0K21j14j18Q1N7j7R0j89P5Jq8Q6J4l4j46K65j38oj26
2735a47J97mm3J1J19j89K1N5q1M8K02j46j43rJ50o0L9J8q8M3J3p9K07k86K08p9
2761b3P3p2R2Pj13J32j82N0O7l0%M8J21j99N9o4P3J28o5M6j76M8J4qm2P6l3k0
2789GJ28o8n0m1O3o0J9o3J5J24j00J7qK4K00q2J2j71j6j4Ml2K2R4n1m7N2k1r2
2818a35J34J32k42J24o1N2J48j53M7l27K38R6k3p8K9l9l5J10k09J95K9j02K46
2841A76j10p7N8M8j12o5K26k33K6J36j10m9M7P1JP8j04j02P6j2L7J09j88q4M0
$$ y = [45, -22, -51, 4, 154, -82, 101, -12, 125, -45, -96, 123, -52, 91, 97, -151, -67, 101, -171, 22, 12, 88, -52, -201, 38, -21, -109, -18, -152, 55, 158, -104, -263, 49, 144, -61, 27, 48, -129, -67, -53, 114, -14, 96, 50, -219, 16, -127, -194, -32, -20, 21, 11, -81, -61, 160, 46, -72, 9, 66, 49, 139, -50, 25, 26, -62, 24, 38, 4, -142, 123, -15, -21, -147, 50, 46, 3, 14, 133, -56, -35, 20, -61, -13, 189, 43, -100, -109, 41, -19, 20, 38, -50, -7, 6, -73, 134, -152, 56, -23, 50, -22, 70, 77, -36, 96, -86, -36, 31, 1, 1, 49, 170, -29, 30, -34, 39, 167, 102, 148, -28, 20, 34, 26, -16, 60, 27, 7, 135, 67, 17, -24, 39, -21, -2, -65, -50, 74, -26, -9, -17, 7, 207, 125, 137, -34, -50, -64, -60, -92, -70, 24, -27, -74, -22, -43, -135, -1, 131, -111, 13, -48, 4, 152, -1, 46, -281, -43, 53, 30, -48, -19, -58, -93, 17, -192, 3, 32, -70, 176, 66, -11, 47, 95, -17, -82, 144, -89, -63, 73, -37, -86, -39, 32, 33, 111, 7, -95, -19, -31, 6, 115, -73, -157, -117]
2866a17Rl9n5K03j1j64j0R4r5J29MJ0M5k9r6m9J83J16l58K76n7J6M3o3m2m3L5
2893f5J71O7j62o4o3p6J67K83k93J41l16J13P6J26k1j37Q8n9K05k95J70M9j48
2916d3J25j75R1Pj32j9Q9O1N6N2j66o1J00p0J88M7k11K10j02j46J45Mj26K78j93
2941ImN6M7r7R8oJ6j64R9o6k44M13k84J10L9j87O1J6p6J91k22J30Q9p4%j13L5
2968a28J38m8k74K18k8J64j26Q8j61O1L1oJ39o5k7N2pk2o3L5J11j2oj7j27M9K1
2995a0N3R4q6J5L3J81P0k95J43j37p2K40l66L35k23Q8J2o8%Q3Q4l35K57j48Q2
3020C0r3k5J34k33J26N3l0r6j45J89N6m4L9L3q9j60J60j7Rl6J10R3j55Q7l59L17
3046d6l0K2J14rk25K72j39l9J95q9q4J49J41j08o8N2k2K7R5m1l04J21J01J16j24
$$ y = [-117, -108, -147, -202, 1, -10, -174, -184, -90, -185, -56, -52, -42, 3, -26, -122, -171, 12, 128, -230, 46, -11, 5, 48, -15, -57, -100, -65, 106, 173, 11, -53, -116, -192, -25, 258, -35, 106, -210, -97, -21, 105, 84, -53, 35, -24, 181, -114, 56, 105, -43, 82, -93, -2, 5, -127, -146, -57, 4, 60, 112, -54, -115, -15, -85, 103, 150, -61, 149, 47, -99, 46, 50, -76, 202, 9, 5, 61, 108, 11, 109, 103, 119, -45, 54, -12, -256, 157, -127, -17, 22, -165, -104, -88, -164, 27, -195, -65, 24, -50, -50, -163, -128, 10, -38, -312, -94, -122, 42, -84, 4, -157, -96, -65, -71, 68, 3, -24, 28, 21, -1, -64, -29, 82, 70, 64, 47, -80, -31, -10, 43, 137, 51, 66, 99, 280, 350, 55, 198, 61, -11, 229, -137, 198, -25, 63, 75, 7, 7, 90, 174, -161, 96, -52, 30, -63, -88, 46, -187, -61, -8, -38, -134, -279, -90, -34, -78, -39, -6, -95, -255, -95, -112, -103, -139, -29, 64, -91, -4, -363, -46, -76, -54, 60, 51, -174, 98, -41, -80, 115, 26, -58, 91, 232, 124, 56, 108, 86, 113, 208, 167, -137, -16, 85, 201, 77]
3071G7k9J22j67rJ9J08k31K38j5j07Km2J03j83RK27k30M1l5j9r1J42Q5j31Q9m0
3097f7J14o2n1J88j74j34m1K81J76q4k42J48j36J05K8j58M6K1K02p7K02j56k0
3120A09M5o8Mr4KQ6k01K06j72MR9N4Rq1P6k9j09Q5n2L5L2P9j66QL4O9M1j14L7
3149B8l7lL1L5k37K25N8j45J24K2k3k30L34q5Qj11N1m7M4R9j39j89L43j39L0m0
3175Gm5J18j69p9K47j3j26j00P1M3K20l23JK11k07J58j64J14L9oo6p5K14o8o6
3200f4K0Nk4P6J22M5j85J01k6Q1j45qJ14q0K6n2k3L7m2K27l9j53O8N9j74J15N3
3227A34j36J42k05L07j64j31J8r8L03j19j59K2N8l6ml3J95j15j46O5J28n4nL2
3251aOn5j60J12J21r6j49LL24o6j09M2Nl7K28rj81J78j21o6J92j06O1l6r9K28
$$ y = [77, 48, 170, 3, -6, 13, 121, -110, 128, 113, 6, 8, -34, 69, -114, -105, 122, -108, -67, -102, -121, -212, -70, 15, -116, -27, -67, 47, -15, -66, 122, -52, -186, -227, 54, 230, 146, -96, 52, -84, 21, 49, -109, -63, -42, 160, 83, 285, 129, 109, 154, 86, 90, -4, -2, 84, -117, 89, -83, -79, 20, 74, 83, 2, 78, 49, -60, 25, -27, 8, 40, 119, -47, -39, -5, 64, 105, -9, 28, -9, -12, 19, 54, -183, 42, 100, -45, 79, 101, 78, -152, 182, 97, 105, -6, 45, -2, 42, 141, 2, -187, 156, 17, 47, 7, -38, 80, -89, -168, 79, 66, -60, -160, -89, -46, 174, -149, -148, 63, -144, 14, -150, -36, 3, -3, -69, -144, 70, 2, -64, -44, -39, -63, 13, 135, 180, -5, 96, 70, 151, 6, -2, 112, 32, 58, 6, -17, 20, -22, 205, 166, 13, 81, 140, -34, 81, 134, -2, 140, -65, 242, 78, -53, -35, -133, 170, 51, -108, -86, -28, -64, -68, -101, 94, -21, -167, -102, 26, -28, -33, -1, 5, -50, -210, -98, 23, -73, -222, -219, 105, 39, -70, -28, -23, -60, 168, 159, -22, 156, 35, -31, 161, 55, 116, 80, -19, 209]
3277B09j57M2N8j70N8j3m8K2K77j17r9p0J03k60K17p8N3j41J13l4L6pN9k6j6j56
3303a45M7K8J48m1j31J50j5r2n3M02l69l5j00J69Q4p2O8j14J03Q9k01l1R2R4k77
3328b02J96l9R4o0P6L9j65KK09K2k62J52j44Q4J31K3m8m2l4O1j6j18R7n8J2L1
3354D1L9p5j42JJ80j55J97J3j66J18k1k4k2k3L8O7j98N3j6m5n6K57p5L5k0K5n6
3381c0r9J22l0N9j47P4L6J50l6l3J62j66O4q0j98K30J63j41J5j2oK6j9r2L2j05
3407f1o8J22J31k5p3M7k8j22J28j13K0J8Q7o4j7k27K74Mk34J87j71K91q1Pln1
3433b2l6o1K39j52j34J47j17J78j02K8J11j36J84j53k37J77J48p1q7M00k89J9
3455C4oj56L22j59K0K18l08J10j7Q9J08j95L1j33R8Rp1J86l15J33j06K6kK04j85
$$ y = [209, 52, 94, 152, -18, 40, 27, -21, 1, 278, 161, 62, -8, 95, -165, 52, -26, 27, -114, -1, -35, 1, -6, 53, 27, 11, -145, -98, -70, 78, 37, -94, 56, 41, -51, -104, 298, -71, -106, -206, -37, 47, -25, 43, -71, 32, 121, -80, -111, -19, 75, -202, -6, -45, 49, -11, 65, 104, -61, -59, 150, 172, -90, 62, -82, 2, 133, 156, 108, 66, 32, 93, 77, -41, 56, -2, 10, 41, 80, 5, -137, -136, 44, -111, 86, 99, -67, 51, 30, 6, -16, -39, -1, 66, -132, -79, -95, -140, -196, 61, -14, 21, 1, 26, -30, -129, -7, -37, 22, -125, -51, -15, 135, 99, 66, 228, 62, 126, 46, -152, 78, 241, 100, 115, 103, 97, 123, 104, 12, 44, -61, -129, -7, 124, 99, 26, 73, 45, -77, 51, -62, -42, -24, 63, -1, -18, -245, 29, 33, -201, -14, -185, 106, 25, 32, 29, -22, -58, -119, 120, -32, -166, -19, -136, 42, -60, -32, 79, -57, 127, -26, -263, -86, 62, -9, -96, 304, 15, 34, 28, -128, 194, 35, 55, 273, -35, 75, 58, 147, 255, 60, 91, -42, 56, 65, -6, 180, -135, -2, -108, -82, -84, 120, -65]
3480f5J25j43Q7R3k96J45L8j30j00J26n2K23j90K6J16j08j75Q3K04p3J26j24R0
3503B6r1O0K3j40N0J5PKQ9j97R6K06j70M3j67M8J14K3o2LJ56j82J58r3m1Q3L3
3530I2m1Q4n0j26P6R7J3j51o8K39r6nJ69k79Q1M3l0j14J17p8kJ15l21J97J6K0
3556bk8j4r5R8p2m0K38k04J66j17J65j99J05pO2o2j21K82j40J56k37N1P5Q0k99
3581a59J05P4P9p5k4j07K35q6Q5n6J14k13K1Q5Lp0K7j53K7J43p7l9R8p2p9J66
3607E2p6o3N4L7j42K02j44N6j01J22k7j8K0j6j4J03j74m2J17Q2j05J43%Q7p7J6
3633I2r2M7j11M4K04q8k4j23j43L08m5j92J88R4k95J15Pk00J83J17r5m4m6k2m3
3658a64P8R8P0j03J75k12K1M4km1J46j08R5n8J62k79j10J45K2k37p2M56r0M1k20
$$ y = [-65, 60, -83, 4, 97, -199, -54, -16, -146, -246, -120, -172, 51, -139, -113, 3, -105, -280, -197, 7, -66, 60, -64, 26, -65, -5, 18, -122, -72, -57, -50, -48, 41, -156, -60, 146, -24, 19, -148, -100, 14, 37, -25, -22, 134, -48, 110, 17, -24, 59, 92, 51, 135, 85, -41, 35, 132, 145, -6, -74, 165, 69, 64, 233, -46, 35, 78, 48, -66, 51, -27, -29, 86, -235, -38, -22, -2, -30, -44, -139, -41, -113, -153, 85, -119, 47, -70, 95, -104, 1, -6, 56, -6, -127, 155, 15, 171, -66, -15, 60, 140, -159, -54, 20, 99, 24, 0, -107, 128, 42, 127, 71, 185, -28, -7, 78, 81, 11, 38, -115, -88, 55, -22, -61, 37, -35, -114, 52, -24, -87, -33, 4, -138, 64, -80, -24, -125, -3, -30, -48, -28, -44, -58, 45, -129, -171, -54, 28, -77, 66, 66, 153, 76, 92, 0, 47, -64, -20, 184, 96, 72, -51, -194, 114, 69, -123, 65, 159, -136, -21, -14, -214, -31, 86, -9, -53, -99, -121, -164, -86, 12, 82, -21, 154, -58, -37, 7, 5, -36, 110, 2, 97, 39, 201, -78, -188, -43, -21, -258, -330, 126, 36, 77, -143]
3683a43K72j49o5J90j3q4nm4J35j21n8L6J1m7J09j13nP4J2n5J48N4j39J0n8L8
3709a0L1j65K29%O7o9j58o7K61q3n4k2j00K04j20P6p6J01k45K98L8k27L8R1j79
3734a41J03J6p8J65j18q8Q2j26J32P2J25j71L2L1k29%K12n6k25K52qNK6k3M0K4
3760E4j66K62k17p5K41j82N4j3j28K85j05j6r3Q5n8L3J6K14l21O7k4l9R4Q6L5
3785H9k2j55J32p3qJ76j47R2J0j29rQ1j72L1L5M3qK4k%J31P3k33j23K32M8k04
3812h8pL8M9m1J5J18j71Q9n7oM9P0L1q8J64j84O0Ln0O4P2k23J43m6Q5j0j19o3
3840a03J85r5J57j67Q5j12J46j9o9j8J6pn9J59k30J52L3J6q4J79j72m5j1n6O7
3865e2K1M7q9R9j6K7J5p5L2n1l6m3q6K42j38J72Lj07J43r6j90J00P0j2J23p1r3
$$ y = [-143, 129, -20, -85, 105, 92, 8, 3, -41, 94, -27, -85, -49, -38, -85, 24, -89, -94, -20, -8, -63, 85, 139, 0, 10, -48, -10, 21, -144, 85, 85, 152, 83, -75, -142, 119, 36, -18, -40, -140, 64, -56, 20, -56, 45, -200, 98, 136, -91, -53, 38, -141, -38, -22, -100, 65, -53, -141, -59, -185, -53, 19, 144, -27, 5, 36, -193, -193, 19, -37, -262, -10, -18, -13, 13, -10, 30, 54, -112, 150, -67, -142, 99, -83, -29, -42, -170, 115, 10, -6, -99, -14, -72, -39, -23, 191, -130, -63, -87, -126, -32, 54, 89, 67, -88, 44, -29, -37, 139, -8, 84, 94, -35, -44, 37, -135, -104, -69, -26, -34, -10, -12, -12, 119, 192, -41, -164, 68, 116, -88, -95, -57, -8, -49, -34, 84, -87, 2, -55, -61, -12, 58, 89, 1, 165, -19, 41, 44, -6, 58, 130, -93, 50, 4, 89, 79, -40, -103, 82, -13, 144, -23, 62, -50, 96, 77, 8, -10, 6, -1, -60, 99, -131, 21, 54, 70, -14, 165, -7, -52, -63, -119, -52, -31, 16, -73, 26, 10, 37, 52, -23, 9, -42, -78, -121, -207, 35, -103, 69, 72, -35, 108, 12, -178, -78, -8, -20, 103, 32, -61]
3892f1q7J04J20R2J41k39R6j67l1Q7r0J03q5m5J13j00J25j66J12j6m0NJ36k40
3916a33J57O9l15J16J31n1N1lnPJ82j02J6q3OO6q3J21j42Q1o8K9j08P8j5K6J07
3943A35j55j44J49N1rjmj36J0M2k18J62j82J19K04l8n1o3j33J64j1J21j40P0K9
3968b9j24P5J23j24J39j1P1j04O7rk8K30j86q3r4N0J20o4NJ7m5J70j54J67k6L
3994A56p2j2n9o9N6O1k7Q9l41K18k0P9q4J64j50jo7J98K2j75O1M4q0j6k4O4m7
4021c2N0l5Oj30J9J6jJ7K29n6j35p3K53j95j78K89m6j55J55K8n4J50o5m9p1J50
4047H7j11Q3j17O6L9n2o7O8Q9k6j60j3K27Kj49m4J56j17J6J02Q4k68J49q7N6P1
4073H4K4j79J02L6j40Q1J58o6r5Q2j26L1L6o1P6M9m5P5J5j82r4R2K30j98p6K69
$$ y = [-61, -148, -44, 76, 168, 309, 70, 166, -1, -32, 55, -35, 68, -17, -62, 51, -49, 76, -90, 22, 6, -34, -29, 107, -133, 24, 93, -222, -106, 25, -26, 25, 22, 17, 24, 206, 104, 120, 37, 43, 109, 26, 147, 5, 86, 18, 47, -61, 17, 2, 28, 135, -20, -164, -15, 36, 27, 26, 22, -114, -104, -62, -280, -118, -300, -181, 23, -15, -66, -129, -262, -98, -109, 12, -128, -58, -29, -153, -78, 45, -79, 60, 49, 120, 16, 83, 74, 46, 276, 90, 7, -87, -37, 83, 19, 24, 41, -4, 166, 12, 179, 153, 156, 84, 72, 13, -56, 0, 61, 34, 123, -218, 0, -20, 59, -25, 139, -11, -12, -79, 119, 141, -34, 27, 71, -9, -25, -49, 15, -32, 18, -17, -11, -141, -122, -106, -107, -90, 139, 83, -52, -125, 128, -67, -245, 44, -2, -157, -2, 26, -28, 122, 57, 8, -63, 87, -24, 59, -58, 8, 47, -5, -72, -4, 85, 59, -101, -114, 113, 115, -34, -78, 78, -39, -23, 79, 163, -105, 44, -43, 13, 84, 108, -71, 31, 67, -73, 8, 166, 100, 5, 87, -39, -8, 28, -33, 43, 92, 47, 122, 137, -45, -139, -47, 183, -15, -91, 178]
4099A78n6k5j28kJ25k17J52m0l2mM4l7L4j73J45J07j75J46j27o8n6J61j80M3J49
4124c6j53K27j03O3k3Mj22K06M3m7j9N9o2q1J9J41o0q5J24j47J32J55j39J08k21
4149a7j54K11J19r0M8j29J4qj71K25l9Ll4k9N4J03k32K66m9%k66R5k6N9j79Q9
4175a37J44j53J8j80Q4K57J40k08k4K1p9J02J0k25K50j35R2nP0nn4R7j98K73k26
4200g1R7M4Rn9L5%J20M3m6q7R4j40J02Q5j25l9o5J32o0O7o5k6J57k20P2j5j17
4227g8n0Q6J09p8j63N4P0j58J18K4j73J86r7l0j2J18j9J24j12j3O1Q5j10r9K2
4252a35Q4l2M5kL9k1j00J66q0J27N3r4J48j42K5k4l1j43j2L58j72j8M9n5J79j25
4278H7P7j04k4O4K6m9l5P2j55j61L93k53N6m7K3Ql3j77K53Ml2p3N3n9K29o1j42
$$ y = [178, 122, 97, -31, -33, 92, -125, 27, -13, -45, -49, -5, -42, -8, -181, -36, 71, -104, 42, -85, -153, -209, -48, -228, -185, -36, -189, 38, -65, -2, -25, -21, -143, 63, 106, 59, 40, 99, 37, -44, -25, 116, 56, -29, 95, -52, 80, 235, 96, 204, -17, -171, 40, 159, 69, 117, -12, 2, -6, -177, 48, 9, 12, -22, -51, 3, 106, -126, 140, 91, 91, -175, -80, -106, -47, -226, -137, 7, -146, -128, -308, -224, 33, 173, -35, -59, -38, -117, -15, -5, -230, 20, -115, -23, -28, 42, 37, -17, 80, -118, 155, -71, 26, 70, 79, 20, 55, 55, 175, 218, 172, 85, 179, 39, 141, 226, 101, 62, -3, 129, 69, 136, 71, 45, 202, -18, 54, 39, -78, -128, -42, 67, -11, -174, -120, -50, -208, -90, -66, -239, -53, -150, -180, -192, -74, -93, 31, -81, -94, -33, 52, -58, -157, -135, -51, -83, -38, -40, -1, -22, -122, 44, -36, 91, 144, 50, 198, 56, 81, 57, 26, -117, -129, 229, 57, 39, 88, 33, 212, 87, 164, 60, 36, 100, 126, 77, 42, 114, -41, -202, 191, -62, -6, -53, -30, -22, -55, -232, 21, 25, -7, -80, -27, -86, 143, 82, -60]
4305f0NM3j38j5J25j7m8Q1J6j3k7K7j06J61q5K7M5l9q3J87l2j04M7mm9Q3N2j80
4333a01K19l22K76P7j98J21j06L5j1J99j97l9J5o2O5j51O9MJ21q8P6lj41K40J07
4358B05j94r5J56l05K38j41P2R8q6PP8j5K9o4J25J13k09o5Q0J8p6M8n%m9J00k45
4385a82J76j36O8k8R2%j3r4J79k26J4J90j86O3j06L20j76J43j83q0J04O3q5J60
4409G7q7l1n4K6P4o0l4j38L73j60k0J32r5n1p7K60k7k53J69L6J17l26L13j83O7
4434D8j43M4Q3p5J20j6p5J06M7j43p2J64k93L07j47J84r0l5j21J44j30qL19l20
4458a02M1j8Q2J9J13o8k10J75j75J45J4J10j71j24P9J71l0j21Pp7J80l3J88j19
4482G6k3n5l7J27l9L9o3Jp6J32R8j66l5J90J21k59k1K3k05R0K29j05L6j32J10
$$ y = [-60, -55, -12, -150, -165, -40, -57, -105, -24, -8, -21, -48, -21, -127, 34, -51, -24, 21, -18, -101, 86, 54, -50, -3, -7, -56, 27, 79, -101, 118, -204, 72, 149, -49, 72, -34, 1, -10, 189, -8, -47, -32, -94, -29, -180, -111, -107, 14, -74, 2, -1, -142, 98, 205, 11, -84, 72, -233, 5, -136, -64, 34, -52, -45, 33, 18, 47, -17, 108, 221, 12, -53, 27, 45, -31, 17, 12, 12, -37, 63, -182, -6, -142, -74, -102, -10, -10, -23, -117, 62, -164, -150, 40, -146, -83, -189, 131, -45, 98, -85, -165, -61, 2, -83, 77, -10, -41, -95, -69, 5, -55, -89, -227, 146, -14, -34, 98, 3, -48, -125, 135, 108, -145, 24, 60, 177, -149, 164, -19, 48, -95, -51, 32, -43, 77, 61, -14, 92, 139, -4, -76, 88, -205, 102, -45, 139, 49, 14, -107, 37, -93, -101, 218, -102, -61, -79, 3, 22, 135, 67, -143, 32, -143, 2, 16, 126, -45, -169, -90, 81, 51, -70, -63, -140, 40, 7, 195, 76, 53, -2, -39, 88, 49, 88, 25, 26, -50, 82, 180, 14, -21, 169, 290, 31, 10, 33, -172, -82, 147, 42, 78, -54, 56]
4507E6r6Mk7R6R3j10K1lN9j84rk8J24J07k20N9r6K7J15N2J3M7o1r0k05L78j53
4534c1p1P0j5r7J62P6P8m1k15K06k7N2qj20J10k72O6J53N2K1j41J00j55J88k9
$$ y = [56, -40, -36, -63, 33, 126, 16, 37, 34, 93, -91, -100, -128, -4, 103, -117, -58, -154, -127, -12, 40, 53, 100, 39, -51, -256, 122, -31, -102, -32, -47, -144, 18, 94, 172, 131, -84, 122, 95, 147, 139, 19, 129, -143, -77, 76, 128, 149, 8, 108, -47, 141, 112]
$$ [...]
8191A32
##END NTUPLES=NMR FID
##END=
