##TITLE=1H_SA_DMAD
 CDCl3
 8 sc, 
 28.10.2021
##JCAMPDX= 6.0         $$ Bruker NMR JCAMP-DX V2.0
##DATA TYPE= NMR FID
##DATA CLASS= NTUPLES
##ORIGIN= UXNMR, Bruker Analytische Messtechnik GmbH
##OWNER= root
$$ XWIN-NMR		Version 3.5
$$ Thu Oct 28 12:23:09 2021 Russian Standard Time (UT+4h)  she@DPX200
##.OBSERVE FREQUENCY= 200.1313468511
##.OBSERVE NUCLEUS= ^1H
##.DELAY= (6, 6)
##.ACQUISITION MODE= SIMULTANEOUS
##.ACQUISITION SCHEME= undefined
##.AVERAGES= 8
##.DIGITISER RES= 18
##SPECTROMETER/DATA SYSTEM= spect
##.PULSE SEQUENCE= zg30
##.SOLVENT NAME= D2O
##.SHIFT REFERENCE= (INTERNAL, D2O, 0, 15.7039)
##AUDIT TRAIL= $$ (NUMBER, WHEN, WHO, WHERE, WHAT)
$$ ##TITLE= Audit trail, XWIN-NMR		Version 3.5
$$ ##JCAMPDX= 5.01
$$ ##ORIGIN= Bruker BioSpin GmbH
$$ ##OWNER= she
$$ F:/spectra/data/she/nmr/H-F/1/audita.txt
$$ ##AUDIT TRAIL=  $$ (NUMBER, WHEN, WHO, WHERE, WHAT)
(   1,<2021-10-28 12:21:59.26 +0400>,<she>,<DPX200>,
      <created by zg, POWCHK disabled, PULCHK disabled
       configuration hash MD5:
       00 E9 B6 7A A2 85 ED C7 34 08 36 98 17 FE 4E 26
       data hash MD5: 16K
       5F D3 2F 15 1D EF 23 04 CA 46 84 35 75 6D 46 EC>)
$$ ##END=
$$ 
$$ hash MD5
$$ 4D E3 5D BF 09 3F 37 7B A8 EF 70 5A A2 09 00 33
##$RELAX= 
##$RELAX= 
##$RELAX= 
##$RELAX= 
##$RELAX= 
##$RELAX= 
$$ Bruker specific parameters
$$ --------------------------
##$DU= <F:/spectra>
##$EXPNO= 1
##$NAME= <H-F>
##$PROCNO= 1
##$TYPE= <nmr>
##$USER= <she>
##$AMP= (0..31)
100 100 100 100 100 100 100 100 100 100 100 100 100 100 100 100 100 100 
100 100 100 100 100 100 100 100 100 100 100 100 100 100 
##$AQSEQ= 0
##$AQ_mod= 1
##$AUNM= <au_zg>
##$AUTOPOS= <>
##$BF1= 200.13
##$BF2= 200.13
##$BF3= 200.13
##$BF4= 200.13
##$BF5= 200.13
##$BF6= 200.13
##$BF7= 200.13
##$BF8= 200.13
##$BYTORDA= 1
##$CFDGTYP= 0
##$CFRGTYP= 5
##$CHEMSTR= <none>
##$CNST= (0..31)
1 1 145 1 1 1 1 1 1 1 1 1 1 1 1 1 1 1 1 1 1 1 1 1 1 1 1 1 1 1 1 1 
##$CPDPRG= <>
##$CPDPRG1= <>
##$CPDPRG2= <>
##$CPDPRG3= <>
##$CPDPRG4= <mlev>
##$CPDPRG5= <mlev>
##$CPDPRG6= <mlev>
##$CPDPRG7= <mlev>
##$CPDPRG8= <mlev>
##$CPDPRGB= <>
##$CPDPRGT= <>
##$D= (0..31)
0 1.2 0 0 0 0 0 0 0 0.06 0 0.03 0 0 0 0 0.0002 0 0 0 0 0 0 0 0 0 0 0 0 
0 0 0 
##$DATE= 1635409318
##$DBL= (0..7)
120 120 120 120 120 120 120 120 
##$DBP= (0..7)
150 150 150 150 150 150 150 150 
##$DBP07= 0
##$DBPNAM0= <>
##$DBPNAM1= <>
##$DBPNAM2= <>
##$DBPNAM3= <>
##$DBPNAM4= <>
##$DBPNAM5= <>
##$DBPNAM6= <>
##$DBPNAM7= <>
##$DBPOAL= (0..7)
0.5 0.5 0.5 0.5 0.5 0.5 0.5 0.5 
##$DBPOFFS= (0..7)
0 0 0 0 0 0 0 0 
##$DE= 6
##$DECBNUC= <off>
##$DECIM= 32
##$DECNUC= <off>
##$DECSTAT= 4
##$DIGMOD= 1
##$DIGTYP= 9
##$DL= (0..7)
0 120 120 120 120 120 120 120 
##$DP= (0..7)
150 150 150 150 150 150 150 150 
##$DP07= 0
##$DPNAME0= <>
##$DPNAME1= <>
##$DPNAME2= <>
##$DPNAME3= <>
##$DPNAME4= <>
##$DPNAME5= <>
##$DPNAME6= <>
##$DPNAME7= <>
##$DPOAL= (0..7)
0.5 0.5 0.5 0.5 0.5 0.5 0.5 0.5 
##$DPOFFS= (0..7)
0 0 0 0 0 0 0 0 
##$DQDMODE= 0
##$DR= 18
##$DS= 0
##$DSLIST= <SSSSSSSSSSSSSSS>
$$ [...]
##$SUBNAM2= <"">
##$SUBNAM3= <"">
##$SUBNAM4= <"">
##$SUBNAM5= <"">
##$SUBNAM6= <"">
##$SUBNAM7= <"">
##$SUBNAM8= <"">
##$SUBNAM9= <"">
##$SW= 18.0517286264689
##$SWIBOX= (0..15)
0 0 2 0 0 0 0 0 0 0 0 0 0 0 0 0 
##$SW_h= 3612.71676300578
##$TD= 16384
##$TD0= 1
##$TE= 0
##$TE2= 300
##$TE3= 300
##$TEG= 300
##$TL= (0..7)
0 120 120 120 120 120 120 120 
##$TP= (0..7)
150 150 150 150 150 150 150 150 
##$TP07= 0
##$TPNAME0= <>
##$TPNAME1= <>
##$TPNAME2= <>
##$TPNAME3= <>
##$TPNAME4= <>
##$TPNAME5= <>
##$TPNAME6= <>
##$TPNAME7= <>
##$TPOAL= (0..7)
0.5 0.5 0.5 0.5 0.5 0.5 0.5 0.5 
##$TPOFFS= (0..7)
0 0 0 0 0 0 0 0 
##$TUNHIN= 0
##$TUNHOUT= 0
##$TUNXOUT= 0
##$USERA1= <user>
##$USERA2= <user>
##$USERA3= <user>
##$USERA4= <user>
##$USERA5= <user>
##$V9= 5
##$VALIST= <valist>
##$VCLIST= <CCCCCCCCCCCCCCC>
##$VD= 0
##$VDLIST= <DDDDDDDDDDDDDDD>
##$VPLIST= <PPPPPPPPPPPPPPP>
##$VTLIST= <TTTTTTTTTTTTTTT>
##$WBST= 1024
##$WBSW= 4
##$XGAIN= (0..3)
0 0 0 0 
##$XL= 0
##$YL= 0
##$YMAX_a= 990951
##$YMIN_a= -1096226
##$ZGOPTNS= <>
##$ZL1= 120
##$ZL2= 120
##$ZL3= 120
##$ZL4= 120
##$ABSF1= 10
##$ABSF2= 0
##$ABSG= 5
##$ABSL= 3
##$ALPHA= 0
##$AQORDER= 0
##$ASSFAC= 0
##$ASSFACI= 0
##$ASSFACX= 0
##$ASSWID= 0
##$AUNMP= <proc_1d>
##$AZFE= 0.1
##$AZFW= 0.1
##$BCFW= 1
##$BC_mod= 2
##$BYTORDP= 1
##$COROFFS= 0
##$CY= 11.3945322036743
##$DATMOD= 1
##$DC= 2
##$DFILT= <>
##$DTYPP= 0
##$F1P= 2.36226072786647
##$F2P= -0.459571619588291
##$FCOR= 0.5
##$FTSIZE= 0
##$FT_mod= 4
##$GAMMA= 1
##$GB= 0.15
##$INTBC= 1
##$INTSCL= 1
##$ISEN= 128
##$LB= 0.24
##$LEV0= 0
##$LPBIN= 0
##$MAXI= 10000
##$MC2= 0
##$MEAN= 0
##$ME_mod= 0
##$MI= 1.114404
##$NCOEF= 0
##$NC_proc= 0
##$NLEV= 6
##$NOISF1= 3.799351
##$NOISF2= 2.8
##$NSP= 1
##$NTH_PI= 0
##$NZP= 0
##$OFFSET= 15.70392
##$PC= 1
##$PHC0= -15152.82
##$PHC1= 11.40082
##$PH_mod= 1
##$PKNL= yes
##$PPARMOD= 0
##$PSCAL= 0
##$PSIGN= 0
##$REVERSE= no
##$SF= 200.130013532006
##$SI= 16384
##$SIGF1= 3
##$SIGF2= 2
##$SINO= 400
##$SIOLD= 16384
##$SREGLST= <1H.CDCl3>
##$SSB= 0
##$STSI= 0
##$STSR= 0
##$SW_p= 3612.71676300578
##$SYMM= 0
##$S_DEV= 0
##$TDeff= 0
##$TDoff= 0
##$TI= <>
##$TILT= no
##$TM1= 0
##$TM2= 0
##$TOPLEV= 0
##$USERP1= <user>
##$USERP2= <user>
##$USERP3= <user>
##$USERP4= <user>
##$USERP5= <user>
##$WDW= 1
##$XDIM= 8192
##$YMAX_p= 0
##$YMIN_p= 0
$$ End of Bruker specific parameters
$$ ---------------------------------
##NTUPLES= NMR FID
##VAR_NAME=  TIME,          FID/REAL,        FID/IMAG
##SYMBOL=    X,             R,               I
##VAR_TYPE=  INDEPENDENT,   DEPENDENT,       DEPENDENT
##VAR_FORM=  AFFN,          ASDF,            ASDF
##VAR_DIM=   8192,          8192,            8192
##UNITS=     SECONDS,       ARBITRARY UNITS, ARBITRARY UNITS
##FACTOR=    0.0002768,     1,               1
##FIRST=     0,             0,               0
##LAST=      2.2672688,     0,               0
##MIN=       0,             -1096226,        0
##MAX=       2.2672688,     990951,          0
$$ Real data points
##PAGE= N=1
##DATA TABLE= (X++(R..R)), XYDATA
0@%%%%%%%QqQj7J8l3M8n6P2q8J05j30J62j94K34k82L30l88M54n26O14p11Q14r32
$$ 0 0 0 0 0 0 0 0 8 0 8 -9 9 -24 24 -32 40 -48 57 -73 89 -105 129 -153 177 -211 243 -283 331 -380 434 -498
31d98J064j209J376j556J749j973K216k477K770l085L428l809M222m672N168n705
$$ -498 566 -643 733 -823 926 -1047 1169 -1308 1462 -1623 1805 -2004 2218 -2454 2714 -2991
47b991O291o940P645q419R279j0224J1273j2451J3768j5259J6967j8934K1240
$$ -2991 3300 -3640 4005 -4414 4865 -5359 5914 -6537 7231 -8028 8939 -9995 11245
60A1245k3985K7303l1430L6726m3786N3750o8976R5401j54155N20024k39696j025661
$$ 11245 -12740 14563 -16867 19859 -23927 29823 -39153 56248 -97907 422117 182421 -843240
72h43240J69064L97790Q21404M45933o70542j087194j2608N59047N68014M32366
$$ -843240 -674176 -276386 545018 990951 320409 -766785 -779393 -220346 347668 780034
82G80034k67178j029874l25225N73829N26598L00344K9137p27771o36496L35249
$$ 780034 512856 -517018 -842243 -268414 258184 558528 587665 -140106 -776602 -441353
92d41353O32025K57325J05832l68327p72395q3951O78775M17723R0183j61255
$$ -441353 190672 447997 553829 185502 -586893 -670844 7931 425654 515837 354582
102C54582o93690m67189N32181O98811J46887j77650n38417o47537K33612Q99811
$$ 354582 -339108 -806297 -274116 424695 571582 393932 -144485 -792022 -558410 341401
112C41401L52865k80290m73399o00388m3790Q59737O20701k86229n57746m62666
$$ 341401 694266 413976 -59423 -659811 -703601 156136 776837 490608 -67138 -529804
122e29804j56770O14158P90771j06869o61120m03109j15865L40941P46726J68612
$$ -529804 -686574 -72416 718355 611486 -49634 -452743 -568608 -227667 519059 687671
132F87671o24049m83451n3558J95674N42061L91540l91291o03629j09041J68790
$$ 687671 63622 -419829 -473387 -277713 264348 655888 264597 -339032 -448073 -279283
142b79283L38191M61307p2873o19182l05378J48418K76388M18938J82222m81592
$$ -279283 58908 520215 447342 -171840 -477218 -328800 -52412 366526 548748 67156
152F7156n41929L2496L34167L74846K87575k78469o73220j75716L93809M22476
$$ 67156 -474773 -442277 -108110 266736 554311 275842 -397378 -573094 -179285 243191
162B43191K78360j28797o38478l95641L39964N36594K52586q3127m99700n13784
$$ 243191 521551 392754 -245724 -641365 -301401 235193 487779 404652 -95048 -608832
172f08832J77102O11861L00040r6171l76593m93986k4590N57049M15941p8740
$$ -608832 -431730 180131 480171 384000 7407 -486579 -511169 45880 461821 383081
182C83081l24582l96135j68706L87419N16470L0164l12863l37573k28496J90174
$$ 383081 58499 -337636 -506342 -118923 397547 427711 114848 -222725 -451221 -261047
192b61047N22624K10126k66313l60507k38017N1998M41638L78151j52181m21797
$$ -261047 261577 471703 205390 -155117 -393134 -341136 100502 478653 326472 -95325
202i5325k73204j2397L40692M59518J2143m32125l58814m1266K76434M50032J63951
$$ -95325 -368529 -380926 -40234 419284 431427 -698 -359512 -400778 -124344 325688 489639
213D89639l66062m58851r3591K49611M08915K55487k43052n01451j89583K22365
$$ 489639 123577 -335274 -428865 -179254 229661 485148 242096 -259355 -448938 -226573
223b26573L85656K79008j17541m65539l03460J58466L83388K82716j9296l76386
$$ -226573 159083 438091 320550 -144989 -448449 -289983 93405 376121 356825 -19561
233a9561l80246M7045L67099L09312M3207k85915l99249q5969L15862L63422R9092
$$ -19561 -399807 -352762 14337 323649 366856 80941 -318308 -404277 -88415 275007 374099
244C74099k13173l79979j99550K26439M03016J74171j58122l60992k67953J21069
$$ 374099 160926 -219053 -418603 -192164 210852 385023 226901 -134091 -402044 -280975
254b80975M04282K68982r8872l48600l05878J9786L64914L46561k3385l30681
$$ -280975 123307 392289 293417 -55183 -361061 -341275 23639 370200 346815 16134
264A6134l34645n6690L05887L83190P0405k89706l61255j15465K33581L79567
$$ 16134 -318511 -375201 -69314 313876 384281 94575 -266680 -382145 -148564 231003
274B31003J60467k22039l70171j71982J60052L60153K29880j33956l56943k38544
$$ 231003 391470 169431 -200740 -372722 -212670 147483 377363 243407 -113536 -352080
284c52080Q5535L31042K75705m0364l24891k96726J1675K95766L10976M3493k81253
$$ -352080 -266545 64497 340202 299838 -25053 -321779 -310104 -14338 296638 340131 58878
295E8878l35215o9950K49241L39187J13337k22991l48935j48055J95502L51162
$$ 58878 -276337 -346287 -97046 242141 355478 132487 -216448 -364503 -169001 182161
305A82161J76195j56666l49202k12559J28916L39507K34526q6587l29059k56599
$$ 182161 358356 201690 -147512 -360071 -231155 108352 342878 256291 -72768 -329367
315c29367N3170L09359K78882j6279k89702k90746k5676K65451L03008N8586k34095
$$ -329367 -276197 33162 312044 295765 6063 -284683 -310359 -44908 258100 316686 82591
326H2591l11055r5272K08446L10769J28346j75058l15296j56844J41455L08620
$$ 82591 -228464 -323736 -115290 195479 323825 148767 -166529 -323373 -181918 126702
336A26702J87711j11097k98577k09943P2090K91744K32915m1663k73346k54650
$$ 126702 314413 203316 -95261 -305204 -233114 58630 291545 249882 -23464 -278114
346b78114N203K58514K71506L2445k41742k82919o0547K11939K95994R8320j97841
$$ -278114 -272911 -14397 257109 289554 47812 -235107 -295654 -83715 212279 310599 112758
357A12758k99237j22643J63429K99425J56106j34866l01752j77002J09636K80542
$$ 112758 -186479 -309122 -145693 153732 309838 174972 -126780 -303782 -194146 86396
367H6396K00788o4858k83291k21921M8250K55192K32807K293k38820k57199k4692
$$ 86396 287184 222326 -60965 -282886 -234636 20556 253363 255656 16836 -240363 -265055
378b65055K24070K49928O0654j80641k75788r8093J81012K65454J14863j26474
$$ -265055 -40985 208943 269597 88956 -186832 -284925 -103913 161541 276404 149930
388A49930k73079j66341J16971K80847J66496q3190k53613k15552M4901K83223
$$ 149930 -123149 -289490 -172519 108328 274824 191634 -61979 -277531 -232630 50593
398E0593K20066m1312k35801k40338k2800K50641K68538J2158k22174k44488p2236
$$ 50593 270659 229347 -6454 -246792 -269592 -18951 249587 261745 39571 -204917 -277153
409b77153J89762K95797Q0919j99972k49866j07283J22712K84406J54701j47192
$$ -277153 -87391 208406 289325 89353 -160513 -267796 -145084 139322 294023 146831
419A46831k64540j34218P3651K40637K10495o4935k72223j74703L7235J93878
$$ 146831 -117709 -251927 -178276 62361 272856 207921 -64302 -239005 -201770 -7892
429g892K32878K8357k44006k31759m008J71889K26725J02061j79320k88038o8995
$$ -7892 224986 253343 9337 -222422 -226430 -54541 172184 274245 94925 -193113 -262108
440b62108J67423K22730J41619j01858l05292j52759J50123K43158J50876m7253
$$ -262108 -94685 128045 269664 167806 -137486 -290245 -140122 103036 253912 206659
450B06659k72280k31133R5673K76993J64048k3911k13875k65538R872K83054K01365
$$ 206659 -65621 -296754 -201081 75912 239960 216049 2174 -263364 -253492 29562 230927
461B30927j7950j70077k42375p7361K32041K56799O885j53169j91489j28447J31408
$$ 230927 212977 42900 -199475 -276836 -44795 212004 218889 65720 -125769 -254216 -122808
472a22808K82635P4685j42275j65623j35329K7214K51734J75119r9682j84511
$$ -122808 159827 234512 92237 -73386 -208715 -181501 70233 245352 145670 -38841
482c8841j29680l7972J77904K54709j2120k18498j56133n1228J13661K73895R8254
$$ -38841 -168521 -206493 -28589 226120 214000 -4498 -160631 -211859 -98198 175697 273951
493B73951k17121k25776m8626R2410K36690J80826j59165k97083p4722J12814
$$ 273951 56830 -168946 -217572 -125162 111528 292354 133189 -163894 -238616 -125802
503a25802J94204J96258o7115l14403j45286J28736J83748J55112J0698k52584
$$ -125802 68402 264660 197545 -116858 -262144 -133408 50340 205452 216150 -36434
513c6434k22298R5468K04391J13863L9713j46919k52221k291K10226J24413K9683
$$ -36434 -258732 -163264 41127 154990 194703 47784 -204437 -206728 3498 127911 157594
524A57594n6676k12000j22061J63321J83684L2298k3842j42366j99973N7923K38061
$$ 157594 100918 -111082 -233143 -69822 113862 146160 122318 -20048 -220021 -162098 75963
535G5963R2804l4579j02773k04619n7651K36803J98331l7886j23723j72554j24055
$$ 75963 168767 134188 31415 -173204 -230855 5948 204279 166393 42670 -129884 -253939
546b53939J74876K87217J1621j76183j59540j15317R5341L00890J02950k03075
$$ -253939 -79063 208154 219775 43592 -115948 -231265 -135924 164966 267916 64841
556F4841j93098o9169M8518K38547J82418j57466k40757n1069N1971J49801J96075
$$ 64841 -128257 -197426 -148908 89639 272057 114591 -126166 -177235 -125264 24537 220612
567B20612n1022k52121r5247P1133R3631J50392O1269j94407j73391M9665R0013
$$ 220612 169590 -82531 -177778 -106645 -13014 137378 198647 4240 -169151 -119486 -29473
578b9473R6816J17213q6191k27234m0118J11957R4959J14544J3219k19921j59848
$$ -29473 67343 184556 98365 -128869 -168987 -57030 37929 152473 165692 -54229 -214077
589b14077J03202J49364R8352M7876j65482k40238L7644K17398J20660K1046j13212
$$ -214077 -110875 38489 136841 184717 19235 -221003 -183359 34039 154699 175745 62533
600F2533k43403n5268K34756J81217j4300j01457j89511j16791J80904K38988
$$ 62533 -180870 -236138 -1382 179835 165535 64078 -125433 -242224 -61320 177668
610A77668K69j25008j35168j18266Q3179K45713O7677j38645j19858q1646K118
$$ 177668 177937 52929 -82239 -200505 -117326 128387 196064 57419 -62439 -144085 -141967
621a41967J90194J46809r8391j41716o2229k8413J03212J87288j933j62002r0793
$$ -141967 48227 195036 96645 -45071 -107300 -135713 -32501 154787 152854 -9148 -99941
632i9941k3969M1149J76926J01905j40402j57796l2044L2154J40595J60653p1141
$$ -99941 -123910 -82761 94165 196070 55668 -102128 -134172 -102018 38577 199230 128089
643A28089k15523p9069N8713J20441J61000N125k23196j51746O8101J35646J33649
$$ 128089 -87434 -166503 -107790 12651 173651 178776 -44420 -196166 -128065 7581 141230
654A41230M5826j73888k04957L0658J66298J19517M1493j06724k08746l9262J68688
$$ 141230 187056 13168 -191789 -161131 5167 124684 166177 59453 -149293 -188555 -19867
665a9867J35363K5748o0590j67043j00491J20409J63896L5743m8956j15293j28096
$$ -19867 115496 141244 80654 -86389 -186880 -66471 97425 133168 84212 -31081 -159177
676a59177L8650J75401Q2215m3804q8586j24205l4272J49931J41843j7626r7019
$$ -159177 -120527 54874 137089 93285 4699 -119506 -153778 -3847 137996 120370 23351
687B3351j13969p0199R8141J83442L6235j12433j20361p4513N0464J83669R5732
$$ 23351 -90618 -160817 -62676 120766 157001 44568 -75793 -150306 -99842 83827 179559
698A79559j03898j45675p2956K9766J52826J35182o0267j68116q6485K7409J16498
$$ 179559 75661 -70014 -142970 -113204 39622 174804 114537 -53579 -140064 -112655 3843
709C843J41129m098j61232j15151J9194R8151J25591M0969j20933j44164j0378
$$ 3843 144972 140874 -20358 -135509 -116315 -18164 107427 148396 27463 -116701 -127079
720a27079R1803J09587O3469o8360j52973n5164Q0554J09906P2953k7652j37467
$$ -127079 -35276 74311 137780 69420 -83553 -138717 -58163 51743 124696 97044 -40423
731d0423r9035M9849J21117Q2327n014j09104j25926O548J25527J01770R536q6880
$$ -40423 -139458 -89609 31508 113835 108821 -283 -126209 -119661 5866 107636 117172 30292
743C0292j31995l6763J08560J26471K8133p4779j24373o6487P5866J42497N5244
$$ 30292 -101703 -138466 -29906 96565 124698 49919 -74454 -140941 -65075 77422 132666
754A32666o4435j16656q2886L9859J37223Q5144m2847j12796r0109J0055J14972
$$ 132666 68231 -48425 -131311 -91452 45771 130915 88068 -24728 -114837 -104782 10190
765A0190J09421j1518j08652r8265j3972Q9462J20439K3563r3234j10212l4771
$$ 10190 119611 108093 -559 -98824 -112796 -23334 97105 120668 27434 -82778 -117549
776a17549O9452J19308N4928o8994j21705n6822N2277J14552P8443m0647j23297
$$ -117549 -48097 71211 126139 57145 -64560 -121382 -69105 45447 123890 83243 -40054
787d0054p9131L1915J10825R3127j5626j13713j00280R089J04897J02080Q627
$$ -40054 -119185 -87270 23555 116682 101056 -12657 -112937 -103848 1049 103129 111756
798A11756r6891j12893j5978R0307J08518L1034p7124j15081m1790O8476J12867
$$ 111756 14865 -98028 -114006 -23699 84819 115853 38729 -76352 -118142 -49666 63201
809F3201N2730n4704j10582o6161M3628J11049P1726l0510j05330q3450J8988
$$ 63201 115931 61227 -49355 -115516 -71888 39161 110887 80377 -24953 -108403 -89415
820h9415J02408Q9612o370r6530r5285n643Q8857J01761J6106q2925j03424k8704
$$ -89415 12993 102605 96235 -295 -95580 -101223 -12366 89395 105501 22576 -80848 -109552
832a09552P4970J07570L7487o4914j08386m8716N6323J06748N8176m5631j06551
$$ -109552 -34582 72988 110475 45561 -62825 -111541 -55218 51530 109706 64075 -42476
843d2476o5849L4789J02718P5430k4055r8531q0938J0374R3513Q7006M01q5880
$$ -42476 -108325 -73536 29182 104612 80557 -17974 -98912 -88538 4975 91981 92382 6502
855F502r2314j1087P8687R4697K4520p0779r8253l2581N9548R7800M4616n1095
$$ 6502 -85812 -96899 -18212 76485 101005 30226 -68027 -100608 -41060 56740 101356 50261
867E0261r7624n3257M1053R5476O1199k8054r4431p1619K0869R0015P5330o204
$$ 50261 -47363 -100620 -59567 35909 97108 69054 -25377 -96996 -76127 13888 89218 83014
879H3014q5656q5188n77Q2696Q6801J0804p3543r2015k4205P1712R4422K7519
$$ 83014 -2642 -87830 -88407 -5711 81090 91894 18351 -73664 -97869 -26157 68265 95784
891I5784n8600r3400m3299N3962R6991M4732m3987q9648n7100L0474R3269O3649
$$ 95784 37184 -56216 -99515 -45553 51438 96170 52183 -37465 -94565 -64091 29178 92827
903I2827k7405q2681o6167O869Q1629P8691n692p6043p3124j1389O3623Q6917
$$ 92827 65422 -17259 -83426 -76557 5072 83763 78071 2028 -71096 -82485 -18862 68055
915F8055K1401o6851q0984k5552M5717Q7321M5413n1357q9379m0081L4474Q2040
$$ 68055 89456 22605 -58379 -83931 -38214 49107 94520 43163 -46216 -86297 -51823 30217
927C0217O1767k8365r4048n7183K6759P5001O7758m444q8256p4793J4685P2394
$$ 30217 91984 63619 -30429 -87612 -60853 14148 81906 77462 -10794 -85587 -70902 1492
939A492O8827J2132o9855q7657o611P0637O9280K0665m6982q7776l2687O1243
$$ 1492 70319 82451 12596 -75061 -81672 -11035 58245 78910 31928 -55848 -88535 -27292
951b7292P5463K6701k9905p6214n3860L7221Q1601L7720k0839n9508o3954N458
$$ -27292 48171 74872 44967 -31247 -85107 -47886 33715 71435 50596 -8912 -72866 -67408
963f7408Q0941N6594j2482n0691o4058k1925O5634P8690L626n2075o0830l5197
$$ -67408 13533 70127 57645 6954 -57104 -79029 -13395 65295 68921 16846 -43984 -79181
975g9181M1382R2478K8911n5621o5346l7894K1691Q9278N6230m7627p9033l7144
$$ -79181 -37799 54679 83590 27969 -37377 -75271 -53580 35698 91928 44301 -34732 -71876
987g1876J5217P2042P2579k5222r0560m4404J7380N4716P0636L862q4080o0940
$$ -71876 -56659 15383 87962 62740 -27820 -72224 -54844 -128 70508 74370 -9710 -70650
999g0650J5690M7581N5768K5911n7271p8459r72M8541M4225L4245k3253q0763
$$ -70650 -54960 -7379 48389 74300 17029 -61430 -62402 -13861 30364 64609 41356 -39407
1011c9407l1742M4203M7984L2818J262o5983o3684K5240O4173L6148P837m5041
$$ -39407 -71149 -26946 21038 53856 55118 -10865 -74549 -49309 14864 51012 58849 13808
1023A3808q0706n584P5613N2454M274l4699p7016l5357O9340P9291M697m0050
$$ 13808 -66898 -72482 3131 55585 59859 25160 -51856 -87213 -17873 61418 66115 26065
1035B6065o2323m9486M5425R7043J9127n0951n4146m3189J8602R1351M5161n0090
$$ 26065 -36258 -85744 -40319 56724 75851 24900 -29246 -72435 -53833 37518 82679 32589
1047C2589n9704k9019K297O4209O5967k8832o8944k5853M40L4693O7829P631o6629
$$ 32589 -27115 -56134 -53837 10372 76339 47507 -21437 -47290 -46850 -12157 55672 63303 -3326
1060c326m1656K263J8167N2711M0521m4587o5510p136J9352L7885N5434j2568
$$ -3326 -44982 -42719 -24552 28159 68680 24093 -41417 -48553 -29201 8684 64118 51550
1072E1550p8762l4999K5267L9341N1060J4310p2824o7649K1958N5436M3054K1083
$$ 51550 -27212 -62211 -36944 2397 53457 67767 -5057 -72706 -50748 4688 47742 68825
1084F8825n2961q6213K065P1008M6051J1257l3732p9527k5039O9549O0507J064
$$ 68825 15864 -70349 -68284 2724 48775 60032 26300 -53227 -78266 -8717 51790 52854
1096E2854k6686n6717m4129M6618P3606O428k8877l5900m3406J1250P0651K9900
$$ 52854 26168 -30549 -74678 -28060 45546 51974 23097 -12803 -56209 -44959 25692 55592
1108E5592k9501l0219l1876j6705M9695N6239j3700l7233k6413k6495K2975O8462
$$ 55592 26091 -4128 -36004 -52709 -3014 53225 39525 2292 -24121 -50616 -27641 40821
1120D0821J7141m4601l7442k2759N414O2904M7807l8018n7976k1278M795M9076
$$ 40821 57962 13361 -24081 -46840 -41426 21478 69285 31267 -26709 -47987 -43192 5884
1132E884O1807j7567p3158l2967J4732L9696N6772P204p1093n2249J8950M0185
$$ 5884 67691 50124 -23034 -56001 -41269 -1573 55199 62403 -8690 -60939 -41989 -1804
1144a804M2782K0180n1299o5819O436M6907L4317J9210k5216o4295j7841M5548
$$ -1804 40978 61158 9859 -55960 -49524 -2617 31700 50910 25694 -38601 -56442 -10894
1156a0894L7201J3201p186m8889m0010K8973M7249J6655k308l1598m9404J212
$$ -10894 26307 39508 32322 -16567 -56577 -27604 19645 36300 33992 2394 -47010 -45798
1168d5798N3447L1694l615k2975m6781k2312M6888N1556J312k6663m1028l2567
$$ -45798 7649 39343 35728 12753 -34028 -56340 -9452 42104 43416 16753 -24275 -56842
1180e6842K9329O4445J6793l3978m1080k9860J2867O3213L5404l3224m7029k5920
$$ -56842 -27513 36932 53725 19747 -21333 -51193 -38326 24887 60291 27067 -19962 -45882
1192d5882N363M9981M7057j8821n3571k6705N487L4535M7348J602n1041l5532
$$ -45882 -40519 9462 56519 37698 -15873 -42578 -37091 -2556 44792 46394 -4647 -40179
1204d0179M421K5427M0308J8766l7215m5978m954K4356L3853K6436j8118n1370
$$ -40179 -35758 -10331 29977 48743 11528 -34450 -39404 -15048 18805 45241 27123 -24247
1216b4247k0680K3354L3237K7783l126m6831l6373J5384L8583K9037L026l6195
$$ -24247 -44927 -21573 11664 39447 36321 -10510 -46883 -31499 7084 36121 39147 2952
1228B952m6318J084M2640L4060N607k7263m7013j3948L8641M2071Q797k3126m2284
$$ 2952 -43366 -42282 358 34418 40025 12762 -34251 -48199 -9558 32513 41310 18184 -24100
1241b4100k4207K6696M8374J7011k1229l7281k9162J2833M7316K7436j5592l6218
$$ -24100 -48307 -21611 26763 43774 22545 -14736 -43898 -31065 16251 43687 28095 -8123
1253h123l0220J681L9909L7584n755l6337l1764n288K9861M2645O583l3457l5539
$$ -8123 -38343 -36662 3247 40831 35076 -1261 -33025 -38313 -8452 34193 40776 7319 -28220
1266b8220j0947K2721M2143J8694k6104m1108j7329J7689L9031K7302j6148m3971
$$ -28220 -39167 -16446 25697 44391 18287 -22821 -40150 -22461 16570 43872 27724 -16247
1278a6247k4724J2924L6870L1862o496m0802l3215N798L5209L4110K418l4273
$$ -16247 -40971 -28047 8823 40685 34189 -6613 -39828 -34030 1179 35289 37707 3434
1290C434l8705l174L2157L5758J0116k6668m0642j3152K5668L8638J6653j9723
$$ 3434 -35271 -38445 -6288 29470 39586 12918 -27724 -40876 -15208 23430 40083 20360
1302B0360l8939k2321J7746L9480K3007j2087l7273k8674Q667L7663K9469n150
$$ 20360 -18579 -40900 -23154 16326 39333 27246 -10027 -38701 -30034 7629 37098 31948
1314C1948l4698l2354N77L3161L5248J914l1285l4702p753K8541L7456R951k5739
$$ 31948 -2750 -35104 -34527 -1366 33882 35796 4511 -30191 -37944 -9403 28053 38004 12265
1327A2265l6601j4000K2156L7131J7383j8630l6878k0224J4327L5784K4361j0731
$$ 12265 -24336 -38336 -16180 20951 38334 19704 -17174 -37398 -23071 12713 37074 26343
1339B6343l4744k6497O150L3307K9228k473l1360l1430k037K9245L2742O199k6825
$$ 26343 -8401 -34898 -28748 4559 33787 31314 -46 -31476 -33513 -4268 28474 34673 7848
1352G848l4279r530K3919L4957J3267k1544l5066j6444J7864L5803J9660j4617
$$ 7848 -26431 -35961 -12042 22915 36182 14638 -20428 -36872 -19008 16795 36455 21838
1364B1838l4719k2828J1811L3663K5158p587l3282k7410M431L1237K9581o21k9716
$$ 21838 -12881 -35709 -23898 9765 34923 27336 -5946 -33356 -28925 2312 31893 31272 1556
1377A556l1018l667K7627L2134O511k4493l3230j0852K2638L3994J3775j9133
$$ 1556 -29462 -33129 -5502 26632 33143 8650 -24580 -35432 -12794 21200 34975 15842
1389A5842l3696j7304J5690L3877K0275j2887l2163k2851P694L2638K6231o037
$$ 15842 -17854 -35158 -19468 14409 34684 21797 -10366 -33217 -25523 7115 33346 27309
1401B7309l0381k7084J67K8745L0649K209k8367l0035n634K4005L3054J0052k4622
$$ 27309 -3072 -30156 -29989 -1244 29405 31614 3247 -26788 -32422 -8417 24637 34689 10067
1414A0067l2879j1029J9283L3343J6324j8228l4621j6361J5454L1212K1081j0375
$$ 10067 -22812 -33841 -14558 18785 35109 16881 -17740 -34101 -18647 12565 33646 23271
1426B3271l4540k2424J0799K9332K3898k825k9972k8497L541K8318K5448L530
$$ 23271 -11269 -33693 -22894 6438 30336 27511 -2461 -30958 -27417 901 26349 29879
1438B9879k3756l2055o098K5596K8067Q391j6972l2026j5327J9678L1823J3340
$$ 29879 6123 -25932 -32030 -6434 21633 30024 13052 -18974 -34301 -14623 17200 30540
1450C0540j2363k9228k2599J0812L4472J9592r086k6191k5626J281L3062K6982
$$ 30540 18177 -11051 -33650 -22838 11634 31226 22140 -4051 -29677 -28396 4666 31648
1462C1648n332k5736k5971n714K6485L4007J788k6889k6323q968J8650L5723J1296
$$ 31648 26316 580 -25391 -31105 -4620 29387 31175 4286 -22037 -31005 -12355 23368 34664
1475C4664k5507k9168j0405J3151L2039K0234j7994l3176j2616R930K5202K5387
$$ 34664 9157 -20011 -30416 -17265 14774 35008 17014 -16162 -28778 -18848 6354 31741
1487C1741p006l4298j8937P769K0706K4901M998k8112k8916K397K0481K2063J3082
$$ 31741 24735 -9563 -28500 -20731 -25 24876 29874 1762 -27154 -24757 -4276 17787 30869
1500C0869j7920l5711p988K1468K3065J5359q320l5518k1092J8832K9416J5125
$$ 30869 12949 -22762 -30750 -9282 13783 29142 20822 -14696 -35788 -16956 12460 27585
1512B7585l483l0088l0428J0925L6256J8156m445k3705l2320n23L6947K5959o134
$$ 27585 24102 -5986 -36414 -25489 10767 28923 24478 773 -31547 -32070 4877 30836 24702
1525B4702k1528k6727j0073K9282L4480k900k2956k0894j3888J6242L6594Q218
$$ 24702 3174 -23553 -33626 -4344 30136 27236 4280 -16614 -30502 -14260 22334 30552
1537C0552k3164k0566j1439M320L0551K1810j7214k5484j0176j268K0214L0221
$$ 30552 7388 -13178 -24617 -20297 10254 32064 14850 -10634 -20810 -22078 -1864 28357
1549B8357l409k9633j5795j165J2369L0163J2275k8273k7604r00J1753K5051K2352
$$ 28357 24948 -4685 -20480 -21645 -9276 20887 33162 4889 -22715 -23615 -11862 13189 35541
1562C5541j9431l8506o728J7032K1660K2170p759m0716j8987K0836K4531J6500
$$ 35541 16110 -22396 -29124 -12092 9568 31738 23979 -16737 -35724 -14888 9643 26143
1574B6143N0l3159k9567J6089L0897J2525M1k0698l2430K641L3721J6703l893
$$ 26143 26193 -6966 -36533 -20444 10453 22978 23019 2321 -30109 -27468 6253 22956 19063
1587A9063j1623k5458j2227K6643K5321k943r724j6520k0159J1513L1629P422
$$ 19063 7440 -18018 -30245 -3602 21719 18776 9052 -7468 -27627 -16114 15515 22937
1599B2937j1998j2858j9503m518L0928K2393j0725j7176j6700j1760K2340L5158
$$ 22937 10939 -1919 -21422 -25940 4988 27381 16656 -520 -17220 -28980 -6640 28518
1611B8518k130k5867j7627r778J2909L7228J1438k9904k5109l932R038L0245K2196
$$ 28518 26388 521 -17106 -26884 -13975 23253 34691 4787 -20322 -24254 -15216 15029 37225
1624C7225k4245l4386m039J2107K1376K3390j0179l7971j1958J6463J6817J7997
$$ 37225 12980 -21406 -25445 -13338 8038 31428 21249 -16722 -28680 -12217 4600 22597
1636B2597K694l1067k3425J2852J9667J2128Q198j7013l0450P34K3010J3167P372
$$ 22597 25291 -5776 -29201 -16349 3318 15446 23644 6631 -23819 -23085 -75 13092 20464
1649B0464m948k9780j5080K1044K1643O380j388k2685k5697J0700L1121J1386
$$ 20464 15516 -14264 -29344 -8300 13343 19723 18335 -4350 -30047 -19347 11774 23160
1661B3160n013j6877k7824j989L4039K1866p689j7763k3289j0215K8386L2174
$$ 23160 18147 1270 -26554 -28543 5496 27362 19673 1910 -21379 -31594 -3208 28966
1673B8966m326k2904j9364j0773J7161L6000N532k6219k0379p207Q557L0279J6254
$$ 28966 24640 1736 -17628 -28401 -11240 24760 30292 4073 -16306 -23513 -14956 15323 31577
1686C1577k0928k5588o149N693K0425K3190q923k9778j1005N861J3393K2721M619
$$ 31577 10649 -14939 -21088 -15395 5030 28220 19297 -10481 -21486 -15625 -2232 20489 25108
1699B5108k6617k1125L725J3757J9448J3086j7816l0046l746J6685J8507J4779
$$ 25108 -1509 -22634 -18909 -5152 14296 27382 9566 -20480 -24226 -7541 10966 25745
1711B5745q328l1972j4516J7376K1809J3789k985k7460k4014J1753K7731J4088
$$ 25745 17417 -14555 -29071 -11695 10114 23903 20918 -6542 -30556 -18803 8928 23016
1723B3016k241k0773k7218K192K9171J9033k619j6395k4565p793K3818K5791R05
$$ 23016 20775 2 -27216 -25024 4147 23180 20561 4166 -20399 -28192 -4374 21417 22322
1736B2322j5534k0609j3383J4878K9477Q064j4948j9364j4944N992K7590J6741
$$ 22322 6788 -13821 -27204 -12326 17151 25215 10267 -9097 -24041 -18049 9541 26282
1748B6282j0740k1674j4798n1K2230K3984l971k3791j7490j888J6566K5883M907
$$ 26282 15542 -6132 -20930 -20981 1249 25233 21262 -2529 -20019 -21907 -5341 20542 25449
1761B5449k1868k2671m036J3829K4131J2843j6976k7026q540J2467K2582J6540
$$ 25449 3581 -19090 -23126 -9297 14834 27677 10701 -16325 -24865 -12398 10184 26724
1773B6724r970k7709j4852R909K2265J7826k867k5475k1270N291K2253J8704K322
$$ 26724 16754 -10955 -25807 -15898 6367 24193 21326 -4149 -25419 -20128 2125 20829 23151
1786B3151k0333k5148j734K0995K1168N449j5772k4932q997J7004K4218R037j1733
$$ 23151 2818 -22330 -24064 -3069 18099 23548 7776 -17156 -26153 -9149 15069 24106 12373
1799A2373k3854j4841J1728K5733J3604q725k2666j7551N474K4480J8653m596
$$ 12373 -11481 -26322 -14594 11139 24743 16018 -6648 -24199 -18725 5755 24408 19812
1811A9812k1580j9827l38K1570K2151O74j9718k1775m731J7456K4181O742j6433
$$ 19812 -1768 -21595 -21933 -363 21788 22462 2744 -19031 -23762 -6306 17875 24617 8184
1824H184k3309r686J3151K4109J3056j2159k4096j3996Q642K3594J7268o150k3735
$$ 8184 -15125 -24811 -11660 12449 25505 13346 -10750 -24746 -16104 7490 24758 18608 -5127
1837e127j8397L779K2222K0258l87k2044k1872j239K0132K2680M519j8722k3954
$$ -5127 -23524 -19745 2477 22735 22348 304 -21568 -22807 -2675 20005 24524 5802 -18152
1850a8152o676J6935K4214Q424j4465k4318j1538J2850K4388J3326r985k4211
$$ -18152 -24828 -7893 16321 24745 10280 -14038 -25576 -12726 11662 24988 15003 -9208
1862i208j5872P821K3686J7573m492k3165j9470K029K1895K1566O90k0654k2512
$$ -9208 -25080 -17259 6427 24000 19508 -3657 -23127 -21098 797 22363 23053 2399 -20113
1875b0113m191J9646K3855N787j7246k4348r369J5308K5290J1522j3495k5193
$$ -20113 -24304 -4658 19197 24984 7738 -16610 -25979 -10671 14619 26141 12646 -12547
1887a2547j3621J0300K5466J6283q553k4753j7798N689K4194J9496l177k3127
$$ -12547 -26168 -15868 9598 25881 17328 -7425 -25223 -19534 4660 24156 20979 -2148
1899b148k0999J185K0904K3168K104k1134k3248m171J8124K4203P483j7137k4982
$$ -2148 -23147 -21962 -1058 22110 24214 3080 -20168 -24339 -6215 17988 25471 8334 -16648
1912a6648q858J4988K3534J2454j1935k5600j3746J0716K3287J5765n751k4343
$$ -16648 -25506 -10518 13016 25470 13535 -12065 -25811 -15095 8192 23957 18206 -6137
1924f137j8600N409K2479J8880p59k0403k2818r89K0765K1555L985j6434k4464
$$ -6137 -24737 -19328 3151 22031 21272 869 -21949 -22938 -2173 19382 23367 6933 -17531
1937a7531q145J8155K3997P743j2972k4206j3335J2723K6010J2052j0217k1907
$$ -17531 -25676 -7521 16476 24219 11247 -12959 -26294 -13571 12439 24491 14274 -7633
1949g633j6986O013K5768J7193o988k1086j8189N22K2161K1980j971k0551j8564
$$ -7633 -24619 -18606 7162 24355 17367 -3719 -21908 -21386 775 22755 20784 233 -18331
1962a8331l886J6341K5111N127j9226k0181o806J0962K3757J2781j4095k3631
$$ -18331 -22217 -5876 19235 24362 5136 -15045 -21851 -10889 12868 25649 11554 -12077
1974a2077r724P701J9998J8499o512k5283j4617M811J7704K0364J691k2763k1396
$$ -12077 -21801 -14100 5898 24397 17885 -7398 -22015 -17204 500 20864 22555 -208 -21604
1987b1604J434J7223J9317Q210j6791k7378m032J7576J9699J0780j0492k8479
$$ -21604 -20170 -2947 16370 24580 7789 -19589 -23621 -6045 13654 24434 13942 -14537
1999a4537j2395J6640K2475J0411n853k4693k0141J2039K6297J1894n141j9131
$$ -14537 -26932 -10292 12183 22594 16741 -7952 -28093 -16054 10243 22137 16996 -2135
2011b135k2693K978K7557J6672n142j5787j9748o314K2496K3831k717j5363j5596
$$ -2135 -24828 -21850 5707 22379 17237 1450 -18298 -24612 -2116 21715 18998 3635 -11961
2024a1961j1464J2716K7494O065j5514j6045j1488L509K4934J7726j2477k0435
$$ -11961 -23425 -10709 16785 22850 7336 -8709 -20197 -16688 8246 25972 13495 -6940
2036f940j1077j561J8904K5898m119k5604j4573r99J4075K6653O863k5989k2846
$$ -6940 -18017 -19578 -674 25224 21105 -4499 -19072 -20071 -5996 20657 27520 1531 -21315
2049b1315P93J3000K2151J4411j9985l0259k026J6156J8183J5027j0261l1770
$$ -21315 -20522 -7522 14629 29040 9055 -21204 -23230 -7074 11109 26136 15875 -15895
2061a5895j0946J8111J8442J0626j596k5990k0593J4462K1950Q322M53j5585k4915
$$ -15895 -26841 -8730 9712 20338 18742 -7248 -27841 -13379 8571 16893 17346 1761 -23154
2074b3154K396K4910J1934q62p704k1915j1010K1135K0256P4o100j5908j9357
$$ -23154 -20758 4152 16086 15224 7520 -14395 -25405 -4270 15986 16060 9960 -5948 -25305
2087b5305J0133K8602P442r318j3359j9362j788K9165K0256j1189j7381j5760
$$ -25305 -15172 13430 20872 11554 -1805 -21167 -22955 6210 26466 15277 -2104 -17864
2099a7864p737K3321K9740n800k4347j5170n185J4337L1452M983k7800j9381j71
$$ -17864 -25601 -2280 27460 21660 -2687 -17857 -23042 -8705 22747 27730 -70 -19451 -19622
2112a9622R335K4869J4897k2251k6250p3J0209J5658J7918r220k9206p827J2681
$$ -19622 -10287 14582 29479 7228 -19022 -19095 -8886 6772 24690 15470 -13736 -21563 -8882
2125h882J1219J4523M308k4492j9025R430J3095J0991J0486j3853k7349j451J8181
$$ -8882 2337 16860 21168 -3324 -22349 -12919 176 11167 21653 7800 -19549 -21000 -2819
2138b819J2437R501l396k8247j4956J8646K0118P140j050k1914k4219J1290K8822
$$ -2819 9618 19119 15723 -12524 -27480 -8834 11284 18424 17374 -4540 -28759 -17469 11353
2151A1353R930m924j6046k5022L01L1548J7863q983j5011j9255p843K5058K6064
$$ 11353 21283 16359 313 -24709 -24408 7140 25003 16020 1009 -18246 -26089 -1031 25033
2164B5033n984j8660j3980q915J2988K8451M218k0827j3805o276M024K3623J5157
$$ 25033 19049 389 -13591 -22506 -9518 18933 23151 2324 -11481 -17757 -13733 9890 25047
2177B5047j6139j8789n085N79J4412K2094m174k3508j0207J413Q482K1831Q326
$$ 25047 8908 -9881 -14966 -14387 25 22119 17945 -5563 -15770 -14357 -5875 15956 24282
2190B4282k1952j9792M05R233J7895J5444j4281k7912n278J3525J5705J5717n101
$$ 24282 2330 -17462 -17057 -7824 10071 25515 11234 -16678 -21956 -8431 7274 22991 17890
2203A7890k9846j4364J4832J9035J2661o86k3836k2491J0335K3747J1132l36j5636
$$ 17890 -11956 -26320 -11488 7547 20208 19522 -4314 -26805 -16470 7277 18409 18073 2437
2216B437k4304K32K4456J5281j197j0825k0769r083J8573K1816J457j0285j6006
$$ 2437 -21867 -21635 2821 18102 16905 6080 -14689 -23772 -5199 16617 18074 7789 -8217
2229h217j4538R394K5774P900j0063j4450j5045P30K3403J7528p663j7219j4177
$$ -8217 -22755 -13361 12413 20313 10250 -4200 -19245 -18515 4888 22416 14753 -2466 -16643
2242a6643l729J7836K3967j056k0325j5504m840J2531K4799P622j9658k0494m906
$$ -16643 -20372 -2536 21431 20375 50 -15454 -20294 -7763 17036 24658 5000 -15494 -20400
2255b0400J0118K1806J3824j4002k4938p662Q858J8890J6945o821k5355j4239
$$ -20400 -10282 11524 25348 11346 -13592 -21254 -12396 6494 23439 16618 -8737 -22976
2267b2976Q371J7842J6595j92k1783k0103M038J8791J6056L913j6000k3012k717
$$ -22976 -14605 3237 19832 19640 -2143 -22246 -18208 583 16639 20552 4552 -18460 -21177
2280b1177J7677J8013N840j1030k2134j0314J3780K0955Q656q152j9500j5629
$$ -21177 -3500 14513 20353 9323 -12811 -23125 -9345 11610 20266 12114 -7386 -23015
2292b3015Q337K2856J2508n814j8104j7580J744K1678J7772k709j7140j7944l707
$$ -23015 -14678 8178 20686 14872 -3232 -20812 -19068 2610 20382 17673 533 -17411 -21118
2305b1118J8047K1415K152j6271j8884o949J3309K2546Q307j3460k0681r378Q662
$$ -21118 -3071 18344 20496 4225 -14659 -21608 -8299 14247 22554 9094 -11587 -20965 -12303
2318a2303K1238J3684q843k1499j2778M943J9426J6748l114k0018j6850J421J7234
$$ -12303 8935 22619 13776 -7723 -20501 -15558 3868 20616 17502 -2516 -19366 -17945 -711
2331g11J8661K108j7304j9853k930J4957J9798O505j3763k1122p359J2153J9949
$$ -711 17950 20058 2754 -17099 -20029 -5072 14726 21231 7468 -13654 -21013 -8860 11089
2344A1089J0088r343k0889j2013Q207J9856J3265m838j9427j6397L693J9039J6647
$$ 11089 21177 11834 -9055 -21068 -12861 6995 20260 15422 -4005 -20402 -16709 2330 18977
2357A8977o01j7686j8383k518J7070J9824L786j4914k0413o868J3907K0949Q561
$$ 18977 18376 690 -17693 -20211 -3141 16683 20469 5555 -14858 -21726 -7819 13130 21691
2370B1691j1599k1133j0754R763K1446J2565p908k0884j4214N593K0139J5733
$$ 21691 10092 -11041 -21795 -12032 9414 21979 14071 -6813 -21027 -15434 4705 20438
2382B0438l522j9363j6939J239J8401J7905J093j6835j9340k977J5054J9573O117
$$ 20438 16916 -2447 -19386 -18147 254 18159 19252 2417 -16923 -19900 -4846 14727 20844
2395B0844j4071k0517p302J1908K0443J0255j0313k0836j1771Q406K0407J3736
$$ 20844 6773 -13744 -21046 -9138 11305 21560 11247 -9589 -21360 -12954 7453 21189
2407B1189n855k0676j5554M469J9510J6277j040j9048j8130n07J7475J8866L111
$$ 21189 15334 -5342 -20896 -16427 3083 19360 18320 -728 -18858 -19365 -1890 16976 20087
2420B0087j5567k0764n177J5114K0413O944j2081k1330r927J2020K0981J0483
$$ 20087 4520 -16244 -21421 -6307 14106 21050 8969 -12361 -22288 -10268 10713 21196
2432B1196q900k0233j3507P197K1081J3651n574j8352j6148J915J9894J6783j506
$$ 21196 12296 -7937 -21444 -14247 6834 20485 14911 -3441 -19589 -17674 2220 19003 17497
2445A7497j6812j7603k550J6304J9748L086j5378j7916o848J1850K1514Q307j2549
$$ 17497 685 -16918 -19468 -3164 16584 19670 4292 -13624 -20472 -8622 12892 21199 8650
2458H650j9024j0025P594K0657J3860q274k0566j2517M337J7931J7908k429k0979
$$ 8650 -10374 -20399 -12805 7852 21712 13438 -7128 -19645 -15308 2623 20531 18102 -2877
2471b877j6271J885J5667J8957L767j8652k0205j751J4952J8236Q110j3591k2938
$$ -2877 -19148 -17263 -1596 17361 21128 2476 -17729 -19480 -4528 13708 21818 8227 -14711
2484a4711o662J3620J8094J0377q141k2755j2856J1679J9669J1072l998j9747
$$ -14711 -21373 -7753 10341 20718 12577 -10178 -23034 -11355 8314 19386 15388 -4359
2496d359j7843O052K1560J2790k168j5083j9664j189K0683J6548j45j2636j7914
$$ -4359 -22202 -16150 5410 18200 16032 949 -18715 -19904 779 17327 17182 4546 -13368
2509a3368q221J5450K1628L295j1516j5852j2024P785K3654J0443j0608j6164
$$ -13368 -21589 -6139 15489 18784 7268 -8584 -20608 -12823 10831 21274 10666 -5498
2521e498j2770Q68K1543J8214p182j8619j2650k519J5975K3165J03k1175j5563
$$ -5498 -18268 -17400 4143 22357 15175 -3444 -16094 -18613 -2638 20527 20630 -545 -16108
2534a6108k338J1750K2988P701j9542k0721k079R992J8854J3013j2770k5257n507
$$ -16108 -18446 -6696 16292 23993 4451 -16270 -18349 -8357 10497 23510 10740 -14517 -20024
2547b0024J1524J4644J3991m497k3948j2833J0316J4758J1234K642j8132j9926
$$ -20024 -8500 6144 20135 15638 -8310 -21143 -10827 3931 15165 17807 -325 -20251
2559b0251N071J6742J0363N165r812k2419n033J7233J3814N049m014j9579j4990
$$ -20251 -15180 1562 11925 17090 7278 -15141 -20174 -2941 10873 15922 11908 -7671 -22661
2572b2661J2198K0682O366l417j4980j9694L558K4711J2353n397j2503j8863m859
$$ -22661 -10463 10219 16585 13168 -1812 -21506 -17948 6763 19116 13719 1216 -17647 -22506
2585b2506K3295K0576n115j4928j5023q725J6280K6416O2j8677j3950o823Q245
$$ -22506 789 21365 16250 1322 -13701 -22426 -6146 20270 20332 1655 -12295 -19118 -10873
2598a0873K5316R094j8703j6529m200L793J8146J6794j1751k1132m972L613J0603
$$ -10873 14443 23537 4834 -11695 -15895 -12102 6044 22838 11087 -10045 -15017 -11404 -801
2611h01J8622K81k1977j2585M397P713J5130J0707j6391k1297K89R871J2528J4173
$$ -801 17821 18102 -3875 -16460 -12063 -4350 10780 21487 5096 -16201 -15912 -6041 6487 20660
2625B0660p063k6236r046J3140J4290J2275J20k4605j8953J2572J9844R977R74
$$ 20660 13597 -12639 -21685 -8545 5745 18020 18140 -6465 -25418 -12846 6998 16975 17949
2638A7949j8278k4031N697K4890J1936k784j2238k1635m386K4551J7592m698j0850
$$ 17949 -329 -24360 -18663 6227 18163 15379 3141 -18494 -22880 1671 19263 14565 3715
2651C715j5594j0572J6681K2905o13j2902j0559j0804N293K3200Q737j2856j1385
$$ 3715 -11879 -22451 -5770 17135 16522 3620 -6939 -17743 -12450 10750 19487 6631 -4754
2664d754q610k347J7262J8377o944j5725q378m781R607K2522L350j8907j3205
$$ -4754 -13364 -15711 1551 19928 12984 -2741 -11119 -15900 -6293 16229 19579 672 -12533
2677a2533k801N488K0436J3189j6286k0885l398O640J6199J6719q421k6238q645
$$ -12533 -15334 -9846 10590 23779 7493 -13392 -16790 -10150 6049 22768 14347 -11891 -20536
2690b0536J0791J3811J4958o09k4877j5922J0319J5845J1238L109j7493k1299
$$ -20536 -9745 4066 19024 18415 -6462 -22384 -12065 3780 15018 18127 634 -20665
2702b0665M551J8475J0573K579q900k0817n515J8032J3791J922m889j6159j3110
$$ -20665 -16114 2361 12934 15513 6613 -14204 -19719 -1687 12104 14026 9137 -7022 -20132
2715b0132J1077J8526N309m344j1551j6231J158K0940J1769m400j0320j5314o325
$$ -20132 -9055 9471 14780 10436 -1115 -17346 -16188 4752 16521 12121 1801 -13513 -19838
2728a9838J7729J9618j403j3196j4280q134J1047K3779N080j5637j4783q017O032
$$ -19838 -2109 17509 16106 2910 -11370 -19504 -8457 15322 20402 4765 -10018 -18035 -12003
2741a2003K2181J2261j3698j8717p115M236J7347J6489p026k1199r845M216J2977
$$ -12003 10178 22439 8741 -9976 -17091 -12855 4492 20981 13955 -7244 -17089 -12873 104
2754A04J7164P34k0189j4486K595J1595J5000O437j3927j9841k040J2232J3455
$$ 104 17268 18002 -2187 -16673 -14078 -2483 12517 18954 5027 -14814 -16854 -4622 8833
2767H833R125p624k0640q832J0631J4817J0338k813j8541j4579O188J7473J1050
$$ 8833 17958 10334 -10306 -19138 -8507 6310 16648 13835 -4706 -19285 -13097 4376 15426
2780A5426n39j4297j8249J84J8183J4741N22j2055j7941n841J5936J8364K924
$$ 15426 14887 590 -17659 -17475 708 15449 15971 3916 -14025 -19866 -3930 14434 17358
2793A7358j1142j6613r388J0562K0780P074r924j6114j0923N559J9779J2361p334
$$ 17358 6216 -10397 -19785 -9223 11557 18631 8707 -7407 -18330 -12771 7008 19369 12035
2806A2035j6570j1786J508J6273J5960k089j6403j3587j602J3043J7918L093j4552
$$ 12035 -4535 -16321 -14813 1460 17420 15331 -1072 -14659 -16261 -3218 14700 17793 3241
2819C241j5923m237J0459J7104Q171j0902j8004p485Q130J6508J1441o364j8803
$$ 3241 -12682 -16919 -6460 10644 18815 7913 -10091 -17576 -9446 7062 18503 12139 -6664
2832f664j1166N620J5908J3184k154j6974j4934J998J5570J4851J181j4199j7277
$$ -6664 -17830 -12210 3698 16882 14728 -2246 -17180 -15182 388 15239 16420 2221 -15056
2845a5056k340J4311J6316M576j1647j7961p062J1759J7678P998q812j7738j0966
$$ -15056 -17396 -3085 13231 17807 6160 -11801 -18863 -7104 10574 18572 9760 -7978 -18944
2858a8944P802J8325J1068n459j7369j3157L793J7105J4169k430j5884j4725j53
$$ -18944 -11142 7183 18251 12792 -4577 -17734 -13941 3164 17333 14903 -981 -15706 -15859
2871a5859J4601J6512J638j4119j6298l773J2428J7088N755j1222j7196p269R209
$$ -15859 -1258 15254 16892 2773 -13525 -17298 -4870 12218 17973 6751 -10445 -17714 -8505
2884h505J7164R603p875j7827j0209N623J6887J2808m211j6669j3828K548J5727
$$ -8505 8659 18262 10387 -7440 -17649 -12026 4861 17669 13458 -3211 -17039 -14491 1236
2897A236J4780J26j5553j5860j424J4096J6414L705j2958j7256n338J1514J7388
$$ 1236 16016 16142 589 -15271 -16695 -2599 13815 17520 4562 -12694 -18032 -6518 10870
2910A0870P301j0014j7355r135Q231J7479J0204n748j7111j2253M850J6383J2752
$$ 10870 18171 8157 -9198 -18333 -10102 7377 17581 11833 -5278 -17531 -12681 3702 16454
2923A6454k481j5207j4541L70J5232J4995J040j3223j5909m075J2943J6807M685
$$ 16454 13973 -1234 -15775 -15405 -173 14822 15862 2639 -13270 -17345 -4402 12405 17090
2936A7090j1141j6496p416R663J7570Q406p957j6502j0573N139J7579J2209m700
$$ 17090 5949 -10547 -17963 -8300 9270 17676 9719 -6783 -17356 -12217 5362 17571 12871
2949A2871j5968j2961J228J5466J5683l57j5471j5114j717J2852J7101M424j3866
$$ 12871 -3097 -16058 -14830 636 16319 15962 491 -14623 -16340 -3488 13613 18037 4171
2962D171j6572m871J0290J7291Q312j0194j8208p995P976J6335J1114n606j8139
$$ 4171 -12401 -17272 -6982 10309 18621 8427 -9781 -17776 -9800 6535 17649 12043 -6096
2975f096j1539N691J4879J3048j038j6641j4864K007J4600J3685K487j3080j7429
$$ -6096 -17635 -11944 2935 15983 14945 -1696 -16560 -14553 47 13732 16219 3139 -14290
2988a4290k737J3747J5091M465r151j7629q143J1256J6802P110o626j6087j2280
$$ -14290 -17027 -3280 11811 16276 7125 -10504 -18647 -7391 9411 16521 9895 -6192 -18472
3001a8472O319J8882J0076m853j4014j4409P88J7826J4539k487j3252j4642m045
$$ -18472 -12153 6729 16805 11952 -2062 -16471 -15683 2143 16682 14195 943 -13699 -17744
3014a7744J5028J7904J551j3703j4376n754R738J9653O595j3017j5626o875O548
$$ -17744 -2716 15188 16739 3036 -11340 -17094 -7356 12297 18892 5875 -9751 -16626 -10078
3027a0078J7819J1591r537j7517q196M673J4591J4341l862j8846j0262L643J1044
$$ -10078 7741 19332 9795 -7722 -15918 -11245 3346 17687 13825 -5021 -15283 -11640 -596
3040e96J4596K063j5933j4500J074J0773J2075P320j0303j8783l584J0561J2007
$$ -596 14000 16063 130 -14370 -13296 -2523 9552 16872 6569 -12214 -15798 -5237 6770
3053F770Q672l922j8855j0584R204J3886Q955n47j5261j6676M475J7653J0018
$$ 6770 15442 11520 -7335 -17919 -8715 5171 14126 13579 -1682 -18358 -13883 3770 13788
3066A3788m9j1331j8177j680J7823J4484p28r999j5676p467J4642J8702J015j0706
$$ 13788 13739 2408 -15769 -17449 374 14858 14130 4131 -11545 -19012 -4370 14332 15347 4641
3080D641j2670r226P990K0181O109j1114j1783q082J660J7428J2331q159j3469
$$ 4641 -8029 -17255 -9265 10916 17025 5911 -5872 -13954 -12294 5134 17465 9306 -4163
3093d163p474j218J1334J6990j629j5377q902j898O052J6863P284j3940j4567
$$ -4163 -11637 -12855 -1521 15469 13840 -1537 -10439 -12337 -6285 10578 17862 3922 -10645
3106a0645k248M570J3729J3308q517j9475o160O059J1626J4480j299k0564j3197
$$ -10645 -12893 -8323 5406 18714 10197 -9278 -15438 -9379 2247 16727 15428 -5136 -18333
3119a8333P111J2715J2287L335j7307j8785M553J6052J0686L499j1294k0409j574
$$ -18333 -11222 1493 13780 17115 -192 -18977 -14424 1628 12314 15813 4519 -15890 -17464
3132a7464J7046J2472J508o800j6603q877J3691J6224J684n474j1234j2791N830
$$ -17464 -418 12054 13562 6762 -9841 -18718 -5027 11197 12881 7407 -3827 -16618 -10788
3145a0788J8199O386n452q630j2084k856J6257J3589l993q956j0377p860J0739
$$ -10788 7411 13797 8345 -285 -12369 -15225 1032 14621 10628 1672 -8705 -16565 -5826
3158e826J9353J927j1725j1095q078M597K0349R553j2208j4462o750K018J6842
$$ -5826 13527 15454 3729 -7366 -15444 -10847 9502 19055 6847 -7615 -14365 -12347 4495
3171D495J5626q523j8763p857L416J2447J6428j818j9954j1299M772J0274J3711
$$ 4495 20121 11598 -7165 -15022 -11606 841 17269 15451 -4503 -15802 -11030 -756 12955
3184A2955L898j6001j6418K947J1011J0296O869q702j8937k896J1294J0001O311
$$ 12955 16853 852 -15566 -12619 -1608 8688 15557 6855 -12082 -14978 -3684 6317 12628
3197A2628k092j6219j0712Q499J2569O384J159j1576j5674J708J5167R375J468
$$ 12628 10536 -5683 -16395 -7896 4673 11057 12216 640 -15034 -13326 1841 11216 12684
3210A2684p866j6662n318J4669J4651J185o589j4861j0311J0933J8827M285q363
$$ 12684 4818 -11844 -17162 -2493 12158 13343 6754 -8107 -18418 -7485 11342 15627 7264
3223G264j3125j0985N330J9965R296r584j2855r299Q40J6949J3732o368j4743
$$ 7264 -5861 -16846 -11516 8449 17745 8161 -4694 -13993 -13153 3796 17528 11160 -3583
3236c583q800k45J1340J5735k67j4889j0821m00P347J4287O646j2181j4280k414
$$ -3583 -12383 -12628 -1288 14447 14180 -709 -11530 -11930 -4583 9704 16350 4169 -10111 -12525
3250a2525N776J2135J0250o369j6496o806N518J0788J1308k41j6335j2108M219
$$ -12525 -6749 5386 15636 9267 -7229 -14035 -8517 2271 13579 13338 -2997 -15105 -10886
3263a0886J1558J0857K928j2369j6073K15J2742J1534L652q431j7104m682J2136
$$ -10886 672 11529 14457 2088 -13985 -13770 -1028 10506 14158 5727 -11377 -16059 -3923
3276c923J3175M336o094j5075q989Q855J5761O000n556j2729j0803L790J5856
$$ -3923 9252 13588 7494 -7581 -16570 -7715 8046 14046 8490 -4239 -15042 -11252 4604
3289D604R451m059j0979j1342q74J3417J3020j026j0911j1234l924R457J5102
$$ 4604 14055 9996 -983 -12325 -13199 218 13238 12212 1301 -9933 -13857 -4400 10702
3302A0702L328r953j1970n486N928J4600P892p668j3258p421L337J3452J0893
$$ 10702 14030 4077 -7893 -13379 -7451 7149 15041 7373 -5885 -13306 -9969 3483 14376
3315A4376l470j4572r246J685J1494J2767J49j3401j2223k17J0489J3031L585
$$ 14376 10906 -3666 -12912 -11227 267 13034 13183 -218 -12441 -12658 -2169 10862 14447
3328A4447j0823j4664k977R726J2709N996p139j5439o723P784J2892Q255m499
$$ 14447 3624 -11040 -14017 -4291 8418 14414 7275 -8164 -14887 -7103 5789 14044 9545
3341I545j3958r843M157J3520R634j697j2353j2208P28J2586J1793N43j0381j2930
$$ 9545 -4413 -14256 -10099 3421 13055 11358 -995 -13203 -12475 111 11904 12447 2066 -10864
3355a0864l356J0891J3389L928r054j3308o092P923J4259O685p051j3318p860
$$ -10864 -14220 -3329 10060 13988 4934 -8374 -14466 -6543 7716 14401 7350 -5968 -13828
3368a3828M535J3946R325m268j3092r881J992J2557J1809r77j2328j1489j154
$$ -13828 -9293 4653 13978 9710 -3382 -13263 -11271 1286 13095 12118 -210 -11699 -12853
3381a2853J1009J2755K460j0166j3028l977R260J3626N216q105j3854o270O617
$$ -12853 -1844 10911 13371 3205 -9823 -13800 -4540 9086 14302 6197 -7657 -13927 -7310
3394g310J3497Q139n715j3350q874L917J3151R635k364j2288j0950J105J1676
$$ -7310 6187 14326 8611 -4739 -13613 -9696 3455 13090 10726 -1562 -12512 -11407 269
3407B69J1145P95j0754j2052k005R940J1998L837q683j2783n010P492J3095N922
$$ 269 11414 12209 1455 -10597 -12602 -2662 9336 13173 4490 -8293 -13303 -5811 7284 13206
3421A3206o013j2718p818N215J2885Q154l816j2166r354K229J1901J0447j108
$$ 13206 7193 -5525 -13343 -8128 4757 12911 9095 -3071 -12425 -10196 1705 12152 11044
3434A1044j1219j1207n30J0608J1985J872r828j1856l577Q409J2544M909p639
$$ 11044 -175 -11382 -11912 -1304 10681 12553 2725 -9131 -12708 -4299 8245 13154 5515
3447E515j2480o021N993J2722P698n424j2613p620L268J1872R575k798j1595r715
$$ 5515 -6965 -12986 -6993 5729 13427 8003 -4610 -12230 -8962 2910 12485 9687 -1908 -11623
3461a1623J146J0667J0681M76j0608j1013j066R101J0942L698q479j2267l836
$$ -11623 -10477 190 10871 11347 739 -10274 -11340 -2239 8703 12401 3922 -8345 -12181
3474a2181P360J1527N712n853j2567o862N834J1747P224l055j1685r988L270J1854
$$ -12181 -4821 6706 12418 6565 -6002 -12864 -7030 4717 11941 8886 -2799 -12787 -9517 2337
3488B337Q661n53j0725j0992n31J1471J0615J034q771j1754l806R422J2467L054
$$ 2337 10998 10445 -280 -11272 -11803 -332 10283 11317 2546 -9208 -13014 -3592 8875 11929
3502A1929p205j1607o001O556J2893N695n762j1137p259L084J2731Q766m326j1064
$$ 11929 4724 -6883 -12884 -6328 6565 12260 6498 -4639 -11898 -8814 3917 12683 8357 -2707
3516b707q014N79J0913J0541j237j0509q945j020Q016J1905K460r553j0615k414
$$ -2707 -10721 -10142 771 11312 10075 -434 -9379 -10399 -2383 9522 11982 2429 -8186 -10600
3530a0600N774J1206O347p146j2194m720M793J0111Q074k646j2914p932L739R351
$$ -10600 -4826 6380 12727 5581 -6613 -11333 -6540 3571 11645 8999 -3915 -11847 -8108 1243
3544A243R073P30j1354j1397J252J0146R631K641r019j3189k044J0003J0398L586
$$ 1243 10316 11046 -308 -11705 -10453 -307 9324 11965 2946 -10243 -12287 -2284 8114 11700
3558A1700o135j3092n950Q954J1573M148m802j0790q520N482J2623N814m125q425
$$ 11700 5565 -7527 -13477 -4523 7050 11198 6396 -4394 -12914 -7432 5191 11005 6880 -1545
3572a545q938K60J2741Q164k536p646q617k860R106J1662M33p789q341m833M713
$$ -1545 -10483 -10223 2518 10682 8146 500 -8117 -10977 -1871 9791 10224 2435 -5906 -10739 -6026
3587f026J3136M931p555r149n718J898J1839R340m810j1775o586J457R327J1628
$$ -6026 7110 12041 4486 -4663 -10381 -8483 3356 12696 7886 -3889 -10475 -9018 309 11937
3601A1937p73j3308q502J054P724J1660K893j1455j1976M12P951R832N104q295
$$ 11937 11164 -2144 -10646 -9592 -1868 9792 12685 1230 -10746 -10334 -2383 7449 12553 4258
3615D258j3258k535Q483Q664N133l675j3056o126P037R430M750j083r703r740
$$ 4258 -9000 -11535 -3052 5612 10745 7070 -5986 -12112 -5075 4355 9105 8022 -1681 -11421
3629a1421L558J0410N315K10o167j0793j867J0171Q226J039m087j0070o746P513
$$ -11421 -7863 2547 7862 8072 1905 -8888 -10755 -584 7642 8681 4594 -5476 -12222 -4709
3643d709J1968K843m744q461q658L017J3809O783n093q734q621J04J2696J0290
$$ -4709 7259 10102 5358 -3103 -11761 -8744 5065 11848 6755 -1979 -10600 -10496 2200 12490
3657A2490l995j0082p407j335R195J2129n42j1124p671q95O077J1221L643j0097
$$ 12490 8495 -1587 -8994 -10329 -1134 10995 10453 -671 -8342 -9237 -3160 8061 11704 1607
3671A607r332r22M561Q637O904o062j1367k918L951O561P623p39j1142o838L055
$$ 1607 -7725 -8647 -4086 4551 11455 5393 -5974 -8892 -4941 1620 9243 8504 -2638 -9476 -6421
3686f421O299P103K969q502j0563L19P495O906M683n433j2132m062P940R038M346
$$ -6421 -122 6981 9950 1448 -9115 -8796 -1301 5605 10288 4855 -7277 -11339 -3399 5639 9985
3701I985k799j1753q121O665J1625M049k183r334r628L069J2447O254k808p941
$$ 9985 7186 -4567 -12688 -6023 5602 9651 7468 -1866 -11494 -8425 4022 10276 7468 -473
3715d73r043n77J1024R424k259p746p480l096P693J1201Q00p915p213l556M201
$$ -473 -9516 -10093 931 10355 8096 350 -7130 -10226 -2533 8668 9468 1553 -5660 -9216 -5015
3730e015J0691M727o261q211m219J614Q951Q124l153r886n211L62O522R864P77
$$ -5015 5676 10403 4142 -4069 -8288 -6674 2277 10401 7248 -2638 -7849 -7487 -965 8899 9676
3745I676r771q214o6O003R472L979q265j0888j628O242Q696N845n488j2088m192
$$ 9676 -95 -8309 -8375 -2372 7100 11079 2814 -8074 -9702 -3460 5236 11081 5593 -6495 -10687
3760a0687N982Q903N587k852j0874o790M554R369N422r40q531q709J510R346O904
$$ -10687 -4705 4198 9785 6933 -3941 -10731 -6177 3192 8614 7674 -857 -9566 -8056 1290 8194
3775H194m89o687q407k275Q567Q108J123m936q402m627N656R692L410m050q101
$$ 8194 7705 1018 -7389 -9664 -1097 7011 8134 3198 -5204 -9831 -4175 5517 8927 4877 -3224
3790c224n711K212R839O337k899q247o488J07Q455Q715j003p913p480j441P027
$$ -3224 -8935 -6723 3116 9453 6554 -1693 -8181 -8074 381 9096 8093 180 -7300 -8741 -1714
3805a714R279J728p669q256k144N008R724L982o059r274l583L941Q914N655l712
$$ -1714 7565 9293 1624 -6632 -8776 -3768 5956 9938 3879 -5395 -8978 -5037 3877 9532 5820
3820E820r541n462L473P710O431j233q531p402J751P255P030R47p212q585q65
$$ 5820 -3721 -9183 -5710 2000 8431 7198 -1333 -8735 -6984 271 7301 8248 1036 -7549 -8414
3835h414O785P951K202n428q860l431N838Q166L909l566r171n224L812Q645N212
$$ -8414 -1629 6322 8524 3096 -5764 -9195 -3357 4809 8718 5152 -4019 -9243 -5431 3214 8426
3850H426k434p803o819J425Q463O980q80p541p322o19P555P962P30o579p774j918
$$ 8426 5992 -1811 -8630 -7205 1258 8238 7358 -183 -7505 -8124 -569 7393 8123 1544 -6230 -8148
3866h148N510Q565K763n407q285l570M199Q701M522l789q378n090K545Q142N873
$$ -8148 -2638 5927 8690 3283 -5002 -8572 -4373 4328 8850 5061 -3317 -8407 -5862 2280 8153
3881H153j849p998o327J103P116P283R6p464p202o02O503P336J928n684p975k501
$$ 8153 6304 -1694 -8021 -6918 198 7481 7577 113 -7089 -7691 -1188 6148 8076 2392 -5583 -8084
3897h084N095P617L757m084q514m092L707P868M722k544p822n542J888P417O381
$$ -8084 -2989 4628 8385 4301 -4213 -8305 -4598 3270 7992 5448 -2374 -7916 -6028 1389 7770
3912G770j402p025o875L84O878P046O91o042p830j494N923P595K319n030p528
$$ 7770 6368 -657 -7532 -7148 -270 6776 7467 1425 -6405 -7899 -1976 5619 7938 2908 -4620
3927d620l345M110Q125L762l468p896m469K632P788N271k232p039o169J277O896
$$ -4620 -7965 -3855 4270 8032 4564 -3332 -7801 -5169 2619 7890 5658 -1381 -7550 -6273 623
3942F23O555m82o620o590n20N782P305J167n548p059k097M771P520K909m448p362
$$ 623 7178 6696 76 -6514 -7034 -1252 6053 7220 1672 -5387 -7484 -2713 4807 7716 3268 -4094
3958d094l568L573P339M366k699p371n183K049P117N560j060o744o318M00O533
$$ -4094 -7662 -4089 3250 7616 4917 -2454 -7637 -5588 1529 7089 6029 -715 -7033 -6633 -100
3973a00O642M21n817p079j307N622P107J920m838p810k684M660P470L103l167
$$ -100 6542 6963 1146 -5933 -7240 -1618 5489 7409 2571 -5239 -7923 -3263 4207 7310 4143
3988D143p510m323K958P612M355j877p056n485J475O506N753p67n771o157m22
$$ 4143 -3367 -7690 -4732 2880 7235 5358 -1698 -7183 -5708 798 6551 5784 13 -6144 -6566
4003f566N838O625P13n383o365j795M620O981K227m084o788l006L155O934M370
$$ -6566 -728 5897 6610 1227 -5138 -6933 -2313 4668 6895 2811 -3977 -6983 -3828 3106 7476
4018G476k921o593m705J762O107N648j072o784n241M27N517O313Q20n812o788
$$ 7476 4555 -2038 -6743 -4981 1126 6774 5702 -1082 -6323 -5896 -379 5934 6754 942 -5846
4033e846o92M852O351K646m866p220k096M015O568L370l376p087l789L303O348
$$ -5846 -6538 -1686 4665 7311 2445 -4775 -6871 -2856 3712 7082 3706 -3381 -7170 -3867 2481
4048B481L974j591o666n169K293N892M867o94n281o017K10N735N018L33l868o023
$$ 2481 6455 4864 -1802 -6971 -4678 1214 6081 5387 106 -5911 -5701 34 5052 5385 1517 -4506
4064d506j991M710O079J685l086n930l625L042O544L681k806n536m238Q19O697
$$ -4506 -6497 -1787 4292 5977 2891 -3039 -6664 -3622 2922 6603 3797 -1739 -5977 -5158 1539
4079A539M854j556n723m996n9O086O061k26n454n650j027M767O701J582n574o005
$$ 1539 6393 4837 -886 -5882 -5941 145 6206 5980 526 -5124 -6151 -1384 5317 6899 1325 -4680
4095d680j245L162O359L505m467o251k363K691N399M107j923o484l645K184M366
$$ -4680 -5925 -2763 3596 7101 2634 -3617 -5980 -3289 2110 6217 4294 -2190 -5835 -3651 715
4110G15M597l30n328n330Q68M524M482J582m204o354j021M656M568J966k225o322
$$ 715 5312 4982 -346 -5676 -4808 -284 4198 5780 1576 -4778 -5799 -1143 3425 5391 3166 -3156
4126c156l422L946N310K799j570n293n200J862O743L750j050n023n590L35O317
$$ -3156 -6578 -2632 2678 5477 3907 -1386 -6586 -4724 2019 5769 4719 -304 -5894 -5559 758
4141G58M872o01m523n493j051N361O174j11m531m712j883L648O095J816m277m638
$$ 758 5630 5029 506 -4987 -6038 -677 5497 5386 855 -3857 -5740 -2092 4003 5819 1542 -3096
4157c096k089K049N599L366l057m869k491O71M487M628o98n217l789P7L392N300
$$ -3096 -5185 -3136 2463 5829 2772 -2097 -4588 -3917 570 5198 4500 -717 -4506 -4429 -1037 4263
4173D263J385m527n251q81K881N294L301l628o476k038K708M980M042j940o448
$$ 4263 5648 1121 -4130 -5011 -2130 3164 6465 2837 -3639 -5677 -2969 2011 6053 4113 -2335
4188b335l936K659N017M172q10n726n036J447N629L963l34m309n525q7N233M289
$$ -2335 -6271 -3612 1405 5577 4767 -959 -5995 -4548 1081 5044 4710 401 -5124 -5211 22 4311
4204D311L26l446m962j837M072N417R37k919m173k830J898N693K246j903l846
$$ 4311 4637 1191 -3771 -5608 -1536 3881 4818 1899 -2274 -5104 -3206 2487 4733 2830 -1016
4219a016l640M08N101M359j352m074l715j096M073N359N82m444m052j539L029
$$ -1016 -4656 -4248 853 5212 3860 -214 -3929 -5025 -952 4407 4989 545 -3507 -5046 -2017
4234b017N580K266m015m984k126K454N185L506k903n686k446J965N049L631j715
$$ -2017 3563 5829 1814 -3170 -5296 -2842 2343 5849 2946 -2740 -5186 -3221 1828 5459 3744
4249C744n424l425J455M434L746qm812m079J44M143L696Q92l498m694r86L437
$$ 3744 -1680 -5105 -3650 784 4530 4522 -290 -4369 -4225 -82 3614 4506 1008 -3686 -4672 -1235
4265a235L914J687j929m987k206K302M552K085j009m142l803J075M875L178n43
$$ -1235 2679 4366 2437 -2550 -4756 -2454 2098 4183 3174 -968 -4771 -3696 1179 4357 3814
4280C814m019m071L2M297M319o6l557m315j136L555M684J088l253m342j729K614
$$ 3814 -205 -4276 -4244 53 4372 4306 749 -3566 -4702 -1147 3537 4625 1372 -2970 -4699 -2085
4296b085M789K297l057m189k222J810M244L161j714m425k763O61L853L881o39
$$ -2085 2704 5001 1944 -2245 -4467 -2657 1587 4748 3034 -1391 -4154 -3493 360 4241 3602
4311C602m025l292p2L285L852Q44l418m219n94K831L855J806k560m492j882K299
$$ 3602 -423 -3715 -3787 -502 3350 4194 776 -3443 -4037 -1206 2649 4455 1895 -2597 -4479 -2180
4327b180M054K366j432m304k921J353M018L037n73l872l700L79L983L420L12l592
$$ -2180 1874 4240 2808 -1496 -4417 -3064 954 3991 3418 -454 -4154 -3775 208 3628 3940 348
4343C48l796p30L552L951O19k741l954j497K544M143J705k179m004k171J745M445
$$ 348 -3448 -4178 -626 3325 3944 1203 -2751 -4248 -1704 2439 4144 1965 -2039 -4210 -2465 1980
4359A980J896j050m020k651P61L746L387o49l467l388j86L510L379M74l312l371
$$ 1980 3876 2826 -1194 -3845 -3084 662 4049 3400 -67 -3455 -3641 -131 3248 3722 410 -2961
4375b961r47K789M116J190k578m267j316K006M031J821j482m065k271J773L469
$$ -2961 -3908 -1119 2997 4187 1609 -2658 -3974 -1968 2063 3884 2402 -1663 -3934 -2161 1308
4390A308K475j045l439k764M06L363L182j15l079l551m19L033L574O45k532l603
$$ 1308 3783 2738 -701 -3465 -3059 304 3486 3371 292 -3259 -3678 -645 2929 3574 1042 -2561
4406b561r38K092L832J402j796l756k077J669L742K150j307l475k556J008L337
$$ -2561 -3499 -1407 2425 3827 2031 -1725 -3802 -2133 1609 3759 2452 -1023 -3579 -2571 766
4421G66K637o02l180k838r1L258K957J81k685k848r62K281L652J067k232l583
$$ 766 3403 2801 -379 -3217 -3308 -50 2907 3088 403 -2445 -3407 -1126 2526 3593 1361 -2222
4437b222j211J747L538J690j601l455j860J149L370K062r42l047k317K16L346
$$ -2222 -3433 -1686 1852 3542 1941 -1514 -3374 -2225 1145 3207 2265 -782 -3099 -2883 463
4452D63K713p4l166k797j04K545L201K55k397l224q52K229L190J236j796l338
$$ 463 3176 3102 -64 -2861 -2965 -420 2781 3036 639 -2585 -3437 -1208 1982 3218 1422 -1916
4468a916j304J573L082J921j150l272k167R40L016K118k73k977k625L39K844K654
$$ -1916 -3220 -1647 1435 3356 2206 -1066 -3233 -2293 723 2841 2568 -409 -3034 -2695 149 2803
4484B803j39k302k774l96K139K931P67k071k952j122J860K908J438j543k922j607
$$ 2803 2664 362 -2412 -2808 -669 2262 3029 958 -1994 -3116 -1256 1652 3090 1547 -1375 -2982
4500b982J116K715K061o37k840k293O00K737K360m81k599k382k46K335K834M44
$$ -2982 -1866 849 2910 2273 -567 -2860 -2260 477 2837 2356 -243 -2625 -2871 -536 2298 2742
4516B742k056k956n26J791L002Q03j641k780j202J462L010J070j055k564j880
$$ 2742 686 -2270 -2796 -1005 1997 2800 1159 -1621 -2823 -1361 1649 2719 1664 -900 -2780
4531b780R90K496J862p05k443j857J43K380K414k10j971k682P8J784K266Q16j873
$$ -2780 -1790 706 2568 1863 -580 -2437 -2294 86 2500 2290 319 -2363 -2285 -501 1765 2581 708
4548G08k388q84J578K423R52q19k739j469J380K223J455q36k112j958N17K476
$$ 708 -1680 -2564 -986 1437 2389 1570 -1169 -2638 -1258 965 2420 1584 -528 -2486 -1969 507
4564E07J723k55k008k266K82J854K458M50k095k730p75K133K474O53j569k242
$$ 507 2230 1975 -33 -2299 -2017 -163 2295 2745 650 -2080 -2855 -722 1752 2405 836 -1406
4580a406j267J461K387J182r23k448j549R76K279J581p71j991j620K43J983K020
$$ -1406 -2673 -1212 1175 2357 1434 -1014 -2563 -1587 692 2273 1502 -489 -2109 -1866 117 2137
4596B137o4k035j826j53J374K470L14j977j566p91J004K445R46j213k205j094
$$ 2137 2073 38 -1788 -1941 -567 1903 2217 240 -1326 -2117 -1113 1332 2278 1065 -1140 -2234
4612b234J051J822J953q83k535j550Q73J888J764k78k212k006N79J872J782K61
$$ -2234 -1183 639 2592 1709 -826 -2376 -1503 385 2149 1871 -341 -2347 -1768 104 1886 2147
4628B147j811k205k59J826J855M30j432j978o38J467J688R08p99k086j158R50
$$ 2147 336 -1869 -2128 -302 1553 1983 551 -1427 -2065 -598 1090 1998 1199 -887 -2045 -1095
4644a095J862J021m31j850j381L70K057J441o27j151j531n14J568J872K05j631
$$ -1095 767 1788 1357 -493 -1874 -1504 553 1994 1367 216 -1315 -1829 -261 1611 1816 185
4660A85j386r26J373K134O60j127j850j123R67J853J385j015j925j301R19J670
$$ 185 -1201 -2127 -754 1380 2040 913 -937 -2060 -1093 760 2145 1130 -795 -2096 -1177 493
4676D93J549n09k255r88K57J546J493J05j897j278K28J341J055N74j214j870j07
$$ 493 2042 1533 -722 -1710 -1453 93 1586 1691 -206 -1484 -1256 85 1140 1714 500 -1370 -1477
4693a477J144J366N02r27j169j264P90J489J181m48j598j312O71J281R44M4j238
$$ -1477 -333 1033 1535 608 -561 -1825 -1035 454 1635 1187 -411 -1723 -1052 229 1173 1217 -21
4710b1j506j1J772J013K70j061j334r70J392J810K25j175j431o44J027J599N54
$$ -21 -1527 -1538 234 1247 1517 456 -878 -1848 -456 1354 1579 404 -1027 -1671 -644 955 1509
4727A509q78j248j058O19J931P00p16j538m43K32R39J363k97j540q88K84Q60J452
$$ 1509 631 -617 -1675 -1056 875 1575 859 -679 -1122 -890 49 1412 1115 -425 -1313 -1029 -169 1283
4745A283j97r18j080l86J004J061R25q50j527n40M98J273Q94n40j365j034N21
$$ 1283 1086 168 -912 -1298 -294 767 1692 842 -685 -1225 -727 546 1440 900 -465 -1499 -978
4762i78J099J023j29j430j252K18J497J141L8j145j431J77R39J403J82j018j309
$$ -978 121 1144 1015 -415 -1667 -1449 48 1189 1227 82 -1349 -1172 -233 1170 1352 334 -975
4779i75o34J348J187L01p77j020r24Q81J369M11m45j145r42M01J307R91n73r52
$$ -975 -1609 -261 926 1227 450 -570 -1494 -613 756 1167 722 -423 -1365 -964 343 1334 761 -191
4797a91o04m27J641P43q8j131q40k29P17J338J93p09j023o11N73J446N59r23j349
$$ -191 -795 -1222 419 1162 1074 -57 -897 -1126 -409 929 1122 413 -610 -1221 -648 798 1357 434 -915
4816i15l25O42R46R50m52j361n47L83R15P68Q1j392p83P8J301Q55k55j140j023
$$ -915 -1240 -598 348 1298 846 -515 -1062 -679 236 1004 1085 -307 -1090 -1012 289 1144 889 -251 -1274
4835a274K71J064O72M10q14j277j06Q87Q02K85n33q23q49N20J472K48l61r92m27
$$ -1274 -1003 61 733 1143 329 -948 -1054 -167 635 920 387 -436 -1285 -765 707 955 594 -398 -825
4854h25K6J067R71m59j032p37R7J015P56j84q62n95r5O99Q50K66p63q87k81K27
$$ -825 -799 268 1239 780 -252 -989 -892 123 879 695 -167 -762 -857 -158 692 958 195 -692 -973 -746
4874g46J458L32q45o59o91P36J069K52l49r17n44M37P15Q02l97p47p08k34R03
$$ -746 712 1044 199 -460 -1151 -415 654 906 557 -360 -904 -467 248 1050 653 -94 -802 -1036 -133
4893a33J117k99o89q93R7O87J088q4o67j149N4N27R07L0j92p23o65N01J088K46
$$ -133 984 685 -4 -897 -800 -113 975 891 224 -925 -871 -344 563 593 401 -322 -987 -486 602 848
4913H48k64r32o49M46R06O66m35q84o98J96R99M79q9p10o50J45O49P40n4r41n51
$$ 848 584 -348 -997 -551 355 1021 586 -298 -996 -800 199 678 589 -121 -771 -626 23 763 709 -232 -783
4934g83p9R00M96j06L9j116j93M81Q14Q79j067p18j91K43R19M04l08q14o13K35
$$ -783 -862 38 534 428 467 -649 -842 -361 453 1332 265 -453 -644 -401 518 922 614 -200 -813 -578
4954e78R36O09k07p85p87J85M68P93J68p49p21k25R85M58K00l00j260k6N77Q03
$$ -578 358 967 760 -25 -812 -627 -159 634 802 53 -668 -893 92 550 750 450 -810 -836 -259 544
4974E44L99l86j034j76K61O73N05k48q59m04J82O42Q59l01r46l75j91J085O29
$$ 544 943 557 -477 -653 -392 281 786 538 -321 -725 -543 99 958 657 -289 -664 -855 230 859
4993H59k94m62o14l92N17J216J06r83n15k43M19P98P28q13p77l24K51P77P04m45
$$ 859 565 103 -511 -903 -386 830 936 -47 -562 -805 -386 412 1140 327 -450 -774 -523 254 958 513
5013E13o05r84M72O80P72l23r13n52J35R59P81j91o47q19k65J060N38M1n92r66
$$ 513 -92 -1076 -604 76 848 525 -388 -940 -805 154 935 744 97 -722 -987 73 611 652 60 -906
5033i06n1Q40O05M86p34n63o39M56J097K58j22j116m76L6J029Q93n70l58q77k25
$$ -906 -957 -117 488 974 240 -323 -962 -506 591 849 727 -389 -865 -829 200 1093 523 165 -712 -937
5053i37J029Q25j71q24o87j99O65R15M42p54q82l53O10J026L40o72j044J10O02
$$ -937 92 917 746 -78 -765 -964 -299 616 1058 304 -578 -931 -321 705 1045 373 -671 -561 41
5072D1M26N68o25j029l79L90P68P00k55j141j36J8L61Q47M18p48j012J18P81M18
$$ 41 467 1035 410 -619 -998 -608 160 860 605 -536 -672 -654 -293 554 972 224 -788 -670 111 529
5092E29M06l94j320k32O44Q75M03l23j390m25R61O09O96l28p28j247M87J249M42
$$ 529 935 541 -779 -1011 -367 508 911 588 -802 -1227 -266 343 1039 711 -17 -1264 -777 472 914
5111I14l49p21p24k42J207J005n63n75m02l39O36R83R5r42m07n99N89J041L81
$$ 914 565 -156 -880 -1122 85 1090 527 -48 -450 -789 -153 830 925 -17 -424 -1023 -434 607 988
5130I88j013n93n7M9P94Q78n76j051j57L49L74J074k70j039m22r2K20J158M33
$$ 988 -25 -618 -675 -626 168 1046 470 -581 -738 -389 -15 1059 789 -250 -672 -764 -544 614 1047
5149A047q34j278M53M92Q64O04r97j163ML82J197J00k74j181o49N87J271J98j69
$$ 1047 213 -1065 -612 -120 744 1348 351 -812 -808 -426 771 871 597 -584 -1233 -646 625 823 654
5168F54p60j049O22J134L15l31m48j039j56J470N07n10j97p97n37O44J304l5n53
$$ 654 -106 -1155 -533 601 916 585 137 -902 -1058 412 919 409 212 -585 -1122 -478 826 791 238
5187B38m58n33J61J412L53p53n28n53o8Q62J344r13r40l53l24R54J293P7j371
$$ 238 -220 -753 -592 820 1173 420 -108 -661 -729 133 1477 564 -376 -729 -1053 -99 1194 1271 -100
5206a00q24j34P28J110O28j343j026p2O07R07R66j133j372j50P45R72P46k75j520
$$ -100 -924 -1058 -330 780 1408 65 -961 -1033 -426 481 1447 314 -1058 -1208 -463 509 1255 980 -540
5225e40p69O52J074K72J95j124j032M73J108M75K88m85j671m89J552P12j79J39
$$ -540 -1309 -657 417 689 884 -240 -1272 -799 309 784 1072 587 -1084 -1573 -21 691 512 651
5243F51j293q47J221J061K87m75r68j110J12K206L17m06q12j372K97J133J431
$$ 651 -642 -1489 -268 793 1080 605 -363 -1473 -1361 845 1162 756 -56 -1428 -1131 2 1433
5260A433p17p71r69j38Q71J682l27j140p50k62O12J547L80j458j110J6N22J071
$$ 1433 716 -55 -1024 -1162 -291 1391 1064 -76 -826 -1088 -476 1071 1451 -7 -1117 -1101 -579 492
5278D92Q66q04j455j55P47M27J148k46j546p38P80O36R48J77j118j432L53Q78
$$ 492 1358 554 -901 -1056 -309 118 1266 1020 -526 -1264 -484 152 1100 1277 159 -1273 -920 -42
5296d2Q48K83l64j836j59P32J303N04n32j481j288J331J236L36N9j276j028M14
$$ -42 806 1089 725 -1111 -1270 -538 765 1269 737 -744 -2032 -701 535 871 930 -346 -1374 -960
5314i60J668Q06n96r28j011l54J480J359n52o90j192l33J129J490J35j324r98
$$ -960 708 1514 918 -10 -1021 -1375 105 1464 912 222 -970 -1303 -174 1316 1451 127 -871
5331h71k75K67J604P02p37j293m82J27J466R15k94j576q81M90O88J437oj462j128
$$ -871 -1146 -879 725 1427 690 -603 -1085 -958 508 1423 1129 -447 -1328 -838 -150 1287 1281 -181 -1309
5350a309L4J255J126N82j246j737j10J048J196R00j086j527n30R31J144Q10m89
$$ -1309 -1275 -20 1106 1688 442 -1295 -1405 -357 839 1739 653 -874 -1404 -473 671 1481 992
5367I92j610q42M29J467Q90k88j437j043J53J479R98K8j100j094l40J164J041
$$ 992 -618 -1460 -1031 436 1326 1038 -399 -1442 -1289 190 1188 1216 116 -978 -1318 -154 887
5384H87M50p81j524n33Q85J324O90p98j257p99N41J427J151q25j410p88R2J471
$$ 887 1337 556 -968 -1501 -616 708 1398 600 -657 -1456 -915 512 1663 838 -572 -1360 -1268 203
5402B03J068k0j217j484K30J417J099M45j632j226k27O27J672N69j072j495p04
$$ 203 1271 1251 34 -1450 -1220 197 1296 1741 109 -1117 -1344 -717 955 1524 452 -1043 -1747
5419a747R33J314O17P0j708r55M37J262J256j67j377j137l2J324J323j97r60j467
$$ -1747 -814 500 1117 1187 -521 -1476 -1039 223 1479 1312 -65 -1202 -1234 90 1413 1216 256 -1211
5437a211m03J202J495M79r81j333r07J095J409P34n43j642q69O16J486R37n43
$$ -1211 -1614 -412 1083 1562 581 -752 -1659 -564 845 1579 1036 -606 -1475 -859 627 1564 1021
5454A021j575q71J24J392J560l32j333j060n30J284J618K45j112j723n6J030J253
$$ 1021 -554 -1425 -1301 91 1651 1319 -14 -1074 -1604 -320 1298 1543 431 -1292 -1348 -318 935
5471I35N46j009j283p76P18J432R47o73j323r78N39J011J335k58j297j126K62
$$ 935 1481 472 -811 -1587 -869 563 1510 837 -486 -1464 -925 86 1421 1163 -134 -1260 -998
5488i98J044R56N00j300j395k76J039J615O01j393j146q44R02J350J146r30j597
$$ -998 46 1002 1502 202 -1193 -1469 -430 1185 1786 393 -753 -1597 -695 655 1801 871 -726
5505g26p54L44J564J026l67j543q67L21J401R93l63j237j015j62J212J331J78
$$ -726 -1480 -1136 428 1454 1087 -456 -1323 -1002 399 1392 1029 -208 -1223 -1385 -173 1158 1336
5522A336j015j295m29Q15J475L82n52j770n48O22J614R41k66j467j270J42J381
$$ 1336 321 -974 -1403 -588 887 1269 717 -1053 -1601 -979 635 1576 1310 -157 -1427 -1285 96
5539I6J369l25j442j041j02J213J755m31r31j358k66R58J499P73j358j438m50
$$ 96 1465 1140 -302 -1343 -1445 -232 1523 1092 161 -1197 -1463 -505 994 1767 409 -1029 -1479
5556a479L96J686R91o81j631r91P64J420R67j43j645j314O06R38J221M96j514
$$ -1479 -1083 603 1594 913 -718 -1709 -945 475 1442 1299 -346 -1660 -1054 -116 1105 1601 87
5573H7j363M0J041J133P77j073j668o84J242J390M34nk013j226R71J788M26o7
$$ 87 -1276 -1236 -195 938 1715 642 -1026 -1710 -468 922 1356 1351 -662 -1888 -917 871 1297 1230
5591A230j341j914Q24J761Q99l62q64j608p72K408J334m22p85j316p94J155J798
$$ 1230 -111 -2025 -1201 560 1459 1097 233 -1375 -2147 261 1595 1173 388 -928 -1722 -567 1231
5608A231J69q86j193r43N13K178N53q13j508m58j88J651J296l64j485o44O0M96
$$ 1231 1400 514 -679 -1622 -1109 1069 1622 809 -699 -1157 -1345 306 1602 1238 -247 -891 -831 -335
5626c35J871K75j706j014m59N35J658J074j074j917m00J036P68J399l47k103j135
$$ -335 1536 1811 105 -909 -1368 -833 825 1899 825 -1092 -1492 -456 312 1711 1364 -739 -1874
5643a874J074J082J270j5j895j433P47J233P54N57j385j652L04J304O18M47l85
$$ -1874 -800 282 1552 1537 -358 -1791 -1044 189 943 1500 115 -1537 -1233 71 689 1136 751
5660G51j882n63J491Q67M63l68j104j468J035J882ql76n71j472l12K086P08j6
$$ 751 -1131 -1694 -203 664 1127 759 -345 -1813 -778 1104 1096 720 149 -1323 -1635 451 1159 1143
5678A143r92j324o82J378J902j40r11q91j278N71K366Q91j575j006r89J73K303
$$ 1143 151 -1173 -1855 -477 1425 1285 374 -517 -1795 -1224 1142 2033 458 -548 -1537 -1364 939
5695I39J454j407k023k75Q8J460J854o88k171p19M74N82J854K74j968j383O45
$$ 939 2393 986 -1037 -1312 -1224 236 2090 1402 -769 -1488 -1014 -432 1422 1696 -272 -1655 -1010
5712a010R87O36J088j127j960k95J269O36J106n8k077q29J034R67N92O07j550
$$ -1010 -23 613 1701 574 -1386 -1681 -412 224 1330 1272 -805 -1634 -600 367 959 1566 16
5729A6j919O20J499Q57M64r71k190m61K124J332M0n25j932j052J620K013k44o32
$$ 16 -1903 -1283 216 1073 1537 566 -1624 -2085 39 1371 1411 886 -1046 -2098 -478 1535 1291 659
5747F59j414j304R21K473K16j006q92j244M2K179J208j202j186m28j14Q15K007
$$ 659 -755 -2059 -1138 1335 1551 545 -347 -1591 -1549 630 1838 636 -550 -978 -1092 -277 1730
5764A730m74j313p55m14M70J966O84j727j203J8k57J452J935q69k010o76L02R91
$$ 1730 1256 -57 -812 -1226 -756 1210 1894 167 -1036 -1018 -1275 177 2112 1243 -767 -1443 -1141 -150
5782a50J938K9k157j376N14R11J600N04j507k152K19J387J385Q30j154k089q21
$$ -150 1788 1817 -340 -1716 -1202 -291 1309 1813 306 -1846 -1627 -240 1145 1975 821 -1268 -2089
5799b089J638J431Q15o14k281r18J276J603L76j14j315j530K50K224M78k18o75
$$ -2089 -451 980 1795 1181 -1100 -2018 -742 861 1237 1123 -192 -1722 -1472 752 1230 1012 337
5816C37j740m49K132J141j01o34j223r63N57K234n8p30j251r76N00K315O36q04
$$ 337 -1403 -1852 280 1421 1320 686 -537 -1500 -943 1291 1233 503 -748 -1724 -1224 1091 1727 923
5834I23j379j083p4K094J607p98j657j256j15J398K241k25j697j297K9O72J714
$$ 923 -456 -1539 -1613 481 2088 1290 -367 -1623 -1738 -340 1901 1676 -21 -1318 -1289 -617 1097
5851A097Q35j211k316n8R67J436R66n80j992r42R00J382J109l1j899j540P17J004
$$ 1097 1932 721 -1595 -1653 -686 750 1716 1136 -856 -1798 -898 484 1593 1562 -337 -1877 -1160 -156
5869a56J133O13j619j240l88J360J443K50o75j903n99J302J448N38l98j662j290
$$ -156 977 1590 -29 -1269 -1657 -297 1146 1396 721 -1182 -1781 -479 969 1507 1109 -553 -1843
5886a843P20K067O49n65j397j262P5J991J105m75j040j268n81K069J188l1j289
$$ -1843 -1123 944 1593 1028 -369 -1631 -1556 435 1540 1065 25 -1243 -1824 245 1433 1402 113
5903A13j464l69J091J980K56j019j594p83Q42J826Q09o31j890n64J53J249J739
$$ 113 -1351 -1720 -629 1351 1607 588 -1006 -1789 -947 879 1688 1057 -833 -1397 -1244 5 1744
5920A744l87j599j327K46J084J540N08j623j639j18J184J454Q61j453j710m65
$$ 1744 1357 -242 -1569 -1323 -239 1301 1809 186 -1453 -1571 -387 1067 1928 475 -1235 -1700
5936a700J096J570O77o66j766j036Q90J411J121k07j941j210O24J421J348m13
$$ -1700 -604 966 1643 977 -789 -1825 -935 476 1597 1390 -551 -1761 -1137 284 1632 1219
5952A219j185j580k11J664J461K87j326j442p87J548J620M22p98j699j020Q73
$$ 1219 34 -1546 -1757 -93 1368 1655 329 -1113 -1900 -352 1268 1690 892 -807 -1827 -954
5968i54J726J178q78j664j073K13J777J617o55j346j385O9J282J671J24j528j436
$$ -954 772 1950 1072 -592 -1665 -1452 325 1942 1287 -59 -1444 -1375 -93 1578 1702 174 -1262
5985a262k20J022J806P49j547j470o32M85J920Q76p56j615j055M89J763J195m83
$$ -1262 -1482 -460 1346 2095 548 -922 -1554 -1069 851 1727 971 -644 -1699 -1210 553 1748 1265
6002A265j694j109J84J438J420P2j372j666l55J651J277N61j273j477o35J110
$$ 1265 -429 -1538 -1354 84 1504 1576 204 -1462 -1817 -166 1111 1672 399 -1078 -1713 -603
6018f03J609J006q59k030j085P57J803J176k56j773j672Q4K125J461l77j461j281
$$ -603 1006 2012 1153 -877 -1962 -1205 598 1774 1518 -255 -1927 -1843 282 1743 1366 -95 -1376
6035a376n62J846J589K63j495j425q28J430J770N06j015j580q42N63K006R93n10
$$ -1376 -1938 -92 1497 1760 265 -1160 -1988 -558 1212 1718 703 -877 -1719 -1156 850 1843 1333
6052A333j671j352L84J445J877o51j372j501j63J459J929L42j641j996k40J058
$$ 1333 -338 -1690 -1306 139 2016 1365 -7 -1508 -1671 -212 1717 2059 418 -1578 -1818 -760
6068g60K152O61j338j726j081J099J659J579r36k433q50Q41J471J609k37k186
$$ -760 1392 2053 715 -1011 -2092 -993 666 2245 1309 -1124 -1974 -1133 338 1947 1710 -476
6084d76j442M98J490J454L13j659j935j36J514J740K78q68j956n84J210J609O62
$$ -476 -1918 -1420 70 1524 1837 178 -1757 -1893 -379 1361 1639 771 -1185 -1769 -559 1050 1712
6101A712o16j438j596N66K230P15k03j481j838K28K035J502j69j305j690r59J995
$$ 1712 1096 -342 -1938 -1372 858 1573 1370 -111 -1949 -1721 314 1816 1647 342 -1348 -2307 -312
6118c12K195Lj454j485j160J338K614O87j730j839p92O80J954J590r94k305m85
$$ -312 1883 1886 432 -1053 -2213 -875 1739 2426 696 -1143 -1935 -1255 699 2289 1295 -1010 -1495
6135a495j00J776K313p78k473p83K87J033J732N98k113j760K76R19J651J016j059
$$ -1495 -1595 181 2494 1716 -757 -1540 -1253 -220 1512 2110 -3 -1763 -1487 -568 1083 2099 1040
6152A040k471k14R40J057J548j76k397j372R97J573R60O10k322k077P00J765J193
$$ 1040 -1431 -1645 -705 352 1900 1724 -673 -2045 -1048 525 1485 2095 -227 -2304 -1604 161 1354
6169A354N55j076k812l61K366J770k6q90k354j354K162K340M17j558j202j968
$$ 1354 1909 833 -1979 -2340 26 1796 1770 880 -1474 -2828 -666 1674 2091 533 -669 -2637
6185b637J248K712J077j407j412j382j07K348J715j245j240r61n46J292K433j96
$$ -2637 -1389 1323 2400 993 -419 -1801 -1908 440 2155 910 -330 -1291 -1837 -545 1888 1692
6201A692j931n89q42N22K505R15j675j538p53L58J828K068j121k527o88N37J124
$$ 1692 -239 -828 -1670 -1148 1357 2272 597 -941 -1694 -1336 492 2560 1439 -1088 -1776 -1239 -115
6218a15K215n2k802j415Q81P63K315Q49k453k598P79J499J363J056j267l025l99
$$ -115 2100 2048 -754 -2169 -1288 -525 1790 2639 186 -2412 -1633 -134 1229 2285 1018 -2007 -2406
6235b406K069J437O65j27k813j433J877J749M34qj318k414M47K510R38k14j222
$$ -2406 -337 1100 1765 1638 -1175 -2608 -731 1018 1452 1444 126 -2288 -1841 669 1607 1393 171
6252A71j840n52J899J956j55p09j773j473J361K614L34j104j210j744L19K942
$$ 171 -1669 -2221 -322 1634 1479 770 -1003 -2476 -1115 1499 1833 729 -481 -2225 -1906 1036
6268A036J373j188j671j178n50K421K453q19k397j164l03J449K688M80k880j463
$$ 1036 2409 1221 -450 -1628 -2178 243 2696 1877 -520 -1684 -1987 -538 2150 2630 -250 -1713
6284a713j67Q70K569J092j974k300k42J062J653J391q47k261j164J409J003J411
$$ -1713 -1880 -1010 1559 2651 677 -1623 -1865 -803 850 2241 1394 -867 -2031 -622 381 1792
6300A792L49k442j826P36J304J683L67j516k426p8J861J432P32q08k487j407K069
$$ 1792 2141 -301 -2127 -1391 -87 1596 1963 447 -1979 -2057 -196 1236 1968 1160 -1327 -2734 -665
6317f65J944O91n09k260j836J292K721Q19o45j680k098O7K962J507r03j318j742
$$ -665 1279 1970 1461 -799 -2635 -1343 1378 2197 1552 -128 -2226 -2159 803 2310 1407 89 -1653
6334a653o35K077K434n56j642j158p56J103K325P41j857j513n03K26K324J484
$$ -1653 -2288 -211 2223 1667 25 -1133 -1889 -786 1539 2280 423 -1090 -1593 -1367 957 2441
6350B441j519j845r20M04J820J792q03j728j409M71R65K028N52k224j698p8J281
$$ 2441 922 -923 -1843 -1439 381 2173 1370 -358 -1767 -1296 -331 1697 2249 25 -1673 -1751 -470
6367d70J656J206j464k446o06J560J666J030p91k437j425J283K036J037j91k087
$$ -470 1186 2392 928 -1518 -2124 -564 1102 2132 1341 -1096 -2521 -1238 798 1835 1644 -443
6383d43j785O48K108J353l66j476k017K07J952J519K25j403k045p08J632K111
$$ -443 -2228 -1580 528 1881 1515 39 -1978 -1771 181 1700 1925 522 -1523 -2231 -599 1512
6399A512L72j078j429j680J123K101J129p40j830j732L83K349J781p97j778j638
$$ 1512 1884 806 -623 -2303 -1180 921 2050 1310 -520 -2252 -1869 480 2261 1464 -314 -1952
6415a952kJ707K297L01k238j565q12J694K106J034k018k125p21J217K243J367
$$ -1952 -1954 -247 2050 2351 113 -1452 -2264 -570 1536 2570 552 -1573 -2294 -1077 1166 2533
6431B533j144k539r80O30K018J430K03k709j659M54J929J867j7j814k201J1J695
$$ 2533 1389 -1150 -2130 -1500 518 1948 2151 -558 -2217 -1763 166 2033 2016 202 -1999 -1988 -293
6448b93K029M22j415k576m54J573K109R56j152k270j371J365K042J166n85k173
$$ -293 1736 2158 743 -1833 -2287 -714 1395 2351 1199 -1071 -2442 -1077 965 2131 1546 -627
6464f27j623M54K540J346n62j514j870jJ677K180q1j470k275n07J440K342O05
$$ -627 -2250 -1796 744 2090 1528 14 -1856 -1857 -180 2000 1919 449 -1826 -2333 -893 1449 2054
6481B054j180j756j541J202K272J183j016k143j632R90K032J886n83k004j984
$$ 2054 874 -882 -2423 -1221 1051 2234 1218 -925 -2557 -1567 465 2351 1768 -236 -2220
6496b220K63K031J785N44k375j683l42J557K168O19j889k154m71J324K095Q73
$$ -2220 -1957 74 1859 2403 28 -1655 -1997 -440 1728 2347 458 -1696 -2167 -843 1252 2125
6512B125j023k351j096J111K236J309q16j895j998N92K000J847q6j981j804k41
$$ 2125 1102 -1249 -2345 -1234 1002 2311 1495 -400 -2398 -1806 194 2041 1955 -26 -1830 -2071
6528b071K047J848M25j771k219n57J662J871J132j489k129r86R17K404J060m63
$$ -2071 -24 1824 2249 478 -1741 -2298 -636 1235 2367 878 -1251 -2237 -1320 1084 2144 1681
6544A681k228j905R20K332J428m90j931j982K44J801K311M3k064j898n33J537
$$ 1681 -547 -2452 -1532 800 2228 1738 -193 -2175 -1931 -130 2181 2224 160 -1738 -2271 -734
6560g34K388O83j693k236o14J243K468Q53j334k252p84N98K025J799q45k250j481
$$ -734 1654 2337 644 -1592 -2206 -963 1505 2358 1024 -1228 -2012 -1414 611 2410 1565 -685 -2166
6577b166N93J838J454L72k274j910J44J925J687N20j727j921o40J540J780J257
$$ -2166 -1573 265 1719 2091 -183 -2093 -1949 -24 1663 2183 456 -1465 -2105 -565 1215 2472
6593B472j494k548q08J426K000J271o65k342j943J169K367R40m2k035j800k57
$$ 2472 978 -1570 -2378 -952 1048 2319 1654 -688 -2631 -1462 905 1845 1803 -232 -2032 -2289
6609b289K479J787o1j598k230m14K010K416J03j808j693j276J375K596R96j380
$$ -2289 190 1977 1916 318 -1912 -2326 -316 2100 2203 395 -1298 -2574 -1199 1397 2393 1013
6625A013j924j245M75K657J583j254j727j402j51K036K060j70k195j416j46J088
$$ 1013 -911 -2156 -1681 976 2559 1305 -422 -1824 -1975 61 2121 1951 -244 -1660 -1806 -718
6641g18K459P43j808k339n14J236K301J444j790k680p45J160K042J828q59k959
$$ -718 1741 2484 676 -1663 -2177 -941 1360 2804 1014 -1666 -2411 -1251 791 2619 1760 -1199
6657a199j378J118J964J793k13k220k667J056K438J256N29k010k553l35K586J392
$$ -1199 -2577 -1459 505 2298 2085 -135 -2802 -1746 692 1948 2477 467 -2086 -2421 165 1557
6673A557O73j331k490j321K242K114P61p08k233j822R76K688R08p16j385k196
$$ 1557 2230 899 -1591 -2912 -670 1444 2205 1497 -736 -2558 -1582 1106 2014 1298 -87 -2283
6689b283q4K772J962j072j110j918j000K125K854J41j903j579j478J377K928J229
$$ -2283 -2367 405 2367 1295 185 -1733 -2733 -608 2246 2387 484 -1095 -2573 -1196 1732 2961
6705B961k472j835q63L78K875J890j309l048p78N80K184K077m47k984j507L75
$$ 2961 489 -1346 -2209 -1831 1044 2934 1625 -1423 -2201 -1621 563 2640 2193 -791 -2298 -1923
6721a923J756J978P88k909j878L15J797J588Q22j564k733k39J555J672J196p61
$$ -1923 -167 1811 2599 -310 -2188 -1873 -76 1512 2334 770 -1963 -2202 -647 1025 2221 1460
6737A460k649j225J316J810J315lk031k588N84K351J499Mj223k816m54K306K083
$$ 1460 -1189 -2414 -1098 712 2027 2024 -7 -2595 -2011 340 1839 1843 620 -2196 -2650 -344 1739
6754A739K47j072k488j159K008K783J42j332j756j808J022L148Q42j397j425j366
$$ 1739 1986 914 -1574 -2733 -725 2058 2200 868 -888 -2696 -1674 1474 2316 919 -506 -1872
6770a872j29K498K242j410j766j518j7J652K581k39k261j316m98J295K103J356
$$ -1872 -2001 497 2739 1329 -437 -1955 -1972 -320 2261 2022 -239 -1555 -2053 -758 1345 2701
6786B701k133k101k70O45K123J621j224k434r66N96J434K187j48k795j582M88
$$ 2701 568 -1533 -1803 -1158 965 2586 1362 -1072 -2038 -1442 -8 2179 2031 -764 -2346 -1858
6802a858J746J828O57k138k566J40K158J806N18j400l050l27K064J947O87q21
$$ -1858 -112 1716 2373 235 -2331 -2191 -33 1773 2291 891 -2159 -2486 -422 1525 2212 1391
6818A391k746j347J874K301O90o34k166j820M82K812J517q62j600j960k86K606
$$ 1391 -1355 -2702 -828 1473 2163 1529 -637 -2457 -1975 837 2354 1492 -108 -2068 -2354 252
6834B52J820k28j600j773r38J695K605K98j699j419j290J086K600J134j333k021
$$ 252 2072 1844 244 -1529 -2467 -772 1833 2131 432 -987 -2277 -1191 1409 2543 1210 -811
6850h11j376M77K295K012l59k847j462J98J703K466Mk801j671K12J415K611N32
$$ -811 -2187 -1710 585 2597 2238 -609 -2071 -1873 -170 2296 2300 -501 -2172 -1960 -545 2066 2598
6867B598k041k628j17J326J968J522j358k866q20J440J814J551p55k253j976R41
$$ 2598 557 -2071 -2188 -862 1106 2628 1270 -1596 -2416 -976 838 2389 1634 -619 -2595 -1654
6883a654K180J366r6j959j989K71K037J499K66j501j964q54J736K344N32j334
$$ -1654 526 1892 1796 -163 -2152 -1881 156 1655 1921 420 -1544 -2398 -662 1682 2214 880
6899H80k097j185J141K715Q88r55k202j636P24K559J480o40k047j682O6K037K346
$$ 880 -1217 -2402 -1261 1454 2342 1387 -815 -2451 -1727 832 2312 1672 -375 -2057 -1991 46 2392
6916B392j88k059k065LJ592J900P75j877j813r23J351K285J269j757k233p82Q70
$$ 2392 2204 145 -1920 -1917 -325 1575 2350 473 -1340 -2263 -912 1373 2642 885 -1348 -2130 -1260
6933a260K296J246p42k451r18L27J697J973p6k114k031Q6K027J683L06j598k203
$$ -1260 1036 2282 1540 -911 -1829 -1502 195 2168 2092 -22 -2053 -1967 60 1743 2049 451 -1752
6950a752o36J768K004P49j123k136j062J334J980J226r22j976j975P05K301J508
$$ -1752 -2388 -620 1384 2133 1010 -1126 -2188 -854 1126 2352 1430 -546 -2521 -1816 485 1993
6966A993k01k033j669j0K023K073k72j945j800k54J664K043M77j626j760p25J224
$$ 1993 1792 -241 -1910 -1920 103 2176 1904 -41 -1841 -2095 -431 1612 2089 463 -1297 -2022 -798
6983g98K034J093j396k009j064P40K206J436q38j922j476M88J566J906j84j992
$$ -798 1236 2329 933 -1076 -2140 -1400 806 2242 1404 -518 -1994 -1506 60 1966 1782 -210
6999b10j900M6J767K209M00k042j955m78J384K336Q79j387k616n86J213J816J537
$$ -210 -2110 -2064 -297 1912 2312 270 -1685 -2163 -779 1557 2436 1049 -1567 -2153 -940 876 2413
7016B413j033k210j422Q98K070J403o03k024j603J81K227J964l24j742j986l63
$$ 2413 1380 -830 -2252 -1354 716 2119 1516 -508 -2111 -1930 297 2261 1937 195 -1791 -2154
7032b154J933J915L84j434k296m51J380K067J086j532k064j252J252K179J228
$$ -2154 -221 1694 2078 644 -1652 -2103 -723 1344 2430 898 -1166 -2418 -1166 1013 2241
7047B241r24k007j738R12K193J329m19j873j640K1J715K123K05j909j820n65J446
$$ 2241 1317 -690 -2428 -1516 677 2006 1587 -286 -1926 -1905 -190 1933 2138 229 -1591 -2156 -710
7064g10K538M93j650k024r09J161K143J082o36k649r05N51K288J628o36k356j500
$$ -710 1828 2321 671 -1353 -2262 -1101 1042 2124 1488 -1161 -2066 -1515 773 2401 1765 -591 -2091
7081b091L98J803J939j72j779k199J50J577K020L68j311k467m52J585K049P34
$$ -2091 -1693 110 2049 1877 98 -2101 -1951 -374 1646 2014 703 -1764 -2216 -631 1418 2152
7097B152r90k131j401J451J968J330q65k268j633Q43J998J301j31j868j598k40
$$ 2152 1162 -969 -2370 -919 1049 2379 1514 -754 -2387 -1544 454 1755 1624 -244 -1842 -2082
7113b082K225J731R5j653j934l89J588J949N98j457j638j236J166K175J096j043
$$ -2082 143 1874 1969 316 -1618 -2007 -419 1530 2128 671 -967 -2203 -1037 1138 2234 1191
7129A191k047j035M73K133J549m34k189j347k29J968K148%k249j644j61J334K359
$$ 1191 -856 -1891 -1418 715 2264 1830 -359 -1706 -1935 33 2181 2181 -68 -1712 -1873 -539 1820
7146A820L22j572k313j0R39K046J186j077k889n27R61J817J235l87k327j288P75
$$ 1820 2142 570 -1743 -1753 -814 1232 2418 1341 -1548 -2075 -1114 703 1938 1551 -776 -2064 -1289
7163a289J757J380j90j791j836L68J485J602M09j424k013o10J667J864O40j260
$$ -1289 468 1848 1658 -133 -1969 -1601 -116 1486 1895 471 -1542 -2152 -485 1379 2019 759
7179G59j944j255J542K006R82q14k004j425N45K487J431o92j836j617J03K160
$$ 759 -1185 -2440 -898 1108 2090 1276 -728 -2153 -1608 879 2310 1618 -218 -1835 -1732 428
7195D28J443k13j623j566m54J454K184L51j878j315q46J106K201Q16j374j849
$$ 428 1871 1658 35 -1531 -1985 -531 1653 2004 126 -1189 -2035 -929 1272 2088 714 -1135
7211a135q66Q08J980J468j104j926r67L21J637J849l39k062j452J83J423J687
$$ -1135 -2001 -1193 787 2255 1151 -775 -1742 -1421 216 2065 1726 -336 -1788 -1605 -182 1505
7227A505M29j457k108j84J172J766J037j072k272j257J436K035J199p90k542j334
$$ 1505 1934 477 -1631 -1815 -643 1123 2160 1088 -1184 -2441 -1005 1030 2229 1439 -1103 -2437
7243b437J018K293J218k50k430j653O00K138J507n29j618j770k54K033J892K8
$$ -2437 -1419 874 2092 1842 -588 -2241 -1641 497 2004 1475 -143 -1913 -2167 -134 1758 1786
7259A786j191j855q43J421K035N12j167j592j158P83K113R96p49j420j529J33
$$ 1786 595 -1260 -2103 -682 1353 1865 698 -894 -2052 -1269 844 1840 1091 -329 -1858 -1725
7275a725J886J932o31j454j657j24J397K178L87k102j521l65R90K272P83j585
$$ -1725 161 2093 1462 8 -1649 -1773 -376 1802 2189 87 -1434 -1799 -809 1463 2246 661
7291F61k062l32N98K029J286q10k499j155J050J831J309m00k136j660Q95J698
$$ 661 -1401 -1733 -1135 894 2180 1370 -1129 -2284 -1234 597 1906 1506 -630 -2290 -1395 303
7307C03J146L61j993j553J45J415J516N46j269k220j14J252J594M97p06j737j347
$$ 303 1449 1810 -183 -1736 -1591 -176 1340 1886 617 -1603 -1717 -465 1129 1626 920 -817 -2164
7324b164Q91K251N88k74j646j423L11J887J183j09j353j740m71J830J993r8j438
$$ -2164 -1273 978 1566 1292 -354 -1777 -1466 421 1604 1495 142 -1598 -2069 -239 1754 1656 218
7341B18j619o00J327K149O36j334j736r62Q38K193J035j253j744q91M48K028J281
$$ 218 -1401 -2001 -674 1475 2111 777 -959 -1921 -1083 1110 2145 892 -852 -1743 -1295 733 2014
7358B014o89j941j131L36J607J436R3j813j502j89J407J835K92j237k021l47J328
$$ 2014 1325 -616 -1747 -1411 196 1632 1725 -88 -1590 -1779 -372 1463 1755 518 -1503 -1850 -522
7375e22J360J139q51k228r30J009J597J385m88k244j020N90J530J321q6j539j838
$$ -522 838 1977 1126 -1102 -2032 -1023 574 1959 1471 -773 -1793 -1203 327 1648 1562 23 -1815
7392a815K01J328J891J22j127k000p19J820J626M42j280j657q77J216J973J058
$$ -1815 -1614 -286 1605 1727 600 -1400 -2119 -299 1327 1769 489 -1168 -2045 -829 1144 2202
7408B202j317j538j183P58J955R23m73j791j177L12J676J379k22j704j033n54
$$ 2202 885 -653 -1836 -1078 877 1800 1327 -464 -1641 -1329 347 1726 1504 -200 -1233 -1787
7424a787J388J960P6j262j598n45R67J811R34j274j764p35P51J968R20n46j884
$$ -1787 -399 1561 1637 375 -1223 -1768 -801 1010 1944 670 -1094 -1829 -1078 890 1810 1264 -620
7441f20j269O53J402K012m25k074j582M70J508J328L12j725j401n13J449J884
$$ -620 -1889 -1236 166 2178 1753 -321 -1903 -1433 75 1403 1715 -10 -1411 -1924 -475 1409
7457A409K16r84j705p55J317J421R95p93j979o09M39J464J275o60j245j592O27
$$ 1409 1625 641 -1064 -1819 -502 919 1914 1121 -858 -1467 -1028 436 1711 1051 -194 -1786 -1159
7474a159J262J334k04j288j271m46J605J530M42j592j231q58J400J643L31p05
$$ -1159 103 1437 1233 -55 -1326 -1772 -167 1363 1805 213 -1018 -1876 -476 1167 1498 793
7490G93j871p81J003J834Q25n35j785j210K43J979J077j00j515j612J10J600J462
$$ 793 -1078 -1859 -856 978 1803 1268 -517 -1727 -1484 495 1572 1472 -43 -1655 -1545 55 1517
7507A517K63j498j641O4R20J461N13j260j546o64J244J434J112q16j775j043L86
$$ 1517 1780 282 -1359 -1295 -375 1086 1599 339 -1207 -1871 -627 807 1919 1103 -672 -1715 -1329
7524a329J844J035l81j567j216OJ721J317J62j369j850OJ414J821k28q98j764
$$ -1329 515 1550 1169 -398 -1614 -1608 113 1430 1592 223 -1627 -1621 -207 1614 1386 488 -1276
7541a276r5Q35J547Q13j104j721r14R90J620J269r50j453j363M37J722J349n76
$$ -1276 -1371 -536 1011 1824 720 -1001 -1915 -925 695 1964 1014 -439 -1802 -1365 357 1706 1130
7558A130j395j034m22J806J345O3j204j373o77J399J344Q00j267j504m84P73J735
$$ 1130 -265 -1299 -1721 85 1430 1493 289 -1084 -1761 -362 982 1782 515 -989 -1473 -700 1035
7575A035N98n38k036n70M95J607J048m26j605j303N20J293J298Q1j504j680K24
$$ 1035 1633 1095 -941 -1511 -1016 591 1639 1213 -392 -1695 -1175 118 1416 1497 -7 -1687 -1463
7592a463J328J476M10j100j799o21J312J453Q66j197j419r55J015J227J182o05
$$ -1463 -135 1341 1751 651 -1148 -1769 -457 996 1862 665 -754 -1709 -694 533 1715 1110
7608A110j799q46M33J491J106j69j429j316m5J330J453J44j209j560m53J452J277
$$ 1110 -689 -1535 -1102 389 1495 1326 -103 -1419 -1464 -134 1319 1463 254 -1306 -1759 -307 970
7625I70O28j203j453m74Q49J848N42j179j253q63P01J699Q75n21j961m87Q8J498
$$ 970 1598 395 -1058 -1532 -683 1165 1707 528 -725 -1588 -887 812 1687 1166 -795 -1282 -1194 304
7643C04J120R8j995p38j16J005J742L4r64j715j71Q16J478O25p57j900n09R82
$$ 304 1424 1522 -473 -1211 -1327 -322 1420 1454 490 -1225 -1396 -580 898 1523 766 -1134 -1643 -661
7661f61J217J162p69j700n70L95J488R19l05j255j460K40J305J398q4j219j329
$$ -661 556 1718 949 -751 -1321 -926 562 1481 1176 -79 -1539 -1299 6 1404 1320 101 -1228
7678a228k10J338J531j04q98j437p53J407J151P94r61j213q43M46J760O51p39
$$ -1228 -1438 -100 1431 1327 429 -1008 -1761 -354 797 1591 630 -583 -1426 -980 780 1431 692
7695F92j159q08J26J250J346j43j283r83m93J473J121K00r67j242l33Q20J254
$$ 692 -467 -1275 -1149 101 1447 1304 21 -962 -1455 18 1139 1339 372 -870 -1203 -383 871
7712H71O89j065j386l75L55J565R75m32j655r75M11J390J042L5j800j182N19J149
$$ 871 1560 495 -891 -1266 -911 654 1629 1197 -458 -1433 -1022 368 1410 1445 -355 -1537 -1018 131
7730A31J262J06j447j461J48J155J214L35j139j363m03J160J181N71p81j498o48
$$ 131 1393 1499 52 -1409 -1261 -106 1108 1443 304 -1059 -1462 -302 879 1450 669 -829 -1477
7747a477N86J246O63j59j075j266Q33J402O78l99q96j356Q5J048J284J19j089
$$ -1477 -891 355 1018 859 -216 -1482 -649 753 1431 1032 136 -1220 -1135 -87 1197 1316 227
7764B27j289m59J379Q90O33r18j184q61P43J702P85j055j421o28L57J801Q05p98
$$ 227 -1062 -1521 -142 748 1381 463 -721 -1582 -839 863 1648 593 -828 -1456 -1099 702 1507 709
7782G09r86r29J04J254J115j07j168j020p4Q78J455mj128j031k26R08J023O44
$$ 709 -277 -1206 -1102 152 1267 1160 -8 -1028 -1102 -224 1231 1227 99 -932 -1158 -250 773 1417
7800A417r80j196j77P7J088R00k64j332q43O58R43P09K3j148q84MR28R91M17j025
$$ 1417 437 -759 -936 -859 229 1129 865 -467 -1310 -652 291 1000 1023 -125 -1009 -1005 -77 914 1331 306
7820C06j559j08J027J122L55n21j613n25P48J515N12m17j333j093M86J594R43
$$ 306 -1253 -1361 -334 788 1143 622 -991 -1516 -768 747 1259 842 -491 -1584 -1098 496 1439
7837A439p62q61j071J57J187R99N3j094j188j39J136J315O6j187o89n66O24J387
$$ 1439 677 -184 -1255 -1098 89 1088 1141 47 -1141 -1280 -144 1171 1237 50 -639 -1205 -581 806
7855H06O91p39j323o71M50J290Q85n81j353m37j32J198J190M7j489j210M88P92
$$ 806 1497 758 -565 -1236 -786 504 1389 808 -545 -982 -1114 84 1274 1321 -168 -1378 -890 -98
7873i8J471j15j154j326J76N68J299N54r09j688K5Q09J107N74n28j350n23N79
$$ -98 1373 1258 104 -1222 -1046 -478 821 1375 466 -1222 -1197 -388 719 1293 765 -585 -1108 -529
7891e29R70M96J49j206r69K99J011P51j14q97j148k6J165J320Q6q25j335l38Q14
$$ -529 441 937 1086 -120 -1089 -790 221 972 858 -39 -1187 -1213 -48 1272 1358 533 -802 -1140 -326
7910c26R94N49n57j238n30M87J201P99m65j293p87K75J436P27k33j120q00k95
$$ -326 668 1217 660 -578 -1108 -621 580 1379 914 -379 -1166 -891 545 1272 1039 -81 -881 -1176
7928a176J392J067J49j175j459J52O23J509j9p26j282k49O71J239O27r19j017
$$ -1176 216 1283 1432 257 -1202 -1050 -427 1082 1063 337 -945 -1194 -523 716 1343 424 -593
7945e93n80N31J106P55k14j419j049O69Q02R51L5r27q92N0O20J126L02q56j315
$$ -593 -1173 -642 464 1219 1005 -414 -1463 -794 8 959 994 67 -825 -775 -155 971 1273 417 -898
7964h98k64P45J015N19n85j317l96O41J149O95o85p32j061K11J442P43n88r62
$$ -898 -1162 -417 598 1117 532 -785 -1181 -540 609 1304 619 -113 -1174 -963 479 1222 634 -328
7982c28p32J23J032R67L0j284o52l47J113O95N78j059q85l65O74J198K86o33r59
$$ -328 -1060 -937 95 1062 1092 -192 -844 -1191 -78 617 1195 136 -749 -1114 -440 758 1044 411 -548
8001e48m05J29J285N27k46j124m91m8J087P94j61q37r17J30P13J278j1r49j215
$$ -548 -953 -824 461 988 742 -382 -873 -921 166 960 799 -38 -955 -825 -112 1166 1155 206 -1009
8020a009j88Q64R09M67n02j388m85Q41J114L34j21j439l45K89J076N33j29p54
$$ -1009 -1197 -333 576 1043 541 -847 -1332 -491 623 957 836 -603 -948 -659 417 950 821 67
8038F7j026K46Q48R10p2r54j015P8P82R74mm21j022l54L30J166M32m94j013n00
$$ 67 -959 -713 135 1045 973 19 -996 -918 -136 838 834 413 -609 -963 -633 533 965 471 -542 -1042
8058a042N29J042O99m78j017n48K5J054Q40n34p46q19J98P97J110j24j039p59
$$ -1042 -513 529 1228 750 -267 -815 -790 264 1104 570 -176 -995 -797 0 1110 986 -53 -812
8076h12j45N46J288M50q61j273j42N79O98M80j18j419j62K44J074O42l91j023
$$ -812 -957 -411 877 1327 466 -807 -949 -370 328 808 690 -729 -891 -647 427 1069 678 -345
8094c45n01J7J052P43L6j021r67K34O76P55M77r35j220j84R02R20N67o50j327
$$ -345 -846 -829 223 966 1002 -19 -986 -752 -76 679 1156 221 -999 -1183 -281 639 1206 556 -771
8113g71l05M93J101P05n01j160p60L04J346M00l9j130p49j20J327J129n82q24
$$ -771 -1076 -583 518 1223 722 -438 -1198 -894 452 852 813 -317 -1066 -1186 141 1270 688 -136
8131a36p24N6O25J044K6n49j113k66P71P75M22m69r17l09Q7J108M34k58q46n60
$$ -136 -860 -804 -179 865 891 342 -771 -1037 -266 509 931 462 -455 -764 -677 431 865 607 -239 -799
8151g99K07O16P63R8j002p71q5P95J162J87j162j006J17M75R14M31o34r90l00
$$ -799 -592 24 787 885 -117 -888 -973 -178 984 1171 9 -997 -880 -405 509 940 306 -684 -984
8170i84O03Q76K43j68j039o38M63J023L18k5o75r94J86R42O64j30n05j104j55
$$ -984 -381 495 738 570 -469 -1107 -644 379 697 672 -3 -997 -811 131 795 665 160 -944 -1099
8189a099Q99J124
$$ -1099 -200 924
8191I24
$$ Imaginary data points
##PAGE= N=2
##DATA TABLE= (X++(I..I)), XYDATA
0@%%%%%%Qq%qQqJ9j9K4l8M6n5O6p5Q8j07J26j48J75k01K34k74L13l59M12m67N33
$$ 0 0 0 0 0 0 0 8 0 0 -8 0 -8 11 -8 16 -22 24 -31 35 -40 48 -59 67 -81 94 -107 127 -147 166 -193 219 -248 285
33B85o05O79p66Q60r59J075j200J329j477J641j815K009k216K441k697K971l269
$$ 285 -320 359 -407 453 -506 569 -631 698 -779 862 -953 1056 -1160 1281 -1416 1555 -1714
50a714L605l972M376m833N343n917O576p330Q211r261J0516j2064J4038j6626
$$ -1714 1891 -2081 2295 -2538 2805 -3112 3464 -3866 4345 -4916 5600 -6464 7574 -9052
64i052K0199k5463L3975n0025R0465l79403p76922O24835P54628M53275k2199
$$ -9052 11147 -14316 19659 -30366 60099 -319304 -1096226 -471391 283237 736512 714313
75G14313q46523q92613L77163R35544L87918p8540m98426q53300k9170R09613
$$ 714313 -132210 -1024823 -647660 287884 675802 597262 98836 -754464 -783634 125979
85A25979N26718j36650l10210o21236l73154O05759P43120j6568l14485m04364
$$ 125979 652697 516047 205837 -415399 -788553 -182794 560326 543758 229273 -175091
95a75091n02756J75807Q40830L06833l31904l70050m64886j53219P16280O72879
$$ -175091 -677847 -502040 338790 645623 313719 -56331 -521217 -674436 41844 714723
105G14723k07746n23511m21514k53867M66074Q86286P6828o79489n02385j88782
$$ 714723 506977 -16534 -438048 -691915 -225841 660445 737273 57784 -444601 -633383
115f33383K72410Q43690L76915o51798o91590j24881K46966O38610N39218m11388
$$ -633383 -360973 482717 859632 207834 -483756 -608637 -361671 276939 816157 404769
125D04769q37107j96655L10993M54162N02632j06742p87873l89858L11477M13112
$$ 404769 -432338 -628993 -318000 136162 638794 532052 -255821 -645679 -334202 78910
135G8910L66113J03177n44414n78187J44474M54070K87212J68436k54889o26897
$$ 78910 445023 548200 3786 -574401 -429927 24143 311355 479791 224902 -401995
145d01995j40212M40825L59459J68868p5884n32393m14817K93108N16077K15690
$$ -401995 -542207 -101382 258077 426945 351061 -181332 -596149 -303041 213036 428726
155D28726l9248l96856n50856O3203O16855L59126o3383l38761n35389j44408
$$ 428726 389478 -7378 -558234 -495031 121824 480950 417567 78806 -456583 -600991
165f00991N64271N43892l7353l68717m49326k42033L95979O50530Q2605m08310
$$ -600991 -36720 507172 469819 101102 -348224 -590257 -194278 456252 538857 130547
175A30547m09100k35898K13084O10155K59395l59550m41313j99311R8576M62267
$$ 130547 -278553 -514451 -301367 308788 568183 208633 -232680 -431991 -333415 128852
185A28852L97518k01551m85781k30600M8949L21023M39436J0105m57038l42186
$$ 128852 526370 324819 -160962 -391562 -342613 -21590 417846 427951 -29087 -371273
195c71273R385K54101M02797J83966l46474m68884p9028K44417L69923K72456
$$ -371273 -361888 -107787 295010 478976 132502 -336382 -415410 -170993 198930 471386
205D71386j97140n19169k20381K25315L81236K90065p4530m76785l63142J53802
$$ 471386 274246 -244923 -465304 -239989 141247 431312 356782 -120003 -483145 -329343
$$ [...]
8191F96
##END NTUPLES=NMR FID
##END=
