##TITLE=1H_SA_DMAD K
 CDCl3
 8 sc, 
 28.10.2021
##JCAMPDX= 6.0         $$ Bruker NMR JCAMP-DX V2.0
##DATA TYPE= NMR FID
##DATA CLASS= NTUPLES
##ORIGIN= UXNMR, Bruker Analytische Messtechnik GmbH
##OWNER= root
$$ XWIN-NMR		Version 3.5
$$ Thu Oct 28 12:28:11 2021 Russian Standard Time (UT+4h)  she@DPX200
##.OBSERVE FREQUENCY= 200.1313468511
##.OBSERVE NUCLEUS= ^1H
##.DELAY= (6, 6)
##.ACQUISITION MODE= SIMULTANEOUS
##.ACQUISITION SCHEME= undefined
##.AVERAGES= 8
##.DIGITISER RES= 18
##SPECTROMETER/DATA SYSTEM= spect
##.PULSE SEQUENCE= zg30
##.SOLVENT NAME= D2O
##.SHIFT REFERENCE= (INTERNAL, D2O, 0, 15.7039)
##AUDIT TRAIL= $$ (NUMBER, WHEN, WHO, WHERE, WHAT)
$$ ##TITLE= Audit trail, XWIN-NMR		Version 3.5
$$ ##JCAMPDX= 5.01
$$ ##ORIGIN= Bruker BioSpin GmbH
$$ ##OWNER= she
$$ F:/spectra/data/she/nmr/H-F/1/audita.txt
$$ ##AUDIT TRAIL=  $$ (NUMBER, WHEN, WHO, WHERE, WHAT)
(   1,<2021-10-28 12:27:05.84 +0400>,<she>,<DPX200>,
      <created by zg, POWCHK disabled, PULCHK disabled
       configuration hash MD5:
       00 E9 B6 7A A2 85 ED C7 34 08 36 98 17 FE 4E 26
       data hash MD5: 16K
       18 CE 3D B7 92 1E 3C 1F 26 18 5B DA 43 B7 44 35>)
$$ ##END=
$$ 
$$ hash MD5
$$ 11 90 9A 35 36 B7 A3 02 BE 41 DF E9 AE 78 A6 49
##$RELAX= 
##$RELAX= 
##$RELAX= 
##$RELAX= 
##$RELAX= 
##$RELAX= 
$$ Bruker specific parameters
$$ --------------------------
##$DU= <F:/spectra>
##$EXPNO= 1
##$NAME= <H-F>
##$PROCNO= 1
##$TYPE= <nmr>
##$USER= <she>
##$AMP= (0..31)
100 100 100 100 100 100 100 100 100 100 100 100 100 100 100 100 100 100 
100 100 100 100 100 100 100 100 100 100 100 100 100 100 
##$AQSEQ= 0
##$AQ_mod= 1
##$AUNM= <au_zg>
##$AUTOPOS= <>
##$BF1= 200.13
##$BF2= 200.13
##$BF3= 200.13
##$BF4= 200.13
##$BF5= 200.13
##$BF6= 200.13
##$BF7= 200.13
##$BF8= 200.13
##$BYTORDA= 1
##$CFDGTYP= 0
##$CFRGTYP= 5
##$CHEMSTR= <none>
##$CNST= (0..31)
1 1 145 1 1 1 1 1 1 1 1 1 1 1 1 1 1 1 1 1 1 1 1 1 1 1 1 1 1 1 1 1 
##$CPDPRG= <>
##$CPDPRG1= <>
##$CPDPRG2= <>
##$CPDPRG3= <>
##$CPDPRG4= <mlev>
##$CPDPRG5= <mlev>
##$CPDPRG6= <mlev>
##$CPDPRG7= <mlev>
##$CPDPRG8= <mlev>
##$CPDPRGB= <>
##$CPDPRGT= <>
##$D= (0..31)
0 1.2 0 0 0 0 0 0 0 0.06 0 0.03 0 0 0 0 0.0002 0 0 0 0 0 0 0 0 0 0 0 0 
0 0 0 
##$DATE= 1635409625
##$DBL= (0..7)
120 120 120 120 120 120 120 120 
##$DBP= (0..7)
150 150 150 150 150 150 150 150 
##$DBP07= 0
##$DBPNAM0= <>
##$DBPNAM1= <>
##$DBPNAM2= <>
##$DBPNAM3= <>
##$DBPNAM4= <>
##$DBPNAM5= <>
##$DBPNAM6= <>
##$DBPNAM7= <>
##$DBPOAL= (0..7)
0.5 0.5 0.5 0.5 0.5 0.5 0.5 0.5 
##$DBPOFFS= (0..7)
0 0 0 0 0 0 0 0 
##$DE= 6
##$DECBNUC= <off>
##$DECIM= 32
##$DECNUC= <off>
##$DECSTAT= 4
##$DIGMOD= 1
##$DIGTYP= 9
##$DL= (0..7)
0 120 120 120 120 120 120 120 
##$DP= (0..7)
150 150 150 150 150 150 150 150 
##$DP07= 0
##$DPNAME0= <>
##$DPNAME1= <>
##$DPNAME2= <>
##$DPNAME3= <>
##$DPNAME4= <>
##$DPNAME5= <>
##$DPNAME6= <>
##$DPNAME7= <>
##$DPOAL= (0..7)
0.5 0.5 0.5 0.5 0.5 0.5 0.5 0.5 
##$DPOFFS= (0..7)
0 0 0 0 0 0 0 0 
##$DQDMODE= 0
##$DR= 18
##$DS= 0
##$DSLIST= <SSSSSSSSSSSSSSS>
$$ [...]
##$SUBNAM2= <"">
##$SUBNAM3= <"">
##$SUBNAM4= <"">
##$SUBNAM5= <"">
##$SUBNAM6= <"">
##$SUBNAM7= <"">
##$SUBNAM8= <"">
##$SUBNAM9= <"">
##$SW= 18.0517286264689
##$SWIBOX= (0..15)
0 0 2 0 0 0 0 0 0 0 0 0 0 0 0 0 
##$SW_h= 3612.71676300578
##$TD= 16384
##$TD0= 1
##$TE= 0
##$TE2= 300
##$TE3= 300
##$TEG= 300
##$TL= (0..7)
0 120 120 120 120 120 120 120 
##$TP= (0..7)
150 150 150 150 150 150 150 150 
##$TP07= 0
##$TPNAME0= <>
##$TPNAME1= <>
##$TPNAME2= <>
##$TPNAME3= <>
##$TPNAME4= <>
##$TPNAME5= <>
##$TPNAME6= <>
##$TPNAME7= <>
##$TPOAL= (0..7)
0.5 0.5 0.5 0.5 0.5 0.5 0.5 0.5 
##$TPOFFS= (0..7)
0 0 0 0 0 0 0 0 
##$TUNHIN= 0
##$TUNHOUT= 0
##$TUNXOUT= 0
##$USERA1= <user>
##$USERA2= <user>
##$USERA3= <user>
##$USERA4= <user>
##$USERA5= <user>
##$V9= 5
##$VALIST= <valist>
##$VCLIST= <CCCCCCCCCCCCCCC>
##$VD= 0
##$VDLIST= <DDDDDDDDDDDDDDD>
##$VPLIST= <PPPPPPPPPPPPPPP>
##$VTLIST= <TTTTTTTTTTTTTTT>
##$WBST= 1024
##$WBSW= 4
##$XGAIN= (0..3)
0 0 0 0 
##$XL= 0
##$YL= 0
##$YMAX_a= 749330
##$YMIN_a= -801923
##$ZGOPTNS= <>
##$ZL1= 120
##$ZL2= 120
##$ZL3= 120
##$ZL4= 120
##$ABSF1= 10
##$ABSF2= 0
##$ABSG= 5
##$ABSL= 3
##$ALPHA= 0
##$AQORDER= 0
##$ASSFAC= 0
##$ASSFACI= 0
##$ASSFACX= 0
##$ASSWID= 0
##$AUNMP= <proc_1d>
##$AZFE= 0.1
##$AZFW= 0.1
##$BCFW= 1
##$BC_mod= 2
##$BYTORDP= 1
##$COROFFS= 0
##$CY= 11.3945322036743
##$DATMOD= 1
##$DC= 2
##$DFILT= <>
##$DTYPP= 0
##$F1P= 2.36226072786647
##$F2P= -0.459571619588291
##$FCOR= 0.5
##$FTSIZE= 0
##$FT_mod= 4
##$GAMMA= 1
##$GB= 0.15
##$INTBC= 1
##$INTSCL= 1
##$ISEN= 128
##$LB= 0.24
##$LEV0= 0
##$LPBIN= 0
##$MAXI= 10000
##$MC2= 0
##$MEAN= 0
##$ME_mod= 0
##$MI= 1.114404
##$NCOEF= 0
##$NC_proc= 0
##$NLEV= 6
##$NOISF1= 3.799351
##$NOISF2= 2.8
##$NSP= 1
##$NTH_PI= 0
##$NZP= 0
##$OFFSET= 15.70392
##$PC= 1
##$PHC0= -15152.25
##$PHC1= 11.20082
##$PH_mod= 1
##$PKNL= yes
##$PPARMOD= 0
##$PSCAL= 0
##$PSIGN= 0
##$REVERSE= no
##$SF= 200.130013532006
##$SI= 16384
##$SIGF1= 3
##$SIGF2= 2
##$SINO= 400
##$SIOLD= 16384
##$SREGLST= <1H.CDCl3>
##$SSB= 0
##$STSI= 0
##$STSR= 0
##$SW_p= 3612.71676300578
##$SYMM= 0
##$S_DEV= 0
##$TDeff= 0
##$TDoff= 0
##$TI= <>
##$TILT= no
##$TM1= 0
##$TM2= 0
##$TOPLEV= 0
##$USERP1= <user>
##$USERP2= <user>
##$USERP3= <user>
##$USERP4= <user>
##$USERP5= <user>
##$WDW= 1
##$XDIM= 8192
##$YMAX_p= 0
##$YMIN_p= 0
$$ End of Bruker specific parameters
$$ ---------------------------------
##NTUPLES= NMR FID
##VAR_NAME=  TIME,          FID/REAL,        FID/IMAG
##SYMBOL=    X,             R,               I
##VAR_TYPE=  INDEPENDENT,   DEPENDENT,       DEPENDENT
##VAR_FORM=  AFFN,          ASDF,            ASDF
##VAR_DIM=   8192,          8192,            8192
##UNITS=     SECONDS,       ARBITRARY UNITS, ARBITRARY UNITS
##FACTOR=    0.0002768,     1,               1
##FIRST=     0,             0,               0
##LAST=      2.2672688,     0,               0
##MIN=       0,             -801923,         0
##MAX=       2.2672688,     749330,          0
$$ Real data points
##PAGE= N=1
##DATA TABLE= (X++(R..R)), XYDATA
0@%%%%%%%%%Qj6J6k4L2l2M1n7P2q8J05j28J59j88K18k60L03l46M03m67N37o19
31c31P06q02R15j033J161j309J467j641J837k045K270k524K799l096L426l783
47a983M170m599N067n582O152o778P475q255R130j0123J1257j2565J4099j5926
61h461J8138k0896K4439k9176L5896m6230O4347j05355L71288q3192q37547j02695
73g19444M70803P67914K30057m21419p60130l23479L70069P42027L68657k81323
83D43732p03739m40910J98722O68775M96433j24160o32884n13823L8072N60879
93h903N58402M7402n08222n79769j20142M54056N75290J87891l60226n83424k68549
104f06194K98192N77486L25935k31277n51707l67573J33771N22238M31452o7410
$$ plain form
0 0 0 0 0 0 0 0 0 0 0 8 -8 8 -16 16 -16 25 -32 40 -48 57 -71 88 -100 118 -142 161 -185 218 -249 288 -331
31 -331 375 -427 488 -545 616 -693 774 -867 970 -1075 1195 -1329 1470 -1626 1800 -1983
47 -1983 2187 -2412 2655 -2927 3225 -3553 3922 -4333 4797 -5326 5931 -6634 7465 -8461
61 -8461 9677 -11219 13220 -15956 19940 -26290 38057 -67298 303990 220798 -616749 -719444
73 -719444 -248641 519273 749330 327911 -432219 -755698 -385629 356398 725055 443732
83 443732 -260007 -700917 -502195 166580 663013 538853 -94031 -607854 -569782 -8903
93 -8903 549499 596901 88679 -491090 -611232 -157176 418114 606005 245779 -337645 -606194
104 -606194 -308002 269484 595419 364142 -187565 -555138 -421367 100871 532323 464913
114D64913m92341m62880n576M46461M77611Q8529l85838n13371j53122L41657
124a93957N12062K13085k78650n00854k72653K02616N05463L26064j56073m77223
134a20120l59439Q6884M45354L93380j1526m19815m31975l1842L79304M36764
144C66969R5824l31892m48435j58589K84546M65577J97348k41398m45878k47234
154d63162J81942M38416K90953j24695m30799l21097Q3094L91618L47310j4927
164C78653l64810l72432l8670L35181L87541P5122k84498l84789j38865K40366
174a67201L91227J81024j96899l88486k10678J46612L60816K55927r1707l53692
184g3057k81996M5982L31980L01941j415k91813l24765n4769K73432L39006R2168
$$ plain form
114 464913 -27428 -490308 -495884 -49423 428188 516717 130879 -382492 -535614 -193957
124 -193957 318105 531190 252540 -248314 -520967 -318351 187112 513176 357103 -120120
134 -120120 -479559 -392675 52679 446059 434533 14718 -417257 -449099 -69795 366969
144 366969 462793 130901 -317534 -476123 -191577 274000 471348 229950 -215928 -463162
154 -463162 -281220 157196 448149 323454 -107345 -428442 -345348 46270 393580 378653
164 378653 13843 -358589 -397259 -62078 325463 400585 116087 -268702 -407567 -167201
174 -167201 224026 405050 208151 -180335 -391013 -244401 116415 372342 280635 -73057
184 -73057 -355053 -309071 22909 324850 323435 31622 -293143 -347912 -74480 264526 356694
195C56694k37753l43610j29459J92528L44914J82684j63578l50167k07060J22632
205b32175L37068K35408p6949l19410k74590L6770L12856K86803J365k83536l02919
216b79309m3802K50920L21109Q6922k32043l20839j15270J90189L20327J53050
226C31254j50811l17814j89913J23797L08774K03916p7042k89515k33987L6313
236b55028K72773K59300m413k57407k62588l6876K22504K81256P6140j98406k92221
247a94966j09942J76311K87446J40323j32566k92022j75996J04909K88904K03754
257B96155p5572k75308k21395K9168K62966K51904L76k48490k66347l2401K26262
268e2682K69719P3848j96720k90162j03459J75863K88362J30901j46424k80408
$$ plain form
195 356694 118941 -224669 -354128 -161600 183314 365998 202420 -147747 -354807 -232175
205 -232175 104893 340301 263352 -56058 -330648 -293878 18978 305781 307146 23610 -279309
216 -279309 -323111 -72191 248918 335840 103797 -217042 -332312 -142123 178204 331254
226 331254 180443 -137371 -327284 -203487 105287 309203 232161 -57354 -291341 -255028
236 -255028 17745 277045 272632 15225 -247363 -284239 -61735 219521 295661 97255 -194966
247 -194966 -304908 -128597 158849 299172 166606 -125416 -301412 -196503 92401 296155
257 296155 220583 -54725 -276120 -246952 16014 267918 268294 19804 -246543 -278944 -52682
268 -52682 217037 290885 94165 -195997 -299456 -123593 164769 295670 149246 -131162
278a31162j61137J07246K84447J87271q4384k69905k05444N1068K53969K22717
288B54686j0102k41459k43307j1968K20657K47505M6834j95658k53784q3270J70321
299i9545K65846J03723j46529k55394j33924J11586K50813J61483p7725k49761
309f9427j80433N2816K27171J98230j2396k10946k14556k3198J94729K27519M7401
320B36910j64452k28566q7591J39011K35274J16967j12239k36958j37166Q0109
330a58701K22833J69817m6469k21748j90919J6281K11777K05423J2607j87903
340C2998k25387n0382J77353K38558P8097j58184k45565j02406J29559K49676
350A24317J39572j10518k53918j58989Q4137K49547J79484n3147k39211k07539
$$ plain form
278 -131162 -292299 -185053 99394 286665 202281 -67624 -273068 -222000 31969 254686
288 254686 244584 3125 -240182 -252150 -31493 216012 262846 67188 -186596 -269866 -99545
299 -99545 166301 270024 123495 -131899 -265823 -154237 96576 258059 180334 -69427
309 -69427 -249860 -197044 30127 228357 215961 5015 -209541 -232739 -38010 189509 236910
320 236910 72458 -156108 -243699 -104688 130586 247553 135314 -101644 -238810 -158701
330 -158701 64132 233949 187480 -34268 -225187 -208906 2871 208294 220901 32998
340 32998 -192389 -242771 -65418 173140 251237 93053 -152512 -254918 -125359 124317
350 124317 263889 153371 -100547 -259536 -175399 74148 253632 200485 -38726 -246265
360b46265K6620K34278K17766O40k16539k29217l1120J92568K43824O1461j81317
371G2699k44006q2544J51750K44208J08437j22526k42875j36026J03043K36956
381H9116J49491p0312k24790j69065M0817K12514J88480j6245k00962j92542j4387
392b07885J77716K06042M2370j59110k15438o7702J41969K10934R1526j09836
402A10586k14610j18424Q6655K12202J39880o4515k01693j53182K9968J91338
412A8205J75069n264j78385j86978j9055J62110J90018N0382j40046k02729p2855
423b09528J22407K02696R4186j01238j97296j17052P1572K00109J36251n4163
433A47944j90781j50586K9792J78404J63701L47j69926j78961j6743J54699J84038
$$ plain form
360 -246265 -219645 14633 232399 233039 16500 -212717 -243837 -51269 192555 254016 72699
371 72699 -171307 -253851 -102101 142107 250544 128018 -114857 -250883 -147840 89116
381 89116 238607 168295 -56495 -225560 -184743 27771 216251 200006 -956 -193498 -207885
392 -207885 -30169 175873 218243 59133 -156305 -224007 -82038 128896 220422 110586
402 110586 -104024 -222448 -135793 76409 216289 151774 -49919 -203101 -173133 18205
412 18205 193274 188010 9625 -177353 -196408 -34298 155720 206102 66056 -136673 -209528
423 -209528 -87121 115575 209761 108523 -88773 -205825 -134253 65856 202107 147944
433 147944 -42837 -193423 -163631 14773 178474 178821 8895 -170066 -186809 -32110 151928
444A51928M1683j37251j87350o8224J19892J95672Q3640j00972j89837j04527
454a95346P7606J85303J23700n3148j84153j37067L4384J67411J49153o690j55471
465E682j60537j8550J43737J67916L5520j21546j68810o2496J02879J72318Q4365
476A80478q4064j73211r6947O1504J63630J19220l8472j60216j33833J6772J53473
487H334J43031L396j36489j56628k8969J27808J63659M8396j13679j67554o5798
498a74493R1156J69662R1369p6766j70728j05808N7626J66117J19016l3138j56257
509b2244j38689J3438J51215J45663P760j36815j52669k9752J18205J61869N2112
520A70093j07374j61984o9199Q5693J61119Q7495o3125j60397j07975M7948J54013
$$ plain form
444 151928 193611 56360 -130990 -199214 -79322 116350 199990 99018 -90819 -195346
454 -195346 -117740 67563 191263 138115 -46038 -183105 -148721 18690 167843 161153 5682
465 5682 -154855 -173405 -29668 138248 173768 52222 -116588 -179084 -76205 96113 180478
476 180478 96414 -76797 -173744 -112240 51390 170610 132138 -28078 -161911 -145139 8334
487 8334 151365 154761 18272 -138356 -167325 -39517 124142 172538 58859 -108695 -174493
498 -174493 -83337 86325 177694 100928 -69800 -175608 -117982 48135 167151 134013 -22244
509 -22244 -160933 -147495 3720 149383 157143 20328 -132341 -162093 -43888 117981 170093
520 170093 62719 -99265 -168464 -82771 78348 165843 102718 -57679 -165654 -117706 36307
531C6307J18262k3346j44785j32588P40J35168J47440J7675j25514j50040m0265
542a60946J08669J58631O1236r2168j64758q0588P9169J60769R7906n5728j61556
553d9364j16011L6647J57424J31414j9932j48225j40471o306J38902J53557K4965
564A62600j27077j61092m1974J12531J61142O5199r4714j67158q1114P9320J65989
575G3652R5720o2248j58255j11254L9582J56541J23462k3846j47484j33095N670
586a41555J34605J40281J7321j25793j48304l1174J10654J49724M9262r4027j48787
597h7793o9457P7904J51490Q0624o0324j43404r4647M0698J35203J08344j9327
608A19311j30203j16001K893J14740J22886J7916j01401j28080l8891Q8917J30715
$$ plain form
531 36307 154569 131223 -13562 -146150 -145410 -10242 137198 154873 29359 -120681 -160946
542 -160946 -52277 106354 167590 75422 -89336 -169924 -90755 70014 167920 112192 -49364
553 -49364 -165375 -128728 28696 160110 140178 -8047 -148518 -154824 -15922 137635 162600
564 162600 35523 -125569 -167543 -55012 106130 171329 76615 -90543 -171657 -92337 73652
575 73652 169372 107124 -51131 -162385 -122803 33738 157200 133354 -14130 -147225 -141555
586 -141555 -6950 133331 150652 24859 -123445 -154619 -43965 105759 155021 60994 -87793
597 -87793 -157250 -79346 72144 152768 92444 -50960 -145607 -104909 30294 138638 119311
608 119311 -10892 -126893 -124000 -9260 113626 131542 30141 -97939 -136830 -47913 82802
619H2802N1729o9671j29753p0596N3313J27941Q5991l7063j25534r4589J8646
630a06784J15854J09095m57j09581j17725j6075J02546J22274L1237q6827j28992
641h5435m9943P7554J31698O3964o5417j31506p5381M7201J29502R1061l5024
652I8274j26508j00117J9807J19558J06596j969j09626j17042j1946J02538J19151
663I8716K6456q9856j20098m0745P4443J23744N4703o4963j19729o4726M9300
674g2755J15444P5261l2652j12305q6405K1601J05081R0963n649r6779r7599r547
686a05341Q7666J04612K0314p8615j03568l5081O6604J05646M8284n3758j07793
697e1030n8178M4250J01982O8466k8153r9269p8218J4823R5419Q5555m743q6655
$$ plain form
619 82802 134531 64860 -64893 -135489 -82176 45765 131756 94693 -30841 -125430 -106784
630 -106784 9070 118165 117708 8127 -109598 -125673 -23127 99147 130384 43557 -85435
641 -85435 -135378 -57824 73874 137838 72421 -59085 -134466 -87265 42237 133298 98274
652 98274 -28234 -128351 -108544 11014 117610 115641 6015 -111027 -122973 -20435 98716
663 98716 125172 35316 -84782 -125527 -51084 72660 127363 62400 -57329 -122055 -72755
674 -72755 42689 117950 85298 -27007 -113412 -91811 13270 104233 98584 1805 -95794 -105341
686 -105341 -17675 86937 107251 28636 -74932 -110013 -43409 62237 110521 56763 -51030
697 -51030 -109208 -64958 37024 105490 77337 -21932 -100150 -85327 10092 95647 90904 4249
709D249q9615j1473P8570R4959K3676p0257r8733l2727N9736R6439M6798m8991
721E2631r8469n5409L8654R6823O3298k8080r0687p2157J4659Q9910P8448n358
733H4263q3473q3167m944P5091Q6915J8784o9984r1033k6470O0790R1148L5969
745I3889n1059q9858m7686M1077R1156N3241l1099q6006o1285K0123Q1011O8728
757H2232p903p8347p2070j091O9429P6237J2767o1067p9655k4283N5314Q0685
769E2248L1213m4436p9952m1967L4892P9187N1184k6941p8623n5438J6206P3459
781A1032O3458o476o9824o9166l261O6546P1477J2204n7107p6093k2463N2096
793b7577P7849L1226m5041p7289l8300L4239P6626M7809k6344p4863n4393J7349
$$ plain form
709 4249 -85366 -96839 -18269 76690 100366 30109 -68624 -101351 -41615 54824 101622 52631
721 52631 -45838 -101247 -62593 34230 97528 69448 -21239 -93396 -78737 11173 89621 84263
733 84263 790 -82377 -87321 -12230 74685 93469 23485 -67548 -94018 -33228 57920 93889
745 93889 42830 -47028 -94714 -53637 37519 90760 59661 -26345 -87630 -67507 13504 82232
757 82232 74329 -4018 -76088 -77179 -7750 68487 81254 20187 -59468 -83751 -28437 52248
769 52248 83461 39025 -40927 -82894 -48002 31185 82369 55428 -23195 -78633 -62427 11032
781 11032 74490 68014 -1810 -70976 -74237 -7691 63786 75990 18883 -57210 -79673 -27577
793 -27577 50272 81498 36457 -40832 -79132 -44893 31733 79542 53198 -21665 -76058 -58709
805e8709P1164N7876o097o5405o5054l040O0973O7619J1627n4046o8222k1874
817g3188M4485P1979L0767l8343p0405l8212K8923O9074M5916j7878o7907n4042
829f8831J1392O3920N8388q58n9552o3159j0379N4462O9187J7727m9111p0210
841d7024k7368M0795P2209L6670l2647p4082m4525K5951P1159N2405j5466o9905
853a1828n9161O182O7336O5362R65o1092o8570j2497N6367P2683K1158n0543p5635
866d9273k7912M3332P4111L7887l5453p5951m4650K7796P4853N0201k0305p0433
878a5797n6895J0836O8589O1622l110o4027o4738m449N7765O7407J4723n3113
890A8813o9431k1329M5741O9715K8419l7198o8326l7260K9274O7392M2484k0943
$$ plain form
805 -58709 12455 70331 64234 -1171 -66225 -69265 -8292 59327 70954 16908 -51314 -73188
817 -73188 -28703 43276 74043 35700 -34705 -72917 -43994 25080 70996 53118 -14789 -68831
829 -68831 -57439 6481 64869 64011 4459 -58700 -69079 -14617 54570 72297 23186 -47024
841 -47024 -74392 -33597 38612 75282 42635 -31447 -75972 -50021 21138 73543 58077 -11828
853 -11828 -70989 -64807 2529 67891 68856 7764 -60806 -73303 -16936 55747 76905 26362 -49273
866 -49273 -77185 -33853 40258 78145 42692 -33259 -77909 -50113 24740 74941 54636 -15797
878 -15797 -72692 -61856 6733 68355 65245 1218 -63520 -67969 -10204 57203 71926 18813
890 18813 -50618 -71947 -26206 43509 71928 34730 -33596 -70856 -41582 25810 68294 47351
902D7351o3885m8253J2077N8540N3692k081n6137n5815n798M9043N8795J4424
914F1953m1976o0533k3657L6755O1479K9332k8173o0584l6434K0518N9337M3706
926F1723j4275n7750m7111N589N3825N2237K148n0403n6667r177M6963N7559J6095
939F0756m0075o0078k3783L4983O0870L0222k9394n9560l4846K1091N8672M0943
951E9801j4676n6172m5507Q272N2475M7488O19m7749n1913o535M3513N2861J2716
964E5193l8471n2439j9842L1399N3984K5276k6516n2616k9892K0196N0298L4474
976E1044j2365m8745l9269P834M5331M1822q05m1976m3773o200L7812M7032J1131
989D8873l3288m6833j7794K7895M6994K3706k2417m8026k7636J7242M5197L2193
$$ plain form
902 47351 -16534 -64787 -52710 5830 59522 57441 1304 -54511 -60309 -11266 47529 61953
914 61953 19977 -40556 -64213 -27458 34021 63353 35180 -25404 -61838 -41320 18017 61723
926 61723 47448 -10302 -57413 -51824 2001 54238 56386 5983 -50684 -59861 -12898 44661 60756
939 60756 20681 -39397 -63180 -28197 32673 62895 33501 -26059 -60905 -39814 18858 59801
951 59801 45125 -11047 -56554 -48282 4193 51681 52300 4551 -47362 -53897 -10384 42477 55193
964 55193 16722 -35717 -55559 -24160 29824 55100 28584 -24032 -53924 -33728 16570 51044
976 51044 38679 -10066 -49335 -41501 3830 45652 44847 2871 -40902 -47102 -9290 37742 48873
989 48873 15585 -31248 -49042 -21147 25847 49553 27136 -20890 -48526 -31284 13913 46106
1001D6106j0494m3512l5957L560M2148L9446M93l7487m1576p224L4163M3376J3108
1014D6150k9934m5525j6488K5674M3993K2893k0814m4847k6605J5895M4163K9635
1026D4190j1163m1252l4291N582M0153L6392n08l7606l8913l712L3242M0453J0309
1039D2876l0333m1822j4333K6305M2132J8339k0841m0992k4040J6540M0796K6963
1051D1590j1730l8689k9857O093L5990L3745j153l4599l4867m054L0888L6517
1063B9874Q875k6863l8528j3853K4145L8680J7372j9417l8209k1634J5150L7688
1075A3280K5963j1531l6987k8056P024L5001L1194k321l3249l3265k342L1142
1087d147L4230O378k7226l5658j0781K3617L6287J4930k0924l5547j7734J5218
$$ plain form
1001 46106 35612 -7900 -43857 -40297 1851 41297 41790 4303 -37273 -44497 -10334 33042 46150
1014 46150 16216 -29309 -45797 -20123 23870 46763 25949 -18898 -45503 -29608 14555 44190
1026 44190 33027 -8225 -42516 -36934 3219 39611 39103 1497 -37416 -41128 -7886 32567 42876
1039 42876 12543 -29279 -43612 -17307 24825 43164 22323 -18669 -42709 -26169 14627 41590
1051 41590 29860 -8829 -38686 -32593 3397 37142 35989 1390 -33477 -37531 -6643 29874
1063 29874 38749 11886 -26642 -40495 -16350 22330 39702 20285 -17924 -39558 -24408 13280
1075 13280 39243 27712 -9275 -37331 -30307 4694 35888 33567 318 -32947 -35289 -4147
1087 -4147 30083 36461 9235 -26423 -37204 -13587 22700 37630 16706 -18841 -36575 -21357
1099b1357L5184K2159j2144l3600k4743Q065L1719K5985k193k8931k9177j386
1111c0419K6643L0003N630k3506l0180j0353J9586L1804J3324j6662l1086j7049
1123c2265J2809L0503J9764p765l0092k3688N012K8160K5531l89k6043k7445m272
1136c0180K3820L0136P782k1358l0669j1470J8237L0564J5759j4342l1963j8541
1148c2225J1547L0195K2099p358k9861k4356K809K9202K6596m33k6316k8777l775
1161c0653K4266K9976Q051k2252l1184j0123J9395L0976J4114j6515l1319j6642
1173c1910J3298L1248J8725j0248k9560k1573O756K8647K3493l203k7516k5031
1185b6874M40K4325K6120L842k2655k7163o938J9891K7260R774j6125k7340j3189
$$ plain form
1099 -21357 13827 35986 23842 -9758 -34501 -26436 5283 31268 29075 144 -29033 -30419
1111 -30419 -3776 26227 31857 8351 -21829 -32182 -12596 19208 32532 15870 -15216 -32265
1123 -32265 -19456 11047 30811 23046 -7046 -30734 -25722 2438 27969 27580 1537 -25908 -30180
1136 -30180 -6360 23776 31558 10200 -20469 -31939 -13702 16862 32621 18279 -13684 -32225
1148 -32225 -20678 9517 31616 24258 -5603 -29959 -27150 2052 28648 28215 1899 -26878 -30653
1161 -30653 -6387 23589 31640 9388 -21796 -31919 -12524 18452 32566 16051 -15268 -31910
1173 -31910 -18612 12636 31361 21113 -8447 -30020 -23264 5383 28876 25673 -1843 -26874
1185 -26874 -26434 -2109 24011 27853 5198 -21965 -28903 -9012 18248 28022 11897 -15443 -28632
1198b8632J3602K7187J5249r689k6576j7599O626K4638K0665l242k3466k2182
1210b3419J54K1651K3277L063j9291k4693o725J7741K5273R280j5277k5508j2307
1223b6781J2450K5726J5194j0528k5498j6798P584K4726J8826m024k3780k1399
1235b4302J763K2708K2198J493k0738k3841l959J8937K4526O684j7170k3990r592
1248b5283J4060K4508J1830j1643k4113j4328R275K3515J5707o219k2838j7340
1260b2869M018K1076J9387j459j9935j9783j525J8114K1034M196j6317k1626o379
1273b2068J4704K1022Q889j1933k1972j1053R864K1506J3005p606k0434j4790
1285b0866M188J9696J6755j969j8614j8084m38J7338J8698L600j5129k0401n474
$$ plain form
1198 -28632 -15030 12157 27406 17717 -8859 -26458 -19832 4806 25471 22229 -1237 -23419
1210 -23419 -23265 -1614 21663 24726 5435 -19258 -25983 -8242 17031 26311 11034 -14474 -26781
1223 -26781 -14331 11395 26589 16061 -9437 -26235 -18651 6075 24901 20877 -2903 -24302
1235 -24302 -22539 169 22367 23860 3122 -20719 -24678 -5741 18785 25469 8299 -15691 -25283
1248 -25283 -11223 13285 25115 13472 -10641 -24969 -15694 7821 23528 17309 -5529 -22869
1260 -22869 -18851 2225 21612 20153 218 -19565 -21090 -2976 18058 22254 5937 -15689 -22068
1273 -22068 -7364 13658 22547 10614 -11358 -22411 -12547 8959 21964 14358 -6076 -20866
1285 -20866 -16678 3018 19773 17804 -810 -18894 -19332 -1994 16704 20304 5175 -15226 -20700
1298b0700J3310K0294Q345j1494j9950j0936R333K0311J2627p025j9774j4503
1310b0162M456J9025J6122j965j8462j7690K9J7110J8160L007j5922j9036n378
1323b0706J4160K0475O981j2280k0112r724J0011K0583J2002q028k0387j3366
1335b0391N459J9444J5260k479j8559j7150jJ7494J8164J898j5367j9272n179
1348b0679J4038J9956P625j2311k0583r382R735K0486J2299p492k0582j4064N369
1361a5585K0058J5867k697j9065j8031N73J8607J8709J910j7187k0204l906J5411
1374e540K0968O545j4017k1407q859J2037K1542J0722r612k1174j3466P568K1075
1387F382J4697m799k0037j6331K201J8923J8162m5j7589j8596k675J5850J9325
$$ plain form
1298 -20700 -7390 12904 21249 9755 -10195 -21131 -11798 8513 21140 14115 -5659 -20162
1310 -20162 -15706 3319 19441 17476 -986 -18676 -18647 -1537 16623 19630 3708 -15328 -20706
1323 -20706 -6546 13929 20910 8630 -11482 -21206 -11195 9388 21390 13362 -7025 -20391
1335 -20391 -14932 4512 19772 17293 -1266 -18416 -18417 -923 17241 19139 3772 -15500 -20679
1348 -20679 -6641 13315 20940 8629 -11954 -21336 -11601 8885 21184 13692 -6890 -20954 -15585
1361 -15585 4473 20340 17643 -1422 -19453 -18880 -273 18436 20346 3159 -17045 -20951 -5540
1374 -5540 15428 21973 7956 -13451 -22310 -10273 11269 21991 12379 -8795 -22261 -14693 6382
1387 6382 21079 16280 -3757 -20088 -17887 1036 19198 19153 1564 -17032 -19707 -3857 15468
1400A5468M876j3399k0216p726J2097J9849R682r499j9655j1925P111J9106J3621
1413A9390m673j8660j4745J925J7732J6160Q91j6118j7992l033J4975J8436N381
1426A9669j2471j9250p786J0714J9501J0160q969j9207j2142N951J9344J4032
1438A9546l944j8211j6117J255J7471J7079J593j6353j8693l558J4748J9095O387
1451B0298j2725j9765q519J0611K0521J0546r059k0039j2300O677J9772J4120
1463B0138m380j9139j5672K294J8382J6234N45j6864j8137k485J5300J8807M370
1476A9393j3814j8947o918J1698J9705Q472r305j9216j0643P195J8410J2805m667
1489A4168j7559j4407K162J6964J5542R0j5385j6620k543J3532J7394N266j2205
$$ plain form
1400 15468 20344 6945 -13271 -20997 -8900 10949 20631 11132 -8523 -20448 -13337 5769 19390
1413 19390 14717 -3943 -18688 -16763 969 17129 18020 1902 -16090 -19123 -4148 14288 19669
1426 19669 7198 -12052 -19838 -9124 10377 20537 11568 -7639 -19781 -13830 5514 19546
1438 19546 15602 -2609 -18726 -17471 0 17079 18672 2319 -16374 -19932 -5184 13911 20298
1451 20298 7573 -12192 -20711 -10100 10421 20967 11908 -8131 -20431 -13754 6018 20138
1463 20138 15758 -3381 -19053 -16759 1623 17857 18402 1538 -16599 -19084 -3784 15023 19393
1476 19393 5579 -13368 -20286 -8588 11117 19589 10284 -8932 -19575 -12380 6030 18835 14168
1489 14168 -3391 -17798 -15636 1328 16870 16960 1575 -15045 -17588 -4056 13338 18604 6399
1502F399j8335o768J0088J8131R336q317j8286j1300O421J8064J2785m349j6900
1515c031j4830K185J6654J5826J14j5536j6658k427J3948J8103M601j3311j8039
1528a2401o594J1280J8578Q305r176j8385j1004P429J8554J1946n292j7645j3835
1541a8240L308J6891J5254j295j5918j6240q16J4876J6797K844j3051j7507n162
1554a8259J2242J7659O445r943j7688q681Q208J7792J0505p030j6889j1905M743
1567a2801J6488J2646k413j5356j4364M31J4725J4792J606j2732j6063l659J1631
1580e069J6724N696j0414j6295p655Q196J6488R309o282j5741j1286M589J5111
1593C371J2171k133j4585j3690L36J3729J4454J683j2586j5324l293J0977J5819
$$ plain form
1502 6399 -11936 -18704 -8616 9515 18851 10534 -7752 -19052 -12631 5433 18218 13869 -3031
1515 -3031 -17861 -15676 978 16804 16918 1382 -15276 -17703 -3755 14348 18949 5638 -12401
1528 -12401 -18995 -7715 10863 19168 9992 -8393 -19397 -11968 6586 18532 13240 -4405 -18240
1541 -18240 -14932 1959 17213 15918 0 -16240 -17056 -2180 14617 17461 4410 -13097 -18259
1554 -18259 -6017 11642 18087 8144 -9544 -18225 -10017 7775 18280 11250 -5639 -17544 -12801
1567 -12801 3687 16333 13920 -1436 -15800 -15369 -644 14148 15754 3022 -13041 -16700 -5069
1580 -5069 11655 17351 6937 -9358 -17013 -8817 7671 16980 10698 -5043 -16329 -11740 3371
1593 3371 15542 13409 -1176 -14866 -14530 -801 13653 15336 2750 -12574 -15867 -4890 10929
1606A0929N443r849j5974p244Q408J5557Q931o430j5252j0429M747J4716J1965
1619A5518k671j4189j2704m8J3807J3720J220j2018j4405l469J0527J4836N641
1632A5765r073j5409p205P291J5127R151n253j5125j0474K900J4930J2075j529
1645A3171j3992j3048o78J3241J4200K718j2205j4994m183J0383J5539O415q974
1658G593j6377q177P941J6178R570n908j6215j1318M236J5680J2722k288j5504
1671a867j3554L62J4374J5182J423j3368j5481l779J2466J5815N196j0225j6267
1684i723p161Q841J6193R370p347j6276j0389N143J5548J1691l054j5206j2698
1697a5068J052J3934J3705J122j2744j4599k991J1862J4742M803j0129j5000o769
$$ plain form
1606 10929 16372 6523 -9451 -16695 -8287 7270 16201 9771 -5481 -15910 -11163 3553 15518
1619 15518 12847 -1342 -14046 -14094 -287 13433 14653 2635 -11770 -15239 -4712 10124 15765
1632 15765 6692 -8717 -15922 -8631 6496 15647 10394 -4731 -15205 -12305 2625 14700 13171
1645 13171 -821 -13869 -14547 -1306 12894 15612 3407 -11587 -15770 -5387 10152 16567 7593
1658 7593 -8784 -16961 -9020 7158 16728 10820 -5395 -16713 -12477 3203 15925 13637 -1867
1671 -1867 -15421 -15059 -685 14497 15920 2552 -12929 -16708 -4242 11573 16769 6544 -9723
1684 -9723 -16884 -8043 8150 17520 10173 -6103 -16492 -11349 4199 15890 12836 -2370 -15068
1697 -15068 -14016 -82 13623 14745 2001 -12598 -15589 -3727 11015 15818 5689 -9311 -16080
1710a6080Q404J5464Q664p183j4983r739M727J4818J1193k688j4181j2894P50
1723a3728J3691J3608R98j2113j4733l326J0932J5433N451r958j5338p543Q139
1736h487J5977Q837o172j5884j0520M411J5605J1908k532j4881j3384J065J4152
1749I5J4527N33j3196j4740l139J2271J5801M240j0570j6290o376R750J5953P764
1763A6623p871j5956r268O271J5614J0426m305j4883j1794K167J4478J2897n51
1776A3848j3086j3641j583J1913J4240L830j0900j4675n658Q996J5070P151o957
1789H548j4870r033N265J4457J0338l491j3716j1937J732J2975J3044N47j2668
1802A191j3313k216J1208J4253M175j0069j4698o063Q457J5478P197o825j5073
$$ plain form
1710 -16080 -7676 7788 16452 9269 -5714 -15453 -10726 4092 15285 12597 -1584 -14478 -13728
1723 -13728 -37 13571 14569 2456 -12277 -15603 -4671 10762 16213 6255 -9083 -16626 -8487
1736 -8487 7490 16327 10155 -5729 -16249 -11838 3767 15675 13143 -1738 -15122 -14057 95
1749 95 14622 15155 1959 -12781 -15920 -3649 12152 16392 5822 -10468 -16844 -7094 8859 16623
1763 16623 8752 -7204 -16472 -10201 5413 15839 11534 -3349 -15143 -12976 1502 14399 13848
1776 13848 762 -12879 -14462 -2549 11691 15521 4621 -10054 -15712 -6716 8354 15505 8548
1789 8548 -6322 -15355 -10090 4367 14705 11214 -2502 -14439 -12707 268 13312 13859 1191
1802 1191 -12122 -14338 -3130 11123 15298 5229 -9469 -15532 -7075 8403 15600 8775 -6298
1815f298r418N173J5080J1004l757j4876j1641J566J3846J3138L80j2858j4600
1828a3261k067J2164J4845L939j0750j5221n912R305J5682P828p817j5690r325
1841a6280O180J5264J0794m177j5022j2052K024J4952J2886n01j3480j4172j514
1854a5098J2572J4989K814j1233j5021n088R898J5644O917q430j5835q213O462
1867i622J5818J0055m979j5141j1678L145J4675J2709j010j3769j3843j037J2543
1880b134J4761L024j1757j5129m843J0207J5199O838q470j5718q556P162J5508
1893F092R735m909j5098j1237K705J4899J2825j491j3673j3441p96J2996J4041
1906A2648K460j1443j4842m385J0340J4757O135q532j5188p531O594J5004R287
$$ plain form
1815 -6298 -15716 -10543 4537 15541 11784 -3092 -14733 -13167 679 13817 14197 1339 -13261
1828 -13261 -15328 -3164 11681 15620 4870 -10351 -16263 -6958 8724 16552 8735 -6955 -16280
1841 -16280 -10100 5164 15958 11781 -3241 -15293 -13269 1683 14569 14068 588 -13584 -15098
1854 -15098 -2526 12463 15277 4044 -10977 -16065 -6167 9477 16394 7964 -7871 -16084 -9622
1867 -9622 6196 16251 11272 -3869 -15547 -12402 2273 14982 13972 203 -13640 -14677 -2134
1880 -2134 12627 15651 3894 -11235 -16078 -5871 9328 16166 7696 -8022 -16578 -9416 6092
1893 6092 15827 10918 -4180 -15417 -12712 2187 15012 13521 -152 -13593 -14389 -1393 12648
1906 12648 15108 3665 -11177 -15562 -5222 9535 15670 7138 -8050 -15581 -8987 6017 15304
1919A5304n045j4169j0881K932J3582J2039m68j3018j3321j055J1539J3857L661
1932A4957j0289j4449n462Q443J4996P301o773j4881r225M907J4773J0821l072
1945A2047j4356j2304J254J3589J3364P86j2990j4130k994J1967J4963M744j0260
1958E680j5736o394Q986J5953P787p064j5686r631N157J5405J1981l727j5116
1971b405j2639J219J4617J3649L78j3194j4722k706J2308J5137M256j0289j6004
1984a0395o239Q995J5928Q084p208j5797r314N293J4821J1311l183j4557j2570
1997a4831J569J3860J3202N10j2390j4070k960J1268J4880M576r618j5247o579
2010a5830Q019J5534Q250o726j5024j0042M468J5123J1356k424j4357j3168J017
$$ plain form
1919 15304 10259 -3910 -14791 -11859 1723 13762 13294 276 -13045 -14100 -2561 11296 14957
1932 14957 4668 -9781 -15243 -6800 8196 15497 8724 -6157 -15382 -10475 4298 15119 12047
1945 12047 -2309 -14613 -13359 230 13594 14380 1390 -12740 -15734 -3767 11196 15940 5680
1958 5680 -10056 -16450 -7464 8489 16276 9212 -6474 -16105 -10948 4457 16438 12711 -2405
1971 -2405 -15044 -13825 792 14441 14819 1625 -13097 -15803 -3495 11642 15898 5609 -10395
1984 -10395 -16634 -7639 8289 16373 9165 -6632 -15946 -10653 4168 15479 12296 -2261 -14831
1997 -14831 -13262 598 13800 14310 1920 -12150 -15110 -3842 11038 15614 5996 -9251 -15830
2010 -15830 -7811 7723 15973 9247 -5777 -15819 -11351 3772 15128 12704 -1653 -14821 -13804
2023a3804J3224J4390J464j2630j4693l756J1097J5958N298r818j5790p641Q363
2036h338J6001R130o425j6080j0858N073J5553J2096l121j5382j3035J092J4440
2049A46J4596k7j3509j4361k454J2200J5370M284j0891j5788n925R594J5592P283
2063A6110p441j5718q704N815J5262J0312m406j4262j1779K008J4196J2343k48
2076A3488j2438j3717j841J1768J3687L795j0340j4116n450Q756J4372O955o846
2089H073j4080q884N255J4353R879l609j3624j0932J395J2855J2298L85j2409
2102I55j2816j862J0883J3539L563r528j4284n485Q566J4255P388p078j4459q364
2116a4727M992J3972J0069l429j3441j1347J926J2664J2449K10j2125j2960k574
$$ plain form
2023 -13804 -580 13810 15274 2644 -12049 -15805 -4708 11250 16548 6730 -9060 -16701 -8338
2036 -8338 7663 16793 10368 -5712 -16570 -11497 4056 16152 13031 -2351 -15386 -14294 146
2049 146 14742 14715 1206 -13155 -15609 -3409 11961 16245 5354 -10434 -16359 -6765 8827 16110
2063 16110 8669 -7049 -15753 -9938 5324 15636 11230 -3032 -14811 -12803 1393 13736 13488
2076 13488 1050 -12667 -14508 -2740 10947 14742 4402 -9714 -15164 -6408 7964 14919 8073
2089 8073 -6007 -14891 -9636 4717 14596 10987 -2637 -13569 -12174 681 12979 13364 955
2102 955 -11861 -13723 -2840 10699 14262 4734 -9550 -15035 -6469 7786 15174 8096 -6363 -14727
2116 -14727 -9735 4237 14306 10877 -2564 -13911 -11985 679 13128 13338 1213 -11747 -14321
2129a4321J1512J3704L642r679j4175n309Q082J4212P437o803j4705q664N178
2142i889J4209J0122l501j3588j1338J611J3246J2067L87j2383j3002j881J1095
2155b845J3719L881j0107j3958n536Q260J4703O851o638j4331r077N341J4473
2168D736R911l401j3612j2012J681J3072J2960M29j2669j3567k123J1296J4249
2181A0950M109j0159j4687n730Q757J4784P513p101j5039q864O155J4259R821
2194A4768l646j3985j1271J751J3784J2087m05j2568j2726j776J1646J3280L357
2207A4296j0034j3962m950Q579J3975O701o979j4102q071N001J4199R810l691
2220A0772j2863j1250J547J2332J1961P20j1814j2903k190J0331J3241M571r225
$$ plain form
2129 -14321 -2809 10895 14537 4858 -9317 -14626 -6544 7668 15105 8302 -6403 -15067 -9889
2142 -9889 4320 14442 10941 -2647 -13985 -12374 872 12939 13326 943 -12059 -13940 -2845
2155 -2845 10874 14755 4648 -9310 -14846 -6586 8117 14968 8330 -6001 -15078 -9737 4736
2168 4736 14647 11246 -2366 -14378 -12697 375 13335 13764 1095 -12472 -14595 -3299 10950
2181 10950 15059 4900 -9787 -15517 -6760 8024 15537 8436 -6603 -15467 -9312 4947 14768
2194 14768 11122 -2863 -14134 -12383 1401 13488 13083 515 -12211 -13987 -2341 10939 14296
2207 14296 4262 -9700 -14650 -6071 7904 14605 7626 -6476 -14547 -9546 4653 14463 10772
2220 10772 -2091 -13341 -11794 538 12499 13219 1405 -11498 -13688 -3357 9884 14455 5230
2233E230j3912n989P426J3965P803n799j4007r457M210J3892J0699k494j3440
2246a873j1593P08J2586J2867J087j1652j3574k936J0678J4242M284q926j4711
2259h813o528Q050J4790P587n946j4734r389M237J4170J1148k842j3728j1874
2272a3872J009J2476J3268Q82j1635j3111l238J0246J4171M501r174j3890o142
2285a4509P400J3998P790n931j3786q727L677J3465J0162k305j2400j1579M96
2298a2249J1696J1949J537j0276j2745l598R286J3450N195q261j3216p024O337
2311g919J3683Q475m903j3278r855L005J3001J0915p97j2451j2469l31J1388J3164
2325A1628K570j1025j3589m235R289J4468N890q099j4658p193O629J4373Q988
$$ plain form
2233 5230 -8682 -14671 -7245 6720 14523 8724 -5283 -14740 -10530 3362 14061 11567 -1873
2246 -1873 -13466 -12758 -172 12695 13782 2130 -11444 -14380 -3702 10540 14824 5898 -8813
2259 -8813 -15341 -7291 7499 15086 9140 -5594 -14983 -10746 3424 14572 11730 -1998 -13872
2272 -13872 -12863 -387 12881 13763 2128 -10983 -14221 -3975 10196 14697 5523 -8367 -14509
2285 -14509 -7109 6889 14679 8748 -5038 -13765 -10088 3377 13539 11234 -1166 -12745 -12249
2298 -12249 -553 11396 12933 2657 -10088 -13686 -4400 9050 14245 5984 -7232 -14256 -7919
2311 -7919 5764 14239 9336 -3942 -13797 -10792 2209 13124 12327 -124 -12593 -12924 -1536 11628
2325 11628 14198 3173 -10416 -14651 -5362 9106 14996 6897 -7761 -14954 -8325 6048 15036
2338A5036n314j4371r867L724J3490J1351k399j2950j1747L7J2671J2994J108
2351A3763j1494j3005l495J0243J3721M903r018j4088o060P364J3842P497n400
2364H773j3844r105L997J3729J0098k699j2546j1205Q82J1921J1952P48j0743
2377A958j2601k387R215J3300M532q656j3315n703O846J3436O995n463j3064q420
2391a3327L954J2509R746k487j2199j0394Q69J1242J1357R10j0693j1830k437
2404a2780R689J2345L827p941j2962n561P130J2766O640n285j2929p580L657J2270
2418C286R327k344j1999j0163N16J1469J0841P88r765j2099k317R137J2033M084
2432A2794p941j2538n284O506J2406O972n136j2631p582L624J1745R245k336j1301
$$ plain form
2338 15036 9722 -4649 -14516 -10792 2698 14049 11650 -1300 -13047 -13010 -339 12655 13763
2351 13763 2269 -10736 -14231 -3988 9733 14636 5618 -8470 -14530 -7166 6676 14173 8773
2364 8773 -5071 -14176 -10179 3550 13648 10949 -1597 -12802 -11920 1 11953 12701 1958
2377 1958 -10643 -13030 -3815 9485 14017 5361 -7954 -13657 -6811 6625 13620 8157 -4907 -13327
2391 -13327 -9373 3136 12882 10395 -1804 -12198 -11329 -87 11270 12180 1487 -10343 -12780
2404 -12780 -3091 9254 13081 5140 -7822 -13383 -6253 6513 13153 7868 -5061 -12641 -8984 3286
2418 3286 12613 10269 -1730 -11893 -11377 92 10933 11721 1956 -10143 -12460 -3323 8710 12794
2432 12794 4853 -7685 -12969 -6463 5943 12915 7779 -4852 -12434 -8810 2935 12180 9844 -1457
2446a457j0072O32J0714J0692J168r492j1824k902Q947J1911M554p823j2381n907
2460a3240O423J2608O966m456j2654q505L618J2213R437j540j1990j0511Q9J0893
2474f49J1844J255j0242j1820l324R360J2675L948p640j2889n964O979J2408P139
2488A3080n164j2703p937L906J1963Q979k108j1621r794L16J0898J0850Q65r700
2502A830j1526k535Q747J1633M129p128j2358n212N808J2084O938m517j1794q320
2516a2221K898J1916R072j340j1020j0331j51J0093J1164J691r205j1802k843
2529a2079Q163J1667M945p139j1953o344N922J2190P008m032j1988q806K995J1769
2543B318R463j230j1408j0259k94J0655J1172J496r713j1770l030Q653J2622L862
$$ plain form
2446 -1457 -11529 -10897 -183 10509 11677 2185 -9639 -12541 -3594 8317 12871 5048 -7333 -13240
2460 -13240 -6817 5791 12757 8301 -4353 -12858 -9240 2973 12410 10870 -1120 -11631 -11542 -649
2474 -649 11195 12450 2208 -9612 -12936 -3576 9099 13047 5407 -7482 -13446 -6467 5941 13080
2488 13080 7916 -4787 -12724 -8818 3145 12124 10016 -1605 -11399 -11083 -185 10665 11530 1830
2502 1830 -9696 -12231 -3484 8149 12278 5150 -7208 -12420 -6612 5472 12410 7893 -3901 -12221
2516 -12221 -9323 2593 11665 10325 -695 -11026 -11177 -1084 10080 11771 2566 -9236 -12079
2529 -12079 -3916 7751 12696 5557 -6396 -12740 -6818 5372 12380 8348 -3640 -12446 -9451 2318
2543 2318 11781 10551 -857 -11116 -11410 -755 10417 11913 2200 -9570 -12600 -3947 8675 12537
2557A2537p467j2148n761O156J2295P016m687j2056q006L064J1419R526j863j0845
2571h20j0369L59J0450J0533J005r215j1428k036Q274J1005L997p091j1430m957
2585a1723N547J1016O821m708j0850p526L090J0954P973j403r945r429J95R307
2599f81R807J897q677j0493k949P116J1330M300o362j1066n771M812J1328O765
2613A1356l394j0893q525K555J0468R007n63j0195r948o30R362J0698J919q589
2627B628j0979l620P895J1464M822p062j1604n552N614J1430O854l881j1854p737
2641a1582L101J0800Q946j800j0519r663K12J0097J0470J026r157j1027k650Q597
2655c149J0930L958o951j1617n228N810J1616O688m991j1213p599L468J1169Q457
$$ plain form
2557 12537 5070 -7078 -12839 -6683 5612 12628 7941 -4115 -12121 -9057 2362 11888 10025 -820
2571 -820 -11189 -10830 -380 10153 11158 1943 -9485 -11521 -3247 7758 11755 4664 -6766 -11723
2585 -11723 -6176 4840 11661 6953 -3897 -11423 -8333 2621 10594 9191 -754 -10183 -9988 -681
2599 -681 9126 11023 2346 -8147 -11096 -3980 7350 11650 5288 -5778 -11549 -6737 4591 11356
2613 11356 7962 -2931 -11456 -8901 1567 10574 10011 -184 -10132 -10762 -1400 9298 11217 2628
2627 2628 -8351 -11971 -4076 7388 12210 5148 -6456 -12008 -6394 5036 11890 8009 -3845 -11582
2641 -11582 -8481 2319 11265 9465 -1054 -10717 -10505 -408 10062 11088 1931 -9096 -11746 -3149
2655 -3149 7781 11739 4788 -6829 -12057 -6247 5369 12057 7066 -4147 -11746 -8278 2891 11348
2669A1348j975j0569r426M74R933J0170Q08r237j0900j653Q242J0862L455p082
2683D450j1575m803O516J0997O037m986j0938p503L906J0924Q119k318j0738q742
2697a0654R79R833R822L68q854j0811j803Q423J1222K752p283j1159m778O513
2711e430J1192N669m771j1213o711L526J0994P797k393j0204q762R84R408R611
2725I697L19q682j0105k115Q374J0418L131p080j0502m418N289J0890O068m761
2739F523j0729o652L115J0208P970j847r812q965O23R412R460R20q438j0328k338
2754a0878P501J0833L714o642j0645n311N494J1093O426m561j0756p380K895J0424
2768B207Q592j485j0228r584M32R438J0123R69q711j0167k514P759J0662L763
$$ plain form
2669 11348 9373 -1196 -10622 -10148 -215 9955 10763 1526 -9374 -11027 -2785 8077 11532 4450
2683 4450 -7125 -11928 -5412 5585 11622 6636 -4302 -11805 -7899 3025 11144 8826 -1912 -10654
2697 -10654 -9675 158 9980 10348 1494 -9317 -11120 -2697 8525 11277 3994 -7165 -11943 -5430
2711 -5430 5762 11431 6660 -4553 -11264 -7738 3256 11053 8660 -1544 -10306 -9322 86 9697
2725 9697 10016 1334 -8771 -10886 -2512 7906 11037 3957 -6545 -10963 -5674 5216 11284 6523
2739 6523 -4206 -10858 -7743 2465 10435 8588 -1224 -10189 -9566 -154 9306 10226 1788 -8540 -10878
2754 -10878 -3377 7456 11170 4528 -6117 -11428 -5934 5159 11585 7024 -3732 -11112 -8217 2207
2768 2207 10799 9314 -914 -10498 -10066 -628 9495 10464 1753 -8414 -10928 -3169 7493 11256
2782A1256o593j0843m788N292J0633O011l868j0730p254L052R772Q451j541r348
2796d98r060j12R011R500J268p821j0120k813O851J0276M534n990j0717m889M157
2811f423J0419O578l143j0095p678J782R823Q648m35r091r526r72Q527R821K565
2826A0800p795j0562l189O294J0593M903n418j0508o426M239J1001O855k854j0638
2840b705p920K002R770R217o59r517r980m95Q612J0374K213q086j0532l486P160
2855d032J0938M384n719j0697o223M974J0770O665l361j0792p482K141J0102Q397
2869A0065j150r258q910m26Q995R081J414p243r930l072O999R647M068n507r707
2884d934n324M572R583O246l038r534p328K117Q894P934l97q459q700p66P690
$$ plain form
2782 11256 4663 -6180 -10968 -5676 4957 10968 7100 -3630 -10884 -7832 1940 10391 8850 -498
2796 -498 -9558 -9670 -659 8841 10109 2288 -7832 -10645 -3794 6482 11016 5026 -5691 -10580 -6423
2811 -6423 3996 10574 7431 -2664 -10342 -8560 1263 9911 9476 385 -9141 -10113 -1586 8235 10800
2826 10800 3005 -7557 -10746 -4452 6141 11044 5626 -4882 -11308 -7069 3932 10787 7933 -2705
2840 -2705 -10625 -8623 1147 10364 9705 188 -9792 -10287 -1675 8699 10912 2826 -7706 -11192 -4032
2855 -4032 6906 11290 5571 -5126 -11349 -6375 4395 11060 7699 -3093 -10575 -8434 1668 10065
2869 10065 8915 -343 -9253 -9679 -684 8397 9811 2568 -7362 -10434 -3435 6212 10280 4773 -4934
2884 -4934 -10258 -5686 3897 10143 7105 -2429 -9757 -7640 1254 9188 8791 332 -8368 -9134 -1444
2899a444Q997K269p220r510l044N767R793M766n436r393n830L869R868O304k576
2914G180r378p687J933Q917Q200l5q725q857j039P996R141K061o804r505l511
2929a0113O155R598M469m885r876n409L989R725O156k661r424p190J612Q856P903
2944H905l65q306q760n86P915Q782K034o668r850l121N711R900M728n151r904
2959d736n055L637R455O261k532r011p563J640Q599Q145l90p876q651q72P393
2974a556Q995J806o677q950l348O061R112M325m835r364n249L772R407O098k548
2989G049r254p071J526Q501Q178k34q550q376j019P809Q917J955o793r282l224
3004i868O140Q977M461m748r159n394L558R114O170k498q649o697R86Q442P705
$$ plain form
2899 -1444 7553 9822 2602 -6908 -9952 -4185 5608 10374 4938 -4455 -10285 -6416 3452 9756 7180
2914 7180 -2198 -9885 -7952 965 9165 9130 405 -8452 -9491 -1495 7646 9707 2903 -6602 -10113
2929 -10113 -3958 5640 10109 5224 -4652 -10061 -6072 3653 9809 7148 -2276 -9466 -7854 1002 8905
2944 8905 8540 234 -8526 -9112 -1197 7585 9619 2951 -6899 -10020 -4309 5591 10319 5168 -4736
2959 -4736 -9791 -6154 3301 9562 7030 -1981 -9544 -7904 695 8840 8450 574 -8077 -8949 -1556
2974 -1556 7439 9245 2568 -6382 -9730 -3669 5443 9768 4933 -4431 -9680 -5908 3499 9597 7049
2989 7049 -2205 -9276 -7750 751 8929 8695 145 -8231 -9250 -1441 7476 9431 2638 -6644 -9868
3004 -9868 -3728 5249 9710 4962 -4197 -9591 -6033 3081 9251 6753 -1896 -8593 -7607 835 8540
3019H540p07p527q049q61O844Q585K148o260q841l107N574Q426M354m253q821
3034c955n005K872Q896O037k071q371o823P99Q028P656J25p277q275j204O719
3049a849Q223K861o098r079l402N130Q950M418l866q955n727K954Q998O189j965
3064F782q262o866O68P808P446N42p026q169j369O582Q270K035n241q551l531
3079h882N102P831M633l842q102n109K720P776O169j838p718o606P86P035O956
3094F911L59o055p557j483N529P761K921m995q025l775L830Q216M783l049q021
3109b650n223J699P490O271r46o718o917l98O658P207J419n858p526k550M795
3124c247Q059L451m186q237m114L200Q015N167k225p912o175J508P890O336k83
$$ plain form
3019 8540 7833 306 -7743 -8604 -1760 6825 8973 2713 -6128 -9235 -3661 4765 9119 4866 -3955
3034 -3955 -8960 -6088 2808 8845 6774 -1597 -8420 -7621 407 8063 8188 911 -7364 -8568 -1849
3049 -1849 6374 9235 3137 -5942 -9344 -4214 4736 9154 5288 -3667 -9394 -6440 2558 8747 6782
3064 6782 -1480 -8346 -7678 130 7576 8118 1092 -7077 -8446 -1864 6406 8441 3200 -5351 -8882
3079 -8882 -3780 4051 8684 4842 -3260 -8369 -5649 2127 8296 6458 -1260 -7866 -7080 -45 6911
3094 6911 7270 1215 -6342 -7825 -2296 5465 8386 3391 -4634 -8409 -4579 3637 8420 5371 -2650
3109 -2650 -7873 -6174 1316 7587 6641 -77 -6994 -7392 -734 6473 7892 2034 -5492 -8042 -3247
3124 -3247 4812 8263 4077 -4160 -8274 -5074 2941 8108 5883 -2029 -8204 -6696 1194 7530 7247
3139G247p097p511k69O522P831J624o314q119k424N411Q136L393m332q304m134
3154h340L466Q212N023k754p964n742J692P627O452q47p242o730j65O694O994
3169F376J183n997p280j825N137P465K848m330p544l810L478P420M492k535p161
3184b083n393J714O803O025q50o373o538j82N996O820J372n712p053j874M634
3199b694P163L091l876p117m186L184P408M379k204p197n187J493O931N771o74
3214F285o605n975n64O123O538J022n210o820k170M625P308K347l462o834m081
3229g473L321P177M020j907p097n097J454O582N785l69o510o278k61N600O746
3244E693J197n341o423k351M709O871L045l835o847m058K894P032M706k380o718
$$ plain form
3139 7247 150 -7361 -7630 -1108 6723 8347 2033 -6086 -8510 -3099 5037 8430 4098 -4206 -8340
3154 -8340 -4874 3338 8361 5607 -2357 -8099 -6407 1220 7672 6825 -417 -7147 -7312 -618 6376
3169 6376 7559 1562 -5718 -7543 -2406 5059 7907 3577 -3967 -7777 -4299 3121 7613 5078 -2083
3184 -2083 -7476 -5762 1041 7066 6216 -157 -6695 -6877 -881 5939 7311 1599 -5454 -7328 -2694
3199 -2694 4469 7560 3684 -3433 -7619 -4435 2973 7352 5148 -2049 -7236 -5743 1188 6959 6285
3214 6285 -320 -6295 -6859 -736 5802 6824 1614 -5206 -7376 -2751 4557 6904 3442 -3392 -7473
3229 -7473 -4152 3025 7045 5138 -1959 -7056 -5602 980 6765 6396 -114 -6392 -6653 -1053 5693
3244 5693 6890 1549 -4874 -7225 -2516 4355 7400 3565 -3282 -7340 -4446 2586 7292 4912 -1806
3259a806m822J309N964N666j94n819o249l28N240O294J596m862o588k310M148
3274b761O604L104l311p003l829K689O857M590j868o559n208J057O156N792l25
3289E985n803n987q84N666O548J312m718o728k527M569O298L233l427o440m120
3304g023K938O371M419j533o554m911P62O067N659j47n658n734j086N204O039
3319D813J677m301o503k389L835O167L292k564o734m014K236O147M869j268o202
3334i39n293L66N967N696N35n638o147j155M851O587K156m445o826k485L414O705
3350C349L765k961o669m349K110O527M856j528o009n371Q60N761N437N21n637
3365F62n773j098M848O141J592m081n949l046L601O263L064k419o487l755J845
$$ plain form
3259 -1806 -6628 -5319 645 6311 6117 298 -5951 -6279 -1039 5255 6851 1989 -4599 -6909 -2761
3274 -2761 3843 6947 3636 -3367 -7196 -4507 2350 6940 5072 -1487 -6695 -5638 518 6310 5985
3289 5985 182 -5805 -6689 -1023 5525 6837 2119 -4609 -7136 -2567 3731 6964 3537 -2903 -7023
3304 -7023 -4085 2286 6705 5172 -1382 -6293 -5531 536 6195 6048 390 -5344 -6430 -1226 4813
3319 4813 6490 2189 -4314 -6703 -2868 3299 6591 4027 -2707 -6721 -4485 1662 6531 5263 -939
3334 -939 -6232 -5866 101 5797 6332 694 -5453 -6608 -1757 4830 6986 2541 -4285 -6770 -3356 3349
3350 3349 7114 4153 -2516 -6865 -4755 1772 6628 5100 -909 -6280 -5420 341 5778 6299 662
3365 662 -5111 -6209 -1361 4780 6372 2291 -3658 -6704 -3103 3160 6224 3805 -2682 -6437 -4592
3380d592O186M499j181n706m534Q2N172N354L93m906n573j211M361N500K195l468
3396B571n793k962K870N967L405k179n599m037J328N095N001q11n135m854k74
3411e407M460N328J208l845n697j879L673N533K351k644n750l390K398N702L773
3426E814j533n855m280Q73N635M763m3n119n416n09M748N527J251m124n838k062
3442f168L505O131K919l525n754l406K510O223L621j726n717m602J225N627M642
3457E505p2n242n494k76M875N383Q95m114n573j902L474O087K264k828n757l059
3473e834K426N238L907j704n241m335Q38N280M744j94n052m842o02M258N585J181
3489E653l879n506k078L497N604K556k809n817l156K228N673L702j360n208m596
$$ plain form
3380 -4592 1594 6093 4912 -794 -5328 -5246 -74 5280 5673 767 -4806 -6017 -1656 3844 6039 2571
3396 2571 -3222 -6184 -3314 2653 6058 3879 -1720 -5757 -4429 666 5667 4856 -279 -5133 -5407
3411 -5407 -947 4381 5589 1744 -3953 -5832 -2159 3374 5725 3081 -2669 -6059 -3661 2041 5814
3426 5814 4281 -1574 -5854 -4981 654 5417 5374 255 -5161 -5670 -922 4605 5856 1732 -4106 -6168
3442 -6168 -2663 3468 6387 2862 -2892 -6298 -3788 2435 6056 4330 -1387 -5989 -4764 863 5505
3457 5505 5433 191 -5303 -5579 -704 4679 5574 1460 -4113 -6015 -2541 3546 5810 2982 -2775 -5834
3473 -5834 -3408 1830 5737 4033 -1208 -5543 -4705 575 5319 5125 73 -4769 -5371 -1113 4472 5653
3489 5653 1774 -3732 -5810 -2313 3291 5847 3038 -2779 -5935 -3707 1966 5668 4308 -900 -5496
3504e496R33M918M740j41m657n034p68M495N113J633m010n425j965L189N559K714
3520E798k871n434l127K058N632L350j189n366m289P81N114M711o4m920m921l94
3536e131M240N002J348l535n510k107L221N478K793k822n385l319K117N241L697
3551E328j189m997m014M30M420N030K4m545m705r87L840N485J410l466n382k299
3567e617K890N488K629k351n175l014J118N461M125j557m522m441N07M617M587
3582D745J45l915n162j056L947M835J917l194n568j978K523N123K757j858n084
3597a823l406J266N024M014r02m639m202K04M254M190Q05l572m703j390L235M737
3613C092J803k428m603k907K159M656L242j518m622l679Q58M597M060l62m186
$$ plain form
3504 -5496 -4563 355 5095 4954 297 -4737 -5505 -1010 4103 5736 1726 -3699 -5664 -2475 3084 5798
3520 5798 2927 -2507 -5634 -3576 2056 5406 4217 -1149 -5438 -4657 457 5168 5104 184 -4737 -5131
3536 -5131 -891 4111 5459 1924 -3586 -5693 -2472 3006 5799 2977 -2408 -5727 -3610 1631 5328
3551 5328 4139 -858 -4872 -4442 -22 5008 5032 487 -4218 -5205 -1365 4120 5530 2064 -3318 -5617
3567 -5617 -2727 2761 5390 3039 -2136 -5150 -4032 1429 5554 3997 -525 -4966 -4459 158 4745
3582 4745 4890 975 -4187 -5243 -1296 3539 5456 2262 -3306 -5284 -2761 2362 5119 3261 -1823
3597 -1823 -5229 -3963 1061 5075 4173 -466 -4668 -4464 -210 3980 4785 1213 -3490 -4880 -1645 3092
3613 3092 4895 2467 -2136 -5043 -2884 1772 5014 3496 -1126 -4805 -3947 650 4710 4348 162
3628A62m583j61L577M707J075l349m774k045L271M993K398k525m954l080K092
3643c196M797L587j546m873l536N24M617M486m82m263m358p87M107M473J437l419
3659A568n066j486K904M896K256k426m882k815J691M792L415j309m505l719O06
3674d080M554L781l3l794m199n95L443M477J137l135m727j666K637M796K266k161
3690B701m527k765J403M294L422r66m167l568K70L642M359p3l413l981j018L123
3706a264M472J346k561m370k120K179M358K709j749m324l215J349L903L522n29
3721C706l844l684j18L856L869M10l568l979j250L111M701J588k861m153k320
3736d536K054M358K673j587m302k999R57M484L141p16l700l853K2L746L944N74
$$ plain form
3628 162 -4421 -4582 -1005 3702 4777 1428 -3346 -5391 -2120 2873 5271 2746 -2208 -5288 -3196
3643 -3196 1601 5188 3642 -1231 -4767 -4243 374 4860 4378 115 -4243 -5030 -923 3550 4987 1568
3659 1568 -3498 -4984 -2080 2816 5072 2646 -2236 -5051 -3360 1432 4847 3538 -967 -4686 -4080
3674 -4080 474 4255 4222 428 -3771 -4366 -923 3554 4691 1556 -3171 -4837 -2200 2596 4862 2701
3690 2701 -1826 -4591 -3188 1106 4528 3562 -605 -4173 -3903 -261 4098 4025 612 -3369 -4387 -1264
3706 -1264 3208 4554 1993 -2377 -4497 -2318 2040 4749 3000 -1324 -4539 -3190 713 4235 3706
3721 3706 -138 -3822 -3940 -84 3785 4195 627 -3352 -4602 -1491 3210 4798 1937 -2216 -4536
3736 -4536 -2482 1876 4549 2962 -1340 -4339 -3382 1102 4243 3527 -173 -4026 -4004 -258 3686 4260
3752D260l427m167q80K817M062J710k377m540j781J836M561K261j649l979k887
3767d180Q92M119L292k27m189l464j02L463M082O18l494l896j354K955M357J435
3783D307k332l919k613J995M375K532j544m168k741O56M086L558n39l735l590
3798c672l27L453L840Q94l140m218j249K891M446J473k414m129k209J933L930
3813A502K839j490m019l001R49M003L211k12l714l923L3L164M038Q58l037m335
3829c134j048K710L848J830k127m080k381J630M047K907j005m259l142J017L562
3844C75L357k4l568l594o17L414L909Q57k862l806j554K263M072K108k178m232
3860b080j797J299L866K735j100l680l379R04L542L373R5l944l055p14L081L893
$$ plain form
3752 4260 833 -3334 -4214 -1397 2665 4375 1998 -2542 -4323 -2487 2074 4335 2686 -1293 -4180
3767 -4180 -3288 831 4123 3896 -293 -3757 -3859 -396 3686 4304 810 -3086 -4440 -1485 2872 4307
3783 4307 1975 -1944 -4557 -2562 1813 4345 2801 -1367 -4108 -3452 634 4192 3653 -82 -3672
3798 -3672 -3999 -546 3294 4188 1048 -3170 -4419 -1528 2918 4391 1977 -2152 -4361 -2428 1502
3813 1502 4341 2851 -1168 -4169 -3220 783 3994 3782 68 -3855 -3822 -658 3380 4238 1201 -3134
3829 -3134 -4182 -1472 2376 4206 2079 -2001 -4382 -2752 1295 4202 3197 -1062 -4204 -3187 375
3844 375 3732 3708 140 -3454 -4071 -657 3252 4109 1247 -2559 -4113 -1850 2222 4330 2152 -2080
3860 -2080 -3877 -2578 1288 4023 2923 -757 -4136 -3232 310 3683 3778 -166 -3221 -3935 -854 3039
3876C039J082k733m263j288K252L771K158j973l788k243J498L768K294m81l556
3891d63l215M21L393L183J21k900l619m71K626L424J235k342l521j866K145L542
3907A693K072j294l446k649Q02L638K592l59l180l465K77K981L595M15k855l316
3923b499j195K083L889J736k084l883j850J477L761K619j338l445l186Q39L522
3938D46L078j64l422l497j94L088L622Q86k880l720j274K405L801J535j637m016
3954a943j998J638L617K462j478l317k651R44L169L103j29l640l040j32L060L322
3970B987P72k766l807o58K138L334J850k138l507j826J399L516K268r37l635k424
3986c434O84L110K845j36k988l132j20K684L075P35k037l850o99J695L410J747
$$ plain form
3876 3039 4121 1388 -2875 -4163 -1911 1860 4018 2045 -1743 -3986 -2488 1280 3574 3093 -463
3891 -463 -3678 -3257 136 3319 3440 540 -3079 -3550 -924 2500 3735 1393 -2128 -3994 -1849 1693
3907 1693 3765 2471 -975 -3624 -2822 816 3408 3049 -131 -3596 -3319 -338 3257 3672 817 -2499
3923 -2499 -3694 -1611 2278 4014 1930 -1953 -3803 -2326 1435 4054 2716 -729 -3915 -3076 446
3938 446 3524 3360 -62 -3559 -3753 -665 2957 3843 963 -2757 -4031 -1626 2175 3710 2073 -1943
3954 -1943 -3941 -2303 1314 3776 2298 -1019 -3670 -2726 443 3546 3417 -223 -3263 -3395 -335 2987
3970 2987 3759 993 -2814 -3472 -1334 2000 3850 1712 -1795 -3621 -2222 1294 3562 2625 -1010 -3434
3986 -3434 -2750 360 3205 3069 81 -3051 -3171 -487 2588 3323 1286 -2564 -3263 -1568 1842 3589
4002C589j881l079k189J265L273K627q68l351k605J23L291K984K09l308k920n90
4018c430K591L426O39k207l240j267J778L683J812j766l398k311J517L147K499
4033C473q04l332k908N74L255K591L35l098k869n00K404L488N89k010l326j419
4049c557K000L059J948j536l371j902J195L210K270q02l028k636M72K838K912
4064C072K4k619l163o27K495L040J130k257l183j709K412L234J628j555l319k055
4080c452J144L206K563r88k982k576K91K793L013l9k642k826r08K664L052J064
4096C377k096l395j164J574L147J816j318l049k355J073L021K369m71l222k460
4111c153K00K830K944J16k527k962q73K500L038J328k072l070j375J485L234J620
$$ plain form
4002 3589 1708 -1371 -3560 -2295 978 3605 2737 -614 -3219 -3096 195 3179 3388 80 -2840 -3430
4018 -3430 -839 2587 3226 1019 -2221 -3488 -1710 1973 3785 2019 -1379 -3690 -2173 974 3473
4033 3473 2669 -663 -3571 -2997 258 2849 3184 86 -2783 -3283 -879 2609 3198 1188 -2138 -3557
4049 -3557 -1557 1502 3450 1914 -1457 -3359 -2164 1046 3316 2514 -514 -3150 -2678 160 3072
4064 3072 3096 477 -2686 -3313 -818 2222 3352 1095 -2088 -3797 -1385 1849 3477 1922 -1397 -3452
4080 -3452 -2308 898 3461 2473 -509 -3085 -2794 -1 3012 2973 331 -2495 -3403 -739 2313 3377
4096 3377 1281 -2114 -3278 -1704 1443 3259 1941 -1108 -3463 -2390 631 3000 2529 -693 -3153
4111 -3153 -2953 -123 2821 2937 410 -2552 -3425 -925 2113 3441 1369 -1701 -3076 -1591 1643 3263
4127C263j199k807k566J006L027K172k34k898k799J41K693K915M96k761l015p39
4143c305K392L178J065j999l197j442J686L200J388p77l245k068P25L035K285
4158B921l59k835k662k9K708L120K15k395l190m05J737L239J073j979l093j262
4174c196J487L028J846j282k924j884P35K696K332m84k530k395M21J902K486M91
4190B729k067k676o95J716K770J338j846k639j603J286K868J870r29k937j868
4205b683N62K639K010n4k683k069j96K192K407Q27k116l006o69J622K853J304
4221B940j493k790j673J328K668K021q96k775k383P82K424K340r6k513k110l10
4237b536J972K715N37k011k513q89J444K737J304j289k764j325J197K346J910
$$ plain form
4127 3263 2064 -743 -3309 -2303 724 2896 2662 -236 -3035 -2894 -201 2714 3210 449 -2566 -3305
4143 -3305 -913 2265 3330 1331 -1866 -3308 -1622 1578 2966 2189 -1056 -3124 -2399 636 2921
4158 2921 2562 -273 -2935 -2964 -256 2864 3079 684 -2506 -2911 -1174 2065 3138 1159 -1934 -3196
4174 -3196 -1709 1319 3165 1883 -1041 -2925 -2190 506 2838 2354 -176 -2571 -2150 -248 2238 2729
4190 2729 662 -2014 -2709 -993 1777 3115 1269 -1370 -2973 -1687 1181 3051 2122 -815 -2683
4205 -2683 -2121 518 2528 2474 -209 -2278 -2474 -282 2125 2952 836 -2170 -2839 -1217 1636 2940
4221 2940 1447 -1343 -3016 -1688 980 3001 2105 -670 -3053 -2271 153 2493 2397 -116 -2226 -2536
4237 -2536 -564 2151 2688 677 -1836 -2725 -1281 1456 2760 1471 -1293 -2618 -1421 925 2835
4252B835p53k815j866L49K711K083l44k192k194k88K162K600K24j667k750p88
4268b693J568K656J166j399k502j435R12K816J652j014k146k190N17K740J734
4283B382k02k275k240p7K021K500M27j898k136j392J723K788J060j552k733j217
4299b821J247K467J871j056k481j851N26K411K172l91k160k364R8J859K720M16
4315B663k064k315j096K063K616Q99j496k650j274J002K795J346o88k419k053
4330b671M15K626K131k23k355k002k24K086K249L95j640k524q78J814K556P97
4346B552j281k683j034J001K556J472r47k356j804P26K330J741k41k273j851j79
4362b271K014K251M36j931k496l12J638K249R26j714j855j553J304K372J329q31
$$ plain form
4252 2835 2082 -733 -2599 -2250 461 2544 2200 8 -2186 -2474 -312 2288 2512 845 -1905 -2693
4268 -2693 -1125 1531 2697 1298 -1204 -2639 -1727 1089 2741 1727 -419 -2609 -2092 648 2382
4283 2382 2180 -95 -2335 -2412 -391 2109 2536 638 -1498 -2890 -1167 1621 2681 1129 -1604 -2821
4299 -2821 -1574 893 2764 1708 -773 -2624 -2098 313 2485 2094 -66 -2430 -2332 -473 2247 2663
4315 2663 599 -1716 -2812 -749 1867 2766 1270 -1380 -2654 -1652 1143 2489 1801 -618 -2671
4330 -2671 -2256 370 2501 2278 -77 -2079 -2303 -217 2032 2427 787 -1737 -2615 -801 1755 2552
4346 2552 1271 -1412 -2446 -1445 1111 2583 1636 -720 -2524 -1798 532 2273 2032 -241 -2092 -2271
4362 -2271 -257 1994 2430 499 -1997 -2309 -671 1578 2504 790 -1065 -2618 -1314 1058 2387 1556
4378A556k391j426N66K334J530l40k082j891k2K178J885L26j776k098n93J493
4394g51K165R46j612j899j209J413K058J218o10k456j655P68J815K122n29k165
4410c81j670k73K216J942L13j638k092m58J443J914P53j102k095j221J086K367
4426A104J113r55j971j279L06J908J805q9j808j997k29J685K242J83j566k076
4442a624m13J114K150R11j378j891j051Q21K410J312r52k016j485M25K072J793
4458B198m44j794k000J79K026J684L2j563k066r8J228K236N18j398k038o07J022
4475h85K003Q86p19k170r30L82J874J331L7k100j628K77J472K085k97j186j734
4492a302o36J418J877P65j334k101n91R59J955J055q77j629j238M72J639J286
$$ plain form
4378 1556 -835 -2261 -1695 639 2169 1829 -253 -2144 -2166 12 1897 2223 447 -1651 -2244 -751
4394 -751 1414 2360 748 -1151 -2360 -947 1111 2329 1719 -737 -2392 -1624 191 2313 1784 -381
4410 -381 -2051 -2324 -108 1834 2147 509 -1583 -2041 -598 1316 2069 967 -1128 -2349 -1263 1104
4426 1104 2217 1262 -709 -1988 -1682 226 2031 1942 134 -1863 -2092 -407 1835 2018 452 -1624
4442 -1624 -2037 -923 1227 2138 760 -1131 -2182 -1361 1049 2361 1409 -607 -2092 -1667 405 2198
4458 2198 1754 -40 -2040 -1861 165 1849 1881 318 -1748 -1846 -618 1618 2136 738 -1300 -1907 -885
4475 -885 1118 2004 1285 -885 -1815 -1433 441 1772 1809 -291 -1919 -1642 -170 1915 1618 432 -1302
4492 -1302 -1938 -520 1357 2122 788 -1313 -1904 -945 1010 2065 1188 -441 -1679 -1207 432 1718
4508A718o6j927j062r4J301J750k41j182j550n60J339J780L38p92j811p02R08
4525h53J896O66o26j639j348M22J800J321N2j836j608J03J854J416k1j506j634
4542a541J06Q79J612Q06r24j891p02P85J999O00q94j539j188N95J720J189j58
4559A454j710j369L43J479R99K5j234j488p3J128J663M09j181j629m90J043J401
4576G70Q79q46j310j278O09J806J058l97j653j060K07J309J581k21j374j329k14
4593a463J118J574M55j344j344p29R62J730R33r35j785q16P24J517J071l35j819
4610d86j286M65J676J211k10j581j456p2J743J390N7j217j407m19J161J470O03
4627A642r32j469p24P54J225R10n44j487j072P74J392R44l1j791p74K6J071J478
$$ plain form
4508 1718 1652 -275 -1337 -1431 -130 1620 1379 197 -1353 -1913 -574 1206 1544 752 -1059 -1761 -853
4525 -853 1043 1709 1083 -556 -1904 -1482 318 1639 1691 -145 -1753 -1650 204 1620 1599 93 -1541
4542 -1541 -1435 -556 1056 1862 938 -953 -1655 -870 1129 1729 835 -704 -1892 -1297 423 1612 1454
4559 1454 -256 -1625 -1282 197 1196 1221 -13 -1501 -1574 -446 1217 1626 445 -1184 -1674 -631 770
4576 770 1649 803 -507 -1785 -1176 630 1688 1291 -362 -1422 -1215 94 1675 1454 80 -1249 -1463
4593 -1463 -345 1229 1684 340 -1004 -1733 -771 959 1892 957 -828 -1644 -920 597 1668 1333 -486
4610 -486 -1772 -1307 369 1580 1370 -211 -1667 -1739 4 1394 1451 234 -1173 -1592 -431 1039 1642
4627 1642 710 -759 -1483 -729 496 1406 862 -625 -1697 -923 469 1413 1382 -409 -1183 -1157 -86 1392
4645A392J46j328j377l37J291J289O38j080j586q02J008J749P09q45j579q78O33
4662i57J460J078o07j472r59M06J076J349o6j224j309m42J481J381K02p64j583
4679i50p32J093J395O38o92j723m52M76J474J028p97j150j079L86J357J065L2
4696A369j149j602O9J270J201L07r69j661m80J169J438N84o73j821m17N50J554
4713G39R22r31j069j196N12J214R37L38j481j440L06R15J602O2j337j291m11J326
4731b83J191N77o71j825p08R68J220J213n25j842p86K71J508J285l87j534j091
4748a419O2J242J484K90j386j390l70J263J228L81p04j730n13R77J241R97q35
4765H18j684o29O14J268J138m99j311r67j9J491J103j79j036j194k40J124J498
$$ plain form
4645 1392 1538 210 -1167 -1504 -213 1076 1714 634 -952 -1754 -746 1003 1712 867 -712 -1590 -957
4662 -957 503 1581 974 -498 -1457 -1051 25 1374 1308 84 -1225 -1667 -186 1195 1397 633 -950
4679 -950 -1682 -589 806 1444 752 -971 -1423 -947 527 1555 758 -392 -1471 -1085 272 1337 1369
4696 1369 220 -1382 -1313 -43 1158 1465 496 -1165 -1645 -476 962 1546 873 -948 -1365 -815 739
4713 739 1661 730 -339 -1535 -1023 191 1128 1466 -15 -1455 -1149 -234 1368 1430 93 -1198 -1609 -283
4731 -283 908 1485 814 -1011 -1719 -751 469 1682 1157 -685 -1471 -1200 308 1593 1206 -328 -1419
4748 -1419 -1357 -115 1369 1659 273 -1117 -1487 -224 1004 1385 681 -1049 -1562 -585 656 1653 818
4765 818 -866 -1495 -881 387 1525 1026 -285 -1252 -1271 220 1323 1144 108 -1086 -1326 -202 1296
4782A296J99j123j606p0N58J618O75q21j497n60O45J345Q87m03j554j285K94J564
4800A62J387k06j312j308j48J213J373L88j270j432m68Q38J938P49j213j538n68
4817a415J46J950R61m13j621j146L37J478J217N1j573j752J93J768J363j06j282
4834A56j506l00J079J694P00j298j367j035J159J639Q57o89j777r69O76J698R35
4851A652n28j620j068L61J444J255j25j279j252m02J244J729K66j091j948n02
4867a864J216J633O43o61j891o93O09J483J134o07j195j387J32J576J465M2j396
4884B39j938n0J589J348N70r89k149m91J212J629Q94j142j582j120O24K139P90
4901A573k47k082j151L79J624J592m4j412j862j15J662J670L88j152k313l69J059
$$ plain form
4782 1296 1495 372 -1234 -1304 -746 872 1547 726 -771 -1331 -686 659 1546 1143 -411 -1696 -1402 162
4800 162 1549 1343 31 -1277 -1425 -212 1161 1549 279 -1153 -1621 -783 1155 1904 691 -847 -1415
4817 -1415 -1269 681 1642 1229 -392 -1538 -1201 277 1494 1545 -28 -1780 -1587 181 1544 1438 156
4834 156 -1350 -1650 -571 1123 1823 525 -842 -1877 -718 921 1778 1089 -688 -1657 -981 717 1652
4851 1652 1124 -496 -1564 -1203 241 1496 1371 92 -1160 -1562 -318 1411 1677 586 -1362 -1864
4867 -1864 -648 985 1628 967 -924 -1617 -1008 475 1609 1002 -193 -1580 -1448 128 1593 1635 239
4884 239 -1699 -1749 -160 1188 1758 769 -1380 -1871 -659 970 1864 722 -860 -1980 -1356 783 1573
4901 1573 1326 -756 -1907 -1528 96 1688 1644 232 -1630 -1745 -83 1587 1975 823 -1490 -1859 -800
4918h00K270M62r86k020j273J345J788J070n63j690j589N93J834J492j66k053
4934b86j353n2J422J759K15j130k042n64J277K176O97j035j990j140Q52J945J405
4951B156o93j909j707K79K308J623l46j730j808J36J426K311k8j578k100l35R81
4968a014K414P42j088k027j181J024K078J137p21k093j376O75J945J687n31j980
4984c09j686K41J652J777M54j911j684n68J343K063Q17j255k316q02J082J948
5000H46J250o40k088j343M52J752J713l77j719j641k36J844J849K67j757j883
5016a711o63J534K067O86r87k161j140J210K200J047p46k181j215L75K281J449
5032B045j74k089j813m1J762K154J81j523k098n77J400K256Q31j481j929j186
$$ plain form
4918 -800 1470 1932 946 -1074 -2347 -1002 786 1856 1293 -397 -1986 -1393 441 1933 1767 -286
4934 -286 -1639 -1691 -269 1490 1705 575 -1467 -2031 -754 1422 2119 1084 -906 -2046 -1194 751 2156
4951 2156 1463 -446 -2153 -1874 434 2057 1711 -19 -1827 -1691 -265 2046 2018 440 -1660 -1995 -1014
4968 -1014 1400 2142 1054 -973 -2154 -1130 948 2085 1364 -729 -2105 -1430 515 2202 1671 -309
4984 -309 -1995 -1754 -102 1675 2129 218 -1466 -2034 -691 1372 2189 934 -1382 -2184 -1102 846
5000 846 2096 1456 -632 -1975 -1523 229 1942 1565 -154 -1795 -2031 -187 1662 1929 172 -1711
5016 -1711 -2374 -840 1227 1913 926 -1235 -2375 -1165 1035 2082 1336 -845 -2060 -1685 596 2045
5032 2045 1871 -218 -2031 -2072 -310 1844 2025 502 -1596 -2173 -773 1483 2314 833 -1096 -2282
5048b282J100K162J461r26k554j569Q40K338J322K7k081j619j87J957J845J96
5064B030j500k242o15J668K109O89j275k255p69J045K034J242o95k212j533P53
5080a526J831J762l21j756k091j4K086J784L57j511k329o23J657K190R41j244
5096A193k486j079J211K485J310j084k372j374M88K343J611l23j959k165J1J969
5112b21K130N18j908k517n69J783K304P40j251k414j300J137K597J558j071k420
5128i04j666P96K374J651j59k388j698j39K426K012j31j948k188m36J911K286
5144A799O40j134k937j008J611K249J406r46k694j776Q04K554K076n62k397j963
5160b278J5K287K491j70j966k655k45J744K582R81j590k685r73J154K666J214
$$ plain form
5048 -2282 -1182 980 2441 1515 -1039 -2608 -1768 570 1892 1919 -162 -1781 -1968 -11 1834 2030
5064 2030 530 -1712 -2327 -659 1450 2139 864 -1391 -2160 -1115 919 2161 1466 -746 -2279 -1526
5080 -1526 305 2067 1746 -10 -2101 -2115 -29 1755 2112 601 -1728 -2351 -694 1496 2437 1193
5096 1193 -1293 -2372 -1161 1324 2634 1550 -822 -2196 -1708 635 2246 1923 -36 -2201 -2190 -221
5112 -221 1909 2427 519 -1998 -2567 -784 1520 2260 1009 -1405 -2705 -1568 1029 2587 1516 -904
5128 -904 -2570 -1774 600 2251 2092 -296 -1994 -2133 293 2305 2174 226 -1962 -2398 -487 1799
5144 1799 2439 1305 -1632 -2640 -1029 1220 2626 1680 -1014 -2790 -1986 568 2644 2082 -315 -2278
5160 -2278 -2263 24 2515 2345 379 -2276 -2521 -777 1805 2786 1196 -1489 -2462 -1308 1358 2572
5176B572j143k418j498P24K237K060o51k299k070J34K434K286k1k176k271k33
5192b333J735K787M00j587k670j068J383K729J295j086k705j795R95K587K001
5207B668l19k634k158j2K654K283k10j988k352n60J948K595Q02j818k533j086
5223b720J530K758J321j077k874j736R76K254K176l26k525k577M09K251K507J84
5239B531k014k781n11K247K477R21j866k767j277J596K873J528j361k812j763
5254b979Q50K886K290p51k585k316K46K458K558j18k365k628l21J792L071R31
5270C019k110k905j071J784K688J538j270k848j868R49K825K003m58k603k474
5285b801Q7K912K454n8k175k728p38K411L052M67j809k973j161J890K672J481
$$ plain form
5176 2572 1429 -989 -2487 -1763 474 2534 1883 -416 -2486 -2352 82 2368 2347 171 -2100 -2333
5192 -2333 -598 2189 2589 1002 -1668 -2736 -1353 1376 2671 1585 -1120 -2915 -1920 667 2668
5207 2668 2349 -285 -2443 -2455 199 2482 2272 284 -2068 -2628 -680 1915 2717 899 -1634 -2720
5223 -2720 -1190 1568 2889 1812 -1062 -2798 -1822 432 2608 2282 -243 -2820 -2411 -160 2347 2531
5239 2531 517 -2264 -2775 -528 1949 2870 1004 -1763 -3040 -1444 1429 2957 1596 -1216 -2979
5254 -2979 -2129 757 3047 2296 -289 -2605 -2359 99 2657 2539 174 -2454 -2775 -983 2088 3019
5270 3019 909 -1996 -3067 -1283 1405 2943 1673 -1175 -3043 -2094 731 2734 2276 -327 -2801
5285 -2801 -2714 198 2652 2594 419 -2309 -3047 -636 2416 2883 1074 -1899 -3060 -1170 1502 2983
5301B983j287k993j742J131K526K229o68k528k264L48K422K389J66k474k492n38
5317b792K093K933J011j985l217p83J388L116J382j259l233j779J136K831K116
5332B958p09k783k467M00K592K723R6k398k806n91K262L093N31j905k894j114
5348c012J611K963J528j261l083j809R78K853K370o36k841k632K73K691K686N9
5364B738k539k559o48K353K649R36j834l095j196J838L001J450j248l017j843
5379c014P61L123K105o36k614k222j37K488K674L89k607k803n43K365K625J068
5395C022j726l152j333J491L130K066j546l055j793N24K871K424k96k860k697
5410b930l1K926K905M71k865k540j130K015L326J077j622l553j592J640L443J754
$$ plain form
5301 2983 1696 -1297 -3039 -1908 618 2847 2179 -349 -2613 -2265 157 2546 2712 238 -2254 -2792
5317 -2792 -699 2234 3245 1260 -1957 -2740 -1352 1764 3146 1887 -1346 -3125 -1989 842 2958
5332 2958 2249 -534 -3001 -2601 -9 2714 2810 412 -2394 -2985 -723 2370 2901 996 -1898 -3012
5348 -3012 -1401 1562 3090 1829 -1254 -3063 -2085 768 3138 2502 -339 -2971 -2698 -7 2679 2738
5364 2738 199 -2360 -3008 -655 1994 2930 1096 -1999 -3195 -1357 1644 3094 1846 -1171 -3014
5379 -3014 -2253 870 2975 2339 -275 -2497 -2634 -146 2528 2917 310 -2493 -3036 -671 1954 3022
5395 3022 1296 -1856 -3189 -1698 1432 3498 1952 -1103 -2896 -2372 499 2923 2627 -233 -2930
5410 -2930 -2961 -35 2870 3341 476 -2064 -3194 -1179 2147 3224 1602 -1951 -3543 -1903 1540 3294
5426C294j425l199k051R18L198K533o78k954k532O6K575L171M77k995l058o36
5442c296J994L508J059j672l675j419J815L338J937j331l194k589R14L194K542
5457C125n88k628l085K13K796L037M22k678l232q93K555L321Q91j669l496j811
5473c720J668L641J958j524l020k245P75L220K548m91l245k481k07K657L418M17
5489C369k857l336n17K185L641J020j903l557j464J251L501K070j193l238k108
5504c136N08L128K870n35k948k993q3L000L076K61k353l569p48K533L142J129
5520C282j673l369j769J592L235K273j199l221k415N25L229L022p12k718l243
5535c161r5K695L341N22k445l290j073K112L793J118j866l268k270J602L634K013
$$ plain form
5426 3294 1869 -1330 -3381 -2463 735 3268 2590 -364 -2896 -2830 -255 2916 3393 398 -2660 -3296
5442 -3296 -1302 2206 3265 1593 -2082 -3501 -1686 1652 3589 2258 -936 -3525 -2611 583 3125
5457 3125 2537 -91 -3176 -2963 -167 2870 3292 614 -2618 -3511 -956 2365 3256 1587 -1909 -3720
5473 -3720 -2052 1589 3547 2023 -997 -3242 -2467 753 3301 2810 -435 -2916 -3123 -466 2952 3369
5489 3369 512 -2824 -3341 -1156 2485 3505 1602 -1955 -3419 -2168 1333 3403 2210 -1028 -3136
5504 -3136 -2628 500 3370 2835 -113 -3106 -3189 -189 2887 3148 795 -2774 -3522 -989 2153 3282
5520 3282 1609 -1760 -3529 -1937 1298 3571 2372 -849 -3264 -2739 490 3512 2800 82 -3161
5535 -3161 -3256 -561 2780 3302 857 -2433 -3506 -1394 2399 3517 1651 -1617 -3887 -2285 1349 3362
5551C362r10l347k700J037L123K780m88k888l152q3K881L152P47k817l358o95
5567c356K241L368J214j829l180j973J301L757K096j308l303k310Q54L066K583
5582C221j58l218k717j55K375L681K68k414l246j005J978L228J335j409l236k051
5598c523J128L533K216r15l356k285M19L241K622p8k880l061j38K714K893P72
5614C302k519l241j006J836L438J724j751l447j918J551L360K170j224l183k624
5629c532O26L538K660l4l144l264o5L074K806Q34k788l173q75K115L420J347k061
5646A484l148j812J669L235K057q26l671k259O80L243K268j2k743k945k25K600
5662d05L153N65k618l156j063K322L372J151j439l304k163J579L024K445j123
$$ plain form
5551 3362 2452 -895 -3595 -2558 565 3345 2857 -31 -3183 -3266 -385 2767 3514 697 -2661 -3356
5567 -3356 -1115 2253 3467 1638 -1542 -3515 -2214 1543 3639 2331 -972 -3282 -2428 638 3221
5582 3221 3063 -155 -2872 -3027 -652 3029 3297 883 -2363 -3368 -1390 1838 3173 1764 -1472 -3523
5598 -3523 -2395 1138 3354 2439 -917 -3202 -2783 458 3080 3002 122 -2939 -3077 -363 2530 3302
5614 3302 783 -2458 -3464 -1628 1810 3534 1783 -1664 -3582 -2031 1329 3499 2275 -908 -3532
5629 -3532 -2906 632 3292 3258 114 -3150 -3215 -141 2665 3499 711 -2462 -3337 -1222 2198 3545 1484
5646 1484 -1664 -3476 -1807 1428 3485 2659 -1012 -3271 -2591 652 2920 2908 165 -2780 -3005 -405
5662 -405 2748 3313 695 -2461 -3524 -1202 2170 3321 1882 -1422 -3585 -2006 1018 3463 2340
5677B340l529j859L94L026K919j93l064k947o68L163K914Q99k264l487j114J934
5693a536L193J809j591l482j994J186L580K358p89l469k586J44L196L106K5k953
5709A97l192n63K969L205J081k577l541j400K158L595J779j688l669k104J344
5724b406L584K396p88l589k602M73K922L764l29l329l346l57K727L624R15k405
5740A254l614j452K250L442J905j653l465k599J297L962K494j143l033k823o4
5755c242L594L213j45k785l871m43K750L431J364k285m174j396K240L507K128
5770C886j730l682j969R43L917K492o93l838l052L43L670L042M25l369l728j83
5786c526K785L474J082k292m005j453K007L758J836j456l786k417J235L749K740
$$ plain form
5677 2340 -1189 -3048 -2654 372 3291 3098 34 -2913 -3581 -418 2496 3395 1131 -2356 -3470 -1536
5693 -1536 1657 3466 1875 -1607 -3601 -2415 1165 3523 2734 -735 -3321 -3177 19 3125 3150 197
5709 197 -2995 -3558 -589 2616 3697 1120 -2421 -3821 -1663 1932 3711 2023 -1646 -3750 -2406
5724 -2406 1178 3574 2786 -803 -3405 -2932 -10 3754 3425 96 -3250 -3607 -880 2744 3659 1254
5740 1254 -2360 -3812 -1562 1880 3785 2132 -1333 -3932 -2635 1327 3821 2678 -355 -3178 -3242
5755 -3242 352 3565 3420 635 -3236 -3679 -929 2502 3866 1581 -2593 -3989 -1749 1758 3886
5770 3886 2156 -1526 -3495 -2552 1365 3857 3164 -674 -3726 -3383 287 3329 3754 385 -3343 -3526
5786 -3526 -741 2733 3815 1523 -2482 -3935 -1928 1830 3666 2210 -1576 -3993 -2758 991 3731
5801C731o58l399l001O1L016L317M61k917l573o04K649L392J323k120l970j660
5817c952J961L654K296j529l876k312J010L709K603m94l441l089q7L355L474K41
5833C523k481m129p90K563L683J794k677l773j443J711L628K413j453l741k805
5848c977R39L802L020n97l363l307Q5L190L496L08k881l687p66K817L243J646
5864C968k288l808j584J529L724K260j432l805k366J014L544K827p13k982l051
5879c163l65L254L209L96k459l309j273K305L835J417j985l776j890J669L435
5894A300K507q64l709k874O99L379L086m51l302l038l18L143L403R29k710l854
5910b674q91K155L932J359k143l662j857J548L440K422q01l573k811N38L505L052
$$ plain form
5801 3731 3073 -326 -3327 -3266 -250 3067 3528 611 -2962 -3566 -917 2475 3798 1678 -2292 -3952
5817 -3952 -1991 1663 3959 2430 -1446 -3758 -2748 961 3564 3070 -371 -3460 -3547 -192 3282 3523
5833 3523 1042 -3087 -3877 -1314 2369 4163 1486 -2287 -3730 -2019 1609 4022 2569 -1172 -3977
5848 -3977 -3038 764 3784 3187 -176 -3483 -3398 -208 3288 3596 715 -2972 -3738 -921 2322 3968
5864 3968 1680 -2128 -3712 -2183 1541 3801 2369 -1436 -3802 -2788 756 3583 2870 -112 -3163
5879 -3163 -3528 -274 2935 3331 872 -2437 -3710 -1405 2430 3847 1862 -1914 -3804 -2135 1300
5894 1300 3807 2943 -766 -3640 -2941 438 3524 3073 -229 -3267 -3585 -442 2961 3890 1180 -2674
5910 -2674 -3565 -1410 2522 3881 1738 -1924 -3781 -2233 1207 3629 2828 -745 -3556 -3018 487 3539
5926C539l68l116l416l3K842L684M18k421l754j259K570L541J695k108l489k161
5942c836J472L799K403j233l506k636O94L416K995l06l237k992p43L076L502O33
5958C501k464l390j357K249L725J138j492l683j817J513L424K171q78l551k377
5973c288M14L115K849o2l040l220j52K689L296J107k496l412j507K034L866J549
5989C742j597l584k046J227L294K461q86l187k886N00L331K555J53k970l096m23
6005c412K733L451P82k494l401j193J929L422J821j624l445k222J447L483K375
6020C652r46l360k825O75K883K961L19k916l373l93K568L670P26k259l651j568
6036c837K023L671K172j870l660k131J453L411K146n66l433k882M94L170L128
$$ plain form
5926 3539 3171 55 -3361 -3394 -552 3132 3550 1129 -2625 -3884 -1314 2227 3922 1814 -1675 -3836
5942 -3836 -2364 1435 3838 2605 -901 -3537 -2843 573 3568 3262 25 -2967 -3710 -634 2868 3501
5958 3501 1037 -2353 -3710 -1461 2264 3402 1910 -1773 -3590 -2077 1347 3518 2640 -911 -3288
5973 -3288 -2874 241 3090 3028 -12 -3232 -3384 -695 2601 3708 1212 -2200 -3707 -1673 2193 3742
5989 3742 2145 -1439 -3485 -2258 1036 3497 2611 -576 -3462 -2962 369 2924 3077 107 -2989 -3412
6005 -3412 -679 2772 3554 1060 -2341 -3534 -1605 1817 3638 2014 -1431 -3653 -2206 1277 3652
6020 3652 2706 -654 -3479 -2804 79 3040 3359 443 -2930 -3323 -755 2915 3641 1382 -2269 -3837
6036 -3837 -1814 1857 4029 2159 -1501 -3632 -2179 1232 3378 2812 -621 -3503 -3009 161 3289
6051C289J36k903l507o53K837L498Q03k264l571j423K153L387K037j715l692j971
6067c559J220L271K569o47l344k914L74L185L025Q9k798l422l99K576L330R72
6083C528k242l500j427K047L345J681j346l559k109R69L559K847j079l234l003
6098c523P24K882K894N16l309k941o50K791L171R82k100l791j576K304L472K210
6114D056k037l521k284J184L660K534p09l572k760K22L105L739n01k679l256j180
6130c999L318L343R54k271l571j476J916L464K301k274l394k166J461L508K487
6145C601p32l428k666M10L023K967j99k809l186l20K560L415Q30k623l185j351
6161c693K075L292J944j847l239k011J425L224K245q27l341k584N38K971K966
$$ plain form
6051 3289 3425 522 -2985 -3638 -801 2697 3500 1236 -2335 -3758 -1605 1782 3819 2104 -1588 -3559
6067 -3559 -2339 932 3501 2854 -490 -3404 -3030 155 3180 3269 471 -2951 -3350 -774 2556 3528
6083 3528 1286 -2214 -3641 -1594 1751 3432 2086 -1473 -3582 -2613 946 3793 2714 -520 -3523
6098 -3523 -2799 83 2977 3493 184 -2757 -3407 -616 2555 3537 1437 -2354 -3930 -1626 1846 4056
6114 4056 2019 -1502 -3786 -2602 1058 3592 2883 -689 -3449 -3227 -122 3617 3116 437 -2819 -3999
6130 -3999 -681 2662 3616 1345 -2226 -3702 -1786 1678 3979 1705 -1689 -3855 -2394 1114 3601
6145 3601 2869 -559 -3225 -2815 208 3175 2976 167 -3019 -3339 -779 2636 3466 843 -2342 -3693
6161 -3693 -1618 1674 3618 1771 -1468 -3479 -2054 1170 3415 2588 -753 -3337 -2799 172 3138
6176C138J06l028l020l80K390L124J112k432k971j632J992L297J755j525l403
6191a477k122J053L439K367l23l274k878Q9L222K845K9k210l566m83K497L125
6207B333J137k099l731j209J932L403J980j464l823k028J093L485K522n32l691
6222f92k589n6L354L026K53k747l496p43K928L330J047k448l409j651K215L513
6238A835J719j457l514k160J009L387K839p95l181l087L74L088K949N37l221l201
6254b879o27K542L490J070k276l658j107J646L381J973j331l793j999R23L414
6269G69K685n75l284l087K64L008L488J15k568l660p89K552L587J116k042l838
6285b259j446J496L850J957j341l635k269J017L380K897n70l168l291K93L080
$$ plain form
6176 3138 3244 216 -2804 -3184 -794 2330 3442 1010 -1961 -3593 -1601 1696 3451 1926 -1477
6191 -1477 -3599 -2546 893 3260 2937 -337 -3215 -3126 96 2941 2970 760 -2806 -3289 -792 2333
6207 2333 3470 1371 -2360 -3569 -1637 1766 3746 2282 -1541 -3569 -2476 1009 3531 2999 -692
6222 -692 -3281 -3337 17 3043 3296 549 -2947 -3690 -762 2568 3615 1167 -2242 -3893 -1678 1835
6238 1835 3554 2097 -1417 -3577 -2568 819 3658 2863 -318 -3405 -3031 57 3006 3543 322 -2879
6254 -2879 -3506 -964 2526 3596 1320 -2338 -3445 -1799 1582 3555 2224 -1569 -3568 -2645 769
6269 769 3454 2879 -405 -3492 -3228 -220 3268 3383 815 -2845 -3634 -1082 2505 3621 1579 -2259
6285 -2259 -3705 -2209 1641 3598 2257 -1378 -3647 -2630 750 3647 3077 -91 -3382 -3089 -9
6300iK953L23k423l540q34K432L593J273k327l455j711J882L330K281j370l624
6316a226k499J125L342K752o50k887l276J53K702L546O99l077l372r86K440L464
6332B250J377j985l399k112J823L600J938j172l253k470N14L564K610k02l093
6347a0l067l18L032L242M13k487l641r34K417L789J290k062l675j690J580L521
6363A400K224j428l053k617P18L305K767l39l040l111j86K704L273Q19k643l249
6379b456r76K191L358J332j806l444j671J231L534K200j040l192k680Q21L105
6394E07K481J81l200k687n00K622L719K76k633l332o98J492L493J795j772l448
6410a704j911J513L192K468j260l153k520M92L055K989k58k670l239m79K812L557
$$ plain form
6300 -9 2944 3267 844 -2696 -3530 -1098 2495 3768 1441 -2014 -3725 -1843 1487 3768 2398 -1226
6316 -1226 -3725 -2600 742 3494 2844 -43 -3319 -3166 -464 3082 3781 704 -2668 -3654 -1214 2250
6332 2250 3627 1642 -1757 -3869 -2046 1554 3492 2320 -933 -3403 -2889 675 3285 3083 -10
6347 -10 -3077 -3395 -363 2879 3292 805 -2836 -3770 -1353 2436 3726 1664 -2011 -3701 -2121 1400
6363 1400 3624 2196 -857 -3474 -2756 549 3316 2977 -63 -3174 -3360 -656 2617 3436 793 -2456
6379 -2456 -3432 -1241 2117 3449 1643 -1801 -3472 -2241 1293 3493 2453 -739 -3419 -2598 507
6394 507 2988 3169 -31 -2718 -3218 -596 3123 3399 766 -2566 -3264 -1772 1721 3516 1744 -1704
6410 -1704 -3615 -2102 1090 3558 2298 -855 -3375 -2883 172 3161 2903 233 -3006 -3485 -673 2884
6426B884K53k634k972j130J896L670J732j957l486j848J439L362K377j507k901
6441h22k548P77L035K869m46l002k829o6K801K868N59k505l009q43K094L011J297
6458C241j666l335j828J614L364J769o96l095k413M36L034K450j33k782k723j46
6474b909K508K987M12k318k941j052J870L407J351j699l292j651J333L015K177
6489C198j004k948k512Q52K808K396K66l229k497j80K342L108N20k186l033j145
6505c244K084K851J402j125l796j586J618K856K130j059k834k258K63K972K759
6520C033k7k837l034n37L021K811P90k245l277q73J751L105J679j500l246j740
6536c126R86L058K157r37k997k412O63K698K717P5k713k804m23K468L236O62k320
$$ plain form
6426 2884 3137 503 -2469 -3599 -1703 1967 3699 1742 -1744 -3592 -2153 1209 3586 2079 -822
6441 -822 -3370 -2593 442 3311 2865 -137 -2966 -3032 -231 2637 3196 691 -2318 -3161 -1067 1944 3241
6458 3241 1575 -1760 -3588 -1974 1390 3159 2463 -632 -3045 -2609 425 2875 2742 -40 -2763 -2909
6474 -2909 -401 2586 2998 680 -2261 -3313 -1443 1964 3315 1616 -1676 -3327 -1994 1021 3198
6489 3198 2194 -754 -3266 -2414 394 2790 3056 -173 -2670 -2850 -508 2600 3120 934 -2099 -3244
6505 -3244 -1160 1691 3093 1968 -1828 -3414 -1796 1060 3190 2131 -703 -2961 -2698 274 3033
6520 3033 3006 169 -2865 -3402 -381 2430 3220 975 -2302 -3175 -1424 1681 3360 1860 -1386 -3126
6536 -3126 -2140 918 3075 2138 -859 -3271 -2608 90 2807 2882 169 -2635 -3058 -590 2646 3308 988
6553I88l156r82J784L091J666j747k984j770R92L155K177r30k797k625N08L102
6569D72K534m8k874k835l92K584K885P41k247k991j139J875L248J791j971l117
6585a484j790J463L074K077j036k963k627P34K857K563K1k783k855l78K598K747
6601B218R73k232l221j050J941L129J285j490k880j769J418K786K135q33k935
6616e25k539N78K820K410J29k736k659m84K514K789P60k203k915j113J935L037
6632A798J200j404l030j822J098L335K037j020k900k445M77K943K590k44k384
6647B29k970MK413K768M02j865l207q05J936K773J353j386l214j458J085L142
6663A200J902q57l193k028M00K721K656l90k123k808l80K680K401P89k204k776
$$ plain form
6553 988 -2168 -3150 -1366 1725 3391 1644 -1340 -3110 -2118 1037 3214 2284 -513 -3138 -2630 472
6569 472 3006 2958 84 -2751 -3143 -559 2326 3067 820 -2171 -3310 -1435 1813 3604 1633 -1484
6585 -1484 -3274 -1811 1263 3340 2304 -659 -3286 -2552 305 2868 2889 106 -2749 -3127 -529 2218
6601 2218 3191 959 -2262 -3312 -1371 1758 3043 1553 -1327 -3096 -1678 1108 3243 2410 -525
6616 -525 -3064 -2486 334 2744 2873 137 -2522 -3006 -492 2297 3057 854 -2061 -3174 -1239 1798
6632 1798 2998 1594 -1436 -3258 -2160 1175 3212 2192 -708 -3153 -2676 267 2857 2613 229
6647 229 -2741 -2737 -324 2444 2846 981 -2226 -3031 -1095 1678 3031 1645 -1569 -3027 -1942 1200
6663 1200 3102 2245 -948 -2976 -2576 145 2801 2411 288 -2520 -2900 -220 2181 2970 766 -2010
6679b010j202K006K987J224j546k848j760J182K899J830o35k908j968M41K472
6694A64K589L6k617k582n61K509K539P10k153k653q79J969K744J208j468k928
6710a373j673J173K821J976r40k504k336M85K371K606Qk422k606o16K377K874
6726B221O57j996k620j278J801K927J275j657k741j668J396K602K159j226k641
6741g89k006K69K753K631m43k442k644J07K132K654O63k172k823r97K065K544
6757A502J165j182k952j281J010K713J878q24k870j763L56K486K223j20j994k863
6773b516j39K298K683N12j988k896o68J922K386J469j563k816j601J412K423J686
6789B604m33k646k360Q27K283K303j15k456k412J03J936K350Q67j906k788r01
$$ plain form
6679 -2010 -3212 -1206 1781 3005 1459 -1389 -3149 -1967 932 2762 2127 -781 -2749 -2308 164
6694 164 2753 2789 172 -2410 -2971 -462 2077 2787 634 -2019 -2898 -929 1815 3023 1555 -1373
6710 -1373 -3046 -1873 948 2924 1984 -520 -2856 -2371 0 2606 2614 192 -2414 -3030 -653 2221
6726 2221 2878 882 -1738 -3016 -1215 1712 2987 1330 -1411 -3079 -1683 919 3078 1852 -789
6741 -789 -2795 -2526 227 2858 2415 -27 -2671 -2564 -432 2222 2885 713 -2110 -3107 -1042 1502
6757 1502 2667 1485 -1467 -2748 -1738 975 2853 2029 -841 -2604 -2248 238 2461 2341 347 -2516
6773 -2516 -2655 -357 2326 2838 850 -2046 -2714 -792 1594 3063 1500 -1316 -2917 -1505 918 2604
6789 2604 2171 -475 -2835 -2008 275 2578 2463 7 -2405 -2302 -366 1984 2851 945 -1843 -2744
6805b744J548K644J361j316k612j484M78L170J920r25k631j918K97K288K291k0
6821B347k148k685q3K085K859L23j860k845o21J274K995J061j314k503j402Q75
6837a642K609J572l19k543k349M83K137K514k59k088k373j15J978K309P46j775
6853H85k341j453J816K712J087j275k728j721J148K751J986o34k862j927K9K517
6869a0K498k53k007k396m31J955K782P49j936k730r79J592K475J496j297k496
6885i88j677R04K701J628n70k549k134N62K488J911J74k259k391j55J916K497
6901B058O72j834k726p26J456K554J209r29k906j595Q65K649J705n55k561j837
6917b501M14K286K406j17k374k498m2J792K673O28j837k442r18J313K779R45j200
$$ plain form
6805 -2744 -1196 1448 2809 1493 -1119 -2603 -2125 1045 2965 2040 -591 -2509 -2212 76 2367 2347
6821 2347 199 -2486 -2569 -484 2375 2698 838 -2007 -2628 -1354 1641 2702 1388 -1115 -2517 -1642
6837 -1642 967 2539 2220 -323 -2672 -2189 -52 2462 2203 115 -2258 -2373 -395 1914 2660 885
6853 885 -1456 -2909 -1093 1619 2706 1431 -1297 -3018 -1870 881 2867 2233 -629 -2556 -2527 -10
6869 -10 2488 2235 228 -2168 -2599 -644 2138 2887 951 -1779 -2758 -1166 1309 2805 1508 -988
6885 -988 -2665 -1761 940 2568 1998 -551 -2685 -2123 365 2276 2450 191 -2200 -2355 -439 2058
6901 2058 2730 896 -1830 -2556 -1100 1454 2663 1734 -1172 -2767 -1902 747 2452 1897 -664 -2501
6917 -2501 -2087 199 2605 2488 114 -2384 -2426 -634 2039 2667 830 -1612 -2530 -1217 1562 2507 1307
6934A307k338j631P89K694J563n56k438k041M98K324K271l12k096k222q6J881
6950c93K336L94j602k573p28J507K671J141j437k263j540J169K323J243l65k344
6966d61j789L73K315J733j68j928k089k71K056K118K09j451k252q22J474K377
6982A424Q90j177k449j310J081K364J321m99k103j463K13J902J733J85j855k291
6998b034j71K034J810O21j686k225o51J251K485J164j573k061j273Q09K232J690
7014B422p41k081j670M57J977J743Q9j954k011k84J863K080K45j503k070q72J453
7031h57K372R07j400j996j407J102K094J545p01k084j530M7K128J909o0k260j656
7048a847Q3J599J949M71j819k083n51J373K268P67j017k198j222Q49K135J759
$$ plain form
6934 1307 -1031 -2662 -1873 821 2384 1828 -610 -2651 -2153 171 2442 2130 34 -2188 -2274 -393
6950 -393 1943 2337 735 -1838 -2566 -1059 1612 2753 1316 -947 -2487 -1318 1005 2248 1883 -461
6966 -461 -2250 -1877 438 2171 2003 75 -2014 -2285 -229 1889 2098 647 -1605 -2427 -953 1424
6982 1424 2314 1137 -1312 -2622 -1541 823 2144 1645 -458 -1921 -1708 194 1927 2112 257 -2034
6998 -2034 -2205 -171 1639 2260 574 -1651 -2302 -1051 1434 2598 1025 -1036 -2309 -1500 732 2422
7014 2422 1681 -400 -2070 -1613 364 2107 2196 242 -1769 -2053 -190 1890 2135 632 -1438 -2310 -857
7031 -857 1515 2422 1022 -974 -2381 -1279 815 2360 1659 -425 -1955 -1908 220 2129 2069 -191 -1847
7048 -1847 -1764 -165 1784 2255 436 -1647 -2198 -825 1443 2210 1193 -1005 -2227 -1378 757 2516
7064B516j066j914j442K06J965J847l02j948j749j99J662K275K01j670k086o74
7080b378J732J955Q10j156k028j119Q37K158J491o80k194j638M54K099K027n84
7096A786j897j849N3J860J932L49j775k265n68J596K237P48j456k046p53Q73K382
7113A207J020o22k516j261P11J928J687j79k036j873J17J554K027K41j587k058
7129a640p59J621K232P51j193k117j104J081K138R86j75k583j279M63J927J754
7145B103k68j784k042N3J583K336J79j674k218n34J467K222P15j169k273j106
7161b410J259K225J013o44k283j240N38J923J831o14j879j647J99J548J825L08
7177A952j567k034m05J413K083M86j076j993r27Q13K260J252j009k079j295O57
$$ plain form
7064 2516 1450 -464 -1906 -1700 265 2112 1810 -138 -1887 -2086 -424 1851 2052 382 -1704 -2378
7080 -2378 -646 1309 2119 963 -1065 -2184 -1347 811 2302 1622 -572 -2210 -1756 343 2370 1786
7096 1786 -111 -1960 -1907 -47 1885 2234 459 -1806 -2374 -778 1459 2207 751 -1295 -2048 -1175 1207
7113 1207 2227 1605 -911 -2172 -1461 467 2154 1975 -61 -1934 -1817 -263 1764 2005 418 -1640
7129 -1640 -2399 -778 1454 2205 1012 -1105 -2209 -1128 1010 1996 1821 -762 -2041 -1578 349 2103
7145 2103 1835 51 -1991 -1938 -355 1981 2160 486 -1732 -2266 -799 1423 2138 969 -1304 -2410
7161 -2410 -1151 1074 2087 1443 -840 -2080 -1542 381 2212 1598 -281 -1928 -1729 -181 1644 1952
7177 1952 385 -1649 -2054 -641 1442 1928 852 -1141 -2068 -1255 1005 2257 1248 -831 -2126 -1469
7193a469J986J255J31j912j904J23J556J651N65j435k222l13J102K327J008j421
7209A028k377q47J041K121J164o95k150j309L41K086J642m18j788j863J21J534
7225c69K063K88j553j903n60J279K190P93j499j762j113R79K136J279r84j869
7241f05j348L70J832J659l96j732j517j13J704J852M55j551k141l01J102K171
7257A441M51j322j796p91R85J828J455p52k252j239P15J981J002p6j803j437J9
7274a591J741J508K18j760j650k64J538J630P44j313j958p45Q44J888R24o80j930
7291h56j157O52J507J642j82j607j686M9J460J602M07j487j870m37J567J690M23
7308A717q94j806r18J176J604Q84o62j655j545Q39J799J188m10j423j842M31J534
$$ plain form
7193 -1469 517 1772 1903 -9 -1913 -1790 -234 1417 1982 547 -1675 -1988 -886 1441 2449 1028
7209 1028 -1349 -2196 -1155 966 2130 1435 -715 -2024 -1683 403 2045 1627 -161 -2024 -1903 -369
7225 -369 1694 1982 429 -1474 -2034 -755 1435 2228 729 -1033 -2146 -1167 969 2248 1264 -605
7241 -605 -1953 -1583 249 1908 1512 -220 -1737 -1850 -146 1706 2161 610 -1531 -1832 -730 1441
7257 1441 1892 570 -1226 -2017 -1032 796 2251 1499 -753 -1992 -1277 704 1706 1630 -173 -1610 -1591
7274 -1591 150 1658 1876 116 -1534 -1798 -260 1370 2114 801 -1157 -1902 -1058 830 1754 1074 -856
7291 -856 -2013 -1361 146 1788 1606 -1 -1687 -1638 -178 1424 1831 344 -1526 -1963 -396 1294 1717
7308 1717 823 -983 -1901 -725 879 1763 1101 -554 -2099 -1260 539 1727 1317 -106 -1948 -1517 17
7325A7J513K95j850j279m88J318J770M63r84j962n53R18J717Q40p53j858r58O30
7343a204J883J151n07j365j735O6J761J472N1j325j614m23J394J834L34j218j697
7360a142m78P52J839Q29p10k148p21L33J965R97j66j413j450k79J899J249J29
7377A485j256j604l29J338J636M40q90j779o97R28J511J212q03j820j278N42J793
7394D29J356k17j934j197J68J288J524L12j633j433l27J244J452O37j285j601
7410a217n64Q53J991N79o19j844r49O91J661R61j23j692j228Q2J684J471j52j579
7428Fj395m30J600J454M28j326j414m92Q35J493J018o89j835j160P73J699J257
7445A822m29j819j432L09J675J525L9j575j575j12J321J321O19j155j625n96R14
$$ plain form
7325 17 1530 1825 -25 -1304 -1792 -474 1296 1759 775 -1187 -1740 -822 895 1735 982 -876 -1834 -1204
7343 -1204 679 1830 1323 -42 -1777 -1711 50 1522 1573 248 -1366 -1789 -395 1439 1773 555 -1142
7360 -1142 -1620 -868 971 1800 1090 -1058 -1779 -1446 519 1516 1350 -63 -1513 -1792 107 1356 1485
7377 1485 229 -1375 -1704 -366 1270 1710 820 -959 -1656 -728 783 1995 1192 -628 -1906 -1364 429
7394 429 1785 1568 -366 -1563 -1395 -107 1417 1729 96 -1337 -1664 -420 1032 1669 384 -1217
7410 -1217 -1781 -928 1063 1642 1023 -821 -1770 -1079 582 1543 1420 -272 -1500 -1418 266 1737 1585 6
7428 6 -1389 -1819 -219 1235 1663 337 -1077 -1569 -734 759 1777 1088 -747 -1907 -1134 565 1822
7445 1822 1393 -426 -1858 -1549 126 1651 1690 115 -1460 -1572 -251 1070 1689 534 -1091 -1687 -773
7462g73J337J000q03j635r31Q91J221J252l56j594j298L08J275J493P7j465j457
7479a458j29J273J869J06j137j610n94J035J580O50o65j660o68M69J442J061k80
7496A284j555j455L16J476J050K13j331j249m33J339J503M59j266j406n92R64
7512f83J735O33q39j484r24M21J774Q65l86j435j140K37J495J255L1j776j108
7529a329l21J727J188J96r69j782l61J088J621O20q97j686n73O46J464J055n75
7546A112j571r63m3J620J392k79j164j346k00J485J178L30j252j355n61J214J430
7563A027M10q56j521p78R74J202Q78l50j684p60L07J446J319k25j649j253K00
7580a313J399J516j90j227j435l18J312J302N29j065j551m13M14J778R31p51j716
$$ plain form
7462 -773 564 1564 761 -874 -1805 -914 307 1559 1203 -391 -1689 -1381 -106 1387 1464 -1 -1458
7479 -1458 -1587 -314 1555 1661 524 -1086 -1680 -645 935 1585 920 -740 -1408 -939 503 1564 1284
7496 1284 -271 -1726 -1410 66 1116 1329 -2 -1251 -1684 -345 1158 1617 351 -1055 -1647 -683
7512 -683 1052 1685 846 -638 -1562 -1141 633 1498 1112 -323 -1463 -1226 269 1524 1555 -221 -1329
7529 -1329 -1650 77 1265 1461 492 -1290 -1651 -563 1058 1678 781 -905 -1478 -832 632 1687 1112
7546 1112 -459 -1422 -1465 155 1547 1268 104 -1242 -1442 43 1221 1551 299 -1056 -1617 -403 1027
7563 1027 1437 581 -940 -1718 -744 458 1336 986 -698 -1458 -1151 295 1614 1389 -260 -1513 -1313
7580 -1313 86 1602 1412 185 -1250 -1568 -256 1046 1575 510 -1041 -1454 -1040 738 1669 918 -798
7597g98r25N75J115J572j43j863r80J91J342J151L33j346j510l28J033J946J06
7614A471j035j299p45J071J542M62o11j448p84L54J352J224m55j329j211J99J306
7631F4J140L28j377j483k37J485J553J79j021j910k61P67J421R31q48j225q79
7648a373K62J591R16j77j565j159J86J444J256J68j447j156m75J130J383P37j064
7665F57j613p03P01J905P61j102j450p64O09J653P92j64j474j197o8J489J508
7682A540l04j022j461k94J198J643K73r29j590p15R52J473O84o57j406p77L75
7699a017J436J073m64j179j159q6J281J579j63j004j653j40J388J223L52q54j795
7716a182l39J029J546P60j012j632r28O24J576J187n43j560j060L48J262J286
$$ plain form
7597 -798 -1723 -1148 -33 1539 1396 -467 -1447 -1256 86 1237 1570 224 -1286 -1614 -581 1365 1471
7614 1471 436 -863 -1608 -537 1005 1467 856 -592 -1376 -1022 330 1554 1099 -230 -1441 -1242 64
7631 64 1204 1532 155 -1328 -1565 -80 1473 1652 631 -1279 -1540 -773 648 1579 731 -494 -1373
7648 -1373 -1111 480 1396 1219 -346 -1505 -1319 125 1381 1549 102 -1054 -1529 -399 984 1721 657
7665 657 -956 -1659 -958 947 1708 606 -844 -1608 -999 654 1446 1282 -192 -1389 -1457 32 1540
7682 1540 1236 214 -1247 -1541 -343 1300 1573 644 -946 -1661 -709 764 1448 791 -615 -1392 -1017
7699 -1017 419 1492 1028 -151 -1310 -1396 -115 1464 1301 297 -1356 -1496 -108 1115 1467 613 -1182
7716 -1182 -1521 -492 1054 1814 802 -830 -1758 -1134 442 1629 1086 -474 -1534 -1186 76 1362
7732A362J2j148j494k82R97J689N10j112j662k22N95J624R53j156j385q66N56
7749a029J791Q97m63j715j021L08J338J130O5j245j420J7J075J383J20q45j387
7766a001j61N29J494O47o72j522n76P1J415J378l92j458j176L25J310J229oj594
7784a60j212k07J227J591J45p68j558q10J269R74J060n51j657o67L46J570J134
7801A726n76j357r20J5J262J276j27j258j463j55J465Q95P30j127j359l99N51
7818h21J799P27q90j686q46Q81J305J218n46j634j057L15J845R47j72j482j103
7835a200k16J471J168K22j327j326k97R52J480O53p68j400r09M35J591P62l62
7852I29j029j373L28J168J343j96j067j211k41J201J217L51j326j251j90N16J946
$$ plain form
7732 1362 1374 226 -1268 -1550 -553 1136 1646 534 -1128 -1350 -755 869 1822 666 -719 -1585 -1029
7749 -1029 762 1659 1196 -519 -1540 -1232 106 1236 1301 56 -1364 -1347 -272 1111 1231 386 -1001
7766 -1001 -1162 -633 861 1508 836 -686 -1262 -1191 224 1602 1210 -248 -1424 -1099 211 1440 1434 -160
7784 -160 -1372 -1579 -352 1239 1384 616 -942 -1752 -483 491 1551 1000 -657 -1324 -978 592 1726
7801 1726 1150 -207 -1127 -1112 150 1426 1299 41 -1422 -1577 -112 783 1513 386 -973 -1372 -821
7818 -821 978 1705 815 -871 -1717 -836 469 1687 1141 -493 -1550 -1235 610 1557 1385 -97 -1200
7835 -1200 -1416 55 1223 1445 118 -1208 -1505 -553 927 1580 812 -588 -1497 -1062 529 1291 929
7852 929 -100 -1473 -1145 23 1366 1170 103 -1108 -1349 -148 1069 1420 94 -1157 -1347 -831 1115
7869A115M76o06j651q03O66J678N22o74q80j496N00J278J131o7r59j323k80J106
7887b67J318J30q95j334n95J104J306N57o63j346r33O66J574J022k41j810j076
7904a483N06J309Q18J62j411j299m1J160J369O18j505j404k03R34J418O30q18
7921G60j449p83Q99J152R78m87j713p83M41J145J295l80j132j171k01J495J141
7938A207J14j158j299m59J170J416L47p15j396q56R73J360Q93m14j533j110K03
7955a257J523R10p3r83j406J2J109J265K38j151j352j96O25J770O58r65j155j118
7973a546Q63J549L25k08j484r75K40J570Q38J80j320j492Q6J169J678N1j248j293
7991a017r9Q90J077O27o71j421r83R83J252Q89n93j384q34J9J339J164N6j361
$$ plain form
7869 1115 1591 985 -666 -1469 -803 875 1397 723 -157 -1653 -1153 125 1256 1189 230 -1093 -1373 -267
7887 -267 1051 1181 286 -1048 -1643 -539 767 1324 661 -685 -1618 -952 622 1644 1403 -407 -1483
7904 -1483 -977 332 1150 1312 -99 -1398 -1439 -279 1090 1708 203 -1201 -1404 -470 948 1578 760
7921 760 -689 -1472 -573 579 1557 1070 -643 -1426 -985 160 1455 1075 -57 -1228 -1429 66 1207
7938 1207 1321 163 -1136 -1595 -425 991 1338 623 -773 -1629 -656 704 1597 1183 -350 -1460 -1257
7955 -1257 266 1176 1103 120 -1286 -1274 -165 1100 1338 187 -1165 -1361 -736 1034 1692 727 -428 -1546
7973 -1546 -683 866 1191 983 -501 -1476 -1236 334 1172 1352 32 -1460 -1374 -205 1473 1524 276 -1017
7991 -1017 -1116 -226 851 1478 807 -614 -1597 -614 638 1527 934 -450 -1284 -1265 74 1238 1294 -67
8009f7j353l4J355J175L44j286j246j57Q53J325N59q06j505o61P82J266R36n27
8027I53j601r45M11J533J113l43j206j151K7J218J206L41j330j402j00R20J426
8044A070N65p73j679q58Q79J407J090o88j836p69N27J416J129l30j587r76J5J258
8062a40J247K67j178j250l49Q07J634L96j049j191m05N81J314Q99o61j513j124
8079a715O92J293J380p55j395j043K20J337J041K38j016j477n86J336J406P69
8095A725j230j246p52P95J362P81m43j540r10L12J679Q24l61j302j258J73J250
8112a41J602j75j061j368k82J054J391P14j210j484p63P49J875M72k97j523j136
8129a583L93J848R24k76j500j370L70J340J093r5r35j222l18R47J414O13j207
$$ plain form
8009 -67 -1420 -1454 -99 1076 1420 134 -1112 -1269 -416 909 1468 662 -843 -1504 -722 544 1480 953
8027 953 -648 -1593 -1182 351 1464 1121 -85 -1236 -1209 9 1215 1556 226 -1176 -1276 -356 1070
8044 1070 1635 862 -817 -1675 -796 611 1701 1013 -823 -1592 -1065 351 1480 1150 -437 -1413 -1398 -140
8062 -140 1107 1374 196 -1054 -1403 -596 1038 1434 385 -806 -1211 -630 684 1583 922 -591 -1715
8079 -1715 -1023 270 1650 895 -500 -1543 -1323 14 1055 1293 277 -1200 -1786 -450 956 1725
8095 1725 495 -751 -1503 -708 654 1435 992 -548 -1458 -1146 533 1357 996 -306 -1564 -1391 -141
8112 -141 1461 1286 225 -1143 -1425 -371 1020 1734 524 -960 -1723 -974 901 1373 1076 -447 -1583
8129 -1583 -1190 658 1582 1306 -194 -1564 -1194 146 1239 1144 209 -1013 -1331 -384 1030 1643 436
8146D36j157p41P79J364R28q99j351j018O52J546R50l70j376j094OJ132J359K35
8164A381j067j557k53J168J325N79j065j556l44N95J524P31n51j632o46N20J454
8181F06O68K22j603j589N02J375J118K84j329j288
8191a034
$$ plain form
8146 436 -721 -1462 -683 681 1609 710 -641 -1659 -1007 539 1489 1119 -257 -1351 -1345 -213 1146 1381
8164 1381 314 -1243 -1496 -328 997 1576 511 -1045 -1389 -794 730 1461 910 -722 -1368 -848 606
8181 606 1274 1496 -107 -1696 -1194 181 1299 1583 254 -1034
8191 -1034
$$ Imaginary data points
##PAGE= N=2
##DATA TABLE= (X++(I..I)), XYDATA
0@%%%%%%%%%qQqJ6j6J6k4L2l2M0m8N6p2Q1r5J16j31J54j81K05k34K67l03L48l95
34b08M42n01N65o31P06p86Q72r73J081j193J321j460J607j774J956k153K375k616
52a370K881l182L515l890M324m820N396o079O897p905R185j0859J3164j6549K2010
67A2718l2309N8417k49820n90929K84552P10928N53318j63181o85514n98391O7587
78f32624O55217O39342m001n95707o42307r4649N28371O60149J75009m62376o72466
89d46042k32973L90854O39043L10108l01055o33632l71406K24156O12666M14799
99F06518j52699n55124m59015N1895N24604N01378J9879m76687n22437q3846M06483
110a39051N29448J79087l50339n47388k36136K85440N40342K89102k12325n12970
$$ plain form
0 0 0 0 0 0 0 0 0 0 0 -8 0 -8 8 -8 8 -16 16 -16 24 -24 32 -40 41 -54 62 -69 85 -96 109 -125 142 -161 187 -208
34 -208 234 -267 298 -333 373 -413 459 -514 567 -626 695 -765 842 -932 1024 -1129 1246 -1370
52 -1370 1511 -1671 1844 -2046 2278 -2542 2854 -3225 3672 -4233 4952 -5907 7257 -9292 12718
67 12718 -19591 38826 -210994 -801923 -517371 193557 746875 583694 -101820 -700211 -632624
78 -632624 22593 661935 657934 62227 -580080 -674729 -146358 513791 688800 226424 -446042
89 -446042 -679015 -288161 350882 660990 359935 -273697 -645103 -420947 191719 606518
99 606518 453819 -101305 -560320 -508425 16179 517557 537436 60749 -461688 -545534 -139051
110 -139051 390397 569484 219145 -328243 -564379 -278939 261403 550505 338180 -174790
120a74790l58906J37405N06021L94359p3177m68809m26012K843M16611M62066
130D17611P4448l91044m75171j23139L32712M79485J83294k70809m80809k49303
140e02725K28417M79492K79223j65017m56681l23691J02732M32712L69127n0233
150C93356m17751l81500o394L71232M07075O4821l32936m26955j18063L02396
160a44719M22420J59346k39493m22694k12088J92021M18805K54356j50791l98077
170a20914k74716Q4836L71452L14964l4031l47086l38618j1276L16353L39875
180C00839O6451k68670l62297j13525K35008L63322J53590j96853l52497j92678
190c67310J39991L54929K33103j06404l40134k59394O3831L18387K81866n697
$$ plain form
120 -174790 -533696 -396291 109730 504089 430912 -37897 -463909 -461066 -44455 417611
130 417611 492059 101015 -374156 -497295 -164583 314902 498196 227387 -253422 -502725
140 -502725 -274308 205184 484407 319390 -137291 -460982 -358250 74462 443589 393356
150 393356 -24395 -405895 -412289 -41057 366018 430839 97903 -329052 -447115 -144719
160 -144719 277701 437047 197554 -225140 -437228 -245207 173598 427954 277163 -120914
170 -120914 -395630 -310794 60658 375622 341591 -5495 -344113 -355389 -39036 300839
180 300839 367290 98620 -263677 -377202 -142194 221128 374718 177865 -174632 -367310
190 -367310 -227319 127610 360713 254309 -85825 -345219 -281388 36999 318865 313168
200C13168l00992l14634k5522K78232L23346O7913k46344l28297j16908K10206
210a39832L47249J47587j83110l37706j82171J41570L28177K15457r6079l27510
220h6368k41727O7844L01221K59796k0801k79370k78212k3646K60677K95377M9078
231C03869k26683k92927r4266J93841K99862J32427j62827l05881j53911J29110
241a77386K87925J89576q7989k84295k17712N1071K77066K35723k1374k48924
251C681k56928k4998K35480K74076N9021k15058k84097q6170J80653K87415J32024
262C05099j56064k94890j57288J26951K91915J79676r0326k76311k15397N5581
$$ plain form
200 313168 12176 -302458 -327980 -49748 273598 341511 95167 -233130 -350038 -139832
210 -139832 207417 355004 171894 -165812 -347983 -206413 121764 337221 241142 -86368
220 -86368 -328095 -260251 40970 300766 279965 595 -277617 -301263 -40586 254791 303869
231 303869 77186 -215741 -310007 -116166 183696 316123 153296 -152585 -306496 -177386
241 -177386 110539 300115 212126 -72169 -289881 -238810 38256 273979 252605 3681
251 3681 -253247 -278245 -42765 231311 290332 75274 -208823 -294993 -114340 173075 305099
262 305099 149035 -145855 -303143 -176192 115723 295399 205073 -71238 -286635 -231054
$$ [...]
##END NTUPLES=NMR FID
##END=
