##TITLE=1H_SA_CD3CN
 CD3CN, 108 sc, 
 16.12.2020
##JCAMPDX= 6.0         $$ Bruker NMR JCAMP-DX V2.0
##DATA TYPE= NMR FID
##DATA CLASS= NTUPLES
##ORIGIN= UXNMR, Bruker Analytische Messtechnik GmbH
##OWNER= root
$$ XWIN-NMR		Version 3.5
$$ Wed Dec 16 11:46:42 2020 Russian Standard Time (UT+4h)  she@DPX200
##.OBSERVE FREQUENCY= 200.1315066352
##.OBSERVE NUCLEUS= ^1H
##.DELAY= (6, 6)
##.ACQUISITION MODE= SIMULTANEOUS
##.ACQUISITION SCHEME= undefined
##.AVERAGES= 108
##.DIGITISER RES= 18
##SPECTROMETER/DATA SYSTEM= spect
##.PULSE SEQUENCE= zg30
##.SOLVENT NAME= CD3CN
##.SHIFT REFERENCE= (INTERNAL, CD3CN, 0, 15.7039)
##AUDIT TRAIL= $$ (NUMBER, WHEN, WHO, WHERE, WHAT)
$$ ##TITLE= Audit trail, XWIN-NMR		Version 3.5
$$ ##JCAMPDX= 5.01
$$ ##ORIGIN= Bruker BioSpin GmbH
$$ ##OWNER= she
$$ F:/spectra/data/she/nmr/H-F/1/audita.txt
$$ ##AUDIT TRAIL=  $$ (NUMBER, WHEN, WHO, WHERE, WHAT)
(   1,<2020-12-16 11:31:50.42 +0400>,<she>,<DPX200>,
      <continue with go, POWCHK disabled, PULCHK disabled
       configuration hash MD5:
       00 E9 B6 7A A2 85 ED C7 34 08 36 98 17 FE 4E 26
       data hash MD5: 16K
       5D 7B 1B 71 E1 6E A0 85 02 21 3F 1B F5 A4 06 F2>)
$$ ##END=
$$ 
$$ hash MD5
$$ 24 ED CC 0B 01 93 38 2B C3 E8 CC 73 CF 84 26 B2
##$RELAX= 
##$RELAX= 
##$RELAX= 
##$RELAX= 
##$RELAX= 
##$RELAX= 
$$ Bruker specific parameters
$$ --------------------------
##$DU= <F:/spectra>
##$EXPNO= 1
##$NAME= <H-F>
##$PROCNO= 1
##$TYPE= <nmr>
##$USER= <she>
##$AMP= (0..31)
100 100 100 100 100 100 100 100 100 100 100 100 100 100 100 100 100 100 
100 100 100 100 100 100 100 100 100 100 100 100 100 100 
##$AQSEQ= 0
##$AQ_mod= 1
##$AUNM= <au_zg>
##$AUTOPOS= <>
##$BF1= 200.13
##$BF2= 200.13
##$BF3= 200.13
##$BF4= 200.13
##$BF5= 200.13
##$BF6= 200.13
##$BF7= 200.13
##$BF8= 200.13
##$BYTORDA= 1
##$CFDGTYP= 0
##$CFRGTYP= 5
##$CHEMSTR= <none>
##$CNST= (0..31)
1 1 145 1 1 1 1 1 1 1 1 1 1 1 1 1 1 1 1 1 1 1 1 1 1 1 1 1 1 1 1 1 
##$CPDPRG= <>
##$CPDPRG1= <>
##$CPDPRG2= <>
##$CPDPRG3= <>
##$CPDPRG4= <mlev>
##$CPDPRG5= <mlev>
##$CPDPRG6= <mlev>
##$CPDPRG7= <mlev>
##$CPDPRG8= <mlev>
##$CPDPRGB= <>
##$CPDPRGT= <>
##$D= (0..31)
0 1.2 0 0 0 0 0 0 0 0.06 0 0.03 0 0 0 0 0.0002 0 0 0 0 0 0 0 0 0 0 0 0 
0 0 0 
##$DATE= 1608103502
##$DBL= (0..7)
120 120 120 120 120 120 120 120 
##$DBP= (0..7)
150 150 150 150 150 150 150 150 
##$DBP07= 0
##$DBPNAM0= <>
##$DBPNAM1= <>
##$DBPNAM2= <>
##$DBPNAM3= <>
##$DBPNAM4= <>
##$DBPNAM5= <>
##$DBPNAM6= <>
##$DBPNAM7= <>
##$DBPOAL= (0..7)
0.5 0.5 0.5 0.5 0.5 0.5 0.5 0.5 
##$DBPOFFS= (0..7)
0 0 0 0 0 0 0 0 
##$DE= 6
##$DECBNUC= <off>
##$DECIM= 32
##$DECNUC= <off>
##$DECSTAT= 4
##$DIGMOD= 1
##$DIGTYP= 9
##$DL= (0..7)
0 120 120 120 120 120 120 120 
##$DP= (0..7)
150 150 150 150 150 150 150 150 
##$DP07= 0
##$DPNAME0= <>
##$DPNAME1= <>
##$DPNAME2= <>
##$DPNAME3= <>
##$DPNAME4= <>
##$DPNAME5= <>
##$DPNAME6= <>
##$DPNAME7= <>
##$DPOAL= (0..7)
0.5 0.5 0.5 0.5 0.5 0.5 0.5 0.5 
##$DPOFFS= (0..7)
0 0 0 0 0 0 0 0 
##$DQDMODE= 0
##$DR= 18
##$DS= 0
$$ [...]
##$SUBNAM2= <"">
##$SUBNAM3= <"">
##$SUBNAM4= <"">
##$SUBNAM5= <"">
##$SUBNAM6= <"">
##$SUBNAM7= <"">
##$SUBNAM8= <"">
##$SUBNAM9= <"">
##$SW= 16.9725356469052
##$SWIBOX= (0..15)
0 0 2 0 0 0 0 0 0 0 0 0 0 0 0 0 
##$SW_h= 3396.73913043478
##$TD= 16384
##$TD0= 1
##$TE= 0
##$TE2= 300
##$TE3= 300
##$TEG= 300
##$TL= (0..7)
0 120 120 120 120 120 120 120 
##$TP= (0..7)
150 150 150 150 150 150 150 150 
##$TP07= 0
##$TPNAME0= <>
##$TPNAME1= <>
##$TPNAME2= <>
##$TPNAME3= <>
##$TPNAME4= <>
##$TPNAME5= <>
##$TPNAME6= <>
##$TPNAME7= <>
##$TPOAL= (0..7)
0.5 0.5 0.5 0.5 0.5 0.5 0.5 0.5 
##$TPOFFS= (0..7)
0 0 0 0 0 0 0 0 
##$TUNHIN= 0
##$TUNHOUT= 0
##$TUNXOUT= 0
##$USERA1= <user>
##$USERA2= <user>
##$USERA3= <user>
##$USERA4= <user>
##$USERA5= <user>
##$V9= 5
##$VALIST= <valist>
##$VCLIST= <CCCCCCCCCCCCCCC>
##$VD= 0
##$VDLIST= <DDDDDDDDDDDDDDD>
##$VPLIST= <PPPPPPPPPPPPPPP>
##$VTLIST= <TTTTTTTTTTTTTTT>
##$WBST= 1024
##$WBSW= 4
##$XGAIN= (0..3)
0 0 0 0 
##$XL= 0
##$YL= 0
##$YMAX_a= 13011
##$YMIN_a= -10535
##$ZGOPTNS= <>
##$ZL1= 120
##$ZL2= 120
##$ZL3= 120
##$ZL4= 120
##$ABSF1= 10
##$ABSF2= 0
##$ABSG= 5
##$ABSL= 3
##$ALPHA= 0
##$AQORDER= 0
##$ASSFAC= 0
##$ASSFACI= 0
##$ASSFACX= 0
##$ASSWID= 0
##$AUNMP= <proc_1d>
##$AZFE= 0.1
##$AZFW= 0.1
##$BCFW= 1
##$BC_mod= 2
##$BYTORDP= 1
##$COROFFS= 0
##$CY= 11.3945322036743
##$DATMOD= 1
##$DC= 2
##$DFILT= <>
##$DTYPP= 0
##$F1P= 15.9154993809931
##$F2P= -4.1035820241983
##$FCOR= 0.5
##$FTSIZE= 0
##$FT_mod= 4
##$GAMMA= 1
##$GB= 0.15
##$INTBC= 1
##$INTSCL= 1
##$ISEN= 128
##$LB= 0.24
##$LEV0= 0
##$LPBIN= 0
##$MAXI= 10000
##$MC2= 0
##$MEAN= 0
##$ME_mod= 0
##$MI= 1.114404
##$NCOEF= 0
##$NC_proc= 0
##$NLEV= 6
##$NOISF1= 3.799351
##$NOISF2= 2.8
##$NSP= 1
##$NTH_PI= 0
##$NZP= 0
##$OFFSET= 15.70392
##$PC= 1
##$PHC0= -10800.83
##$PHC1= -36.99908
##$PH_mod= 1
##$PKNL= yes
##$PPARMOD= 0
##$PSCAL= 0
##$PSIGN= 0
##$REVERSE= no
##$SF= 200.130013532006
##$SI= 16384
##$SIGF1= 3
##$SIGF2= 2
##$SINO= 400
##$SIOLD= 16384
##$SREGLST= <1H.CDCl3>
##$SSB= 0
##$STSI= 0
##$STSR= 0
##$SW_p= 3612.71676300578
##$SYMM= 0
##$S_DEV= 0
##$TDeff= 0
##$TDoff= 0
##$TI= <>
##$TILT= no
##$TM1= 0
##$TM2= 0
##$TOPLEV= 0
##$USERP1= <user>
##$USERP2= <user>
##$USERP3= <user>
##$USERP4= <user>
##$USERP5= <user>
##$WDW= 1
##$XDIM= 8192
##$YMAX_p= 0
##$YMIN_p= 0
$$ End of Bruker specific parameters
$$ ---------------------------------
##NTUPLES= NMR FID
##VAR_NAME=  TIME,          FID/REAL,        FID/IMAG
##SYMBOL=    X,             R,               I
##VAR_TYPE=  INDEPENDENT,   DEPENDENT,       DEPENDENT
##VAR_FORM=  AFFN,          ASDF,            ASDF
##VAR_DIM=   8192,          8192,            8192
##UNITS=     SECONDS,       ARBITRARY UNITS, ARBITRARY UNITS
##FACTOR=    0.0002944,     1,               1
##FIRST=     0,             0,               0
##LAST=      2.4114304,     0,               0
##MIN=       0,             -10535,          0
##MAX=       2.4114304,     13011,           0
$$ Real data points
##PAGE= N=1
##DATA TABLE= (X++(R..R)), XYDATA
$$ [...]
773A3L88n89o3O43n89j06O93n13k82P43l00m90P47k46n58P16p3n91P16M7p21M97
795H2K96p59L33M92p09J87M84n74L7N11m68q6N46m09k59M96k15l45N32j79l03
816c10L94N5l47K48J4l01K20O2k59J75M9o3j1O0q7Q3l4M9O2p9L1J21j66K0J45
841A31j02J1J41j64r4K92j69k25L61m4l95M85j32l99L85Qm17L64J98n17K50K35
863B03m55O9L88m05m6M96l60j31N27k52l59N26n0n01N27l7m30M09J09m57L09J83
885B63m48J59K92k70j47M10j74k44L54j50j83J93j31n5J56Pj59M8J56k20oJ35
907a4j25q9K79Q1k64J72O7k14J00N7q3N9J84j93n1K60k53k44M38n8j41J50N0l16
931a48K41%k11J01J47j65NQ2j41l4K72k2l29K28J09l56K50J4l33K55J26k67Q5
$$ plain form
773 13 401 -188 -251 392 -197 -303 390 -123 -405 338 38 -452 295 49 -509 207 134 -457 259 306 -415 82
795 82 378 -381 -48 444 -265 -78 406 -168 -131 380 -88 -174 372 -37 -296 200 -15 -360 172 -7 -310
816 -310 84 139 -208 40 54 -247 -27 35 -224 -49 0 -63 -74 -14 -101 -18 -52 -3 59 -20 11 132 -34 -14 131
841 131 29 40 181 17 -77 215 46 -179 182 138 -257 228 96 -303 82 90 -327 37 235 -282 -32 203
863 203 -252 -183 205 -200 -246 250 -110 -241 286 34 -325 201 151 -350 177 140 -290 119 228 -229 80 263
885 263 -185 -26 266 -4 -151 259 85 -159 195 45 -138 55 -76 -131 25 32 -127 -79 77 -143 -149 -14
907 -14 -139 -228 51 132 -132 40 107 -107 -7 50 -33 26 210 17 -34 226 -27 -271 167 109 -32 118 168 -148
931 -148 93 93 -118 -17 130 -35 -30 52 -89 -123 149 127 -202 26 135 -221 29 43 -290 -35 91 -176 -91
954i1L33l01l3K61m2l18L74j6m43L84K3k42J63P1k07J7K07k09m9K94k17j43L31
977A47nk72J98N7l35K22N8k48J70Q4j72N6J74k22KR1%r6K04j8k40J64L5j65J91
1002H0J2k01J41P8k07J42J53j43r1J91q8j54K53q6k51K41J14l76R7J62k13J8J67
1025C9j73m7K54r2j32J67N8k29K20J48l86J42J48k05M1K72k57m8K51p7j48J86
1047A32n9j92K90o6k11J56J24k29J31K2l12J24Q9j40J23NJ2q8P1oJ4m8P4l8n4
1072g6J07l2k9L4K9j13QJ24j19M9R2j13j2J22n4r6K87k34j15L83j14l90M24r9
1096F3k61K48J02m82L82J22m68K65K85n03nN39m23P0M30n20j74N46k41l03N80
1117B52k91k58N50j07m08M32l2m78N07K2m68L03L46n99J96L47n88L92K13n84L28
$$ plain form
954 -91 242 -59 -92 169 127 -191 183 167 -276 108 131 -111 52 123 -84 -67 140 -69 -118 176 -41 -184 147
977 147 142 -130 68 125 -210 12 70 -178 -8 76 -96 -40 134 -88 -86 5 5 -91 113 95 -145 19 54 -111 80
1002 80 92 -109 32 110 -97 45 198 55 -36 155 67 -87 166 80 -171 70 184 -192 -95 67 -146 -128 39
1025 39 -134 -181 73 -19 -151 16 74 -155 65 213 -173 -31 117 -88 -47 225 -32 -80 171 94 -54 132
1047 132 73 -119 171 105 -106 50 174 -55 76 98 -214 -90 -1 -141 -18 -13 -1 -89 -18 -24 -10 -58 16 -22 -76
1072 -76 31 -1 -30 4 33 -80 -72 52 -67 -18 74 -39 -51 71 17 -79 208 -26 -141 242 128 -262 162 63
1096 63 -198 50 152 -330 52 174 -294 -29 256 -247 -252 287 -136 -66 364 -156 -330 216 -25 -328 252
1117 252 -39 -297 253 146 -262 170 138 -340 167 189 -279 24 370 -229 -33 314 -274 118 331 -253 75
1138G5O0l27Q0L84m53J27J57k23M0L09m16l2L72l96J71K27l57J30L57m74k3N98
1160C86n30n9M80k26k34N24l24l15Q00m88l58P83k16n65P12k75m82P76k65o76
1180e52Q71m0r16Q32J17r37P41J97r67P72L79j032M68N97r98L83P16j004J66Q27
1200F20j013P4R91q53j17R96p82k92R97o57l77R75m84n59J017m59o30R68l12o77
1220e74J017k53p72R09j18q18R19Jr36Q28R7q70P78J44r95P11L84j040O27M39
1240D78j010O54M97j175N68O71j170L56R17j281L15R40j180J47J033j072o7J238
1258H59j165k48J383j032m50J409q67o99J506o96q87J569n06j101J495k82j196
1275i08J398r3j372J357J38j435J182M18j527J013O08j589Q67P81j559O27R91
$$ plain form
1138 75 135 -192 -112 272 -181 -54 103 -120 -80 229 -187 -219 153 -243 -72 155 -202 -72 285 -189 -212 386
1160 386 -144 -203 277 51 -183 341 17 -298 502 14 -344 439 223 -342 370 95 -387 389 124 -552
1180 -552 319 279 -637 195 312 -625 116 313 -654 118 497 -535 -67 530 -468 -85 631 -373 -207 620
1200 620 -393 -319 672 -181 -298 698 -84 -376 621 -36 -413 562 78 -481 536 77 -553 415 103 -574
1220 -574 443 190 -582 327 209 -609 310 311 -625 203 300 -570 208 352 -643 68 452 -588 39 478
1240 478 -532 122 619 -556 12 683 -487 -131 786 -495 -180 760 -420 -273 760 -312 -379 859
1258 859 -306 -554 829 -203 -653 756 -111 -810 696 0 -887 682 176 -925 570 288 -908
1275 -908 490 397 -975 382 520 -915 267 685 -842 171 779 -810 57 838 -721 -94 897
1292H97j602N48J050j433K99J141j303l2J319j304q5J389j202k77J353j001m53
1309f96J494r04o77J461p03p49J569q04q58J658o07j105J634m20j257J645k39
1326D42j385J587p9j530J430K50j663J299L96j690J123Q34k040J051R84j899P99
1343i1J128j834M70J337j701K38J429j470j42J773j535l86J796j261o64J955j199
1360a57p93J974j043r88J973p56j257J963n58j358J730k93j507J654j5j655J533
1377D47K90j790J409M97j881J201O49j800R52Q76j790Q41J017j745O66J071j647
1394g37L96J313j649K48J436j567R2J506j395k28J744j475l74J838j332o14J863
1411A065j155q97K057j010j060J998p37j403J966m55j603J882j42j700J719K09
$$ plain form
1292 897 -705 -157 893 -540 -241 900 -403 -435 884 -420 -505 884 -318 -595 758 -243 -696
1309 -696 798 -106 -783 678 -25 -774 795 -9 -867 791 184 -921 713 293 -964 681 442
1326 442 -943 644 565 -965 465 715 -948 351 747 -943 180 1014 -1026 25 1009 -890 -91
1343 -91 1037 -797 -327 1010 -691 -453 976 -494 -636 1137 -398 -784 1012 -249 -913 1042 -157
1360 -157 -950 1024 -19 -1007 966 210 -1047 916 358 -1000 730 437 -1070 584 569 -1086 447
1377 447 737 -1053 356 853 -1028 173 822 -978 -26 850 -940 -99 918 -827 -161 910 -737
1394 -737 -341 972 -677 -429 1007 -560 -468 1038 -357 -585 1159 -316 -690 1148 -184 -798 1065
1411 1065 -90 -987 1070 60 -1000 998 261 -1142 824 369 -1234 648 506 -1194 525 734
1427G34j966J620M21j994J378P15k041J196Q99j964R41J115k000O80J344j858
1443g80M03J525j748J16J652j638j31J764j483m39J863j231o98J842j041q57J810
1460I29q55j036J804o60j137J784n81j295J676k01j460J598r7j489J414J91j610
1477a025J353L31j656J221M90j665J098O71j727R50Q32j697P56J044j682N11J227
1494A032j695L13J418j559n5J657j533j95J684j345m77J700j152o43J782j022
1510i0q96J781o42j182J700m21j260J556j68j397J456R2j533J438K05j536J226
1527C29M11j612J057N65j543Q79P13j525O10R70j454L82J064j326K05J056j191
1544d10K7J211j156j97J311j149j41J232j092l62J465r29m42J264p11n78J321
$$ plain form
1427 734 -1232 388 809 -1185 193 908 -1133 63 962 -1002 -61 1054 -946 -266 1078 -780
1443 -780 -377 1148 -600 -484 1168 -470 -601 1163 -320 -759 1104 -127 -825 1017 -24 -881 929
1460 929 74 -962 842 182 -955 829 248 -1047 629 428 -1032 566 469 -1020 394 585 -1025
1477 -1025 328 659 -997 224 714 -951 147 818 -909 41 873 -824 -68 976 -706 -195 1032
1494 1032 -663 -350 1068 -491 -546 1111 -422 -617 1067 -278 -755 945 -207 -850 932 -90
1510 -90 -986 795 153 -1029 671 250 -1010 546 378 -1019 437 529 -1004 434 639 -897 329
1527 329 740 -872 185 750 -793 86 799 -726 -116 854 -600 -218 846 -480 -275 781 -410
1544 -410 -383 828 -328 -525 786 -363 -504 728 -364 -726 739 -190 -632 632 -79 -657 664
1561F64m73q73J303m37r75J252j71j006J199n4j150J190o5j122J026L25j432J097
1579B98K21j144P31N50j333O41P46j256L54R62j363K43J093j109j8J136j235k7
1597e10J243r73k92J161p64m43J208o83m43J134n50o00J030m20o33J001j86p82
1615e02R30j21q89R31N0r52P91J66r43O47K93r02O44K19q59N11L18q20L59N06
1635C77p54K60N69q02K37N50p68J49O92p91%P48o47j08Q08o08j82P74n35k70P71
1656D70n06l08Q28l70m87P90k56o21P95k40n40O67k3o91O68M4o96N77J98p33M86
1677E2K78q05M77M17p76L12M93p75K69M23n63J02M26m61R1M27m26j58N44l34k08
1698a95N60l41k13M70k39k19M51j65l14M17j67k87M04j05k81L67q0l22L27K4k87
$$ plain form
1561 664 191 -682 621 184 -791 461 290 -716 483 429 -721 469 404 -718 308 633 -799 298
1579 298 519 -625 106 656 -677 -36 710 -546 -192 770 -593 -350 743 -366 -384 752 -483 -510
1597 -510 733 -240 -532 629 -135 -578 630 -53 -496 638 88 -512 518 98 -535 466 280 -502
1615 -502 428 307 -582 349 399 -553 238 404 -539 108 401 -501 143 362 -497 14 332 -488 -129 377
1635 377 -377 -117 452 -350 -113 437 -331 -182 510 -281 -281 467 -180 -288 520 -88 -270 504 -31 -301 470
1656 470 -36 -344 484 114 -373 417 161 -460 335 95 -445 222 199 -492 176 220 -476 101 299 -434 52
1677 52 330 -475 2 419 -357 -45 448 -327 -58 365 -198 -96 330 -131 -40 387 -39 -197 347 13 -195
1698 -195 365 24 -189 281 42 -177 274 109 -205 212 45 -242 162 57 -224 143 63 -259 68 92 -195
1719a95L00Ql15K71P9l08K67R9m01K56J22l51K39J44l22K03J50l63J09K39l26
1740i5N2K84l36K6L26l22m0L37k89r0L33k04k06M00k38j56L34j35k28L72m2k35
1762a52K11L6l02L25J8k60K18O4k54J12J58k39J23J04j73QJ54j78N7R0j19k1Q2
1785F2r5M6M2o8MQ9j29j7P3l5m4J00p6j9P2n2j5Q9n7RP3q2j7N4j1JJ06k0p6Q4
1815I1o7j9J05m4o2R3j9j44J30kj23J22l9q2O5K5r2j5R4m5KQ0o3j01J48m4j24
1842a30J65nj14J11m1m8N6N3k1l2Q3o9PM4j3mP3r0k9Q6o7J1J8J2ro2M8l2k2L9
1872A8K3j01N8k4q9Q1J4m7Q5l4KlJ8q0Q5L4l9l2L7J1j9R9k5o7J01k5n0J8rm6O3
1903E7Mj49R2M0k6m1N4j7n7M5J0r2M7Rr1P0K8p1M6L6k2%N8l7l6Q4k8o6Q2Q8r6
$$ plain form
1719 -195 105 113 -202 69 148 -160 107 206 -195 61 183 -168 71 215 -107 96 246 -117 -8 231 -95
1740 -95 -43 241 -95 -69 257 -65 -105 232 -57 -147 186 -18 -224 176 -62 -218 116 -19 -247 125 83 -152
1762 -152 59 95 -207 118 136 -124 94 158 -96 16 174 -65 58 162 -11 -3 151 -27 30 120 1 -20 62
1785 62 -33 13 55 -13 -9 80 -49 -66 7 -28 -72 28 -48 -67 5 -47 -62 27 -30 -21 52 -30 -47 7 -4 -3 103 83 7 91
1815 91 24 5 110 66 4 97 78 -66 64 62 -61 61 22 -60 5 30 -62 -77 17 -28 -26 54 -9 -110 38 -6 -130
1842 -130 35 30 -84 27 -14 -62 -6 47 26 -6 77 8 15 59 46 42 115 25 -4 82 15 26 44 56 47 -15 33 1 -21 18
1872 18 41 -60 -2 -26 -115 -34 -20 -67 18 -16 -14 -17 1 -79 6 40 1 -31 6 17 -2 97 72 5 106 81 31 49 40 -6 57
1903 57 61 -88 4 44 18 -23 31 14 -43 2 12 -80 -33 -24 -115 -45 -17 -88 -42 -6 -28 -28 30 -7 -43 41 13 -53 29 117 21
1934B1K2L6m4j3J4K6k2m5kN1jko0J29o6o5K5nM4n6Q0j95O0ROk4RN4nj9L2l9K7
1967a8MN9K5O2j25Q1o5j6lJ29j41m2J40J2j91J14J02j79O6k0J8L3K3k8l4lp5l2
1995a04J61rr7RL0n7O7L8p9K3Q0j41Q5k0k4N9J8m4l2J07l1r3J48n6j7L1j7j8J18
2024A35j32M6n5n5L6LJ6oj3n2k3Q6k7m9J17j48N2P2L6p6N0l8OM6m2l1J04q1j4
2053c7J44p4p8J48r9n7J65q4o4J19k8r5R7J6j21R1Kj12J16K4k17J09R6j17KP0
2079A6p5JJ03j04k8J29m9j25K13q2j05J26j03L7R8lj10P9L2o0R7J2n8L3K6k00
2105a00J46N5n1k7l5r8J27Nm7k3Q6p5oJ02j51Q9K5j31J69mj64J66n2l0K8K5n0
2132b1RP6p2m7J94o1p1J34j37J0J48j27m1J01j17l0J70j15j22K15n7r1Q1K5j45
$$ plain form
1934 21 43 79 35 22 36 62 40 -5 -7 44 43 41 -19 110 44 -21 4 -1 43 -13 67 -128 -68 -59 -53 -77 -68 -14 -19 -38 -6 -45 -18
1967 -18 -14 45 70 132 7 88 23 7 4 133 -8 -50 90 102 -89 25 127 -52 14 -6 12 45 68 40 6 3 -72 -104
1995 -104 57 48 -49 -40 -10 -67 0 38 -41 -18 62 -79 6 -14 -38 21 39 -5 -37 70 39 -54 94 38 21 52 35 17 135
2024 135 3 49 -6 -61 -25 -22 -6 -12 -25 -77 -100 -14 -41 -90 27 -121 -69 3 39 -37 13 -25 -19 27 -15 -46 58 -23 -37
2053 -37 107 33 -45 103 4 -53 112 28 -36 83 55 -40 57 73 -48 43 45 -67 49 73 -144 -35 61 -56 -54 16
2079 16 -59 -58 45 -59 -87 42 -7 -132 81 -1 -106 20 -83 -46 52 49 -61 18 50 -10 87 99 41 74 100 -100
2105 -100 46 101 50 23 -12 -110 17 22 -25 -48 38 -37 -43 59 -92 -3 22 -109 60 56 -108 58 6 -24 4 29 -21
2132 -21 -12 64 -8 -55 139 78 7 141 4 14 162 35 -6 95 -22 -52 118 3 -119 96 39 -52 29 54 -91
2157i1R7j3n7O7M6j71J04P2j63rK20j38K5Q4n8k7J22p1o1J42j92J07O3q1JR8r6
2184B0p6J16n8m2J51n8q2J31j20m8J28j17KQ2r7M3M0l7J6n3O3l7K6J4p7J30p1
2211a1m3P8J2j32J14N0n8J7N6r8J09K7j27PP2q1J5M9j33J3J39o1l8R8p7k6Q5q5
2239b9l9J01l8r9R6Jn9O2L3o7Q3Mq1L4O9j73J65J5j30R0J1J8j05R7m4M3j3Om1
2268A0NL0l2J8k6Ql4J3MN7r4Q4p4J04j21l6L0K1l0r4K12p2P1m2L0n6pR5m8o9J74
2299A31l5j03Q2Kn2P9J7j41N6j2j0K6Kn8o7P9RJ4Pm7LRLn2P2k7lM2ml6m0R0j17
2332h1J01L0l3m1M9k2QM9jj5QJ5k3K9m6P1o9L4k2lj1po9R3m6n8J00p7K5L3l5n1
2364f5N4K2n6kJ19o3k3P2J7j09M6j8P5k9K0o4N1m9R1J8j4q7L6L8k8j3K9M0j01
$$ plain form
2157 -91 6 -7 -64 3 49 -122 -18 54 -109 -118 102 -36 -11 73 15 -12 110 39 -22 120 -72 35 98 17 18 116 20
2184 20 -56 60 2 -40 111 53 -29 102 -18 -66 62 -55 -53 29 -68 -25 15 -22 -6 -59 4 -33 -7 7 -70 60 -11
2211 -11 -54 24 36 -96 18 68 10 27 83 -15 94 121 -6 1 73 -8 7 56 -77 -64 75 14 -24 74 -3 -29 56 -29
2239 -29 -68 33 -5 -104 -8 -7 -66 -4 29 -38 45 49 -32 2 71 -102 63 78 -52 38 49 67 -38 59 15 58 45 51 10
2268 10 15 45 13 31 5 13 -21 -8 -4 53 -41 43 -31 73 -48 -84 -54 -33 -63 -157 55 -17 54 12 42 -14 -21 74 26 -43 131
2299 131 96 -7 75 77 25 104 121 -20 36 24 14 40 42 -16 -83 -4 5 19 26 -21 -18 -9 -6 -58 14 -13 -16 26 22 -14 -54 36 -81
2332 -81 20 50 17 -24 25 3 11 60 59 44 52 67 44 73 27 98 29 63 41 38 27 20 -49 44 -2 -60 40 -37 -12 21 -14 -65
2364 -65 -11 11 -45 -47 72 9 -14 58 75 -34 12 -6 69 40 60 -4 47 -2 89 107 93 6 42 80 52 39 68 108 7
2393GL7k1p5L5L4m6J7j5N1j10Q4n5J5M3j3Qj0K2OK8o5oJ02j11L8R5p4J9nP4q3
2424B6L8j8L5k9J9j7m7K3j3rk7K3j6ORJl5L9K0m7k9R3q7J4M2l7lN2k8l3O9k8l1
2457b5Q3J6o9O3j1k4k1J10j21P4j0p3K9N6r1J9P3j17J8J10j05O3k2p0j4Q8l0n5
2485e6J16o9r0J83n9j04J26l8p9J06Jj01J26K0r6N4N1r6J02K5r8N1M0j30P6N4
2511A15j22NO8j27R0M0j79O6J24j60M6P3q4j0J30j20KJ32j80J7J47r4m9J98r3
2536C5q3J97j43q0K24q6j50K44p0j63K20o7j80K20J3k68K33N6k86J80R4k34J22
2559B8J19l32K18J39l29J33Q2j61O5J78k02kK35k30j6K49j95o6K61j48j16K66
2581A76j47j92L75j38k09L07p2k19K87q8k32K83r4j88L00N1l88K70j8k45K79J7
$$ plain form
2393 7 44 23 -52 -17 17 -29 -12 -27 24 -86 -2 -57 -42 1 -12 -4 -14 8 14 42 -23 -29 73 -38 0 95 21 40 35 109 26
2424 26 64 46 81 52 71 54 7 30 17 8 -19 4 -12 -6 3 4 -31 8 28 -19 -48 45 -42 -28 14 -23 -26 26 -2 -35 34 6 -25
2457 -25 58 74 5 68 57 33 12 122 1 75 65 -8 21 77 -14 5 78 -39 -21 89 -16 47 25 -45 -59 29 -1 -56
2485 -56 60 -9 -99 84 25 -79 47 9 -70 36 37 -64 62 82 -14 40 91 -5 97 122 24 75 115 -15 61 115
2511 115 -7 -2 66 -61 29 69 -110 -44 80 -80 -34 39 -45 -55 75 -45 -43 89 -91 -74 73 -21 -70 128 35
2536 35 -48 149 6 -74 150 64 -86 158 88 -75 145 78 -102 118 131 -137 96 152 -134 46 140 -94 28
2559 28 147 -185 33 172 -157 -24 58 -103 -38 140 -62 -64 171 -59 -75 174 -21 -87 174 26 -90 176
2581 176 29 -163 212 74 -135 172 100 -119 168 80 -152 131 37 -151 149 200 -188 82 64 -181 98 115
2603A15l44K82R3l62K19J64l92K24J66l55J37K50l79J44K21k92L3L22l48L7L10
2624B45k62p4L34l22J7L54k85j84M88k88j49L22j44l19M03p5l32M43l6l84L92
2645A44k6m62N06ll84L43J42n17K47K24m09J69L26n13K14K56m51K46K01l97Q0
2666f4L64m15K9L70l92OM85m51o5M13m17l5N18l41k10N22m05j75M99k15k33M18
2688B06j92l48N00j31l57M91n7m13M60j9m65M72P2m66L31K00n54L17K32n09L00
2709G0K40n31K27L69o20K19L94n87J10M82o02M0M74n16k0N59m22k29N91l50j80
2730b82N66k49l10N25l20j63M47j24m65O01k5n85O55Oo90O77j14m20M36R8m85
2751b21L09K32m89K46J62n47L21K85m78J16L45m99J17M19n56R7M31n54Q8M98m81
$$ plain form
2603 115 -229 53 146 -216 3 167 -225 -1 165 -190 -53 197 -182 -38 183 -109 -76 246 -102 -65 245
2624 245 -17 -91 243 -79 -62 292 7 -177 311 23 -126 196 52 -267 136 61 -271 172 136 -248 144
2645 144 118 -344 162 159 -225 118 260 -257 -10 214 -195 -26 300 -213 1 257 -194 52 253 -144 -64
2666 -64 300 -115 -86 284 -108 -102 383 -68 -133 280 -137 -172 346 5 -205 317 -88 -263 236 21 -212 206
2688 206 14 -334 166 35 -322 169 112 -301 159 140 -325 147 219 -247 84 284 -270 47 279 -230 70
2709 70 310 -221 6 375 -245 -26 368 -219 -109 373 -229 -189 285 -231 -251 308 -114 -343 248 -102 -282
2730 -282 284 35 -275 250 -70 -233 214 90 -375 226 201 -384 271 277 -413 264 150 -270 166 264 -221
2751 -221 88 320 -169 77 239 -308 13 298 -180 -64 281 -218 -101 318 -238 -141 290 -264 -176 322 -159
2772a59l7N07m30q8N64m01k21O31l58l45O77k43l86O04j67m59O69k01n14O13n0
2793B06n65O90j99m04L16K19n54L94K10o82L80L59o92L47J70m48K08L02n42J73
2813a12N01n50K4M52n02J1N14m84l8N43m24j59N90l79k00N99l40k97N99l26l15
2834b93N95k10l54N15j46m03N25j18m53M94Pm57M21P0n49L96K28o17L39L08o34
2855c36L72K87n16K01L32o18K16L91n17R1M28m61kM76m48n2M86l30j84N26l07
2876C5k95N54l66j04M97k11m02N93k22l31M83j27l59L87J14n14M08J02o30M49
2896F1J87n41L57J25n23M34J76n64L32K28m58J78K99m30O6M05m37L2L57l16m5
2917g7L22l21j6L98m58L3M23m29n2L99l14j15M06j37l61N73j65l68L61r7k79L53
$$ plain form
2772 -159 -196 311 -119 -207 357 -44 -265 366 8 -337 340 97 -289 315 148 -311 358 157 -357 256 206
2793 206 -359 331 132 -272 44 263 -291 103 313 -369 11 370 -322 25 195 -253 -45 257 -285 -112
2813 -112 389 -161 -137 315 -187 -176 338 -146 -184 359 -65 -224 366 -13 -213 386 46 -251 348 22 -293
2834 -293 302 92 -262 253 107 -296 229 111 -342 152 159 -298 123 193 -356 40 268 -349 -10 298 -336
2855 -336 36 323 -193 8 340 -278 -62 329 -188 -97 331 -130 -132 344 -104 -156 330 0 -184 342 35
2876 35 -260 294 -72 -176 321 110 -292 301 79 -252 231 104 -255 132 246 -268 140 242 -388 61
2896 61 248 -293 64 189 -334 100 276 -288 44 272 -186 -8 291 -139 -73 332 -105 -73 284 -32 -77
2917 -77 245 -76 -92 306 -152 -119 304 -125 -177 222 -92 -207 199 62 -299 274 109 -259 102 5 -274 79
2939G9L8l53L74K9l78L41R5l82K83J18m35K88J38m06J92K31m58K35J72l50J06
2960d3L36n13J43L47l95R8K37l02q1M26l25j06L78k96n2L22j74j85K79j08k03
2981b17L99j51j82L00p3k42L11o0k37K65O2l24K57L6k56J78J15k97J53J15k94
3002a42J61J51k98P8K10l13J11K32l01N7K36k88o8L38k43k9K70j90o9K85k12j38
3024a62L01j25j17K67j24j09K11o9j67K38p4j15J57J0k71K13O5k26J53O4k34J46
3046C2R0j90Q7P2j89Q1J52k46Q2J76k89O2J86j22PJ06q2m8J21p5l7J48o1j05K09
3071A67j23p8J43q6n9J47m4r0J51r7r8J44m4j39J66j9j30R8N7j62J41J5j57J01
3095DN4j74Q0M2j58J61M7j22P7M0n7J6R0m8mN8n5l2Q9l9j0mj8p7K03j59o0J57
$$ plain form
2939 79 117 -236 138 167 -211 130 225 -157 126 244 -191 97 235 -171 21 252 -206 29 201 -149 -43
2960 -43 293 -220 -77 270 -125 -27 210 -92 -173 253 -72 -178 200 -96 -148 174 0 -185 94 -14 -217
2981 -217 182 31 -151 149 76 -166 145 85 -152 113 175 -149 108 144 -112 66 181 -116 37 152 -142
3002 -142 19 170 -128 -50 160 -153 -42 190 -111 -54 182 -106 -174 164 -79 -108 162 -28 -97 188 -24 -162
3024 -162 139 14 -103 164 40 -69 142 73 -94 144 70 -45 112 122 -149 64 129 -97 56 120 -114 32
3046 32 122 -68 19 91 -98 -17 135 -111 -29 147 -142 -80 106 -16 -9 97 15 -33 88 13 -24 124 63 -42 167
3071 167 44 -34 109 23 -36 111 67 -23 128 31 -67 77 33 -106 60 41 -89 9 66 -96 45 60 -97 4
3095 4 58 -116 -36 6 -152 9 56 -66 11 51 -6 10 100 52 48 106 51 19 108 69 59 55 37 -40 163 4 -56 101
3123A01j26P4nPr0P6j0o2P6k0m9M4L6q0J7J00r9J01m4q4Q5L4j50J29L5o6J3Ol1
3152A8j5K2K2J8Q0j18J17m5m8q4J02n2m4K5m9O3N2q2QJ4m3J4O0m1k4L7J9l0N1
3181D7Pn0N5m0J4K8J3p0N6KJ8m8N2n8J5m1n1O5p6J80r2N7n2k5j1p9J69j06J18
3210I7j11q7Q9J0L5q3P0ol5QKM4m2LN3j8mK8l3N2l0qjJ8k4K5Kj9J6j4Pj1j0j3
3244A0L1j9j5l6M0j8k6kL5J2k0O6j7l7m6O6k1m1Q1k9K2J0k6L1k0J9Nrm3Q6o7K
3276B4J7l9K7j7RKJ3pK2m3Nk8j4L7k3l8L1K3k6L4L1k6M0p2L9m4M5J8n4N5r1O5
3308A5lK9jJ9oL8n3k8L2k5L%Kk6QL1%n0L2JmJk8JJ4P%l2M7Pl7N0o6NnO4l2j0r
3347iM9K9Kn9L2qm5L2N0q4L3K5n3J30q5p2KL1K3k4l0L7Oj2k1OoK9n4M3j6J0lP4
$$ plain form
3123 101 -25 49 44 51 -39 37 27 -35 41 21 -28 16 52 -28 -11 89 -10 91 47 -37 48 82 -68 61 96 30 43 49 18
3152 18 3 25 47 65 145 27 144 99 51 -33 69 17 -27 -2 -51 12 64 -18 -10 4 -39 -25 35 -6 -30 7 26 -4 47
3181 47 54 4 59 19 33 61 74 4 60 62 80 32 84 26 41 0 -51 14 -62 118 26 83 31 6 -5 -84 85 -21 97
3210 97 -14 -101 -12 -2 33 -50 20 14 -21 -13 -11 33 -9 -6 47 29 25 53 20 72 42 34 33 51 27 52 54 35 51 37 44 33 23 10
3244 10 41 22 7 -29 11 -7 -33 -35 0 12 -8 58 41 4 -42 24 3 -38 43 14 36 46 20 51 31 50 55 46 3 89 22 24
3276 24 41 2 29 12 21 23 36 29 51 8 13 -15 -29 8 -15 -53 -22 1 -25 9 40 14 54 -18 21 -23 22 40 -14 41 -50 15
3308 15 12 41 40 59 53 91 38 10 42 17 20 20 22 -4 4 35 35 -15 17 18 14 15 -13 -12 2 9 9 -23 24 31 -6 44 -22 -17 -22 42 10 0 -9
3347 -9 40 69 71 12 44 36 -9 23 73 -11 22 47 -6 124 39 -33 -31 0 23 -1 -31 6 12 0 -21 -15 -21 8 -46 -3 -19 -9 -12 62
3381F2k6j2ol3mjL7m7Q8q7M6O9n8n1O7l8Q9n8k7M8m1mL2No2K7k7J7p5P7q0O3J1
3414Ak6j0N2Rm4kNlj6M3n6J02K0j19L8O7m1L1l5m8N9O1o2J7L5o1M8j3p5O2J0j4
3446C5K8m2k6JOk1n9P6Mn3P5m3j3J1l4j2N7K3J0n%rJ7K4l2J3L1o9L2j9MO7n7p6
3480e6P8LPk0j4j5J1j1P1o6P5j32jL8k8J39n6p4L8K3l1J7n1L6oL2o2L3N0j9k3
3511a4N1mj9Q1j1r7N2k1mj0pJP0o1o3Q0Nl1pj7n2Q0j4m5K4J5lNOMk4j2K8j5M1
3546A2o2N5K7j1L8o6M3n7J7oQ8m0K1j3n8N3l8N5n9%N9p2l0k0N5k1k4J4nP3n7k5
3578e4K2M8pJ0r3K9K6k9K3K5n2JJ16l3n0rP8o7M1L3p7K7rM6ln4J2K8m3J7j6mL1
3611A3n4J3J2r0J67n5k8N1p6O2m8P9o1o9J15J8j42J40l1O3j14M8oO2l7Jnj2L4
$$ plain form
3381 62 36 24 18 -15 -19 -20 17 -30 58 -29 17 86 28 -23 44 6 95 37 10 58 17 13 45 50 -12 15 -12 5 -70 7 -73 -10 1
3414 1 -25 -35 17 26 -18 -20 -15 -18 -34 9 -47 55 75 -44 -6 61 20 51 16 -32 27 88 26 43 78 17 65 52 -23 39 49 35
3446 35 63 21 -5 -4 2 -19 -78 -2 2 -51 24 -19 -32 -21 -55 -67 -10 13 23 18 18 9 26 50 18 31 62 -7 25 6 10 77 20 -56
3480 -56 22 25 32 12 -2 -17 -6 -17 54 -12 63 -69 -70 -32 -60 79 23 -51 -13 10 -21 -4 -55 -19 -25 7 -55 -22 28 9 -14
3511 -14 37 33 14 95 84 -13 39 18 14 4 -3 -2 68 7 -56 24 29 -2 -9 -26 -78 2 -12 -57 -33 -18 -21 -16 -10 -6 -30 -42 -14 -29 12
3546 12 -50 5 32 21 59 -7 36 -21 -4 -10 78 38 59 46 -12 41 3 58 -1 -1 58 -14 -44 -64 -9 -30 -54 -40 -45 28 -29 -54
3578 -54 -32 16 9 19 -74 -45 -19 -48 -25 0 -52 -51 65 32 -18 -27 51 -16 25 58 -19 8 -1 45 42 -12 0 28 -15 2 -14 -18 13
3611 13 -41 -28 -16 -106 61 6 -22 29 -47 15 -33 46 -15 -84 31 49 -93 47 16 79 -35 13 7 69 32 33 28 16 50
3640E0Oj3k7N1j06N4oP9K2r9r2m0J71r8J02r0K3m6J9L1n8N6j1p6P2l6nO5Ol3m
3671c3R7p9J0R7j66R5J3k6M9o5k6N0n1P8j25K5J01j24M5K0l9M4K7l3%J0l0k8O5
3700Aj16J1P9q6J08KRj2j1O2p9l4N1L2j05R8m5J33j17j6R9j2m6R7j60RM9j29Q1
3729d7QJ06j37M5k4j0J64j18O6j72J29J1j0r0K9jj6j6R1q6pJ19q6P9n9J32j14
3756a4N3K5onL0l8k0J5J0J8r7J01m6lK3l4j03J05L6k4m8ok4J9m6O3j5qOJ5L8r
3788A1j1K5m5J4K4K9l9j3O1k1m1K4jNj3QM4o7J18j36L7QM0J9j60R3j5l0k5N3l6
3819d0oL1n4N0l8l2P9k4J3MK0QnK9rk0pJ9K2l4K3j3L7j1k8J7j4K8n6LQk5K8J0
3853A3pPk2k7K8%m4mK3o2R9j18R0N4j7n0K5M2q4J06J3j11J71p4K3o4Q2n1K4l0
$$ plain form
3640 50 56 43 16 67 -39 15 9 88 110 11 -81 -121 50 -48 54 -36 -13 -59 -40 -9 -67 -11 -22 -98 -26 -62 -67 -2 4 -29 -33
3671 -33 64 -15 -5 92 -74 21 34 8 57 -8 -34 16 -35 43 -82 -57 44 -80 -35 -15 -54 -10 17 -16 -16 -6 -36 -64 1
3700 1 -115 -104 -25 -111 -3 -1 8 -4 -15 47 -32 -66 -15 17 -88 10 -35 98 -19 -35 64 52 6 103 -57 -48 1 -128 -47
3729 -47 -39 67 -70 -25 -49 -59 105 -13 53 -119 10 21 11 -79 -50 -51 -67 -83 8 -78 -85 34 -52 27 -32 100 -14
3756 -14 39 64 58 53 83 45 25 40 50 68 -29 72 26 23 46 12 -91 14 50 26 -22 -28 -52 -33 -79 -16 -31 -39 -33 -18 20 11
3788 11 0 25 -20 -6 18 47 8 -5 56 35 -6 18 17 22 9 17 61 -6 112 -24 13 21 61 80 -80 13 -2 -32 -57 -4 -40
3819 -40 -46 -15 -69 -19 -57 -89 -10 -34 -21 -17 3 11 6 35 26 6 -1 18 40 6 29 16 53 42 14 31 17 45 -11 -8 0 -25 3 13
3853 13 6 13 -9 -36 -8 -8 -52 -56 -33 -95 4 -114 -24 30 13 -37 -12 30 -54 52 65 -46 125 51 74 10 92 41 65 35
3883C5n3M9L4r2Q9n1P6j20Q0j21J11k7o2P7o7j4NO0k0j1l7M1o6R2m8m9J41o4n6
3912f8R2j9m5P8k0k2O9k1n9N7K1p9M5K6r3P6K4r9K4M0m0qO2p0k5J02p2j9M2o2
3942f3rO6n0K3N1l0L5J7%j10J40p4j9J31o3PM1k2j29R0Pm8P1L5j06P0k0q6Q3K5
3972F3j28J16L1j29N5J9j09R8J6j19P5Rq4L7R5p8l2J15p2j9Q5q0J1L5n1J6J09
3999H4p8n7K10j62m3J16nj17J14k7q7R4l5p4R0j2j18J11N7j45O6K4j59J37N3j32
4025i5N0J19k47J66N5j60Q0J05j37L7J19j72N2J23j04J8O9r4k9J66q1o7J22j80
4049h5M8J34j90k7J88j33j11K92p5j41J57q4j20J27mj31K43n8j76J31N8j23J11
4072C1M0k04K13K6j34N0J3q2L1J43j75Q4N6r2q2K60k10j35K34m8j58L04k63j6
$$ plain form
3883 35 -18 31 65 -27 62 11 87 -33 47 -74 37 10 -52 25 -42 -56 -51 9 -11 -22 -59 -18 -84 8 -40 -89 52 -12 -68
3912 -68 24 5 -40 38 18 -4 65 44 -15 42 63 -16 29 55 -38 38 62 -37 -13 27 -13 -21 41 -29 -54 48 -24 -43 -1 -63
3942 -63 -72 -6 -56 -33 18 -12 23 40 40 -70 70 -4 -23 108 45 52 93 71 -58 32 39 -9 62 97 -9 61 41 -45 38 63
3972 63 -65 51 82 -47 8 27 -82 16 32 -87 -12 -3 -87 -50 45 -33 -65 50 -22 -41 44 -36 -25 10 -41 -25 84
3999 84 6 -51 159 -3 -46 70 65 -52 62 35 -52 42 7 -67 23 11 -107 4 61 -84 -18 6 -153 -16 37 -95
4025 -95 -45 74 -173 -7 48 -112 -32 73 -64 -27 92 -80 -28 95 -9 9 78 -16 -45 121 40 -27 95 -85
4049 -85 -37 97 -93 -120 68 -65 -176 116 41 -100 57 -27 -147 -20 -24 -155 88 30 -146 -15 43 -80 31
4072 31 71 -133 80 106 -28 22 35 -47 -16 127 -48 36 92 0 -82 178 -32 -167 67 19 -139 165 -98 -114
4096a14J66j01m1J06r4J2N7l9o0K21j01j12J80n4j43J10R2j80J22L7j61J19Q3
4119A05k13J74L8j60J00P7j71R3J22k32O3J42j97P5O5j57M2J70k14J2J55j79K
4142h8J24j02j9J35r3q8K12j19n9J97j09j21K10k9j73K14o8r3J80j2j93J69L8
4165A13j78J30M1j91J46L6k16J27J03k18R0J08k12O5J41j71M6J21j79J4J41j44
4187h7lJ34j10j8J87j10r5K04j03p3J69j16n7J92j13j01J88n7p2J37l7j17J15
4210E7oj61J34L3j28J09Rj22R4L6j71J02R0j75M0J51k18P6J01j42M5J63j54k7
4234f4J53r2n5J99j40n8J82j22m4J45r5n1J81q4j32K24r3j77J83o9o1J35j5j36
4258h6J92r2j10J20J2j57J21L3j51J42L2j71J07J17j34Q1L3j65Q7O1j65O1J33
$$ plain form
4096 -114 52 -49 -90 16 -78 -66 -9 -48 -108 113 12 -100 80 26 -117 -7 85 -95 27 64 -97 22 105
4119 105 -108 66 104 -56 44 121 -50 43 165 -67 -4 138 -59 16 81 -76 -34 136 -78 -66 89 -90 -88
4142 -88 36 -66 -85 50 -43 -131 81 -38 -97 100 -9 -130 80 51 -122 92 24 -69 111 99 -94 75 113
4165 113 -65 65 106 -85 61 97 -119 8 111 -107 -17 91 -121 -56 85 -86 -40 81 -98 -84 57 -87
4187 -87 -90 44 -66 -84 103 -7 -102 102 -1 -74 95 -21 -78 114 1 -100 88 31 -41 96 59 -58 57
4210 57 51 -110 24 57 -71 38 47 -75 19 55 -116 -14 76 -99 -59 92 -126 -50 51 -91 -46 117 -37 -64
4234 -64 89 -3 -58 141 1 -57 125 3 -41 104 9 -42 139 55 -77 147 54 -123 60 -9 -70 65 50 -86
4258 -86 106 14 -96 24 36 -121 0 33 -118 24 56 -115 -8 109 -25 56 89 -76 11 72 -93 -32 101
4281A01j71N1J96j76k8J49j28J8R9j06k5J06q5j29K27o1l6O9qk03J99m5r2J49
4305G1m2j04O3M0j60J16M8j07J16Pj77J32P4j07O1J0j55J19P6j25M7P8j04L9O9
4330H5r5j6J16j28QJ09j41K7Q0o0p2J33q9n1Q9K2j54J68j0j11J15k4j31J10N5
4355C5j02N6Q5k01J76j3r6J05Rr8N1N4o2j1J08j20L0N9j28O2O8j01M6J5p4jR1
4382D3j00M0O4o3q6J60p6j27K17j16j3N9j6k2Q7j7q7Q9k0n4J17j1j07P8K9p3N4
4409D9Nm5J1L5o5J4L2o3L8N0q6k1O9m9k4O5r4NR0o7rQ8n6kN0q9P5O4r5PL9no0
4442d4J16k5q4Q4J0l2L2l3l0L8j8k9N2p5KQ5k5j17K7M5j5j1O2o4j9J29j19QP2
4471B2k7m5l8O9J3jk9k4L8j0J0K4n4J06nLo1O4%l6L2qn5K7J1m2K5o3K5KLRpK6
$$ plain form
4281 101 -70 -19 177 1 -27 122 -6 12 111 5 -20 86 1 -128 99 38 2 71 63 -140 59 14 -78 71
4305 71 29 -75 -12 28 -132 -16 32 -75 41 48 -129 3 77 -30 31 41 -114 5 81 -44 3 81 -23 16 85
4330 85 -10 -26 90 -38 -30 79 -62 -35 45 -15 -87 46 -43 -94 -5 17 -137 31 21 -90 25 1 -130 -20 35
4355 35 -67 -11 74 -127 49 36 -60 45 54 -44 7 61 -1 -12 96 -24 6 65 -63 -1 67 -34 12 27 -47 -48 43
4382 43 -57 -17 47 -16 -102 58 -18 -145 72 -44 -57 2 -14 -36 51 34 -53 36 16 -38 79 68 -39 39 68 -5 49
4409 49 54 9 20 55 -10 4 36 -27 11 61 -25 -46 23 -26 -50 15 -79 -74 16 -51 -60 28 -28 -30 20 -69 6 70 -25 -18 21 16 -44
4442 -44 72 47 -37 47 57 25 57 24 -6 32 14 -15 37 -38 -36 49 24 -93 -66 -21 -36 -47 15 -49 -68 61 -58 -50 22
4471 22 -5 -50 -88 -19 -6 -7 -36 -60 -22 -32 -22 2 -52 54 49 52 -9 55 55 19 51 43 -12 15 26 -16 9 -54 -29 -27 -24 -15 -22 4
4505Dn8O2jp0M8l3K4olJ3KJ4LL4J0n9K3L0j8RjJ0qJ3pj6J2J9j5Rk8K5n6O8ol6
4541A1k3n7N6M0p1N6j4m8K2L9n1KJ0P1L3k9j28M2K1L0nJ0L2m1J5PKL6m7k0P9n8
4573B2N9o0j2K4o8L9J0l9L9n2J2QKJ1k1rK3ml6rj2O4MJ1j7J5m3K1K0J0L9m8PJ
4607A1%MK4kJKl6%K8mk2J8Om4J3j3MrK8k9K4k7nK1j3qJ0JoJ5Nk5M1j0mlK9K2o8
4646b1M6K2qJrpj9J2nk9L5lK9m3K4J2m6K9k1l7K6K8m4k3J0L1rLj9OkL7m0O8k4
4681A0j9L3Qjj4mNj2J2rM8l9M3n7PL3k7l2L2oK5m1pjJ4m4L5pl2M5n0N2n4lj0Q7
4717B0k6J9l0OK1pL7j0K6n2N3L4m8M9l9o8Q3q5J9P1n3j4o8N7k1L5l7L7j0o0N2
4748il1J4n5R9p7J3nj4O0lL2n8rO9n0o7J27n8qP4j2m6N7k2J3o2Q9p1K8M7j45P8
$$ plain form
4505 4 -54 8 7 -63 -15 -48 -24 -30 -33 -20 -18 -4 -1 33 43 -16 7 37 19 28 27 37 29 42 35 19 31 50 35 44 16 41 -15 53 47 11
4541 11 -12 -69 -13 27 -44 12 -2 -50 -28 11 -40 -38 -28 43 76 47 -81 -39 -18 12 7 17 49 8 23 30 32 68 21 1 80 22
4573 22 81 21 9 33 -35 4 14 -25 14 -38 -26 -18 -16 -5 -26 -35 -12 -16 -52 -61 -73 -9 -5 6 -11 4 -39 -18 2 12 51 3 10 11
4607 11 11 15 39 37 38 40 4 4 32 28 6 24 30 -14 -1 -14 -10 -19 9 -20 4 -23 -28 -7 -20 -28 -18 -17 -23 -8 -3 -28 13 3 -1 -4 25 47 -21
4646 -21 25 47 39 40 31 24 5 17 12 -17 18 15 44 1 25 37 -9 20 -1 -38 -12 16 -28 -51 -41 -10 -19 -16 -35 -29 -31 6 -34 34 10
4681 10 -9 24 32 31 17 13 18 6 18 9 57 18 61 4 11 44 17 -15 17 11 36 -5 -12 -13 1 -43 -8 -15 -47 -2 -52 0 -54 -57 -67 20
4717 20 -6 13 -17 -11 10 3 40 30 56 4 57 91 43 92 53 -15 68 -17 2 73 20 6 -62 -5 -26 9 -28 9 -1 -61 -9
4748 -9 -40 -26 -81 18 -59 -46 -51 -65 -5 -8 24 -34 -43 26 -24 -91 36 -22 -30 44 32 -14 43 21 34 -28 61 -10 18 65 -80 -2
4780bl6O5l0k1l1J03l4J4q4jQ0j8j9j08J31j18L1N9O3j10J7K9J35o8%q4O9nJJ0
4810C8k5K2j03R6n3Q4jk9j24J01N5k6n3k5J7pL9qklk5J2kj4L5k8nJ1O1k6m2N5
4842B5j7k9J4j3N7l2N1pk8j3L2M0o1oPk4%Mk7K9k9QL0lk8Pj3J1j3L2j9oj3M9m6
4877c1J2%k9M8m3L5k4L4j8M2jm8L0J9kj2M2m0L7k1oKnnQk3nJ0j7Jl7O6k7l2L8
4912bk8l3N0l3K8k8M6kk6K8lj0J7oJ7J0%l6N5k8Mj6K9n%l2J7K1l9O6o8ROJ2k5
4947ej6J0KK6j8j0J2j9j7l8M0K0PMJ6k3K9L6l5L7o1L3K4Nk7m6M3RnMk0L3om9K7
4982B2K8n1M3o3L0j7K3l0Pk0jJ5j8lk2L7K5K1n8J9K1J3l1mM3K4pm5K8J7RkNk2
5016C6l%K1k7k4j4L3m4L4j4K2ppK3p6K8j0%j5J8k1L2l8L3j9J15nj02L5Jl0M7m5
$$ plain form
4780 -2 -38 27 -3 -24 -55 48 14 28 -56 -57 23 5 -14 -122 9 -109 -78 -19 44 -66 -49 -20 115 47 47 -37 32 27 28 38
4810 38 13 35 -68 28 -25 59 58 29 -95 6 61 35 -18 -43 -26 -33 6 -2 -4 -7 -32 -20 -22 -36 -1 -29 -34 -23 38 12 -30 25
4842 25 8 -21 -7 -20 37 5 56 49 21 8 40 80 19 13 20 -4 -4 0 -27 2 -27 -19 11 8 -20 -13 -26 -15 -28 4 -15 -21 -34 15 -31
4877 -31 -19 -19 -48 0 -43 -8 -32 2 -16 26 25 -23 7 26 24 12 54 14 51 30 24 26 21 16 24 1 -4 6 -11 -10 -47 19 -8 -40 -2
4912 -2 -30 -63 -13 -46 -18 -46 0 -2 -28 0 -3 -13 4 -2 15 25 25 -11 44 16 20 4 33 28 28 -4 13 34 -5 61 -7 2 8 20 -5
4947 -5 -21 -11 -9 17 -1 -11 1 -18 -35 -73 -33 -13 -6 -2 14 -9 20 56 21 58 -3 30 54 59 32 -14 29 38 33 37 17 50 44 -5 22
4982 22 50 -1 42 -21 9 -8 15 -15 -8 -28 -29 -14 -32 -35 -57 -20 5 26 -32 -13 8 21 -10 -14 29 53 46 1 29 46 55 53 58 36
5016 36 33 33 54 27 3 -11 22 -22 12 -2 20 13 6 29 -47 -19 -29 -29 -44 -26 -47 -15 -53 -20 -39 76 71 -31 4 5 -25 22 -23
5049b3O3NpK0olk5RL2m0J3k7K3j1kK1l9N9j25O1m5P9mn9N2l0ok2j9K9K7kJ5l5
5083b2N7j3K4k2qNjNk3K5MJ6pJ7k4j1K7l6K0j7P5o2n6M2m1J9J0N2l7k2J0o2M5
5116a1J4L4q8L1n1N1K0k4M1qRm9L5M2l8kK5ql0P5l1m7Q0j28m3O9P5m7M3o3N5m2
5148a1O1l0m0Jp3j7M7O5o5J8L5r2J05J4p0J0J3j4Q7k5J6n0J5j5k0Q2k2K8K8k8
5178E3l5J2J8j3m1L3J5pJj2m8K8l4N2j1Ml3K2k7K0jrnM9m9J0jL7j3K8k0L0j9k8
5212FK9K1L3l6pK1l6j3KM8m4Nk1K9l1qmQmn3J12m3q6Q5j2j7K3l3K5j9L5rRK7n5
5247a3O8j0k3K4j4M3k4N3o3J4J6m7M3j2mO1j8j25J1P3r6k2j2P6N2j18J07l1k6
5276a7O0j26N0J9j6O0o8K6J9L1n2K5J7n2K4K8l0KM4k7M4mQKKp0N0J6qk3J4lp0
$$ plain form
5049 -23 40 45 38 58 52 49 24 33 65 25 38 11 34 23 21 42 3 62 -63 -2 -47 32 28 -31 21 -9 -15 -37 -56 -27 0 -2 13 -22
5083 -22 35 22 46 24 16 21 20 25 2 27 31 47 40 57 33 22 49 13 33 16 91 29 -27 15 -26 -7 3 55 18 -4 6 -56 -11
5116 -11 3 37 -51 -20 -71 -20 0 -24 17 9 18 -31 4 46 8 6 31 23 -7 68 37 -10 70 -58 -101 -32 43 -4 39 -24 31 -11
5148 -11 50 20 -20 -19 -92 -109 -62 3 -62 -44 -9 -101 4 18 -52 -42 -29 -43 44 19 35 -15 0 -15 -35 47 25 53 81 53
5178 53 18 30 48 35 -6 27 42 35 36 24 -24 4 -30 22 11 15 -18 4 -23 -3 -4 -13 -18 31 -18 -8 -9 28 15 43 23 53 34 6
5212 6 35 56 89 53 46 67 31 18 20 68 24 29 8 37 6 -2 -6 2 -2 -55 57 14 -72 13 1 -16 7 -26 -1 -20 15 6 15 42 -13
5247 -13 55 45 22 46 32 75 51 104 41 55 71 24 67 55 51 112 94 -31 -20 53 -43 -65 -77 -1 51 -67 40 9 -17
5276 -17 43 -83 -33 -14 -30 30 -38 -12 7 38 -14 11 28 -24 0 28 -2 0 44 17 61 57 65 67 69 -1 49 65 57 34 48 45 -25
5309b5N9k3l6J8J4l1J2j9J5K7J2o5J08m4m3rQK2lJ22j40N3M1m0N4Qp7JO6n5n4
5340b4R4q1%R9p5N5j0o0PN0l7j7J4l2K2K2l3m1O6m6l3O4%l0LK%L5om4J01k8kj1
5374B4L9l2K7j5n0K7L3m4K3L0r3M7K5l0MM9l1m3Np1P8Rj7l7O6q5L0K4l1J1Q7q5
5406b6Oj3rKO4J1n8O6J3o5N7j2n6N8qk1N2k3n9O1L6j05M4L3j01L2J7j7J3M7j06
5437f7O3J5p0K8M8o3K6N1m1j8L5m1J6M4k1m5J33q2n7R5j9k0K6Oo4R5j1j00J17
5466G9n2p2Q0K1q2M6Jq6O5J7n0K6J4p5M9P0o5j0L4l1rQ8j17J7J26r2k4J04q4M8
5496C6O7p5q1J76q9o1J47p2o8J20o2o8J03m4m0Q3m4o1O0k5r2O4N2j32J22j3q1
5523g8N7O4q3K4P9j00L0K1m7L8J02j06M4O4j34J6M6P0j11Q1j67O3J35p7j28J82
$$ plain form
5309 -25 34 11 -25 -7 7 -24 -12 -31 -16 11 23 -42 66 22 -21 -30 -22 0 -3 119 -21 32 73 33 87 95 18 19 85 30 -24
5340 -24 70 -11 -11 88 13 68 58 -2 5 55 18 1 15 -17 5 27 -6 -47 19 -27 -60 4 4 -26 -23 -21 -21 14 8 -36 65 37 35 24
5374 24 63 31 58 43 -7 20 53 9 32 62 -31 16 41 11 15 64 33 -10 -5 -76 2 11 -6 -43 23 -62 -32 -8 -39 -28 59 -26
5406 -26 -20 -33 -42 -40 24 35 -23 43 56 -9 48 36 -20 38 30 9 61 38 -21 40 76 -29 15 48 -53 -21 -4 -21 -8 39 -67
5437 -67 -4 11 -59 -31 17 -46 -20 31 -10 -28 7 -34 -18 26 5 -40 93 11 -46 49 30 10 36 42 -22 73 62 -38 79
5466 79 27 -45 35 56 -26 20 21 -65 0 17 -33 -7 7 -68 -19 51 -14 -24 10 -21 -30 58 -59 -42 84 -8 -32 72 -12 36
5496 36 103 28 -53 123 34 -27 120 48 -20 100 38 -30 73 29 -11 72 28 -33 27 2 -90 -26 26 -106 16 3 -78
5523 -78 -21 43 -40 -16 63 -37 -7 14 -33 5 107 1 45 109 -25 -9 37 107 -4 77 -90 -27 108 31 -97 85
5549H5o9jO2m2rL6j5k3lp0j46K23J9j43J33j2l1ok4M7J2mq0J12P8j91J29Q5j01
5578E1j05M2k8K5J89j89O7m5l1O6Kp0MP8n9j4Q8n2m7J06r6o6J12po2R2n9o1J56
5607H7q6m7P4nj24R7N8j12J27%j22J49l3j12J03O9j63P0O1p4oK5j9k6Q5j01PN0
5635C2o5RJ2o9M6O1n3p7J02m7l0J41r2n6R7j9j0N6m6l5R3l6m4P3pl8J01m2m4R2
5665A05r2l4Q2L0j07L6K5j18Q0K8p0K6lm4j0P5o3M2N5q6m6J54m9q5O5j4k1O3m4
5694b0j5J22j23M3L5K2l9N2j0r6J15n4o2Q3qp6O7P8j39O6l1NJ0N8j00lL4m6J7
5723a5P8j33N0N8r4K7Q4m4k1K7l7L2M7lJ6J0p3L6Pj3P1p8N8j01MlO1J49j24p2
5753Dj2P5j06R6J7j16N0q5Q2L6m9r0R1K5p8P7m4J%L9l5P2K3n5J5mk2J5J6k3j4
$$ plain form
5549 85 16 15 77 35 26 62 47 24 21 -49 -195 28 47 -96 37 25 -6 -12 -36 11 23 19 -61 51 129 -62 67 152 51
5578 51 -54 -12 -40 -15 174 -15 52 7 -24 42 44 -26 -22 56 -3 -17 71 19 -28 78 -18 -84 28 21 -41 51 -8 -69 87
5607 87 1 -46 28 23 -101 -4 54 -58 69 69 -53 96 63 -49 54 123 -40 30 91 17 11 36 17 -9 76 -25 -18 32
5635 32 -33 -24 -12 -81 -35 26 -27 -104 -2 -49 -79 62 -30 -86 11 -8 -18 38 -8 -43 50 14 -30 43 36 -2 99 57 13 105
5665 105 13 -21 61 91 -16 20 45 -73 7 35 -35 -9 -12 -56 -66 9 -54 -12 43 -43 -89 65 16 -69 -4 -18 -39 24 -20
5694 -20 -35 87 -36 7 42 64 25 77 67 -29 86 32 -30 53 45 -31 36 114 -25 41 10 15 25 83 -17 -20 14 -32 -15
5723 -15 63 -70 -20 38 -56 -29 55 11 -10 17 -20 12 59 56 72 82 9 45 52 39 110 32 90 -11 -7 -10 51 200 76 4
5753 4 -8 67 -39 57 74 -42 8 -77 5 41 -8 -98 -7 18 -60 17 -27 -26 -26 13 -22 50 73 18 33 29 7 22 38 15 1
5784AM2O%L8p1j7N1m4l0O5rm0O6p5l1R6n5k1O4k4o5K5J3J0K1n6J2L8J0%j4K7N0
5817H3m7l4%%L0N8r0J05p1m2N0j9j7O5p2RJ0k1KJ9qm4M1Jo3L6J5j8mk6j1P0n4
5850d7NJ9Qk9J4Qj6K0NK3J4Pj5MK5l2J0M7o7LJ2l2N7%j4nJ5j2m2Ok8KpRj8J8L0
5887cJ6K0o9ON4m4j0J7K3l9L1L9k9JOqrJ6PK1k4K9K2rk3%j5pJ8j2j1l2NK8k3m0
5923d8J8J8j9K9l3N2l8O2n1j9N4m4lKMK7m6J65m4m5j0K9l5rQJ3M5p4J6M8m7j2
5955A3J3k7J3K0m9L2m3l9j5M2J5l3M8k7k4J5j12J35pr1J25M4q2Ol3NJ53j17N3
5984C3r1Q2N6q3J15m1M0j39L0M4j19M2Rk2O1Oq5J3N3jn8N4ml8L8k9k4M0QML2m8
6016b2LL8l5J4L3NmmJ6j5M9m2j1JOnL7m8j2K1l8J8j2m1O5j6k0nqQJ3j4Lj8N1k1
$$ plain form
5784 1 43 49 49 87 16 -1 50 6 -24 41 32 -8 58 -17 -48 48 -7 -28 36 12 -53 -28 -15 -5 16 -40 -28 10 20 20 6 33 83
5817 83 36 2 2 2 32 90 0 105 34 -8 42 23 6 71 -1 8 18 -3 -1 18 10 -34 7 8 -55 -19 -4 -22 -26 -52 -63 7 -47
5850 -47 -42 -23 -15 -44 -30 -22 -38 -18 -13 10 24 31 16 20 45 13 23 70 3 6 18 -14 43 43 29 24 39 27 -15 -9 -37 -35 -42 -33 -51 -33 -3
5887 -3 13 33 -36 -30 24 -20 -30 -13 10 -29 2 41 12 13 19 11 2 18 25 46 22 51 73 64 41 41 26 19 37 25 14 -18 -13 15 -8 -48
5923 -48 -30 -12 -31 -2 -35 17 -21 41 -10 -29 25 -19 -22 -20 -16 11 -35 130 86 41 31 60 25 16 24 37 82 8 24 72 25 13
5955 13 26 -1 12 32 -17 15 -28 -67 -82 -40 -25 -58 -10 -37 -61 -46 -158 -23 -30 -121 4 48 -34 -28 -61 -56 97 -20 33
5984 33 -58 24 80 -3 112 71 111 -28 2 46 -73 -31 -22 -44 17 23 -62 -49 4 3 -55 -1 -5 -43 -5 -34 -58 -18 -10 -6 26 -22
6016 -22 -19 19 -16 -2 31 36 32 28 44 29 78 36 25 26 32 27 64 16 4 25 -13 5 -7 -48 17 1 -19 -24 -32 -24 -11 -25 -22 -40 11 -10
6052a0l1pM0j0J3J8Ok6K6l0M4K0j7%LMJ9k9K0m5MK0Lopj5k2J6j2Pk1Moj4N6q6
6088g1j1N2k2OL8K0k4L7k6L1rn1J9K6K0Qm7M6lL9j1m1K0J7m6L0k6%k3j0%%k1P3
6122D0m0k1J1j4Nl4N6k9j3K9QKKl3M6j2nN6j1j3PJ9Jn0N7l2L7K6j90J65J6r9J
6155a2nJM8q0L8K3j5Pl8K9j5L2k4j5K6k2k4O0j2q3Q5jk9J5K1K2J3Rk1J8%l4K5
6188D2J7j6OL4q0J9l0P5p6L8j8kJ3nk0j09J03m5lN0MR9p1j7l0l1N1o2J00n2j3
6219b9J4m1N7OJ7L7l3J3J6nK6l1k3K6n3J50j33rK2k8j0PlJQq7Q4j1m8L1J2j2j2
6252d1Lk0O3k1J8l4M7mk5K9K4n4K2L0nJ2pJ3PJ6m6L5J7l3kJ4pj09O6k1L7n7O4
6285C1m6K2j1k7Kl7Q0m0J2l3L2RJ3RJ1j9K4k0JO8o1lJ8j9J7KRoJ1n5K5QJ1k8K
$$ plain form
6052 -10 -41 -48 -8 -18 -5 13 19 -7 19 -11 33 53 36 36 39 43 62 33 53 8 12 32 35 29 22 7 -15 1 -11 -4 -25 -21 -27 -41 15 -71
6088 -71 -82 -30 -52 -46 -8 12 -12 25 -1 30 21 -30 -11 15 35 43 -4 42 39 78 67 26 46 63 17 47 21 21 -2 -12 -12 -12 -33 40
6122 40 0 -21 -10 -24 -19 -53 3 -26 -39 -10 -2 0 2 -31 15 3 -2 54 43 30 37 56 57 7 64 32 69 95 -95 70 86 -13 -12
6155 -12 -17 -16 32 -48 -10 13 -2 5 -33 -4 -19 13 -11 -26 0 -22 -46 14 2 -81 4 3 -26 -11 10 32 45 54 33 51 51 17 42
6188 42 59 43 49 83 3 22 -8 67 -9 29 11 9 22 17 -3 -112 -9 -54 -57 -7 -3 96 25 8 -22 -53 -2 -64 36 -16 -29
6219 -29 -15 -56 1 7 24 61 28 41 57 52 78 47 24 50 -3 147 14 5 27 -1 -11 -4 -7 -6 2 -85 -1 -12 -60 -29 -17 -29 -41
6252 -41 -38 -58 5 -16 2 -32 15 11 -14 15 39 -15 7 37 32 44 37 50 57 73 27 62 79 46 44 58 51 -58 8 -13 24 -33 31
6285 31 -15 7 -4 -31 -29 -66 14 -26 -14 -47 -15 -6 7 16 27 8 32 12 13 81 20 17 35 16 33 35 44 38 49 -6 19 27 38 10 12
6320A2K8k2k3L5K2o5J0l0rL0J5j2rj6K2l7N2L7r5Q4j0j1L0l7L7l2L0K0k7J3J9
6351F1kpK0j3j7k5k3L9m5oN7n7M4k6j3j8L2j5k3QJ0lK1j7j1J0QJ7o2R0j6l9M3
6384B2k1M5j0l4j0N6l5J5J3k4P4j37R2pJ0rk8Oj6l3Qk9P8m6Nl5K4J7KL2r1M0L1
6417Ej9onL9mn1J2Q9m7qK6p9Q0m0K8L5m6k1J02m0l9J24r0k8Pjm2Jj2J7k3j4j7
6450f7J4L8p5R4r3RO9l9l7P7No5P5QRk2krK8kL6ql1L0j4m1N3lll3j4j3P4r5Q4
6485C7j2q9N8k4j1J4KJ5l2k7O3m1kj2M6O8K0rk3l1J7l1K8Pl8jl5Q5q7P2P5j34
6517c2L2R3Rj64J58o8p8j6N1o8N4J3l9J06p8L3K5j0n3N6o9QM9k2J8O7l7m4o6J38
6547F6nk6L8q3m7J70k8j3P2j14P3j27j4n0M6N5j5p4jP1J7o9Q2lp9L5pqJ18j65
$$ plain form
6320 12 40 18 -5 30 52 -13 -3 -33 -42 -12 3 -9 -18 -34 -12 -49 3 40 -55 29 19 8 38 1 38 6 36 56 29 42 61
6351 61 59 52 72 59 42 17 -6 33 -12 -18 39 -18 26 0 -13 -31 1 -14 -37 -29 -19 -22 -1 -18 -29 -19 -11 6 -56 34 18 -21 22
6384 22 1 46 36 2 -8 48 13 28 41 17 91 -46 46 39 49 40 12 18 2 -31 -23 -52 26 -20 -15 -50 -26 -9 -7 25 -66 -26 5
6417 5 -14 -20 -25 14 10 -41 -29 60 13 5 31 -48 32 -8 20 55 9 -12 90 50 11 135 45 17 24 23 -19 -18 -30 -13 -36 -50 -67
6450 -67 -53 -15 -90 4 -89 -80 -11 -50 -87 -10 -5 -70 5 13 22 0 -2 -11 17 15 51 43 12 42 28 -13 40 37 34 1 -13 -26 48 -47 37
6485 37 25 -64 -6 -30 -41 -27 -25 -10 -42 -69 -6 -47 -49 -61 -15 53 73 64 41 10 27 -4 24 31 -7 -8 -43 42 -45 27 102 -32
6517 -32 0 93 102 -62 96 28 -50 -66 -15 -83 -29 -16 -55 51 -27 6 31 21 -32 24 -45 -37 12 -10 8 75 38 -6 -72 66
6547 66 61 35 73 -10 -57 113 85 72 144 30 103 -24 -38 -88 -42 13 -2 -76 -77 -6 11 -58 24 21 -58 -23 -30 -38 80 -85
6577h5J19j3qm2K8n3kR4n9K7k2J0L3J6Jo9P5p7j4J4Ol6O7Lq6J26Po9lJ2p6J09
6609C3q8N3M1n6kp1Q9l5L8k0QN5q2k8R2mj05J07m2mN9n2K4Q2l5p4P4pl8J2K3j04
6641e7R6o0N9k5ln4pkK5Q4Mo7Pn8j9P4m8k4L3Nl1J11q8jP0J0q0R0LM3k4J3q4n0
6675e5P3j8n9Q0%K1k5L1m6NMq4J21r2MQO2lp3O5k9L4m0j5J00j46J3K3O7p2R2J5
6707F1k7nN0r2L4N9p9m1J55p6k8O8k6j08J04o7QP8j9o6M6m4k8N9j5j9PNm3K7K9
6738Gq6L6N8n2O1j1k0nN6j5K9j4j0K0L1p8J5Q6m2j5K5k9k0N3m3K2o2M6l3kK8n3
6770a7L5j2j5j1o3M2pK5K1J6j8pJ7j8n9O4K5m7K0O5j00P7J9l5QN3n5L7N0q0l0
6801@P6p4QN0n1NKl2k0J2NoK7p5nP1k5J5O2m4n7L3K5k3O5n0rK6N3l1OL0m4M9l3
$$ plain form
6577 -85 34 21 13 -29 -1 -54 -56 38 -21 6 -16 -6 27 43 44 -25 50 -27 -41 -27 -21 -57 10 13 -73 53 60 -9 -12 0 -76 33
6609 33 -55 -2 39 -17 -19 -90 -1 -36 2 -18 -10 45 -37 -65 27 23 -82 25 -17 -21 38 -14 10 92 57 -17 57 50 12 24 47 -57
6641 -57 39 -21 38 13 10 -44 -51 -53 -28 56 60 -7 0 -58 -77 -3 -51 -75 -42 -37 -68 43 -45 -46 24 34 -46 44 47 90 66 79 -5 -55
6675 -55 18 0 -59 21 21 42 17 48 2 7 11 -73 48 -44 -40 -32 30 27 -46 19 -10 24 -16 -31 69 -77 -64 -41 26 -46 46 61
6707 61 34 29 79 -13 21 80 1 -40 115 39 11 79 53 -55 49 -18 -10 68 49 -17 29 -15 -43 16 1 -18 -11 -6 -49 -22 7
6738 7 -79 -43 15 -37 24 13 -7 -12 44 29 58 44 34 54 85 7 22 108 66 51 76 47 27 80 37 59 -3 43 10 8 36 -17
6770 -17 18 6 -9 -20 -83 -41 -48 -23 -2 14 -4 -11 6 -12 -71 -7 18 -29 -9 56 -44 33 52 17 25 78 23 60 110 30 0
6801 0 76 2 10 60 9 14 16 -16 -36 -24 -19 -25 2 -73 -78 -7 -32 -17 45 1 -56 -23 2 -21 44 -6 -15 11 64 33 39 69 25 74 41
6836D1KLpm5P5Kn3PP4l7l9R4j28M3J24j57k1J1j02O0J63j65k5P1k0l8J19l7m1
6865b6O6l4k9J32j90J18M1j14J8O4J5q9J17j9n8N5j1k2M9rr2R1j6r9Q5K9j55Q3
6893@O9p9j7O4n2l9J00p6M8K3p9pP7r0N5J16q7j8M8k8j18K09j25PR8k1j15J46
6921A09j04J5O6l5n1M1rl8O9Kj63J29j07M4L2N0p7k9rk5J30r3m2L8N7l9qJ03j13
6950e7K5P5m5j2J04k0m5k1kL0O4m6q8N3O8j27P9j6l7J22p1o6J18p8m4K3K3o8N7
6979bm0j5O2%q1M6P9j15O6N8j05M5R8q3J0L5o6J01j6n3NR5r3N8K3m2k6K6n3K5
7009D2kj1r9J17n7p8J15n9K5j5R4j49R9qq2Q2j6pK0N3q9L9Q2j39J03np2M5K2m2
7039Hj5R9pm9O7j03j1J41j02NJm2J3J1prK7l3l1L9j1p1J24o0r0J35Km0M8l0j4
$$ plain form
6836 41 43 46 39 -6 69 71 18 25 99 62 23 117 -11 32 156 -1 -22 -11 -113 -53 110 -55 -80 -9 -29 -67 52 15 -26
6865 -26 40 6 -23 109 -81 37 78 -36 -18 46 61 -28 89 70 12 67 56 34 83 74 -18 73 57 -42 43 72 -83 0
6893 0 69 -10 -27 37 -15 -54 46 -30 18 41 -38 -45 32 -58 -3 113 26 8 56 28 -90 119 -6 1 99 78 -37 109
6921 109 5 20 86 51 0 41 32 -6 63 65 -98 31 -76 -32 0 50 -27 -56 -65 -90 40 -53 -95 -57 0 -39 -47 56 -57
6950 -57 -32 43 -2 -14 90 70 25 4 2 32 96 50 -38 15 83 -44 35 19 -18 104 33 -33 85 7 -37 -14 9 -59 -2
6979 -2 -42 -57 5 5 -76 -30 49 -66 0 58 -47 -2 96 13 23 58 -8 93 77 24 29 124 31 89 112 70 44 70 17 42
7009 42 40 29 -70 47 -10 -88 27 -32 -7 -22 72 -77 22 14 -68 14 -2 -9 11 64 -25 14 96 -43 60 55 -17 28 50 8
7039 8 -7 92 85 36 103 0 -11 130 28 33 34 -8 5 16 9 0 27 -6 -37 2 -9 -80 44 -16 -106 29 31 -9 39 9 -5
7070eQ5m1l4L5J6k6M4k8j4OM7j08Q7L9l5O5q1j5k8P5l8n7P3n9m5J37j40J5N6p5
7100d9m1Q6Ll0K1Oj1J1L7n4O8l0j9N8pm7Q9n1j0L8mk5PK4m8L7K8r2P6j8p0N2K2
7133E7q1nO1rn0J11j14k6P3r4N7N4n8%O5o7M1k6k6K2N5r8O2O8k1m6O2ko8L1L1
7164E9k3j5N6p6L5Jk9lL7n3J6Kl8N1j4n9L5K7r9P5L3l1j6K2k3L8L%Pop6M3Q4k6
7198C7NL5j8pL1l2Jj0J1rl3RPj9k0%L3On8J9l3J1rO3p5L0k8O6Jk6O0o4Mn4J20
7233E4k7l2L6j4M3Jn0L2LqL7j1j2rmj6O2k4nk3j9K7m3lM3k7nj0ml6N7l3J3m1M4
7268dl4N9rL4n8mJ1N3o4M7L8l9J1K3J6rLl7K1KK2q9M0K4o5J8Mm6qO5n6K9L2l5
7302ek1J4j3J4J0j4K3m3M6k9M6J8n4L1k0K4K2L1l7n3M2m4K5O5l6ko5J16q4QM1
$$ plain form
7070 -5 80 39 5 40 56 30 74 46 32 38 85 -23 64 103 68 133 52 37 9 84 46 -11 62 3 -42 95 -45 -30 26 -49
7100 -49 -90 -4 -1 -31 -10 -4 -15 -4 33 -21 47 17 -2 56 49 2 91 40 30 68 64 39 46 70 22 59 87 -5 71 53 -17 35 57
7133 57 -24 -29 32 23 -27 84 -30 -56 17 -77 -20 34 -24 -24 41 -26 15 -11 -37 -15 40 -58 4 72 51 5 67 65 -3 28 59
7164 59 36 21 77 1 36 37 8 5 42 -11 5 7 -31 20 6 -53 -18 9 -90 -15 18 -13 -29 -7 -30 8 11 11 18 12 -64 -21 63 37
7198 37 42 77 59 52 83 51 52 42 53 44 11 20 27 8 -12 -12 21 27 -31 -12 -45 -34 -43 20 -55 -25 -53 13 14 -12 48 -16 -12 -66 54
7233 54 27 -5 31 17 60 61 11 43 46 38 75 64 52 43 39 23 85 61 56 33 14 41 -2 -5 38 11 6 -4 -8 -44 13 -20 -7 -48 -4
7268 -4 -38 21 12 46 -12 -16 -5 48 -16 31 69 30 41 64 80 71 74 37 58 60 82 -7 33 57 -8 10 14 -32 -40 25 -31 -2 30 -5
7302 -5 -26 -12 -25 -11 -1 -15 8 -35 11 -18 28 46 -8 23 3 27 49 80 43 -10 32 -12 13 78 42 40 -25 91 7 15 56
7333E6p1K3j2K8p1M2j1L1k6rJ8M6r5J8%N2l4k4Q6p3N4j4L4m2N6j8L2k0K2k1K1
7364G8J3Lk2l0Kk2nM2rl9l0QNJ6k8K7mn1M3k2J4k3L7Pm4K4K1l5K6mj2M6m6M9m
7399C1j9pK4j8j1M6m7M8k9N9l4J4k6j1L5l7MJ6k7p7M3%L3p0l1N9lO6j02J18j6
7430C1o1L7L3k7J1j1R5o3jK3K3m7l7N2n2k3P9l5N1m6k9K6m7O2o4J4J7J0k1j3k1
7461c4j3k2jN3K2m7q6J19poM0k6Ml4M2L7k7j1l2P1J7mj01k5M6O2Om2Q2n2MRk9
7494A5N6o4K5n7j4L3M7p3lK2j9pkJ2j1L9j3n0pL5O7q7P1O8j4q2k8R9J1n7q9J41
7526F4J6q4Q4Ok5Jm7L0K1o4J3j0jM4r4qJ25q5mJ07r3K6o5q0J46m9J02j19K2K8
7556GM0j8kLJ6J8O%pj20P5P3o4M9R7j93J26m0l1Q6k10P2Q9r1N2j00LO4j2j10O9
$$ plain form
7333 56 -15 8 -4 24 -47 -5 -16 15 -11 -20 -2 44 -51 -33 -33 19 -15 -39 47 -26 28 14 48 6 62 44 76 56 78 57 78
7364 78 91 94 72 42 44 22 17 59 50 11 -19 -11 -6 10 -18 9 5 -46 -3 -25 -11 -34 3 10 -34 -10 11 -24 2 -2 -14 32 -14 35 31
7399 31 12 5 29 11 0 46 -1 47 18 77 43 57 31 20 55 18 22 38 11 -66 -23 -23 10 -60 -91 -32 -35 31 -71 47 31
7430 31 -30 7 40 13 24 13 108 45 44 67 90 43 6 58 6 -17 62 27 78 32 3 29 -18 44 -20 -6 11 21 0 -13 -34
7461 -34 -47 -69 -70 -17 5 -42 -128 -9 -16 -22 18 -8 -4 -38 4 41 14 3 -29 42 59 55 -46 -71 -25 37 43 1 83 31 35 44 15
7494 15 71 7 32 -25 -39 -6 41 -32 -35 -13 -32 -39 -41 -29 -40 -1 -14 -64 -71 -36 31 -56 15 83 69 -13 -41 58 69 12 -77 64
7526 64 80 -4 80 86 61 62 15 45 66 2 15 5 4 48 -46 -54 71 -14 -18 89 -4 22 -43 -123 23 -26 76 -43 -21 7
7556 7 47 29 27 30 46 64 70 70 63 -57 18 91 27 76 173 -20 106 66 35 121 -89 -17 72 -19 33 -67 -64 0 -12 -122 -53
7587e3LJ0j2J23j3j04J14n3k4J7N5m8K2p8R1j3j0J08n5nm0J8Qn3O0m1QJ6J2j7
7617D6l7m6J1P6k4l8l5K6lk6L6Kj5j3l9O5mK6RkomK1J1J4k9L5k6J8LJ3k1l4O1
7651G1Jj0l4K6l1J5j9L2j1j9m9pK9%Jk7j7K5l6OJ5m9N6K5q3J17K4l2n9l1Q1J0
7683B0j6N3J1n0k9P1k8K9m4k0K7J0L6q7j2M8k3k3J2K5j8j3jMk1oM6k8K1Lj8M%
7716a7kN2m5J1J6K8j5Oj4JL1m1K6MJ8l2Mj1Jk9K9N7p1N3r5M2j8r4R0m8%L4rm3
7750h1Q5K7n5rn0J07m6q7J51j01J25n8O0j7kJ1n8L0K1M0n0l9O5Nq9N6l8l5M1N1
7780F0K5j00K0J6Ml8l0J1qP2q4M1L4q1J42n5n3M1J0Lm6JRR6o9k1J27nKp3Jl5o
7813A1K8j7%Pm6M0J6m3J9L5n5j8N1j2Kj03J08k8l6L4K4m3k5O6MrL0r0N3O3p0Q
$$ plain form
7587 -53 -50 -40 -52 71 58 -46 68 15 -9 8 63 15 37 -41 50 37 27 135 80 75 35 53 61 8 68 27 35 51 63 46
7617 46 9 -37 -26 50 26 -12 -47 -21 -24 -50 -14 -12 -27 -40 -79 -14 -18 8 17 15 9 5 26 37 51 22 57 31 49 52 65 44 10 71
7651 71 72 62 28 54 23 38 19 51 40 21 -28 -35 -6 -6 -5 -32 -49 -24 -60 -54 -39 -88 -32 -7 -90 27 51 19 -40 -71 10 20
7683 20 4 57 68 18 -11 60 32 61 17 -3 24 34 70 -17 -29 19 -4 -27 -15 10 -8 -21 -22 -18 -39 -45 1 -27 -6 -3 -21 -17 -17
7716 -17 -19 33 -12 -1 15 43 28 34 20 21 52 11 37 41 59 27 31 20 21 -8 21 78 7 60 -35 7 -11 -105 -15 -63 -63 -29 -38 -81
7750 -81 4 31 -24 -33 -83 24 -22 -109 42 -59 66 8 68 51 49 60 2 32 53 93 43 4 69 74 -15 41 3 -32 9 60
7780 60 85 -15 5 21 25 -13 -43 -32 -40 32 -52 -11 23 -58 84 29 -24 17 27 30 -16 -15 -6 90 21 0 127 122 124 51 52 17 11
7813 11 39 22 22 29 -17 23 39 -4 15 50 -5 -23 28 16 18 -85 23 -5 -41 -7 17 -26 -51 15 19 10 40 -50 3 66 -4 4
7845DM0O3jm5Nl0M0ok0Nl2QRK2n7O4o4M2m7M6r9K7j1J8j2JK3l5l5l%K8L2m0O3
7880Ck3Pk8J06k6n2Q4o6lO7m0M3m7j3J1N1n8PP1j39K4O1ql2P0k8op9Q0q1mJ01
7912E3j7n5l1P9p0M6Q4p9j6J08j59N0Q2p1J09l7k4J2l5P1n8k1N3j9N0n7Jr5rN9
7942Dm6O1l9p7L5j3R1l9K4k1j4M7k8j6k7N7%m0Q4o6P7m3P0j0m6k2OK1L0Mk3L2
7974G3k8L0J1j1l4l9J6K0mj5m4K2J8l9m6K8K0j0l8RN1K8l1n6N9L6l5j1N9o1P6
8005E4OJj2Qpj8K5qk3j8N8p%Pqk1j8Rk4M0l5k1nK6j8m4OK9k3K0J5l2lK4J2k8O0
8042B7k2K6K0k4mJ3J4k2Prk7ML9LJ6k9k3O9o0Oj0J3l5OK1m6M%jk5M0n5N9Nk8j3
8078d1N0j7j0O5l5J1Njm2P1n2mP7l6OM7p0J2N3n4l3O5p9qN5mm4JK9m2J9QoLJl8
$$ plain form
7845 4 44 107 106 61 66 36 76 70 50 55 23 31 40 62 5 69 5 47 0 46 -53 -26 -37 -19 -31 -30 -7 -42 -77 -80 -80 -52 -20 -60 3
7880 3 -20 -13 -41 65 39 -13 71 5 2 69 29 72 25 12 23 74 16 23 94 -45 -21 40 32 0 70 42 36 -43 37 -44 -48 53
7912 53 36 -19 -50 29 -41 5 89 10 -6 102 -57 -7 75 4 113 76 52 64 29 100 42 21 74 55 105 48 49 -46 -55 4
7942 4 -42 19 -20 -97 -62 -75 16 -23 1 -20 -34 13 -15 -31 -58 -1 -1 -41 43 -23 54 11 81 71 25 3 9 30 60 64 41 73
7974 73 45 75 86 75 41 2 18 38 34 19 -25 -3 15 -24 -70 -42 -22 -32 -70 -61 -10 18 -13 -69 -10 26 -9 -20 39 -22 54
8005 54 60 61 49 57 50 32 57 49 26 8 66 59 59 66 58 37 19 28 4 44 9 -12 -17 9 -9 -53 -47 -18 -41 -21 -6 -38 -41 -17 -5 -33 27
8042 27 5 31 51 27 23 36 50 28 35 26 -1 3 42 45 61 32 9 78 18 24 14 27 -8 -2 19 -27 -23 -23 -24 -49 -9 -64 -5 0 -28 -41
8078 -41 9 -8 -18 47 12 23 28 27 -15 56 4 0 77 41 47 94 24 36 89 35 2 67 -12 -20 35 31 -13 -12 17 -25 -6 2 -4 -1 0 -38
8114c8N2ro7M9L8n4j9M7J6QOo2O4nj3j3O4l7pP5m0k9K0l1K1J6lm6K0k4l3P5n1
8147a0J1J3l8jLm2mO8k2l6M6L3p6M6Jk6J3J0RL7mm9N5L4o2N0J8m3n4Q5m7L4%n3
8181aKO0n9j5O9m6m5O6oo4
$$ plain form
8114 -38 14 5 -62 -13 25 -29 -48 -1 15 23 29 -33 31 26 13 0 64 27 20 95 55 26 46 15 36 52 49 3 23 -1 -34 41 -10
8147 -10 1 14 -24 -25 -22 -64 -68 0 -22 -58 -12 21 -55 -9 -8 -34 -21 -11 -2 35 31 -18 37 71 9 59 77 34 -20 65 18 52 52 -1
8181 -1 1 61 2 -13 56 10 -35 31 25 -39
8191c9
$$ Imaginary data points
##PAGE= N=2
##DATA TABLE= (X++(I..I)), XYDATA
0@%%%%%%%%%%%%%%%%%%%%%%%%%%%%%%%%%%%%%%%%%%%%%%%kJ1m9R3j08J21j47J77
55I6k00K10k12K14k35K87l23L53m53N47o63R10j339K314q054l366K2925j6913
73c902m479K0049j3159q101J9606r819j0182J7593n041j2357J6275k841j4177
86a0535J5760P16j5792J4110J752j5820J2817L069j5484J1564M543j4096Q767
99A371M508j2706P430N879j2326M827P274j1515L727Q598j2111K613J0394j2433
113d470J157J0852j2071J123J1194j1898J84J1319j0413q35J0647r411j993J1363
127F748q129m441J2148o401o324J2759n596q433J3912l939j0314J3349k675j0856
141h192J3192j224j1892J1800R90j2235R731L188j2529Q097N821j3255N403Q350
$$ plain form
0 0 0 0 0 0 0 0 0 0 0 0 0 0 0 0 0 0 0 0 0 0 0 0 0 0 0 0 0 0 0 0 0 0 0 0 0 0 0 0 0 0 0 0 0 0 0 0 0 -2 9 -40 53 -55 66 -81 96
55 96 -104 106 -106 108 -127 160 -163 190 -263 284 -379 531 -808 1506 -6548 -9914 13011 -3902
73 -3902 -8381 11668 -1491 -9592 10014 195 -9987 7606 2565 -9792 6483 3642 -10535
86 -10535 5225 5941 -9851 4259 6011 -9809 3008 6077 -9407 2157 6700 -7396 1371
99 1371 5879 -6827 603 6482 -5844 -1017 6257 -5258 -1531 7067 -5044 -2431 7963 -4470
113 -4470 -3313 7539 -4532 -3409 7785 -4113 -3929 7390 -3023 -3858 6789 -2622 -4615 6748
127 6748 -1381 -5822 6326 -75 -6399 6360 764 -7669 6243 2304 -8010 5339 2664 -8192
141 -8192 5000 3776 -8116 3684 4674 -7561 2170 5358 -7171 926 6747 -6508 -1105 7245
155G245j2893L551R847j2673J726J0992j1744o5J1053r863j170J0619q620k786
169d781J0448o258m186R658m622n365R564l200o739R101j712p075Q479j351p084
184e123Q116o44p040P062j94o404O323K60o546N596J406o549M562K124o744M318
200E23L102p516L727L999p551L514M334q008L236N001p906K436N617p566J490
215a568O183p230M9P265o261j521P645n517k892Q382m688m201Q574l625n031Q142
231C706k786n595P841j300o305O710l3o484N679J374o766M614K710o850L357L439
247C311o498K653M123o303J821M296n650J011M365m944M81M404m276m74M190l387
263h77q08M171k910j384M134k639j653M030k239j686M112k319j952L920j838j957
$$ plain form
155 7245 -5648 -2097 7750 -4923 -3197 7795 -3949 -4014 7039 -2824 -3994 6625 -1995 -4781
169 -4781 5667 -591 -4777 4881 259 -5106 4458 1258 -5481 3620 1908 -5167 3312 1961 -5123
184 -5123 2993 2349 -4691 2371 2177 -4227 2096 2356 -4190 1406 2812 -3737 825 2949 -3795 523
200 523 3625 -3891 -164 3835 -3716 -202 4132 -3876 -640 4361 -3545 -1109 4508 -3058 -1568
215 -1568 4615 -2615 -2566 4699 -1562 -3083 4562 -955 -3847 4535 -153 -4354 4220 595 -4436 3706
231 3706 920 -4675 3166 1866 -4439 2271 2238 -4246 1433 2807 -3959 655 3365 -3485 -128 3311
247 3311 -3187 -534 3589 -2714 -893 3403 -2247 -1236 3129 -1815 -1334 3070 -1206 -1680 2510 -877
263 -877 -1685 2486 -424 -1808 2326 -313 -1966 2064 -175 -1861 2251 -68 -2020 1900 62 -1895
279a895L813j653k222L669j425k560L686o95k844L469l37l411L454K67l725L349
295I40O71m047L072J130m154K641J947m264J932K491m277J383K947l845M44L455
311B466l551m26L881l102r41L916k558j590L816j945j863L609j410k247L198o02
327F51k435K620Mk485K208N18k658J791Q71k132J259Q97k012Q05J101j807P81
344b3R56j528N12Q56j335N26P40j214M73O75j186M44Q47j304M63Q19j396N04J035
363H64j525M42J158j619K62J341j505K6J568j334m26J736j213o73J938r53j115
380a028J897o24j338J843k94j513J654O5j683J313N22j674R37Q54j718N65J142
397I20j575K77J314j383p0J307j057l09J242o75o31J099l60o99Q82Qp98O24J96
$$ plain form
279 -1895 1918 265 -1957 1712 287 -2273 1413 718 -2126 1343 1006 -2405 1049 1316 -2409 940
295 940 1611 -2436 636 1766 -2388 253 2200 -2064 -132 2359 -1918 -535 2412 -1433 -989 2466
311 2466 -1085 -1511 2370 -732 -1673 2243 -315 -1905 1911 -34 -1897 1712 302 -1945 1253 651
327 651 -1784 836 840 -1645 563 1081 -1577 214 1085 -1047 212 1109 -903 -98 1003 -804 -23
344 -23 933 -595 -83 773 -562 -36 704 -510 -37 638 -548 -104 743 -561 -98 721 -675 -171 864
363 864 -661 -219 939 -680 -418 923 -582 -556 1012 -322 -748 988 -225 -898 1040 87 -1028
380 -1028 869 245 -1093 750 456 -1057 597 662 -1021 292 814 -860 77 931 -787 -222 920
397 920 -655 -378 936 -447 -517 790 -267 -576 666 -9 -640 459 99 -600 282 290 -508 116 312
416C12p55M06M18n90J55L17m09m6L46m1j56J36L7j83l0K06k6k56L90j39l26L17
438H3P3l04J44L62n61KN61n77j72P61l29m79P99k73p33Q98O7p79N80K76q31L00
460a32N48o95P9P74q03q2Q35o00k10P64n07k94O98j41o50O83nn67L32K99o06P6
482b04O86o60j04P11n39k70P62m24m37O98o7n25M63J50n98L11M17n41j21P41n35
503h6k28P67m21m64P73r6o02M73K26o11K89M58o83l3P64n88k79P34m06m25P96
524C58k45n77O27O5n72L54L17o07J70N14n85j18O54l61l89P32k38m60N89o7n05
545c44M34J85l78J6L72m97K21M21n15k02N97l76k41O48l63k86N75j10n32M89J41
566B55n22J55L57m60J5N25m30j65N71l27l21O47k99l62N70r0m23L46J92l96Q5
$$ plain form
416 312 -443 -37 381 -209 -54 263 -146 -192 154 113 -43 93 130 -53 -83 123 97 -159 231 92 -234 83
438 83 156 -148 -4 358 -203 -201 360 -217 -389 372 43 -436 363 90 -643 255 322 -457 123 399 -432 -132
460 -132 416 -279 -200 574 -229 -311 524 -76 -286 478 -29 -323 375 234 -416 267 262 -305 27 326 -280 -204
482 -204 482 -178 -282 429 -110 -380 382 -42 -479 219 152 -373 90 240 -358 -47 370 -171 -292 449 -86
503 -86 -314 453 32 -432 341 245 -357 116 342 -269 20 478 -205 -238 526 -62 -341 393 -13 -438 358
524 358 113 -464 163 228 -344 10 327 -280 -110 404 -181 -299 355 -6 -395 337 99 -361 228 161 -344
545 -344 90 275 -103 -87 285 -212 9 430 -85 -287 310 -66 -307 341 -22 -308 267 157 -375 114 255
566 255 -267 -112 245 -215 -200 325 -105 -270 301 -26 -347 300 1 -361 209 119 -304 42 234 -162 -77
587g7M22m34j57O31l04l83N72r3m35M10J06n36K09L29l85q7M44k80k68O27k51
608F0m84O20o7n24N18O1n93M55K53o31J98N15n58j26O71m40l59Q42k92o24Q37
629C32j36n86O26O3o89N31K00p01L43M09o43J71N16o39j09P17n34k35P25l57m30
650d26P04k07m29N02J0m54L08J27l46J82J90k47J9K85k24q2K02j46m6K00r4j61
672a33J22P7pj09J14O0k70J12K06l79Q9M12l80q5M51l48k22N50k58m24N71l7n02
695c90M89J32o75N24K79q56M45M76q30K77O56q66Q3Q07p26j97Q46n27m28Q70l18
716G1n57Q60j21p19P01L4p60O18J59p33M76L04p49L30M68o61R5N48n38n5M81l61
738a09j16L80j44k20L40k01j44K96j08m9J68j31O0J15j59K4P7r0N0P1k36J26J74
$$ plain form
587 -77 345 -89 -246 385 81 -302 270 177 -258 152 258 -278 -69 260 -125 -212 232 -48 -316 311 60
608 60 -424 196 129 -395 123 184 -409 46 299 -332 -134 381 -177 -303 368 -72 -431 411 119 -505 332
629 332 196 -390 236 299 -390 141 341 -360 -17 392 -251 -80 436 -203 -312 405 -129 -364 361 4 -426
650 -426 278 71 -358 144 154 -300 8 135 -211 -29 161 -86 -67 218 -6 -88 114 -32 -78 122 28 -133
672 -133 -11 66 59 -50 64 124 -146 -34 172 -207 -118 294 -86 -171 280 -68 -290 260 2 -422 149 112 -390
695 -390 99 231 -444 80 359 -497 -52 424 -406 -129 527 -339 -256 551 -175 -372 474 -53 -481 389 71
716 71 -486 374 253 -466 235 269 -491 127 286 -447 29 333 -416 -86 382 -279 -184 364 -174 -229 252 -109
738 -109 -225 155 11 -209 131 -70 -214 82 -26 -75 93 -38 22 137 -22 2 79 -11 39 110 -126 0 174
761A74l70J96J74l88J68L30l88p2N00n35j12O51l98k61O35l61m17P32j85m65P15
782C23j35o07O35M5o38M86K95q09L82M89p92K27O30p07j39P68o22q7O73m60k90
803c33O47k23l80N65j51m54M57Mm43L12J86m80K75J80l27L9K54k88Q2K25k32K5
825f0J84q2o8mK2K1oj2P5o3l4J87j09r8J72j38m7Q2jj93K66J8l30L02Ql12K43
852B3J21m06K49J93n27K41L34l48j9L54k98j53N66l64j93M60j57l64N45q5m43
873b71L52J27l91K77J81n86K97K41m11J08K89k79j82M09j84j65L22n3l47M01j33
894Bj31J31O9k20R3Q7j47J21n7L5r7J03Q2j95J26J41k92J75m2L6Q9L8j98QJ19
919G6j42oP5J0j02N8J52k81J34K72l26M5J83k78n9L23k23j3J79j25j81K55J40
$$ plain form
761 174 -196 0 174 -214 -46 284 -104 -176 324 -211 -323 328 -70 -331 304 -57 -474 258 73 -392 323
782 323 188 -419 216 261 -377 109 404 -405 -23 466 -326 -99 531 -176 -315 453 -169 -256 417 -43 -333
803 -333 314 91 -289 276 125 -329 128 132 -311 1 187 -293 -18 162 -165 -126 128 -160 -78 147 -85 -60
825 -60 124 42 -26 -30 -8 13 7 -5 70 7 -27 160 51 -47 125 -13 -60 22 21 -172 94 112 -218 84 92 -220 23
852 23 144 -262 -13 180 -347 -106 228 -120 -139 215 -83 -236 330 -34 -227 233 76 -288 257 172 -271
873 -271 81 208 -183 94 275 -311 -14 227 -184 -76 213 -66 -248 161 -23 -188 134 81 -266 135 2
894 2 -129 2 71 -149 -56 31 -116 5 -52 -17 -114 -11 71 -124 2 143 -149 26 -16 20 109 147 -51 -43 76
919 76 -66 -72 3 13 -89 -31 121 -160 -26 246 -80 -35 148 -130 -189 134 -89 -102 77 -48 -229 26 166
942A66l91J82J50l21J77L30m86J29J67j64K4J74j51j87K51J57l40J34J69l59J61
963b8K36m09K25K17l94J0K75q5k15J90J9j58J50M9l20K25J60j92j7K12k24q2K64
986A08k02K6J90j29q2J33K1j29J38K2j82Q6J40k67J13J74k51O3K20j43j57J91
1008H3p9j18P4J31k47Q8K06l00Q9L19l27q6K08j72l6K42j37j16K65j1j71J35J73
1031B13l56J80R3j83o1K83j10j66L57l03n3K47j50p1J08kj68J30K04l18J25O5
1053F4j89R0K90m05J02J77k02J8J58j08j9m2N6j4N5K6j17l6J77n3J0p9Q4r2l5
1078h4J84n8j74K40j27o2K00m1k53K98k4k19J88L4k68J75R7k26n7L25l18N6L86
1101B72m81Q5L55l66j03N14k59m00N59j36l75N52p1n51N45qm93N20Mm58L10J18
$$ plain form
942 166 -225 -43 107 -214 -37 293 -193 -64 103 -61 -37 137 -14 -201 50 207 -133 1 170 -189 -28
963 -28 208 -201 24 241 -153 -143 132 47 -168 22 41 -117 33 82 -238 -13 147 -45 -62 150 -74 -156 108
986 108 -94 -68 122 -7 -89 44 65 -64 74 96 -86 0 140 -127 -14 160 -91 -28 192 49 -108 83
1008 83 4 -114 -40 91 -156 -68 138 -162 -73 246 -81 -167 41 -131 -167 75 -62 -178 87 76 -95 40 213
1031 213 -143 37 130 -53 -114 169 59 -107 250 -53 -106 141 -9 -80 28 26 -142 -12 192 -126 -1 64
1053 64 -125 -35 255 -150 -48 129 -73 -55 103 -5 -24 -66 -10 -24 31 57 -60 -96 81 28 38 -41 43 -49 -84
1078 -84 100 42 -132 108 -19 -81 119 78 -175 123 99 -120 68 102 -166 9 106 -120 -177 148 -170 -114 272
1101 272 -209 -124 231 -135 -238 276 17 -383 176 40 -335 217 146 -405 140 132 -361 159 163 -295 15 133
1123A33l13K80K86o28K48L09m73j17N57m27k8M41l21j55M22k83j5K85k97j28M15
1144A91k63k27M73j77j70M64l45k46N97k91j81M62k96j49M75l31k52N60j35m59
1164c00O01k55l53N72j18n22M83O2o38N85J49p73O07K23p15M86J86q66O23M67
1184E04r82L25N13p66J90Q37j001R2R45r71J0J024q70k60J056p19m92J186o04
1203A7n72J079l90o79R93k26q30J025j69q51Q17R3q78P98J65j040P25L52r67O72
1223A34K99r33N42M04r42M33O12j034M40N91r54L20O77r93K58Q21j044J21R77
1242G29j033k7J070r51j61J078q99l42J266q59m64J254o76p08J375n21r03J381
1260F09l96j051J397k47j235J360k9j338J292K26j462J084M83j524R74O63j589
$$ plain form
1123 133 -180 100 386 -242 6 315 -158 -275 282 -145 -173 268 -53 -208 214 -69 -84 201 -96 -224 191
1144 191 -72 -299 174 -3 -173 291 -54 -300 297 6 -175 287 -9 -158 317 -14 -266 294 159 -300
1164 -300 301 46 -307 265 147 -375 108 170 -468 117 266 -507 100 323 -392 94 280 -586 37 504
1184 504 -478 -153 360 -406 -216 621 -380 -288 657 -314 -304 720 -150 -410 646 -73 -565 621 17
1203 17 -555 524 134 -545 448 222 -608 417 248 -603 214 307 -571 227 392 -648 77 429 -538 134
1223 134 433 -500 42 446 -496 -63 549 -485 -45 546 -408 -88 589 -404 -146 675 -369 -248 729
1242 729 -304 -331 739 -212 -373 705 -194 -536 730 -129 -593 661 -15 -723 652 131 -772 609
1260 609 213 -838 559 312 -923 437 408 -930 362 588 -874 210 693 -831 143 806 -783
1277g83Q16Q30j582O18J039j540L10J288j515J42J318j381j00J479j236l41J502
1294H64j059m82J504r59n93J548q28p92J480n58r93J547n11j069J455k77j135
1311h58J313n9j293J383Oj334J237J87j497J307K70j553J133N90j689J030P24
1328H97j747Q08R85j834P12J148j702M77J291j687J56J591j678l1J691j445l55
1345g23J827j289p98J858r94q97K003q52j157J905o00j381J986m78j491J757o0
1362F16j740J641J80j804J518M20j901J351O14j884J075Q79j898Q36J075j808
1378h30O02J223j749L69J432j737K07J529j594k1J615j443k21J640j313m20J693
1395I82j142n89J697r33q46J743p91j060J881p30j159J772n02j408J835k75j561
$$ plain form
1277 -783 33 863 -719 -101 938 -602 -292 996 -519 -377 941 -440 -540 939 -297 -638 864
1294 864 -195 -677 827 -132 -725 823 -5 -797 683 125 -868 679 168 -901 554 277 -858
1311 -858 455 396 -897 486 492 -842 395 582 -915 392 662 -891 242 832 -857 173 897
1328 897 -850 -42 943 -891 -179 969 -733 -256 1035 -652 -496 1095 -583 -614 1077 -368 -723
1345 -723 1104 -185 -983 875 -119 -1016 987 135 -1022 883 283 -1098 888 410 -1081 676 616
1362 616 -1124 517 697 -1107 411 831 -1070 281 895 -989 86 965 -933 -97 978 -830
1378 -830 -228 995 -754 -385 1047 -690 -483 1046 -548 -569 1046 -397 -618 1022 -291 -711 982
1395 982 -160 -749 948 15 -831 912 121 -939 942 212 -947 825 323 -1085 750 475 -1086
1412a086J792j25j729J613K69j954J586M92j943J294P75k065J039J112k104Q24
1428b10J313j992N53J553j952K88J723j885O3J768j667l01J916j425n32J878j211
1445a20p46J889j012r50J869q03j165J849n43j334J768k69j538J721k3j665J492
1462D20J17j592J414M14j696J120N78j692R88P50j617P82R72j699O35J108j712
1479g10N25J191j629L29J297j538J49J442j499n8J532j366l09J658j223n19J700
1496I72j031q46J818q68j018J806o51j202J759m04j447J675j22j486J463K17j636
1513a001J353L19j692J238O89j697Q34J003j825P29R89j641O34J069j624M04J209
1530I90j511J28J314j217j98J391j349j61J449j014m85J389q40o41J434n54q39
$$ plain form
1412 -1086 706 581 -1148 465 734 -1220 366 858 -1085 209 984 -1081 -42 1070 -1034 -210
1428 -210 1103 -889 -336 1217 -735 -447 1276 -609 -546 1222 -445 -746 1170 -255 -787 1091 -120
1445 -120 -866 1023 11 -939 930 127 -1038 811 268 -1066 702 433 -1105 616 593 -1072 420
1462 420 537 -1055 359 773 -923 197 775 -917 71 821 -796 -14 958 -741 -106 1002 -710
1479 -710 -185 1006 -623 -294 1003 -535 -386 1056 -443 -501 1031 -335 -644 1014 -209 -728 972
1496 972 -59 -905 913 45 -973 833 182 -1020 739 335 -1112 563 441 -1045 418 635 -1001
1513 -1001 352 671 -1021 217 906 -791 43 1046 -779 -50 939 -702 -68 1001 -623 -219 990
1530 990 -521 -393 921 -296 -494 897 -452 -613 836 -178 -663 726 -114 -755 679 125 -714
1547g14J296n58p96J354l60r34J181j86r71J191j04j192J147J4j023R33L17j170
1565e75P51N14j392Q51N15j299P21N81j441P67Q46j524N68Q82j300J98J034j096
1583c99n4J288j138j54J137r02l37J310q14n53J186o84m51J181l76q80J264l17
1601C07j030J312k57r71J040Q0j127R49J56j051P97L18j114P52L36j085N54N43
1619E09r74L96O06r50L04N97q06J24P10q12J9P90q00l4Q11o68q1P57n92k15P53
1640D44n41j94P59m24l81P42l63m53Q56l33n49Q11k31n62P54j13o91P00K1p12
1660d60O65P4p20N55K58q21M86L07p37L58M55q46L10N49p40J68N56o39K2O47n89
1681a42l0O00m87k19O67m64k29O70l30l67N73j91l58N59j27m32M91q0m21M77m7
$$ plain form
1547 -714 582 24 -772 582 222 -712 469 283 -688 503 399 -793 354 368 -655 278 595 -575
1565 -575 176 690 -702 149 664 -635 86 667 -774 -7 839 -685 -117 765 -535 -337 697 -399
1583 -399 -453 835 -303 -457 680 -222 -559 751 -63 -616 570 -114 -565 616 240 -640 624 307
1601 307 -723 589 332 -639 401 481 -646 303 459 -592 205 523 -591 161 497 -588 -34 509
1619 509 -465 -69 537 -413 -109 488 -318 -194 516 -296 -277 513 -287 -321 490 -178 -259 498 -94 -309 444
1640 444 -97 -291 468 44 -337 405 42 -411 445 112 -437 374 143 -419 335 222 -469 231 252 -460
1660 -460 205 279 -441 114 372 -449 37 344 -393 -35 420 -426 -116 433 -307 -139 417 -222 -200 447 -142
1681 -142 -172 428 -59 -278 389 -75 -304 366 36 -331 242 51 -307 252 125 -307 184 104 -317 160 113
1702A13l58L63l6l90L66O7l72L08J13m61L06J31l68K31J60l48K40J60l88J53K06
1723A96l15J39K24l93R5K79l11L8K99l13%K73l18QL43k70j05L23k22j67L85k08
1745b0k07L73j15k80L96q1l01L52k7l34K94N2k75K55N5k68P9K50l34J94J64l22
1767a00J08J65j78n8K63k43nK05j79o4J81j57l5J67m5j21J15n1n1J09k7r5J22
1790B6l6r3J28pp1R4j5q8J04Ko1Q9m4m5J26q1j9N6m8nN3L0j03N2K0o7Q5J8j30
1819c0O2M8j32L9O6j27Q4O1j68Q8K6o1k4J48p3m8N1l1o7J60K6j60J12L2r9P3K2
1846G8q8K0N0l0J0j8L4q6R1K9q1L2Kp2M4l0nL5jp0M5j9K2l6L4J1m7M3ko5P8M5
1878E3q3N5O3p9L8L4j22J00L4rn5K9k1k2M4K3j22P5l5l2O7M4j46O9L2p6LL2k1
$$ plain form
1702 113 -245 118 82 -308 58 125 -247 61 174 -287 19 150 -218 13 173 -175 65 225 -163 -10 196
1723 196 -119 20 244 -149 -54 225 -86 -48 251 -62 -62 211 -107 -99 244 -26 -131 192 -30 -197 188 -20
1745 -20 -227 146 31 -249 147 66 -235 117 90 -244 50 102 -173 82 137 -131 -52 198 -136 58 222 -100
1767 -100 8 173 -5 -63 200 -43 -48 157 -22 -86 95 -62 -97 70 25 -96 19 -32 -83 26 -1 -96 26
1790 26 -10 -103 25 18 -53 41 26 -62 42 44 -17 72 28 -17 109 28 9 65 17 12 65 95 -8 44 64 -3 82 100 -30
1819 -30 32 80 -52 -13 53 -74 10 71 -97 -9 17 -44 -68 80 7 -41 10 -21 -88 72 98 -62 50 82 -17 56 78
1846 78 -10 10 60 30 40 22 56 -30 61 90 9 41 43 -29 15 -15 -20 15 14 -56 -11 -30 -8 -44 -10 1 -46 -3 -5 -70 8 53
1878 53 -30 25 88 9 47 81 -41 59 93 84 29 58 37 15 59 82 -40 35 0 -32 35 79 -67 2 34 -42 -39 -7 -28
1907b8n2R3M5r3OO6p4RM9m0j2P6n5QJ2M0n1O2K0p1J8J9m4M2N1o7k6N0m3k1P0m9
1939A0j8Q6q2k6L5L4q2K7N3n6M9Q1j09o6P1PM2q4J0J5j4mJ6LP4p1J5J18j42O2
1969E4MK4N9L4j21k3n8J13n9m0J64k18P4n6o6J55q0m3n5J79j52M2J25j20nN2k7
1996d4k5L6L3q6J7J40r5M4Q2j37M8R3m3qN6j26K3N5o4M4P6j02J9K5l5L4%p6k4
2025d0K9jm3M3K6k3L1m7J7K3j23O2M0N3p2L9j8JP1n9m4J09m3n1J18q0J8N7l1q3
2055b1Q4Kj25J13l8o2O0K4n9M9K2j48P6Q2j41K6J62j50%J57k40Q1J21j13l9J06
2081B9o6k8J42m9j03J76j1j69K07J7j26M8mj41M4J61j42R6J3j57N5J19k51J20
2105b0M2q1P0K1j31O7O2q8J9P1m4J3k9r7J24R0j17MO8j57J65M9n2j3R3p5m5O7
$$ plain form
1907 -28 -80 13 58 -35 -29 37 -37 -28 21 -19 -31 45 -10 -2 10 50 -1 61 81 10 28 47 3 45 96 29 3 53 10 -11 59 10
1939 10 -8 78 -4 -30 5 39 -43 -16 37 -19 30 111 2 -64 7 14 56 -28 -18 -3 -17 -21 -5 -2 72 1 16 134 -8 54
1969 54 58 82 141 175 54 31 -27 86 27 -13 151 -67 7 -49 -115 40 -40 -83 -138 41 -111 -69 56 -64 -69 -17 -44
1996 -44 -69 -33 0 -86 -69 71 -24 20 102 -35 13 106 63 55 111 -15 8 63 -1 43 119 17 36 61 26 60 60 -16 -40
2025 -40 -11 -12 -55 -12 14 -9 22 -25 -8 15 -108 -46 -6 47 -25 14 -4 -3 68 9 -35 74 31 -20 98 18 36 93 62 -21
2055 -21 63 65 -60 53 15 -47 13 37 -22 27 49 -99 -23 59 -82 -56 106 -44 -44 113 -127 -46 75 -38 -77 29
2081 29 -37 -65 77 28 -75 101 90 -79 128 145 19 67 63 -78 -34 127 -15 81 94 -63 -8 111 -140 -20
2105 -20 22 -59 11 32 -99 -32 30 -58 -39 32 -12 1 -28 -125 -1 89 -28 -24 44 -113 52 101 49 36 129 54 9 76
2133G6p4l5J56o0j01J48j08m5J76p1j68J80l6j49K02m1j54J21kj07J22M4j21J13
2157F6j4j04P1K7r3OJ54j13q2J56j09O6R5p6m5Q3j06n3J46q3n5K17j52o7J20n
2183E0j16J13j5j16J24M0j31J2L9q3M6M4p1Q2jp2Q6j2k1PK1n1J05n6p3J69k8j13
2211b1J62k0j24J01J2j37M1P0j17N8O2q6mN7q4J3M8k3j40J57l2l5J49r7p3P3k5
2238a5q7J06J5q4Q8Kn0L4L2o6L8N1j7n3N9q7N9J16j58Om1P9r2J43j12L2K4L1q6
2267c3J1L2m8j1J12j09NK9o4J00l3k8J15j23R9K3k1n0M4j33O0N6n7J3Q5ln0k7
2295fJ4n0L9J06r3j6J00q9m8J8n6R7K3j9%%q0L2J2J1K6k0L6o0N0Qo5P3n9OL1j0
2327A1kM3J4m7NN4k7o4R0m7j4L9m6pMm5O2K7rl0j3p0Q4k3J4m9NP5n4J7oM5p0N
$$ plain form
2133 76 2 -33 123 63 -38 110 2 -43 133 62 -106 74 38 -111 91 50 -104 17 15 -92 30 74 -47 66
2157 66 52 -52 19 46 -47 -41 113 0 -82 74 -35 31 126 50 5 88 -18 -71 75 -8 -63 154 2 -65 55 50
2183 50 -66 47 32 -84 40 80 -51 -39 0 -83 -37 7 -64 18 17 -55 31 19 -2 5 26 -25 80 24 -49 120 92 -21
2211 -21 141 121 -3 98 110 -27 14 84 -33 25 87 1 -3 54 -30 -17 31 8 -132 25 -7 -42 107 10 -63 10 -15
2238 -15 -102 4 19 -65 23 25 -25 9 41 -25 13 64 47 -6 53 -34 25 141 -17 -11 -52 27 -65 78 -34 -2 22 53 -33
2267 -33 -22 10 -38 -49 63 -46 -41 -12 -76 24 -9 -37 78 -45 54 77 56 6 50 -83 -23 33 -24 -11 74 71 21 -6
2295 -6 8 -42 -3 103 10 -6 94 5 -43 -25 -81 16 39 20 20 20 -60 -28 -16 -5 21 1 37 -23 27 35 -30 43 -16 -10 21 11
2327 11 9 52 66 19 24 78 51 -13 77 30 16 55 9 2 6 -39 23 50 41 11 -2 -72 12 -11 3 -46 -41 34 -20 -3 -9 36 -34 -29
2361b9L2l3N7R3j59K7Q0o8K1K7m0M4l3L0pl8L4m2j6P2m5j0J06q2j6O3j17k1R5
2390B5nnj6K2m2L1nn1NL3m5l4K9N9l2P9o0N9m4lJ9L4j4r0K12j74L8M1o6j13J42
2421B9l5lK9nK2n3O4q0L2lm2J3L7k4k6PRN5o9mK5J2k5M2Kk2K2j0m7J09l1n4R0
2454F6k0m5P7k6p1M3N4q3k6J06j03J3J24j62kR5q0j0P8p2l6J34p1r3J53n6r5J08
2482@K5q0R3Nj01J10qr7R3M7j33J11J1p0J0O3j03M9P2j20J9J12j23L2N8j24N5
2509FQ3j14j3J13j24K8R7j32NJ28j35j2J35q4m1J12q5l9J62p6q9K03j20r8J95
2534A05j8j46J51mj61J84J0k16J78K1j53R7O3k10J33J25k38J11Q9k31N4J98k65
2557a23L5K37k64L7K25k39J9K18k26J3K43j64j40K68j19j71K83j05j30L00r5k18
$$ plain form
2361 -29 3 -30 27 120 -39 -12 68 0 21 48 8 52 19 49 42 4 38 -4 -20 52 7 -3 103 21 5 68 -49 -70 25
2390 25 20 15 -1 21 -21 10 5 -46 -41 -8 -53 -87 -58 1 -31 48 -12 47 3 0 19 53 39 -51 161 -13 25 66 0 -113 29
2421 29 -6 -9 20 15 37 -16 48 -32 0 -3 -45 -32 5 -19 -45 -38 -29 26 -43 -47 -22 -10 -35 7 9 -13 9 -1 -48 61 30 -24 66
2454 66 46 1 78 52 -19 24 78 -5 -31 75 -28 -15 109 -53 -55 40 -40 -50 28 -44 -80 54 -17 -110 43 -13 -108 0
2482 0 25 -55 38 43 -58 52 44 -53 40 87 -46 65 76 6 16 79 -24 25 97 -23 -4 108 -15 17 75 -49 6
2509 6 89 -25 -38 75 -49 -21 76 -56 -51 77 -58 -70 65 -19 -60 52 -33 -72 90 14 -75 128 8 -90 105
2534 105 87 -59 92 88 -73 111 121 -95 83 104 -49 48 111 -99 34 159 -79 32 121 -110 -56 142 -123
2557 -123 -88 149 -115 -78 147 -92 -73 145 -81 -68 175 11 -129 139 20 -151 132 27 -103 197 102 -116
2579a16K70j25o0J16M8k58K45O9l48K26O8l01J95K9k76J66J69k85J24K08l78J88
2601b6J41k65Q8K73l94J17K88l79N4L19l36QL42k85j6K89k31j02L37k39j55L81
2623B09j75k01M58k46k71M36j22k72L38q4l34L61N1l94K76K2k76K26J75n30L79
2644B6J95m33K30K05m70J95M42n36R1L35m89O2L88l53m0M56l64k1K98k45j67M95
2666C00l04k27M84k56k03M59k20k84N19k63k52M35j65k65M08n3m40M92m4m47M53
2687A27O3m70L76P1m33L37J66m74K64K54n14K42K79n53K57L30n23J65L89n35L4
2708a48M87m42j45N35m31j09N12l58j54N56l66k09N04l05k19N98l05l15N19j35
2728G0m05O31j82m40M15J36n77M75O4n48M25K52o78M60K61o47L17L16o56K56L47
$$ plain form
2579 -116 154 29 -31 85 133 -125 120 189 -159 67 135 -166 29 58 -218 -52 117 -168 -44 164 -214 -26
2601 -26 115 -150 -62 211 -183 -66 222 -157 -103 216 -120 -112 230 -55 -71 218 -13 -115 222 -17 -172 209
2623 209 34 -167 291 45 -226 210 88 -184 154 70 -264 97 148 -246 30 52 -224 2 177 -353 26
2644 26 221 -212 18 223 -247 -52 390 -146 -55 280 -209 -147 241 -112 -152 304 -60 -81 217 -28 -195 300
2666 300 -4 -231 253 -3 -206 253 33 -251 268 5 -247 188 23 -242 166 113 -327 165 121 -326 127
2687 127 190 -280 96 167 -266 71 237 -237 27 281 -233 9 288 -265 -8 322 -201 -36 353 -182 -148
2708 -148 339 -103 -248 287 -144 -253 259 -99 -253 303 -63 -272 232 -73 -292 306 1 -314 205 70
2728 70 -335 296 114 -326 89 225 -352 123 187 -361 64 316 -362 98 359 -288 29 345 -311 -55 292
2749B92n28J98L61m77K9M26n51J39M96n35n9M86l89j67O06m29j48O18m93q8N30
2770C17l72k26N63k49l19N64j47m35N52j01m98N98m8n54N89Nn43M40Q7n64M77
2791A36K05o06K88L66o80L31K39m97J15M63n95N7N36o50N5N29m37o6N73n24j11
2812b73O76m45j56N57l46k32N38k54l24M96j46m16N77j59m08N24k8m68M94j1n17
2833c21M54J30n79M60J07n56L40K24n92L42K62n63K07L94n42J40M34n55J13M03
2853C02n09M9M90n00n0N34m50k4N18l66k01O30l65k60N58l09l17N15j47l38N02
2874B62j19m66O00j79m12M35rm22L68J57n76M28J71m46K56O4m38K91K84m71J96
2895b6L65n71J16M42n20R1M41m24LM71m99m5N02m07j02M36k94j34M81l76j69L80
$$ plain form
2749 292 -236 -38 323 -154 -125 301 -250 -111 385 -150 -209 277 -112 -279 327 -102 -250 368 -125 -213 317
2770 317 -55 -281 282 33 -286 278 131 -304 248 147 -351 247 199 -355 234 239 -304 136 223 -341 136
2791 136 341 -265 23 389 -291 40 279 -218 -103 360 -235 -178 358 -292 -237 292 -145 -211 362 -162 -273
2812 -273 403 -42 -198 359 13 -219 319 65 -259 237 91 -325 252 93 -315 209 181 -287 207 196 -321
2833 -321 133 263 -316 144 251 -305 35 259 -333 9 271 -292 -85 309 -233 -93 341 -214 -101 302
2853 302 -207 -158 332 -168 -218 316 -134 -158 360 -6 -207 423 58 -202 356 47 -270 245 98 -240 262
2874 262 143 -323 277 98 -314 121 112 -310 58 215 -361 67 238 -208 48 112 -326 -35 249 -222 -26
2895 -26 339 -232 -116 326 -194 -103 338 -86 -83 388 -111 -156 346 -61 -163 273 -21 -155 326 -50 -219 161
2917A61k03j95M62q1l28L25j03l11L78m5l88M90j3m40N23l5m61L39Q3l88K82J68
2939B20m92K98K27m31K11K98m17J09J48l00nL49l10l1M12l83KL85l58r0L99k59
2961a8q5L54l29j77M87k12j91L13j38k62M59j24k82L50J8l02K57Nl22K96N2l23
2983a74K37J91l83J86J46l51J71J54l33J49J76l02R6K00k22QK21k76pL03k57p3
3005a40K82k27o2K79j84j28K89j65q1K63j39j16K89j32j45K75j00j54K58l8k74
3026a50K91o0k32K42O9k89K22L5k70J68J01k29Q3J02k07O3J62k21J7J65j28o0
3048a26J61j37n3L34k14o4J49j03k6K01j32q7K28j59n9J32j2n0J58r7j02J40j7
3071F5j27J61p0j22J49Nj52J12N0j21P2Pj41J52L0j54O4J08j77Q8J08j67L0J09
$$ plain form
2917 161 -42 -237 225 144 -184 141 38 -273 105 60 -328 162 149 -291 232 197 -264 75 158 -230 52 220
2939 220 -272 26 253 -178 33 331 -86 23 171 -129 -134 215 -95 -126 286 -97 -95 290 -68 -158 241 -18
2961 -18 -103 251 -78 -255 232 20 -171 142 4 -258 201 77 -205 145 163 -139 118 123 -199 97 149 -174
2983 -174 63 254 -129 57 203 -148 23 177 -156 -7 169 -133 -37 163 -59 -51 170 -106 -113 190 -67 -140
3005 -140 142 -85 -147 132 -52 -180 109 -56 -137 126 -13 -129 160 28 -117 158 58 -96 162 124 -150
3026 -150 141 81 -151 91 160 -129 93 128 -142 26 127 -102 -19 83 -124 -61 101 -120 -103 62 -66 -126
3048 -126 35 -102 -155 179 -35 -99 50 -53 -79 122 -10 -97 131 -28 -87 45 33 -17 141 44 -58 82 65
3071 65 -62 99 29 -93 56 61 -91 21 71 -50 22 29 -112 40 70 -84 -20 88 -89 -1 107 -60 -30 79
3095G9j38N6M9q3k0J56j52O1O8p0l8J18n1o6J19m5q2J28q8q7K00j13j23J16J4
3120Hq0J14j1r7P4Km2M3pp9P2J4n3M5L2q4L3R9r7L0N3q6k4R2p5M1L2m7O8k0l9
3151A1K5Qj4p6Q4k0lK3L7j62R0J7k8N3r9Q0j5o1j0N5n0K6P2m0k5K1L6q4N5Lk8
3182a9N8jon9O0n9P8Rn4O3j9m0M7N6q6j5Q5l4r9K5O1p7M1n2j7pM9mM9j10m6J59
3214C6m6QJ6RkmKMj9J8J2k3L7Rk1K6j5l1J6j5lkJ8L1m0j1j6oj1K8k9OrJ6l0k7
3250f8j1l6Q5q3L7R1M0q0J1Pj6N4l0l7O3j9oJ7j6J3RLnj6j1qk2K3J1j2KM5m8o
3284a9K9l1K8l2J7m9N3J8m5J0O8p3j4M7m2L9nkM2m6K9Ql5N7k7kl4O0J2n6k4M0
3316B1L4j21J03o1K0LK2l2JJ9l5J0k8rNjN1%j1Lk0N3k7K5ko2MM8l3K5m5N8K7p2
$$ plain form
3095 79 -59 -3 46 -37 -57 99 -53 8 76 6 -32 86 35 -31 88 43 -39 89 1 -86 114 1 -122 -6 8
3120 8 -72 42 31 -66 8 10 -32 11 4 -75 -3 11 -42 3 35 -49 -16 83 -14 16 69 -17 -41 51 -24 17 49 2 70 50 11
3151 11 36 44 30 -46 38 18 15 38 75 -87 3 20 -8 45 -54 26 11 -50 -60 -5 -55 -29 43 3 -22 -1 35 -49 6 9 -19
3182 -19 39 38 32 -27 33 -26 52 61 7 70 51 11 58 114 28 13 98 64 -35 -10 51 -26 15 -37 -54 -61 -12 -16 33 -77 -123 36
3214 36 -10 -2 14 23 21 17 19 23 4 22 34 11 48 57 36 62 47 16 32 17 14 12 30 61 21 10 -6 -12 -23 5 -24 -18 -27 -11 -41 -68
3250 -68 -79 -115 -30 -113 -76 15 55 -25 -14 -7 -23 31 1 -36 27 8 2 19 3 16 25 28 23 7 -4 -12 -34 -11 0 -12 -10 35 -13 -19
3284 -19 10 -21 7 -25 -8 -57 -4 14 -31 -21 47 -26 -40 7 -35 4 -1 -3 39 -7 22 30 -5 52 25 23 -11 49 61 5 -19 21
3316 21 55 -66 37 -24 -4 -1 21 -11 -10 9 -26 -16 -44 -53 -48 -49 2 2 -9 -6 -26 27 0 25 23 -39 -35 13 -20 5 -40 18 45 -27
3350b7%N8m9K7O5m1m1Q3r8K0PLJ6k1J2j5oK5p1N2k7m1M8nj6M8J2m3jL0Knj6KK9
3385A6Onk7L3q4N5O4p2J9L7no1J4k2K4M2n3L0J1l0J1k6Qj1j2K3p7P5j8k7M4%k7
3418d5L8L5l9K5Mr2O0Rm0M0K0m5L4P3q0P3q4K2j1P0j17J4L5K9l5J2K6o9Q6o0q
3449b0Ok7qK7K3k3L9k2k6N8l3j4K2K0o7L7J6j5K1Lok8L6oJ5K9m8j3k4K2J6kl7
3482b9M1j2p7J27p2L7m3MrO7n2n5mN6l1J0L6NK7j9l8JQ4m4j9L6K2q4M5J9l9P4
3514F4Mp2qP9p5j3N7q6O8M4m6J1N6j43Q6l1ol9O3m7nO3l2J9o2ML0K1l4l1N3l%
3547a1N3o1kQ1m2j2m8R5l0K1L1m2n6L6p5M2L5l3O7p6K2q5J08k8K9l8q3J22k6m7
3577e3K7O4j29R9L1n0K8O2j3r5JN8o7Q6q8J7L1nn0J00j2n6J03p3l9N6l1M7k4l0
$$ plain form
3350 -27 -27 31 -18 9 74 33 -8 75 -23 -3 4 7 23 2 14 -1 -7 18 -53 -1 -28 -69 -21 -26 -42 6 18 -25 -26 4 6 1 -15 -13 16
3385 16 22 17 -10 23 -61 -6 58 -14 5 42 37 -24 -10 -32 -8 34 -19 11 22 -8 3 -23 -15 -26 -38 -15 -92 -17 -35 -62 -18 -18 -45
3418 -45 -7 28 -11 14 18 -74 -14 -5 -45 -5 15 -30 4 77 -3 70 -14 8 -3 67 -50 -36 -1 28 -7 5 31 -38 48 -12 -20
3449 -20 -14 -41 -49 -22 1 -22 17 -5 -31 27 -6 -20 2 22 -45 -8 8 -7 14 17 11 -17 19 13 28 57 9 -4 -28 -6 10 8 -29
3482 -29 12 0 -77 50 -22 15 -28 -24 -33 34 -18 -73 -77 -21 -52 -42 -6 -1 26 7 -31 -30 54 10 -9 27 49 -35 10 29 -10 64
3514 64 68 -4 -12 67 -8 -21 36 -50 18 62 16 27 83 -60 26 -5 -11 -50 13 -34 -39 24 -8 11 -51 -47 -17 4 -30 -61 -8 -11 -11
3547 -11 42 -19 -21 60 18 6 -42 53 23 44 75 33 -23 13 -62 -20 15 -18 49 -27 -5 -90 18 -10 19 -19 -102 20 -6 -53
3577 -53 -26 38 -91 8 39 -11 17 79 66 -29 -28 30 -37 49 -39 -22 9 4 -46 54 42 -14 89 16 -23 33 2 49 25 -5
3607eM3j8l3k7O5m1Jj1MLjK1J4o1m7J41k0L4k9ll9LK3k5N2m5O4n6j8l8R8J3p1
3640iM4j16R9l8K6j6O5j02J12L5p0n9K7j2Km5O0PO7j31N7l8j3P1k5o4R0j5O5K3
3670I7j63J71o3l8l3J24m0o9J32K7j63L7l9nN1K4m8J2R6j28lJ3Kj5n9L0k1K6J32
3699H7r4K0o9nL2R5j06M2%N7m4Mj7m4J0Q8N6n0n8j5Q6l9R7j09q6O6jKo9J54j67
3730g7J94j58P5o6Oj8L7K0o5J50k01J00MLj01J34j23J0N5M6j57J35J2l6N0k2k4
3757a7onK7N6m9M4j11J36n6J5q3P5n9Q9o5l0NO6q6Q5o0LJ4N6m1M1j6n6O0m9M5
3788B8K%oj3K0L0mn9K2K7k1j1k5M8qoNk4m%L3j5N4l1op0M2J0p4K6qL3nK8o9Q1
3824C0p7k8J7M9OJ0L3m9Lj4K8M2o3k8N2N0o9KK4o2O5j6rL0Jl4O5k1r3N4jm3J3
$$ plain form
3607 -5 38 20 -13 -40 25 -16 -15 -26 -22 -19 -20 1 15 -46 -93 48 28 62 33 30 -9 -6 17 -8 44 -1 63 7 -11 -49 49 62 -9
3640 -9 35 -81 18 -20 6 -10 55 -47 65 100 30 -29 -2 -14 -12 -57 3 10 77 -54 3 -35 -48 23 -2 -66 24 9 74 97
3670 97 -66 105 42 4 -29 95 55 -14 118 145 -18 19 -20 -25 26 50 2 14 110 -18 -21 -8 -6 -21 -80 -50 -71 -45 87
3699 87 -7 13 -56 -61 -29 66 -40 2 2 59 15 19 2 -42 -32 56 112 62 4 -11 75 36 133 24 -62 4 3 5 -64 90 -77
3730 -77 117 -41 34 -32 -26 -44 -7 13 -52 98 -103 -3 1 4 -97 37 -86 -76 -21 25 -132 3 15 -21 29 7 -17
3757 -17 -23 -28 -1 55 6 50 -61 75 19 34 -49 26 -33 56 -9 -39 -34 32 -54 31 -29 -26 -12 44 3 44 28 -28 32 -17 28
3788 28 30 30 24 11 31 61 57 -2 20 47 26 15 -10 38 30 24 29 5 1 1 34 19 73 42 36 -34 8 18 -56 -30 -38 -5 -10 18 -51 30
3824 30 -47 -75 -58 -9 -3 7 40 -9 -6 -20 8 50 -13 -41 11 61 -8 -6 18 -44 21 5 -4 26 27 -7 58 37 -56 -2 -3 -46 -33
3857c3J2J9k7K9m8P1k6k7J04n9n1J6J2%O7qL2j7n4l6L8Mk6M8kp0M9L1J5l3K7o4
3889gp4R4N7j10N0m4o8J23Np4K5J4m2L3Kk8L6kLL9k5kk4R9q9lN9n8K3P4j06LQ4
3922F7l5k6O5p3J2Q4r6l0O1m3k5P8k0l8J05o5K8k4j8q3J14q7j6J26k8r2Q5nl8
3951a7O1m1j10J10Ml9N1mq4N0L1p3R5L9r2L4N4j40O4P1q4L6M3j04O2N6j17L8Q0
3980G4j18j6J25j09PJ07r7pQ9k6q2J39p0m1J25p1n3L3L7r4J20m2p7Q2J0j27Q8
4007FM9j31P5M1j04P0P7k24J53K7j18L2J37j38K6N5j37O2J32j47J7J30j15p2J72
4032G5j02L7J27j65j7J00o9RQ9r0mJ44p2r7N4l9r0J80jj31P9l0q8J68k1j87N1
4059i0J44j39M0K17l39K45j0j91J71J29j79n4J88k21j1J93k55K26J05l22O9J91
$$ plain form
3857 -33 -21 -2 -29 0 -48 23 -3 -30 74 15 -36 -20 -8 -8 59 51 83 66 12 -24 14 18 -8 40 38 -32 17 48 63 30 57 -7
3889 -7 -81 13 70 -40 10 -34 -102 21 26 -48 -23 -9 -51 -18 -16 -44 -8 -10 -7 32 7 5 -19 80 -9 -12 47 -11 12 86 -20 -17 67
3922 67 32 6 71 -2 10 94 -2 -32 29 -14 -39 39 19 -19 86 21 49 25 7 -76 38 -49 -65 61 33 -59 26 21 -17
3951 -17 44 3 -107 3 7 -32 19 15 -69 -19 12 -61 34 73 -19 15 69 -71 -7 64 -20 16 59 -45 17 73 -44 -6 74
3980 74 -44 -60 65 -44 -37 70 -27 -34 55 29 -53 86 16 -25 100 29 -24 9 46 -48 72 30 -47 35 45 -82 6
4007 6 55 -76 -1 40 -64 6 83 -141 12 39 -79 -47 90 -48 -22 33 -104 -42 90 -57 -40 90 -25 -97 75
4032 75 -27 10 137 -28 -45 55 -14 -5 84 -6 -10 134 62 -35 19 -20 -110 70 69 -62 17 -13 -101 67 46 -141 -90
4059 -90 54 -85 -45 172 -167 78 68 -123 48 177 -2 -56 132 -89 -100 93 -162 64 169 -153 -84 107
4081A07p0k11L41j25mJ28j22j13O1O2j93K90j50j12J96j44m1J38jj09J09M4j87
4104a06J78l2j25J02O1j43Q7L1j37O6J05j65N1J24j50L6J06j74Q9J34j87L8K00
4127A89k17J7J69j43q1J88j31m4J57j29p7K15j13j10K12j01r3J51jj61J18Nr6
4150g6J25J4j95J80K9j67Q3P1j28R7N0k05J49N9j38M0J44j58O8J00j80J4J23j10
4174a1m8J85j38n3J75j40m6J74q6r4K10j39r4J74n8j30J74j1j46J48Pj58J67j9
4198D3j41J72J9k00J49N5j90J38L6j74J29N0j67N0J40j76M3J23j74O3J19j57P
4221d3J45j59j1J31r0n2J69j24k6J78j21p2J67r4o0J57p5j04J74n3j21K10m5k18
4245a37J91jj30J54K7j63O9K5j56K03k0j89J79N1j81R9J16j58l1R6j24l2K08j64
$$ plain form
4081 107 37 -174 167 42 38 166 44 -69 -8 54 -139 151 1 -111 85 -59 -100 38 37 -72 37 81 -106
4104 -106 72 40 -85 17 78 -65 22 53 -84 -18 87 -78 -27 97 -53 -17 89 -85 4 138 -49 -11 189
4127 189 -28 -11 158 15 -66 122 -9 -53 104 -25 -102 113 0 -110 102 1 -92 59 58 -103 15 20 -76
4150 -76 49 63 -132 48 77 -90 -7 64 -64 33 83 -122 27 86 -52 -12 132 -26 42 142 -38 -24 99 -11
4174 -11 -59 126 -12 -65 110 -30 -76 98 12 -82 128 -11 -105 69 11 -119 55 44 -102 46 53 -105 62 43
4198 43 -98 74 93 -107 42 97 -93 45 81 -93 36 86 -81 -31 109 -67 -24 99 -75 -12 107 -50 -43
4221 -43 102 -57 -68 63 -27 -79 90 -34 -60 118 -3 -75 92 -2 -62 95 20 -84 90 37 -84 126 81 -137
4245 -137 54 53 -77 77 104 -59 10 35 -121 82 62 -127 52 103 -78 21 137 -21 -52 44 -80 -112 96 -68
4269f8L8J22j69K8J19j12l5J41p8q7K38j61nO9jq0P2K7j20J35m1j10J79m1j41
4294h1J55l4o6J05r8j04J07M0j24R9Q3j69P1P6r4NP9j55J30M7j32LJ95j58K1R5
4320I6j01m5J57j17PJ41j50n5J75n4j13J41m4p8J01m3p3J35m9o9J05l8j17J11
4344B3M7j07L1O0j37R8K7o5J7P8p2l8P5j26O4J08j17O9K9j42Q7N5p1KP9q7RM6
4372D2m8J9N4r8l4Q8j6o6Q7L1j14P4oq0M9J4l9R9o7k8N4M8j06R3j6m2K9J2p0M7
4402A0Q4r6M6K3j40R5N2r2K1M8o7K0M9n9l3R3p7m8J23n9o9Q5Nk8M1l2o4J16k3
4431B4k8nRm7K0K3nJ12nq5K8N4j49J23o2lM8j1k7K2M6q8O7k8n1jL5p2N7J5p2M5
4463a1qN3k1n9oJ0Q3m5K9j3L6J8n5no1J08j7n7M9k5m4N3QL4o0K7o2P7j7mj6M9
$$ plain form
4269 -68 -30 92 -77 -49 70 -42 -77 64 -14 -101 137 -24 -29 40 39 -41 31 58 -62 73 32 -78 101 60 -81
4294 -81 74 40 -26 79 -19 -123 -16 24 -100 -1 82 -87 -16 60 -34 -29 50 -105 25 72 -60 -57 138 -20 1 96
4320 96 -5 -50 107 -10 -3 138 -12 -67 108 54 -59 82 38 -40 61 18 -55 80 31 -38 67 29 -88 23
4344 23 70 -37 -6 54 -83 15 42 -23 -6 72 0 -38 37 -89 -25 83 -34 35 64 -78 9 64 -7 -5 74 -13 -4 42
4372 42 -6 13 67 -31 -65 23 7 -59 28 59 -55 19 13 -67 -18 -4 -43 56 -11 -39 15 63 -43 50 34 -8 21 33 -37 10
4402 10 94 -2 44 67 -73 22 74 -18 3 51 -16 4 53 -6 -39 54 -23 -71 52 -7 -76 9 14 -14 27 -5 -69 47 24
4431 24 -4 -9 0 -47 -27 -4 -9 103 98 13 41 95 -54 69 7 4 52 41 14 36 82 -6 61 33 -18 -19 16 -56 1 16 -56 -11
4463 -11 -19 34 13 -46 -52 -42 41 -4 25 12 48 66 11 6 -55 53 36 -21 28 3 -41 12 20 54 -6 21 -41 36 19 15 -1 48
4495D8q3Q1jn6qM2m8L2J9n1J9J9l7jL1J0l5L1k9L1L1p3J4O3o6jL9l8L1J3QJ0k4
4528B1J5n6N5moM3m8l6L5m5J8O6j11O4J3m0J4K1rl3j4ML4PK2Ml2oo8K3J32o2j2
4561Ij4N3n8M1Ll3M0j7mK8n0NnK4K9j07L4qO9k6ll1K9k2jKK3k6j1L2J6rk5ooK0
4597eOm9O1K0m7N7j3Lj4k9J7k8N2Jj6k9KK7JK8l1Kl6J9%k5J9j7J3LnJ8j0mJ5k9
4633b3L0Jj4n8L4nK1NlJ2J2Lk7M3m8j1K7j8M7kl6M0j6Pj6L3k2LmJ3J8rl6Pk1N1
4669C8n6NK2j8K1oj4%j0kK4j4KJ2qJ2L1m1L9J0n1J5J5nj3l9M0L7n3L3l2K3k2M0
4703C5q3J4j7O2j8k6L1k4RK7j1Nk8l5P1J6k1k0R0o1j9m5KN8p1J%P2%j1j9j7M6
4736A3J3j6M4o4O6nn6J0j6j6m1Q7K1n8j6K7J2np7O4m3N0K6j5q5N9qk0k0L9k9L3
$$ plain form
4495 48 -35 46 45 -11 -19 23 -25 7 26 -25 -6 13 -24 -25 6 16 -19 12 -17 14 45 -28 -14 49 -17 -18 21 -17 14 27 35 45 21
4528 21 36 -20 35 31 25 68 20 -16 19 -26 -8 58 -53 11 24 -16 -2 19 10 -23 -37 -33 1 8 30 34 2 -4 -72 -49 83 21 9
4561 9 -5 48 -10 31 34 1 41 24 20 48 -2 3 -2 22 51 -56 -22 -30 39 13 10 -21 8 -14 -15 -13 10 -16 -27 5 21 12 -13 -19 -25 -5
4597 -5 1 -48 13 33 -14 43 30 33 19 -10 7 -21 31 32 16 -13 -11 16 17 45 14 16 -20 -1 -1 -26 -7 -24 -11 -8 -13 5 -5 -9 6 -23
4633 -23 7 8 -6 -64 -30 -35 -14 -9 -12 0 12 15 -12 31 -17 -28 -1 -19 28 26 -10 30 14 21 5 38 16 19 15 28 46 37 1 8 -13 38
4669 38 -18 -13 9 -9 12 6 -8 -8 -18 -20 4 -10 -8 4 -4 8 39 -2 37 47 -4 11 26 21 8 -31 9 46 -7 26 -6 17 -5 35
4703 35 -48 -34 -51 11 -7 -33 -2 -26 -17 10 -1 4 -24 -59 12 28 7 -13 77 16 -3 -48 -46 12 -59 -58 -58 14 14 3 -16 -33 13
4736 13 26 10 54 -10 56 51 -5 5 -11 -27 -68 19 40 -18 -34 -7 5 0 -77 -13 -56 -6 20 5 -80 -21 -29 -49 -69 -30 -59 -26
4768b6N8l3J4p7O8n9K4K6j0L5n8L6N6q4J0K6m3j8J34j24KN7qNJ9Mp9P9k3L0o5
4799b4J8K8m0Qn1J21P9j49l7J06m7om1Q2l1qpj8P6n8J9l0O2j5nn2N2o4J1J9m1
4830d3O6l5l4M4%KoK7l6m6P0m1L4k4j7QO0k5n2O1mjJ0jj2oJ0k0M1%m4M1nMRm6
4866a1k0L5nK5k0Lj3K5j5Lk7L0Mj7Mk2l5P6K4m8L0j2rMQl4J4l9N2j9K5ll2RKK1
4902A3OK8m7k6J7L4k7qK7n3O7j4LMl8J6J4m5J0K2J8qj1j4jK5J7k1j7M6K7q2NL5
4936B2j1m5O1l0j9L7j4l0LJ8J7pj6J7k0J%K8J1m7K1k2OJ9j8l2L9j4KM9m7J7L1
4969B7j1l3L5nlK9l5K3J5l7j1J0K1k4LM3k3Mk6l7LK7j3JJ1J8L0l0Mk6L1l1K5n6
5003d1K7N0jm5j4qK9pMnQL3j5NJ4l1k1J0J7k8K6m5QL2qj9J3j7JN4n4L2k6N6m4
$$ plain form
4768 -26 32 -1 13 -64 4 -55 -31 -5 -15 20 -38 -2 54 -30 -20 6 -37 -55 79 -45 -43 14 6 11 30 34 -45 34 11 41 -24
4799 -24 -6 22 -18 -10 -61 60 139 -10 -47 59 12 6 -35 47 16 8 1 -17 59 1 20 -10 52 37 32 -20 32 -32 -21 -2 -43
4830 -43 23 -12 -46 -2 -2 0 -6 21 -15 -61 9 -32 2 -22 -39 -31 29 4 -48 13 9 8 18 17 5 -1 9 -11 30 30 -14 27 22 26 35 -11
4866 -11 -31 4 -1 24 4 7 -6 19 4 7 -20 10 14 -3 1 -21 -56 20 44 -4 26 14 5 9 17 -17 -3 -42 10 -9 16 13 -19 -10 -8 13
4902 13 19 47 0 -26 -9 25 -2 -10 17 -36 31 17 20 24 -14 2 16 -29 -19 3 21 13 2 -12 -13 12 29 8 -9 37 64 -18 -13 22
4936 22 11 -34 27 -3 -22 15 1 -29 -26 -8 9 2 -14 3 -17 -16 -16 12 23 -24 -3 -25 -19 0 -18 -50 -11 -25 -23 26 -21 -4 27
4969 27 16 -17 18 13 10 39 4 27 42 5 -6 4 25 1 4 47 24 28 2 -35 -32 -5 -18 -17 -6 12 42 12 16 -10 21 -10 15 -41
5003 -41 -14 36 35 -10 -24 -32 -3 -10 -6 -11 -3 30 15 20 34 3 -18 -8 9 -19 7 -38 -30 2 -6 -25 -12 -29 -28 26 -28 4 -22 34 -10
5038a0n7O1l4P3k7j6j6k0N3lk2k8J5LK6J4j9kj6K1Kk9M5m1j6M0OJk4L9l5k2KJ7
5072a9k1L9JJ3l3mk8j5N1j7ML2o1J4%L2J9k5L1nk5l3N5j7qj8JK9K3J2o4M8rRP
5107A8pjL2k7k2n3L2PKj3kl8R2l5j3O2p4N3m0K9K6m9K6J6Qk3J7K5lp6L9j0J5p5
5141f2P6k0J9P2j9j5o5N8p7M8J4m3l1M5K7M1m4k5k5K2k8N0%l8J6k2M4kl2M4m9
5172b1LNJ8J6Pk0j3j4L9l9oNQK7k8rP3l6Kj3l9k2R0k8l0L7m0J1kK9l4mJJ2K1j0
5208dQRj5j3K1JJ9l1J6Qo4M2J0m4K7k6N8k9j3Lj1J2j2k3LQ0j44J05l7rN3k3MJ1
5242hk4Pj4K3l7K1Ql7N0j5K4k5o0M7L8K3l9N2n5J6l0O5K8j0n0NJ7l1r7J17j4L4
5274B9k0L1n6RnOk1K0k4k1N3J6j2K5j2Nj3l4mM3j1n9J7P6q6O9mp2P9n4lQ0nq4
$$ plain form
5038 -10 -67 -6 -40 33 6 -10 -26 -46 7 4 -18 -46 -31 -28 -2 12 -7 -9 -25 -4 -2 -31 14 -27 -43 -3 3 4 -20 19 -16 -38 -36 -19
5072 -19 -40 -1 0 13 -20 -24 -52 -67 -16 -33 -29 3 -58 -44 -44 -12 7 -18 13 8 -17 -50 5 -12 -20 -38 -37 -8 15 27 -37 11 2 11 18
5107 18 11 10 42 15 -7 -60 -28 -21 -19 -32 -34 -72 20 -15 -28 34 -40 13 -27 2 28 -21 5 21 29 6 23 48 45 -31 8 -2 13 -62
5141 -62 14 -6 13 85 66 51 -14 44 -33 15 29 -14 -45 0 27 68 24 -1 -26 -4 -32 18 18 -20 -4 -26 18 16 -16 28 -21
5172 -21 -18 -13 5 21 28 8 -5 -19 20 -19 -25 -20 -12 15 -13 -22 51 15 17 4 -35 -57 33 5 -25 12 -28 -17 -19 10 -24 -28 -27 -15 6 -4
5208 -4 4 13 -2 -15 6 7 26 -5 11 19 -45 -3 7 -37 -10 -36 22 -7 -20 -17 -28 -16 -28 -51 -48 32 -112 -7 -44 -53 0 -23 -19 -8
5242 -8 -32 -25 -39 -16 -53 -32 -24 -61 -11 -26 -2 -27 -87 -40 -2 21 -18 34 -21 -5 -35 30 58 48 -2 3 20 -11 -108 9 -5 29
5274 29 9 40 -16 -7 -12 -6 -27 -7 -31 -52 1 17 5 30 18 23 10 -24 -28 15 4 -55 -38 38 -48 21 17 -55 24 -30 -33 47 42 -42
5308d2N2pj0K6noJ1j3k8lK3n3L7O1p2N1N7r7J1J3j9N5k9n5j1J05o3L6Mj1j1K2
5340B9k3jK8k6l5K6K4QL8m7m3P7l9qMJk4NMl8O1j2l5K8%l1J1L0n3N2Jl6K7Lm1
5375c5L9L7n4jP2n1l6M7j5j0M3l3j3N4j00P0N1j74M7J26j12K5L5mk4M4j4n4P7
5404C7k3l3L3mm9M3K1r5O0N2p2O2L5j07N0L0p1N9K5q2K6M6p0pQ7p3K2L0n9LQ3
5435E9k9p1O8n1RQ5p2l8Q4m1o6J15o1n8Q3j6l5P0n0o1J08Qm9K2L4o9M8j0n6QP6
5466D4o0L8J2m8O5J1j04K5P6j05O5N0r7N1K1n6l9J26p7j8J09r1l4R2p7nM0l9k8
5495e3Q9n7K1N9m5o4R6lp9P8Pj22J20l1q6J03j2o5N6K1m4M9Pr8N4P9j03RP8j13
5525d9rJ61j09l0P4n2k2N4k3k5J08j07j2M5k5l3J66o7j05J22J6q1N2k3%j4J1l9
$$ plain form
5308 -42 10 3 -7 19 14 8 19 6 -22 -25 -2 -55 -18 43 -29 22 79 -18 -7 6 -13 42 13 -42 -53 52 -11 25 29 18 7 29
5340 29 6 5 33 7 -28 -2 22 30 68 21 -22 55 16 8 12 13 -11 -6 -2 -40 21 9 -26 2 2 -29 -18 12 -41 11 12 -24 3 6 -35
5375 -35 4 41 -13 -14 58 7 -29 18 3 -7 36 3 -10 44 -56 14 65 -109 -62 64 -48 -23 12 8 -16 28 14 -40 37
5404 37 14 -19 14 10 -39 4 25 -70 -10 42 -30 32 67 -40 10 40 -31 28 53 -29 -3 43 -27 -34 53 -20 2 32 -27 -24 59
5435 59 30 -41 27 -24 -15 70 -2 -40 44 3 -63 52 -9 -67 16 0 -35 35 -15 -76 32 40 -9 13 47 -22 26 16 -40 -32 44
5466 44 -16 22 34 -14 51 62 -42 -17 59 -46 19 69 -28 23 44 -12 -51 75 -2 -20 89 -2 -36 56 -21 -26 14 -25 -53
5495 -53 36 -21 0 59 14 -50 46 43 -36 42 49 -73 47 16 -70 33 21 -44 12 33 -11 38 45 -53 1 80 -23 -14 64 -49
5525 -49 -58 103 -6 -36 38 -14 -36 18 -5 -30 78 -29 -41 4 -21 -54 112 45 -60 62 78 -3 49 26 26 12 23 -16
5553a6O0l1j27J49J0p0N9Qj19P8M1p9k4J86k25M4J52j57L8J10k30J16J35j48J7
5578b3J55r3p4J47j71M6M2r3L6K7Lj6Q1o8o7R5jn9O8l6k5N0L1p9N6L3j40O6N2
5607D3l5qK4p6M8Q5o8J3N0j62O1R0q6J8M0k3l1Q7k9q3R7l1m9M3k4J1K5l6p0J45
5637F9m5j22J35k5n1Q4o4k6Q6k2j17J14k5n6O8K2j07J04p0J9K2J6n7N6j6l6O2
5664A8J7p6K1K2l2K6K5o9M0J07j03ML1o0M9M9J1p6N0r3n9J05L7qn4L6k8J23j11
5693Bo2M7L8r7O2L3j21J19K9q0K3L5l0mN8j34O1J0j3J2mj6qQ6o2pM2l4k4N0m5
5724c4K8M7j0q9J48q3p1P5L5q0R5l3q1J29n3j8K3k4l1J6K9N6p0Q2j48RLL4o8J05
5754B1j4m4J38j42p5J96j42Q7rqKj5jJO1m0j2Mn7J9M4p4O0k2RKL1l3NO4q7K0M1
$$ plain form
5553 -16 44 13 -114 35 45 -25 34 42 -77 1 42 -37 -61 125 -100 -56 96 -61 -23 87 -143 -27 108 -40 -23
5578 -23 132 39 -35 112 -59 -13 29 -64 -28 -1 2 -14 67 -1 -68 27 26 -33 35 -1 -26 24 55 -24 32 65 -75 -9 43
5607 43 8 0 24 -52 -4 81 13 26 76 -86 -25 65 -21 -3 37 14 -17 70 41 -42 55 24 -25 18 -6 5 30 -6 -76 69
5637 69 24 -98 37 12 -39 45 -19 -45 41 19 -98 16 -9 -65 3 25 -82 22 -48 -29 -7 9 -48 8 -8 -44 18
5664 18 35 -41 -20 2 -30 -4 21 -48 -8 99 -4 0 31 -29 20 69 80 4 54 -39 -98 7 44 36 -18 18 -10 113 2
5693 2 -60 -13 25 -72 -10 23 -98 21 50 -30 -7 28 -2 -6 52 -82 -21 -11 -24 -12 -16 -32 -40 46 -16 -23 19 -15 -39 11 -34
5724 -34 -6 41 31 -58 90 7 -64 11 46 -34 61 28 -53 76 23 5 28 4 -27 -11 18 74 4 86 -62 -53 -50 -16 -84 21
5754 21 7 -37 101 -41 -116 80 -62 25 16 8 10 -5 -6 -5 56 16 4 8 -49 -30 14 -60 0 -22 -13 -11 20 -13 -8 56 -31 -11 30
5787C0J6r8P6j4o3N4N6o1M9Jp3O9j27P1j7J4m7J59Rk11J57q1j2R2m8k3l7O4Ol7
5817b6P6r2k8R3o4QO4n2KOpJJ5k6K6M1o0j3M9k6K1J9j2n0M2jm4K4J7m8K6J9Kk4
5851b2Mj5K0K7k9J2j3J2rK1k5KnONK7n3L4j8Kk0O2k9%J0jm2N5ml2M5ll3L6k4k7
5887b4jJ2L5k2NJ8m2NMJ4J0m0j1K4j8mK3K1j0k6J0Qj4NM7j0n1J0LJ3m6L1k5P1
5921B5j1l3J6m1oK3lj5OM8Lm1j8J8Jl8M6l9k8J0J3M5k8lj7O0R2j36O6M1n4k6L7
5954A3m0K2j6j0J2k4P7OPm6Nj7k2K6j8l3N1pJ5K5r3J00N1j31l0J34oq2rJ5l3J15
5986E7j7r9R9o5O9O7j51J03o5JrN1q3L2K4kN3l1K7m8LJ1l8RMk1L4l3J1L3J0j6
6018B0Jm2K1m3K6J7nnK8LJ5rn3j5Q0k5J1Orn2QRLN1k5j7P1r6J9K2k4K6l9M2mk3
$$ plain form
5787 30 46 -52 24 10 -53 1 57 -4 45 46 -27 42 -85 -14 -31 -17 -64 95 104 -107 50 -31 -43 49 1 -22 -59 5 11 -26
5817 -26 50 -42 -70 23 -41 -33 31 -21 -19 -13 -20 -19 -4 -30 -4 37 -23 -36 13 -13 8 27 15 -35 7 6 -38 -14 3 -45 -19 0 2 -22
5851 -22 -18 -33 -13 14 -15 -3 -16 -4 -13 8 -17 -15 -20 -14 -9 18 -35 -1 -19 -17 -37 25 -4 -4 6 5 -37 18 14 -18 27 24 -9 27 3 -24
5887 -24 -25 -13 22 0 5 23 -19 -14 -10 4 14 -26 -37 -13 -31 -35 -12 9 -1 -27 -17 -9 -23 -18 29 19 -32 -22 -19 -6 -52 -21 -46 25
5921 25 14 -19 -3 -44 -50 -27 -30 -45 -39 9 12 -29 -47 -29 -28 -66 -20 -59 -87 -77 -64 -19 -47 -50 -67 -7 85 -51 15 56 2 -24 13
5954 13 -27 -5 -21 -31 -19 -43 34 40 47 1 6 -11 -33 -7 -25 -58 -7 -14 1 26 -67 33 84 -47 -77 57 51 -31 -40 -25 -58 57
5986 57 40 -59 40 -25 44 111 -40 63 -2 -1 -10 41 -42 -10 14 12 65 34 61 13 16 27 -11 -2 2 -19 15 -18 -7 26 36 20
6018 20 21 -21 0 -43 -17 0 -5 -10 18 21 36 27 -26 -41 39 14 25 31 22 -30 -22 -13 -10 41 16 -1 70 -26 -7 15 -9 17 -22 20 16 -7
6054gl0O7k0k0J2mj4J9m0J6j3J1J0MLJ0oQk4K2Pj3J6j2%l7L7lJ1rJ9k0Onl7M6
6090A0jl1K3K3m5K8j7J8j4K3J7k6k2K0n1M9j8J8j2L3m8L9k3j7j3QK0j0kJ3N1k
6122D1l2K9pk8L0k2Ol9J3J1PJ5OPl3j6J1Rl4K1n4O2pL2l5j2J7k3J7P2j8m4j2J5
6156EK7o6M5k4J3k8M7J3j1%k1%QJ2J6m1J2k2M4oRm9L3J8p3L6j8QK1Jjm8O4p5R7
6191D6j1l7nL1j9k6J4n3L2k0P7Kko7NO0j2j5j0j1M2mp1J24j46J07m5K6Ql8M5m4
6223a7kK0oppL4j8M2n1N4k3k3RM1n2Nn6L7L3pM8r2L4qK1J2k5j8kL4l4J3PrL4m0
6259a9L5k0L0k9j6J8j0qj0PK4l5LJ5L3Jn2Rk3K9Mo4R4j2j4q6P4M8l3K0J4r4L3
6292c4L6n7N1J1o%K8k4j7L7m2K0L4m5k1N2qm7j0L8j0Rl0MJ4l5L3k4K9k8N5n6K9
$$ plain form
6054 -7 -37 30 10 -10 2 -2 -16 3 -37 -21 -34 -23 -13 -9 -6 4 -2 6 -18 4 11 -2 14 2 2 -35 2 -1 10 1 20 0 6 1 -36 10
6090 10 9 -22 1 24 -21 7 -10 8 -6 17 34 8 -14 6 -45 4 -14 4 -8 25 -23 16 -7 -24 -37 -29 -9 -19 -21 -8 43 41
6122 41 9 38 31 3 33 11 17 -22 -9 2 9 24 30 37 4 -12 -1 8 -26 -5 -59 3 -4 28 -7 -19 -2 -25 -8 64 46 2 -10 5
6156 5 32 -34 11 -13 0 -28 19 32 21 21 0 0 8 20 36 -5 7 -15 29 23 32 -17 16 34 -39 -3 -21 -13 8 9 8 -40 24 -51 46
6191 46 35 -2 -7 24 5 -21 -7 -60 -28 -48 29 31 29 -38 -33 27 15 0 -10 -21 21 17 -54 70 -76 31 -14 12 20 -18 27 -17
6223 -17 -19 1 -5 -12 -19 15 -3 39 -12 42 19 -4 5 46 -6 -1 -57 -20 13 6 54 -38 -4 -12 9 21 -4 -22 -24 10 -24 -11 -4 -13 21 -19
6259 -19 16 -4 26 -3 -19 -1 -11 -19 -29 -22 2 -33 -30 -15 18 19 -33 -24 -47 -18 -14 -78 16 4 -10 -96 -22 26 -7 13 27 -67 -34
6292 -34 2 -55 -4 7 1 1 29 5 -12 25 -17 3 37 -8 -29 23 15 -32 -42 -4 -14 -5 -35 -31 -17 -52 -19 -43 -14 -42 13 -43 -14
6325a4K7k5K4%k3j9L5K3K0o2J4J6l7M4j9j4M9k9J6Om2K8m7J9k5L7On0M1jnl8J
6358d4M1k9K4j3%l2K9J4L4l9ON5k9L1l6K1k4K8k5l2k0M4nrK3j3j9K8j0k3pM5l7
6391b3Qj6j9N7K0k7pjn4Q2p0L8m5R8M1j61Q4Qn1J9K7m8M4qJ4j7J1kk1K7j1n6R9
6424D0%j4j7j2m0Q3m5J2RL1n6N7k0o2j6RP3%n7J8j2j6J3M0n1P5p3Q5o2N6J5n1
6456A2KL9j4J4o3M1nj2m3N0J1Rp9NnR2r9j4O1n5R5o1j4K2Pj6q7J40m1RM3j0m2
6489hK5j5K6J4n0J3Mj7rK0M7K9n6j2n7J0L8l1O1oq9J01n0p4M2L6MK0M6r3K4Q4
6521G7j07P1l2qk1N8p1J3Ql8J37o2K5q9K8J35j07L2k8K5l6j5M1n2J6L7m1l0J00
6550F6l4r9P7J7q7k7R0N4mn0J8l8O7o1NO3n5l0L6O6j01k4J8%Pr7J66K1q3R3q6
$$ plain form
6325 -14 13 -12 12 12 -11 -30 5 28 48 -14 0 16 -21 23 4 -10 39 10 26 32 -10 18 -29 -10 -35 2 8 -42 -1 -2 -7 -45 -44
6358 -44 -3 -32 -8 -21 -21 -53 -24 -10 24 -15 -9 46 17 48 12 33 9 37 12 -20 -40 4 -1 -10 13 0 -19 9 -1 -24 -31 14 -23
6391 -23 -15 -31 -50 7 27 0 -7 -8 -62 20 -50 -12 -57 41 82 -79 5 13 -38 -19 8 -40 4 -4 10 -7 4 2 -19 8 -3 -59 40
6424 40 40 26 9 -3 -43 40 -5 7 16 47 -9 48 28 -34 -50 -41 32 32 -25 -7 -19 -35 -22 18 -33 42 -31 54 -8 48 63 12
6456 12 14 53 39 53 -10 31 26 14 -29 21 32 41 -38 -33 -38 54 -45 -59 2 -53 42 -19 -33 -11 -4 -20 -107 33 -8 1 44 34 -8
6489 -8 17 2 28 42 -8 5 9 -8 -17 3 50 79 23 11 -46 -36 2 -29 32 26 -63 38 -12 -86 -44 -8 -4 16 62 -31 -7 77
6521 77 -30 41 9 1 -20 38 -33 -20 -12 -50 87 25 50 -39 -11 124 17 49 21 46 10 -5 36 -16 0 37 -4 -34 66
6550 66 32 -67 10 27 -60 -87 3 57 53 3 21 -17 50 -11 -6 57 2 -28 8 74 -27 -51 -33 -33 -26 -123 43 64 -19 74 -12
6581a2K7r2Q9j9j4K4M1r0P7m1Mj5q4O4M4o7L5J38j50n2J36Jn8L1r2K9Q5pm1M4
6611C5j5Kk0M7r9J10l3l0j2N3p1K2M6lm0M3l2k6k2j5m6Q4M4k6K7lN5k5j16L0K0
6642a6L6Kkkm5L7l6M1J5j4l6P1m0l5R6p2J0J3om4J3R2j26J00k5o3L3M4o6O0j4
6673B1J2j6r0M5O1K8p3mJ05j24M4M9l1o5Q7m8OP4j04K9l6M5O4k1l6K0J9k8k5M5
6703E3q2J9O7m9M0n2L8k8okM3j6j4n4K5M3o9Q8k3n1K3j7L5j6lk1L8M3m0n7R2l0
6735A7QQl5J9L6r2M5L0k4k2L0Jj6J5Qj8L1q3K1O8n1k5M7j8m9N7l7L7J3k6l4OK6
6768gm3N1J8l6L6j0j4rP8n4p3R7m9M7M5p4LO2o2rJ3l1K0L9n1kN1n7jO6o9l2Q3
6801B6r3N1K3n8J1Kk1j0J11m0p3N8Qn6M5N2l1j2L7q2O6N1j04M7O4j17j5J11j32
$$ plain form
6581 -12 15 -77 12 -7 -21 3 44 -46 31 -10 -6 -21 -105 -41 3 -64 -29 109 -41 -93 43 44 -14 17 -75 -46 39 32 -9 35
6611 35 20 22 2 49 -50 60 27 -3 -15 38 -33 -11 35 32 -8 35 3 -23 -45 -60 -106 -22 22 -4 23 20 75 50 -66 -36 -16
6642 -16 20 22 20 18 -27 10 -26 15 30 16 -20 51 11 -24 72 0 10 23 17 -27 -14 78 -48 52 27 -36 -3 41 -25 35 21
6673 21 33 17 -73 -28 33 61 -12 -16 89 -35 9 58 27 -38 49 1 7 81 -23 6 -30 15 79 58 22 42 61 33 8 53
6703 53 -29 -10 57 8 48 -4 34 6 0 -2 41 25 11 -43 -18 25 -44 44 21 -30 -7 -24 11 -5 -8 -29 9 52 12 -45 47 17
6735 17 25 33 -2 17 53 -39 6 36 12 -10 20 21 5 20 28 10 41 -42 -21 47 -4 -29 18 0 -49 8 -29 8 21 -5 -39 -33 -7
6768 -7 -50 1 19 -17 19 9 -5 -14 64 10 -63 34 -15 32 77 3 6 68 6 -3 10 -21 -1 38 -13 -15 36 -21 -22 44 -25 -57 26
6801 26 -67 -16 7 -51 -40 -38 -59 -69 42 2 -71 -13 -5 -61 -16 36 5 -7 30 -52 14 65 -39 8 72 -45 -60 51 -81
6830h1R2J03j05o1J21n9M2l2o0k4N3J7rM1o8K4L4j13Q9Q4l5q3J8K0O1J0l1p4P6
6859E0l9j9QK8m8O6Rl2K0K4j01j1J37j31R3Pj31P5L6l4K7K0j06R5j2q8QJ18r2
6888b3j7R1j11k8J73n1p3J13q0%L6n9k3J19n4k0K2j0k7N0JnO0p9r7J26o0j8J06
6917F2r5jP8m7p3R5J5j63J42j6l5R1m5j57J22J17j42J1J00j11P1q0J34o0M1o1
6943gm5J15j11Q1N9p8l5L9K0n6K0K6o1Q6p3m3J20K2k04Q8J12j69J30l1p1O5L5
6970C4j21Q8J6l6N0j3j13K9J19n3J2J4o3R8j4r8Q7k5k6LJ10j24J1O2n1J7J5m5
6998a7p8J23n8k9Q7o9rO6p1M2N7m3k3k0N9m8J9K3l7Q5l7m0L7M6n9K1J9n2K5M1
7028F0q7M7M7j43J7J37j02N4K1m7kK6r5N7On3K7K6k1NN8n4rN6Nj06J39l9q2O1
$$ plain form
6830 -81 11 114 9 -52 69 10 52 20 -40 -64 -11 6 -3 38 -30 -6 28 -85 4 88 53 -30 -12 8 69 79 48 -26 50
6859 50 11 -8 0 28 -20 46 55 23 43 67 -34 -45 92 -39 54 61 -70 5 41 7 34 54 -52 43 31 -57 -49 69 -23
6888 -23 -40 51 -60 -88 85 34 -39 74 -6 -6 30 -29 -52 67 13 -7 15 5 -22 28 29 24 84 5 -92 34 -26 -44 62
6917 62 -33 -34 44 -3 -76 19 34 -129 13 -3 -38 53 8 -149 -27 90 -52 -41 59 -52 19 -61 73 13 54 -7
6943 -7 -52 63 -48 33 92 14 -21 18 38 -18 2 28 -33 53 -20 -63 57 79 -125 -37 75 -94 36 5 -66 -1 34
6970 34 -87 1 17 -19 31 18 -95 -66 53 0 12 26 -37 61 47 -51 36 11 -15 -12 98 -26 -15 47 -4 13 28 -17
6998 -17 -95 28 -30 -59 28 -41 -50 16 -55 -13 44 1 -22 -42 17 -31 -12 11 -26 59 22 -18 19 65 6 27 46 -6 19 60
7028 60 -27 20 67 -76 -59 78 -24 30 51 4 2 28 -67 -10 -4 -57 -30 -4 -25 -20 38 -16 -25 31 36 -70 69 30 -52 9
7058Il6J9K5l5j5P2K5n1N5j9p2O2rq8O0K7n6M5J7o6NO4n1k1N4n4m7J04q6L9L0
7089Fo5R3M5j06n6J18k9q8J26N2j16Q1k3n4J10q8KL0K6m3J0K2l9J0j3n0N3j7j5
7118a8O0k1n5K0J3l2k3O3o3K4M4o3O5n0Ml3P9k7k3O1L0r6L9j4j8N6m0J2N8O2j39
7149b5Q3q3J0K8J9o7O8l9O7l8K1r0J9M3n1NJ6n6O5K3n9P8j7k7k3O4n1L3L5j04
7179e3R2J0m1j5O8n3L1K3qMk5j0NjQl1Q7j2p4K2nk2J8%k4JLl4L0J8k3J5mk7K6
7214aO6p0M7l0l2O7l0M1r8P0q3J49j13J00n4l3P5p7N9j09J3L5N1r1R5J4m3l5J9
$$ plain form
7058 9 -27 -8 17 -18 -33 39 64 13 68 49 -23 39 30 -58 2 29 -27 18 35 -31 -26 38 -13 -34 20 -34 -81 23 -63 -24 6
7089 6 -59 34 79 -27 -83 35 6 -82 44 96 -20 61 38 -16 94 6 8 38 64 21 31 53 14 24 11 -39 14 -3 -18
7118 -18 42 21 -34 -14 -1 -33 -56 7 -56 -32 12 -51 14 -36 -32 -65 14 -13 -36 25 55 -41 -2 -16 -34 22 -18 -6 52 114 -25
7149 -25 58 -25 -15 13 32 -35 33 -6 61 23 44 -46 -27 16 -35 -30 -14 -70 -5 18 -41 37 20 -7 -30 34 -17 16 51 -53
7179 -53 39 49 8 -7 61 8 39 62 54 58 33 23 28 27 35 4 91 79 5 27 22 0 18 18 -6 -5 -2 -36 -6 12 -11 4 0 -27 -1
7214 -1 65 -5 42 12 -20 47 17 58 -40 30 -53 96 -17 83 29 -4 71 -6 53 -56 -43 -8 43 -48 47 61 18 -17 2
$$ [...]
8191a6
##END NTUPLES=NMR FID
##END=
