##TITLE=1H_SA_Ac.IV
 CDCl3, 8 sc, 
 3.08.2021
##JCAMPDX= 6.0         $$ Bruker NMR JCAMP-DX V2.0
##DATA TYPE= NMR FID
##DATA CLASS= NTUPLES
##ORIGIN= UXNMR, Bruker Analytische Messtechnik GmbH
##OWNER= root
$$ XWIN-NMR		Version 3.5
$$ Tue Aug  3 09:26:16 2021 Russian Standard Time (UT+4h)  she@DPX200
##.OBSERVE FREQUENCY= 200.131506
##.OBSERVE NUCLEUS= ^1H
##.DELAY= (6, 6)
##.ACQUISITION MODE= SIMULTANEOUS
##.ACQUISITION SCHEME= undefined
##.AVERAGES= 8
##.DIGITISER RES= 18
##SPECTROMETER/DATA SYSTEM= spect
##.PULSE SEQUENCE= zg30
##.SOLVENT NAME= CDCl3
##.SHIFT REFERENCE= (INTERNAL, CDCl3, 0, 15.7039)
##AUDIT TRAIL= $$ (NUMBER, WHEN, WHO, WHERE, WHAT)
$$ ##TITLE= Audit trail, XWIN-NMR		Version 3.5
$$ ##JCAMPDX= 5.01
$$ ##ORIGIN= Bruker BioSpin GmbH
$$ ##OWNER= she
$$ F:/spectra/data/she/nmr/H-F/1/audita.txt
$$ ##AUDIT TRAIL=  $$ (NUMBER, WHEN, WHO, WHERE, WHAT)
(   1,<2021-08-03 09:24:58.35 +0400>,<she>,<DPX200>,
      <created by zg, POWCHK disabled, PULCHK disabled
       configuration hash MD5:
       00 E9 B6 7A A2 85 ED C7 34 08 36 98 17 FE 4E 26
       data hash MD5: 16K
       72 76 34 B3 80 9A A8 8E 61 C8 AE FE 42 CC 9A 42>)
$$ ##END=
$$ 
$$ hash MD5
$$ 3B B3 C7 E4 A9 7C C5 33 1B 64 3E 79 8C 18 E6 39
##$RELAX= 
##$RELAX= 
##$RELAX= 
##$RELAX= 
##$RELAX= 
##$RELAX= 
$$ Bruker specific parameters
$$ --------------------------
##$DU= <F:/spectra>
##$EXPNO= 1
##$NAME= <H-F>
##$PROCNO= 1
##$TYPE= <nmr>
##$USER= <she>
##$AMP= (0..31)
100 100 100 100 100 100 100 100 100 100 100 100 100 100 100 100 100 100 
100 100 100 100 100 100 100 100 100 100 100 100 100 100 
##$AQSEQ= 0
##$AQ_mod= 1
##$AUNM= <au_zg>
##$AUTOPOS= <>
##$BF1= 200.13
##$BF2= 200.13
##$BF3= 200.13
##$BF4= 200.13
##$BF5= 200.13
##$BF6= 200.13
##$BF7= 200.13
##$BF8= 200.13
##$BYTORDA= 1
##$CFDGTYP= 0
##$CFRGTYP= 5
##$CHEMSTR= <none>
##$CNST= (0..31)
1 1 145 1 1 1 1 1 1 1 1 1 1 1 1 1 1 1 1 1 1 1 1 1 1 1 1 1 1 1 1 1 
##$CPDPRG= <>
##$CPDPRG1= <>
##$CPDPRG2= <>
##$CPDPRG3= <>
##$CPDPRG4= <mlev>
##$CPDPRG5= <mlev>
##$CPDPRG6= <mlev>
##$CPDPRG7= <mlev>
##$CPDPRG8= <mlev>
##$CPDPRGB= <>
##$CPDPRGT= <>
##$D= (0..31)
0 1.2 0 0 0 0 0 0 0 0.06 0 0.03 0 0 0 0 0.0002 0 0 0 0 0 0 0 0 0 0 0 0 
0 0 0 
##$DATE= 1627968297
##$DBL= (0..7)
120 120 120 120 120 120 120 120 
##$DBP= (0..7)
150 150 150 150 150 150 150 150 
##$DBP07= 0
##$DBPNAM0= <>
##$DBPNAM1= <>
##$DBPNAM2= <>
##$DBPNAM3= <>
##$DBPNAM4= <>
##$DBPNAM5= <>
##$DBPNAM6= <>
##$DBPNAM7= <>
##$DBPOAL= (0..7)
0.5 0.5 0.5 0.5 0.5 0.5 0.5 0.5 
##$DBPOFFS= (0..7)
0 0 0 0 0 0 0 0 
##$DE= 6
##$DECBNUC= <off>
##$DECIM= 32
##$DECNUC= <off>
##$DECSTAT= 4
##$DIGMOD= 1
##$DIGTYP= 9
##$DL= (0..7)
0 120 120 120 120 120 120 120 
##$DP= (0..7)
150 150 150 150 150 150 150 150 
##$DP07= 0
##$DPNAME0= <>
##$DPNAME1= <>
##$DPNAME2= <>
##$DPNAME3= <>
##$DPNAME4= <>
##$DPNAME5= <>
##$DPNAME6= <>
##$DPNAME7= <>
##$DPOAL= (0..7)
0.5 0.5 0.5 0.5 0.5 0.5 0.5 0.5 
##$DPOFFS= (0..7)
0 0 0 0 0 0 0 0 
##$DQDMODE= 0
##$DR= 18
##$DS= 0
##$DSLIST= <SSSSSSSSSSSSSSS>
$$ [...]
##$SUBNAM2= <"">
##$SUBNAM3= <"">
##$SUBNAM4= <"">
##$SUBNAM5= <"">
##$SUBNAM6= <"">
##$SUBNAM7= <"">
##$SUBNAM8= <"">
##$SUBNAM9= <"">
##$SW= 20.0188882624521
##$SWIBOX= (0..15)
0 0 2 0 0 0 0 0 0 0 0 0 0 0 0 0 
##$SW_h= 4006.41025641026
##$TD= 16384
##$TD0= 1
##$TE= 0
##$TE2= 300
##$TE3= 300
##$TEG= 300
##$TL= (0..7)
0 120 120 120 120 120 120 120 
##$TP= (0..7)
150 150 150 150 150 150 150 150 
##$TP07= 0
##$TPNAME0= <>
##$TPNAME1= <>
##$TPNAME2= <>
##$TPNAME3= <>
##$TPNAME4= <>
##$TPNAME5= <>
##$TPNAME6= <>
##$TPNAME7= <>
##$TPOAL= (0..7)
0.5 0.5 0.5 0.5 0.5 0.5 0.5 0.5 
##$TPOFFS= (0..7)
0 0 0 0 0 0 0 0 
##$TUNHIN= 0
##$TUNHOUT= 0
##$TUNXOUT= 0
##$USERA1= <user>
##$USERA2= <user>
##$USERA3= <user>
##$USERA4= <user>
##$USERA5= <user>
##$V9= 5
##$VALIST= <valist>
##$VCLIST= <CCCCCCCCCCCCCCC>
##$VD= 0
##$VDLIST= <DDDDDDDDDDDDDDD>
##$VPLIST= <PPPPPPPPPPPPPPP>
##$VTLIST= <TTTTTTTTTTTTTTT>
##$WBST= 1024
##$WBSW= 4
##$XGAIN= (0..3)
0 0 0 0 
##$XL= 0
##$YL= 0
##$YMAX_a= 812604
##$YMIN_a= -671211
##$ZGOPTNS= <>
##$ZL1= 120
##$ZL2= 120
##$ZL3= 120
##$ZL4= 120
##$ABSF1= 10
##$ABSF2= 0
##$ABSG= 5
##$ABSL= 3
##$ALPHA= 0
##$AQORDER= 0
##$ASSFAC= 0
##$ASSFACI= 0
##$ASSFACX= 0
##$ASSWID= 0
##$AUNMP= <proc_1d>
##$AZFE= 0.1
##$AZFW= 0.1
##$BCFW= 1
##$BC_mod= 2
##$BYTORDP= 1
##$COROFFS= 0
##$CY= 11.3945322036743
##$DATMOD= 1
##$DC= 2
##$DFILT= <>
##$DTYPP= 0
##$F1P= 2.36226072786647
##$F2P= -0.459571619588291
##$FCOR= 0.5
##$FTSIZE= 0
##$FT_mod= 4
##$GAMMA= 1
##$GB= 0.15
##$INTBC= 1
##$INTSCL= 1
##$ISEN= 128
##$LB= 0.24
##$LEV0= 0
##$LPBIN= 0
##$MAXI= 10000
##$MC2= 0
##$MEAN= 0
##$ME_mod= 0
##$MI= 1.114404
##$NCOEF= 0
##$NC_proc= 0
##$NLEV= 6
##$NOISF1= 3.799351
##$NOISF2= 2.8
##$NSP= 1
##$NTH_PI= 0
##$NZP= 0
##$OFFSET= 15.70392
##$PC= 1
##$PHC0= -13354.96
##$PHC1= 12.00099
##$PH_mod= 1
##$PKNL= yes
##$PPARMOD= 0
##$PSCAL= 0
##$PSIGN= 0
##$REVERSE= no
##$SF= 200.130013532006
##$SI= 16384
##$SIGF1= 3
##$SIGF2= 2
##$SINO= 400
##$SIOLD= 16384
##$SREGLST= <1H.CDCl3>
##$SSB= 0
##$STSI= 0
##$STSR= 0
##$SW_p= 3612.71676300578
##$SYMM= 0
##$S_DEV= 0
##$TDeff= 0
##$TDoff= 0
##$TI= <>
##$TILT= no
##$TM1= 0
##$TM2= 0
##$TOPLEV= 0
##$USERP1= <user>
##$USERP2= <user>
##$USERP3= <user>
##$USERP4= <user>
##$USERP5= <user>
##$WDW= 1
##$XDIM= 8192
##$YMAX_p= 0
##$YMIN_p= 0
$$ End of Bruker specific parameters
$$ ---------------------------------
##NTUPLES= NMR FID
##VAR_NAME=  TIME,          FID/REAL,        FID/IMAG
##SYMBOL=    X,             R,               I
##VAR_TYPE=  INDEPENDENT,   DEPENDENT,       DEPENDENT
##VAR_FORM=  AFFN,          ASDF,            ASDF
##VAR_DIM=   8192,          8192,            8192
##UNITS=     SECONDS,       ARBITRARY UNITS, ARBITRARY UNITS
##FACTOR=    0.0002496,     1,               1
##FIRST=     0,             0,               0
##LAST=      2.0444736,     0,               0
##MIN=       0,             -671211,         0
##MAX=       2.0444736,     812604,          0
$$ Real data points
##PAGE= N=1
##DATA TABLE= (X++(R..R)), XYDATA
$$ [...]
3136a88l543Q850l812n823R146p89r818P907N482j1666J032J0970p164o350J0094
3151D328o85q293O522K609q706M587N682r815L78J0420o774o815J0711N62j0530
3166e819N713N569q819J257O936p169j463R357n426o824J0444Q87j1474N613P427
3181F209r603q86Q846n025m370Q169k516p010Q495J569j0730N221Q053j0053k057
3196e688J0869m351p260Q244Q58q063N557L335q531L100P437q895k514J1157l940
3211A315q843Q906K973r586L417N982p471M53O792o411k630R556l510q149Q769
3226A563L248j0611K939Q092p600k001Q115m174m356P942j892p347P645L100j0219
3241e556K886R095q035m097R811k443o736O684J227p352M965L797q299J828Q226
$$ y = [-188, -3731, 5119, 1307, -4516, 4630, 3841, -5977, 1930, 7412, -4254, -3222, 7748, 584, -5766, 4328, 3643, -4650, 1872, 4481, -4225, 362, 6044, -3771, -3393, 7027, 253, -6562, 4149, 4711, -5819, -106, 5463, -3356, -2099, 4837, -2332, -3795, 5562, 136, -6688, 3756, 4643, -6831, -1218, 6209, -3394, -4280, 4566, -459, -4829, 3340, 824, -6186, 2309, 3878, -6852, -1631, 6422, -3631, -5688, 5181, 830, -6430, 1814, 2672, -5391, 166, 3501, -5030, -1930, 5507, -3388, -5902, 5255, 1315, -7528, 1378, 4351, -5235, -1818, 4164, -3307, -2854, 3938, -2473, -5103, 4453, 943, -7206, 1563, 4811, -5800, -2861, 5231, -2369, -4370, 3745, -429, -4785, 3157, 1265, -6082, 1563, 4663, -5556, -2670, 6425, -1610, -5707, 4104, 1661, -5075, 1609, 2836, -4516, 449, 4246, -4053, -2225, 6001]
3256F001p377m339J0034j415q598O459L801q095K374N185o416j17P212n619m005
3271d915R074j265q915O850M786r282J119P614n838k439P187l604m161P460p63
3286B908p829O372M487r369J099Q614n799m360Q012j412n911N454J336p042M429
3301I89M550q148K73Q911n620n647Q784M8p868M484L845o706J597N041o091n00
3317b058P122m372n211Q333L64q599M509N395p184m76O540m241k460N983k741
3332I04m691P074L43q206M565N709p992q58P879l838m597O153l52n557M847J570
3348B953o884L455N515p860j059Q480l686o250O897J472p022L117L817n816J320
3363a551M997n568j600P434l060o470P129K164p903K617N603n416j254N262k949
$$ y = [6001, -1376, -5715, 4319, 2904, -5694, 765, 4566, -3529, -1155, 4030, -2386, -2503, 4709, -910, -4915, 4159, 2894, -6021, 829, 5615, -3667, -2548, 5066, -772, -3211, 3976, 372, -3789, 3671, 2908, -4921, 1451, 5938, -3431, -2332, 6282, 483, -3877, 4135, 2723, -3188, 2266, 3602, -3440, 989, 5539, -2609, -2336, 6575, 955, -4692, 4092, 4140, -3728, 756, 4601, -2105, -508, 4533, -1558, -2058, 5064, 692, -4519, 3814, 4178, -4421, 88, 5483, -1701, -2177, 4363, 122, -2338, 3645, 904, -3787, 3287, 3630, -4576, -11, 5698, -2294, -3152, 4727, 889, -3708, 2445, 2093, -3464, 1383, 2953, -3931, -476, 5039, -2821, -3880, 4600, 914, -5336, 1561, 3033, -3989, -872, 2945, -2871, -1551, 3446, -2122, -3722, 3712, 652, -5818, 1311, 3475, -4428, -1811, 3792, -1624, -2878, 2384, -565]
3378e65k801N743j926n157N839J965p423K408O332n995k593O688j923m248M795
3393A139O6m688L706K476o593K128N657n626k879P415j546n674M585K504n540
3408b870J797L783m794L79N105m704k459O884j375o293M922L333o191M88M872
3423B877l272j632M297k088k753N035p45n354M376L141o223J47N848l259l230
3438b835M638n32l468L332N95m130K907K497n356P62N470l645l495N411M02m968
3454b415K341K616l875J123K830l778n1M655l153l107N557Q5n407K631L579m234
3470f03m85L869k411j386L545j686k595M243m5m958K972L380m458j089M561j429
3486A425k823L010k7k581K453M16l467K359K460m291l88M790k123l450L450Q77
$$ y = [-565, -3366, 2377, 451, -4706, 1133, 3098, -4325, -1917, 4415, -1580, -4173, 2515, 592, -3656, 1139, 1205, -3483, 223, 2699, -3894, -1766, 3891, -1735, -4614, 2801, 1255, -4419, 166, 2670, -2870, -1073, 2710, -2084, -1705, 3400, -1304, -3763, 3121, 1746, -4547, 375, 3708, -2483, -1995, 2877, -395, -2027, 2270, 182, -2571, 2464, 1719, -3635, 741, 3882, -2341, -2194, 3654, 395, -2835, 1803, 1271, -2197, 1135, 1730, -2400, 507, 3004, -2352, -1590, 3880, 235, -3260, 2151, 2553, -2415, -74, 2542, -1333, -210, 2620, -1158, -1209, 3446, 293, -2814, 2743, 2828, -2579, 52, 3631, -603, -1088, 2781, 370, -1016, 2529, 843, -1752, 2491, 2446, -2512, 460, 3840, -618, -1707, 2854, 1425, -1398, 1612, 1585, -996, 1457, 1873, -1594, 765, 3225, -1066, -1454, 3336, 1213, -2237, 1213, 2090]
3502B090l496J547J717k790J070J936l225j35M039k727k784M158Q28m211J160
3517h23K866k740m36K333j827o05K731j940j993L628M66m368J728L227l105j383
3533b241L237r30j869K056n87j489K302J56l229J932K585l705q80L892j059k823
3549b652K377O25k208J406N44k332J583J820l413m6L974j979k807L269Q01l197
3565b235J106J759k031O85J572k477J71L272k444k189L796N44l963J254K971k769
3581i78m33K275j258q53K316j328j751L005K8l515J762L051l374r48L504j040
3597D63k049K167k63j378J830J1k886K274K256l634l57M035j696k934K986R33
3613A758k839J573Q68k284J251J953l242Q4L903k239l156M031R29m077J258K499
$$ y = [2090, -1406, 141, 1858, -932, 138, 2074, -1151, -1286, 2753, 26, -2758, 1400, 2228, -1983, -823, 2043, -697, -1133, 1200, -627, -1232, 1499, -441, -2434, 1194, 1660, -2708, -980, 2247, -858, -2241, 996, 66, -1803, 253, -334, -1823, 479, 635, -2594, -662, 1923, -1782, -2662, 1230, 171, -2652, -275, 350, -1858, -452, 92, -2240, -657, 1163, -2250, -2296, 1678, -301, -3108, 161, 962, -2235, -1129, 630, -1401, -716, 856, -1621, -1450, 1822, -622, -2811, 985, 1529, -2434, -1180, 1791, -978, -1411, 864, -394, -1247, 1069, -259, -2010, 995, 1023, -2492, -730, 2321, -1053, -2001, 1503, 463, -1586, 581, 318, -1060, 770, 781, -2105, 169, 2425, -1209, -1566, 2469, 773, -2161, 825, 1758, -1081, 492, 1360, -924, 327, 2280, -962, -878, 3025, 786, -2370, 1661, 2590, -1487, -229, 2270]
3629B270k691J4K224k148l79L088k038k473L828O42m376J588L531l377j064L188
3645A827r95j817K543p70j949K728M82l874K221L028l696j081L974r47l069K892
3661A497M24k603J883O29k777J623K308l713q76M647j482l988L498J636l990Q53
3677d31K239k369P0K660k898n93L661j669l597L754J772m763J049L737k997j223
3693a598K974r33j835K669q04k530L179R89m350J082M005l336j886M020p76k570
3709a700J997N20k299J856Q88l403J156L346l474k009M771p11l954K789J397k953
3725a783P87J907k636O10K580k894j226M297j127m131L399K309m029J1L324j737
3741c39j371K707j313j622L215o38l310K914K201m393L08L946k184k273K962K1
$$ y = [2270, -421, -407, 1817, -331, -710, 2378, 340, -2133, 1695, 2337, -2039, -451, 3080, -297, -1361, 1827, 832, -985, 1558, 788, -1161, 1567, 2049, -1825, 396, 3424, -272, -1353, 2621, 1674, -1395, 1497, 1921, -682, 1201, 1830, -947, 676, 2984, -729, -1605, 3042, 1560, -2428, 1070, 2706, -1284, -431, 1808, -561, -491, 2169, -729, -1322, 2339, 670, -2927, 827, 2599, -2164, -1115, 2622, -375, -1598, 1376, 443, -1392, 1277, 473, -2057, 1122, 2111, -2239, -1157, 2848, -488, -2374, 1646, 870, -1700, 297, 817, -1482, 374, 1262, -2141, -985, 2361, -1113, -3122, 1649, 938, -3016, -227, 1170, -1783, -996, 911, -1725, -1115, 1465, -1429, -2655, 1642, 515, -3616, -217, 2092, -1937, -1926, 1398, -339, -1710, 997, -316, -1938, 1277, 639, -2671, 243, 2444, -1949, -1641, 2305, 121, -2152, 810, 831]
3757H31k383J942Q4j993J730J532l645N33L979l011k050L688j2l127J706J482
3773A286k302P89J658k820P45K967k790j782M349m10m019K526K374k941l29K636
3789A937j777o83K338j734j281L375o47l587K718K464m081j88L572j574k034K461
3805A279l56j570K052k23k604K412J544l926M27L813k105k414L110K00k402J306
3821E43P42j985J692R05l048R66L182k886j948M017r6l422J801J770k557L29J681
3838A686k089J8K874k610j647L966m36l909K297K624l420o27K825j406j265K249
3854A130j087j646K998n22l147K482K063l839r4L575j750k065K482rk038J969
3870E02Q8k497K179J329l631N00L712k425k397L384L06k819J411J285k635J279
$$ y = [831, -1552, 390, 474, -1519, 211, 1743, -1902, -1369, 2610, -401, -2451, 1237, 1225, -1902, -196, 1286, -1016, -227, 1431, -1389, -644, 2323, -467, -2249, 2100, 1690, -2329, 197, 2571, -370, -699, 1937, 160, -523, 1815, 81, -1200, 2175, 1528, -2059, 659, 3123, -958, -1146, 2426, 852, -1182, 1279, 923, -647, 1405, 1182, -1422, 990, 2534, -1392, -965, 2848, 743, -1671, 1439, 1639, -763, 543, 1285, -700, 992, 1897, -1151, -185, 2997, 111, -1837, 2180, 2084, -1338, 463, 2233, -324, 5, 1686, -403, -385, 2489, -121, -1768, 2198, 1762, -2147, 150, 2774, -646, -1273, 1552, 146, -1119, 1130, 43, -1603, 1395, 873, -2274, 208, 2271, -1568, -1662, 1913, 163, -1902, 580, 571, -1467, 502, 590, -1907, 272, 1601, -2030, -1530, 2182, -243, -2640, 744, 1050, -1769, -358, 927, -1708, -429]
3886d29J375k673M27L067k614k108L863J97l743J614K490k824k82K391j770n65
3902a584K354j509j709L355k74l568K303K536l196j061L460j129j965K120o3j956
3918a886K315K6k601J885K008l358m53L804j460k646K541P40k346J264Q74k115
3934a408J204J563k718j51L454j765k607L195J057l403O83K392j996j53J811j481
3950c23o74K604j446k094L080P78l654J181K734k289j298K634m41j468J500j47
3966F77j554J922L91k569R46K500k361j559L180p2k537J648R05j811P58Q11j639
3983c64P51J569k198q91L133o89k671J822J567k093o3J483j070j30J154j182m35
4000c07J975o33k287J888J539k601j68K291r21j508J476J15j008Q78k70j195J350
$$ y = [-429, 946, -1727, -1300, 1767, -847, -2955, 908, 1105, -2638, -1024, 1466, -1358, -1640, 751, -1019, -1584, 770, -739, -2448, 907, 633, -2935, -632, 1904, -1292, -2353, 1107, -22, -1987, 133, 70, -1886, 429, 455, -2146, -261, 1747, -1611, -2064, 1740, 280, -2366, 175, 915, -1431, -167, 707, -1408, -204, 1359, -1359, -1510, 1944, 179, -2428, 767, 1824, -1579, -896, 1496, -500, -653, 1158, -323, -997, 1607, 161, -1933, 1147, 1925, -1729, -548, 2186, -103, -1401, 1233, 792, -676, 824, 677, -877, 1045, 1436, -1133, -187, 2313, -48, -1607, 1573, 1501, -1036, 612, 1517, -294, 464, 1275, -364, 387, 1956, -242, -1133, 2000, 1311, -1360, 462, 2029, -64, -127, 1356, 286, 156, 1310, 128, -307, 1668, 1035, -1252, 636, 2175, -426, -594, 1697, 776, -732, 744, 859, -149, 729, 459, -736, 614]
4017F14R40k190J9K303j089j931J823P16j574L26N87n41J83K73p54J28J396j343
4035a14q96J589M22j974L62J244n89p23O01k55Q0N24j051j83J227m6j678P05J566
4054H11j393o17J069L85r74L8L41l13M94k45o55Q57O27j109m69J403K55j342M12
4073d25M54j6l86j73M10K7o2n94K14R92m61j054P89N94p53m88M17O53j82o84N2
4094f76Q11k69n05J8O26k8o36Q4N57K53n47j95Q30J37n90l95Q70L66p87k68O46
4115C02L82o27k80M81L42k00p24M60P03l56o71L58P81o12n06L48K76p2l07m9P4
4136A03O91p93n63J291J19j227J12J127k70q35N61L34l76O3P7l19Q05J20j239
4155b19N77J222j029q13J225K20p86k36O35j93m2J25n04L20O20j127k53J133k2
$$ y = [614, 1554, -636, -617, 1686, 597, -1334, 489, 1205, -369, -43, 544, 3, 186, 459, -295, -167, 1229, -114, -1010, 579, 1001, -973, -611, 633, 44, -679, -78, -333, -253, 271, -780, -963, 264, 218, -1460, -755, 811, -582, -1199, -130, 255, -719, -681, -340, -653, -159, -404, -1059, -202, 425, -684, -1153, 250, 505, -837, -425, 29, 13, -373, -546, -136, -109, -171, -765, -551, 441, -20, -1074, -285, 309, -444, -932, -515, 138, -44, -728, -676, 135, -134, -639, -621, 5, -23, -659, -575, -18, 235, -312, -507, 323, 460, -130, -525, 345, 711, -76, -344, 302, 684, 57, -223, 258, 600, 400, -324, 136, 839, 483, -188, 170, 951, 339, -167, 181, 457, 385, 78, 29, 103, 794, 1, -562, 729, 848, -379, -267, 860, 590, -245, 316, 650, 274, 337, 414, 95, 900, 1020, -219, 358, 1580, 551, -262, 963, 1183, 397, 161, 796, 603, 561, 686, 182, 502, 1122, -5, -258, 875, 853]
4174H53j331N59R35p07n63O28O1k97M37p72m3J242p51j029J151Q33j624k79J493
4193G96q3j227P54J8m39Q05m12r13J162N49j592k59J815n87j555J257O34j295
4211e72Q4O19o10K18M38r02j47J422q74j200J629M98k055K73J588j052n29J014
4229a58m21l85J105p08r09J709J7j917Q14J824j794p68J643j85j111J048J7j147
4247a326J378J37j521P07J614j997p97K516l55k099J160J206j736M39P41j074
4263a007M99J198j544p47K215k40k269J811J363k248j25J958j093n93J354o30
4279i8p79J590k11j901J666J191k452K0K700j591j388K069j73j451J206J73j463
4296h92J386R01k481M67K718k087j695K916R5k578J370J222j927N44J477k031
$$ y = [853, -478, 81, 1016, 309, -254, 374, 435, 138, 575, -197, -240, 1002, 251, -778, 373, 1206, -418, -697, 796, 713, -514, 240, 258, -181, 624, 212, -701, 461, 1010, -582, -841, 974, 387, -1168, 89, 723, -572, -488, 131, -479, -261, 177, -725, -872, 550, -324, -1524, 105, 603, -1452, -1179, 409, -643, -1172, -158, -579, -964, 141, -567, -1476, 233, 250, -1667, -853, 971, -823, -1591, 52, -133, -1244, -196, -179, -1326, 52, 189, -1332, -625, 989, -1008, -1805, 711, 356, -1743, -583, 623, -1113, -674, 67, -1007, -508, 690, -854, -1601, 614, 374, -1895, -84, 1279, -969, -1094, 864, -229, -822, 532, -98, -877, 713, 502, -1399, 267, 1458, -994, -974, 1726, 135, -1253, 816, 643, -808, 398, 571, -892, 494, 1395, -1086, -619, 2099, 12, -1683, 1233, 1328, -1250, 120, 1342, -585, -41, 1436, -595]
4312e95P2K491j864j733L166J99l321J524K238k811K2K340j559p69K084j078j491
4329a085K509L65l331J836K353l472l30L355j564j870K497j35k205J847P91k935
4345a374J573K313l412l42L845j887k850L278N70l228J507J763k791N02K715k781
4361e99p93L749j825l205L808R97m522J711L256l403p07L340j938j679L425j109
4377E06k977L305J340m758J419L899l762j500M228j106l040L230L25l371K383
4392A21J878m477J216L898l533j950M822j207l996L427J459m008J589K791l686
4407a656M3L894l270k101N059q45m733L701K368m825M34M342l547j478M369j753
4423Bl188M463j34m670L500K859n366P7N623l472k982M909m25m191L546J439m978
$$ y = [-595, -523, 1968, 104, -1629, 1537, 1736, -1585, -61, 2177, -634, -612, 1728, 169, -600, 1484, 406, -1085, 1424, 1789, -1542, 294, 2647, -825, -1155, 2200, 636, -1234, 1263, 1128, -1077, 770, 1561, -1374, 199, 2512, -900, -1242, 2603, 716, -2134, 1144, 1714, -1514, -7, 1756, -1035, -533, 2182, -599, -1392, 2357, 532, -2673, 1135, 2132, -2390, -679, 2577, -826, -1533, 1807, -131, -1810, 1615, 506, -2471, 834, 2174, -2584, -1165, 2734, -1028, -2528, 1700, 594, -2446, 784, 1109, -2262, 121, 1999, -2478, -1262, 2636, -897, -2847, 1975, 768, -3228, 199, 1658, -2350, -761, 2030, -1656, -1613, 2281, -989, -3090, 1969, 1124, -3609, 92, 2460, -2365, -1931, 2411, -1136, -2614, 1755, 2, -3186, 1277, 1143, -3527, -27, 2832, -2534, -2457, 3166, -306, -3288, 1621, 1196, -2995, 551, 1990, -2988]
4440b988K478L479n164j13N517k991l671N021P30n354K886L016m690M78M246l935
4456a055j233N214k466m010N409P75n920L010L847n130m57N271l165k660N044
4471B474j185m292M543J461o039K556M940n564j427O150k287m357N003N96n151
4486b579L350K527n373J414M695m764j975O295j703n433N048K011o042K118L881
4501C470m943jM943l594k486N926j550n492N079K571o732J516N394m612k012N520
4517B997k281l534N126l48n155M027L073o610R12O041m538l006O148r43n151M485
4533A243J407n375K490L829o006L54N819l871l720O160q3o162L986L185n854J088
4549a510M689m617j140N411k950l868N999J34o112L361M223n965j90N783l789
$$ y = [-2988, -510, 2969, -2195, -2308, 3209, 218, -3453, 1568, 2298, -3056, -170, 2846, -1844, -1366, 2880, -1055, -2288, 2926, 460, -3550, 1859, 2634, -3286, -276, 3571, -1559, -2016, 3255, 90, -2570, 2474, 1289, -3003, 1540, 3001, -3038, -482, 4458, -1106, -2533, 3617, 1330, -3027, 1976, 2572, -2579, 771, 3298, -2075, -661, 4034, -730, -2705, 3590, 1887, -3546, 1502, 3513, -2529, -411, 3470, -1473, -1474, 3469, -125, -2611, 3315, 1765, -3727, 1352, 3923, -2809, -1293, 4101, -511, -2523, 2997, 716, -2818, 2308, 1960, -3195, 832, 3905, -2705, -1793, 4248, -290, -3296, 2852, 1909, -3242, 1243, 2650, -2725, -235, 3594, -2412, -2058, 3761, -110, -3830, 2330, 2247, -3915, 71, 3256, -2598, -1510, 3179, -1438, -2578, 2833, -117, -3985, 2014, 2148, -3964, -603, 3620, -2345, -2535, 3248, -541]
4564e41k734N433j485m261M869Q00o038L260M436o266n88O371l278m009N605l7
4580A537n163L757K160n368J865M524n428j377O604k936m947O102J290o371K526
4595a225M159n153L8M878l981j922N951k051n095N558J948o801K185M876m890
4610a525j349N512k541l407N076n01m655M279K092n961J453N575n060k603O437
4625B822j487m616M591J097n271K831L003n242R38N167m647k606O638j239n586
4640c607M500K522n772J526M123m317q26N162l099l190N889o39n954M417L375
4655D110o100M94N461l861k619N262j414m037M634O10n369L208L508n736J08N752
4671D011l547l539N508l56m980L667K100n129J968L743m733o17N666l198m075
$$ y = [-541, -3275, 2158, 673, -3588, 1281, 2081, -3957, -697, 3739, -2527, -3115, 3256, -22, -4031, 1574, 1537, -3626, 131, 2291, -3077, -1212, 3312, -2116, -3493, 3111, 175, -4772, 1330, 2620, -3751, -1225, 2934, -2219, -2181, 2697, -1284, -3206, 2745, 694, -4401, 1157, 3105, -3696, -1511, 3365, -1525, -2874, 2638, 97, -3310, 1766, 1265, -3390, 889, 2981, -2980, -1527, 4048, -1012, -3615, 2822, 1335, -3281, 1310, 2407, -2864, -33, 2970, -2272, -1334, 3833, -814, -3420, 3218, 1979, -3607, 893, 3415, -2357, -831, 3292, -1025, -1851, 3311, 212, -2978, 2911, 2272, -3682, 735, 4110, -1990, -1496, 3965, 104, -2515, 2747, 1333, -2704, 1930, 2540, -2829, 379, 3887, -1849, -1741, 4011, 464, -3075, 2433, 2077, -2903, 764, 2864, -2265, -297, 3446, -1287, -1904, 3762, 564, -3511]
4686c511N712M49n676K993L339m818J66M360l705j690N407k182m096N004J031
4701B783n906K621M267n148j138N386k415l390M859m12m541L964J604n585J886
4716a165M711m787j752N765j799m467M250J298m943K455K886m434N49M205l843
4731a071k013N629j532m929M685J916n477J451L971m016p41M599k824k658N051
4746B041q10m951M045K634n741Q05N017l680k390M948j109l862L903P09m625K770
4762b96L000n153K7N705l372l527N349J09m901K929K508m605J086L604l849o37
4778b023M641k511l512M925M21n140K602L389m490o1M212l089j787M410j313l511
4794b837M016J175n286K381L819m600j047N032k088l289M191J66l870K872J649
$$ y = [-3511, 2201, 2650, -3026, -33, 3306, -1512, -1346, 3014, -691, -2381, 3026, 844, -3252, 1752, 2783, -3123, -502, 3765, -1383, -2521, 2865, 450, -2940, 1919, 1507, -3034, 930, 2534, -3051, -1165, 3546, -1241, -2993, 2772, 973, -3494, 756, 2054, -2889, -434, 2452, -1982, -1433, 2772, -1071, -3084, 2545, 1013, -3916, 769, 2685, -2792, -1341, 2630, -1386, -2127, 2472, -352, -3010, 2041, 1231, -3720, 325, 2959, -2782, -1977, 3040, -640, -3030, 1918, 809, -3053, 850, 1559, -3066, -296, 2704, -2449, -2422, 3283, -89, -3616, 1733, 1842, -3059, -130, 2378, -2227, -1141, 2463, -1386, -2023, 2618, 107, -3405, 1520, 1941, -3199, -597, 2792, -1698, -1759, 2453, -636, -2423, 1987, 674, -2837, 1179, 2354, -2932, -551, 3268, -1332, -2379, 2653, 565, -2724, 1467, 1633, -2237, 635, 2284]
4809B284m302J351L807l987j530N123j339m211L990J462m420J489L022l725k77
4824a263L908k531k228M640j040m267L702K117m879O94M015l133j447L912j522
4839F78k343L366j07l621K586K342m469N72M137k946k306M027l72l480K731J189
4855A984l531J531K367l485j17L994k503k716M277M4m285K148K517l567L67K979
4871B004k495j024L407j828k452L651L74m228K055L096l851o20L713j793k066
4886b057K969j91k874K519R85l515J420L004l287r95L670j096k984K766Q16l069
4902a919J462J622k767O56K557k566q95L335j143k823K921R66l373Q95K496k225
4918h01o26K381j406j569K969n91k627K386J266l401O55K988k214j306K743o40
$$ y = [2284, -2018, -667, 3140, -847, -2377, 2746, 1407, -2804, 1186, 2648, -1772, -283, 2739, -986, -1263, 2645, 114, -2114, 2526, 1486, -2781, 921, 3038, -1841, -1147, 2868, -265, -1712, 2200, 678, -1665, 1701, 1594, -2027, 559, 2901, -1568, -996, 3141, 195, -2111, 1916, 1544, -1936, 795, 1984, -1547, -16, 2351, -1134, -1251, 2743, 240, -2476, 1801, 1845, -2440, -292, 2225, -1342, -975, 2004, -491, -1515, 1892, 64, -2388, 1263, 1637, -2591, -536, 2560, -1291, -1911, 1802, 9, -2057, 912, 721, -2153, 366, 1351, -2164, -744, 2260, -1027, -2022, 1648, 552, -2432, 334, 1150, -1919, -457, 1165, -1602, -946, 1611, -955, -1850, 1485, 342, -2481, 440, 1406, -1967, -1072, 1424, -801, -1427, 954, -452, -2021, 948, 357, -2270, 116, 1382, -2019, -1364, 1624, -590, -1896, 847, 207]
4934B07j905J898M95k377J529J400k572K27K655k001j624K810K98k648J357J345
4950A094k289N22J710j730m82K228j446j357K620J1k659J575J604k224l24K018
4966H71j124n70J454n55j274J935K7k170J383J708k247n24K506r66j480J595L19
4983H88j466Q83P17j770R27J347j950q2K164j064j802J852Q64j935K59J263j264
5000a69R8R91r38m18J690q07j503J543Q59j929M19J393r56q24J245k08o15R22
5018G93l38r15J152K82j586M88J538j132r14J485j5j089M86M84p27K38L06r54
5036d18L92R56j157o80J576K75j720O01J134j072m01P95m35p7M45m36m89J046
5054C35K0j383N90J402j238p40J202M4r79N13K73l87K95J36p74L63Q56j172j85
$$ y = [207, -1698, 200, 695, -1682, -153, 1247, -1325, -1098, 1557, -444, -2068, 742, 1040, -1608, -251, 1094, -1195, -673, 1037, -693, -1175, 1053, -393, -1750, 870, 881, -1778, -203, 1401, -823, -1147, 871, -253, -823, 631, 76, -1198, 737, 764, -1406, -23, 1685, -562, -1086, 1420, 454, -1026, 569, 888, -578, 305, 1022, -748, 179, 1526, -424, -506, 1658, 594, -1208, 644, 1508, -427, -168, 1095, -169, -71, 920, -18, -436, 1254, 447, -1056, 487, 1346, -583, -164, 1229, 273, -551, 694, 486, -129, 793, 455, -460, 692, 974, -612, -124, 1414, 282, -632, 853, 838, -251, 235, 719, -8, 230, 536, -418, -26, 930, -227, -907, 669, 944, -776, -175, 959, -113, -514, 281, -154, -231, 214, -222, -711, 335, 355, -1028, -438, 964, -274, -1014, 188, 232, -747, -234, 39, -348, -53, 83, -691, -328, 528, -644, -829]
5073h29J393l79j211M86R69n90m37N12j64n8K46l91l06Q23j93r20P21O56r79l51
5093a002J140L6r44K66O95o07p2J94m84M10Q52j023m60J329M1j567P44J020p35
5112a67n56Q65J27m40K92l64k31Q79j03j207P02R70r88p40J482J9j075K76P34
5131D75n61mK89n05K87Q93j055n10J526nj646O30J182j208o7J014o74k03O98n17
5151C9n11J387m02j402J201J336k167j47J974o29j277J091K67j064O98K77j182
5168e11Q85Q36j679k49K341q26j850J719N87j682L87J170j104P6R40j112l68J819
5186A379o59j895J947Q05k415L62J894j191r21J499m81n97R90j96j471J471Q21
5203A342k209L24K277j814j280K408j81j860R83Q03j455P38Q28j927K85K106j584
$$ y = [-829, 564, 185, -1026, -540, 429, -161, -598, -86, -250, -308, -62, -453, -759, 64, -129, -1049, -328, 328, -651, -1002, 138, 174, -770, -504, 191, -416, -488, -294, -778, -368, 484, -539, -999, 330, 371, -1196, -452, 568, -167, -723, 142, 269, -171, 121, -243, -474, 405, 302, -905, -203, 767, -221, -961, 521, 540, -535, -259, 475, -86, -90, 199, -306, -19, 874, -181, -691, 835, 830, -816, -186, 996, -212, -279, 735, 61, -142, 556, 39, -472, 915, 513, -889, 312, 1648, -519, -666, 1308, 679, -598, 493, 760, -304, 394, 671, -511, 374, 1210, -469, -718, 1623, 797, -1053, 666, 1253, -429, -42, 1128, 24, 100, 1040, -72, -440, 1379, 720, -1175, 772, 1577, -838, -476, 1418, 227, -694, 805, 324, -273, 717, 521, -950, 521, 1342, -867, -543, 1734, -80, -1360, 1048, 867, -993, -10, 793, -662, 76, 904, -1023, -738, 1368, -216]
5220b16j371K733j99k612J460J639k199j36K048j461o28K003j301j504K698o7
5236H87k965J666J827k467n56K424p76j517J710J02j801J608M51k458J253K111
5252A499k694o24L070j057k267K163P47k466R43J434j996O06J866k238n04L038
5268A520j514k233K503R49k888P68K056j924n01K114j209j148K479p66k445K597
5284C58J070l186M81L080k266j325K720l93k170J979L94k324J649J442l043N03
5300a031K955k434j372L146k4l083J778J619k380O95J692k326j2K620j993j353
5316a503L023n0l301J850K036k862J9K489j708q95K361j174j893K830l1l095K199
5333B95J933l334l06L462j547k157K793K4k390J971O60k777J208K346k958l28
$$ y = [-216, -1587, 1146, 947, -1665, -205, 1434, -765, -901, 1147, -314, -942, 1061, -240, -1744, 954, 887, -2078, -412, 1415, -1052, -1608, 816, 40, -1477, 233, 335, -1466, 142, 593, -1865, -612, 1499, -1195, -1819, 1251, 194, -2073, 90, 837, -1629, -686, 748, -1248, -642, 1224, -1014, -1518, 1520, 6, -2227, 276, 1225, -1663, -895, 1161, -763, -1264, 850, -359, -1507, 972, 206, -2239, 358, 1428, -1758, -1277, 1803, -463, -1788, 932, 539, -1631, 348, 742, -1582, 67, 1509, -1534, -1031, 1924, -510, -1882, 1264, 1240, -1843, -65, 1554, -826, -131, 1561, -765, -777, 1843, -150, -1503, 1520, 1470, -1831, 19, 2055, -807, -788, 1701, -7, -902, 1459, 285, -1608, 1222, 1191, -1904, 295, 2228, -1106, -1412, 2050, 503, -1654, 1139, 1163, -1227, 744, 1404, -1373, -165, 2181, -777, -1105]
5349a105L454j546k619K924Q90l160J061J862k393L96J910k032p09K661j081k477
5365a964K992J031l725J076K717k626p16K589j443j278K431n69k394K580Q27l412
5381a884J225L028k934j234L209p39k406K288L94k492J680J267k839Q12K690k624
5397e59j368L559p20l143K479J264k673N13K029k458J23K401k043j404L197n65
5413F32l046K549J619l365L43K986k287j014K573j174j586K621l45k857K222J893
5429A764l566L94L242j982j726K829l34k207J848O66k297J253J920l119J05L296
5445B086k121k278L593k8l015J508J707k503K05K271k104n79K982j776k087L154
5461A015L49l539J708K590l276k91K978j597j321K423m42k499K767O31l392J638
$$ y = [-1105, 2349, 803, -1816, 1108, 1998, -1162, -101, 1761, -632, -236, 1674, -358, -1067, 1594, 513, -1964, 1028, 2059, -1666, -590, 2127, -499, -1215, 1374, -69, -1347, 1084, 515, -1879, 701, 1528, -1884, -659, 2369, -565, -1799, 1410, 671, -1735, 553, 947, -1545, 135, 1402, -1437, -625, 2065, -559, -1927, 1632, 912, -2231, 248, 1512, -1161, -648, 1381, -1077, -954, 1447, -596, -2000, 1197, 632, -2414, 135, 1754, -1611, -1268, 1718, -569, -1583, 990, -184, -1770, 851, 506, -2351, -129, 1764, -1802, -1408, 1834, -148, -1874, 955, 621, -1586, 262, 928, -1369, -116, 1804, -1315, -1210, 2086, -35, -2313, 1280, 1252, -1763, -255, 1452, -1051, -846, 1425, -679, -1258, 1724, -52, -2139, 1015, 1364, -2175, -467, 2123, -1153, -1444, 1534, -63, -1384, 1039, 597, -1902, 865, 1496, -1896, -258]
5477b58K664l046o82L332j371k236K648K67k442J810J015k829J196K404l256m53
5493a237L697j473k889K831J118l369J306K114k727P1K411k142j169L521j174
5508H89l049L190J303l908J112K855k734p64K984j342j707K700l19k976K577J316
5524B127l562Q80L369k837j666L544n11k724K223Q53k925J475J842l205M64L057
5540B404k558j879L628k93l507K550J537l141O26K410k502m80L052k020j869L497
5556A455j08l761K511K040l611J08L377k247j329K742o57k518L017K29l475K065
5572a62K408l695j62L886k046k498L294J9k999K168R39k759J150K275l235k45
5588a662L577j922k767L649N06l499J612K239l046J58K446k082j005L261j338
$$ y = [-258, 2406, -640, -1322, 2010, 639, -1597, 1051, 1318, -1124, 686, 1701, -1128, 68, 2472, -784, -1237, 2460, 987, -1902, 929, 2047, -1322, -16, 2098, -629, -558, 1853, -289, -1458, 2063, 889, -2160, 1030, 2333, -1575, -463, 2392, -342, -1106, 1878, 536, -1171, 1529, 1210, -1766, 811, 2127, -1435, -555, 2814, -23, -1689, 1855, 1344, -1380, 843, 1696, -1229, 246, 2088, -1117, -653, 2404, -154, -2033, 1595, 1302, -2205, 345, 1882, -1259, -633, 1777, -725, -1205, 1847, -173, -2042, 1455, 1347, -2414, 97, 2137, -1474, -1366, 2011, -236, -1565, 1177, 520, -1998, 1019, 1248, -2227, -162, 2246, -1449, -1611, 2275, 229, -2269, 1025, 1044, -1955, 213, 1152, -1607, -457, 1818, -1417, -1662, 1915, -7, -2774, 875, 1381, -2118, -506, 1733, -1313, -1155, 1291, -791, -1796, 1465, 127]
5603A27k601L402P60m046J785K642l066p37L461j598j941K912o44k424K539R59
5619A530l422J070L178l314j089L678j120k724K549Q54k774J554J725l128N89
5634h44K826k639j181L581r24l121K755J413l347R16K279k393k42K632j786j373
5650a448L130n83l272K808J508l521O22K912k298j145K959r56j964K373O3k827
5666a639K316J589l471M88L180k358j752L211l04k851K165J164k792J105J713
5681A764k441j34L076k156j871L344k1l218J868J860k938M96J993j812o56K544
5697A698j440j640K703J26l162J839K034l055lK652j683j024J879l49j780J979
5713G74L84k753J506K055k904j64K762j487j879K514L2k279J474J209k361Q23
$$ y = [127, -2474, 928, 1688, -2358, -573, 2069, -997, -1734, 1727, 129, -1812, 1100, 456, -1968, 571, 1530, -1892, -822, 2356, -958, -2047, 1631, 511, -2213, 336, 1190, -1584, -30, 1695, -1433, -844, 1982, -657, -1838, 1743, 819, -2302, 453, 1866, -1481, -565, 1714, -679, -921, 1711, -75, -1448, 1682, 1099, -2173, 635, 2143, -1378, -756, 2156, -142, -1287, 1672, 716, -1248, 1125, 1188, -1639, 677, 2266, -1205, -717, 2463, 105, -1647, 1564, 1260, -1591, 574, 1738, -1054, 51, 1764, -677, -811, 2265, 109, -1762, 1582, 1561, -1657, 211, 2071, -867, -371, 1622, -190, -846, 1698, 258, -1382, 1321, 1447, -1715, 124, 2158, -897, -900, 1752, 69, -955, 924, 575, -1205, 774, 1158, -1595, -89, 1966, -938, -1102, 1660, 173, -1706, 808, 840, -1439, 35, 1244, -1117, -294]
5729b94J654k215m32K855j327k324K763M68k729J143J736k258l4J788j333o08
5745a147K084q60j959K211O73k851J206K151k381n24K333j014j332K086m24j751
5761a499J792M06k367J062K068k318m29K394p46j887J856M16j812J071Q20j971
5777a144O14J688k007k97K365j112j941K001P69j944N55J282j350j39J525j285
5793d20o10K067n08k080J865P32k170N28J828j423n51J740q78q57J456l19j306
5810i06J543L56j815N93J850j718q61J953k81j207J018j14j092J162K96j697Q24
5827i6J532j884m73J949m34j608J314O62j408L89Q94j222L18J137j252l20J859
5844A357n06k076J775J040j830nJ506q35m22R39o12m98J284l08j389J179P43j891
$$ y = [-294, 1360, -855, -1287, 1568, 241, -2083, 680, 1148, -1581, -438, 1298, -960, -994, 794, -539, -1147, 937, 77, -1882, 329, 1002, -1849, -643, 1508, -873, -1397, 936, -78, -1410, 676, 252, -1499, 293, 699, -1668, -606, 1462, -856, -1285, 1109, 363, -1524, 332, 748, -1064, 7, 827, -1144, -530, 1158, -849, -1146, 1219, 107, -1834, 167, 936, -1008, -453, 829, -521, -660, 865, -420, -1030, 1037, 529, -1551, 314, 1046, -1124, -596, 1232, -191, -742, 998, 120, -737, 719, 400, -906, 637, 993, -822, -229, 1621, -97, -958, 995, 714, -493, 525, 411, -681, 481, 777, -920, -96, 1436, -448, -921, 1028, 594, -1014, 300, 962, -446, -57, 837, -385, -67, 1070, -182, -502, 1357, 851, -1225, 550, 1590, -240, -245, 1261, 426, 4, 943, 331, -167, 1117, 809, -580, 599, 1342, -549]
5862e49K91J683j099r84J270Kj004P34L72j088Q63L18j580O17J438j403p82J609
5880G08O2j369O49N20p50K87M24j028O33Q13r54o75J709l32j755J226R08j208
5898a32k70J079n01l85P53o49l13J012m82j072J041Q76j416j14J045k92j015P08
5916a27N7m18N51k45o39O82M17j208K73J286p86q94J000J89p10L18L99o02O69
5935B12k0p95M15J082j252l95J283n7j176N60P02p92j60N45l87J89M75q53o0Q34
5955C50Q8j277P35P86j007l13Q21j06l19L33k55j02O54m20o43R84L54j207K35
5974c09J026m47n70M74J41k02L42k33k54O62m6q54L08R39p59n02Q19J43q73K21
5994B6M35l04M46l37m99M18M57r30r9J023N3j135N30N55m45m23M35j15J46M4m26
$$ y = [-549, -258, 1425, 326, -658, 612, 614, -390, 344, 716, -372, 491, 809, -771, -154, 1284, -119, -901, 708, 770, -599, 50, 570, -180, 107, 531, -497, 136, 949, -5, -680, 1029, 697, -1058, 168, 1076, -132, -402, 677, 176, -209, 544, -105, -418, 594, 112, -960, 81, 957, -459, -573, 472, 180, -835, -127, -70, -488, 63, -182, -821, -139, 278, -930, -657, 629, -157, -1051, -51, 138, -572, -254, 145, -457, 212, 192, -603, -188, 894, -358, -753, 530, 473, -703, -143, 559, -233, -393, 152, -235, -46, 429, -424, -484, 350, 438, -839, -104, 682, -325, -638, 183, 77, -242, 91, -164, -266, 388, -32, -675, 309, 663, -544, -309, 717, 270, -300, 174, 315, 113, 455, 222, -32, 630, 584, -270, 38, 977, 218, -284, 535, 678, -195, 26, 461, 157, 603, 266, -233, 185, 642, -288, -387, 636, 689, -446, 84, 639, 194, -229, 206, 91, 237, 281, -145]
6015a45P8R04o51o38Q51M62r50j44P53q6k95P8j01J23N53o93k58J008r8r98L45
6036I8O94n49n58O77j04j90J52k59j6M30j42r30N97P51r19k85R63k33n84K80K13
6057H6k91K14O9n64P13L37r68J8R82m04r19R61J71n16j90M33k10K8L57q03M20
6078g6O04o45p33J176J74j177J88Q99o76l78O75l45j24N15n89j57R36j01j131
6097i65N39Q21r04l44Q88n1m64L20l1m54R31k06r45P51O06j066j91J228l12r34
6117g83N78L79o50K68n3j17K75N19j052L3J196n80j126J217N16j129N4P41l83
6136i7q5L53l97n0Q29p39o24J186K49j509O07J105r86l61Q30Q7p11P87k18m91
6156b35N81L30j337O88J090j157o57J249Q1r25L15M69o41N18K91j033M40Q60j083
$$ y = [-145, -67, 837, 186, -452, 399, 861, -89, -233, 520, 434, 139, 217, 116, 239, 792, 99, -159, 849, 751, -247, 98, 792, 243, -315, 362, 258, 68, 220, -39, -55, 375, 233, -697, -100, 651, -268, -553, 410, 177, -407, -127, 86, -205, 9, 78, -486, 227, 564, -404, -386, 596, 192, -727, 234, 405, -111, -301, 132, -78, -50, 307, -496, -76, 528, -117, -850, 326, 500, -677, -489, 410, -266, -644, 31, -314, -438, 77, -512, -669, 267, 166, -965, -426, 395, -509, -853, 35, -16, -480, -160, -191, -645, 286, 80, -865, -114, 492, -574, -765, 463, 151, -783, -205, 174, -476, -208, -261, -378, -103, 416, -636, -603, 593, 13, -1113, 104, 620, -509, -455, 286, -97, -182, 171, -226, -276, 553, -186, -810, 376, 625, -884, -277, 828, -158, -519, 311, 398, -313, 474, 256, -235, 346, 676, -661, 27, 1117, -40, -697, 552, 633, -292, 23, 492, -149, 369, 660, -373, 67, 927, -156]
6175a56l94J538m94j058O31P73q57m6P74o46k7M89p32j50J225m31j164J087P10
6194A072j322r0J025m64m36N03j50l49O68l27p73J113K60j331J46J519r93p75
6212g04R27K80r38N17K91p47M39N79j063R4J134q01p45J232O6j148J83Q94o21
6231a31j80O54m98K1O49o93m60J068q1j117M41R02q53l91Q57k69l76M79k23l81
6251e82R07k69q39Q11M94j086p6J323o38o98O39J32m41K45J3l64M42M17j043K63
6271c50R23n78j037R81N44j036K44N49m79q0K94m86J60P08p56m65J106J54j034
6290f38K27P63n99j62M86l03o7K94j77j91O59l8j006O92N71p48j52Q34j32o41
6310c28L94J88l07J19Nn71P42M50j166j2J294n63q62P46M01p36J76J53l93M38
$$ y = [-156, -550, 988, 494, -564, 67, 840, -17, -63, 711, 65, 38, 527, -205, -355, 870, 439, -725, 362, 1072, -250, -340, 685, 221, -215, 288, 138, -211, 457, 130, -643, 470, 730, -601, -455, 1064, 71, -704, 223, 503, -435, 82, 373, -374, 65, 644, -419, -325, 809, 8, -737, 495, 561, -587, -404, 490, -131, -311, 343, -155, -134, 515, -178, -638, 430, 349, -768, -327, 575, -278, -669, 188, -81, -457, 22, -201, -582, 325, 56, -783, 28, 522, -564, -640, 683, 45, -653, -14, 118, -323, -78, -65, -429, 13, 430, -613, -350, 573, -5, -1042, -61, 483, -553, -309, 240, -239, -319, -25, -511, -351, 357, -399, -864, 242, 396, -638, -411, 352, -247, -409, 77, -226, -293, 1, -176, -367, 292, 254, -752, -60, 511, -237, -389, 445, 313, -328, 66, 254, -53, 66, 71, -500, 242, 692, -474, -486, 808, 245, -617, 129, 530, -206, -30, 123, -270, 168]
6330A68J07o36K24P73n39o76R06J72q12L69M50l24p9K82r7k86N23n40k39Q05j18
6351D33o98M58M39n29n1L78j46j01L12l20q0M12j06q48P56M05j047P0O53m18k53
6372b81M71O9k98K57k98k26M22J64n70L5O73n12l39N27R0l32P2K69j32K7o7j93
6394a72K53L82o89k07P56p4o35K72L61l48j2K22k44JK11n43JP75l30n90M60J85
6416C5l97p1N28k22k69L56l86K25J08m05q1M19L17q66J57P31l71n1O6J41k38K67
6438gk36j66N86k19n47M66M56o63k52P04j53m33K89J88j35k13J41l67M38L70p58
6459e11n7P08r9o47N23J9j70k0J06k09N36j42l83M2N25m70k42O56J06o51J25N04
6481B49k78L2J67j71J28J04o30J93N31k33n01M43N47n90p4M14k46k55L22k04m2
$$ y = [168, 275, -361, -137, 636, 97, -579, 327, 499, -313, 56, 506, 182, 103, 385, 288, 2, 525, -15, -254, 551, 433, -265, 193, 632, 103, 52, 430, 284, 183, 495, 175, 95, 507, 401, -447, 309, 714, -333, -263, 390, -28, -281, 190, 259, -39, 218, -80, -306, 116, 280, -290, -255, 418, -94, -433, 94, 184, -148, -76, 193, 61, 88, 21, -172, 81, 463, -226, -433, 323, 249, -386, -114, 247, -101, -113, 109, -135, -134, 77, -466, -465, 310, -20, -610, -150, 35, -362, -433, 95, -127, -396, -40, -426, -201, -93, -498, -579, -160, 157, -709, -552, 179, -192, -243, -177, -36, -274, -7, -243, -409, 177, -42, -589, -123, 333, -330, -582, 122, -31, -464, -175, 13, -122, -335, -194, -561, -123, 247, -511, -568, 140, 41, -606, -83, -64, -234, -254, -148, -357, 179, 37, -346, -304, 221, -249, -491, 165, 271, -380, -255, 249, -29, 3, 170, -1, 127, 231, -399, -206, 325, 92, -409, 34, 581, -9, -83, 331, 85, -170, 152, -52, -94]
6502i4L58l58l22P71m1o54J23P91n72l60N31j41q6K66j81l02N78N3p99L59P62
6523F82q79j17P49n9n34K91K07k35K15O9o76M27N82q73j27R66m41p21O45K03n65
6544a91K2M26j43j08K27m51j76J017o61p43J083K00q93J88O57l43j67L54m28j76
6564c06O06l22n06Q64K98j373N81P34o64m95Q02m8o72O14j84l26N33O8r00L59
6584c37R91r79n69J255k57q22N09O25r44L38L93p78L76N09q91j54J242m38j062
6603i93R18M60j143K10P68n56k60Q92p06k08R42m10r17R93N45j138M2J156p33
6622a38n43J111k67p55P59Q4j021R15M50j302K92J356j082n89J212j64j105O66
6640a21N07r97O73M07q84O7J002o08p99J268J5j349Q22P23j145jJ113o91n09J045
$$ y = [-94, 264, -94, -416, 355, 314, -340, -217, 574, 2, -358, 173, 32, -54, 212, 31, -271, 307, 360, -439, -80, 682, -197, -314, 435, 376, -158, 133, 340, 105, 320, 389, -287, 140, 722, -151, -278, 688, 247, -474, 171, 374, -191, -169, 257, 114, 6, 233, -218, -394, 623, -38, -781, 302, 502, -391, -203, 454, 111, -56, 298, -130, -306, 300, -22, -528, 336, 634, -739, -158, 576, -88, -583, 219, 171, -501, 113, -71, -397, 136, 204, -696, -337, 654, -325, -894, 361, 104, -718, -209, 416, -528, -190, 203, -575, -199, 310, -581, -735, 507, 69, -993, -75, 385, -758, -548, 220, -336, -596, 296, -410, -618, 324, -86, -1003, -10, 535, -603, -561, 595, -138, -681, 430, 163, -592, 167, 251, -770, 145, 595, -707, -415, 941, -141, -730, 482, 318, -787, -121, 386, -611, 62, 469, -415, -348, 654, 46, -753, 515, 530, -819, 3, 726, -419, -420, 693, 2, -507, 538]
6660E38p04n91J204K47j478P47J034j600J57J319o46p59J021l00m34P05Q6j044
6678d98O17Q67j404l58J870q38j008J212L98j580P57P58j292M66R70j231j59J383
6696I30n42j348J440L62j530N88R16q80k93R33o26l87J022l40q89J200K81j637
6714h00N64J338j151p09J251j64j056J166nj047R25M03j417K70J389j229o29J409
6732E08r6j492J128O88j454N78O32r36n0J246r86p19J519k9j602R68Q51j343k0
6751f09J217q61m09J017m73o71J257j46j305J019O92j424QJ451q81p00J068r6
6769A54q53Q76J32j122N59R85j443L2J631j065j027J512O6j335Q07M64j069K52
6787d44R92j263J68J195p38j054J378L33j810Q15J066j158j75J294q35m62J227
$$ y = [538, -166, -757, 447, 694, -784, -37, 997, -603, -446, 873, 227, -532, 489, 189, -245, 460, 546, -498, 119, 986, -418, -776, 1094, 256, -752, 460, 858, -722, 35, 793, -499, -33, 937, -294, -453, 930, 388, -960, 480, 842, -688, -100, 816, -64, -357, 576, -50, -437, 585, 245, -644, 556, 837, -800, -236, 1102, -49, -758, 493, 329, -727, 439, 434, -613, 312, 715, -702, -432, 957, -272, -901, 508, 412, -1080, 48, 736, -718, -140, 492, -444, -494, 752, -234, -953, 566, 537, -1065, -97, 754, -589, -609, 608, -253, -662, 355, -118, -789, 468, 322, -983, 36, 728, -696, -688, 763, -118, -818, 250, 154, -699, 177, 309, -813, -254, 731, -712, -680, 951, -114, -1141, 371, 437, -898, -91, 373, -696, -444, 548, -715, -547, 648, -90, -1144, 234, 567, -1243, -428, 638, -520, -695, 599, -236, -698, 529]
6804E29n12r39J432J88j739P71J482j693l61J709p51r01J028J32r88R15K55j330
6822g73N46J263j458k88J476o32j237J383L91j347O84N56j150J59J382j265n43
6839h53J832q78j086J222P59j910O98J033r76l67J142n50o44J240l27j043J023
6856C15P04j731M30J413j308n65J445m51j056J259J04j344Q42P82j610M75J507
6873A211j104r21J558n52j003R27O36j151L55P77j251K83R82r95n46J577k11j461
6891h89J086O15j509N26J136j051m01J251p52q12J620k60j542J221P53j673j67
6908h48J569p84q70J511j41j323J342j11j180P54J020j822J28J647r32j225J660
6925C95K30j722R69O61j200M02J005j404J36J195p75j170J646J04j446P73R68
$$ y = [529, 17, -922, 510, 698, -1041, -270, 1212, -481, -842, 867, 116, -785, 243, 375, -613, 302, 557, -773, -227, 1036, -422, -710, 766, 134, -1103, 280, 671, -676, 8, 564, -586, -427, 955, -310, -853, 979, 101, -985, 237, 996, -914, -216, 817, -159, -526, 616, 66, -578, 662, 335, -708, 315, 1019, -712, -282, 1131, -177, -742, 703, 252, -804, 455, 559, -785, 57, 839, -771, -296, 1211, 107, -814, 744, 192, -811, 116, 752, -399, -44, 733, -518, -235, 747, -248, -794, 783, 572, -889, 197, 812, -697, -171, 965, -86, -487, 764, 12, -800, 820, 560, -982, 239, 992, -681, -848, 721, -63, -933, 578, 437, -886, 456, 345, -835, -81, 939, -883, -755, 892, -40, -1265, 395, 625, -1097, -128, 533, -667, -265, 740, -664, -528, 667, -108, -1278, 368, 472, -974, -201, 767]
6942G67j289m0J191j036l36J381n29j075J458K48j914Q66J249j476l90J592o62
6959Er53J242m8j142J071K88j274O11J028j156o28J817n99j377J532J67j468P81
6977a03J008j587K84J192j130l78J594l55j585J377M53j549N09J135j109k89J236
6994G03p10n70J202k75j117J138N51j567K85J365j200m23J366n29q56J149K1j164
7012f31P81O13j375L99J315j247p05J655m31j169J088M58j081L09P07j056q0J242
7030G92p20q39J479q3j303P68R48j353K6J090q21m03J286o37p65J165k75j232
7048h77P93J023j450J84J214q06n88J034k65p97O51M33j207O43Q95j411K50J139
7066H58o93r13J068J53j278P16M88q47L89O51q14k67J227p03q96J033L51j308
$$ y = [767, -522, -562, 629, -407, -743, 638, 109, -966, 492, 740, -1174, -308, 941, -535, -925, 667, 5, -948, 294, 246, -896, 175, 463, -811, -200, 828, -328, -956, 861, 262, -1115, 417, 584, -884, -103, 905, -682, -398, 794, -336, -714, 880, 525, -1060, 317, 770, -779, -270, 865, -244, -533, 703, -7, -577, 625, 350, -767, 371, 922, -645, -360, 1005, -195, -618, 748, 219, -637, 512, 533, -631, 150, 763, -612, -213, 1102, -145, -850, 805, 374, -795, 293, 751, -330, -21, 686, -370, -450, 792, 72, -767, 712, 629, -674, 94, 1042, -311, -285, 805, -16, -419, 867, 230, -535, 630, 355, -877, -84, 939, -511, -327, 887, 81, -507, 527, 262, -535, 116, 549, -658, -15, 880, -531, -281, 858, 165, -748, 320, 473, -805, -89, 399, -448, -59, 592, -222, -489, 738, 35, -861, 172, 523, -785]
7084g85N53P48q35k11J020o28k26P85l93p30Q47K08j069N05R32j087k29R97m47
7103d5m79P79J00r64P07K56q62J89Q25r40j83R38j13j044Q16K13q52N86M17p01
7123c57P6R18q30m25R11j33q64Q08J72p78K66P68m59m43N93j65m19P58k40p76
7143f19O50M05r08L4R97n52o97R34j07o09P16n5o77M66M00p51J35R00o49o54Q58
7164B17jp19M10N31o62L9N47n81J38O78n96m08P86n6p16L64N27o86j67Q10m20
7185C5m35P10m5o01O77J30p87M27N94q73o4N40rq28O72L39n64O6L80o42J71N87
7207D80n97j40O73m30l49M76K80n76m9O69n21k4M48k53k41N04j66n61P36n0p14
7228d05K87O77n86j42M09j91l07L96R4o21N47P9m66l5N21m15l24O66n0n60L57
$$ y = [-785, -232, 516, -319, -530, 490, -138, -364, 421, 28, -702, 145, 353, -716, -211, 721, -366, -595, 402, -45, -524, 255, 355, -609, 98, 354, -508, -319, 506, -434, -617, 321, 208, -836, -20, 193, -659, -73, 344, -357, -281, 637, -193, -618, 293, 160, -704, 104, 276, -502, -236, 532, 73, -370, 223, 58, -361, 397, 157, -619, 31, 436, -472, -438, 559, 7, -690, 244, 137, -472, 244, 189, -488, -22, 378, -373, -238, 662, 13, -641, 217, 216, -503, -93, 438, -224, -185, 362, -219, -81, 597, 1, -407, 379, 323, -393, -29, 498, -188, -355, 455, 35, -400, 310, 265, -336, 341, 471, -316, 111, 705, -168, -232, 308, 299, -529, 143, 482, -82, -16, 364, -278, -107, 480, -117, -257, 416, -14, -363, 113, 393, -183, -232, 437, -84, -108, 340, 87, -154, 350, 184, -377, 359, 309, -405, -118, 559, -27, -169, 240, 49, -258, 138, 232, -389, 158, 237, -229, -264, 257, -158, -482, 184, 134, -426, -69]
7249f9J61k17J1J82l66K44L64l06l72O59J16q45M66K04l63n8L39j63m5K38j16
7270F4l63N81k06m36K23L87n22J9N63l92l97M90J93m24K29O8k30k3L29n08j37
7291d92R06l33m67L86J77l24Q0J40j52k10L91k38L2K71j16m16L78K50m59K1M71
7312B96j77k35J05J28k45L47j33l76K08L18l78q8N30j20k53J09J49m04K62J59
7332B02l37R2K24k99J29K76l48k95N95O3m26K1L85k9m08J09L68k98K33j77k64
7353a84L84J36k74j90M72k35k93M24J66n10K7K79Rk59L07l41J04J52l2k32K47
7374A57J61m39Q9M00l29j58L11j36m2J37r6M6J49mm71J25P14n57k34L22J35m78
7396a98K27J77p8qJ23k75n8M24l21k47M86J9o52L41K42k95j40K81Q2k47K36j48
$$ y = [-69, 92, -125, -114, 68, -298, -54, 310, 4, -368, 291, 407, -438, 28, 232, -131, -189, 150, -13, -58, 180, 64, -299, 282, 76, -360, -137, 250, -272, -253, 310, -82, -479, 11, 204, -220, 9, 77, -153, -176, 153, -355, -492, 414, 81, -386, 0, 177, -147, -67, 73, -79, -289, 102, -136, -104, 167, 51, -365, 13, 263, -196, -175, 296, 119, -116, -11, 117, -128, 219, 86, -290, -82, 236, -142, -230, 300, 180, -73, 36, 185, -219, 43, 202, -135, -43, 181, -118, 11, 287, -61, -356, 239, 302, -124, -103, 282, 253, -155, -46, 322, 24, 257, 80, -184, 200, 336, 62, -128, 344, 109, -184, 240, 406, -104, -77, 202, 211, -48, 259, -82, 22, 174, 142, -90, 157, 318, -121, -32, 368, 39, -119, 192, 56, 14, 151, 55, 101, 250, 246, -225, -100, 614, 57, -177, 145, 280, -198, 29, 206, 128, 120, 243, -32, -90, 334, 13, -234, 252, 271, -381, -40, 202, -93, -233, 48, 130, -117, 119, -29]
7418b9k86L25M5m55P6O31l47j70L52o0k53J85P0j94M2L24l97lM15m14q9N21r1
7441A98n65M66M3k01r0J99k37k5J47k5j95M89q7m25J97M01l58q9L97l06j51L37
7463A20k27k74M71k1l92L36K70m59r5L77Q1m82J78M35n81J70M39m50l3L94m41
7484a84m2L38q5l68L29K31l56M6M26m17p3K23mk81L70n7l84N35K49p73kO28l14
7507C5k56N10M3n02J01L43o08M00K36k48k48N67k23m16O27l3p28M36L08m32J28
7528D0L49l54j84L88j06k58L23O8n66J73O02o87k4M60o6m36L19R4l90L48L02n16
7550a21L4O33p24m9N32l4o50N52J90o36J15M09n19P7O54n05k93P60k30n88N21
7571A28K59n56J5N78l54k81M13l60j97N61p6n34L34N43p40k8N59k97l60O88j70
$$ y = [-29, -315, 10, 55, -400, -324, 307, -40, -210, 142, 82, -171, 14, 84, -110, -68, 256, -141, -144, 271, -143, -232, 289, 198, -367, 99, 142, -59, -149, 50, -187, -212, -65, -90, -285, 204, 117, -308, -111, 290, -68, -157, 240, -66, -217, 120, -107, -381, 90, 69, -323, 13, 283, -176, -271, 106, 187, -295, -117, 318, -263, -93, 346, -104, -137, 257, -184, -226, 112, 27, -341, -12, 219, -137, -91, 335, -82, -155, 68, 64, -217, 153, 96, -288, 247, 496, -277, -279, 349, 35, -221, 289, 332, -170, -69, 274, -334, 66, 302, 54, -194, 373, 150, -266, 361, 328, -400, 36, 344, -88, 40, 389, 35, -149, 239, 133, -125, 198, 266, -300, -127, 475, -212, -236, 224, 158, -278, 41, 135, -255, 93, 395, -121, -87, 546, -178, -227, 305, 271, -379, 173, 363, -273, -158, 251, -268, -191, 463, -42, -335, 425, 195, -393, 128, 387, -169, -154, 424, 70, -211, 202, -158, -355, 206, 130, -404, -70, 473, -267, -295, 264, -33, -393, 295, 125]
7592A25l42K92K20q89N05L97n87q4P97m89n87P31K80q27J93N13n13J12K08l50
7612b95p5N17l31m90R37J57r22J59P46o37o7N96m28k45O04j63n03N63Q5o53L69
7633g6O70q04l11R44l95n22P21J0o79O41J57o76K87L86o72q0P65k41o39P50K94
7654E30q29J48N01m52q4M54k53m61Q99k80p24Q60P4p13N8P46m71k42N19r1n71
7675c82O46pp30N56L58r21L23N57k65n52Q70k67l87N01n0o12M68K65p23Q4P71
7696E03n56k94P92l67n40O61K87p69J57N53m50rO46p50k31O98q8p58P15M14r47
7717c33P7O61j89n48O21j61n90P45R6r12L38P65q65O9P07m06n17P05N8q18O45
7738A48J30o04K65M79m56m54J014n73l66O18J65q63M75O15r93K30M40l47r5N72
$$ y = [125, -217, 75, 295, -594, -89, 308, -279, -363, 434, -55, -642, 89, 369, -458, -265, 248, -265, -153, 55, -295, -370, 147, -184, -674, 263, 420, -502, -343, 403, -234, -301, 295, -133, -378, 226, 63, -440, 123, 208, -445, -76, 594, -210, -521, 423, 28, -494, 227, 237, -442, 199, 356, -320, -33, 353, -319, -399, 366, 125, -514, 236, 530, -299, -151, 350, -102, -186, 268, 15, -446, 453, 173, -551, 309, 383, -330, -272, 474, 3, -239, 280, 189, -382, 264, 257, -473, 83, 441, -480, -157, 400, 135, -417, 453, 186, -201, 300, 250, -362, 106, 371, -352, -268, 503, -53, -347, 445, 78, -462, 199, 486, -283, -126, 427, -23, -32, 614, -136, -367, 331, 243, -515, 200, 614, -333, -256, 405, 216, -332, 289, 128, -462, 283, 379, -533, -195, 570, -295, -226, 481, 75, -442, 263, 321, -497, 148, 278, -326, -61, 418, -38, -492, 522, -51, -417, 201, 366, -497, -22, 593, -400, -170, 270, -77, -172, 400]
7758D00j65o32P35J4q08M75N06p21K0N65k36n44P53r3o40N91J13q18L12P42o79
7779a10l81R89n12n54N81K18n68L18K41m54O8N49o46j71O88j02p90P57J96p66
7799d49L15M28o00J14O09n75k02O18q8p48O49L46p58J31O20n19m01Q16k48n53
7819d95O81jn96M29K70o52K21N16m11n51R52l4q52N19K64n80K38K96n76L9O47
7840C24l00m00N58N1n43L82J93m11J10M75l99j96O40l23m61P32j58n81L84M84
7860E61n76k37O01k17m76O98j37n35N38R9o17J77O11p08q4O91l30m16L99J41n14
7881c31L18J95m10l1N34j74l43Q21l81m81M99Q6p76L78M50l77j68N20l44r6L14
7902B03l6n63N67jo22K61N99n74k56N54k11j72L84M0n31L29K75m17mO32o65r5
$$ y = [400, 235, -397, 338, 352, -456, 19, 525, -196, -176, 389, 153, -391, 362, 269, -371, 220, 333, -485, -173, 569, -110, -491, 498, -14, -568, 13, 231, -337, -19, 222, -232, -164, 385, -261, -432, 256, 154, -636, 121, 317, -449, -134, 294, -306, -192, 417, -158, -360, 258, 170, -578, 71, 417, -341, -210, 410, -109, -510, 306, 58, -495, 186, 185, -411, 18, 288, -364, -143, 373, -38, -589, 363, 329, -523, -4, 260, -320, -82, 214, -362, -323, 324, 24, -376, 182, 233, -310, 72, 265, -146, -36, 439, 40, -156, 484, 161, -300, 432, 274, -307, 77, 561, -15, -252, 349, 132, -344, 354, 217, -318, 220, 319, -298, -121, 490, -218, -302, 389, 59, -357, 42, 183, -331, -13, 182, -228, -259, 275, 101, -242, 579, 198, -283, 216, 302, -474, -96, 354, -23, -191, 329, -15, -111, 203, 167, -396, 171, 170, -452, -191, 408, -166, -422, 132, -79, -251, 133, 173, -358, -29, 246, -171, -175, 457, -208, -303]
7924c03N26M4o71M90L10o81K53K80m93M3N58k34m88N75l2o12N15O2o12K85L26
7945A41j79m7L04k37j53L10j21k84K21L64m42j32N86n11k24N28j07k76L76j34
7965a7k42K38R2m34lP20l52n22N19J6l32L12P9k99L15k9k53%N60n13j57O30j02
7988B26n85K40L55l97J78K27l15k76N85k38l26O38q8n72N22J72m89q6K89J05k70
8009a05K15q9l00M73j6k45PJ53q0j39L51o3l97K22K01j97J37j40J8O5K33l96n0
8032a42M31r8l65K95K00m38P2L30m27n3L45K1l40L32j48j76J69J73l41O7M65l74
8054bk51N03m1l24L57k12j76J67K54o03M87J63l58q7J89J5j30J39j08k88L13K0
8076B7j89K11K68l97j22M52j00l25K27J56k77j0L84l67J01K30l24k3L92k82j83
$$ y = [-303, 223, 267, -404, 86, 396, -285, -32, 248, -245, -202, 356, 122, -366, 209, 177, -435, 80, 142, -470, -185, 141, -38, -85, 219, -18, -171, 139, 18, -266, -45, 319, -123, -255, 331, -180, -404, 124, 17, -259, 117, -17, -259, -21, 71, -363, -366, 354, 2, -520, -1, 15, -317, -5, 74, -225, 90, 61, -192, -192, 368, -145, -302, 328, 226, -359, -119, 236, -161, 17, 244, -71, -347, 238, 0, -326, 312, 224, -348, 174, 346, -143, -229, 60, 165, -105, 110, 21, -279, 194, 178, -67, -60, 93, 13, -126, 225, 162, -235, -13, 188, -9, 128, -12, 6, 71, 304, -92, -142, 289, 191, -174, 121, 321, -117, -45, 285, -142, -195, 150, 171, -169, 163, 15, -161, 8, 181, -160, -93, 372, -2, -253, 250, 209, -115, 242, 30, -146, 21, 275, -328, 159, 322, -36, -123, 66, 81, -49, 90, -18, -306, 7, 27, -162, 49, 317, -80, -202, 250, 150, -175, 52, 208, -69, -79, 305, -62, 39, 269, -55, -78, 314, 32, -151]
8097a51J21K37l37Q9K80k14j40J31R2k73L15j50k32K54J09k51j07M29l32j79N07
8118A98j22l37L29j66j21J67J83k11l4L84l27j92M12j7m98L05K70l76J81o6N5
8139A7M0K21l36j27L24k6m44K56K76m83K07J29N5k56J05j6%P3q2j27J46K47l98
8162a99K43O2n6j52J52J11k77J56J0o3P0mj77K6K89j92j77J23J55k38K68k23P8
8185a5L2J07o9j12K11l01
$$ y = [-151, -30, 207, -130, -41, 239, 25, -115, 16, 108, -165, 150, 0, -232, 22, 131, -120, -227, 202, -130, -309, 198, 76, -261, 68, -98, -219, -52, 131, -80, -114, 270, -57, -249, 163, 146, -352, -47, 223, -153, 28, -38, 17, 57, 278, -58, -185, 139, 113, -331, -75, 201, -282, -75, 54, 109, -147, -42, -58, -58, 15, -67, -194, -48, 199, -199, 44, 106, 50, -102, 50, 161, -116, 40, 50, -13, 57, 53, -124, -98, 191, -1, -178, -55, 100, -138, 130, -93, -15, 17, 124, 55, -57, 154, -147]
8191a47
$$ Imaginary data points
##PAGE= N=2
##DATA TABLE= (X++(I..I)), XYDATA
0@%%%%%%%%%%Qj6J6j6K4l2M0n6O4p2Q8j05J28j51J73k01K34k73L12l54M04m60
32b45N24n93O65p46Q38r39J049j167J295j437J595j765J947k150K371k612K880
49A510l172L490l845M244m685N178n737O379p124P992r019J0263j1809J3781j6384
64h938J9990k5315L3934n0048Q9438l41004l46466J112838l94035p61605Q24097
75A52886J77232q84020M83471M82052q29498J31434P90189p15307l40181R65363
85D13621k57177q10202P45142L07850q81126K63473O26548o75288j02657P22041
95C52225m52775m15149P92405j26543p62534O35552L87476q77937J59345P47693
105D39758o00527l01979P61154k29826n41947O38882P8375p07082M58869M47273
$$ y = [0, 0, 0, 0, 0, 0, 0, 0, 0, 0, 0, 8, -8, 8, -8, 16, -16, 24, -32, 32, -40, 48, -57, 71, -80, 93, -108, 126, -147, 165, -189, 215, -245, 279, -314, 351, -395, 443, -496, 553, -614, 681, -756, 839, -926, 1021, -1129, 1242, -1370, 1510, -1662, 1828, -2017, 2227, -2458, 2720, -3017, 3362, -3762, 4230, -4789, 5474, -6335, 7446, -8938, 11052, -14263, 19671, -30377, 59061, -281943, -628409, 484429, 90394, -671211, 152886, 330118, -553902, -70431, 411621, -417877, -286443, 503746, -211561, -551742, 413621, 156444, -653758, 91384, 399234, -481892, -218419, 408129, -267159, -369816, 352225, -100550, -515699, 276706, 150163, -612371, 23181, 410657, -467280, -307935, 439758, -160769, -462748, 298406, 68580, -473367, 165515, 243890, -463192, -4323, 442950]
115D42950p78681N7702P76901n22985m23495P70892o8179o60750N02069K75507
125C71931o62425K29398M96125o14262p3583P06095m04758m74161P08674L1196
135C14230p15550L96131M19025o31204K1737N57878m24993k28875N94310k18001
145H4688m67291N64275J04669o57677L10483M65272n82368q6317N99346k93904
155D1176l50476N14138l6379m62445L98588J80020n52226K10784M46054n10208
165a20974j28537N95003k33664m27337M81838R3086n02540K58036K85907m67727
175a66909O4162M33482l92330j85452N37592j63066m54333M37005J77626n26550
185b38773J51322L85267l93595q5258M29239k40803k46548M39538o5843m22061
$$ y = [442950, -335731, -278029, 498872, -24113, -447608, 323284, 255105, -405645, 96424, 371931, -290494, -61096, 435029, -179233, -252816, 453279, 48521, -425640, 283034, 314230, -401320, -5189, 413836, -217368, -195631, 362247, -62746, -291621, 302689, 84688, -382603, 181672, 286341, -371336, -60853, 404419, -177949, -264266, 335080, 41176, -309300, 204838, 168459, -293986, 104602, 284622, -267604, -56820, 389234, -120974, -249511, 345492, 111828, -315509, 166329, 259415, -243125, 14911, 300818, -166909, -102747, 330735, -61595, -247047, 290545, 127479, -326854, 110151, 287777, -238773, -87451, 297816, -95779, -181037, 248202, 7399, -239149, 200389, 134546, -287515]
195b87515L61096K11717m99249R5047M34847l44950j89105M38166j10490l16194
205b06630L39108N1043l74764K42785K20957m16814N1938M07600l04726k23449
215b12952M27972m3421l68671K67901J50972l50411J14733K42921l13613j4028
225i8597L44093k40289k16711L88976j9899l86166K40761K20371l61564J8812
235a10213L10081k33848j20436L12410j27004k31598L10491K8197l57017J96562
245b2375K48301l47172m0013L51928j74127k11657K89979j1511k56559K06234
255C3028Q9927k90850J22557K27155k91260n8670L35427j45117k45406K79184
265E5975N4009k87729J37589J56523k45222M1547K14739k19585p1253K94738j20197
$$ y = [-287515, 73581, 285298, -213951, -118904, 315943, -29007, -218112, 220054, 109564, -206630, 132478, 183521, -191243, 51542, 272499, -144315, -92377, 315223, 10497, -212952, 215020, 171599, -197072, 70829, 221801, -128610, -13877, 229044, -84569, -98597, 245496, 5207, -211504, 177472, 157573, -228593, 12168, 232539, -129025, -110213, 199868, -33980, -154416, 157994, 30990, -200608, 109883, 138080, -218937, -22375, 225926, -121246, -161259, 190669, 16542, -195115, 94864, 83353, -173206, 33028, 122955, -167895, -45338, 181817, -109443, -168113, 167314, 22197, -223209, 55975, 109984, -177745, -40156, 116367, -128855, -87308, 127431, -92154, -163407, 131331, 11134]
276A1134k40392K72115Q2809l13599J06099K26696k30710m7615K38455j30222
286b5230j21476K34101n3229k13824K17051R3192k89766Q1683K50228k21400j06748
297a55418K67283o2357j90251J85207L6874k00308J28139J12732k27503M2566
307f3036K26622j90891j21816K69565l3000k35526J67179J10669k12169M7414
317c4989J53895j62475j9120J89695j29131j16681K27619k1101k29257J57763
327A6218J34718k27069Q134J95281j31037q1693J75747o1567j28172J70448P990
338G8998k01220J29347J37339k22327j1637K25354j16508j38926J84300P480j64190
349i1990J09701O8727j63138O1605J32930j69504l0549K07529r3736j57470J80629
$$ y = [11134, -229258, 42857, 125666, -187933, -81834, 144862, -85848, -133463, 104992, -25230, -146706, 87395, 34166, -179658, 37393, 130585, -159181, -77498, 172730, -48670, -155418, 111865, 49508, -140743, 44464, 81338, -118970, 9169, 121901, -105602, -63036, 163586, -27305, -149121, 120444, 87444, -148082, 19097, 129766, -82403, -34989, 118906, -43569, -62689, 127006, -2125, -118806, 108813, 87712, -141545, 16218, 150936, -76133, -67999, 127282, -3755, -85448, 90299, 28732, -99440, 71008, 78998, -122222, 7125, 144464, -77863, -89500, 135854, 19346, -119580, 64720, 72200, -91990, 17711, 86438, -76700, -15095, 117835, -51669, -82218, 125311, 31575, -125895, 54734]
360E4734M8678j91283O6296J24129j35753j2444J30165r7163n5043J54503n9773
371B7046j36641J56403M9569j93235N8083J50920j37769n7657J51619m6596r8364
382g6622J15699k240j19838J04950N6279j61957M5355J49411j33153p3560J69982
393G4306k2795j38094J01335N6764j23308M4328Q2274j16239Q554J28859j03561
404g577p5543J59248j4136j52836R5621Q9845j36143l343J15306p6053m6932J05779
416E3236m6404q0664J14026N106j35363P3992R6900j30323k9513J34019m5550
427I462r2080Q8562J5901q5040N5793L1459r2244M4132P6188j04979j9795J26699
439E4058m7273j00222R7742M1133j04764K7822O7963p1058J086P0286o6163k4362
$$ y = [54734, 103412, -87871, -21575, 102554, -33199, -45643, 84522, -12641, -67684, 86819, 27046, -109595, 46808, 96377, -96858, -38775, 112145, -25624, -83281, 68338, 21742, -76622, 39077, 36837, -83001, 21949, 78228, -83729, -38374, 111037, -22116, -95676, 74306, 51511, -86583, 14752, 71516, -51792, -7464, 74810, -41429, -32875, 95984, -7577, -83120, 76128, 61992, -90844, 4777, 94622, -41521, -44864, 70442, -5611, -52543, 53236, 6832, -73832, 40194, 45300, -90063, -16071, 80829, -49494, -79007, 55012, 9462, -82618, 5944, 21845, -63195, -7402, 24057, -68187, -24055, 52133, -52846, -72641, 54058, 6785, -93437, 4305, 45438, -59326, -31504, 36459, -34599, -33513, 36773, -29390, -53752]
451e3752R9793l9864q9988R4887M4656j18686J5648J00079o6127m8280Q1066j6235
463C197n4993O0113m26o8225N7109M0056r2502R018R5293n6636o2969Q6034J4050
476B9119p6916L5196M0830n2181J3625M2149n0505j500O9872l9489n2643P6180
488C3737K0762q1753K3680O3681m8056k1771M8453j4849k1315L5186j5068l1936
500i249M7392Q929o5207K1992N7967n1103l3610N8857n15m7043K1599J6886k7251
513c56J3660J2943l7471J2592M4800m2744l1288O5689M866o7095K4953N1547l9041
526A3055k1548L9227l830k0642K3198m906k3627L4105Q823n0835J6806M9206l9287
539A9745l3526M6281J1529m3404M009K5099j5198o112R063j7299L639K4628k7386
$$ y = [-53752, 46041, 6177, -83811, 11076, 55732, -62954, -47306, 52773, -13354, -61634, 19432, 3197, -51796, 8317, 7891, -60334, -3225, 36831, -55671, -46653, 48640, -7996, -70965, 15069, 29119, -47797, -12601, 28229, -23952, -10327, 31822, -18683, -20183, 49689, 10200, -42443, 33737, 54499, -27254, -3574, 60107, 12051, -9720, 38733, 23884, 2569, 37755, 22687, -9249, 38143, 47072, -18135, 3857, 61824, 10721, -22889, 35968, 35453, -11590, 10009, 26895, -356, 13304, 26247, -11224, 1368, 46168, 3424, -27864, 37825, 42691, -24404, 549, 52096, 13055, -8493, 30734, 26904, 6262, 29460, 24554, 927, 35032, 43855, -6980, 9826, 59032, 19745, -13781, 32500, 44029, 625, 4634, 29733, 14535, 8423, 17486, 187, 3826, 28454, 1068]
552A068k3530M2104P370n0732P326M4485k1976l0225K7064Q797j9791J0571L23
565B854j5131K5738O443m1691J4102M7622l1870l6479M6261J8906m5932L665L2668
578B7156j6361p267J3570j7408L518K9792k8653k9363M8633J2379o2835Q998N6877
591C9036l4163l8109M1410N283l2998J7016M124k6298K5065J4069n0590R751N7873
604C1469l9933m5069O0856J6124o1080J4981M1207k9944p457K5712k1052j651
616a5837L7911k8292l1299N6641P200o5612K5569N2674m7436k1564M7158j1590
628E523k5005K9994r831k8431M1450L613o0670L1439N2668o3397k4189P1827j4076
641A0915n5011M0139J9123m3392J9728K1964m4922J6872M8304n5256k2259P9217
$$ y = [1068, -22462, 19642, 27012, -23720, -16394, 28091, 6115, -24110, 2954, 11751, -8040, 2531, 2854, -12277, 13461, 19904, -21787, -7685, 39937, 8067, -28412, 17849, 36755, -9177, -5512, 27156, 10795, 3528, 17098, -310, 3208, 33000, 4347, -25016, 23617, 35996, -26839, -17841, 39036, 4873, -33236, 8174, 13457, -19541, -2525, 1599, -24699, 366, 14435, -36155, -26404, 31469, -8464, -53533, 7323, 23447, -37633, -22652, 18555, -11389, -18846, 6866, -14186, -15837, 22074, -6218, -37517, 19124, 26324, -39288, -13719, 38955, -8481, -30045, 17113, 5523, -19482, 10512, 681, -27750, 13700, 17313, -43357, -11918, 40750, -22647, -46836, 24991, 10915, -44096, -3957, 15166, -28226, -8498, 13466, -31456, -14584, 33720, -21536, -43795, 35422]
653C5422j7171p0480N5136M0015o5629M238N0964l4365j1571M5425l0263k4016
665b2295O2282j5592o3910N8673L7968p9667L917P0378l8739l6990N1433n506
677B1952l7196L7427k20m7363M3271K6702p2911J2668P1830n2401m3028P0847
689C1578R08o0231L5667K4578m9433K2992L3390n9896R517O9166n7537m3147Q8149
702D5701k504q4545M7191N0490o8810k22N7733m3936j7527O1788l7125m4606P7231
715D0859j333q6918M9389N8953q0723j3023P6724l4115m4345N6435q620m7672
727c4389N3605N334p2566M6116N2398q4860p670Q9960m1748o1774P0808J1619
739B6833o6545L7573K8417o2459K7624M9670p4419m435Q9376m9779o5862Q7015
$$ y = [35422, 18251, -52229, 2907, 42922, -22707, -18469, 32495, -1870, -13441, 31984, 1721, -22295, 39987, 24395, -39515, 19158, 57126, -22541, -18624, 51754, 13015, -23975, 27458, 21952, -15244, 22183, 21963, -25400, 17871, 44573, -28338, -15670, 56160, 3759, -39269, 31578, 32486, -27745, 7922, 32500, -16933, 6059, 39449, -20447, -10930, 58236, 699, -42448, 45701, 43197, -41348, 5843, 56333, -12477, -12699, 45034, 1098, -16429, 45359, 8234, -36372, 40859, 39526, -47392, 1997, 60950, -19773, -32796, 43928, 9813, -34532, 21903, 13283, -34389, 19216, 24550, -48016, -1900, 50498, -34362, -42032, 47928, 6180, -55594, 15214, 26833, -39712, -2139, 26278, -36181, -8557, 41113, -33306, -37741, 51635, 1856, -64006, 23009]
751B3009J6638r0024L5411N7011o6890j468O1395n3072j9359P8239l9781o3755
763f2646Q6656J5955j01225L9783P6220p9416k4431Q3744l3980m8702O9289j0914
775A0333o5269O6591K2717r2086L5255P7910q1975l1993R6394k4078p1464O5121
787G456J7574o9839M0342L5465p5140K2913O9793p5459k8825R9387k7530q3792
799f7655P3549L6018q7505K3911O0450o7109k599P1357n7875l4362R2991k4921
811A6250q7003P9282M4806j03652J5392Q7421o5091l5089Q0635k7882n2505P2664
823B5228m391p7744O4486M4021r9030J3287R5567o6612n3319R2873o748p6724
835d9106N8698K6070p4123L6928M9552q0368N398Q8164o1420n5846R7066Q25r2177
$$ y = [23009, 39647, -50377, -14966, 42045, -24845, -26313, 35082, -17990, -37349, 40890, 1109, -62646, 24010, 39965, -61260, -21477, 54743, -24673, -49104, 34640, 660, -48042, 21247, 10333, -54936, 11655, 34372, -57714, -22459, 55451, -26524, -58517, 37877, 13799, -57665, 7456, 25030, -44809, -4467, 30998, -44142, -21229, 48564, -26895, -55720, 43667, 16137, -67655, 5894, 41912, -45593, -21682, 38768, -28341, -30940, 40417, -17458, -51820, 41171, 16250, -70753, 8529, 53335, -50317, -34925, 52496, -12595, -47684, 32951, 5069, -47436, 25228, 20837, -56907, 7579, 51600, -47430, -34143, 61424, -5188, -58507, 34366, 27618, -49106, 9592, 35662, -38461, -1533, 48019, -32349, -26951, 61213, -207, -56053, 41013, 41838, -50339]
848e0339N4121N1184p9145J0597O4083n9893j3503P6863m4924n3107Q8016K651
860D6604r4994N3692O3805q8597o523Q4118m8297m1320P4175j9642o0269P0110
872C2862J2222q8784M5579O7706r0021j7860R8981m0266o8801P6469J1828p4413
884c4498M2957L4967p1947K2028O2320p1455k0978R2220l4661p4722P7930K6068
896E0229q6663K8622N6555o3175l291O1217m8648k6262P5448k7148o7875P3358
908B2367K6700r2669K5640P2853o6834k6269P2972k7677m5782O0286m445o2735
920d5593N3292L0429q2503J8509P5904o4254l9035Q2794j1816o6226N0901K2919
932B5321o1019K6706L9913o1815N356O8057n2820m0860Q2728n156p8291M9225
$$ y = [-50339, 3782, 54966, -24179, -13582, 50501, -9392, -22895, 53968, 9044, -44063, 43953, 46604, -48390, 5302, 69107, -19490, -26013, 58105, 9808, -31512, 42663, 23021, -37248, 32862, 45084, -43700, 1879, 69585, -20436, -38296, 60685, 20419, -48382, 28087, 39915, -34498, 8459, 43426, -28521, -6493, 55827, -15628, -36606, 55614, 20953, -53769, 24161, 50229, -36434, -7812, 48743, -14432, -17723, 43494, -5154, -31416, 44032, 16884, -50991, 22367, 49067, -43602, -17962, 54891, -11943, -38212, 34760, 7083, -38699, 21587, 17142, -45593, 7699, 38128, -44375, -25866, 50038, -14216, -53251, 29543, 17727, -48499, 2402, 25321, -35698, -8992, 30921, -30894, -25538, 42519, -10301, -51161, 31567, 26411, -51880, -2655]
944b655M3945o7956M434N4735m2857j5769N6113l1336l8232O5990l308p1868M7098
957a666M6028p2567l523O6461l5961l4811N2513r105m0891M4292N699n7233L7559
970c205M0029o8348j816P1911l7573m7098O0745P632n6237L0367K8173m8453J3803
983a0070M1434m9094r052O3939l0807m9157O0795J5284o5566K2465M5306m5698
995a0221r058M5380k7445k1260M7561j6989m2295N0118J3317o2850K2704M8603
1007C7565m8771j7641N2967j6927l3709L8767k95l8040L4913J4771n1773K0535
1019g638M5284m8613j7364N8782j4759m4142L9301J5089m1975J9249K4314m0028
1031a2500R967L9074m1228j5266N6590j7452m8175M4211K1477n2464J0424L8502
$$ y = [-2655, 41290, -26666, -22232, 32503, -10354, -26123, 29990, -1346, -39578, 26412, 23104, -48764, -1666, 44362, -28205, -31728, 34733, -1228, -36039, 16474, 7369, -33522, 10770, 16469, -40764, -3205, 36824, -31524, -33340, 38571, 998, -46100, 14645, 22277, -33960, -3593, 24580, -23873, -10070, 31364, -17730, -26782, 37157, 6350, -42807, 17988, 33272, -32294, -9829, 35477, -10221, -19279, 26101, -1344, -22604, 24957, 7968, -34327, 15791, 29108, -33742, -11038, 37565, -11206, -28847, 24120, 7193, -26516, 12251, 11956, -26084, 8829, 23600, -28173, -7638, 37646, -10967, -28331, 30451, 15692, -28450, 10851, 25940, -16035, 3214, 27528, -12500, -2533, 36541, -4687, -19953, 36637, 19185, -28990, 15221, 36698, -15766, -5342, 33160]
1043C3160l4644q936L8126k5046k0621M4928j1804m3611M0094K1645n4246P237
1055a3718M6832l2103k3334M0510p493k8923L0110J336l3758K8252J7588m5452
1067b0153J0217M3274l4680k3835M5985l779l8018K7423J3133l4799J7162K0350
1079B2280l8646P153L9677l6133k2499N0270o110m7584L0506K5175m2729M052
1091a4588L2064k9829o651L5699k5214k1802M4072n579m5810L1729K8596m6406
1103b3719j888M2442k3277k0998L4427p909k4714L0853O88l6293K7025K4524m4245
1116b3084n04M5670k3693k9511L8287L339l4091K1044J2509l0524J5296K1366
1128A6104l6179R20M0897k6980k8409M3457L623m3395K1286K4798l4751L723K8029
$$ y = [33160, -1484, -10420, 27706, 2660, -17961, 26967, 15163, -28448, 11646, 33291, -20955, -13718, 33114, 1011, -22323, 18187, 10694, -18229, 11881, 13217, -20541, 7711, 25299, -20153, -9936, 33338, -1342, -25177, 20808, 17029, -20989, 6434, 19567, -15232, 1930, 22280, -16366, -9213, 30464, -5669, -28168, 22102, 15992, -31592, -1086, 24089, -18640, -14588, 17476, -12353, -19004, 16695, -8519, -30321, 13751, 8172, -37638, -5909, 22687, -23719, -25607, 16835, -6442, -27440, 6987, -922, -25636, 5217, 5905, -30388, -3363, 21161, -23084, -23588, 22082, -1611, -31122, 7165, 10504, -23587, -2543, 9966, -20558, -5262, 16104, -20075, -19155, 21742, -5238, -33647, 9810, 13433, -29962, -8676, 16122, -18629, -14906, 13123]
1141A3123k7658n208L5927k2034k5590M2340L075m6234K3388L2616l9302o302
1153b1859L9177j8800j9319L1645p323k5164L0530O337l8786J9331L1003l8196
1165a1424r164M3273j5296k9364L0932M416k8768J9556J0807l0354J4222K4211
1177B3047l4366m673M1332j9044l1179L5572Q954l6387J4519K1064k6891K999
1189e053K2798k3504n330L3028j6978k6765L5571Q123m0535J4853L0047k9760
1201c505q010K9441j3559j4299K5445p415k2781K7532O749l6657J5291L0770l3123
1214d121j1810L6324r877k4780K3526L809k3249J5965R101k6603J1079K3498k9200
1227f338q422L5478j1635k7380K5911Q431k6213R953J3302j9882N633J6949k2755
$$ y = [13123, -14535, -19743, 16184, -5850, -31440, 10900, 13975, -32259, -8871, 23745, -15557, -21859, 17318, -1482, -20801, 10844, 3521, -21643, 8887, 15224, -23562, -4231, 26772, -11424, -20588, 22685, 7389, -21975, 8957, 13373, -15395, 4161, 14968, -15386, -1164, 23047, -11319, -15992, 25340, 6296, -24883, 10689, 19643, -16744, -2225, 18839, -8052, -5053, 17745, -5759, -11089, 21939, 4961, -21804, 13767, 21890, -18645, -3792, 26255, -3505, -11515, 17926, 4367, -9932, 15513, 8098, -14683, 12849, 19598, -17059, -1768, 29002, -4121, -15931, 20393, 10516, -14264, 9262, 13071, -10178, 5787, 14888, -11715, -636, 22862, -6338, -14760, 20718, 9083, -18297, 7614, 16045, -10168, -215, 13087, -6795, -1162, 15787, -6968]
1240f968l057K9648j5594k3904K9957P363l2320J0505K1115k1152k900J9110j4159
1253b356o607K2194j1590j9200K7265N097l3464J2634K5752k5276r210K5739p916
1266C062j4890J6319k158j4517J7481K248k4871J4063J9638k7167n477K8813j0612
1279A932j9434J8853L106j6509J0922M037j7438J1715J2820k4718N17K7744j6695
1292c148j9034K5772L267k3404J1403J0450j6739N838J1774j8629J904K3153j7952
1305e345j5753K9381O16k8610J5116J7455k1792m83J7546j2840m023J8539j2688
1318b881j2191K5063j679k7737J8071J8223k7312k091K3809j1501j1023J6572
1330E323n504j0554J7715l522k0551J9711J2109k9635M066K7954j8649j4590K4220
$$ y = [-6968, -10025, 19623, 4029, -19875, 10082, 17445, -14875, -4370, 16745, -4407, -7307, 11803, -2356, -8963, 13231, 1641, -17559, 9706, 14803, -18661, -6027, 19725, -5551, -14761, 10978, 3062, -11828, 4491, 2333, -12184, 5297, 7545, -17326, -3263, 16375, -10792, -16269, 12544, 1932, -17502, 1351, 4457, -12052, -1130, 2907, -14531, -2816, 10004, -14714, -14197, 13547, -3148, -22182, 3590, 6857, -16547, -5144, 5306, -11433, -5595, 6179, -12450, -10546, 12607, -5345, -21098, 8283, 8899, -19711, -4595, 12860, -8932, -9415, 8131, -4709, -8732, 9807, -2881, -15072, 9991, 8312, -19425, -1354, 16869, -10443, -12534, 11275, -226, -11249, 5323, -181, -10735, 6980, 3458, -17093, 2618, 14727, -14908, -10842, 17112, -1537, -16127, 8093]
1343H093k159j7256J5838K359j8566J5881J0753k7664O789K8919k4028j6086L3387
1356A6260k016k8122J7953J2826k2644O381J5409k0551J251K3910k0207j4482
1368a4032L2134m004l1508K0951J7680k8786R46K3172j6975p520K1911j2523j4225
1381a2779K7431m271k9598K3751J7420l4178K001L0826j9081j5248K5961n046
1393G189j8750K1329P92k5602K0425J5674l4626M332L3936k3925j9896L2948j345
1406A2481k8232J8655J0687k6066J0681J8072k9264Q83L2834k3732k2276L7214
1418A1937O91l6996J8718K2296k9669j153K5884j8821r267K7844j4010k1029L2353
1431H778J900l6167J9757K5813l2889n209L2629j4319j8439K5662l557k1462K3599
$$ y = [8093, 5934, -11322, 4516, 6875, -11691, 4190, 14943, -12721, -5932, 22987, -1041, -17127, 16260, 14244, -13878, 4075, 16901, -5743, 638, 16047, -4504, -3253, 20657, 450, -14032, 18102, 14098, -17410, 3541, 21221, -7565, -6619, 16553, -422, -7942, 13969, 1446, -12779, 14652, 10381, -19217, 4534, 21954, -12224, -10223, 20603, 1522, -13726, 12235, 7189, -11561, 9768, 10560, -15042, 5383, 21057, -13569, -9237, 24699, 774, -19122, 13826, 12481, -15751, 2904, 13591, -12475, -1794, 16278, -12986, -12103, 20731, -3001, -25277, 11937, 12628, -24368, -5650, 16646, -13023, -14176, 11708, -7113, -16380, 11464, -2546, -23575, 8778, 10678, -25489, -5732, 20081, -12808, -18017, 14612, 293, -18146, 7516, 3959, -17503, 6096]
1444F096M353l1669J8395K3784l4992m717L7798j6711k6664K9632M998k9079J5580
1457c196J3454k7764R246K3194l0247n696L7184j7016k9689L3325J0047l6457
1469b3615J1209K4950k5558l079K5724j8604j0845L1224j1610k7246L1498J1064
1481A5112l8478J0366L2380k6586j3381L1101p760k0214K2935j38k3607K1157
1493B887J0372l2319R662K9346k7038j4998L4067m561k8090J9951J0589k4512
1505a4644J0297J4032k4317N053K5016k4378j2599L4999o253l2066K3753J8031
1517A6924l0925L153K5010j9153o337K4464j4005j4428K9026l237l0042K2873
1529C323J9660l3028p05L1554j6080j7126K4582k712j8281J8048K743k3221J5930
$$ y = [6096, 10449, -21220, -2825, 20959, -14033, -18750, 19048, 2337, -24327, 5305, 10303, -18776, -3196, 10258, -17506, -8260, 14934, -15313, -21009, 16175, -841, -30530, 2795, 12842, -23615, -12406, 12544, -13014, -16093, 9631, -8973, -19818, 11406, -204, -27450, 4048, 15112, -23366, -13000, 19380, -7206, -20587, 10514, 2754, -17460, 5475, 5337, -18270, 2887, 13259, -19060, -9398, 19948, -7090, -22088, 11979, 7418, -20672, -721, 9868, -14644, -4347, 9685, -14632, -9579, 15437, -8941, -21540, 13459, 7206, -24860, -1107, 16924, -14001, -10848, 14162, -4991, -11328, 13136, -869, -15297, 13729, 10492, -19550, 3323, 22983, -10045, -10750, 20804, 4724, -12402, 12180, 9468, -8813, 9235, 11978, -11243, 4687]
1542D687J5429k8897oL0297j6749k1002K6462L769k4900J2064J1357j9262O322
1555d29J4189k0613n33K5469j6024j8983K7939M790k9773J1424K0316k1120l090
1568f438J9010j2447o182J9277j0242j5640K4185K663k9220J3115K2868k5307
1580d358q324K6388q332j7080J7492l4j6655J4453N372k3302R910K0128k4073
1593h415q734K8697o992k3557J8312Q927k0154O258J0985j5296L073J5737j7531
1606h690o027K4954q041k2431K0722J0870k4247L633J8322j4003m318J5332r789
1619c713p285J8925o447j8776J9891R904k6973M029K4109j6487j2150K0145k379
1632B793j4337J2834J786j5887J2823R195k3083M092K3876j7576j4890K4626J248
$$ y = [4687, 20116, -8781, -8787, 21510, 4761, -16241, 10221, 13990, -10910, 1154, 12511, -6751, -429, 13760, -6853, -7386, 18083, 2059, -16924, 11015, 15805, -13968, -2544, 17772, -3348, -6438, 12572, 125, -6057, 13220, 2978, -12662, 11523, 14186, -15034, -1919, 20949, -4358, -12682, 13706, 5374, -11706, 5786, 5752, -10903, 3550, 8922, -14380, -4470, 15658, -8415, -17149, 11548, 4556, -19001, -689, 8238, -11916, -5658, 5327, -9969, -6896, 8841, -8690, -14717, 10237, 2196, -20235, 487, 11357, -12890, -9257, 9065, -4938, -9256, 6076, -3713, -10998, 7927, 1480, -17296, 2595, 12499, -14474, -10445, 13664, -2823, -14973, 5172, 2793, -11544, 1290, 3076, -12811, 12, 9207, -13876, -9784, 14092, -3484, -18374, 6252, 7500]
1645G500k2099J1145J1290j5900L257J2190j4646k11J9122j4220j3298K4620O99
1658I449k5023J2498J6738j9600k918J7551r219p059J4795o774j1363J8543K40
1671G858k2277J3465J6347k2609l703K2621q514j4406J5677Q52j3999J1857M154
1684G323j7991J0073J4823k1599l696K5808r689j9852J8950P692k0033N673J2848
1697A0330j4043N24J4192j3526n830K1520p452j9341J9118R852k3336K636J9802
1710A4446j2486q787J5526m315r429J3958k389j5147J5326P941k2545M293K1182
1723A7574j4881j2300J9596k79j5959J0531N296j3999P503Q384j7284L098J8112
1736A5392j4730j2250K1605P64k1279R970J2737j5745j007J3176j0321l626J4801
$$ y = [7500, -14599, -3454, 7836, -8064, -4807, 7383, -7263, -7474, 11648, -2572, -15870, 8750, 9449, -15574, -3076, 13662, -5938, -8856, 8695, -524, -7583, 7212, 438, -10925, 7618, 7858, -14419, -954, 15393, -7216, -10919, 11702, 3188, -11218, 4459, 5311, -8688, 3169, 7323, -10668, -595, 14228, -7371, -11067, 14741, 5052, -14800, 4150, 11842, -8191, -2518, 10330, -3713, -3189, 11003, -2523, -8353, 13167, 5715, -13626, 5492, 15344, -7992, -5356, 14446, 1960, -6827, 8699, 4384, -5045, 8913, 6524, -8623, 6703, 14644, -7901, -3608, 17574, 2693, -9607, 9989, 9710, -6249, 4282, 9578, -4421, 3082, 11466, -5818, -2720, 15392, 662, -11588, 10017, 10781, -10498, -528, 12209, -3536, -4543, 8633, -1688, -5314, 9487]
1749I487r247j1307J8557J164k1438J0230J6230j8222o024J8726n222j2047J2266
1762C153K29j1776J1032L629j6597P705J4017j6607o725K0242l796j6917J1808
1775f03P201j3699K960P953j0339J814J0236j2077m504J6592m466j6595J2932
1788b595R702j7555K05J4088q433n533J0778m768o627J2263k207j3558J1632R411
1802F803j7882k75J8267q314j1735J3511K384j1239N985M442r138M774P583j1771
1816f605j256J4704o766j2163J2958N489j4562K041J0179o931k866O760m339k909
1830f266Q268l443q818R840N033j3630J364J3066o851p948R259K010p077L529
1844a664K416n064M105M145r015J278J1543o902q372J1257L518j1310K273Q003
$$ y = [9487, 240, -11067, 7490, 8654, -12784, -2554, 13676, -4546, -10570, 8156, 2934, -9113, 3153, 3382, -8394, 2638, 6267, -10330, -2625, 11392, -5215, -11940, 8302, 4506, -12411, -603, 6598, -7101, -4141, 3812, -6527, -4713, 5523, -6554, -11058, 5534, 1068, -15527, -2595, 7107, -10448, -10243, 3845, -4588, -10121, 657, -4111, -10738, 1525, -682, -14240, -2608, 6803, -11079, -11354, 6913, -1401, -13136, 375, 2759, -8480, -2495, 1947, -7191, -2417, 5166, -6605, -7861, 6843, 77, -12086, 872, 6361, -8201, -6160, 4019, -2912, -5778, 982, -3357, -6266, 2002, -1441, -10259, -419, 4614, -9016, -7652, 5414, -1437, -9385, -126, 1884, -5193, -1664, 752, -4312, -207, 3938, -5077, -3799, 7744, 842, -7530, 3727, 7245, -4065, -1792, 6211]
1858F211n176k394N254l226k144P070l971p271R504L085j2636J761J1753p002
1872H18p975Q487K753q315K383M338n398J732M596p185m87J0132m977q578R722
1887B046N287j1174J54J0308l967n494O253j84l836N409j060o295O728M514j0573
1902a884K01J1384n272r345R185L320r495K040N360o267Q70N668p647j609J0380
1917F889n106j0266J0948N290j4314J675J1928p898n237R379k478n982Q323r95
1931B156r480R078O126j4526J581J5298r357j0104J4040K071j2935N769O858j0056
1945c481K226Q306j0438j941J3839p562j1798J4925L729j7598M860J2827j1765
1958c871m517J2013n130o957J0710k742j0841J1922M386j7310N623J5302j4207
$$ y = [6211, 1035, -1359, 3895, 669, -1475, 5595, 1624, -5647, 3857, 6942, -5694, -3933, 7820, 818, -7157, 1330, 4083, -4232, -1849, 2489, -2909, -1177, 3419, -3766, -4253, 5879, 902, -7676, 2046, 7333, -3841, -3687, 6621, 2654, -2840, 3413, 3229, -607, 4802, 3742, -2553, 4175, 8689, -1884, -1683, 9701, 4429, -4916, 4269, 7589, -1906, 134, 5494, -773, 97, 5765, -1882, -3491, 6889, 1783, -8483, 2465, 7755, -6559, -4884, 7044, -854, -6091, 3288, 810, -5172, 3151, 2156, -7324, 1754, 7880, -6646, -5065, 10233, 876, -9228, 4812, 6883, -6052, -283, 6575, -3481, -1255, 7051, -3387, -5328, 8511, 949, -10849, 4076, 7805, -9793, -4933, 7894, -3871, -8388, 3625, -1505, -8462, 2248, -494, -11335, 587, 4973, -12337, -6714, 8588, -5619]
1971e619p063J7287l375j2503J1457L257j2691Q023P563j5379L855J5944j4428
1984c672q389K0769k897j8308J3252Q981j6459K429J3033j2287k759J5559j0302
1997a050j0006J9111j733j9835J3131J2724k0174p40J8665j0546r744J5999k964
2010B838j2929J4450K469j8293J1047J3438k0095j332K2069j0857j4226J8688
2022G267K270j7190J0225Q675j6488N830J3610j7137k306K1143j1236j5411K0645
2035I897L548k2080R556J4163j7900o21J6660j3310o525J9619q209j6627K0339
2048H510M742k4750R427J8796k0241n788K2080q948j3958J8374q41j7705J5663
2061E361P437k2711P740J9941k0109q331K4980o415j9298J7979N761j9956R562
$$ y = [-5619, -12682, 4605, 1230, -11273, 184, 3441, -9250, -1227, 6336, -9043, -5188, 10756, -3672, -12061, 8708, 5811, -12497, 755, 9736, -6723, -4294, 8739, -3548, -6307, 9252, -1050, -11056, 8055, 6322, -13513, -382, 12342, -7832, -8572, 10093, -453, -10197, 5802, 2838, -10091, 4359, 6828, -11465, -418, 13020, -7075, -8407, 13662, 2805, -11421, 7267, 9537, -7653, 2572, 11247, -5241, 589, 14199, -2938, -5244, 15899, 4663, -10748, 9897, 13445, -8635, 921, 15084, -2816, -3437, 13223, -87, -6612, 13007, 4798, -11829, 8510, 13252, -11498, -2071, 16725, -3516, -9304, 12776, 3828, -10130, 8244, 7403, -10302, 5361, 12798, -9913, -2173, 17768, -2341, -10672, 14308, 7893, -11405, 6574, 12335, -7621, 1941]
2074A941J1598j9242L402J8505j7881q424K4960o743k1636J8886R508k3916N781
2087c261J7375j7567l388J9056j2577j0559K2096m725k1704J8940J1221k6440
2099a1533M038K3120j7846j0299K2826o272j6561J8864J731k1605J4933J3167
2111A4563k5661K536K5532j8098j4877K6278j564k3212J6239R462k2114Q091J5769
2124A2944k1143j270K3915j5550j6048K6313J83k6451J5442J5217k3958J723K0084
2137A1401j6318o803K1967j0577j6248K3662J404k6646J4992J8651k6545k045
2149a3105K5932j4202j4243K2867l517j9263J8788O120k5307J1860J9867k5967
2161a0170m699K9710j2825k1060K4882L867k4716J3483J3388k2849M542K0800
$$ y = [1941, 13539, -5703, -2301, 16204, -1677, -10101, 14859, 8116, -13520, 5366, 14874, -9042, -3261, 14114, -3453, -6841, 12215, -362, -10921, 11175, 6450, -15254, 3686, 14907, -11533, -7495, 15625, -2221, -12520, 10306, 4034, -12527, 6337, 8068, -13537, 1396, 14563, -11098, -8562, 16970, -1128, -16005, 10273, 8709, -14503, 1736, 11198, -10916, -2825, 12944, -8199, -9469, 14446, -1104, -17152, 9161, 9344, -17107, -1665, 13552, -10406, -8683, 11401, -4917, -11720, 10247, -330, -16578, 7084, 8488, -18158, -3166, 15485, -11060, -13105, 12827, -1375, -15618, 7249, 3732, -15531, 3257, 9377, -15930, -4070, 15797, -10170, -14869, 14841, 2016, -19044, 5838, 9705, -15011, -1528, 11860, -10989, -6447, 14353]
2173A4353k0866p422K8311j0460k3162K5096Q213k9070J0011K0687k2276l416
2185a0001K3198j4175j1967K4368n368k2940K2273J0168k9628P806K5124k2609
2197c751r823K6857q142j8770K1393K040k3098J6046J3021k7400M861K6591k1887
2210b062j3610L0057m707k5422K0334J0010k5211Q686J7709k2497j112K5521j7264
2223D32j6148K9386j630k9031J9110J6560k7913J697K3975j7548r809K4039r050
2236D070j8504K4092K306k8006J6069J9239k8501k123K8523j5267j7050K4701
2248I549j191k2054J7935Q066k5376J0997J9543k5840l958L0254j4577k1249K6562
2261H661M409k7293J3610J5888k3884K607K1635j9589q485K7921j0452k3032K5461
$$ y = [14353, -6513, -13935, 14376, 3916, -19246, 5850, 14063, -15007, -4996, 15691, -6585, -10001, 13197, -978, -12945, 11423, 6055, -16885, 5388, 15556, -14072, -6266, 18858, -3751, -13574, 13283, 5141, -13629, 7764, 9804, -13294, 2752, 15773, -11627, -6766, 19825, -2062, -15672, 14385, 9678, -15744, 4590, 14600, -10611, -1925, 15784, -6713, -7825, 17696, 432, -15716, 13670, 12040, -16991, 2119, 18679, -9234, -7537, 16438, -1110, -10919, 13120, 4070, -14434, 9658, 11964, -16042, 27, 19266, -9235, -11358, 17165, 1898, -15152, 9549, 8358, -13696, 4239, 12305, -13071, -2074, 17469, -8371, -12329, 17925, 3348, -17901, 8661, 13070, -14223, -613, 15275, -8609, -6002, 15633, -3956, -12441, 15480, 5028, -18004, 7457]
2274G457P780l0506J0372K2448k3358o157K5187j2323j5351K3885l094k3383K0620
2287C577J0805k9585P313K5592k2744j1434K8515o783k1623K0559N536k3600J2799
2300a073J4410k4860L117K5135k0038j3440K8887l694k6180J9546J2266k5512
2312a1436N907J9613k0476l601K3817j4514j5326K6547j726k7240J8308J6269
2324A6142k7839P91K5373j7074j2011K3899o286j8974K1267L596k5810J4424J8223
2337A5721k6752k177K8595j4764j8009K5054J001k3227J5711J0584k3091P977
2349c377J8538k1886m207K6781j2501j9788K4930M756k6324J1941J6713k2048
2361f472M05K0435j6036q510K3612q562j9866K2711O792k7795J0130K1042k2220
$$ y = [7457, 15237, -15269, -4897, 17551, -5807, -11964, 13223, 900, -14451, 9434, 6340, -17043, 3577, 14382, -15203, -7890, 17702, -5042, -16476, 12039, 5256, -16367, 4192, 9728, -13872, -1073, 13337, -11523, -8406, 16729, -3309, -16749, 12138, 8444, -17736, 1810, 14076, -11436, -5529, 14084, -6392, -9993, 13824, -690, -16016, 10531, 8805, -18435, -127, 16142, -11697, -10906, 14467, -2607, -14618, 9281, 2995, -15979, 5288, 8884, -16926, -2502, 15721, -11031, -13208, 15387, 623, -17386, 7668, 8669, -14558, 1153, 11737, -11354, -3377, 15161, -6725, -10932, 15849, 3348, -16440, 8490, 13246, -13078, -1137, 15576, -6472, -6067, 14368, -1668, -10178, 13434, 4872, -14994, 7717, 14509, -13286, -3156, 17886, -4334]
2374d334o105K4334j0901j4527K1068j890j9902J7456R091k5250P348K2445k1288
2387b455r647K7361p285k0533J9673N831k2043J0806J3468k1306K415K1164j7934
2400d85j0785K6022m669k3800J8837J0705k4305N341J8199j7774m168J9930j1795
2413A253j2359K1973k516k2622J6930J2587k4932K492K2095j6054j0052K1248
2425A0043o009j5497J7887J998k0788J3353J3636k3766R08K4360j5626j4107K3142
2438I534r73k0340J4571Q348j9952P056J5135j9213k555K2830j3088j5816K3211
2451H748J512k3812J2577J4194k0752P58J8089j4344o883J9946q536j5496K0002
2464F003L278k3542J1331J6631k0846l027K1183j0689j2085J8430k302j6283J5390
$$ y = [-4334, -10439, 13895, 2994, -11533, 9535, 7645, -12257, 5199, 14290, -10960, -3612, 18833, -2455, -12102, 15259, 7974, -12559, 7114, 12945, -9098, 1708, 15176, -6130, -3715, 17449, -485, -11270, 14752, 10083, -13717, 5120, 15825, -8480, -3139, 15060, -2714, -6882, 13048, 1253, -11106, 10867, 8351, -14271, 2659, 15246, -9686, -7194, 14901, -1153, -11205, 10043, 4034, -11463, 6424, 8422, -12366, 987, 14623, -9143, -8235, 16125, 499, -13608, 9534, 8561, -11779, 2792, 11140, -8812, -1756, 13379, -5834, -8389, 14441, 1353, -14463, 8748, 10260, -13552, -975, 13219, -7533, -6775, 11314, -3030, -9913, 10033, 1497, -13999, 6003, 9281, -14261, -2930, 13701, -7145, -10172, 11011, 322, -11763, 6667, 4365, -11918, 3472]
2477C472N658k1036Q905J7017k0474m624K3420r745j6217J8933K600j8994J0887
2490a98R995j8750M135J6962j7439o462K2856p958j8565J8820O557k2160P384
2503d823J5334j6819k323J7579j1227r542J9447m130j8205J6729Q742k2458N248
2516f448J8664j5884p242J9143n994j3167J5695J043j6976J2481R502k0239L777
2529e645J9066j5426r369K0700l352j7234J4001O480j7559P190J1925j6983L32
2542e874J7982j3009j0541K0688j808j9698J3566J0613j8914K337J5700j3020
2554a978n175J7041p974j1748J7502O73j9109J1668J2492j8814q65J8326j0125
2567A914j0286J6177j694j3903J2433M322j6566P855J2410j6893k335J8658q839
$$ y = [3472, 9130, -11906, -3001, 14016, -6458, -11082, 12338, 2593, -13624, 5309, 7909, -11085, -198, 9797, -8953, -4818, 12144, -5295, -11757, 11099, 3141, -15424, 3396, 9953, -12207, -4823, 10511, -6308, -8631, 8948, -2279, -11821, 7626, 3496, -14709, 2020, 10762, -11696, -6448, 12216, -3668, -10910, 8233, 2239, -10928, 4767, 5810, -11166, 1315, 10817, -9422, -5645, 13421, -2005, -11374, 9326, 5974, -11260, 2741, 9221, -8338, -1148, 10777, -6206, -5874, 12108, -901, -11442, 9246, 7438, -12260, 1306, 11919, -6995, -4658, 11042, -1978, -7153, 9888, 1914, -9834, 7668, 8341, -10768, 900, 13392, -5422, -6287, 12039, 1914, -8372, 7805, 6111, -7792, 4641, 8963, -7603, 252, 12662, -4231, -6566, 12092, 3253]
2580C253j2971J5782K148j6000Q278Q693j4263K784J2220j3064l700J6739p339
2593B560j3383J5624M037j7944O740J2414j3781k349J3949q136p283J4177l593
2606C032j2758J3103N095j7298N072J4263j3018n999J5424m066j1216J1238J980
2619D852j2296P881O535j3867K545J3178j1295p169J5729k242j3485R622O348
2632F336j2553K824R179r919j020J1175p749o820J3223j000j3322Q820Q239j3253
2646e840K05J1496p208n097R952k962p418R597O82j1331P113P910j2292j071J2870
2661F606o087q422J0408Q70r541N904M191r287L419P397r333j928J1626m718r589
2676h484J0146L456j1062L177P618p580j091P313m852l161Q144k726p601Q266
$$ y = [3253, -9718, 6064, 8212, -7788, 490, 9183, -5080, -2296, 9924, -3140, -6840, 9899, 2560, -10823, 4801, 8838, -9106, -2366, 10048, -3733, -6082, 7867, -269, -7552, 6625, 3032, -9726, 3377, 8472, -8826, -3754, 10509, -2509, -8508, 6916, 2850, -8366, 2872, 4852, -7444, 437, 6972, -6895, -4350, 8828, -2467, -9636, 6093, 3851, -9634, -12, 6336, -6217, -3393, 5786, -4133, -5153, 6022, -1727, -8547, 4676, 3676, -9646, -826, 7413, -5840, -5635, 5861, -1347, -6444, 3508, 546, -6872, 2725, 3407, -7924, -811, 7099, -5193, -6264, 6606, 519, -7903, 2505, 3375, -6166, -262, 3929, -5358, -1939, 5458, -3875, -5803, 5823, 1105, -8484, 1662, 5118, -5944, -2767, 4851, -2729, -3820, 3493, -1359, -4520, 3624, 898, -6703, 1563]
2690A563L358j0479K364Q778o810l854Q050j801n094N462J48n819N199K807p939
2705d067J689Q186o619m647R186l45p701M450L759n701J259M022m969L5O310m613
2721B34m467Q332J57q474M028O216o616j594N990k392k984M564j171m054N306
2736C075P93o968L382N793o628k360P134r73n375L366K292l960J106K046l506
2751g83J202M148m754j885O417j258o161L915L718m871p92L811j587j490K609
2766B239j907j443M244j151n065L926L445n629j163N692j413m511L187J434k841
2781i56J167R74k981J895K571m778q54N607j343n330L529L415m637o89L819j574
2797a65j605K191j176j503L467r02m098L479L053m947j330N353r12m094K597J451
$$ y = [1563, 4921, -5558, -3194, 5584, -1226, -5080, 2970, 1169, -3925, 1537, 1685, -4134, 1065, 3872, -4067, -2378, 5808, -811, -5458, 3728, 3383, -4318, 132, 3891, -1810, -551, 3471, -1498, -1463, 4847, 234, -4233, 4099, 4256, -4218, -190, 6026, -590, -2184, 3806, 1414, -1570, 2994, 1823, -2231, 3075, 3868, -3100, 282, 6075, -553, -2913, 4221, 3248, -2127, 1239, 3531, -429, 677, 2723, -783, 419, 4567, -187, -2072, 4345, 3087, -3074, 841, 4559, -312, -1104, 2707, 1120, -370, 2239, 332, -1111, 3133, 1982, -3083, 843, 4288, -1341, -2504, 3188, 1775, -2736, 451, 1885, -956, 211, 1185, -1796, 99, 2670, -2108, -2962, 2645, 1302, -4028, -499, 2916, -1721, -2410, 1409, -165, -1770, 421, -755, -2258, 1209, 307, -3791, -312, 2741, -2206, -3536, 1817, 905, -3189, -592, 859]
2813H59k354J044L24k258J844J930m085l85N300k074m604L625K864m355j29L156
2829G02j577p14J695j544n03L052j532l764M174K584n610j03N722k332l684L383
2845e1R56k534J377O71k603K212K166m644L9N839k764n057M850K439n206O05L403
2862A698k150j002K422k092n79L919k164l977M752K105o107R16N296k950l076
2877b989L668M43k524J941r0k753L446J370n476J453N842m367l547N754P78m975
2893b026J830K447k692N63K270l491M16M857l859l653O578M53o752K613M993m614
2909f7j724M362j500k199L545j677k985M851N47o334K877N627n755k789O506n55
2925B730n249L474J939m002K109J685m514J847M664n436k217P251j282o628M196
$$ y = [859, -1495, -451, -127, -2385, -541, 1389, -2696, -3081, 2219, 145, -4459, -834, 2030, -2325, -2454, 702, -875, -1589, 106, -1438, -1941, 1111, -421, -4185, -11, 2573, -3037, -3140, 2582, 250, -3434, -51, 905, -1629, -252, 419, -2184, 28, 2194, -2450, -2411, 3428, 664, -4393, 457, 2896, -2310, -1705, 1698, -452, -1454, 968, -1124, -1703, 2216, 52, -3925, 827, 2932, -3175, -2259, 3037, 87, -2989, 679, 1122, -1402, 539, 449, -2304, 1142, 2512, -2964, -1511, 4331, -36, -3583, 2171, 2949, -2026, -196, 2251, -441, 122, 2392, -1099, -683, 4174, 315, -3338, 3240, 3693, -3059, -446, 4547, -67, -1791, 2571, 1071, -1128, 2417, 740, -2245, 2606, 3153, -3181, -304, 5323, -432, -3221, 3285, 2730, -2519, 955, 2894, -1108, 1001, 2686, -1828, 19, 4683, -753, -2970, 4281, 2999, -3629, 567]
2940E67L832n799J97M165l275o61M198l956k075O482j648o796N456M320p846l57
2956c196P084l559l987N065o37m025M528M0n759M381M185p701o07Q585l874o274
2972e751O621K157o761K316L739n126J244M585n839r48P717l800o594P569K932
2987D061q823J996O571n653j697N577l016k868O239k226o047P079K381r121K078
3002c469Q480o644m419Q491j456n998N496J078o088M236L531q167J780Q304o762
3017a607n075J0215o90r184N639M993p764J256N747n999o14P360m958n183R391
3032C527J90j0254N671O698q835j243Q387l988m372O729j239n793O714J280r077
3047e605M683P283r334k076J0595l774p542P793J721p729M121L860p604K473P359
$$ y = [567, 4399, -1400, -1203, 2962, -313, -974, 3224, -732, -2807, 3675, 2027, -4769, 687, 5007, -2839, -3196, 3888, 329, -3658, 1407, 770, -3255, 1273, 1313, -4446, -65, 4120, -3581, -4188, 4397, 523, -5751, 870, 3027, -3734, -1418, 2321, -2805, -1561, 3024, -2815, -3763, 3954, 154, -6440, 1129, 4061, -4762, -2766, 3805, -1848, -3545, 2032, -984, -3852, 2387, 161, -5886, 1193, 3574, -5547, -3469, 5011, -1633, -6052, 2439, 983, -5015, 481, 1559, -4529, -293, 3238, -4929, -3149, 5155, -1607, -6682, 3533, 2843, -6341, -702, 4291, -3473, -2217, 3530, -2469, -3083, 4277, -681, -5864, 3527, 3717, -6537, -866, 5832, -3003, -4246, 4141, 153, -4219, 2510, 1271, -4522, 2192, 3472, -5605, -922, 6361, -2973, -5049, 5546, 1772, -5770, 2023, 3744, -3985, 136, 3996, -3608, -1135, 6224]
3062F224q443k517J1016l745r321R056L891j0507K785P382p140j142P651n402
3076b12l844R447k628q853Q602M627j1827K117J0191p647m523R217k133o707P359
3091C186N33q434O208N126j0724J444J0522p572o310J0770j26r525N904M278q461
3106c181K570O432q270m26R891o666o613J1082K46j1128N863P022r493k22Q477
3121E584o093l318Q867m174o676R680P80j1455O163Q016j0642j958J1102m973
3135I03o787Q622j82q090O935K732r998M367Q076j0182k443J1882m345r204R050
3150A336K952r748M004N729q243R72P795p648k911J1045m117r176R181L870j1187
3165f146K950Q397p728k199Q490m775m492Q672j966q386Q303M038j1261K514R778
$$ y = [6224, -2219, -4736, 6280, 2535, -6786, 2270, 6161, -4346, -1561, 5821, -1319, -2461, 5190, -212, -4056, 5391, 2763, -6090, 2512, 7139, -4688, -2571, 7620, -27, -4550, 4667, 2534, -4173, 3186, 3719, -4715, 1493, 6619, -4105, -2661, 7861, 289, -6021, 4749, 4623, -4902, 1002, 5280, -3181, -611, 5821, -2449, -2875, 7016, 350, -6263, 4819, 5065, -6063, -200, 6822, -2671, -2893, 5584, -509, -3827, 5040, 866, -5810, 3870, 4650, -6805, -642, 7374, -3268, -5226, 5876, 903, -5884, 2738, 2556, -5534, 1401, 4133, -5865, -1498, 6578, -3604, -6047, 5835, 1490, -7714, 1336, 4288, -5460, -1456, 4273, -3970, -2998, 4797, -2851, -5762, 5283, 1166, -8010, 1171, 5041, -6146, -3196, 5201, -2527, -4726, 3764, -1011, -5503, 3169, 1203, -7183, 1120, 5158, -6103, -3589, 6189]
3180F189p988m616J0023k148p240P337P79q245O081M359r967J784J0098q074n427
3195g055J1058j220r491O899M187q739K611O336p861P3Q529o429n069J0483p23
3210C589j0244O778N958r498L28Q219n797l052P713l285n505Q314k08r240O426
3225D96O081j0156o8R752n506n652Q409j125o621O502J305q300N082N614r336
3240c523l89J0323n680o592R295O03q636M691M306p431K075O163p252j162R008
3255E799m811o681R223J386r871M143O795p877n10P167m832k999P440l009n955
3270d592P956J005r361M356P239q461j893Q875l861n247O914p31o060N898J758
3285C795q223M035O342q295j951R485l387p104P255J684p195L686L822o903J746
$$ y = [6189, -1799, -6415, 3608, 1460, -5780, 1557, 2336, -5909, 172, 4531, -5436, -3652, 6446, -1628, -7055, 4003, 2783, -6708, 191, 4378, -4361, -1750, 4586, -3275, -3202, 5327, -1102, -6171, 4312, 3589, -6655, 123, 6081, -3417, -3089, 5130, -667, -3719, 3994, 709, -4796, 3518, 3310, -5930, 496, 6577, -3579, -3647, 6105, 599, -5053, 3356, 2231, -4390, 2112, 3417, -4883, 199, 5813, -3523, -3912, 6411, 731, -5861, 3434, 4037, -4599, 92, 4398, -3033, -958, 5205, -2047, -3209, 5799, 988, -5693, 3530, 4916, -4955, -812, 5983, -1894, -2404, 4763, -69, -3068, 4372, 1363, -4592, 3364, 4369, -4992, -636, 6603, -1858, -3751, 5124, 1263, -3984, 2930, 2199, -3861, 2037, 3795, -4428, -393, 5949, -2346, -4297, 5188, 1801, -5303, 1952, 3636, -3559, 127, 3949, -2954, -1208]
3300a208N954o574k295R067l253p577P660K581q586K482O170o113j340O343m089
3315g78l013O888k029o804O796L120r246K209P471o363l063P386k313m783N761
3330A239l06n845N035K976q092K259P314o538l616Q377j444o719N565K174o242
3345c863K798L931o420J141O483n614l802Q369j191p693N547L964p226R85N618
3360C027m974j299N886l491l442O786n18p620N492M457p948K46P336m307l635
3375d004N865r83m364M662P07n969M264L934p294L50P434m498m360O632J25n499
3391b998L399K438n147J996L584n244l4O486m170m482P014N67p031L340M217n415
3407a480p5M836l663j597N386k602m491O278P65p050L296N062n838j427N794j992
$$ y = [-1208, 4746, -1828, -4123, 4944, 1691, -5886, 1774, 4355, -4231, -1749, 4421, -1692, -3032, 3311, -778, -3791, 3097, 1068, -5736, 1060, 4180, -5066, -2857, 4614, -1749, -4812, 2574, 261, -4522, 1239, 933, -4912, 123, 3099, -4993, -2734, 4580, -1958, -5574, 2803, 1359, -5360, 205, 2379, -3863, -1065, 2866, -3554, -2413, 4070, -1544, -5346, 3023, 1832, -5861, -314, 3650, -3576, -2591, 3027, -1947, -3246, 2640, -851, -4293, 2493, 1975, -5645, -153, 4304, -3644, -3398, 3938, -369, -4004, 1861, 878, -3486, 1176, 1883, -4086, 178, 4112, -3182, -2832, 4602, 104, -4256, 2376, 2501, -2998, 401, 2839, -2308, -312, 3272, -1972, -2006, 4480, 310, -4172, 2842, 3409, -3622, -282, 3935, -1480, -1555, 3281, -382, -1979, 3407, 805, -3686, 2592, 3357, -3693, -397, 4665, -1173, -2600, 3194, 1202]
3423A202l585M326k99l777L797J313n682K526M674n696j463O311j821m788M259
3438A297J482m473J793K511m046J266L504m221j174N686k286m785M915J803n313
3453b041J178L754l309o77L478k520j643M524j515m283M668J638n771J207M962
3468C650l792k214M332r39k843L150k46l349L041J603m798J299M474l938k417
3483b987M781k90m113K468J654k956J209J601l438J116L145l311j763M559q27
3498H48m017K701K241l609K41K794k512l28K823k646r46L940j573l566L260K169
3514A820m465N20L616k209j748K815q43j665K723j025k270K761J179m025Q34M081
3530B099k753k269L283K08k498J619N96k093J698R74l138J068L101k795j789L938
$$ y = [1202, -2383, 1943, 1644, -2133, 1664, 2977, -2705, -179, 4495, -1201, -2664, 3647, 1826, -2962, 1297, 2779, -1694, 99, 2610, -1436, -170, 3334, -887, -2061, 3625, 1339, -3446, 1469, 3272, -2041, -863, 2891, -418, -1095, 2383, -137, -1780, 2744, 1229, -3054, 1614, 3252, -2519, -1312, 3650, -142, -2356, 1976, 1037, -1806, 1344, 1098, -2251, 790, 2393, -2405, -1106, 3368, -570, -2987, 1794, 1504, -2609, -141, 1513, -1443, -234, 1367, -2071, -955, 2190, -1121, -2884, 1675, 848, -3169, -468, 1773, -1836, -1595, 1199, -1313, -1641, 1182, -1464, -2410, 1530, -43, -3609, -349, 1820, -2645, -2125, 1491, -718, -2466, 349, -494, -2159, 564, -461, -2731, 30, 1209, -2816, -1982, 2099, -654, -2923, 360, 568, -1930, -311, 285, -1808, -110, 864, -2274, -1206, 1895, -900, -2689, 1249]
3546A249j33l351J683J850k445N49J383j945N08K197k609r09L787r00l556K664
3562B2K098l550K73K528j714n97K134j536r74L127j269k795L251J574m009M18
3578a019L707k192j667K588l26j763J914k93k178K524R55l721J194L503l034j898
3594a706L409l1k865J663Q81k123J219Q91k525J161K558l166j360M212q45l501
3610b128K495J848l058J97K091j987K53K237k586p56L594j048l684L098K198m135
3626a371K71L438k030j470K584j143j371K706q27k732K717J867m483L71M150k472
3642B05k626L548q4k777K044L31k388J807J348l377O99L477l164j971M182k6l822
3659b594K321J679k812M76J978k569L19L012k746j689M366n81m359K730K746m182
$$ y = [1249, 1116, -2235, -552, 1298, -1147, -598, 785, -1160, -652, 1545, -1064, -1973, 1814, 914, -2642, 22, 2120, -1430, -1157, 1371, -343, -940, 1194, -342, -1316, 1811, 542, -2253, 998, 2572, -1437, -1019, 2688, 496, -1171, 1417, 1091, -672, 1242, 949, -1229, 1295, 2250, -1471, -277, 3226, 192, -1706, 1703, 1672, -1193, 470, 1351, -772, 447, 1338, -1187, -26, 2532, -634, -1994, 2218, 1373, -2128, 367, 2215, -843, -646, 1445, -542, -289, 1948, -638, -1394, 2200, 1152, -2532, 566, 2764, -1371, -1100, 2338, 308, -1162, 1422, 279, -1092, 1614, 787, -1945, 772, 2639, -1844, -1473, 2677, 205, -2421, 1127, 1043, -1734, 310, 641, -1747, 60, 1408, -1969, -1270, 2207, -957, -2928, 1254, 1228, -2594, -273, 1406, -1406, -930, 1048, -1521, -1202, 1810, -936, -2625, 1741, 1160, -3199, -469, 2277, -1905]
3675a905K22K971j912j196K694j473j715L364m13m262L135K706m508l52M366k068
3691c46k653L230r1k432J976M33k687J980K177m072n6M483k403l106L990Q30l607
3708b354J778J622k585J003J924k837J21L628k610k449M279M20m515K010K847
3723B282l186l55K520j705p60K807j617k276L811m0m299K232L371l907j008M083
3739A953j313k507K745p5k114K276M48l178J856K988m017q88M522j334l343L094
3755A113J048k718Q85J624k656J231K076l080l56L833k154k960L720R19l584R59
3771a00K497k503k35K169j930m69K974j992k585L902O57m292J305L515l120j020
3787a227K932j005j539K250o95k085K702N22l825J999L102l568j199L906q94k796
$$ y = [-1905, -1683, 1288, -624, -1820, 874, -599, -2314, 1050, 637, -3625, -490, 2216, -2292, -2644, 1722, -346, -2999, 231, 140, -2292, -316, 117, -2570, -590, 1587, -2485, -2541, 1942, -461, -3567, 423, 1253, -2354, -576, 1046, -1539, -536, 1388, -1449, -1328, 2300, -310, -2759, 1520, 1940, -2575, -565, 2282, -904, -1259, 1261, -444, -1204, 1603, -14, -2290, 1521, 1481, -2818, -586, 2785, -1122, -2130, 1953, 640, -1867, 878, 803, -1311, 965, 1413, -1765, 91, 3079, -938, -1826, 2696, 1362, -1981, 1113, 2161, -557, 328, 1952, -704, 527, 2603, -477, -833, 3000, 846, -2114, 1606, 2525, -1059, -100, 2397, -106, -341, 1828, -102, -571, 2403, 411, -2174, 1728, 2385, -1907, -602, 2913, -207, -1227, 1705, 700, -839, 1411, 716, -1369, 1333, 1855, -1970, 29, 3131, -437, -1636, 2270, 1376, -1420]
3803a420K194O14k011J384P67k783J463K435l427q85M161j466l315L042J058k873
3819a062O42J665j986L31J711k390l13L321j715l045L669R76l741P56K957k588
3835h12o52K359j484o73K450j369k316L490N62m157J456L541l193j487L156n64
3851C07k107K120k8k048K171M96l390J874K668l420j064L750r37k839K211Q69
3867F33k333R87J125k193J105K162l067n48L926j363l424L048J555l174N99K223
3883A261k102n2K138j937o14K960j537k882L625J349m387J083L222k316j547K678
3899I42o39j498K068l95k211K494J092l800J176L299k985j655L682k51k687J663
3915B95R91k223J250J141k635R53K563k749j194L585l77l380K080J704k379J07
$$ y = [-1420, 774, 1388, -623, 761, 1528, -1255, 208, 2643, -784, -1669, 2492, 1026, -2289, 753, 1811, -1062, -420, 1245, -741, -410, 1301, -1089, -1402, 1919, 204, -2841, 828, 1804, -1937, -1181, 1776, -812, -1464, 895, -589, -1262, 1188, -181, -2497, 993, 1555, -2602, -1146, 2395, -798, -2285, 871, 307, -1800, 320, 292, -1756, 415, 911, -2479, -605, 2063, -1357, -2421, 1329, 392, -2447, -236, 633, -1700, -713, 412, -1781, -676, 1486, -1581, -2129, 1797, 434, -2990, 58, 1613, -1561, -962, 1261, -841, -893, 1245, -692, -1306, 1654, 117, -2765, 860, 2209, -2178, -1095, 2127, -189, -1736, 942, 303, -1195, 873, 478, -1733, 761, 1853, -1947, -771, 2528, -457, -2112, 1570, 1319, -1368, 295, 1286, -937, 313, 1454, -1181, -228, 2335, -414, -1608, 1977, 1600, -1780, 300, 2004, -375, -268]
3931b68J863j869N5K107k169q36L321q48l126K584J838l346q8L073j639j488K196
3948A360q36j289K374l55k707K349J515l364N7L397j758k222K557N28k334J134
3964D06P52j671Q94J127k325K22K676j764k132K902N98k882P22J934j692j86J423
3981A004j245j12J683j265j214K307J54l018J104K489k290q10J957m76j244J416
3997D40n65r97J765L6k228J230J920k632o25K676o19j851J068Q48j374M35M80
4014Gj322O81J132j517o05K361o95k082J420J273j703l41J260m11k88O37o50K13
4032f30Q93p58j184J509R53j935p6J784o52j051O06K84p9K60l19n12R67K20j583
4051a303O37J358r85j047J472J61r77J69M56K2J59l43l79M75O15j051n96J530
$$ y = [-268, 1595, -274, -219, 1888, -281, -1117, 2204, 1356, -1770, 814, 2652, -694, -782, 2291, 652, -836, 1360, 524, -765, 1609, 1254, -1453, 896, 2411, -953, -896, 2501, 743, -1479, 1078, 1606, -728, 406, 1158, -513, 381, 1508, -817, -595, 2081, 317, -1815, 1087, 1685, -1197, -475, 1459, -233, -419, 1004, -241, -353, 1330, 65, -1149, 1158, 1312, -1706, -602, 1887, -403, -1213, 744, 268, -976, 440, -125, -1122, 643, 679, -1549, -319, 1601, -1031, -1656, 1020, 401, -1450, -382, 466, -908, -473, 7, -1315, -634, 498, -1019, -1624, 737, 42, -2040, -620, 653, -1050, -1391, -131, -542, -830, -193, -843, -630, 263, -495, -1679, -170, 783, -1152, -1228, 556, -96, -1147, -541, -257, -336, -76, -395, -907, 60, 280, -1303, -666, 692, -293, -1340, 132, 293, -684, -515, -59, -37, 122, -221, -600, -125, 490, -561, -1157, 373]
4069C73K57j147J9J253n15n34L26L00K4k28l15L61O88l03q94O62N90m54o36O12
4089D39N34l42p43L88N11m00k76L5N80k86m70K27N72j04o49lN98L65o29m97R06
$$ y = [373, 630, -517, -498, 755, 240, -294, 32, 332, 356, 128, -187, 174, 862, 559, -335, 327, 917, 463, -173, 439, 973, 631, -112, 276, 787, 387, 111, 146, 726, 440, -30, 197, 769, 665, 16, 13, 611, 976, 347, -150, 756]
$$ [...]
8191b04
##END NTUPLES=NMR FID
##END=
