##TITLE=1H_SA_Ac.I
 CDCl3, 8 sc, 
 3.08.2021
##JCAMPDX= 6.0         $$ Bruker NMR JCAMP-DX V2.0
##DATA TYPE= NMR FID
##DATA CLASS= NTUPLES
##ORIGIN= UXNMR, Bruker Analytische Messtechnik GmbH
##OWNER= root
$$ XWIN-NMR		Version 3.5
$$ Tue Aug  3 09:32:24 2021 Russian Standard Time (UT+4h)  she@DPX200
##.OBSERVE FREQUENCY= 200.131506
##.OBSERVE NUCLEUS= ^1H
##.DELAY= (6, 6)
##.ACQUISITION MODE= SIMULTANEOUS
##.ACQUISITION SCHEME= undefined
##.AVERAGES= 8
##.DIGITISER RES= 18
##SPECTROMETER/DATA SYSTEM= spect
##.PULSE SEQUENCE= zg30
##.SOLVENT NAME= CDCl3
##.SHIFT REFERENCE= (INTERNAL, CDCl3, 0, 15.7039)
##AUDIT TRAIL= $$ (NUMBER, WHEN, WHO, WHERE, WHAT)
$$ ##TITLE= Audit trail, XWIN-NMR		Version 3.5
$$ ##JCAMPDX= 5.01
$$ ##ORIGIN= Bruker BioSpin GmbH
$$ ##OWNER= she
$$ F:/spectra/data/she/nmr/H-F/1/audita.txt
$$ ##AUDIT TRAIL=  $$ (NUMBER, WHEN, WHO, WHERE, WHAT)
(   1,<2021-08-03 09:30:46.48 +0400>,<she>,<DPX200>,
      <created by zg, POWCHK disabled, PULCHK disabled
       configuration hash MD5:
       00 E9 B6 7A A2 85 ED C7 34 08 36 98 17 FE 4E 26
       data hash MD5: 16K
       67 91 21 7F 68 60 3D 3A A2 1C 16 79 C0 90 A5 84>)
$$ ##END=
$$ 
$$ hash MD5
$$ 67 E1 C2 8F 80 25 0D 4F 01 88 19 99 68 21 9D CC
##$RELAX= 
##$RELAX= 
##$RELAX= 
##$RELAX= 
##$RELAX= 
##$RELAX= 
$$ Bruker specific parameters
$$ --------------------------
##$DU= <F:/spectra>
##$EXPNO= 1
##$NAME= <H-F>
##$PROCNO= 1
##$TYPE= <nmr>
##$USER= <she>
##$AMP= (0..31)
100 100 100 100 100 100 100 100 100 100 100 100 100 100 100 100 100 100 
100 100 100 100 100 100 100 100 100 100 100 100 100 100 
##$AQSEQ= 0
##$AQ_mod= 1
##$AUNM= <au_zg>
##$AUTOPOS= <>
##$BF1= 200.13
##$BF2= 200.13
##$BF3= 200.13
##$BF4= 200.13
##$BF5= 200.13
##$BF6= 200.13
##$BF7= 200.13
##$BF8= 200.13
##$BYTORDA= 1
##$CFDGTYP= 0
##$CFRGTYP= 5
##$CHEMSTR= <none>
##$CNST= (0..31)
1 1 145 1 1 1 1 1 1 1 1 1 1 1 1 1 1 1 1 1 1 1 1 1 1 1 1 1 1 1 1 1 
##$CPDPRG= <>
##$CPDPRG1= <>
##$CPDPRG2= <>
##$CPDPRG3= <>
##$CPDPRG4= <mlev>
##$CPDPRG5= <mlev>
##$CPDPRG6= <mlev>
##$CPDPRG7= <mlev>
##$CPDPRG8= <mlev>
##$CPDPRGB= <>
##$CPDPRGT= <>
##$D= (0..31)
0 1.2 0 0 0 0 0 0 0 0.06 0 0.03 0 0 0 0 0.0002 0 0 0 0 0 0 0 0 0 0 0 0 
0 0 0 
##$DATE= 1627968645
##$DBL= (0..7)
120 120 120 120 120 120 120 120 
##$DBP= (0..7)
150 150 150 150 150 150 150 150 
##$DBP07= 0
##$DBPNAM0= <>
##$DBPNAM1= <>
##$DBPNAM2= <>
##$DBPNAM3= <>
##$DBPNAM4= <>
##$DBPNAM5= <>
##$DBPNAM6= <>
##$DBPNAM7= <>
##$DBPOAL= (0..7)
0.5 0.5 0.5 0.5 0.5 0.5 0.5 0.5 
##$DBPOFFS= (0..7)
0 0 0 0 0 0 0 0 
##$DE= 6
##$DECBNUC= <off>
##$DECIM= 32
##$DECNUC= <off>
##$DECSTAT= 4
##$DIGMOD= 1
##$DIGTYP= 9
##$DL= (0..7)
0 120 120 120 120 120 120 120 
##$DP= (0..7)
150 150 150 150 150 150 150 150 
##$DP07= 0
##$DPNAME0= <>
##$DPNAME1= <>
##$DPNAME2= <>
##$DPNAME3= <>
##$DPNAME4= <>
##$DPNAME5= <>
##$DPNAME6= <>
##$DPNAME7= <>
##$DPOAL= (0..7)
0.5 0.5 0.5 0.5 0.5 0.5 0.5 0.5 
##$DPOFFS= (0..7)
0 0 0 0 0 0 0 0 
##$DQDMODE= 0
##$DR= 18
##$DS= 0
##$DSLIST= <SSSSSSSSSSSSSSS>
$$ [...]
##$SUBNAM2= <"">
##$SUBNAM3= <"">
##$SUBNAM4= <"">
##$SUBNAM5= <"">
##$SUBNAM6= <"">
##$SUBNAM7= <"">
##$SUBNAM8= <"">
##$SUBNAM9= <"">
##$SW= 20.0188882624521
##$SWIBOX= (0..15)
0 0 2 0 0 0 0 0 0 0 0 0 0 0 0 0 
##$SW_h= 4006.41025641026
##$TD= 16384
##$TD0= 1
##$TE= 0
##$TE2= 300
##$TE3= 300
##$TEG= 300
##$TL= (0..7)
0 120 120 120 120 120 120 120 
##$TP= (0..7)
150 150 150 150 150 150 150 150 
##$TP07= 0
##$TPNAME0= <>
##$TPNAME1= <>
##$TPNAME2= <>
##$TPNAME3= <>
##$TPNAME4= <>
##$TPNAME5= <>
##$TPNAME6= <>
##$TPNAME7= <>
##$TPOAL= (0..7)
0.5 0.5 0.5 0.5 0.5 0.5 0.5 0.5 
##$TPOFFS= (0..7)
0 0 0 0 0 0 0 0 
##$TUNHIN= 0
##$TUNHOUT= 0
##$TUNXOUT= 0
##$USERA1= <user>
##$USERA2= <user>
##$USERA3= <user>
##$USERA4= <user>
##$USERA5= <user>
##$V9= 5
##$VALIST= <valist>
##$VCLIST= <CCCCCCCCCCCCCCC>
##$VD= 0
##$VDLIST= <DDDDDDDDDDDDDDD>
##$VPLIST= <PPPPPPPPPPPPPPP>
##$VTLIST= <TTTTTTTTTTTTTTT>
##$WBST= 1024
##$WBSW= 4
##$XGAIN= (0..3)
0 0 0 0 
##$XL= 0
##$YL= 0
##$YMAX_a= 464717
##$YMIN_a= -377986
##$ZGOPTNS= <>
##$ZL1= 120
##$ZL2= 120
##$ZL3= 120
##$ZL4= 120
##$ABSF1= 10
##$ABSF2= 0
##$ABSG= 5
##$ABSL= 3
##$ALPHA= 0
##$AQORDER= 0
##$ASSFAC= 0
##$ASSFACI= 0
##$ASSFACX= 0
##$ASSWID= 0
##$AUNMP= <proc_1d>
##$AZFE= 0.1
##$AZFW= 0.1
##$BCFW= 1
##$BC_mod= 2
##$BYTORDP= 1
##$COROFFS= 0
##$CY= 11.3945322036743
##$DATMOD= 1
##$DC= 2
##$DFILT= <>
##$DTYPP= 0
##$F1P= 2.36226072786647
##$F2P= -0.459571619588291
##$FCOR= 0.5
##$FTSIZE= 0
##$FT_mod= 4
##$GAMMA= 1
##$GB= 0.15
##$INTBC= 1
##$INTSCL= 1
##$ISEN= 128
##$LB= 0.24
##$LEV0= 0
##$LPBIN= 0
##$MAXI= 10000
##$MC2= 0
##$MEAN= 0
##$ME_mod= 0
##$MI= 1.114404
##$NCOEF= 0
##$NC_proc= 0
##$NLEV= 6
##$NOISF1= 3.799351
##$NOISF2= 2.8
##$NSP= 1
##$NTH_PI= 0
##$NZP= 0
##$OFFSET= 15.70392
##$PC= 1
##$PHC0= -13354.37
##$PHC1= 10.60099
##$PH_mod= 1
##$PKNL= yes
##$PPARMOD= 0
##$PSCAL= 0
##$PSIGN= 0
##$REVERSE= no
##$SF= 200.130013532006
##$SI= 16384
##$SIGF1= 3
##$SIGF2= 2
##$SINO= 400
##$SIOLD= 16384
##$SREGLST= <1H.CDCl3>
##$SSB= 0
##$STSI= 0
##$STSR= 0
##$SW_p= 3612.71676300578
##$SYMM= 0
##$S_DEV= 0
##$TDeff= 0
##$TDoff= 0
##$TI= <>
##$TILT= no
##$TM1= 0
##$TM2= 0
##$TOPLEV= 0
##$USERP1= <user>
##$USERP2= <user>
##$USERP3= <user>
##$USERP4= <user>
##$USERP5= <user>
##$WDW= 1
##$XDIM= 8192
##$YMAX_p= 0
##$YMIN_p= 0
$$ End of Bruker specific parameters
$$ ---------------------------------
##NTUPLES= NMR FID
##VAR_NAME=  TIME,          FID/REAL,        FID/IMAG
##SYMBOL=    X,             R,               I
##VAR_TYPE=  INDEPENDENT,   DEPENDENT,       DEPENDENT
##VAR_FORM=  AFFN,          ASDF,            ASDF
##VAR_DIM=   8192,          8192,            8192
##UNITS=     SECONDS,       ARBITRARY UNITS, ARBITRARY UNITS
##FACTOR=    0.0002496,     1,               1
##FIRST=     0,             0,               0
##LAST=      2.0444736,     0,               0
##MIN=       0,             -377986,         0
##MAX=       2.0444736,     464717,          0
$$ Real data points
##PAGE= N=1
##DATA TABLE= (X++(R..R)), XYDATA
$$ [...]
3464A782j156l865N395Q88p503L453O487p017k938Q053j563n699M345J491m207
3479b054K718J304m953K929M402o906j023Q359l378o691O354K819o592J428L896
3494B612l949M92L384m453J5O193m498m554P621J042q185L057N679n426j787N097
3510B340k167j862M147k703l149O344m20p311M745N219p297j493P342k344m807
3525c416M711k0l364L497L9m898M104L364p384M27P811m483n197O421J242n917
3541c063K528K534m093J978K700n485J273O071n528l596Q031k75p578L928M459
3556C884n158m99M232l173l96M042l820j906O496j749o619N536M219p641j82O612
3572C878l293l269M512j126k592M123j463m794N812J867p616J854P117n382m051
$$ plain form
3464 1782 626 -3239 2156 3044 -4459 -1006 5481 -1536 -4474 3579 2016 -3683 662 2153 -2054
3479 -2054 664 1968 -2985 -56 4346 -2560 -3583 4776 1398 -5293 1061 3880 -2712 -1284 2612
3494 2612 -1337 -845 2539 -1914 -1899 4294 -204 -4758 2863 3905 -4280 -1223 4456 -970 -2757 2340
3510 2340 173 -1689 2458 -245 -3394 2950 2530 -4781 -36 5183 -2114 -3607 3735 1391 -3416
3525 -3416 1295 1275 -2089 1408 1447 -3451 653 4017 -3367 -2940 4871 388 -4809 1612 2854 -3063
3541 -3063 -535 1999 -2094 -116 2584 -2901 -1628 4443 -1085 -4681 3350 3075 -4503 -575 3884
3556 3884 -1274 -1773 2459 -714 -1110 2932 -888 -2794 3702 1953 -4666 870 5089 -2552 -2734 3878
3572 3878 585 -2684 1828 702 -1890 2233 770 -4024 1788 3655 -3961 -2107 5010 -372 -4423
3587d423O677k50n110L504Q04l545L006J578n671K510N408o083k771P980j328
3602B286o663M782L166n452J132L195l699Q79L676m906p99O549k884n989O361
3617A634K866p436J271N471m012j548M030k619j315M703l104l881O235Q54p507
3632d358K818O372o099k567O391j504l852L885m45l239M187j0n562L940M309o719
3648b453j103P832k906n382N098J859m710K068J719l755K331K614n381L85O675
3663D891m451m904P034J203o988K674M018m164k02L156l219k63M841m292l114
3678c780O870n71p326M468M824o350r93N245k310k423L644j479k432M659r88n297
3694d239N208L169p286L61O915l498m209N332J67l746K761M87l459L468K041o525
$$ plain form
3587 -4423 2254 2004 -3106 398 1202 -2343 663 2241 -3430 -920 4488 -1595 -4366 3614 2286
3602 2286 -4377 405 3571 -1881 -749 2446 -1253 -374 3302 -1604 -2403 4146 1262 -4727 1634
3617 1634 4500 -2936 -1665 3806 -206 -1754 2276 -343 -1658 3045 -59 -3940 2295 3149 -4358
3632 -4358 -1540 4832 -1267 -3834 2557 1053 -2799 1086 641 -2598 1589 1579 -3983 -43 4266 -2453
3648 -2453 -3556 4276 1370 -4012 1086 2945 -1765 303 2022 -1733 598 3212 -2169 -1784 4891
3663 4891 440 -4464 2570 3773 -3215 -541 3477 -687 -889 2267 -952 -1215 3626 -666 -3780
3678 -3780 3090 2519 -4807 -339 4485 -1865 -2858 2387 77 -2346 1298 -181 -2613 2046 1058 -4239
3694 -4239 969 4138 -3148 -2787 4128 630 -3579 1753 1920 -1826 935 1422 -2037 1431 3472 -3053
3710c053K000O204n272l716O978j8o201L153K852m271J039K431l995J232M238
3725C601n189j794O839j558o558N087L388o199K72M690l120j112L630k917j343
3740b283N408k693m976O410J883p261J667O156m346k774M958q93k981L725r56
3755A044l521M940M26o281L143N367o153k334O980j428n292M059J323l811K153
3770F15J239m222K749L139n940n48P184l377n708O032K062o024J428L659l675
3785a387N31K867l849K7N295l912l962O880P71p094K797N137m868j466M645k103
3801C09j708L798k390k174N053p51n927M193M387o563r34O587k732m011M245k7
3817A355l050L105o8m119L628K665o349M38O992m683m225O011Q74n340K519K129
$$ plain form
3710 -3053 -1053 5151 -121 -3837 3141 3123 -3078 75 2927 -1344 -305 2126 -1869 -637 3601
3725 3601 -1588 -3382 3457 1899 -4659 428 3816 -2383 -2111 2579 -541 -1653 1977 -940 -2283
3740 -2283 3125 432 -4544 1866 3749 -3512 -1845 4311 -35 -2809 2149 1256 -1725 2000 1044
3755 1044 -2477 2463 2889 -3392 -249 5118 -1035 -3369 3611 2183 -3109 950 2273 -1538 615
3770 615 1854 -2368 381 3520 -2420 -2968 4216 839 -4869 1163 3225 -2799 -1371 2288 -1387
3785 -1387 -856 2011 -1838 -1811 3484 -428 -4390 2490 3261 -3833 -1036 4101 -767 -2233 2412 309
3801 309 -1399 2399 9 -2165 2888 2137 -3790 403 4790 -1773 -2707 3880 1148 -2863 1382 1355
3817 1355 -1695 1410 1342 -2777 851 3516 -2833 -2395 4597 -86 -4311 1700 2574 -2766 -247 1882
3833A882l504J575K000m439J535M799m866k845O997m74o706L858L888m977j17
3848a394L779k978l26L580l330j691N919k068n658N331L150o917M47N906l515
3863B35k486M004j143k314L544j259l901M957J811p074J951O173n140l114N969
3878B213n91m207K810J158l368K780J006n007K784M392n860j680P021j811n672
3893d032M675K469n065J274K756l340R00L228m572m58O219l356n163O264J864
3908C663o769J641N028m059j338L651j984j332L996k480l458O098J37o781L281
3923g06N031n556j708N423j458l295L372l44k751L676l42m880L920L497o375m89
3939b985O765k902m770M817J289m480K097J651l306K096K344n137P62N903m614
$$ plain form
3833 1882 -1622 -47 1953 -2486 -951 3848 -1018 -3863 3134 2660 -4046 -188 3700 -1277 -1394
3848 -1394 2385 -593 -919 2661 -669 -2360 3559 1491 -4167 1164 4314 -2603 -2156 3750 235
3863 235 -2251 1753 610 -1704 1840 581 -3320 1637 3448 -3626 -1675 4498 -642 -3756 2213
3878 2213 1622 -2585 225 1383 -1985 795 1801 -3206 -422 3970 -1890 -3570 3451 1640 -4032
3893 -4032 643 3112 -1953 -679 2077 -1263 -363 2865 -1707 -2165 4054 698 -4465 1799 3663
3908 3663 -3106 -1465 3563 -496 -1834 1817 -167 -1499 2497 17 -3441 2657 2794 -3987 -706
3923 -706 4325 -1231 -2939 2484 1026 -2269 1103 759 -1992 1684 1342 -3538 382 3879 -2496 -2985
3939 -2985 3780 878 -3892 925 2214 -2266 -169 1482 -1824 272 2616 -2521 -1759 4144 -470
3954d70l732O508M01o082K509L902m390P0L065l158M04L768l896k241O333j118
3970A873o190M382M122o276m29N268k610k101L562j807j647M191j750m557N145
3985A176K446p048J094O222l930l713N273k48l713K923K91l219L393J138n538
4000c453J986N503n198l089O834n80n378L422K370m027J329J898l472J283L647
4015C075m720j328O548k149n794N325K740o148Q04M434l273q86L148k575r51M475
4031B725k479m244N711J483o851J864N537m531k397M805j346k600L198r80k742
4046b847M073N52n827L164M937o179j732O659j772m638M022J271l722K296J093
4061A350l815K652L001n441k24O514l534m826N775J577n533J658L216l420L42
$$ plain form
3954 -470 -4202 2306 2707 -3375 -866 3036 -1354 -1284 1781 -1377 -973 2795 -1101 -3342 2991 1873
3970 1873 -4317 65 4187 -2089 -2518 2750 140 -1961 1601 -206 -1853 2338 588 -3969 1176
3985 1176 3622 -3426 -2332 3890 -40 -3753 1520 1272 -2441 482 773 -2446 947 2085 -3453
4000 -3453 -1467 4036 -1162 -4251 2583 2003 -3375 47 2417 -1610 -281 1617 -1855 -572 3075
4015 3075 -1645 -2973 3575 1426 -4368 957 3697 -2451 -1647 2787 -486 -1372 1776 -799 -1750 2725
4031 2725 246 -3998 1713 3196 -3655 -1791 3746 -785 -3182 1623 277 -2323 875 -105 -2847
4046 -2847 1226 1778 -4049 -885 4052 -2127 -3859 2800 1028 -3610 412 1683 -2039 257 1350
4061 1350 -2465 187 3188 -2253 -2477 4037 503 -4323 1452 3029 -2504 -846 2370 -1050 -708
4076g08K597l632L34M646l823l439O376J91o649L033M431n066r66M302k122j598
4092b093L475k263k276N238j119n437M555L504o289l91O154k757l492M098j5k953
4108b061L176j76l689L773J982o204J197O290m550l619N852N83n116K228K377
4123B043l466J399J801m152J463M384m963k122O416r22o202L790L527n100O6L634
4139A596k867l76L401l481j156N393k284m853N285K719o445M83N532l353k493
4154b899M143r47k181L463j409l233M795Q61o152K481N384n321k500N935p41m185
4170b506L093P21l251K847N97m370K623L725n711j112O634k134n325M283K262
4185B376m787J233K494l074R42K673m157j48N819l541m402N946J634o587J973
$$ plain form
4076 -708 1889 -1743 -1409 3237 -586 -4025 2351 2542 -4107 -1074 3357 -1709 -2675 1627 -495 -2093
4092 -2093 1382 -881 -3157 2081 962 -4475 80 3584 -2705 -3096 3058 301 -3191 907 892 -2061
4108 -2061 1115 939 -2750 1023 3005 -3199 -2002 4288 -262 -3881 1971 2554 -2562 -334 2043
4123 2043 -1423 -24 1777 -2375 -912 3472 -1491 -3613 2803 1881 -4321 -531 2996 -2104 -2038 1596
4139 1596 -1271 -1647 1754 -1727 -2883 2510 226 -4627 658 3377 -3068 -2585 2947 -406 -2899
4154 -2899 1244 297 -1884 1579 170 -3063 1732 2593 -3559 -1078 4306 -1015 -3515 2420 1679 -2506
4170 -2506 587 1308 -1943 904 1501 -2869 -246 3479 -2232 -3344 3290 1156 -4169 114 2376
4185 2376 -2411 -1178 1316 -1758 -816 1857 -2300 -2448 3371 -170 -4572 1374 3008 -3579 -1606
4200a606M513l969q37L557k173q60L784k818k546N543m48o145L524M623n744j314
4216b916N600j788l135L366o35k426L394l74m410L743K965o189l5O320l271m152
4232c943M779Q42m179K196J341l220K208J814m619J211M999m570l140O703j65
4247B257n846L024L037l915J81K821k998N06L536l763j497N651j380n782M769
4262F01L230n857J50M550k610j789L205j663j471L766j656m190M989J930o621
4277c436J446N685m159k966M927o32l294K977J24k927L026J182n234K542M646
4292C907n434j928O255j054n158L461K112l857J301J887l062J243L283m782n73
4307b399O068k717m962N081K140n607J170L582l027m79K747k668n09M071k646
$$ plain form
4200 -1606 2907 -1062 -1899 1658 -515 -1375 2409 -409 -2955 2588 2140 -4005 -481 4142 -1602 -2916
4216 -2916 2684 896 -2239 1127 492 -1934 1460 1086 -3324 419 3384 -2805 -2840 3480 209 -3943
4232 -3943 836 1678 -2501 -305 1036 -2184 24 1838 -2781 -1570 3429 -1141 -4281 2422 2257
4247 2257 -3589 -565 2472 -1443 -1262 1559 -1439 -933 2603 -1160 -2657 2994 1614 -4168 601
4262 601 3831 -2026 -1876 2674 64 -1725 1480 -183 -1654 2112 456 -3734 1255 3185 -3436
4277 -3436 -1990 3695 -464 -3430 1497 865 -2429 548 672 -2255 771 1953 -3281 -739 3907
4292 3907 -1527 -3455 2800 1746 -3412 49 2161 -1696 -395 1492 -1570 -327 2956 -1826 -2399
4307 -2399 3669 952 -4010 1071 3211 -2396 -1226 2356 -671 -1150 1597 -1071 -1580 2491 -155
4322a55l459N808N36o543K602M778m467j913M796j588k168L160j435k047L900
4337A805l26n061L534L678n841p83O097k159m192M069Q72l608K225Q66l387K886
4353F75J963n184P91N564l795l825N626P93n245K093K618l263N68K333l180M77
4369i91M127m002k434O167p93n853L462L933n166l83M009k121j171L115k268j676
4385b045M655j619m566M224L156o359K69N312k733k893L996n68k604K894n59k953
4401b393L650J246n787J955N296m780k775N879k21m733K682J650l198J848J107
4416A426l668J972L551m796j288O072j767n426M572K565n036N83L126k583J26
4431e71K515l132m48M924k835m177N255J662o214J573M825l713j815L793j664
$$ plain form
4322 -155 -3614 2194 2730 -3813 -1211 3567 -900 -2813 1983 395 -1773 1387 -48 -2095 1805
4337 1805 1479 -3582 -48 3630 -2211 -2994 3103 944 -3248 821 1693 -1915 310 1176 -2211 675
4353 675 2638 -2546 -1755 3809 14 -3811 1815 2608 -2637 -544 2074 -1189 -621 1712 -1468 -991
4369 -991 3136 -866 -3300 2867 2074 -3779 -317 3616 -1550 -1933 2076 -45 -1216 1899 -369 -2045
4385 -2045 2610 991 -3575 649 3805 -2554 -2285 3027 294 -2599 1397 829 -1775 1119 560 -2393
4401 -2393 1257 2503 -3284 -1329 3967 -813 -3588 2291 2070 -2663 19 1669 -1529 319 1426
4416 1426 -2242 -270 3281 -1515 -2803 3269 1502 -3924 648 3213 -1823 -1240 1886 -697 -571
4431 -571 1944 -1188 -1636 3288 453 -3724 1531 3193 -3021 -1448 3377 -336 -2151 1642 -22
4446b2j373L091j717k600M419M72n730K664M813n224j997N889j609l490L182L41
4462A109k819K598M06l805K822L064n535l43O233k820m357M552J346m349J605
4477b93K160k893J018K157l874M29M952l902l462N881M56n763K416L871m049p04
4493a600L235k145n21L039k650k027N279j101n353L988L349n330q01N238k040
4508E60k792L251n87k060L133o55l676L951K041n943J044N713l927l208M729M63
4524B037l999K244J173k896K217J295m382J681M400m716k275N951n62n276L125
4539A7K608l929M43K489k715L73L019l637o88M923k016m773M645K435n636P05
4555a737M356k761j486L039j728j105L588j938l048M788Q47n971K058N001m403
$$ plain form
4446 -22 -1395 1696 -21 -2621 1798 2270 -3460 -796 4017 -1207 -3204 2685 1076 -2414 768 1109
4462 1109 -1710 888 1294 -2511 311 3375 -2160 -2503 3730 910 -3447 1105 2451 -1898 -293
4477 -293 1867 -1026 -8 2149 -1725 -1296 3656 -246 -3708 2173 2629 -3134 -718 3153 -896 -1600
4493 -1600 1635 -510 -1031 2008 -642 -2669 2610 1509 -3844 144 3493 -1837 -2638 2600 560
4508 560 -2232 1019 432 -1628 1505 850 -2826 1125 3166 -2777 -1733 3980 53 -3155 1574 2037
4524 2037 -1962 282 1455 -1441 776 2071 -2311 -630 3770 -946 -3221 2730 2168 -3108 17
4539 17 2625 -1304 -861 1628 -1087 -714 2305 -1332 -2020 2903 887 -3886 759 3194 -2442 -1737
4555 -1737 2619 -142 -1628 1411 -317 -1422 2166 228 -2820 1968 2815 -3156 -1098 3903 -500
4570e00k380M797o11k995K593j16k532L127J69m329K755L755n311j164N783j541
4586A500m694L703J526l649J446J413k993J845K136m228jN288k955m206N202J396
4602B729n396J596L460l340j03K306k211k72L700k933k445N244R7n974L033M171
4618C662m763j159M440j598k034K867j237j784L598o89m390L676K673n442j53
4633b333N748k991l307M022K17l078K340L14l064K902J385m715J270M969m056
4648c77l312N631K94m961K298K497l346R68J813k986Q75L318l767j823N752j189
4664A685n206L659L105m762k5L489k112r95K951k429r27M004j914l895M671J855
4680C154n962J200M794l241k484L910o67k373K803p42k458L367O81n123K262M468
$$ plain form
4570 -500 -2880 1917 1306 -1689 904 788 -1744 1383 1552 -2777 -22 3733 -1578 -2742 3041 1500
4586 1500 -3194 509 2035 -1614 -168 1245 -1748 97 2233 -1995 -1996 3292 337 -3869 1333 2729
4602 2729 -2667 -1071 2389 -951 -1054 1252 -959 -1231 2469 -464 -2909 2335 2432 -3542 -509 3662
4618 3662 -1101 -2260 2180 582 -1452 1415 178 -1606 1992 1303 -3087 589 3262 -2180 -2333
4633 -2333 3415 424 -2883 1139 1356 -1722 618 932 -2132 770 2155 -2560 -1290 3679 -377
4648 -377 -3689 1942 2236 -2725 -427 2070 -1276 -308 1505 -1481 -606 2712 -1055 -2878 2874 1685
4664 1685 -3521 138 3243 -1519 -1544 1945 -167 -1162 1789 -640 -1567 2437 523 -3372 1299 3154
4680 3154 -2808 -1608 3186 -55 -2539 1371 704 -1669 1134 392 -2066 1301 1982 -3141 -879 3589
4696C589m737j948N432r04l992K712J252k862J713R22l213K058K748m498p26N547
4712C093k092m502M364J691m443J143K788k807L21K235k942r3M134k930l447N141
4728A654R41n579J972M195l811j331L448j461j319K900j778k092M352n14n055
4743c478L536L451n007r98N052j740l024L021K86k634K448P5l309K883K132m851
4759b157L25N297l311l561M660P37m111J937J763k841J421J406l642J023M062
4774C008l801k385N549l66n168K854L213m010l69L068k156l04K745k486j452M603
4790B543j533m418M183K285n102K64M501k454k466L232o88j744L009j327k856
4805b571L779J343n306J260N039l712k991M791j47l437K171P03k392K188O15l488
$$ plain form
4696 3589 -1148 -3096 2336 1432 -2560 152 1404 -1458 255 1177 -2036 22 2770 -1728 -2454 3093
4712 3093 1001 -3501 863 2554 -1889 -746 2042 -765 -444 1791 -1151 -1244 2890 -40 -3487 1654
4728 1654 2595 -2984 -1012 3183 -628 -1959 1489 28 -1291 1609 -169 -2261 2091 1577 -3478
4743 -3478 58 3509 -1498 -2496 2556 816 -2208 813 1099 -1535 913 988 -2321 562 2694 -2157
4759 -2157 -1832 3465 154 -3407 1253 1990 -2121 -184 1579 -1262 159 1565 -2077 -1054 3008
4774 3008 -793 -3178 2371 2005 -3163 -309 2904 -1106 -1475 1593 -563 -867 1878 -608 -2060 2543
4790 2543 1010 -3408 775 3060 -2042 -1778 2723 269 -2197 1035 347 -1397 1612 285 -2571
4805 -2571 1208 2551 -2755 -1495 3544 -168 -3159 1632 1485 -1952 219 922 -1470 718 1333 -2155
4821b155J826L471m360j482N264j178m523L536K035l799P85J979k256N45K406
4836B094l254l60M607k376m154M619J957n457J141L686k836j030K566j552q14
4851a163L067k156k368M306L78n315K459M148m476j557M488j191k590K597k31
4866C96j878K638q3l854L133K804n137l56N537k405l662L810Q89l062J266J177
4882A213k592J742J731l915N05M871l498l290N046O07m733J824K828k963j20K241
4898A497k249m6L201l011j952M870p48m996L343L119m461n63L865j589j942K832
4914A170j292j546L355r46l501L828J888n463R58M649k866k755L819P5k604K026
4930G95L29k677K644R55m261J444M215l897k456N257m39m263K287K009k921P68
$$ plain form
4821 -2155 -329 3142 -1218 -2700 2564 1386 -3137 399 2434 -1365 -580 1399 -857 -312 2094
4836 2094 -1160 -1520 3087 711 -3443 1176 3133 -2324 -1183 2503 -333 -1363 1203 -349 -1163
4851 -1163 1904 -252 -2620 1686 2064 -3251 -792 3356 -1120 -2677 1811 620 -1970 627 396
4866 396 -1482 1156 1073 -2781 352 3156 -1981 -2337 3200 795 -2867 943 1832 -1230 36 1213
4882 1213 -1379 363 2094 -1821 -1316 3555 57 -3233 1813 2420 -2313 -489 2339 -624 -744 1497
4898 1497 -752 -798 2403 -608 -2560 2310 1562 -3434 -91 3028 -1433 -1996 1869 280 -1662 1170
4914 1170 -122 -1668 1687 741 -2760 1068 2956 -2507 -1549 3100 234 -2521 1298 1373 -1231 795
4930 795 1124 -1553 1091 2046 -2215 -771 3444 -453 -2909 2348 1909 -2354 -67 1942 -979 -211
4946b11J561k713J228K808m120q09M992j699m494L885K321m606L30L467k256p19
4962a035K539k173o25L587k262k962M445R79n195J648M289l415j804L513q20j855
4978a146K441q92k083L377L7m395K692L507m437j498N079j540l426K976R55k788
4994a141J512P61k888K087J981l986n3M904k564l920M373J263m150J077K538k460
5010f66J87J892k792M86L672l045k488M851o4m921K320L793l805q08K969j378
5026B03j109K457j763j499L904p05m438L419L065n049m33M542k064k650L022m9
5042H53k062K028j64k745K781J660m640Q81M725l323k983M590Ml649J912J442
5058A310k156J019J266l122J069L407l685j811N134n63m706K837K553l390r2K604
$$ plain form
4946 -211 1350 -1363 -135 2673 -1447 -2256 2736 1037 -3457 428 2749 -1857 -1527 1940 -316 -1035
4962 -1035 1504 -669 -1294 2293 31 -2931 1514 2493 -2702 -1054 3235 -180 -1984 1529 709 -1146
4978 -1146 1295 403 -1680 1697 1734 -2661 31 3538 -899 -2397 2682 1142 -2284 692 1647 -1141
4994 -1141 371 1132 -1756 331 2312 -1674 -1727 3177 613 -3307 1066 2329 -1821 -744 1794 -666
5010 -666 -479 1413 -1379 -893 2779 -266 -2754 2097 2033 -2888 -568 3225 -580 -1388 1581 203
5026 203 -906 1551 -212 -1711 2193 1488 -2950 469 3534 -1515 -1948 2594 530 -2120 902 853
5042 853 -1209 819 655 -2090 691 2351 -2289 -1408 3317 -6 -2989 1601 1605 -2044 -132 1310
5058 1310 -846 173 1439 -1683 -614 2793 -892 -2703 2431 1868 -2838 -1 2552 -838 -930 1674
5074A674k008k02K234k335p49L909j877l854M186K070m992N34M050k440j737K744
5090A207r96j304K550j317k324L913K67m904K138L930l799j951M247m24l139K286
5106C80O68k277J916N37l225K064K760m385o61N028j758l919L333J757l324P78
5122c28J680k101Q08J809l150J91M009k814l144M556J004m916J459L524k867j099
5138a379K662j559m90K464k001j980M023k11m600K618L563m367j010M191j280
5153F44k272K304k00j908K821n46l340L188J919m683L59M541k331l264L920K59
5169A411k821J597Q24k355J820J202l563J008M002l663k364M846q7m323K128K522
5185B184l081L87J685k113N81K511l145j080M394j136m345L481K527m395m8L415
$$ plain form
5074 1674 -334 -536 1698 -637 -1386 2523 646 -3208 978 3048 -1944 -1410 2640 200 -1537 1207
5090 1207 211 -1093 1457 140 -2184 1729 1996 -2908 -770 3160 -639 -2590 1657 1233 -1906 380
5106 380 1048 -1229 687 1224 -2001 63 2823 -1562 -2223 2805 1047 -2872 461 2218 -1106 -328
5122 -328 1352 -749 59 1868 -1282 -1091 2918 104 -3040 1516 2520 -2396 -937 2587 -280 -1379
5138 -1379 1283 -276 -766 1698 -303 -2283 1740 1529 -3071 -453 3110 -1257 -2267 1924 644
5153 644 -1628 676 476 -1432 1389 843 -2497 691 2610 -2073 -1714 2827 496 -2768 1152 1411
5169 1411 -1410 187 1011 -1344 476 1678 -1885 -877 3125 -538 -2902 1944 1857 -2466 -338 2184
5185 2184 -897 -510 1175 -938 -357 2154 -991 -2071 2323 1187 -3158 323 2850 -1545 -1593 1822
5201A822j776j348K399j316p56K689j508k784L878J040m827J062M390l148k270
5216b453L725k60k542J955L2k133K327O38l811K017L392m037j547M863q63l910
5232b607K719J348k601R51J145k364J354K045l440k43M403k044l804L896J757
5247B515m311Q75K556k076m57J941j782l80L060k170k368M213L24m715J998L346
5263B569l444j221L243j010j558K197r54j559L014l11l755K743K861m522n67M721
5279B447j819k994K814N86k172J357O54k552K206J449m030N94M426k830k834M207
5295A509M97l874J507J988k439M29J401k320O51K888l233j692M759o07m574K669
5311d41K898l706n03K926j467r44K066j576r14L284j130l695L733J951m619K18
$$ plain form
5201 1822 46 -1302 1097 -219 -975 1714 206 -2578 1300 2340 -2487 -1425 2965 -183 -2453
5216 -2453 1272 1012 -1530 425 457 -1676 651 1289 -2522 -505 2887 -1150 -2697 2166 1303 -2607
5232 -2607 112 1460 -1141 -190 955 -1409 -55 1990 -1450 -1693 2710 666 -3138 758 2515
5247 2515 -1796 -921 1635 -441 -898 1043 -739 -1119 1941 -229 -2597 1616 1940 -2775 -777 2569
5263 2569 -875 -2096 1147 137 -1421 776 -178 -1737 1277 966 -2789 -46 2815 -1707 -2274 2447
5279 2447 628 -2366 448 1034 -1138 219 873 -1679 527 1976 -2054 -1460 2966 136 -2698 1509
5295 1509 2006 -1868 -361 1627 -812 -383 1018 -1302 -651 2237 -996 -2688 2071 1464 -3110 -441
5311 -441 2457 -1249 -1752 1174 -293 -1237 829 -747 -1661 1623 493 -3202 531 2482 -2137 -1919
5327a919M070k185k106K770q7j722J964n25k210L300M02m044J577L918l738k066
5343b601M126J58l604J900J477k516J257Q86k739J536K361l694q12M315j446l665
5359c061L001K190l833M34K267j892k19K042k228j62L466k418k853M142J173m436
5375b387J232L499k762j470K770r00r44K118j349j636L370n7m205K359L306l849
5391i05j383M267r96k810K194M16k112J892J41l001K437J979m155k2M288k010
5407B20l522L834Q02l319J331J481k103R08J434k938N17L522k762k436M628m8
5423A549m339K104K799k907m40K274j551k79K265j962j274M027j134l949L127
5438C10K620m510k00L705j641j718K219n94j249K149p73k596L201J008m497J060
$$ plain form
5327 -1919 2151 -34 -2140 630 543 -1179 785 260 -1950 1350 1752 -2292 -715 3203 -535 -2601
5343 -2601 1525 1683 -1921 -21 1456 -1060 197 1083 -1656 -120 2241 -1453 -2265 2050 604 -3061
5359 -3061 -60 2130 -1703 -1269 998 -894 -1113 929 -1299 -1461 2005 -413 -3266 876 2049 -2387
5375 -2387 -1155 2344 -418 -1888 882 -18 -962 1156 -193 -1829 1541 1484 -2721 -362 2944 -905
5391 -905 -2288 1979 983 -1827 367 783 -1329 563 704 -2297 140 2119 -2036 -2058 2230 220
5407 220 -3302 532 1334 -1985 -654 827 -1276 -368 1066 -1872 -1355 2167 -595 -3031 1597 1549
5423 1549 -2790 -686 2113 -794 -1234 1040 -511 -790 1475 -487 -1761 2266 1132 -2817 310
5438 310 2930 -1580 -1780 1925 284 -1434 785 191 -1058 1091 318 -2278 923 1931 -2566 -1506
5454a506M163l144k385L705Kk577J434P27k046J726Q43l278J531L242l640j456
5470b659M462o13l787K593J950l063N05J712j815N27J927k796k05L734j884l542
5486b954L954J473m171N91K983k026j046K146j148q64K563j690k434L967M18m610
5502b848J747L636l668j215L350n98k111J924j71j583K212j3l158K359K395l993
5518a735n31M418j392l232K986R27k613J081J102k133J354J645l472N14L746k416
5534B49k770L856P76l846J090K563k280j34J614j876oK559k481j604L959m59m156
5551b946K355L069l755o14L163j330j299K067j139j272K931q04l068K915K155
5566B428m271J7M247k035k634L085L10k314J556L45k020J907J268l671R71L575
$$ plain form
5454 -1506 2657 -487 -2872 833 835 -1742 -308 419 -1627 99 942 -2336 -805 2437 -1203 -2659
5470 -2659 1803 1190 -2597 -4 1946 -1117 -612 1100 -715 -188 1739 -1057 -1262 2472 588 -2954
5486 -2954 1000 2473 -1698 -1107 1876 -150 -1196 950 -198 -1062 1501 -189 -2623 1344 1762 -2848
5502 -2848 -1101 2535 -1133 -2348 1002 404 -1707 217 46 -1537 675 662 -2496 -137 2258 -1735
5518 -1735 -2266 2152 760 -2472 514 1441 -1172 -91 1011 -1122 232 1877 -1595 -1081 2665 249
5534 249 -2521 1335 2111 -1735 -645 1918 -362 -496 1118 -758 -764 1795 -686 -2290 1669 1210 -2946
5551 -2946 -591 2478 -1277 -1891 1272 -58 -1357 710 -429 -1701 1230 426 -2642 273 2428
5566 2428 -1843 -1826 2421 386 -2248 837 1147 -1167 389 734 -1286 621 1889 -1782 -811 2764
5582B764l031k122M118J7l524J614J476k371J073R66k269J036K010k869j099M237
5598B026j120l925L085K190l691J34K494j586n57J711j425o93L052j574k677L494
5614I38J197m265R07L651k623j439K778m96j474J722m95j910K873Q2l565K038
5630h1K976l500j525M114q13k971K171Q46k363J498M54k351J638J864l557j16
5646a716M231k154l231L563J153l578J029K123k121L07J484k113K23K790k317
5661c27k211L987L74m247J738K986k958q40K761j184p64J823j444j089L179q57
5677I27l642L102K260m128q4L520j393k260K462j01j597J737m91k020K209J398
5693A899l851O92L884k762k218L395K99k780J255J166j774Q58J119k549R14K924
$$ plain form
5582 2764 -267 -2389 1729 1746 -1778 -164 1312 -1059 14 980 -1289 -253 1757 -1112 -2211 2026
5598 2026 906 -3019 66 2256 -1435 -1301 1193 -393 -950 761 -664 -1357 1695 121 -2556 938
5614 938 2135 -2130 -1223 2428 -195 -1634 1144 648 -826 896 401 -1509 1364 1446 -2119 -81
5630 -81 2895 -605 -2130 1984 1171 -1800 371 1217 -1146 352 806 -1545 93 1957 -1600 -1716
5646 -1716 2515 361 -2870 693 1846 -1732 -703 1420 -701 -394 1090 -1023 -800 1990 -327
5661 -327 -2538 1449 1823 -2424 -686 2300 -658 -1498 1263 79 -685 1138 -306 -1395 1784 927
5677 927 -2715 387 2647 -1481 -1565 1955 562 -1698 764 663 -934 803 312 -1708 501 1899
5693 1899 -1952 -1260 2624 -138 -2356 1039 1338 -1442 -187 979 -795 63 1182 -1367 -453 2471
5709B471l245j576M547q74l909K579J931k544k33K029j843J28K029k268o13L333
5725A942j532l110L584J341l734J15L368j987j413K228n48j143K075r02k066K960
5741A178M65l692J443L225l029j699L628n93k284J887J23j522J549M58l018K016
5757A35J976l399n45M011j490l020K648J246k737N19J656k028Q92J273k480J04
5773a239L377k243k718L697J058l962J093K641k442l52J987j328l21K193j816
5788c75j390L451m19l797K479K678l478p68L222j107j691J884l00j461K255n32
5804F51k649K517J701m009K08M170k345k584K809L61k033J145M99j646J366R72
5820A133k918P91K945k738j947L984o4l442J772J874k271K27J546j841P19J798
$$ plain form
5709 2471 -774 -2350 2197 1323 -2586 -7 1924 -620 -853 1176 -667 -539 1490 -778 -1391 1942
5725 1942 410 -2700 884 2225 -1509 -1394 1974 -13 -1426 802 254 -889 1186 284 -1782 1178
5741 1178 1643 -2049 -606 2619 -410 -2109 1519 926 -1358 529 652 -870 679 1137 -1881 135
5757 135 2111 -1288 -1833 2178 688 -2332 316 1562 -1175 -656 1000 -1028 -136 1137 -1343 -1239
5773 -1239 2138 -105 -2823 874 1932 -2030 -937 1704 -738 -1090 897 -431 -752 1441 -375
5788 -375 -1765 1686 1267 -2530 -51 2627 -851 -1619 1603 496 -1195 689 389 -1072 1183 651
5804 651 -1998 519 2220 -1789 -1581 2589 244 -2340 469 830 -1203 -58 441 -1205 161 1133
5820 1133 -1785 -994 1951 -787 -2734 1250 1186 -2256 -484 1390 -881 -654 892 -949 -230 1568
5836A568k205j023L569r67l299K762J985l596J03K686j508q94J780j097q72K518
5852A510j196k528L122R41m031Q29L613k597j584K724l35j930J597j39j541J950
5868D05L07l168J868K614l567q99M000q93k771J997J338k171N94J041j822J261
5884A34J611k956j90L873j912k969L257J254l506Q42K209j880k78J568j940J77
5900g06K387j906k060L699N8l684J409K633k512j199K810r49j167J589r27r59
5916a484K241l05l075K549K165l800l46L699j322k439K445L39j700J225K94j875
5932a389J952J073l342P18L376k607j999L182N54k913J063J713j937O25J014k169
5948a086O98K271k494j526L657n20l704K445J783k577n43K340j286n23J622j535
$$ plain form
5836 1568 -637 -1660 1909 942 -2357 405 2390 -1206 -1103 1583 75 -819 961 -136 -1008 1510
5852 1510 314 -2214 908 1849 -2182 -1353 2260 -337 -1921 803 468 -1462 135 -4 -1545 405
5868 405 712 -2456 -588 2026 -1541 -2440 1560 667 -2104 -107 1231 -940 -346 695 -1127 134
5884 134 1745 -1211 -1401 2472 560 -2409 848 2102 -1404 -562 1647 -233 -511 1057 -883 -706
5900 -706 1681 -225 -2285 1414 1472 -2212 -803 1830 -682 -1881 929 -20 -1187 402 -525 -1484
5916 -1484 757 452 -2623 -74 2091 -1709 -2055 1644 322 -2117 328 667 -1033 192 486 -1389
5932 -1389 563 1636 -1706 -988 2388 -219 -2218 964 1518 -1395 -332 1381 -556 69 1083 -1086
5948 -1086 -388 1883 -611 -2137 1520 1000 -2704 -259 1524 -1053 -1596 744 -542 -1065 557 -978
5964i78o23K789j356k555K987J371l601L71L192j801j488K060j05j495K185p85
5980A68j462K325N89l435J320K921k750j656L511m61k621J724P52j673J068N94
5996I14k194J161J918l066o75L778j196l178K490J482k899P13J366j354J61J422
6012H43k140P2K779j866k305L384P30l531R52K695k275n98J828p70m31J507j141
6029b67j265L039k77l335K056K312l100p98L282j057k105K028j28j220J401n1
6045E15k231J990J484l282M1L513k009k385K747N89k415R47J161j766J015R80
6061H94k383O47K760k364k060L829k55l379J749J950k132k09J737j098n6J612
6077A242j743q19K926q85k902K493J879l333n8K612j204j180J581o79q62J976
$$ plain form
5964 -978 -1601 1188 -168 -2723 264 1635 -1966 -1595 1597 -204 -1692 368 263 -1232 953 168
5980 168 -1294 1031 1620 -1815 -495 2426 -324 -1980 1531 1070 -1551 173 925 -748 320 914
5996 914 -1280 -119 1799 -1267 -1942 1836 640 -2538 -48 1434 -1465 -752 614 -740 -579 843
6012 843 -1297 -1225 1554 -312 -2617 767 1497 -2034 -1082 1613 -662 -1260 568 -202 -633 874 -267
6029 -267 -1532 1507 1230 -2105 -49 2263 -837 -1635 1647 590 -1515 513 385 -835 566 515
6045 515 -1716 274 1758 -1524 -1483 2030 21 -2364 383 972 -1443 -496 665 -1101 -86 894
6061 894 -1489 -842 1918 -446 -2506 1323 1068 -2311 -562 1388 -744 -953 784 -314 -370 1242
6077 1242 -501 -1320 1606 721 -2181 312 2191 -1142 -1200 1412 208 -972 609 -70 -932 1044
6093A044o94k134K397Q57l332Q14L180k282j694K487J15k029J380L33j486J514
6109D70K59k387J231K443l002j018L514o75k845J915J516k360N65J185j489N34
6125a44J343k227j96L282j659k733L067J035l054M93K000j326o51J505j094m04
6141g63K043j459j502K845L09l560J498K599k586p70K392n83j400J486n16j059
6157a026J863k29k466K098J656l078l59L345j144k353K159N85j762P91N74j516
6173h62J265J122k877N26K874j949k245L095N89k942R47J599j707J39J299j533
6189f60K63J865j902j178K971k21l161J824K194k816k26K367j310o55J506r08
6205d7q92K348r68k247K440J341l482L11L117j826j599K179K2j486J317l21j401
$$ plain form
6093 1044 350 -1784 613 1470 -1862 -1048 2132 -150 -1844 643 758 -1271 109 442 -1044 470
6109 470 729 -1658 -427 2016 -986 -2004 1510 835 -2010 -95 1421 -939 -374 811 -678 -144
6125 -144 1199 -1028 -1224 2058 399 -2334 733 1768 -1286 -793 1207 -119 -770 735 -359 -763
6141 -763 1280 -179 -1681 1164 1473 -2087 -589 2010 -576 -1346 1046 463 -937 549 33 -1026
6157 -1026 837 608 -1858 240 1896 -1182 -1541 1804 660 -1693 466 1051 -711 80 654 -862
6173 -862 403 1525 -1352 -826 2048 99 -2146 949 1538 -1404 -457 1142 -565 -426 873 -660
6189 -660 -397 1468 -434 -1612 1359 1138 -2023 -199 1995 -821 -1047 1320 10 -645 861 -47
6205 -47 -939 1409 441 -1806 634 1975 -1507 -1196 1921 95 -1504 675 697 -789 528 207 -1194
6222a194J833M64k821J230K561k487j525L154n6k666J357J045j744P46R88j826
6238i41R42J605k301q06L353r47k764K262J210k392K87J796j282k29J214j510
6254e03k9K139j132k204K759O47l208R68K513k006j076J899l87j173J484o00j113
6271a022J694K16k516J457K379l107q23L192n10k279J553M70j383R80L66j705
6287a038J380J544l128O1L287j518k338K525P81k326P80J311j638N19Q83j709
6303f24L11K287k102j519K982K72l178J432K074k450l40J782j072m57J458j136
6319b80q79K324n31k594K141J620k848l05K687r72j716J648j06p94J311k29j799
6336a322J852J026k999N78K937j817j746K595L44k371J177P73j404R26O56k071
$$ plain form
6222 -1194 639 1103 -1718 -488 2073 -414 -1939 1215 1159 -1507 -150 895 -849 -103 885 -941
6238 -941 1 1606 -695 -1501 1852 905 -1859 403 1613 -779 -492 1304 22 -207 1007 -503
6254 -503 -532 1607 475 -1729 1030 1677 -1531 -563 1950 -56 -1132 767 380 -793 691 91 -1022
6271 -1022 672 888 -1628 -171 2208 -899 -1722 1470 960 -1319 234 704 -679 301 667 -1038
6287 -1038 342 1886 -1242 -1181 2106 588 -1750 775 1556 -770 10 1321 -317 202 1085 -624
6303 -624 -313 1974 -128 -1647 1335 1607 -1571 -139 1935 -515 -855 927 -145 -602 856 -280
6319 -280 -1159 1165 634 -1960 181 1801 -1047 -1352 1335 363 -1353 295 189 -605 706 477 -1322
6336 -1322 530 1556 -1443 -865 2072 255 -1491 1104 1448 -923 254 1027 -377 549 1205 -866
6352h66P22K271k460j063L008m27k641J706J315k221J68J362j071K6J266j606
6368e11n46K455j164k237K384J266k964L31K377j380j044J760o84o78J782r88
6384A59j536K234N34k944J231K287k134j144K486k20j797J519j6j158J194K39
6400I34j992J379J575k610n48L017q07k551J978P85k004O61R48j463P54Q65k011
6417a090M69K266j683j936K789O12l008Q45K025j602l57J558j202p6J611j525
6433c04r68K737l08k710J694K001k503n09K028n75j081J360n43q32J730m63j970
6450a216J673J486k918R6K773j459j731J787M05j708R98L71j395J196P67k382
6466a257P29K312k073j668L006P4k566J187J417j704L12R27j308L27J583j830
$$ plain form
6352 -866 -144 2127 -333 -1396 1612 1185 -1456 250 1565 -656 -488 874 -197 -171 1095 -511
6368 -511 -1057 1398 234 -2003 381 1647 -1317 -986 1391 11 -1033 727 43 -635 1147 159
6384 159 -1377 857 1391 -1553 -322 1965 -169 -1313 1173 953 -844 675 659 -499 695 934
6400 934 -1058 321 1896 -714 -1262 1755 948 -1603 375 1160 -844 -183 765 -698 56 921 -1090
6417 -1090 -621 1645 -38 -1974 815 1427 -1581 -736 1289 -313 -670 888 -314 -390 1221 -304
6433 -304 -1272 1465 1157 -1553 141 2142 -361 -870 1158 583 -498 862 319 -513 1217 754 -1216
6450 -1216 457 1943 -975 -879 1894 435 -1296 491 896 -812 186 557 -838 358 1125 -1257
6466 -1257 -528 1784 -289 -1957 1049 1123 -1443 -256 1161 -543 -231 696 -612 -285 1298 -532
6482e32o56K691n95k571J955J523k504m6J969r10j019J615j137m61K002j060j851
6499a587K517O65l053O41K615j763j325J956j93j067R57j45j205J539K21k386
6515a613J416J931k425p55K719o48j994J468P76j490N93M59j431J239J079k152
6531h28p3K534r93k253K297Q01k359M04J621j282L9R84j253r2J916j581j370K532
6549A044K78k973J314J966j913q28K000p98q01J281n68q88J712q3k487J796J612
6566A664k456o22K714o73j991J730K70j309J073m8j375J461Q11k439L34K676j663
6583A57j863K436J72k111J141J005j481M62Q15j584N51J710j693j040K653l06
6599A024k678J604J542j851k54J605j092k38J184j357k91K028q13j993K090J053
$$ plain form
6482 -532 -1188 1503 908 -1663 292 1815 -689 -735 1234 324 -695 920 -217 -678 1324 264 -1587
6499 -1587 930 1595 -1458 -817 1798 35 -1290 666 473 -594 363 218 -987 552 773 -1613
6515 -1613 -197 1734 -691 -1446 1273 625 -1369 99 875 -615 -22 437 -994 245 1324 -828
6531 -828 -901 1633 640 -1613 684 1485 -874 -470 1151 -131 -92 892 -361 -453 1463 -118 -1488 1044
6549 1044 1322 -1651 -337 1629 -284 -1112 888 90 -711 570 2 -886 826 743 -1744 52 1664
6566 1664 -792 -1414 1300 627 -1364 366 636 -673 400 352 -1023 438 1249 -1190 -856 1820 157
6583 157 -1706 730 902 -1209 -68 937 -544 -82 733 -851 -300 1410 -283 -1323 1330 1024
6599 1024 -1654 -50 1492 -359 -613 992 -100 -338 846 -511 -802 1226 413 -1580 510 1563
6615A563k679J06K629j539j019J453l35p19J171l35j322J855K55k371P73K313
6631A799k012j357K440j70j764J181M42j118O88L11j537J177J236k189m97K871
6647A501p76k308J776R51j888L22J110r34J7J040j572J51J933j174j936K457Q36
6664A506k818P13J943j504o32J146l52o43J429r04j139K121m6k315J225J725k008
6681e53o00K065n84j451J263J35p89R08n9j471J340J176k516p3K784j264j855
6698a544J834P98j781N88P15q97L77P15j591M11J895j583j398K545j06k203J083
6715a42J287j167l19J064j005j45J304j152q71K227n33k202J713J402k272k57
6731a068J970r25p09J070m85n72J359m62j616J814R06k507O03K086j420j462J998
$$ plain form
6615 1563 -1116 -1010 1619 80 -939 514 179 -540 631 296 -1026 829 1084 -1287 -514 1799
6631 1799 -213 -1570 870 700 -1064 117 559 -559 129 440 -1097 80 1316 -873 -1370 1501
6647 1501 725 -1583 193 1144 -744 -422 688 -246 -229 811 -761 -610 1323 149 -1787 670 1506
6664 1506 -1312 -599 1344 -160 -792 354 2 -641 788 -116 -1255 866 820 -1495 -270 1455 -553
6681 -553 -1153 912 328 -1123 140 275 -514 394 335 -1136 204 1380 -1136 -1209 1575 311 -1544
6698 -1544 290 1088 -693 -105 610 -287 90 805 -786 -375 1520 -63 -1461 1084 978 -1225 -142
6715 -142 1145 -22 -341 723 -282 -427 877 -275 -1146 1081 548 -1654 59 1461 -811 -1068
6731 -1068 902 -23 -732 338 -147 -719 640 178 -1438 376 1282 -1225 -622 1464 44 -1418 580
6748E80J65j360P22K88j008J268Q5j783Q50J765j965q66K286k19k128J261J165
6765A106j700K64R68j303P60Q79j511n89K282p35k162K031P39j989P4J548q20
6782a58n05J176p03k67J260r50j306K147N01k536P94K088j545j115J931m44r80
6799f12J035j31p85J165o5j710J215J557k251m63K342p18j716J312N06j116O42
6816B07J25r87P25Q07j896J70K216j282j668K055N25j913M34J047r48L4Q35q54
6834c68r7J455j194j157K452k67k237J256J647j862m12J566n88n01Q87n28n53
6851e01J487k17k155J799J206k412J3K120r65j388J446n5q70O21K78j126R67O62
6869I10k066O58J842j601j234K234r4j803J021O18q52J11P37j219O54J274j594
$$ plain form
6748 580 745 -615 107 395 -613 655 740 -1043 -193 1572 -393 -1259 1027 808 -1320 -59 1106
6765 1106 -594 -330 638 -665 95 974 -537 -1126 1156 421 -1741 290 1029 -960 -886 662 -158
6782 -158 -663 513 -190 -457 803 -147 -1453 694 1195 -1341 -547 1541 -4 -1119 812 368 -612
6799 -612 423 292 -493 672 607 -1103 112 1669 -582 -1045 1297 579 -1137 175 681 -435 207
6816 207 332 -655 70 877 -1019 -849 1367 85 -1583 472 997 -916 -482 565 -383 -349 486 -368
6834 -368 -465 990 -204 -1361 1091 824 -1413 -157 1490 -372 -784 782 194 -307 580 52 -501
6851 -501 986 769 -1386 413 1619 -793 -780 1340 375 -1013 433 378 -492 129 407 -719 248 910
6869 910 -1156 -498 1344 -257 -1491 743 649 -1154 -133 485 -367 -256 481 -738 -84 1190 -404
6886d04r03K574n88k014J494J061j447l49J469r85O8P76r59l73J772r35j434J747
6904E70R30k407M57J690j102r46J301j13q49R85n18r33J384L02j974R75J801k030
6922d77p67J898k20j517R70N55r43P02J19j158R62Q93k000J41K151q83j660J495
6940B61P42j482L53P53r27K63Q19j148M6J660j352j310K177L89k185L78J792j515
6958b86j98J032l99m93R10o02p53J719l36j896J243J409j795n17J782n73j032
6975g85J059j06p33J088l04j147J389P30k097K36K321j433j483J797L55j482N81
6992a4O24j082O60O03j560N35J619j560j104K440k70j925R09J155j354q4Q35n88
7010a61j26R88j231k58J740p73j478J437J108j978l2J660q47n76R29n25l51R98
$$ plain form
6886 -404 -1307 1267 679 -1335 159 1220 -227 -576 893 -92 -24 752 -207 -580 1192 257 -1177 570
6904 570 1500 -907 -450 1240 138 -808 493 380 -469 516 -2 -935 449 751 -1223 -248 1553 -477
6922 -477 -1244 654 434 -1083 -113 442 -501 201 320 -838 124 1017 -983 -842 1309 426 -1234 261
6940 261 1003 -479 -126 627 -300 -37 782 -366 -320 1340 -12 -1322 855 1244 -941 -563 1229 -286
6958 -286 -484 548 149 -344 566 -36 -789 930 594 -1302 -59 1350 -445 -962 820 247 -785
6975 -785 274 168 -565 523 219 -928 461 1191 -906 -670 1651 218 -1265 532 887 -595 -14
6992 -14 610 -472 188 791 -769 -234 1385 -175 -1279 1161 891 -1034 -125 1030 -324 -408 427 -161
7010 -161 -287 701 -530 -788 952 179 -1299 138 1246 -732 -764 896 49 -527 402 -123 -474 524
7028E24m68j027J357N00j913M64J903j488p88J521L7j149N90J30o53Q76p1j135
7046g90P47J208j571o60J933m50j438R95O75j025K89N14q72M67P04j215j35J699
7064A075q87j405J721M14j691J59J432r40l59R33n56k42J195q81j048J789%j777
7082a068P48J662j595p12J556m74q03Q57Q7q33J057k60j278J087J111j827k36
7099i21J836q14r35J073L44j091N27J81p54Q38K41j289L00J569j208j175J820
7116E42L33j803N62J005p53j91O42p65Q7R94j202l51J643j45j615R43J007j466
7134e33k85J384m34o57Q77m27m68J184n68j129J168Q36j914J62J727p19j099J084
7152A89K41r11P92j11p84R83K10j505N67J400j134r99J783j07j502Q55N54q13
$$ plain form
7028 524 56 -971 386 886 -1027 -563 1340 -148 -936 585 622 -527 63 193 -460 416 345 -790
7046 -790 -43 1165 -406 -1066 867 417 -1021 -26 649 -376 -87 427 -445 22 726 -489 -624 1075
7064 1075 188 -1217 504 918 -773 -614 818 -122 -481 452 -104 -346 849 -32 -1080 709 709 -1068
7082 -1068 -320 1342 -253 -965 591 117 -686 171 258 -575 482 222 -1056 31 1142 -685 -921
7099 -921 915 101 -834 239 583 -508 19 200 -554 284 525 -764 -464 1105 -103 -1278 542
7116 542 875 -928 -366 639 -114 -305 337 -428 -341 653 -549 -900 743 598 -1017 -74 933 -533
7134 -533 -818 566 132 -525 352 -75 -543 641 73 -1056 112 948 -966 -804 923 204 -895 189
7152 189 430 -481 311 200 -584 399 609 -896 -329 1071 -63 -1062 721 614 -888 -33 521 -292
7170b92K91L39q32L68Q47j308l28J846o23j287Q92P41j139j7R00p07KM26n40j48
7190e69J315q44q51J301N25j890N20J406j117o51J191l23k97N19k54o49J020J17
7208D69j606J043J343j611m75J601m39j145R03L20p66N18Mq06P11O31j410KJ548
7227H35o57j563J589K92j280N60O17q25J19N25r06J55J256q39j069J543L32j781
7245a097O89J267j310JQ81n06j91P90m79o65J191j86j334J027J057j677k59J541
7263G40m80r15P96rm18N23p9r95J061M28j651M77J561j227j003J413O4j080O07
7282a87M79q20L67L71r78M35J070j304m05J622p4j903J195R02j243K24L77k39
7300a11j06P60p59l81J528o44j389J467M98j570K18J163o61n94P57k76l38P68
$$ plain form
7170 -292 -1 338 -494 -126 721 -587 -915 931 308 -979 -87 654 -485 -502 398 -309 -307 119 -421 -569
7190 -569 746 -98 -949 352 877 -1013 -493 913 -204 -855 336 13 -284 235 -19 -668 352 469
7208 469 -1137 -94 1249 -362 -837 764 325 -820 83 403 -363 155 159 -647 64 695 -715 -713 835
7227 835 178 -1385 204 496 -784 -224 393 -432 -313 212 -694 -539 717 -122 -1191 352 684 -1097
7245 -1097 -408 859 -451 -450 431 -75 -266 524 45 -620 571 385 -949 78 1135 -542 -801 740
7263 740 260 -655 141 132 -286 237 158 -837 224 652 -999 -522 1039 -188 -1191 222 286 -794 -187
7282 -187 292 -528 -161 210 -768 -333 737 -567 -972 650 576 -1327 -132 770 -473 -249 128 -111
7300 -111 -217 543 -216 -597 931 287 -1102 365 863 -707 -489 674 13 -581 176 -100 -438 330
7318C30n13n46J110K61j580M15J425j229q13J267O8r27P16Q1p04P92Lj068Q45
7337f7P25j314j76J621o23j113R43O22j124M13M71o72K15O62j124j1J539r43j040
7356i96J365M86j538J55J093m48q35R83l60j56P11o67n73J301K0j551O98J096
7374G84j252m82J328m00o16N35j33l81R76k64j029Q08P58j430M3J408m25j177
7392i49J119L93j104N56K90n85M93L68j145L11J075r50r25J545K91j557O69P73
7410F68r59Q0L79o21L46O80j083k78J315k31j483J311N97j204k33J272n45p20
7428g09Q96m66k30R05m68q55J069O77j700K84J367p96p54Q68K56p06N37p9k88
7447a92O11J25j256N68J242j239q18J576j72j182O27M27n43K74P3n56L74N71j101
$$ plain form
7318 330 -183 -729 381 642 -938 -523 902 -327 -1140 127 195 -732 -16 65 -639 153 156 -912 -67
7337 -67 658 -656 -832 789 166 -947 -4 618 -506 -93 378 -294 -79 583 -541 -552 987 44 -996
7356 -996 369 855 -683 -528 565 117 -718 265 -95 -251 460 -207 -780 521 541 -1010 -312 784
7374 784 -468 -950 378 -22 -638 -103 -236 -617 359 95 -934 -126 632 -798 -755 653 228 -949
7392 -949 170 563 -541 15 305 -280 213 581 -564 -253 822 -128 -1053 492 783 -774 -105 668
7410 668 -291 -211 168 -453 -107 573 -510 -788 527 296 -1187 124 721 -483 -716 556 11 -709
7428 -709 187 -279 -509 396 -72 -927 142 819 -881 -597 770 -26 -780 88 344 -362 175 96 -192
7447 -192 419 544 -712 -144 1098 -141 -959 617 445 -737 -110 317 -226 48 121 -435 -61 510 -591
7466e91L9J221o79j057J118N74j240J34P75m52j13M46o42m6J125p69r03J576j2
7485E04j177K02J200q08o44R13j44l07M19j61m49R82l04j038P26R67j226l86J499
7504G68n61q76Q18ql97M01J11q26O47N27j329R4J563q04j173J269K68j016M77
7523d7M58p42L00L53o45Q8Q84q93m52J376j50j251O92N51p41k47P57m55j06P41
7543D71o09m15J216m51j022J059N44j216k42J306o15n74P49M5m20M52O4r39R00
7562C03L77j143J77J127j031n84J114J24j050N69J74n21K35L05p36N85P78j081
7580b78l10J333l83j081N64Q84q82m3O71o26J12M78o94j67J301o85j098J144N70
7599H10j398J06J051m68m12P97n13j11P01o26n80J116K10j565O68J126j099m07
$$ plain form
7466 -591 -552 669 -10 -1067 51 625 -615 -481 294 -158 -271 175 -467 -513 612 -157 -1060 516 504
7485 504 -673 -471 729 -79 -723 190 46 -261 158 -3 -452 530 226 -812 -86 881 -345 -731 768
7504 768 207 -669 149 141 -256 145 256 -570 77 604 -725 -631 932 128 -1045 224 492 -524 -47
7523 -47 411 -331 -31 322 -323 -235 649 -244 -696 680 530 -721 -29 522 -219 -466 291 -164 -270 471
7543 471 -138 -553 663 212 -810 249 793 -423 -665 641 26 -548 201 246 -174 278 342 -597 303
7562 303 680 -463 -286 841 -190 -774 340 464 -586 -17 157 -364 -129 176 -560 25 803 -278
7580 -278 -588 745 362 -719 -155 729 -153 -196 475 -151 -39 439 -255 -422 879 194 -904 240 810
7599 810 -588 -482 569 101 -311 486 -27 -138 563 -63 -643 473 683 -882 -214 912 -187 -594
7617e94J096r4p99O05N2m74N33j26o87N45O18j245o6J452m43j123R74L81r37J76
7637a56L79o36M91K18o61Q8R00p63p88J309J82j145K36R76p81k43O33m18J52N48
7657E21o09k19P69j21j276R45P79q90l54R45l37l76M36O0m69N57j80r09R47M27
7677F46j069o2J143n43q97Q38J65n99N37%n24M46J50j000N56R06q86n68J205o7
7697C77q10K04O49n67K03K24l45l0O96p94k79J113k30j039O54P28j061L8Q98n29
7717A00k35N91m46l79Q38m88n32R40K99j334J88J036p05n80P92J19o80N16r8k14
7737b72N57j11r03N12O63p24n05J122r6q92P20L42o88L58J40n79L58O26j007J69
7757b10P15j29r44J012J50q09J8P64o71l5N00n51J52N85n10p09J172K2j307N46
$$ plain form
7617 -594 502 408 -391 214 266 -208 325 199 -488 57 675 -570 -636 816 373 -750 224 605 -332 -156
7637 -156 223 -413 78 296 -365 -277 623 -140 -928 381 563 -582 -346 630 -151 -394 239 -179 -27 521
7657 521 -88 -307 462 341 -935 10 789 -101 -455 490 153 -223 213 273 -196 361 181 -728 219 646
7677 646 -423 -485 658 115 -782 56 221 -378 159 159 -365 81 231 -769 -213 693 -193 -761 444 377
7697 377 -433 -229 420 -147 56 280 -65 -95 601 -193 -472 641 411 -628 26 754 -307 -269 629 100
7717 100 -135 456 10 -369 469 -19 -551 389 688 -646 -458 578 -127 -707 85 204 -476 40 -58 -272
7737 -272 285 174 -729 -217 446 -278 -783 339 243 -649 71 413 -275 83 223 -356 2 628 -379 -210
7757 -210 505 376 -568 444 594 -215 -197 567 -104 -139 361 -190 -38 547 37 -672 500 522 -785 -239
7777b39Q35p74n65J039k86m27M43j22m67Q96k42r51Q47P50j253j47J131l54o05
7796d91M89L83o24M99k1m45N39K03r14L48J022q07p39J086J51j065K67N51n75
7815a43J41L75o71N9R25r46m04J079lj139P06N99r77p1P86m09j23M10l90k21R13
7836D96m26q66R21M48j115J74Q85m69n35Q98l46l53N49l26k81P03Q5j110M97J136
7856I65r00n27Q96m7p77L87J29l41M08K20o07J50O76r98j16Q15r7r06N84N52q93
7877d27Q0O09m38J27L31o08q4J013o42p10J004M13j322J02J023n69p2L51k33l3
7897h5M17l58l70R48j53j067N97Q75j016k14R01j17o57M10K0k43M55k98n64O64
7917A45M04r65k63J296m65q17N66L63o23J36L05n15M33L27q54K56Q20p05m63Q17
$$ plain form
7777 -239 596 -178 -743 296 10 -417 26 -96 -563 333 91 -860 -13 737 -516 -663 468 114 -491
7796 -491 -2 381 -243 256 235 -210 329 532 -382 -34 988 181 -558 528 679 -386 -119 432 -143
7815 -143 -2 373 -298 -239 686 -260 -664 415 412 -727 -21 578 -399 -470 316 -93 -216 194 -196 -417 496
7836 496 70 -796 125 573 -542 -368 517 48 -487 411 65 -288 261 -65 -346 357 442 -668 -171 965
7856 965 65 -462 434 387 -390 -3 126 -215 193 413 -194 -44 632 -366 -482 333 236 -670 -86 466 -427
7877 -427 -347 262 -176 -49 282 -326 -410 603 -39 -749 255 668 -654 -552 471 -98 -170 181 -52 -85
7897 -85 332 -26 -396 552 399 -668 -71 804 -212 -426 475 358 -299 111 131 -112 343 45 -519 145
7917 145 549 -416 -679 617 152 -665 -99 264 -359 -223 82 -433 0 327 -527 -271 549 -156 -619 198
7937A98P6q78L21P46n20k38M21j47%K89n88j38R76l15p08M37Q02q47m55R63m73
7958g8j83M32n4k19K19j08o34Q17M72j119J45R16m47q13O91K53o73N48J39n97
7978b93M75q7n25K43P58o58n35J020Nq31L99N27p36k5L91m20K40M50n84m2O32
7999D04k50p68M68O83p25l0O40l97k27L31m2l96P22l67n97P20K12p89J13R85p36
8020d6l35N28o2m29M19J79p20O22K18q62N06Q37j182l20J021j32n89M21K38n59
8040b47K38J85l45K14L51n54k82R05l90q17P53M74r48J06P22l37j52L47l97p0
8060b44P28n10m68R93p5r52K57P98n77l84N88j46k3L14k94k45N36j11p81N74P03
8081F81r45k33R03j44p26N26J47m94O13k49m46M93K87r59L89N64m54n19O58K22
$$ plain form
7937 198 274 -604 -283 463 -57 -295 126 -21 -21 268 -320 -458 518 203 -505 -68 734 -113 -568 395 -78
7958 -78 -261 171 117 -102 117 9 -625 192 664 -455 -310 606 159 -654 37 290 -383 165 304 -293
7978 -293 182 95 -430 -187 571 -87 -622 398 403 -428 -29 498 -238 -263 128 -292 -52 398 -186 -228 404
7999 404 154 -614 -146 537 -188 -218 422 25 -202 129 87 -309 413 46 -551 169 381 -408 -295 690 -46
8020 -46 -381 147 85 -344 75 254 -466 156 374 -488 18 855 -327 -647 374 242 -347 74 312 -247
8040 -247 -9 176 -169 45 396 -158 -440 465 75 -742 11 485 -463 -357 365 28 -124 223 -174 -244
8060 -244 484 -26 -494 499 424 -528 -271 527 -50 -434 154 8 -15 299 5 -240 296 185 -596 -22 681
8081 681 -264 -497 406 262 -464 62 209 -285 328 79 -367 126 413 -546 -157 407 -47 -566 92 314
8101C14o58J56N20l67l4L20p04L59L83m76l09J093j81j042P53M43o35l01O76k49
8121F1q4L75k02l28O50l43r30J045K63p99j27R98l18n86N55j94m22O98k33l76
8141b97O25op29K68O91p19k51P42l1p18L59L83m99L29R6l45M5O20q21j91J125
8162F76n90n51M59N04n87o9K90j58P4K61m31J25O02o08n01O33K41o48J16O62m71
8183B9l98N81j78l77N54k02k89N68
$$ plain form
8101 314 -344 -188 332 -35 -69 251 -453 -94 289 -187 -496 597 416 -626 127 570 -65 -366 310 61
8121 61 -23 352 150 -178 472 129 -801 244 507 -292 -419 579 261 -325 230 36 -386 312 79 -297
8141 -297 328 322 -407 -139 552 -167 -418 324 293 -425 -66 317 -182 147 243 -102 -57 563 -258 -449 676
8162 676 86 -465 -6 498 -89 -158 132 -26 48 309 -122 3 605 -3 -504 129 370 -278 -162 500 29
8183 29 -369 212 34 -343 211 9 -280 288
8191B88
$$ Imaginary data points
##PAGE= N=2
##DATA TABLE= (X++(I..I)), XYDATA
0@%%%%%%%%%%%qJ6j6J6j6K4l2M0m8N3o4P5q8J04j20J41j65J89k16K46k80L18l58
34a89M02m53N08n70O38p10P88q72R67j071J184j308J441j587J750j928K122k337
52a225K576k846L149l486L873m325M850n469O219p150Q333r892J2047j5219K0337
67A1772k9868N3106k02182k06208O34600j72053m21454L81116J34394l75700K10352
78A7875J55769l53074J75737L10365m58990m1934N53009k70288m21943M87236
88A53762J22924m92891J59128K83966l26064J4620K56962k97537l5403L92279
98B31746k88727k95989M98886J6654n40556K57142L54401m22397p4849L76837
108A13148j90375j58413L06218j37818k16464L81123k4364m32939L17615L02524
$$ plain form
0 0 0 0 0 0 0 0 0 0 0 0 0 -8 8 -8 8 -8 16 -16 24 -24 29 -35 40 -48 56 -64 77 -88 101 -115 131 -149 169 -189
34 -189 213 -240 268 -302 336 -374 414 -458 509 -562 622 -686 755 -832 918 -1010 1112 -1225
52 -1225 1351 -1495 1654 -1832 2041 -2284 2566 -2903 3316 -3834 4499 -5393 6654 -8565 11772
67 11772 -18096 35010 -167172 -373380 261220 89167 -332287 48829 183223 -192477 17875
78 17875 173644 -179430 -3693 306672 -152318 -194252 358757 88469 -333474 153762
88 153762 276686 -216205 -57077 226889 -99175 -84555 172407 -125130 -160533 231746
98 231746 -56981 -352970 145916 162570 -377986 -120844 233557 -188840 -263689 113148
108 113148 -77227 -235640 70578 -67240 -283704 97419 73055 -359884 -42269 260255
118B60255m80321k7013M77048k08850k71985L39255Q693k56289K32980L6854k97844
129a87217K48850J83751m31322O7437M38383l12798k70401M30569J0643l78296
139b00401K01102J58861k87654R9502J71828l05453N5653L22048l15440j85835
149b85789M43609o1031m19177K65514K31638l55687Q238K70214k00023n4187K44067
160H7386j85862j15059L41330j02623l24370L18629J77458m03300N1893L50519
170A96001k22455j49144K79430p3421j58578K35036n4364k31993K74479Q9725
180A84716l81203J27582L37783l11281j66810L69185n6793k79375K10063O5211
190I9078k31213J47322Q8953k76751J18172K43656l12888r4774L82994j15903
$$ plain form
118 260255 -220066 -247079 229969 21119 -250866 88389 97082 -159207 73773 110627 -187217
129 -187217 61633 245384 -185938 -118501 319882 7084 -263317 167252 177895 -200401
139 -200401 701 159562 -128092 -28590 143238 -162215 -106562 215486 -99954 -285789
149 -285789 157820 96789 -322388 -56874 174764 -180923 -172685 97529 -102494 -156681 87386
160 87386 -98476 -213535 127795 25172 -299198 19431 196889 -206411 -154518 196001
170 196001 -26454 -175598 103832 30411 -128167 106869 52505 -179488 94991 184716
180 184716 -196487 -68905 268878 -42403 -209213 159972 103179 -176196 33867 99078
190 99078 -132135 15187 104140 -172611 -54439 189217 -123671 -218445 164549 48646
200D8646l16300K67877J28700k95354P7431J72794j99546L4903J80759k19719
210a19809l0662L06522j62924k44973L23449Q5115l54355J15570K56585k33021
220e8503n6735K26111j24893q0775K17760j12882j69800K76841J8504l29511J69371
231b4512K49151l00449p5948L02688j06583j80739J95879j2751j61401J70901
241E6236J0837k35525J69734J65569l08958p329L24885j70562k17584K65639L4208
252H7150k33106J25673Q8432j86763R8169J24671k37984L5304K72051k10548j75205
263b12156L22247N961l02656J58236J73312k22435R374J68664j47816j6479J89750
274A26002j56515j09451K75335m8572k77376K07174J65358k82298J73K37348j35892
$$ plain form
200 48646 -267654 223 128923 -166431 -89000 83794 -115752 -80849 99910 -119809
210 -119809 -150471 156051 -6873 -251846 71603 156718 -197637 -82067 174518 -58503
220 -58503 -115238 110873 -14020 -94795 122965 10083 -159717 117124 135628 -193883 -24512
231 -24512 224639 -75810 -151758 150930 44347 -136392 59487 46736 -114665 56236
241 56236 67073 -168452 1282 166851 -142107 -149436 175449 4887 -212697 52942 87150
252 87150 -145956 -20283 68149 -118614 -20445 104226 -133758 -98454 173597 -36951 -212156
263 -212156 110091 116052 -186604 -28368 144944 -77491 -68117 100547 -47269 -63748 126002
274 126002 -30513 -139964 135371 86799 -190577 16597 181955 -100343 -100170 137178 1286
285A286r9205J75282o9098j03963J86845m9390k01880K08776J02629k97916N6756
296h9878K68688j95087j41288K42147k1084j77627J41296L0800j63187J32810
306B7590P5438k34839Q2679K25517k28713j10863K91153m4923k40096J65680J05022
317A13645j92089N2394J12787j56642M0471J56607j90798n0751K65069j03219
327D7474k25551K26757R9968k58214N0779J85945j51830l9522J56756j10056n6835
338g4329J93232r6603j66451K29224N0229k74108R5597K16776j98835q5367K11657
349A01022n7412j25602J42634k1613j28368J56239J9238k14010J23036J68023
359A63187k31699n0363K51679q5035j79076J68278M1239j59349R1366N5339j54405
$$ plain form
285 1286 -97919 77363 8265 -95698 91147 41757 -160123 48653 151282 -146634 -89878
296 -89878 178810 -16277 -157565 84582 63498 -114129 27167 57967 -105220 27590
306 27590 103028 -131811 -49132 176385 -52328 -163191 127962 83039 -157057 8623 113645
317 113645 -78444 -26050 86737 -69905 -29434 127173 -63625 -114376 150693 47474
327 47474 -178077 48680 148648 -109566 -58787 127158 -24672 -64194 92562 -17494 -74329
338 -74329 118903 22300 -144151 85073 135302 -138806 -43209 173567 -25268 -110635 101022
349 101022 43610 -81992 60642 39029 -89339 66900 86138 -127872 -4836 163187
359 163187 -68512 -118875 132804 47769 -131307 36971 78210 -81139 10227 65566 -88839
370h8839R1042J15487k07001K836K39529j38078j73478K29334M6901k26907Q6878
381b2296J35231j52631J2153J23485j32045n876J76243j31551j18982K30568J097
392A15396k40151J26821J61498j96982k8933J74404r0687o7710J34334p1963q5709
403f9682J70163l3037j90403J55497J18447k33558J171K18078j19172j24348J65644
414E8800j1221j23198J12729P131j38013J20934P5857k04038M1801K06335j56269
425i152j23148K16898J204j82485J06077P9192j32259N1632P8571j35332L9577
436i225J46754j54655p1285K22510m5200k00620J50752J04080j85260K0034J31010
447A08895j09234j7512J16933j05513m8894J73880p2472j66534J78257P4657k27142
$$ plain form
370 -88839 2203 117690 -89311 -86475 153054 14976 -158502 70832 117733 -109174 -22296
381 -22296 112935 -39696 -27543 95942 -36103 -41979 134264 2713 -116269 114299 115396
392 115396 -124755 2066 163564 -33418 -62351 112053 21366 -46344 87990 16027 -69682
403 -69682 100481 67444 -122959 32538 150985 -82573 -81402 136676 17504 -106844 58800
414 58800 47579 -75619 37110 44241 -93772 27162 103019 -101019 -59218 147117 -9152
425 -9152 -132300 84598 85802 -96683 9394 88586 -43673 7959 86530 -48802 -9225
436 -9225 137529 -17126 -88411 134099 88899 -111721 39031 143111 -42149 -22115 108895
447 108895 -339 -17851 99082 -6431 -55325 118555 46083 -120451 57806 132463 -94679
458i4679M2763J80933j36759p5498J48381m5608q3903J17132l1990j13629J41833
469D8976L5583j94840Q0889J67709j71101o8655J95929m0092j33598J15368K8524
480F4692j08091Q2631L6926j35113Q0143J16537j73936k4124K07619q5718j56153
491i4587J61311N2632j62868N2830Q9171j12481K0992R2526j25291r797J62970
502A27408j07458j27699J86163K5792k00978P4504J33255j37313l0168J20890
512F4396p1001m1441J13645p1512q1262J59384j2037j77577J18487J23464j78395
523e3849j9970J72235p1416r2227J19331j2125q6016J05477l54j29564J12312
534D3834Q3886j80338J4453J83059j08106j16098J56373J5352j35121P0635N0652
$$ plain form
458 -94679 -51916 129017 -7742 -83240 65141 19533 -64370 52762 20772 -92857 48976
469 48976 84559 -110281 -29392 138317 -32784 -101439 94490 54398 -79200 36168 64692
480 64692 -43399 39232 76158 -58955 21188 137725 -36211 -60335 147284 61566 -94587
491 -94587 66724 119356 -43512 9318 98489 -13992 7000 99526 -25765 -35562 127408
502 127408 19950 -107749 78414 104206 -96772 -22268 110987 -26326 -56494 64396
512 64396 -6605 -48046 65599 -5913 -87175 72209 60172 -117405 1082 124546 -53849
523 -53849 -73819 98416 27000 -65227 54104 41979 -44037 61440 61086 -68478 43834
534 43834 127720 -52618 -38165 144894 36788 -79310 77063 92415 -42706 27929 78581
545G8581j04922N2749O0814j32456K8720J38747j29141q4548J78019j2923j67375
556i3735R3915Q8807j29961R234R0772q8873L27J01805j01614m6037J62039m8003
568C8676j52516J37332Q5639j72700J4434J45084q8896n4755J11358m3303n6465
579c6112J12634l6266j08210J30147M7161j72690M6909J52292j23052p5329J45540
590H3024k0630j01795Q4110Q337q8132Q0624K4326j31510O3520J12136j44528
601c0518m6036J68570m6551j35327J08798M7937j17261M0691N7854r3125L3010
612a1958Q1237j15139j4726J50743p2285j22819J43015M8843j54988M1803J08022
623H1748r2300j7194Q7713o2991k1063J04198o5158q0075J38494J0690j57944
$$ plain form
545 78581 -26341 26408 87222 -45234 -16514 122233 -6908 -91456 86563 73640 -93735
556 -93735 180 88987 -40974 -31740 59032 -29841 -29514 72291 -29323 -75360 86679 38676
568 38676 -113840 23492 109131 -63569 -49135 95949 7053 -47702 63656 20353 -36112
579 -36112 76522 40256 -67954 62193 109354 -63336 -16427 135865 12813 -62516 83024
590 83024 62394 -39401 44709 53046 -35086 45538 69864 -61646 1874 114010 -30518
601 -30518 -76554 92016 45465 -89862 18936 66873 -50388 -9697 48157 -44968 -11958
612 -11958 69279 -45860 -60586 90157 17872 -104947 38068 86911 -68077 -26274 81748
623 81748 -10552 -27746 59967 -3024 -24087 80111 14953 -65122 73372 84062 -73882
634g3882P5661J16922j31098l4179J26906m8907o5491Q6379k5701o6652R6937
645E6895o067j24639Q9556Q7525j53090j2328J54743p1174j02273J11584J4963
656D5695r5763N7416K7832q6665N6905N7887j20821J4576J34619r3120q9170J41680
668E1071J2632j29443O0648P0074q7310J3625O2403p5184Q630R4153q7632n4254
680f0587J41466k0902j38037R3845Q2694j27053l300J02649o1852l5838P9129
691E2214m6651m5489J02558l1315j09628J06285N8076j47683J7181J29056q3051
702A553o8121J02365j1138p0030O6713k130p5012P9094K9868j23570M6294J13527
714H9413j11569n4455J35652j8542j04715P4063L8116q1518L8549L9974q4177
$$ plain form
634 -73882 1779 118701 -12397 -46576 80330 31423 -34068 52311 26610 -40042 56895
645 56895 50828 -73811 15745 103270 -49820 -62148 92595 21421 -80852 30732 45695
656 45695 -50068 7348 35180 -51485 5420 63307 -57514 -42938 91681 -1439 -90609 51071
668 51071 63703 -65740 -5092 64982 -22328 -8703 53700 -21484 -12854 81299 -6333 -60587
680 -60587 80879 59977 -78060 15785 98479 -28574 -31874 70775 8923 -26915 52214
691 52214 5563 -39926 62632 31317 -78311 27974 86050 -61633 -44452 84604 1553
702 1553 -66568 35797 24659 -45371 21342 19212 -55800 23294 53162 -70408 -24114 89413
714 89413 -22156 -76611 59041 40499 -64216 9847 47963 -33555 4994 44968 -39209
725c9209L5561Q0696j05034k6419J36116m6393j13531J02341N1842j15067J9080
736b0017P7888o7282q093O6067o3709j8032R9258n6140q4477J14580K6239j32757
748f6475M1169J00310q8597l5431Q9440l3898m2870P1131l0811n8045R4315J082
760D1320j16366O9563Q9261j18817k6544J24622m0254q1562P9633J0915o9401
771c7630N5213J4577q1790N8100N9084j11755K41J22897o5390q7488J05247K3039
783E4345j00192L9236M9927o7900K0380M6959p6139J0342R0344p6264n9761J18377
795D9654q68j18252O0783P4009r1066p045P3685m9760j7072O7101n1070l8405
807d8306R7686k0867j03224Q2468O5186j16758k544J05893n4091n3895P4219j3191
$$ plain form
725 -39209 -3648 77048 -27986 -54405 81711 35318 -78213 24128 75970 -39097 -20017
736 -20017 57871 -9411 -17504 48563 -15146 -33178 66080 9940 -74537 40043 66282 -66475
748 -66475 -25306 75004 -13593 -49024 40416 6518 -36352 34779 3968 -54077 40238 41320
760 41320 -75046 -5483 83778 -35039 -61583 63039 22785 -58777 20856 31771 -37630
771 -37630 17583 32160 -49630 8470 67554 -44201 -43960 78937 13547 -73941 31306 54345
783 54345 -45847 -6611 43316 -24584 -4204 42755 -33384 -23042 67302 -8962 -68723 49654
795 49654 48786 -69466 -8683 65326 -25740 -32785 40900 -8860 -25932 41169 -9901 -48306
807 -48306 49380 28513 -74711 7757 72943 -43815 -46359 59534 5443 -48452 25767 12576
819A2576m7655O1300j1134o9569P3928L4929j11475K5220J06151q1428n9265J04254
831C7832m918q0130N3599K2186o1738M1867K7511q1283L3200P9922r0705l7777
843f0434J18874k3789j01465P3828M8038q5368J4522N3782n5138M715N6345o3548
855a9638j8962R5424m0867q5875R1457L8634j08891K0195Q1539o1439k6445O2532
867B7664l1361k6108O3096l2493n6701Q5692J2259j07657M6751Q5914q9560l2694
879e5198R4483k3572n9159N7522J176n0827N4191R190p9386N1623O3972r8112
891c4097j3862J09734m2328p8415P7010K3813p2637K9334L2591n5659K5648M2307
903D3439p5252M456Q9924o1799o4900R7832J1924r7539L8245N9206o4720m191
$$ plain form
819 12576 -35079 26221 15087 -54482 19446 54375 -57100 -31880 74271 -7157 -66422 37832
831 37832 32914 -47216 6383 28569 -33169 8698 36209 -45074 -11874 68048 -22657 -60434
843 -60434 58440 34651 -66814 7014 55052 -30316 -15794 37988 -17150 -12435 43910 -19638
855 -19638 -38600 56824 15957 -69918 21539 60173 -48718 -28523 53016 -8423 -34868 27664
867 27664 -3697 -29805 33291 798 -55903 29789 42048 -65609 -18858 67056 -22504 -55198
879 -55198 39285 15713 -43446 14076 15252 -35575 18616 27806 -51580 43 64015 -34097
891 -34097 -47959 61775 19447 -58968 18042 41855 -30782 -1448 31143 -24516 1132 43439
903 43439 -31813 -27357 62567 768 -64132 33700 45624 -51915 -13670 45536 -19184 -23375
915b3375N1828m5491p222O2866n1175m1435R2142q869r6901O0846O4640q9035
927c1181j1588Q1073l4997l8472N5625j6661l5938O1494j1564o9801O6488M2305
939E6783r7222Q919R3555n4674n4689P5129K137n7950M1176J0330n2163M4589
951A5920K4348q0711K6294P8529p5701m4179R7344q203q5032M9763L9262o3546
963b5912J4154L7758n3383J2603N4670o4384k2552R0737k7670q1881P0450M3267
975D7857q4945P871O4896m4433j5641M9234l4086j6960O3974l1566n6611P6838
987B6428K1491r3444K8104P7369o3927l2711P0771j7002m1131M7448r730m2882
999b9216N5850O572p7584M1695O3682q1780k4297R0967k5310o7303N5729J7547
$$ plain form
915 -23375 28453 -17038 -24260 38606 -12569 -54004 38138 29269 -67632 -6786 57854 -31181
927 -31181 -42769 38304 3307 -35165 20460 3799 -32139 29355 17791 -52010 14478 56783
939 56783 -40439 -31520 62035 7361 -47328 27801 29938 -28012 13164 23494 -28669 15920
951 15920 40268 -40443 -14149 64380 -11321 -55500 41844 33641 -51391 -1628 37634 -25912
963 -25912 -11758 26000 -27383 -14780 39890 -24494 -47046 43691 16021 -65860 4590 47857
975 47857 -37088 -29217 35679 -8754 -24395 24839 -9247 -26207 37767 6201 -50410 26428
987 26428 47919 -45525 -17421 59948 -3979 -36690 34081 17079 -24052 23396 13666 -29216
999 -29216 26634 33206 -44378 -2683 60999 -20781 -45078 45889 20579 -46724 9005 26552
1011B6552n4168K8557J7789n1722L1082L9663p2119j145Q4713m5942o3700P8220
1023A7780J9405p7621K7396M4673m8756N711L8768m6256J651O2086m8572m2698
1035d6433Q4282J804q7602M4530N9596o8894j1725O0726k9889k2905M5770k5110
1047D150l0488O1229j0289p0572N4818M6112q3908l547P8690l8661m5816N4336
1059A6054j801m0148L6793m7m7172M5007K5490p6071J6477P6655n9162m5360P8880
1072B5595P06o5548L6960K7371m6285J9601K7080n1325J6417N6106n9609k7599
1084d0530Q4758j5605p5767N4075M0406o5418M421M6898l6092o007M0525l8357
1096f693j5855O4655k8598o0207O6509K6866q2209J5284O4492m7084k6879N1055
$$ plain form
1011 26552 -27616 941 18730 -32992 -1910 37753 -34366 -35511 49202 3260 -60440 17780
1023 17780 37185 -40436 -13040 31633 -17123 -11412 27356 -18900 -17249 44837 -3735 -46433
1035 -46433 37849 39653 -47949 -3419 56177 -12717 -24442 36284 6395 -16510 29260 4150
1047 4150 -26338 34891 24602 -45970 8848 54960 -28948 -32495 46195 7534 -38282 16054
1059 16054 14253 -25895 10898 10851 -36321 8686 34176 -41895 -25418 51237 -7925 -53285 25595
1072 25595 26301 -39247 -2287 25084 -21201 -1600 25480 -25845 -9428 46678 -12931 -40530
1084 -40530 44228 28623 -47144 6931 47337 -18081 -13660 33238 -2854 -8861 31664 -6693
1096 -6693 -22548 42107 13509 -46698 19811 46677 -35532 -20248 44244 -2840 -29719 21336
1108B1336j6703k7687M3007j5906m1542N6809J0638p6105L2601O3831o5883k7594
1120d3198P3683j3388n1643M1105J1590m0162L0772J2190n1677L1964M3683o7239
1132b2320r070P8856l1003n9620N8595K1559n8590J7981L1656m0047J1177L2257
1144C1431m9714J387O2936m4251m7102P3105R526p6812K8901N1145n1752j0789
1156b1989M5392k8306j3345M3951l0481l0603O2864n536o9555M4546M8769o8095
1168b2388j0661O5164k5394l5829M2808n526l0327L9986m659m7914M5395K9312
1180C9967p0529P266P0675m2785m4240O0931M754n0474K8812J6304l9227K5299
1192F753K0978n3935J5808N5973n3409l3144P3584n133o7397L8456L5869n0919
$$ plain form
1108 21336 4633 -23054 19953 4047 -37495 19314 29952 -46153 -13552 50279 -15604 -43198
1120 -43198 30485 17097 -34546 6559 18149 -22013 8759 20949 -30728 1236 44919 -22320
1132 -22320 -31390 47466 16463 -43157 15438 36997 -21593 -3612 28044 -12003 -826 31431
1144 31431 -18283 -16896 46040 1789 -45313 27792 37318 -39494 -10593 40552 -11200 -21989
1156 -21989 23403 -4903 -18248 25703 -4778 -35381 27483 21947 -47608 -3062 45707 -22388
1168 -22388 -33049 32115 6721 -29108 13700 8174 -22153 17833 13174 -34740 10655 39967
1180 39967 -30562 -23296 47379 4594 -39646 21285 26039 -24435 4377 20681 -18546 6753
1192 6753 27731 -26204 -10396 45577 -7832 -40976 32608 27475 -39922 -1466 34403 -16516
1204a6516M623L3721l4472L302L7662m1734j5636O3791k1305o0103N4777L2212
1216D0322o8528O604N4009l5601j8197M0031k0645j7488M4028j9822m1845N5215
1228A8083J5803p1457K1871O1003n2020k8308N8980j0168l8395L4352J096l3054
1240b2214L4646Q185n3253K8486M6209n9962j7134P0214j9750n3325M4422J8140
1252B4664m4318J7224J9534l5949J7455K9460m9868j231O2081l5403m8523O2104
1264A7230J4678o3981K0145M0658l9457m065L3576k9602n326M3353l1948l2446
1276c7185O0938R73o7161L4646M7137n5568j2136N1167j9937k4629L4637j1872
1288A010k4617M2152n601n0573M1654L3906o4562k11O3349l1557l8175M6250L370
$$ plain form
1204 -16516 -11893 21828 -12644 -9342 28320 -13414 -29050 34741 13436 -46667 8110 40322
1216 40322 -28206 -21602 32407 -3194 -21391 18640 -2005 -19493 24535 4713 -37132 18083
1228 18083 33886 -37571 -15700 45303 -6717 -35025 23955 13787 -24608 9744 10840 -22214
1240 -22214 12432 20617 -32636 -4150 42059 -17903 -35037 35177 15427 -37898 6524 24664
1252 24664 -19654 -2430 17104 -18845 -1390 28070 -21798 -23029 39052 3649 -44874 17230
1264 17230 31908 -32073 -11928 28730 -10727 -14792 18784 -10818 -16144 27209 -4739 -37185
1276 -37185 23753 24726 -42435 -7789 39348 -16220 -28356 22811 2874 -21755 12882 1010
1288 1010 -23607 18545 12944 -37629 4025 37931 -26631 -26842 36507 4950 -33225 13025 16395
1301A6395l6669K6057P423l5985K9230K0929n5124J1701N7135m5477l5601O2512
1313B2526J284n5856K7493K7663l8470P251K4451l4690O900L9096m2453j9706
1325c4511O1927j3996n7718M2818L2434n4343J391M1791k7265j0831L2712k4056
1337i647j3600M6586k0093m3763N1659K0217o4664J3660N4989l9015k5261M5519
1349A6587q544k7756L1749n562l1363L8914Q442n4984K4432M7481n1591k1681
1361c3876N9108j0722m5010L2837J3289l4755J8637J2455l7286K0509L0856m9831
1373b3789o125N9335k5853m7536M8605J8651n1601J3201L1614l1994K550K7574
1385A4632l2580j786M5585l0312l4989N6285Q205o0766K3833M4492m2660j2135
$$ plain form
1301 16395 -20274 5783 13206 -22779 6451 27380 -27744 -16043 41092 -4385 -39986 22526
1313 22526 23810 -32046 -4553 23110 -15360 -8109 16342 -18348 -11448 27648 -14805 -34511
1325 -34511 27416 13420 -44298 -1480 30954 -23389 -21998 19793 -7472 -18303 14409 -9647
1337 -9647 -23247 23339 3246 -40517 11142 31359 -33305 -19645 35344 -3671 -28932 16587
1349 16587 8043 -19713 12036 6474 -24889 14025 22467 -32517 -8085 39396 -12195 -33876
1361 -33876 25232 14510 -30500 2337 15626 -19129 -492 11963 -25323 -4814 26042 -23789
1373 -23789 -29914 29421 3568 -43968 4637 23288 -28313 -15112 16502 -15492 -12942 14632
1385 14632 -17948 -19734 25851 -4461 -39450 16835 25040 -35726 -11893 32599 -10061 -22196
1397b2196M0616j7896j5856L2219j7607k2659M3868l993n1442L4732L7118n6057
1409a9153q118N4537k2071l3104L5710o53k8154K6933L41l6465L0980K2599n4084
1422c0702N006N5795l5094l7456N1352N795m5267K1619J9951l1431J3218J9632
1434A2418l6312Q660M1752l7959k4963N7698l500n3920L1505L1964m1957M50L1394
1447A7230k3518l577K9077k7017j3390M6989j5368m6876M3451K5653n7263M591
1459b0018M7328k9832k0952L4438j0789k0145L0861j0009l2810L8577J3158n5205
1471c5398J6306M8771m2106k4573M9337n200l5619K6262P702k7578K2116J0422
1483A0442l8772J9999L6019m5738j2740N6874j5977m4398L7754J8506l9212J0705
$$ plain form
1397 -22196 18420 524 -15332 16887 -720 -23379 20489 16496 -34946 -214 36904 -19153
1409 -19153 -27271 27266 5195 -27909 7801 7148 -21006 5927 6268 -30197 783 23382 -30702
1422 -30702 -25696 30099 -4995 -42451 8901 14696 -30571 -8952 10999 -20432 -7214 12418
1434 12418 -23894 -15234 26518 -11441 -36404 21294 17794 -36126 -4621 27343 -14614 -14164 17230
1447 17230 -6288 -9865 19212 -7805 -21195 25794 10426 -36450 7001 32654 -24609 -20018
1459 -20018 27310 -2522 -23474 10964 175 -19970 10891 882 -31928 6649 19807 -35398
1471 -35398 -19092 29679 -12427 -37000 12337 7137 -28482 -2220 5482 -22096 20 10442
1483 10442 -28330 -8331 27688 -18050 -30790 26084 10107 -34291 3463 21969 -17243 -6538
1495f538K2471k7599P272K5529l4904m137M7559k5921l9200M8677J3602n3879
1507b7068J4155L7363l2419j0042K9842j8154j0732L1593k0180k5623M4484Q41
1519A4060n2046K7068L8184m5526j1667M4618j4542k5388K8825l956k1948K9781
1531G463r72l7908L1049K7038n0674k12N2840k5203l4520M0314P063l4545J8743
1544D76J2344k8207J7261J8650l9673O598M3877l4293k8699M9796K069m7339K1406
1557e734K6872l2917R80K3165k4405R35K9122k9447j5980M6563j0040m6299L4377
1570b808K7940m6206j100L8950k1513j5049K8518j3525j4716L3546j1006l4078
1582c1047L7872J7622n0946R082M6575l0881k4860L9657k650k7443K3131J800
$$ plain form
1495 -6538 15933 -11666 -4394 21135 -13769 -17906 29653 3732 -35468 13209 26811 -27068
1507 -27068 -12913 24450 -7969 -18011 11831 -6323 -17055 14538 -5642 -31265 13219 14060
1519 14060 -37986 -10918 27266 -18260 -29927 14691 149 -25239 3586 -370 -22318 7463
1531 7463 6491 -31417 -368 26670 -24004 -24216 28624 3421 -31099 9215 16278 -18267 476
1544 476 12820 -15387 1874 20524 -19149 -12551 31326 -2967 -31666 18130 20199 -27140 -5734
1557 -5734 21138 -11779 -10799 12366 -12039 -11104 18018 -11429 -27409 19154 9114 -37185 -2808
1570 -2808 25132 -21074 -22174 16776 -4737 -19786 8732 -4793 -19509 14037 3031 -31047
1582 -31047 6825 24447 -26499 -17417 29158 -1723 -26583 13074 10424 -17019 6112 7912
1594G912k5051K5130R385m0707J6546L7770l9939j8804M9081p684m0223K7373
1606G89J5311l1065J1343J5057k8181J1043K5875l5950p745M6881j8130m0495
1618c5267L9068J8328m4221P763L0910k4863m847K4704k0210o603L3251j8734
1630g21k8186M1274Q736m8724J7076L8477l4389j3903L5419j0952j8127K4222
1642A0202p512j9811L0522N23l9880K5182L0599m3941q481M6756j6618l1306L0359
1655F594N198k6494J7714O660k7645J8845K0258l9599J015M4859k6110l2091M1527
1668A0731P660l9361J5060K1114k5224M348J8478k4954J884L2072k6950k1193
1680b6335M4082j380m4376K4394K8271l5536l563K9489j6608r592K4036j5631
$$ plain form
1594 7912 -17139 7991 17376 -23331 -6785 30985 -8954 -27758 21323 13639 -26584 789
1606 789 16100 -14965 -3622 11435 -16746 -5703 20172 -15778 -23523 23358 5228 -35267
1618 -35267 3801 22129 -22092 -14329 16581 -8282 -13129 11575 -8635 -15238 18013 -721
1630 -721 -28907 12367 21103 -27621 -10545 27932 -6457 -20360 15059 4107 -14020 10202
1642 10202 2690 -17121 13401 13924 -25956 -774 29825 -14116 -22597 24159 7541 -23765 6594
1655 6594 11792 -14702 3012 9672 -17973 872 21130 -18469 -17454 27405 1295 -30796 10731
1668 10731 18391 -20970 -5910 15204 -10020 -5672 12806 -12148 -10264 21808 -5142 -26335
1680 -26335 17747 16367 -28009 -3615 24656 -10880 -14443 15046 -1562 -11154 12882 -2749
1692b749j4585L4613p756l7370L2057K2883m5122Q82M1190k1629k2198K9654k315
1705G555k0796K1272q84k5553K5605J3033m1152J0689L9036l1816k2024M0709
1717A5674j487l2958J9846J1693k4276J2427J2004k8572J1190K8411l4039j2815
1729b2902M4793j0859l8722K9815J8781l4884M763K3474k1212n85K2083k2670
1741h125o997L5713j6324l1597L6668J3510m2960R386L3862k5004j2652K7447
1753A2927j0205j2801K3738j0319k0880L1670L622l9829J9156L2217l6033j2466
1765a9203L8653r819k5794K3216K526k1429J8815L721k8993J9294K2075l7622
1777a4560m297M2355j8353l1695L2444R759l1830J1687J5525k2303P876J6913
$$ plain form
1692 -2749 -17334 17279 9523 -27847 4210 27093 -18029 -17147 24043 2414 -19784 9870 7555
1705 7555 -13241 8031 7147 -18406 7199 20232 -20920 -10231 28805 -3011 -25035 15674
1717 15674 14187 -18771 1075 12768 -11508 919 12923 -15649 -4459 23952 -10087 -22902
1729 -22902 21891 11032 -27690 2125 20906 -13978 -9215 14259 -6953 -7538 14545 -8125
1741 -8125 -15122 20591 4267 -27330 9338 22848 -20112 -10726 23136 -1868 -14520 12927
1753 12927 2722 -10079 13659 3340 -17540 14130 17752 -22077 -2921 29296 -6737 -19203
1765 -19203 19450 9631 -16163 7053 9579 -11850 6965 10686 -18307 987 23062 -14560
1777 -14560 -18857 23498 5145 -26550 5894 15653 -16177 -4490 11035 -11268 -3392 13521
1789A3521k7287K133L3456k3657k4051L9136M477l9292J6812K5729k7346k673
1801i042K3224j6679l861K3739j8293j4900L4872m151l7357K5351K5174l7654
1813i577m119L4573j5767j7831K3213n316j5967K2225l972k6792K4782J5609l8997
1826a7936L639L7894k4011k3216L2435J099k5994J6019O805k0300J4899J0432
1838A1765k9458R881L0441k9491j6543M0210l923l4773K2430J7620k6864N146
1850c559J7421j9781L322K1679k3575q977L6141j1576l3194K9986J7096l6725
1862a1742L602K8057j9474r238K0818j1953r606K3813j1403k3204K9696P769l8785
1875b1650J1732L1812k8372j3804L0239o342j9225J8706r60j7758K0592L969k9920
$$ plain form
1789 13521 -13766 -11633 21823 -1834 -25885 13251 17728 -21564 -4752 20977 -6369 -9042
1801 -9042 14182 -2497 -6358 17381 -912 -15812 19060 14909 -22448 2903 28077 -9577
1813 -9577 -13696 20877 5110 -12721 10492 5176 -10791 11434 7462 -19330 5452 21061 -17936
1826 -17936 -14297 23597 -414 -23630 8805 9904 -16090 -71 6734 -13566 1333 11765
1838 11765 -17693 -7812 22629 -6862 -23405 16805 12882 -21891 539 18159 -8705 -3559
1850 -3559 13862 -5919 -2597 19082 -4493 -13470 22671 11095 -22099 7887 24983 -11742
1862 -11742 -8140 19917 443 -8795 12023 70 -9536 14277 2874 -20330 9366 17135 -21650
1875 -21650 -9918 21894 -6478 -20282 9957 3615 -15610 3096 2136 -15622 4970 8939 -20981
1888b0981J6852K5852l3455q254L8635j0904k8170K4831R479k3662J0548J0736
1900A1507k0074J0215J7195k7730q39L4228j8984k5980L2752P698l3350J0472
1912b890K0376k1092j052J6885j7175k349K3994j9040j7706L3264p50l6005J8691
1925d849K4296k9977n810K7028j2086j2491J9718p930j3582K4283l149k8004K3112
1938E59J8790l4404k37L3963j5828k0447K4945J955j9081J4996L213j9264J6914
1951F074J0892k9774O932L0531k4276j8873L3149K41k9219J4996J3485k1122N501
1964a463J2539k0619M529K1835k4062j1184L3536p047l2138K2708J7531k9336
1976a3171P05K2321j5567n095J8213j4026p292K5392j0051k3661K7012J1894l3731
$$ plain form
1888 -20981 -4129 21723 -11732 -19986 18649 7745 -20425 4406 13885 -9777 771 11507
1900 11507 -8567 1648 18843 -8887 -9726 24502 5518 -20462 12290 19988 -13362 -2890
1912 -2890 17486 -3606 -4658 12227 -4948 -7297 16697 -2343 -20049 13215 12465 -23540 -4849
1925 -4849 19447 -10530 -16340 10688 -1398 -13889 5829 -2101 -15683 8600 5451 -22553 559
1938 559 19349 -15055 -15292 18671 2843 -17604 7341 9296 -9785 5211 8424 -10840 6074
1951 6074 16966 -12808 -5876 24655 379 -18494 14655 14896 -14323 673 14158 -6964 -1463
1964 -1463 11076 -9543 -5014 16821 -7241 -18425 15111 8064 -24074 -1366 16165 -13171
1976 -13171 -12466 9855 -5712 -10807 7406 -6620 -13912 11480 1429 -22232 4780 16674 -17057
1989a7057O190K9153j9871j2687K3926n200j3380J7703m151j6778K1811M932l0170
2002a5579J3068K6320k7816j2084L2338o138k4235J8003O322j8815J0754O628
2014H766k0985J0816J7666k7154m703L2292j2943k6404K5433R939k6967P070J5562
2027H388j6644J977J4336j7770j192K4942j6243j8923K9910N045l2613J2818K3112
2040A7143k2283n455K0890j0159p688J8207r814j3345K4749r50k8855J7997K1110
2053B1547k9317n398K9069j1039j7457J8348k27j4672J4226O40j9690J5819J2953
2066A4802k8566J453K9804j7979j9743K6162L121k3025J1255R537j6487P454J0407
2079H195k0379M559K3453k0825j4020L0989j457k8804J6460J6640k1828J92J6653
$$ plain form
1989 -17057 -10867 18286 -1585 -14272 9654 4454 -8926 8777 4626 -12152 9659 14591 -15579
2002 -15579 -2511 23809 -4007 -16091 16247 10109 -14126 3877 10199 -8616 2138 8766
2014 8766 -12219 -1403 16263 -10891 -15594 16698 3755 -22649 2784 12723 -14244 -7174 8388
2027 8388 -8256 -6279 8057 -9713 -10905 14037 -2206 -21129 8781 13826 -18787 -5969 17143
2040 17143 -5140 -10595 10295 136 -7552 10655 841 -12504 12245 11295 -17560 437 21547
2053 21547 -7770 -13168 15901 4862 -12595 5753 5526 -9146 5080 5720 -13970 1849 14802
2066 14802 -13764 -12311 17493 -486 -20229 5933 9054 -13971 -2716 6821 -9666 -2212 8195
2079 8195 -12184 -7625 15828 -4997 -19017 11972 10515 -18289 -1829 14811 -7017 -6825 9828
2092I828j2848j906J6455j4549q033K5457p407k5258K2485J4070k9118J795K4008
2105A4979j4259j0573J7530o050r773J6716n828j7365K0836P310k9492Q540K5450
2118A8021k1500j3102K5423k573j8637J3703L675j4965J2123N626k1310J0402
2130c114J9407k4094p735K9323p242k3338J8242J0587k0344N107J1504j4362L918
2143b141J3439j8384k153K5022j2954k0523K4560P959k7394O842J9386j6299m600
2156g240J5565j0124m977J7491j0907j3852K3927J358k7600J2840K0967k2798
2168e350p121K3021p011j3293J4910k475j1627J5420j79k0304J5040J4827k5421
2181i563k244K7060j1631j8551J9756M049j7476R262N607j4500R510R708k0820
$$ plain form
2092 9828 -3020 -4926 11529 -3020 -11053 14404 6997 -18261 4224 18294 -10824 -9029 14979
2105 14979 720 -9853 7677 1627 -8146 8570 2742 -14623 6213 13523 -15969 -7429 18021
2118 18021 -3479 -16581 8842 6269 -12368 1335 5010 -9955 2168 7794 -13516 -3114
2130 -3114 16293 -7801 -15536 13787 6545 -16793 1449 12036 -8308 -3201 8303 -6059 -2141
2143 -2141 11298 -7086 -9239 15783 2829 -17694 6866 14825 -12569 -5727 13659 -2640 -7240
2156 -7240 8325 -1799 -6776 10715 -192 -14044 9883 11241 -16359 -3519 17448 -5350
2168 -5350 -12471 10550 3539 -9754 5156 2681 -8946 6474 6295 -14009 1031 15858 -9563
2181 -9563 -11807 15253 3622 -14929 4827 8876 -8600 662 6269 -8231 1279 10987 -9833
2194i833L028K3233j7028j5969K5816K606k5009J1117J4127j6795J101J2212j2668
2207d062L72J6006j4823r431K4504l504k4675J6519J5793k3206j506J9446j0391
2220A042p371J3683p046p483J7164n736j8405J9136R914k6505L552K3802j5725
2233B2j2585J9479j747j3380J1642M94j3345J3395N593k1653P523K0924k0226
2246c864j0922K5711k812k0539J3250Q627j4994N249P957j3587N303J3841j7920
2259d700m840K4678q179k1325J9390R696k1809L543J4923j2109k196J1936j0555
2272a547l694J7556r934j5688K1497N049k5674P833J9879j7376p648J7529n245
2285B537r464J2172l500j1027J5826J038k1016J1990J7158k1979n140K3201o967
$$ plain form
2194 -9833 -6805 16428 -600 -16569 9247 11853 -13156 -2039 12088 -4707 -3606 8606 -4062
2207 -4062 -3690 12316 -2507 -11938 12566 9062 -15613 906 16699 -6507 -8013 11433 1042
2220 1042 -6329 7354 308 -7175 9989 4253 -14152 4984 14898 -11607 -8055 15747 22
2233 22 -12563 6916 5169 -8211 3431 3925 -9420 3975 9568 -12085 -4562 16362 -3864
2246 -3864 -14786 10925 8113 -12426 824 9451 -5543 -294 7663 -5924 -621 13220 -4700
2259 -4700 -9540 15138 6959 -14366 5024 14720 -7089 -3546 11377 -732 -2928 9008 -1547
2272 -1547 -5241 12315 2381 -13307 8190 13239 -12435 -4602 15277 -2099 -9747 7782 2537
2285 2537 -6927 5245 1745 -9282 6544 7582 -13434 -1444 15714 -6265 -11405 11796 4829
2298D829j5328J4139L463j2748Q799L657j4305J0150J0897k0420K35K3259j2628
2311C999j6695K0536M776j9753O825J0965j2786K022R671j3463O31J7000j3953
2324b25j1850K2398K11k3282J1221J5020j7423l219J4824q065m866J2196q375
2337a435p388J7824l998j8955J5561J2480k2388m06K0886r716j1560J4764j099
2350D570j0080J1653r63j3318J3708P268k1149M724K0444j5082j2186K0064O42
2363A0295j6841R125O459j2176N924O109j4677N286J4615j6799p511K2031m190
2376G650j9865J3016J0700j6842J223J1187j0018p5J0654j1685l472J8234p861
2389B846j6637J7932Q599k2043L599J7546j1678o966J3636m582o712J2290m758
$$ plain form
2298 4829 -10499 3640 7103 -5645 3154 6811 -7494 2656 13553 -6867 -6632 16627 3999
2311 3999 -12696 7840 12616 -7137 -312 10653 -2133 -111 9560 -3903 -3272 13728 -225
2324 -225 -12075 10323 10534 -12748 -1527 13493 -3930 -7149 7675 -390 -5256 6940 -1435
2337 -1435 -8823 9001 5003 -13952 1609 14089 -8299 -8705 12181 2465 -9095 5669 4570
2350 4570 -5510 6143 5180 -8138 5570 12838 -8311 -3587 16857 1775 -10411 9653 10295
2363 10295 -6546 2579 9038 -3138 2786 8895 -5782 -496 14119 -2680 -10191 11840 7650
2376 7650 -12215 801 11501 -5341 -4118 7069 -2949 -3024 7630 -4055 -7527 10707 2846
2389 2846 -13791 4141 12740 -9303 -5704 11842 164 -6802 6834 2252 -4460 7830 3072
2402C072j1022J5801L364k0527Q065J7601j6784q177J9230l327j2990J0497J498
2415F301j0103Q993K090j4852R122J2052j8807l565K1239p793j6713J5146N762
2428H872j5620N213P522j0855L951Q714j3961j52J7952j0921j3926J9358M190
2441A0337k0370O871J4098j2739k377J1032p035k403J1633q244q247J7301p38
2454I119j9350J1712J3825j7921l373J6802o470r050J0835k387p786J1096j462
2467E590j4379J2259Q923j9458K56J9698j0730j2667J5298J634j2868P021M072
2480D649j0349O773O005j4818L515J6284j3678j0181J9541K61j7863R367R570
2493I076j2095J142Q328q970J248J0955j1569n268J8601m972j7245J3919J0018
$$ plain form
2402 3072 -7950 7851 11215 -9312 -1247 16354 -430 -8607 10623 7296 -5694 4803 6301
2415 6301 -3802 5191 7281 -7571 1551 13603 -5204 -8769 12470 4677 -12036 3110 8872
2428 8872 -6748 -1535 5987 -4868 -917 7797 -6164 -6316 11636 715 -13211 6147 10337
2441 10337 -10033 -3162 10936 -1803 -4180 6852 -183 -2586 9047 803 -7444 9857 9119
2454 9119 -10231 1481 15306 -2615 -5988 10814 4344 -4706 6129 3742 -4044 7052 5590
2467 5590 -8789 3470 12393 -7065 -6809 12889 2159 -10508 4790 6424 -6444 577 4649
2480 4649 -5700 1073 7078 -7740 -4225 12059 -1619 -11800 7741 8002 -9861 -494 9076
2493 9076 -3019 -1877 6451 -2519 -1271 9684 -1885 -7153 11448 6476 -10769 3150 13168
2506A3168j7874L56J4319q434n130R981n430n173J2377n065j2553J4791N398j9534
2520h803M348J6519j2532q491J4478j670r813Q284J79q793R758K411j5329P826
2534a628J3537j6048n719J8804l662j4383J0776N503j1241M569N166j0199M956
2547D31R107j3779j622J7733q104j4238J5293N924j6614L391J1250r501j459Q676
2561F488q152j524J2165q446r673J6075J414j8076P386J3383j3485m630J3153
2574F078m623o466R012l584o810J1852j243j4483J0594J0713j6880k157J7406
2587I409o630j1341J1548J969r624O754J890r832Q037O231j4765J723J6157j0391
2601A135j1375J5857K265j4614N954P699r650K151O132r529J753J1322j1088o794
$$ plain form
2506 13168 -4706 -4350 9969 1535 -3595 6386 956 -4217 8160 3095 -9458 5333 10731 -8803
2520 -8803 -4455 12064 -468 -8959 5519 3849 -5964 2320 2499 -6294 3464 5875 -9454 -1628
2534 -1628 11909 -4139 -9858 8946 5284 -9099 1677 7180 -4061 508 5674 -4525 431
2547 431 9538 -4241 -5863 11870 3766 -10472 4821 10745 -5869 -2478 8772 -729 -2188 6488
2561 6488 -1664 -3188 8977 531 -9142 6933 8347 -9729 -2343 11040 -2445 -7075 6078
2574 6078 1455 -5011 4001 417 -6393 5459 4216 -10267 327 11040 -5840 -7997 9409
2587 9409 2779 -8562 2986 4955 -4669 2085 3975 -5857 2180 8411 -6354 -4631 11526 1135
2601 1135 -10240 5617 7882 -6732 -778 6921 -2729 -578 5554 -3975 -2222 9100 -1988 -8782
2615h782J6682j659j6516R689J0294j3747r85J0834o467k998Q739o434m482J2651
2629F819l680j3253J2018Q107j6854O91J5488q430q156J1074j320p031Q001j099
2643B375q899J0019L875j5230M681J4445j2482p946J5578p29j2387P714L978q719
2657c727M683L763j0377M705J0324j2942m540J7042m386j4738J1331P053j2929
2670d738J667Q282p344m1P506q402k027J3137o835j1579J4013M934j6272L591
2684d108J2509r414m592R786l805m241Q410m356p396J2198R01j5226P682J2014
2698A0362j3616m862J4862l543r542P997J363p502O839J409j0666P246Q524j4013
2712e142j888J6402o723j1783J1511M285j1427L389N778p497K608N996j0037Q73
$$ plain form
2615 -8782 7900 6241 -10275 -586 9708 -4039 -5024 5810 -657 -3655 5084 -1350 -5832 6819
2629 6819 3139 -10114 1904 10011 -6843 -6152 9336 906 -7250 3824 2504 -4527 3474 2375
2643 2375 -6524 3495 7370 -7860 -3179 11266 -1216 -9162 6416 5687 -6700 1014 4992 -3727
2657 -3727 956 4719 -5658 -953 9371 -3571 -8111 8931 4545 -10193 1138 8191 -4738
2670 -4738 -3071 5211 -2133 -2174 5332 -3070 -5097 8040 1205 -10374 3639 8573 -7699 -4108
2684 -4108 8401 -1013 -5605 4181 376 -3865 4545 189 -7207 4991 5892 -9334 -1652 10362
2698 10362 -3254 -8116 6746 3203 -6339 1658 3021 -4481 2358 3767 -6899 347 8871 -5142
2712 -5142 -7030 9372 2649 -9134 2377 6662 -4765 -1376 4402 -3095 -487 5509 -4528 -3655
2726c655J2526r295r200J4863J706j5048N819R759r751j740Q319n704j959Q846
2740E486o779n850J3293j659j4376R514R713j3787k197J3131n101o994Q386j429
2754A351n797Q179j506r737R538N876j4555J479J4517q697r012J1877J233j0008
2768e262N759K636p286N497L585j1053L813J1218j1220o442J4894q51j3624P541
2782g95P164j0031R78O400p023J283P501q688l163J3151m186j2575J0838P168
2796H022j3577O82J1046o710l857P718m121l021Q846m292q477J1546L269j4578
2810g504L893J2914j0170o185J1663j657p340O382r4o423P571J325j1138N713
2824a050J0067j2424m242J4585l525j1230Q538M081q845L129M169p392L465O256
$$ plain form
2726 -3655 8871 -424 -9624 5239 6945 -8103 -2284 7475 -2276 -4016 4303 -1401 -3360 5486
2740 5486 -1293 -7143 6150 4491 -9885 -371 9342 -4445 -6642 6489 1388 -5606 2780 1351
2754 1351 -4446 3733 2227 -7510 2028 7904 -6651 -5172 9345 648 -8364 3513 4746 -5262
2768 -5262 497 3133 -4153 1344 4929 -6124 -2311 8907 -2313 -8755 6139 5288 -8336 -795
2782 -795 6369 -3662 -2684 3716 -3307 -2024 5477 -3211 -6374 6777 2591 -9984 854 8022
2796 8022 -5555 -4873 6173 -537 -4394 3324 -797 -3818 5028 736 -7741 3805 7074 -7504
2810 -7504 -3611 9303 -867 -7052 4611 2954 -4386 1996 1902 -4521 3050 4375 -6763 -1050
2824 -1050 9017 -3407 -7649 6936 3411 -7819 719 4800 -4045 -916 3253 -4139 -674 5582
2838E582j0180q11J2905o474j0578J2173M028j2966L073Q557p190j088O489n818
2852b298q08R066o541p008J2446J316j4375O403J0502j1038l233J0266l298n130
2866c730O759k574m982Q588p43j0928P988Q048j3119j637J3467n408q739Q786
2880A776J416p348M558J751p369N987M558j1245J443J2634q641q204J2451J283
2894E050j1254M595O436p637J227N250o922J154Q990q741n037J2931j434j2607
2908g999P794Q042j0854j010Q721m537k718O361m496l453R754l334j0045R791
2922B017N535j3226J139J1486o513o462Q644p49n794N937q45o969Q097K810j2130
2937g023L973J1012r820n859J2055m66r896N636M016o715L124L200p768L627P522
$$ plain form
2838 5582 -4598 -5409 7496 1022 -9556 2617 6645 -6321 -3248 5309 -1881 -2969 3520 -2298
2852 -2298 -3106 5960 -581 -7589 4857 6173 -8202 -1799 8703 -2335 -5568 4698 1400 -3730
2866 -3730 3029 455 -4527 4061 3318 -7610 378 8426 -4693 -6330 7137 1729 -7010 1776
2880 1776 3192 -4156 402 2153 -5216 771 5329 -5916 -4473 8161 -480 -8684 3767 5050
2894 5050 -6204 -1609 4827 -2810 -1583 3667 -3255 -2101 6889 -1852 -6889 6042 4608 -7999
2908 -7999 -205 7837 -3017 -4027 4694 157 -2561 3800 -696 -4149 5605 2271 -7774 2017
2922 2017 7552 -5674 -4535 6951 438 -6024 2620 1871 -3923 2014 1169 -5800 2297 5107 -7023
2937 -7023 -3050 7962 -1858 -7717 4338 3872 -6024 -388 3628 -3087 37 3237 -4531 -904 6618
2952F618r760k883J2861l716j1174R131N466j0087J178O770n875k1N723o578j011
2967c358R690n653q419J1040L216j2929L218R631p643l609Q121k977l715O640
2981C253l393n592R276M00j1204N741R395j0812l459J1396k739p535O488J106
2995B321n826N495L94p581N930N943j0996l57J2252n941q868R546K870r283L390
3010g11M357o195K497M191p646Q32R306p112o782J1631J046j2028M812P986q166
3025a982j417O473m014j574O135m869l915R696j437j0741P673P259j1142j009
3039d864R879m149n330O335j000m316O295j044p537P410M340j1397J551J1225
3053G398p009o845R393P20p527M142K355n748M122K823q160K490Q954q517n269
$$ plain form
2952 6618 -3142 -6025 6836 3120 -8054 1077 6543 -3544 -2366 4404 -1471 -1492 4231 -2347 -3358
2967 -3358 6332 679 -7740 3300 6516 -6413 -3195 6436 -1207 -4816 3305 328 -3387 3253
2981 3253 -140 -5732 3544 3944 -7260 -1519 7876 -2936 -6395 5001 2262 -5273 1215 2321
2995 2321 -3505 1990 2384 -5197 733 6676 -4320 -4677 7575 1634 -7234 2312 5182 -4101 -711
3010 -711 3646 -2549 -52 4139 -3507 -2675 6631 -481 -7263 4368 5414 -6614 -1802 6184 -1982
3025 -1982 -3399 3074 -940 -2514 3621 -1248 -5163 4533 3096 -7645 28 7287 -3855 -4864
3039 -4864 5015 866 -4464 1871 871 -3445 2850 1806 -5731 1679 6019 -5378 -3827 7398
3053 7398 389 -6456 2937 3657 -3870 272 2627 -3121 1001 3824 -4336 -1846 7108 -1409 -6678
3068f678J1698j091j0221N934N312p333M68M787m839N75N851o730k350J0108l368
3083B123r639Q908M972j0748Q81Q504n067l306N905k815k678O643k926o655Q811
3098B913K427j1330L383R657q070m413Q764q76o194M902L91m913N448J098q502
3113e315M744P385r814k628J1171k888q609O754L125o879K299L297n650K595N015
3128D602p992m77R934n129p958R093L079r881K347O847n770r81N076m164r91O642
3144D277m955n249R495O90j0677M977P784q317k631Q168k914m005N418j808l843
3159c590O603p36q100O290N940j0059j216J0675m271o858O989J473o266L784J592
3174B250n836M369L767q702J263R299o627o334R662J298r109L518M942n944J005
$$ plain form
3068 -6678 5020 3929 -6292 -358 4954 -2379 -1911 2876 -1963 -1388 4463 -2267 -4617 5491 2123
3083 2123 -7516 1392 6364 -4384 -3503 5001 -66 -3372 2533 -282 -2960 3683 757 -5898 2913
3098 2913 5340 -5990 -2607 7050 -1020 -5433 3331 2455 -3739 1163 1554 -3359 2089 3187 -5315
3113 -5315 -571 6814 -3000 -5628 5543 2655 -5954 800 3925 -2954 -655 2642 -3008 -413 4602
3128 4602 -3390 -3867 6067 938 -7020 2073 5152 -4729 -2382 4465 -1305 -2286 2790 -1374 -2365 4277
3144 4277 -678 -5927 3568 4258 -6419 -1442 6342 -1975 -4606 3562 648 -3357 2061 253 -3590
3159 -3590 3013 2277 -5823 467 6407 -3652 -4868 5807 1536 -5322 1667 3140 -3126 658 2250
3174 2250 -3586 783 4550 -4152 -2889 6410 -217 -6551 3111 4409 -4700 -1182 3760 -2184 -1179
3189a179L898n399J218O202o452l643R871j530r426N968O060q334q35O923l656
3204c14k228N116l483k275P033k566p577P802M337j0301P88R313n145n226O878
3219B152l76m430M474o82n020N786K036q820K960Q310p725m440R387p38p558M666
3235a8K761n294K521K276n805K668N655p583k341J0065l011q551P054M128p983
3250c458J041N439m449l30M528m646j037P567m132o506Q331K721r888K573P572
3265E326n871k776N914j974k956M846k101m412P022L55q704M537O979q237k978
3280e030R003k174o139N195J070m645L618R60n959M175M625q630l08R352m402
3295G11o907P452K427p193K150L836m712J570L436n835O97P413n787n259R242
$$ plain form
3189 -1179 2719 -2680 -1462 4740 -1712 -5355 4516 2986 -6440 -472 5588 -2746 -3581 3342 -314
3204 -314 -2542 2574 -909 -3184 3849 1283 -6294 1508 5845 -4456 -3668 5645 500 -4726 2152
3219 2152 1776 -2654 1820 1138 -3882 1904 3940 -4880 -1920 6390 -1335 -5775 3612 2874 -4684 -18
3235 -18 2743 -2551 -30 2246 -3559 -891 4764 -2819 -5160 4905 1894 -6657 397 4525 -3458
3250 -3458 -2417 3022 -1427 -1757 2771 -1875 -2912 4655 523 -5983 2348 5069 -4819 -2246 5326
3265 5326 -545 -3321 2593 619 -2337 2509 408 -4004 3018 3373 -5331 -794 6185 -2052 -5030
3280 -5030 3973 1799 -4340 855 1925 -2720 898 1858 -4101 74 4699 -3931 -4239 5113 711
3295 711 -6196 1256 3683 -3510 -1360 2476 -2236 -666 2770 -3065 -2368 5045 -742 -6001 3241
3310C241O80r066L951N900o175r83N183l290j223M924l843l144P792j533q130
3325e716N960N437q787q49P802l029m321M905o40l479M527r52n716N868L340r267
3341d917J683Q616n563n235P389N62o167L604J967m563L009K264o303K396O457
3356E199o825l566R160q63q215N034M350o096L06M126m090L92M660n266j664P928
3372D570l008p217O563M142q510N51O943m429k398M779k460j985N212k664m770
3387d681O776J443q625K880P534o563l452P463j145m999M156K19l987M478P43
3402B240o510L791N583p485k062Q878k534o881N750K480n601J820K660m378K126
3417a23L388n951j27P722m223o270P516K262p981K107N253m679p85L981l290p02
$$ plain form
3310 3241 3921 -5145 -1194 4706 -1469 -2452 2731 -559 -1782 3142 -701 -3845 3947 2414 -5716
3325 -5716 244 5681 -3106 -3955 3847 818 -3503 1402 762 -2717 1810 858 -4858 1010 4350 -4917
3341 -4917 -3234 5382 -181 -5416 1973 2535 -3632 -28 1939 -2624 385 2649 -3654 -1258 5199
3356 5199 -1626 -5192 3968 3105 -5110 -76 4274 -1822 -1516 2610 -1480 -1088 3572 -1694 -3358 4570
3372 4570 1562 -5655 908 5050 -3460 -2909 4034 -395 -2793 1986 -474 -2459 2753 89 -4681
3387 -4681 2095 3538 -5087 -2207 5327 -1236 -4688 2775 1630 -3369 787 1006 -2981 1497 2240
3402 2240 -4270 -479 5104 -2381 -4443 4435 1901 -4980 770 3250 -2351 -531 2129 -2249 -123
3417 -123 3265 -2686 -2813 4909 686 -5584 1932 4194 -3787 -1680 3573 -1106 -1891 2090 -1200 -1902
3433a902N354m018m063P511L83q453M331N925o838j972O567k231l196M136j415
3448A19k965N196o02o354M803M956q136o73Q488l844n232N667Q49m654K867J297
3464A782m397L311K782o763J183P341n513m597P902L84p198L273L644m675O89
3479h52L113m269O73N189n067k990Q142j201q061N312M914p071m44N495l014j754
3495a885L956k563k087N688k096n800O099L285q231J034P321m683l795N620m47
3510A416l491L387l56l938M540J560p147K908O490o267l458P613n67o238L581
3525C3K729m507J893K116m612K105M419o122j464P885k304p016N662L561o887
3540b509R70M502l530n23L628l721q58N927l611n028O957J745q016K332O113m859
$$ plain form
3433 -1902 3452 -566 -4629 2882 3265 -5188 -857 5068 -1770 -3742 2825 594 -2602 1534 119
3448 119 -2846 2350 1748 -4606 197 5153 -2983 -3656 4832 988 -4244 1423 2272 -2382 485 1782
3464 1782 -2615 696 3478 -3285 -2102 5239 -274 -4871 3031 3415 -3783 -510 3134 -1541 -852
3479 -852 2261 -2008 -1335 3854 -1213 -4203 3939 2738 -5323 -11 4903 -2168 -2612 2883 -131 -1885
3495 -1885 2071 -492 -2579 3109 1013 -4787 1312 4597 -3634 -2600 4721 38 -3757 1863 1416
3510 1416 -2075 1312 956 -2982 1558 3118 -4029 -1121 5369 -898 -4356 3257 2690 -3548 33
3525 33 2762 -1745 148 2264 -2348 -243 4176 -1946 -3410 4475 2171 -4845 817 4378 -2509
3540 -2509 -1539 2963 -567 -1090 2538 -1183 -2041 3886 275 -4753 2204 3949 -4067 -1735 4378 -481
3556d81k443N313j822k649M107j445l631N408K83o919L868N752o954k049P403
3571C741j812n043M287Q75l948L239N01m613L562L500o889r8P735l847n767O286
3587A709J878o212J943L251l888J160K747m662K50N906m406m430P589M88p756
3602d433L303N083n411q47M617k722j074M014l045k369O166j155o632N098M607
3617E200p205p38O800k927l652M456o12k902L909r76m240M671K597p295J050P318
3633E454m869m594O453M14n469K904J699l673K339J942n309J730N411n552l286
3648d406P875r50o875M124L748n308M52L570l392K58L699m058j497O875k637o062
3664d584N996L283p233O96N757l607k161M243j732k029M273j896m238N781J403
$$ plain form
3556 -481 -2924 2389 567 -2082 2025 580 -3051 2357 2640 -4279 -411 5341 -1613 -3662 3741
3571 3741 1929 -3114 1173 2048 -1900 1339 1840 -2773 789 4289 -2600 -2698 5037 1190 -4577 1709
3587 1709 3587 -2625 -682 2569 -1319 -159 2588 -2074 -1824 4082 -324 -4754 2835 3323 -4433
3602 -4433 -1130 3953 -1458 -2305 2312 -410 -1484 2530 -515 -2884 3282 2127 -4505 593 5200
3617 5200 -2005 -2743 4057 1130 -2522 1934 1322 -1580 2329 1353 -2887 1784 4381 -2914 -1864 5454
3633 5454 585 -4009 2444 2858 -2611 293 1992 -1681 658 2600 -2709 -979 4432 -1120 -4406
3648 -4406 3469 2519 -4356 -232 3516 -1792 -1340 2230 -1162 -904 2795 -1263 -2760 4115 1478 -4584
3664 -4584 1412 4695 -2538 -1842 3915 308 -1853 2390 658 -1371 2902 1006 -3232 2549 3952
3679C952p386K256O635n783l047O053p01m147L113L84l388L475Q27n693L142M701
3695D393o479j726P674k492n661M764K254m875J639K469l736J514L250n028j06
3710b146O658l713n297O612J965p001K110M742m015r78L560k521q79M306l141
3725B62l285O470j44o934L600N106o057j648N769k019l134L829j302k592M401
3740B322r88n169M499L730p315q3P101l369m560N099R68m372K415J089l778K987
3756E76K566o023J289O385m935l939O957N20o385K811L545m295O16K807l517P76
3772b46M162m553k331O939j507o768M985L689o272j12N089l174j543L476k178
3787c44j733N027j997n081N609K425p440J159O608m356l304N112k25l546L157
$$ plain form
3679 3952 -3434 -1178 5457 -326 -3373 2680 1979 -2168 945 1329 -2059 1416 2243 -3450 -308 4393
3695 4393 -2086 -3812 3862 1370 -4291 473 2727 -2148 -509 1960 -1776 -262 2988 -2040 -2146
3710 -2146 4512 799 -4498 2114 4079 -2922 -812 3930 -85 -1063 2497 -24 -903 3403 262
3725 262 -3023 3447 3303 -3631 -31 5075 -982 -2630 3139 1120 -2014 1815 513 -2079 2322
3740 2322 1334 -3835 664 4394 -2921 -3004 4097 728 -3832 1267 2235 -2137 278 1367 -2411 576
3756 576 3142 -2881 -1592 4793 -142 -4081 2876 3396 -2989 -178 3367 -928 -312 2495 -1022 -246
3772 -246 3916 -637 -2968 3971 2464 -4304 681 4370 -1902 -2014 3075 -99 -1642 1834 -344
3787 -344 -2077 2950 953 -4128 1481 3906 -3534 -2375 4233 -123 -3427 1685 1460 -2086 1071
3802A071k59l278M135R05o098K743N622n908k595O848p16n479L595J892l699J633
3818D12J736l990K049L669n566j075O982k545o013N470K864o246J048L926l388
3833f67k26L061l329n97N051l237m318O270J381p348K442N471m802k114M923j544
3849D17k234L581j755k605M717J27o295L918M903o598j407O743k127m389M173
3864A169N58l418K774M90m042L153K980o193K39O814l938m712N968J042n430J936
3880f10K852l503R68K410m000P53M849m536l325P072l56o747L400M494n103m96
3896a878M101k511j140L642k698k153N540j272n790M870L646o792n9N918k815
3911F09l129M045o52k504L107p55l531M179J869o506J730O012m773l460N908Q4
$$ plain form
3802 1071 812 -2466 1669 2574 -3524 -781 4841 -1067 -3662 3186 2470 -3009 586 2478 -1221 412
3818 412 2148 -1842 207 3876 -1690 -2765 4217 1672 -4341 1129 3993 -2253 -1205 2721 -667
3833 -667 -893 2168 -1161 -1758 3293 56 -4262 2008 3389 -3959 -1517 3954 -848 -2962 1961 417
3849 417 -1817 1764 9 -2596 2121 2248 -4047 -129 4774 -1824 -3231 3512 1385 -3004 1169
3864 1169 1727 -1691 1083 1573 -2469 684 3664 -2529 -2290 4524 586 -4126 1842 2884 -2546 -610
3880 -610 2242 -1261 -293 2117 -1883 -1130 3719 -817 -4142 2930 2574 -4173 -773 3721 -1382 -1878
3896 -1878 2223 -288 -1428 2214 -484 -2637 2903 1631 -4159 711 4357 -2435 -2494 3424 609
3911 609 -2520 1525 873 -1631 1476 721 -2810 1369 3238 -3268 -1538 4474 -299 -3759 2149 2233
3927B233m819K670J603l361K130J487m675K217M551n614k099P150j420o055M120
3942A18L145n029N31L279l190K63L400m191o71N885k871m945N522K451o669J013
3958a959N319l843j872L892j461j808L783k115l307N487O37o479K531N479n390
3973a106k240O008j237l669L114K11l107L315M83n107L549L696n845j182O943
3988C826k618m996M812J589m704J690K172l317J607K460n019O01N654l718m446
4003d407O356J180o503K115M186m008n22L418k770n46M007l180k530N732m03o484
4019d359L940M551o048r31N410k108k572L714j126k356L849o51m835M407L094
4034C979o597K38O468l500m046M951M93m070K453J017l338K451J867n398J636
$$ plain form
3927 2233 -2586 84 1687 -1674 456 1943 -2732 -515 4036 -1578 -3677 3473 2053 -4002 118
3942 118 3263 -1766 -1235 2044 -1146 -883 2517 -1674 -2345 3540 669 -4276 1246 3697 -2972 -1959
3958 -1959 3360 -483 -2355 1537 76 -1732 2051 -64 -3371 2116 2753 -3726 -1195 4284 -1106
3973 -1106 -3346 2662 1425 -2244 870 1081 -2026 1289 1772 -3335 214 3910 -1935 -3117 3826
3988 3826 1208 -3788 1024 2613 -2091 -401 1771 -1546 61 2521 -2498 -1897 3757 39 -4407
4003 -4407 1949 3129 -3374 -1259 2927 -1081 -1603 1815 -955 -1501 2506 -674 -3204 2528 2125 -4359
4019 -4359 -419 4132 -1916 -2847 2563 455 -2117 1597 471 -1885 1964 1313 -3522 885 3979
4034 3979 -2618 -2380 4088 588 -3458 1493 1986 -2084 369 1386 -1952 499 2366 -3032 -1396
$$ [...]
8191B97
##END NTUPLES=NMR FID
##END=
