##TITLE=1H_SA_AC.III
 CDCl3, 8 sc, 
 3.08.2021
##JCAMPDX= 6.0         $$ Bruker NMR JCAMP-DX V2.0
##DATA TYPE= NMR FID
##DATA CLASS= NTUPLES
##ORIGIN= UXNMR, Bruker Analytische Messtechnik GmbH
##OWNER= root
$$ XWIN-NMR		Version 3.5
$$ Tue Aug  3 09:15:40 2021 Russian Standard Time (UT+4h)  she@DPX200
##.OBSERVE FREQUENCY= 200.131506
##.OBSERVE NUCLEUS= ^1H
##.DELAY= (6, 6)
##.ACQUISITION MODE= SIMULTANEOUS
##.ACQUISITION SCHEME= undefined
##.AVERAGES= 8
##.DIGITISER RES= 18
##SPECTROMETER/DATA SYSTEM= spect
##.PULSE SEQUENCE= zg30
##.SOLVENT NAME= CDCl3
##.SHIFT REFERENCE= (INTERNAL, CDCl3, 0, 15.7039)
##AUDIT TRAIL= $$ (NUMBER, WHEN, WHO, WHERE, WHAT)
$$ ##TITLE= Audit trail, XWIN-NMR		Version 3.5
$$ ##JCAMPDX= 5.01
$$ ##ORIGIN= Bruker BioSpin GmbH
$$ ##OWNER= she
$$ F:/spectra/data/she/nmr/H-F/1/audita.txt
$$ ##AUDIT TRAIL=  $$ (NUMBER, WHEN, WHO, WHERE, WHAT)
(   1,<2021-08-03 09:14:27.28 +0400>,<she>,<DPX200>,
      <created by zg, POWCHK disabled, PULCHK disabled
       configuration hash MD5:
       00 E9 B6 7A A2 85 ED C7 34 08 36 98 17 FE 4E 26
       data hash MD5: 16K
       A4 8E 85 99 E5 AE 17 04 24 AB 7C C5 A5 69 C2 0E>)
$$ ##END=
$$ 
$$ hash MD5
$$ C1 D8 19 0D 41 03 B4 46 10 48 74 66 64 77 07 E6
##$RELAX= 
##$RELAX= 
##$RELAX= 
##$RELAX= 
##$RELAX= 
##$RELAX= 
$$ Bruker specific parameters
$$ --------------------------
##$DU= <F:/spectra>
##$EXPNO= 1
##$NAME= <H-F>
##$PROCNO= 1
##$TYPE= <nmr>
##$USER= <she>
##$AMP= (0..31)
100 100 100 100 100 100 100 100 100 100 100 100 100 100 100 100 100 100 
100 100 100 100 100 100 100 100 100 100 100 100 100 100 
##$AQSEQ= 0
##$AQ_mod= 1
##$AUNM= <au_zg>
##$AUTOPOS= <>
##$BF1= 200.13
##$BF2= 200.13
##$BF3= 200.13
##$BF4= 200.13
##$BF5= 200.13
##$BF6= 200.13
##$BF7= 200.13
##$BF8= 200.13
##$BYTORDA= 1
##$CFDGTYP= 0
##$CFRGTYP= 5
##$CHEMSTR= <none>
##$CNST= (0..31)
1 1 145 1 1 1 1 1 1 1 1 1 1 1 1 1 1 1 1 1 1 1 1 1 1 1 1 1 1 1 1 1 
##$CPDPRG= <>
##$CPDPRG1= <>
##$CPDPRG2= <>
##$CPDPRG3= <>
##$CPDPRG4= <mlev>
##$CPDPRG5= <mlev>
##$CPDPRG6= <mlev>
##$CPDPRG7= <mlev>
##$CPDPRG8= <mlev>
##$CPDPRGB= <>
##$CPDPRGT= <>
##$D= (0..31)
0 1.2 0 0 0 0 0 0 0 0.06 0 0.03 0 0 0 0 0.0002 0 0 0 0 0 0 0 0 0 0 0 0 
0 0 0 
##$DATE= 1627967666
##$DBL= (0..7)
120 120 120 120 120 120 120 120 
##$DBP= (0..7)
150 150 150 150 150 150 150 150 
##$DBP07= 0
##$DBPNAM0= <>
##$DBPNAM1= <>
##$DBPNAM2= <>
##$DBPNAM3= <>
##$DBPNAM4= <>
##$DBPNAM5= <>
##$DBPNAM6= <>
##$DBPNAM7= <>
##$DBPOAL= (0..7)
0.5 0.5 0.5 0.5 0.5 0.5 0.5 0.5 
##$DBPOFFS= (0..7)
0 0 0 0 0 0 0 0 
##$DE= 6
##$DECBNUC= <off>
##$DECIM= 32
##$DECNUC= <off>
##$DECSTAT= 4
##$DIGMOD= 1
##$DIGTYP= 9
##$DL= (0..7)
0 120 120 120 120 120 120 120 
##$DP= (0..7)
150 150 150 150 150 150 150 150 
##$DP07= 0
##$DPNAME0= <>
##$DPNAME1= <>
##$DPNAME2= <>
##$DPNAME3= <>
##$DPNAME4= <>
##$DPNAME5= <>
##$DPNAME6= <>
##$DPNAME7= <>
##$DPOAL= (0..7)
0.5 0.5 0.5 0.5 0.5 0.5 0.5 0.5 
##$DPOFFS= (0..7)
0 0 0 0 0 0 0 0 
##$DQDMODE= 0
##$DR= 18
##$DS= 0
##$DSLIST= <SSSSSSSSSSSSSSS>
$$ [...]
##$SUBNAM2= <"">
##$SUBNAM3= <"">
##$SUBNAM4= <"">
##$SUBNAM5= <"">
##$SUBNAM6= <"">
##$SUBNAM7= <"">
##$SUBNAM8= <"">
##$SUBNAM9= <"">
##$SW= 20.0188882624521
##$SWIBOX= (0..15)
0 0 2 0 0 0 0 0 0 0 0 0 0 0 0 0 
##$SW_h= 4006.41025641026
##$TD= 16384
##$TD0= 1
##$TE= 0
##$TE2= 300
##$TE3= 300
##$TEG= 300
##$TL= (0..7)
0 120 120 120 120 120 120 120 
##$TP= (0..7)
150 150 150 150 150 150 150 150 
##$TP07= 0
##$TPNAME0= <>
##$TPNAME1= <>
##$TPNAME2= <>
##$TPNAME3= <>
##$TPNAME4= <>
##$TPNAME5= <>
##$TPNAME6= <>
##$TPNAME7= <>
##$TPOAL= (0..7)
0.5 0.5 0.5 0.5 0.5 0.5 0.5 0.5 
##$TPOFFS= (0..7)
0 0 0 0 0 0 0 0 
##$TUNHIN= 0
##$TUNHOUT= 0
##$TUNXOUT= 0
##$USERA1= <user>
##$USERA2= <user>
##$USERA3= <user>
##$USERA4= <user>
##$USERA5= <user>
##$V9= 5
##$VALIST= <valist>
##$VCLIST= <CCCCCCCCCCCCCCC>
##$VD= 0
##$VDLIST= <DDDDDDDDDDDDDDD>
##$VPLIST= <PPPPPPPPPPPPPPP>
##$VTLIST= <TTTTTTTTTTTTTTT>
##$WBST= 1024
##$WBSW= 4
##$XGAIN= (0..3)
0 0 0 0 
##$XL= 0
##$YL= 0
##$YMAX_a= 749009
##$YMIN_a= -633127
##$ZGOPTNS= <>
##$ZL1= 120
##$ZL2= 120
##$ZL3= 120
##$ZL4= 120
##$ABSF1= 10
##$ABSF2= 0
##$ABSG= 5
##$ABSL= 3
##$ALPHA= 0
##$AQORDER= 0
##$ASSFAC= 0
##$ASSFACI= 0
##$ASSFACX= 0
##$ASSWID= 0
##$AUNMP= <proc_1d>
##$AZFE= 0.1
##$AZFW= 0.1
##$BCFW= 1
##$BC_mod= 2
##$BYTORDP= 1
##$COROFFS= 0
##$CY= 11.3945322036743
##$DATMOD= 1
##$DC= 2
##$DFILT= <>
##$DTYPP= 0
##$F1P= 2.36226072786647
##$F2P= -0.459571619588291
##$FCOR= 0.5
##$FTSIZE= 0
##$FT_mod= 4
##$GAMMA= 1
##$GB= 0.15
##$INTBC= 1
##$INTSCL= 1
##$ISEN= 128
##$LB= 0.24
##$LEV0= 0
##$LPBIN= 0
##$MAXI= 10000
##$MC2= 0
##$MEAN= 0
##$ME_mod= 0
##$MI= 1.114404
##$NCOEF= 0
##$NC_proc= 0
##$NLEV= 6
##$NOISF1= 3.799351
##$NOISF2= 2.8
##$NSP= 1
##$NTH_PI= 0
##$NZP= 0
##$OFFSET= 15.70392
##$PC= 1
##$PHC0= -13355
##$PHC1= 11.80099
##$PH_mod= 1
##$PKNL= yes
##$PPARMOD= 0
##$PSCAL= 0
##$PSIGN= 0
##$REVERSE= no
##$SF= 200.130013532006
##$SI= 16384
##$SIGF1= 3
##$SIGF2= 2
##$SINO= 400
##$SIOLD= 16384
##$SREGLST= <1H.CDCl3>
##$SSB= 0
##$STSI= 0
##$STSR= 0
##$SW_p= 3612.71676300578
##$SYMM= 0
##$S_DEV= 0
##$TDeff= 0
##$TDoff= 0
##$TI= <>
##$TILT= no
##$TM1= 0
##$TM2= 0
##$TOPLEV= 0
##$USERP1= <user>
##$USERP2= <user>
##$USERP3= <user>
##$USERP4= <user>
##$USERP5= <user>
##$WDW= 1
##$XDIM= 8192
##$YMAX_p= 0
##$YMIN_p= 0
$$ End of Bruker specific parameters
$$ ---------------------------------
##NTUPLES= NMR FID
##VAR_NAME=  TIME,          FID/REAL,        FID/IMAG
##SYMBOL=    X,             R,               I
##VAR_TYPE=  INDEPENDENT,   DEPENDENT,       DEPENDENT
##VAR_FORM=  AFFN,          ASDF,            ASDF
##VAR_DIM=   8192,          8192,            8192
##UNITS=     SECONDS,       ARBITRARY UNITS, ARBITRARY UNITS
##FACTOR=    0.0002496,     1,               1
##FIRST=     0,             0,               0
##LAST=      2.0444736,     0,               0
##MIN=       0,             -633127,         0
##MAX=       2.0444736,     749009,          0
$$ Real data points
##PAGE= N=1
##DATA TABLE= (X++(R..R)), XYDATA
0@%%%%%%%JrJ6j6J6k4M0m8N6p2Q8j12J36j60J92k30K73l21L75m34N06n87O75p72
$$ 0 0 0 0 0 0 0 0 1 -8 8 -8 8 -16 24 -24 32 -40 48 -64 72 -88 104 -126 147 -174 201 -233 273 -314 361 -411
31d11Q80j004J142j291J454j636J838k057K299k563K848l162L508l886M294m739
$$ -411 469 -535 607 -684 770 -866 972 -1085 1214 -1349 1499 -1663 1845 -2041 2253 -2486
47b486N228n766O355o998P707q493R366j0341J1431j2661J4070j5693J7586j9831
$$ -2486 2742 -3024 3331 -3667 4040 -4453 4913 -5428 6003 -6658 7412 -8281 9305 -10526
61a0526K2539k5886L0152l5792M3637n5382P5111j16502L49839m25311q8691R85821
$$ -10526 12013 -13873 16279 -19513 24124 -31258 43853 -72649 277190 -148121 -236812 749009
73G49009o76643m06978Q09894j37913p21046O64370J65194p90546L58150N65308
$$ 749009 72366 -334612 475282 337369 -383677 280693 445887 -344659 13491 578799
83E78799q09905n2274Q10691m70974n29083P67875k0449p08637M62591L31577
$$ 578799 -231106 -283380 527311 56337 -472746 295129 274680 -433957 28634 360211
93C60211o99871J86533N52847o13116j50133P60905l69215n51999P30986J03276
$$ 360211 -339660 -153127 399720 -213396 -363529 397376 28161 -523838 207148 310424
103C10424p82913L90169N00439o76476j7176O55765m38135l14260O75888j67964
$$ 310424 -472489 -82320 418119 -258357 -275533 380232 -57903 -372163 303725 135761
113A35761n75876N91272K02468p37550K73526N62916o14285j49524O75762k94388
$$ 135761 -440115 151157 353625 -383925 -110399 452517 -161768 -311292 364470 70082
123G0082m32609N73853M208n65163M17821K75922o40502J58267N63864n32151
$$ 70082 -362527 211326 215534 -349629 68192 344114 -296388 -138121 425743 -106408
133a06408k32628O75675j87319n30553N05785J76509n82130K31874L92874n06628
$$ -106408 -339036 336639 149320 -381233 124552 301061 -281069 -49195 343679 -162949
143a62949j8058N32715l61853k96542N79077p5447n31502M09228K60622n49325
$$ -162949 -181007 351708 -10145 -306687 272390 196943 -334559 74669 335291 -214034
153b14034J03310M42525l91602j41837M73705k16781l16799M60915q775m84944
$$ -214034 -110724 331801 -59801 -201638 272067 55286 -261513 199402 190627 -294317
163b94317L36859K75243n23487M8941M77904l47249k40688M74139r2037l88156
$$ -294317 42542 317785 -205702 -156761 321143 -26106 -266794 207345 115308 -272848
173b72848L60239J16230m51749K06189L19184m37124l8124M71342k59046l06064
$$ -272848 87391 203621 -248128 -41939 277245 -159879 -198003 273339 14293 -291771
183b91771M37872K3219m21534K51355K23154l88101P2011L29698l20160r7539
$$ -291771 146101 169320 -252214 -859 222295 -165806 -93795 235903 -84257 -181796
193a81796M12571j86413l05058L95533O2378m30549K05436K85762l71123k5021
$$ -181796 230775 44362 -260696 134837 197215 -233334 -27898 257864 -113259 -138280
203a38280L62071k29512j79807L59259q8579l06492L12816J02278l94415J46598
$$ -138280 223791 -5721 -185528 173731 85152 -221340 91476 193754 -200661 -54063
213e4063L03489l29243r3171L63136j40586k39749K89568J4899k84136K04363
$$ -54063 249426 -79817 -172988 190148 49562 -190187 99381 114280 -169856 34507
223C4507J31140l13337R4265K71824k80660j01313L52761j10558k73787K76844
$$ 34507 165647 -147690 -53425 218399 -62261 -163574 189187 78629 -195158 81686
233H1686Q7453l11276J31793K03775k72891N499K78671k10169j44316L23757n7945
$$ 81686 169139 -142137 -10344 193431 -79460 -73961 204710 -5459 -149775 173982 116037
244A16037k97042K39439J49292l19030N1149K60285k13786r3043K57169j06430
$$ 116037 -181005 58434 207726 -111304 -60155 200130 -13656 -106699 150470 44040
254D4040j69970K36719p435k50592J80654J41199k81579K7953K58206j88239j30031
$$ 44040 -125930 110789 103354 -147238 33416 174615 -106964 -79011 179195 -9044 -139075
265a39075K54077n2066k00367J92602M4203k32151J31026J50399k52924O020K63605
$$ -139075 115002 62936 -137431 55171 99374 -132777 -1751 148648 -104276 -98256 165349
276A65349j71168j66363K66126K90k51119J52400J27140k23807M1864J76964j79517
$$ 165349 -5819 -172182 93944 94234 -156885 -4485 122655 -101152 -59288 117676 -61841
287f1841m4170K22389j15440j61111K26960K3339k46275J24281J61318k15252
$$ -61841 -106011 116378 938 -160173 66787 90126 -156149 -31868 129450 -85802
297h5802j3727K01631j25584r4506J92166n5518j58216J80241M4785k26689R9364
$$ -85802 -99529 102102 -23482 -117988 74178 18660 -139556 40685 85470 -141219 -41855
308d1855J78459k08457n3422K33668q6502j58850J77862K5135j75740J08601Q9112
$$ -41855 136604 -71853 -125275 108393 21891 -136959 40903 66038 -109702 -1101 88011
319H8011j78724M4551J62507j61377o4866K13536o4680j71203J67177N8939j87255
$$ 88011 -90713 -46162 116345 -45032 -109898 103638 38958 -132245 34932 93871 -93384
330i3384P1209J20730j52212K718J53722j22000p3980J91152m8173j75131J61676
$$ -93384 -22175 98555 -53657 -50939 102783 -19217 -93197 97955 49782 -125349 36327
341C6327Q4909k09339M1242J72260j39414o6990J68219n3396j17449J39773J3065
$$ 36327 121236 -88103 -46861 125399 -14015 -81005 87214 33818 -83631 56142 69207
352F9207j57179J00653J00317j74779M523J74633j08417j03469J59055l740j37744
$$ 69207 -87972 12681 112998 -61781 -57258 117375 8958 -94511 64544 60804 -76940
363g6940R2710N5458j28272M7591R4225j29776p117J51651r5021j03873J62180
$$ -76940 15770 71228 -57044 -9453 84772 -45004 -52121 99530 4509 -99364 62816
374F2816Q862j62140Q5952R8338j35646m36J22342q6644n1200J29922m5353j07586
$$ 62816 71678 -90462 -4510 93828 -41818 -42254 80088 -6556 -57756 72166 26813 -80773
386h0773J27917L3166j55265O0376J19622j25489l8616J35718m6352q8509J00876
$$ -80773 47144 80310 -74955 -14579 105043 -20446 -59062 76656 30304 -58205 42671
397D2671N464j01249P8384M6117j25382L9539J12676j15813m7903J45233l6471
$$ 42671 48135 -53114 25270 71387 -53995 -14456 98220 -17593 -65496 79737 43266
408D3266j17019J00324M6647j17808L5691Q3088r6251p811J08674p2255o5691
$$ 43266 -73753 26571 73218 -44590 -8899 74189 -22062 -29873 78801 6546 -59145
419e9145J23386o251j21087P5748P6227j09122p506R9940n1081m8384P9168j8818
$$ -59145 64241 57990 -63097 12651 88878 -20244 -27750 72190 21109 -27275 51893 33075
431C3075n9893P4913M650r0180O0083O0935j02517m373J03839n4137o8101Q6554
$$ 33075 -26818 48095 52745 -37435 22648 83583 -18934 -23307 80532 26395 -41706 44848
443D4848N341q2219N2427L4240q4667K9374O8056q6698k0640J04308m2082q6637
$$ 44848 50189 -32030 20397 54637 -30030 -656 67400 -19298 -39938 64370 22288 -64349
455f4349Q4692L5843r8474J8995P1621o1150k0301O5447l5099l5096O5990j5068
$$ -64349 20343 56186 -42288 -23293 48328 -12822 -33123 32324 -2775 -37871 28119 13051
467A3051o3544N9807L2532q0734J1027P2651m8896l7916O5118q062m9618M4059
$$ 13051 -50493 9314 41846 -38888 -27861 44790 -4106 -42022 23096 15034 -34584 9475
479I475J0167n3912L3701L5093o4833j29P0536l9627n3367O4531J6221o7849K0145
$$ 9475 19642 -34270 -569 34524 -30309 -30438 40098 471 -52896 11635 27856 -39993 -19848
492a9848M2455m2579n848L6418k8136j1258M1076k1475l4609M6637J1918n5311
$$ -19848 22607 -19972 -25820 10598 -17538 -28796 12280 -9195 -43804 2833 14751 -40560
504d0560J7689M3628l7189j5239L9989j1753j9747K9140o667k5528L4371J1892
$$ -40560 -22871 20757 -16432 -31671 8318 -3435 -23182 5958 -709 -26237 8134 20026
516B0026m8421J4869N0822l9094l3186N6204P102n2298J8104L3880l0295p950
$$ 20026 -28395 -13526 37296 -1798 -34984 21220 28322 -23976 -5872 28008 -2287 -10237
528a0237K7451j5740j2724K8897j1041k9725L2247J3938m3907N991L6780k1576
$$ -10237 17214 1474 -11250 17647 6606 -23119 9128 23066 -20841 -14850 21930 354
540C54k1672K3162M240j5573O287P07r365J6051K761k7544J2303K9590k6758j9737
$$ 354 -21318 1844 6084 -9489 -3202 -2495 -11860 4191 6952 -20592 -8289 21301 -5457 -25194
554b5194L5460P139l2728N765K4913j3171r808J5880o629p173J9937r468k1702
$$ -25194 10266 17405 -15323 -9558 15355 2184 -7624 8256 1627 -5546 14391 4923 -16779
567a6779K7137J2439l7369N81L6553j4022k7887K0300J2565j9474J070O234q899
$$ -16779 10358 22797 -14572 -13991 22562 8540 -19347 953 13518 -5956 -4886 1348 -7551
580g551J0885L516k5544R068K9539k3707k4143L4361J2572l7627M001L1691j6458
$$ -7551 3334 6850 -18694 -9626 19913 -3794 -27937 6424 18996 -18631 -14630 17061 603
593F03j3337K1201o136j0851K2711o145k5161K6878J9326l9901l643M5605j4292
$$ 603 -12734 8467 2331 -8520 14191 8046 -17115 9763 29089 -10812 -14455 31150 16858
606A6858l6493K8672J7789k9413J835J5395j2363L684R423k1906K017K8381k0362
$$ 16858 -19635 9037 26826 -2587 -752 14643 2280 5964 15387 -6519 -4502 23879 3517
619C517k5698L4004Q428l9379J0532K5105k3455l852J9242j8675l572K8352j9584
$$ 3517 -22181 11823 20251 -19128 -8596 16509 -6946 -10798 8444 -10231 -13803 14549 -5035
632e035k5285L9402Q586m9636J4756M3599l4288k2122L9785k679k7149K0207M995
$$ -5035 -30320 9082 17668 -31968 -17212 26387 -7901 -30023 9762 7083 -20066 141 5136
645E136k2132J9234J0835l5156J1137L6876l4186k1613M6872l952m1046K4983
$$ 5136 -16996 2238 13073 -22083 -10946 25930 -8256 -29869 17003 13051 -27995 -3012
657c012J8096l1382Q435J8485k9151M800L2321l3050j9368N0526q531n1016L4160
$$ -3012 15084 -16298 -7863 10622 -18529 -13729 18592 -14458 -33826 16700 8169 -42847 -8687
670h687L0052m5832k187L6348j9945j4132K6330j1861j5760L1397o477l5498L2253
$$ -8687 21365 -24467 -26654 9694 -10251 -24383 1947 -9914 -25674 5723 -754 -36252 -3999
683c999K2417m6083L523M2721k5386k0841L4077n078k3292K7340k92l3799L1090
$$ -3999 18418 -27665 -24142 18579 -6807 -27648 6429 1351 -21941 5399 5107 -28692 2398
696B398K1715n2924P384N6566l8908l6089N6696L330n1237K6541K5967l9704Q013
$$ 2398 24113 -28811 -21427 35139 -3769 -39858 16838 20168 -31069 -4528 21439 -18265 -10252
709a0252L1984l6763m663M7987k9182l5143N3717N925n4634K5019L4749m0120
$$ -10252 21732 -15031 -19694 28293 -889 -36032 17685 23610 -31024 -6005 28744 -11376
721a1376k908L5603k4110j0239L7295k2176k7624N1249m92n7484L4823M1571n6607
$$ -11376 -14284 21319 -2791 -13030 24265 2089 -25535 25714 25222 -32262 2561 44132 -12475
734a2475q294N6870k4375l3546M2918k473l8605L6659J1595n3441K6817M2843
$$ -12475 -20769 36101 11726 -21820 21098 18625 -19980 16679 28274 -25167 1650 44493
746D4493n8411j0594O5038k6701m6544N0084R944m9525K5725K4026m7053J5823
$$ 44493 -13918 -24512 40526 13825 -32719 17365 27309 -22216 3509 27535 -19518 -3695
758c695M0636n3134r428O7605l2128n2985O3075J6690o9405K3828M8006n0891
$$ -3695 36941 -16193 -25621 41984 9856 -43129 19946 36636 -32769 -8941 39065 -11826
770a1826q155N3010l3928k7188N9681j5597n5337N4624K4420p0905J6820N8507
$$ -11826 -19981 33029 -899 -28087 31594 15997 -39340 15284 39704 -31201 -14381 44126
782D4126m8547k3913N6882j7077l7454M6202k045m8437M3781K1850o7083K0936
$$ 44126 -4421 -28334 28548 11471 -25983 20219 18174 -30263 13518 35368 -31715 -10779
794a0779N9721n7688k6699P1561j6252n6410N0273J7680n9792K8538L8426o1886
$$ -10779 48942 -8746 -35445 36116 19864 -36546 13727 31407 -28385 153 38579 -23307
806b3307N672O4779n1115l7396P6547o857p2150M6890L9460o5544M928N3914m3710
$$ -23307 -17635 47144 -3971 -41367 35180 28323 -43827 3063 42523 -23021 -18093 35821 -7889
819g889j6990N6822l0582l8344O3442l309o8413M6124M2551p1743n75O7589m0934
$$ -7889 -24879 31943 1361 -36983 26459 23150 -45263 861 43412 -28331 -28906 38683 -2251
832b251l5993O1279j2018n0563N2018J1273o6217L5700M7516o9933p113P4688
$$ -2251 -38244 23035 11017 -39546 12472 23745 -42472 -6772 40744 -29189 -36302 38386
844C8386l6154n1029O2860Q147o1687L3804L0547n5667J4948M5841n3156j1055
$$ 38386 2232 -48797 14063 22210 -39477 -5673 24874 -30793 -15845 29996 -23160 -34215
856c4215O6649l2381n0615O3615J3000o9479K9495M6691n7624l175N6709m0377
$$ -34215 32434 53 -50562 13053 26053 -43426 -13931 32760 -24864 -28039 28670 -11707
868a1707k5673O3856j9772n5882N9820K3112p6146K1232O4118n6329k6587O7649
$$ -11707 -37380 26476 6704 -49178 10642 33754 -42392 -21160 42958 -13371 -39958 27691
880B7691j7515m7065M9262O491n1790L6342K6817n9450J3168N6024m8599k7866
$$ 27691 10176 -36889 12373 18864 -32926 3416 30233 -29217 -16049 39975 -8624 -36490
892c6490O5408j1441n3878M3980J9276n2625K2260L2683m9832N722N1390m3606
$$ -36490 28918 17477 -36401 7579 26855 -25770 -3510 29173 -20659 -14937 36453 -7153
904g153k8044O5890r584o2054M5436L4207o1727N876N1291l8672j7239M9160k1677
$$ -7153 -35197 30693 21109 -40945 4491 38698 -23029 -17153 34138 -4534 -21773 27387 5710
917E710l2553M9407L2n3857L5742L5429n7206j182N5359l1048l0063M6599o371
$$ 5710 -26843 22564 22596 -31261 4481 39910 -17296 -18478 36881 5833 -24230 22369 15998
930A5998l6457L4947P829m4582K5811L1697n1439l539N6522k9519m0432M9991
$$ 15998 -20459 14488 22317 -22265 3546 35243 -16196 -19735 36787 7268 -33164 16827
942A6827Q010m9624K2268K6302l8241M734L1967l2276r764M3397k0099l5547M2983
$$ 16827 24837 -24787 -2519 23783 -14458 -9724 22243 -10033 -19797 23600 3501 -32046 10937
955A0937J0853m8483J7332L3327l4709m952L2052k0762j1573L2730j5466k5995
$$ 10937 21790 -26693 -9361 23966 -10743 -15695 16357 -4405 -15978 16752 1286 -24709
967b4709L8761N115m6842K2403L6281m1904j0785M4145j5424k8198L1075K480
$$ -24709 14052 19167 -27675 -5272 31009 -10895 -21680 22465 7041 -21157 9918 12398
979A2398k9772K1389J3664l5045R830L2649l1990j6132M1218p523l4264K4801
$$ 12398 -17374 4015 17679 -17366 -7536 25113 -6877 -23009 18209 10686 -23578 1223
991A223J4192k8688O803J8038k1322J655K2186k2371j0126L4421j0583l1418K9409
$$ 1223 15415 -13273 -6470 11568 -9754 -8099 14087 -8284 -18410 16011 5428 -25990 3419
1004C419J4494l5576P181K6494k2166o984K4122j3171j3487K6675n763k7192K4883
$$ 3419 17913 -17663 -10482 16012 -6154 -13138 10984 -2187 -15674 11001 5238 -21954 2929
1017B929J4044l4636N433K9205k1107j3750K4112m539j6295J6290j59j9097J7297
$$ 2929 16973 -17663 -12230 16975 -4132 -17882 6230 1691 -14604 1686 1527 -17570 -273
1030b73Q845k8990Q098K7392k5337j4180L2075m498k6303J8758J1223k3393P753
$$ -273 8572 -20418 -12320 15072 -10265 -24445 7630 3132 -23171 -4413 6810 -16583 -8830
1043h830J6572k1785j37K6578j8248j6818L1097K90k9655J6421J8337k2311j409
$$ -8830 7742 -14043 -14180 12398 -5850 -22668 8429 8719 -20936 -4515 13822 -8489 -9898
1056i898J8655j0599n287J5849j0024r055K1999n150k2150K0260J1937k6795L460
$$ -9898 8757 -1842 -7129 8720 -1304 -10359 11640 6490 -15660 4600 16537 -10258 -6798
1069f798K2333j5566r425J9443o155j4015J8851kk3074J7039J5927k9102k84L0175
$$ -6798 15535 -31 -9456 9987 3832 -10183 8668 8666 -14408 2631 18558 -10544 -10828 19347
1083A9347j5250j9857K3950M498k2218J0508J1723j8364O124J5229k0440j378
$$ 19347 4097 -15760 8190 12688 -9530 978 12701 -5663 461 15690 -4750 -6128
1095f128K5854j5159j8156K6633L654k6257J0812J6446j8883o93J7319j4318n772
$$ -6128 19726 4567 -13589 13044 16698 -9559 1253 17699 -1184 -1877 15442 1124 -4648
1108d648K1800j1486j7339K4590M051k8826J0474K1905k0788r206K1976n088j4981
$$ -4648 17152 5666 -11673 12917 16968 -11858 -1384 20521 -267 -9473 12503 7415 -7566
1121g566J4622M30j5179J4289N062k2029R619J9143k1614p605K5884o751k0188
$$ -7566 7056 7486 -7693 6596 11658 -10371 -752 18391 -3223 -10828 15056 8305 -11883
1134a1883J8149O297k0393J0534J1708k2030N705K1558k2432r981L0747p174k7660
$$ -11883 6266 12563 -7830 2704 14412 -7618 -1913 19645 -2787 -12768 17979 10805 -16855
1147a6855K1230J4722k7407J748K1846j5804q229J9591r289j2917K0222j912k1844
$$ -16855 4375 19097 -8310 -6562 15284 -520 -8749 10842 1553 -11364 8858 6946 -14898
1160a4898J4733J3887k3614j021K2309j2422j2873J8250j914j4812J4695J444
$$ -14898 -165 13722 -9892 -10913 11396 -1026 -13899 4351 2437 -12375 2320 3764
1172C764j8814J3857J2212k4787J821K6211j6584j7328K5349K768k4377J2687
$$ 3764 -15050 -1193 11019 -13768 -11947 14264 -2320 -19648 5701 8469 -15908 -3221
1184c221J2791j9878M374J5586j7605j994K1481j2343j5833K2895L693k4583J0092
$$ -3221 9570 -10308 -5934 9652 -7953 -9947 11534 -809 -16642 6253 9946 -14637 -4545
1197d545J6924j8691k798J7629j0660o747J6602p508j3250J9157K490k3387J0935
$$ -4545 12379 -6312 -9110 8519 -2141 -8888 7714 206 -13044 6113 8603 -14784 -3849
1210c849J9244k1748p519K4663o628j7483J6245L795j6793R985Q196j7149M363
$$ -3849 15395 -6353 -13872 10791 4163 -13320 2925 6720 -10073 -88 8108 -9041 -4678
1223d678J6372j6345p804K1855m516j8296J4286P155j6253N394Q812j2145L129
$$ -4678 11694 -4651 -12455 9400 4884 -13412 874 8029 -8224 -2830 5982 -6163 -3034
1236c034J0424j3778k401J8830q865j6175J8583O412k1630N896J6192j4520m297
$$ -3034 7390 -6388 -8789 10041 1176 -14999 3584 9996 -11634 -5738 10454 -4066 -8363
1249h363J4995p480p929J4532k529j4877J3720Q659k0057K155J9560j1838j1023
$$ -8363 6632 -848 -8777 5755 3226 -11651 2069 10728 -9329 -7174 12386 548 -10475
1262a0475J5937O4j1618P972K989r216P247M399j3386M765J4021j3594o952J8010
$$ -10475 5462 5526 -6092 1880 4869 -4347 2900 7299 -6087 -1322 12699 -895 -7847 10163
1276A0163l069j4374J0863N608j1671M603O132j0284K799J0869j1415n090J6306
$$ 10163 7094 -7280 3583 9191 -2480 2123 8255 -2029 770 11639 224 -4866 11440
1289A1440l841j4773J1578P349j3720J826Q750p135r92P000p158k280J1443n980
$$ 11440 7599 -7174 4404 11753 -1967 -141 8609 1474 482 7482 324 -1956 9487 3507
1303C507j1052J3305M625j6945M153J3015j1448m921J1976m792o936J0016j852
$$ 3507 -7545 5760 10385 -6560 -2407 10608 -840 -5761 6215 1423 -5513 4503 2651
1316B651j0869J0564N392j5820L055J5038j1498p865J3730o06r568O044K007n727
$$ 2651 -8218 2346 7738 -8082 -5027 10011 -1487 -9352 4378 3772 -5796 248 2255 -3472
1330c472N504R25q817O248P797j2668j318J4648o455j0278J1682J368j0568O594
$$ -3472 2032 2957 -5860 388 8185 -4483 -5801 8847 2392 -7886 3796 5164 -5404 1190
1344A190M017j0603M677Q578j2732k405J6729p463j4696J4849N995j7409L421
$$ 1190 5207 -5396 -719 7859 -4873 -7278 9451 1988 -12708 2141 8136 -9273 -5852
1357e852J2006r732l347R747o020m497J1038m343j0770J2957M021j6742N642J3175
$$ -5852 6154 -3578 -6925 2822 -3198 -7695 3343 -1000 -11770 1187 5208 -11534 -5892 7283
1371G283j2517m128J3442m993p573J0646j275j0584J1173M508j6443N668J5366
$$ 7283 -5234 -9362 4080 -913 -8486 2160 885 -9699 1474 5982 -10461 -4793 10573
1384A0573j4591p462J8226k782j3877J0053N186j1386M366O421j0542K414J1603
$$ 10573 -4018 -11480 6746 3964 -9913 140 5326 -6060 -1694 4727 -5815 -3401 8202
1397H202j2335n350J7722n005j4963J3441O538j5764M329J1031j1295j097J3377
$$ 8202 -4133 -9483 8239 3234 -11729 1712 8250 -7514 -3185 7846 -3449 -4546 8831
1410H831r862p431J8358l220j8720J5197J1519k0929M76J9302r949j0922J4595
$$ 8831 -1031 -8462 9896 6676 -12044 3153 14672 -6257 -5781 13521 3572 -7350 7245
1423G245K03j2182R347L968j3832P508J0303j6111r56J7086r025j1818J4152K420
$$ 7245 7448 -4734 4613 8581 -5251 2257 12560 -3551 -4507 12579 3554 -8264 5888 8308
1437H308j3852O608O492j1648L760R305j3745o74J7352j0963j2579J8678L088
$$ 8308 -5544 1064 7556 -4092 -332 8973 -4772 -5446 11906 943 -11636 7042 10130
1450A0130j9752P392J4030j3567l701J4141o388p338J3747l401j2701J4025N261
$$ 10130 -9622 -2230 11800 -1767 -5468 8673 2285 -5053 8694 5293 -7408 6617 11878
1463A1878j8165N467J5612j3063p565J5841j998j2041R930K447j1610Q135N925
$$ 11878 -6287 -820 14792 1729 -5836 10005 8007 -4034 5896 8343 -3267 4868 10793
1476A0793j5274L910J5302j4145r307J8894l64j8328R058J1634j4788q97J2376
$$ 10793 -4481 -571 14731 586 -8721 10173 9809 -8519 539 12173 -2615 -3512 8864
1489H864q718m324J2233o096r030J3434J685j5740O829J2272j2413m829J3464
$$ 8864 146 -4178 8055 1959 -7071 6363 8048 -7692 -863 11409 -1004 -5833 7631
1502G631l176q453Q556m36o954Q305O51j1370P366R663j4318l487J7164n341j4042
$$ 7631 4455 -3998 4558 4122 -2832 5473 6124 -5246 2120 11783 -2535 -6022 11142 5801 -8241
1517h241J1835N596j4154L959Q840j0848l71J1241r184p325J5045j458j6324R495
$$ -8241 3594 9190 -4964 -1005 7835 -3013 -3384 7857 -1327 -8652 6393 4935 -11389 -1894
1531a894J1030j5097k891J3895n438p800Q725r66o727P639N07j0253O974Q036
$$ -1894 9136 -5961 -8852 5043 -395 -8195 530 -436 -7163 476 983 -9270 -2296 5740
1545E740j2735k112J4851n316j1165J0829L476j0298L741N569p938J562Q316r084
$$ 5740 -6995 -9107 5744 428 -10737 92 3568 -6730 -2989 2580 -5358 -3796 4520 -4564
1559d564l935J4078l775j3763J1093P784j4026l21J1709n524n534P339j867m585
$$ -4564 -8499 5579 1804 -11959 -866 6918 -7108 -7429 4280 -1244 -6778 561 -1306 -5891
1573e891P737j823r127R341N781j4224K075J3709q520p628J1653N71r134O176
$$ -5891 1846 23 -9104 237 6018 -8206 -6131 7578 -942 -8570 3083 3654 -5480 696
1587F96L740r081M990P408j1666m55J4914p412j1627J3632N214j4471K076J1224
$$ 696 4436 -4645 345 7753 -3913 -4368 10546 3134 -8493 5139 10353 -4118 -2042 9182
1601I182p179m408Q562l429m708Q433k548q962R877L888j3284K637J1330q203
$$ 9182 2003 -2405 6157 2728 -1980 6453 3905 -5057 4820 8708 -4576 -1939 9391 1188
1615A188n690R568j497o768O486j31p595Q094L006j3074M704J2332j1856o429
$$ 1188 -4502 5066 3569 -3199 3287 3156 -4439 3655 6661 -6413 -1709 10623 -1233 -7662
1629g662J4471n65j2395O354O842r263J340O862p944j6R947q073o496J3359l52
$$ -7662 6809 6244 -6151 203 7045 -2218 -878 5984 -1960 -1976 7971 -102 -6598 6761 6409
1644F409j3755P266R173j1060j935J0014n220m330Q899m600o319J1520q10j3571
$$ 6409 -7346 -80 9093 -1967 -3902 6112 892 -3438 5461 861 -5458 6062 5252 -8319
1658h319R082R716j4381k134J4702n322j0124J0222J683r393O369L542j0477N329
$$ -8319 763 10479 -3902 -6036 8666 3344 -6780 3442 5125 -4268 2101 5643 -4834 495
1672D95Q195j1532j932J3479n255j0267J0055L814j0486L699N336p931K577O403
$$ 495 8690 -2842 -4774 8705 3450 -6817 3238 7052 -3434 265 5601 -2330 247 6650
1686F650r862q6J2286p847r920J3854L056j5941N192J1602j1388l535J2028o448
$$ 6650 -3212 -3298 8988 1141 -8779 5075 8131 -7810 -2618 8984 -2404 -5939 6089 -359
1700c59o178J1778l527j1105J1835M555j6106L815J3979j1241p566J3935j738
$$ -359 -6537 5241 1714 -9391 2444 6999 -9107 -5292 8687 -2554 -10120 3815 2077
1713B077j0316Q517J432r490P707L352j2454M864J1549j2751n157J5923l430j3217
$$ 2077 -8239 278 1710 -7780 -73 3279 -9175 -4311 7238 -5513 -10670 5253 1823 -11394
1727a1394J0544N913j2853M004Q724j1072P29J1915r915o516J5959k133j5527
$$ -11394 -850 5063 -7790 -3786 4938 -6134 -5405 6510 -3405 -9921 6038 3905 -11622
1740a1622J0868R776j5747N96J3579q929m880J1639n236p382J2878j720j3754
$$ -11622 -754 9022 -6725 -6129 7450 -1479 -6359 5280 44 -7338 5540 3820 -9934
1753i934J1121Q875j7631Q93J7270j0638r592J5542j848j2531J1188L499j4425
$$ -9934 1187 10062 -7569 -6676 10594 -44 -9636 5906 4058 -8473 2715 6214 -8211
1766h211P443J0882j5781j983J8345q160j4001J5847M479j6785O405J0223j1839
$$ -8211 -768 10114 -5667 -7650 10695 2535 -11466 4381 8860 -7925 -1520 8703 -3136
1779c136K35J0915r469l413J4395o280j2111J5420L911j8316P302J3356j4669
$$ -3136 -2901 8014 -1455 -4868 9527 3247 -8864 6556 10467 -7849 -547 12809 -1860
1792a860k488J4731q096p830J4539l345j3351J3958N492j9658O127J7096j6118
$$ -1860 -4348 10383 2287 -5543 8996 5651 -7700 6258 11750 -7908 -1781 15315 -803
1805h03p751J9340m498j4384J2300M500j4224O464Q979j4001J205J4910j1622
$$ -803 -8554 10786 6288 -8096 4204 8704 -5520 944 9923 -4078 -2873 12037 415
1818D15q773J7739j696j6506J1350Q859j5153J591J2563j0689l648J4261p356
$$ 415 -8358 9381 7685 -8821 2529 11388 -3765 -2174 10389 -300 -3948 10313 2957
1831B957j0370J6074P46j8597J0602J2756j7992k379J7524q108j0922J3740k34
$$ 2957 -7413 8661 9407 -9190 1412 14168 -3824 -6203 11321 3213 -7709 6031 5797
1844E797j2860R730N073j5130N431J2387j4875m022J7376o674j2976J3350L640
$$ 5797 -7063 2667 7740 -7390 -1959 10428 -4447 -8469 8907 2233 -10743 2607 6247
1857F247j4332O076Q797j2626J424J2983j1859n718J7799n011j5852J4915P954
$$ 6247 -8085 -2009 6788 -5838 -4414 8569 -3290 -9008 8791 3780 -12072 2843 10797
1870A0797j8755K777J6086j1688p336J5524l897j1603J2597K202j5175Q446J0472
$$ 10797 -7958 -5181 10905 -783 -8119 7405 3508 -8095 4502 6704 -8471 -25 10447
1883A0447j6181j110J6398q464j1369J3713J869j3971P298O676j2371L124J0077
$$ 10447 -5734 -6844 9554 1090 -10279 3434 5303 -8668 -1370 5306 -7065 -3941 6136
1896F136j2071k634J5163p217j1983J4535M040j6873N680J2775j2785l336J4140
$$ 6136 -5935 -8569 6594 -623 -12606 1929 5969 -10904 -5224 7551 -5234 -8570 5570
1909E570o618q312J3608j481j3287J1047P505j5977K034J5344j0600q455J4883
$$ 5570 -1048 -9360 4248 2767 -10520 527 8032 -7945 -5911 9433 -1167 -9622 5261
1922E261j323j2468R620M100j2253N931P992j2939k20J4635r527j0046J5618J128
$$ 5261 3938 -8530 1090 5190 -7063 -1132 6860 -6079 -6299 8336 -1191 -11237 4381 5509
1936E509j6547Q268J0620j4168n93J3236q729o608J3921l079j2606J2188N950
$$ 5509 -11038 -2770 7850 -6318 -6911 6325 -2404 -9012 4909 1830 -10776 1412 7362
1949G362j6370L884J4890j2075o771J5446k942j1069J0171K989j1133O268P095
$$ 7362 -9008 -5124 9766 -2309 -9080 6366 3424 -7645 2526 5515 -5618 650 7745
1962G745j2571J657J3138j0406p271J5489j815j4161J0303O841j4055K934J0955
$$ 7745 -4826 -3169 9969 -437 -7708 7781 5966 -8195 2108 8949 -5106 -2172 8783
1975H783j0931l262J3936p058j0572J5042J651j7152Q522J2194j5459k617J5943
$$ 8783 -2148 -5410 8526 1468 -9104 5938 7589 -9563 -1041 11153 -4306 -6923 9020
1988I020p258r555J2860j29j1899R533N610j4631M669J3136j3449m892J6864n238
$$ 9020 1762 -7793 5067 4938 -6961 2572 8182 -6449 -1780 11356 -2093 -6985 9879 4641
2002D641j2941J2848L954j4255N916R106j2683R8J3402j0581p877J6680l186j5768
$$ 4641 -8300 4548 8502 -5753 163 9269 -3414 -3316 10086 -495 -8372 8308 5122 -10646
2016a0646J2107Q292j6715J508J3949j0509o386J3399m042j0527J2108J285j4206
$$ -10646 1461 9753 -6962 -5454 8495 -2014 -8400 4999 957 -9570 2538 3823 -10383
2029a0383Q930R082j5767M79J5411r617q687J4548j163j3009J0723M983j4514
$$ -10383 -1453 7629 -8138 -7659 7752 -1865 -10552 3996 2833 -10176 547 5530 -8984
2042h984O190J1422j5180j179J7386r399j2250J6765K350j7296Q089J0880j4482
$$ -8984 -2794 8628 -6552 -7731 9655 256 -11994 4771 7121 -10175 -2086 8794 -5688
2055e688m49J3910r726o667J4971m387j3111J3130N048j6740N099J3260j3069
$$ -5688 -6137 7773 -1953 -8620 6351 1964 -11147 1983 7031 -9709 -4610 8650 -4419
2068d419m608J4839n901r799J2968m90j2784J0833N735j6219M714J4421j3749
$$ -4419 -9027 5812 -89 -9888 3080 2590 -10194 639 6374 -9845 -5131 9290 -4459
2081d459o154J7442m217j3980J3059M651j5114O709R795j4002N76J4506j1027
$$ -4459 -10613 6829 2612 -11368 1691 6342 -8772 -2063 7732 -6270 -5694 8812 -2215
2094b215p953J6961k440j5644J1578Q163j5918K579J3167j1633l989J4339p357
$$ -2215 -10168 6793 4353 -11291 287 8450 -7468 -4889 8278 -3355 -7344 6995 -362
2107c62r358J5197q07j6167J1146J0589j7905K33J7585j0893r778J6637j893j4078
$$ -362 -9720 5477 4670 -11497 -351 10238 -7667 -7434 10151 -742 -10520 6117 4224 -9854
2121i854J2269M845j5891P092J1985j5487k543J7985q542j2466J6362J710j6025
$$ -9854 2415 7260 -8631 -1539 10446 -5041 -7584 10401 1859 -10607 5755 7465 -8560
2134h560R289Q324j4328L119J1842j2350l299J6262p706j2363J6203K906j8242
$$ -8560 729 9053 -5275 -2156 9686 -2664 -5963 10299 2593 -9770 6433 9339 -8903
2147h903Q278J2593j5883j683J6150r847q428J6250l399j4605J4130O388j9388
$$ -8903 -625 11968 -3915 -5598 10552 705 -7723 8527 5128 -9477 4653 11041 -8347
2160h347N341J6747j5939o495J9094n858j3654J4350K599j5563R276Q947j6564
$$ -8347 -3006 13741 -2198 -8693 10401 4543 -9111 5239 7838 -7725 1551 10498 -6066
2173f066K498J6241j3983q228J9843m065j7005J4381O890j8020N659J2935j4575
$$ -6066 -3568 12673 -1310 -9538 10305 6240 -10765 3616 10506 -7514 -1855 11080 -3495
2186c495k052J6361j0136j0729J8422p12j9052J2636J1263j9317P57J7624j1990
$$ -3495 -5547 10814 678 -10051 8371 7659 -11393 1243 12506 -6811 -6054 11570 -420
2199d20q265J6791m345j3437J4527L039j8248R582J3069j9259j159K0447j1805
$$ -420 -8685 8106 3761 -9676 4851 7890 -10358 -776 12293 -6966 -8125 12322 517
2212E17j2400J8827n52j7574J2371Q146j8574N486J5333j6996n155K1852q946
$$ 517 -11883 6944 6392 -11182 1189 9335 -9239 -3753 11580 -5416 -10571 11281 2335
2225B335j6880J9091M986k1415Q070J5020j6980k440J7430j0529r901J8599l394
$$ 2335 -14545 4546 9532 -11883 -3813 11207 -5773 -8213 9217 -1312 -11213 7386 3992
2238C992j7508J5689Q154k1678N416J8176j6592o855J9788o869j3986J6563J568
$$ 3992 -13516 2173 10327 -11351 -5935 12241 -4351 -11206 8582 1713 -12273 4290 5858
2251E858j8478J2203J0722k0931L004K0185j5960j1040K2648l123j9587J5145
$$ 5858 -12620 -417 10305 -10626 -7622 12563 -3397 -14437 8211 5088 -14499 646
2263F46Q621j9917N697J5649j7456k768K0422j1344j3739K1352N10k1845J2978
$$ 646 9267 -10650 -4953 10696 -6760 -9528 10894 -450 -14189 7163 7673 -14172 -1194
2276a194J3702k0771M45J9319j3220r100K0029n663j6522J8153M881k3110J0335
$$ -1194 12508 -8263 -7818 11501 -1719 -10819 9210 3547 -12975 5178 10059 -13051 -2716
2289b716J7570k1293m760K3526j0082j6060J9764J992k0456J2549J0690k1068
$$ -2716 14854 -6439 -11199 12327 2245 -13815 5949 7941 -12515 34 10724 -10344
2301a0344M424J8911j7842q105K3534o717j9044J8192P018k1842Q082J5039j8247
$$ -10344 -5920 12991 -4851 -12956 10578 3861 -15183 3009 10027 -11815 -3733 11306 -6941
2314f941j115J9544j3600j0262K2277m284k0750J8083J0406k4370M650K1336j7538
$$ -6941 -8056 11488 -2112 -12374 9903 5619 -15131 2952 13358 -11012 -6362 14974 -2564
2327b564q626K2634p270j6595J9250K725k1960J2931J4356k3161n7K3760j4741
$$ -2564 -11190 11444 4174 -12421 6829 9554 -12406 525 14881 -8280 -8337 15423 682
2340F82j4170K2781j141k0834J4984Q978k0735O688J6163j9229l298K2652j1961
$$ 682 -13488 9293 8152 -12682 2302 11280 -9455 -2767 13396 -5833 -9131 13521 1560
2353A560j5810K2344K336k3507J2561J4621k1342O28J9944j4883q835K1753o654
$$ 1560 -14250 8094 10430 -13077 -516 14105 -7237 -6609 13335 -1548 -10383 11370 4716
2366D716j8119J9509O017k4325R311J8621k0482n334K2728j0224j4483J9475l49
$$ 4716 -13403 6106 12123 -12202 -2891 15730 -4752 -10086 12642 2418 -12065 7410 7061
2379G061j9127J4453Q851k2470O164J9458j9396q152K4502p528j9450J9572N467
$$ 7061 -12066 2387 11238 -11232 -5068 14390 -5006 -13158 11344 3816 -15634 3938 9405
2392I405k2030R730J4129j9964L36K0546j4952j1463K3517l453k1812J6977J1080
$$ 9405 -12625 -2895 11234 -8730 -8394 12152 -2800 -14263 9254 5801 -16011 966 12046
2405A2046k2995M249J8642j6069o161J9931q849j3303J9196J33k0739J4208J2295
$$ 12046 -10949 -6700 11942 -4127 -10288 9643 794 -12509 6687 6820 -13919 289 12584
2418A2584k2548J888K1125j5361j0123K1129m941j6600J6670M303k0622J0473
$$ 12584 -9964 -8076 13049 -2312 -12435 8694 3753 -12847 3823 8126 -12496 -2023
2430b023J4273k1187r61K2491j3168j4325K2213j47k0885J3732J0402j9838M302
$$ -2023 12250 -8937 -9898 12593 -575 -14900 7313 7166 -13719 13 10415 -9423 -5121
2443e121J6345j6216m768K0876r561j5509K0365K983k2150J1390J4254j9553n74
$$ -5121 11224 -4992 -9760 11116 1555 -13954 6411 9394 -12756 -1366 12888 -6665 -7239
2456g239J8733j2554r036J9349n089j6736J7457N672k2348Q910J7287k0026m454
$$ -7239 11494 -1060 -10096 9253 4164 -12572 4885 10557 -11791 -2881 14406 -5620 -10074
2469a0074K1420r489j3778J7789N85j7523J2576Q284j9483N288J7142j7323o317
$$ -10074 11346 1857 -11921 5868 6453 -11070 1506 9790 -9693 -4405 12737 -4586 -10903
2482a0903K1906p717j5910J7432L808j9082R850J1382j7670J489J7649j4445q026
$$ -10903 11003 3286 -12624 4808 8616 -10466 -616 10766 -6904 -5415 12234 -2211 -10237
2495a0237K1285n455j8782J7594P862k1792O135J6762j6399m689J8890r057j2015
$$ -10237 11048 5593 -13189 4405 12267 -9525 -3390 13372 -3027 -7716 11174 2117 -9898
2508i898J8142q58j8546J3691J0288k1090L188J8745j4978q196J9194m950j4589
$$ -9898 8244 7386 -11160 2531 12819 -8271 -5083 13662 -1316 -9512 9682 4732 -9857
2521i857J5017L155j7469J0029J1015j8789J385J9288j4113j0634K0508k378j7719
$$ -9857 5160 8315 -9154 875 11890 -6899 -5514 13774 -339 -10973 9535 7157 -10562
2534a0562J3390Q095j8224N117J4268j5770k968J8862j0589j2571J9372L26j9639
$$ -10562 2828 10923 -7301 -2184 12084 -3686 -6654 12208 1619 -10952 8420 8746 -10893
2547a0893J2012J1464j8778Q19J7036j2549p474J7911o276j4103J6738K745j9874
$$ -10893 1119 12583 -6195 -5376 11660 -889 -8363 9548 3272 -10831 5907 8652 -11222
2560a1222J0316J3733j9104j858J9343j0434j1808J7372n15j6550J2274P215j7718
$$ -11222 -906 12827 -6277 -8135 11208 774 -11034 6338 5823 -10727 1547 8762 -8956
2573h956N518J4812j6187m574J9599p719j4743J6242L806j7685Q278J0697j5578
$$ -8956 -3438 11374 -4813 -9387 10212 2493 -12250 3992 7798 -9887 -1609 9088 -6490
2586f490R74J4839j2269o708J8062n718j5263J5735N583j9309O525J4491j5602
$$ -6490 -5516 9323 -2946 -9654 8408 2690 -12573 3162 8745 -10564 -4039 10452 -5150
2599e150l642J7308q837j0509J6419j723j5769J2872Q073j8672L467J6795j3677
$$ -5150 -8792 8516 -321 -10830 5589 3866 -11903 969 9042 -9630 -6163 10632 -3045
2612c045p763J7842m049j3943J3254L782j5462Q209R574j5411R21J5864j1309
$$ -3045 -10808 7034 2985 -10958 2296 6078 -9384 -1175 8399 -7012 -6091 9773 -1536
2625a536q917J7201j263j6004J1371P874j5829L555J2574j2353l243J4927p569
$$ -1536 -10453 6748 5485 -10519 852 8726 -7103 -3548 9026 -3327 -6570 8357 788
2638G88j0531J5372R60j6422R232J0689j5434n90J4757r037p540J3770k853j1437
$$ 788 -9743 5629 6589 -9833 -601 10088 -5346 -5936 8821 -216 -7756 6014 3161 -8276
2652h276J1616L106j4535O824J0975j4141k389J5592p046j0665J3418J037j3061
$$ -8276 3340 6446 -8089 -1265 9710 -4431 -6820 8772 1726 -8939 4479 5516 -7545
2665g545Q230O694j3178L077J1611j1274m929J4918m212j2731J2047N068j4410
$$ -7545 685 7379 -5799 -2722 8889 -2385 -7314 7604 3392 -9339 2708 7776 -6634
2678f634M120J0640j0625k450J1769o540o746J1847j484j1531R587N854j3449
$$ -6634 -2514 8126 -2499 -4949 6820 280 -6466 5381 3897 -7634 1953 7807 -5642
2691e642K271J1719r469m801J1618l259q283R162J137j0204O636O380j1636Q34
$$ -5642 -3371 8348 -1121 -5922 5696 2437 -5846 3316 4453 -5751 885 7265 -4371 -3537
2705c537J1901q161p328J2367m49j1014P161N330r958K227P737q095k290J0537
$$ -3537 8364 203 -7125 5242 4793 -6221 940 6270 -3688 -1461 6276 -1819 -4109 6428
2719F428n101p887J0586J375j1386N326P654r589r36R178n564m527Q697k147p460
$$ 6428 1327 -6560 4026 5401 -5985 -659 6995 -2594 -3530 5648 84 -4443 4254 2107 -5353
2734e353P912K437j0589M361Q272r116k734R879l178p124P111J579p545L964M119
$$ -5353 2559 4996 -5593 -1232 7040 -2076 -4810 5069 1891 -5233 1878 3457 -4088 -124 3995
2749C995p626J513P430o794l474Q937j895p943O005L808p345J192N446n299q66
$$ 3995 -3631 -2118 5312 -1482 -4956 3981 2086 -5857 148 3956 -3389 -2197 3249 -2050 -2916
2764b916O162m329l478P464j223p615O070M361q640M49P602m902l561O484j149
$$ -2916 3246 -1083 -4561 2903 1680 -5935 135 4496 -4144 -3695 3907 -995 -4556 1928 779
2779G79n268N315Q05o336L879M482p242m70P462l305n198N631J468n558K419K942
$$ 779 -4489 826 1631 -4705 -826 3656 -3586 -4056 3406 101 -5097 534 2002 -3556 -1137 1805
2795A805m229R04L659m408o47N930k882m843N947J599o226J710M665l913j506
$$ 1805 -2424 -1520 2139 -2269 -2916 3014 132 -4711 1236 2835 -3391 -1681 2984 -929 -2435
2810b435M327j965k179M403j151m211M836J704o033J535N330m043k646M725k91
$$ -2435 1892 -73 -2252 2151 1000 -3211 1625 3329 -2704 -1169 4161 118 -2528 2197 1906
2825A906l569K704O44k966K368J229m097J383M138m119k260M794K25m872K533
$$ 1906 -1663 1041 1685 -1281 1087 2316 -1781 -398 3740 -379 -2639 2155 2380 -2492 41
2840D1K783l610J23K659k307o57L244k284k189M212K16m791K087L908l573k006
$$ 41 2824 -786 -663 1996 -311 -968 2276 -8 -2197 2015 2231 -2560 -473 3435 -138 -2144
2856b144L968n12k383J806J30j550J856M4k680J741K540l383j040M115r59l099
$$ -2144 1824 1312 -1071 735 865 -685 1171 1215 -1465 276 2816 -567 -1607 2508 1549 -1550
2872a550K102J190k093P60P71j682J183J418k775m66L751r43l746K361K609l359
$$ -1550 552 1742 -351 409 1180 -502 681 2099 -676 -1142 2609 1666 -2080 281 2890 -469
2888d69q22L117q03j273J081k53p88J760l73k523K193J826l260n50L458o52k961
$$ -469 -1291 1826 1023 -250 831 578 -210 1550 1177 -1346 847 2673 -587 -1137 2321 1669 -1292
2905a292J862R62j434K35L21q84J001R92k652j60L269j073l196K296K150k689
$$ -1292 570 1532 98 333 654 -230 771 1763 -889 -1049 2220 1147 -2049 247 2397 -292
2921b92j194K596l37j652P63M4o39J311l85j994J740J557k982n49L163o43k295
$$ -292 -1486 1110 773 -879 -116 -72 -711 600 215 -1779 -39 1518 -1464 -2013 1150 507 -1788
2938a788J086J073j213J22N77j149J082J065k654K8L440j735k879K922J656l339
$$ -1788 -702 371 -842 -720 -143 -1292 -210 855 -1799 -1771 1669 -66 -2945 -23 1633 -1706
2954a706l36K990j044j588J719m13j279K020l19k443J868K298l544q61L832n66
$$ -1706 -2042 948 -96 -1684 35 -378 -1657 363 44 -2399 -531 1767 -1777 -2638 1194 628
2970F28l323J795J772k130J70J262j485N41J642k549k99L738j410l628L210K239
$$ 628 -2695 -900 872 -1258 -1088 174 -1311 -770 872 -1677 -1976 1762 352 -3276 -66 2173
2986B173l787l58L467j713j224K166j213j255L249r56l417L200K260m297n41M701
$$ 2173 -1614 -1972 1495 -218 -1442 724 -489 -1744 1505 549 -2868 332 2592 -1705 -2246 2455
3002B455j782l435L401P74k856J709P57k471J705K058m178K32M906k690m114M885
$$ 2455 673 -2762 639 1413 -1443 266 1023 -1448 257 2315 -1863 -1631 3275 585 -3529 1356
3018A356J661n210J351L585l300n27L429k646j530M596j561m511M883K452o644
$$ 1356 3017 -2193 -842 2743 -557 -1084 2345 -301 -1831 2765 1204 -3307 1576 4028 -2616
3033b616Q13O020l764l200M881j54l745L160M51l637K773K317n562P69N928m302
$$ -2616 -1803 4217 453 -2747 2134 1980 -1765 1395 1846 -1791 982 3299 -2263 -1494 4434 132
3049A32l506O103R0n638K988K645m500J267L515m588l09N933m018m289O993O33
$$ 132 -3374 2729 2819 -2819 169 2814 -1686 -419 3096 -1492 -1801 4132 114 -4175 2818 3451
3065C451p744L723N191o037j146N928l014k797N127j531m633N585J265p254L109
$$ 3451 -4293 -570 4621 -1416 -2562 3366 352 -2445 2682 1151 -3482 2103 3368 -3886 -777
3080g77O145o877k307P760k175n452N177J340n643L221L004o385J674O397o516
$$ -777 5368 -1509 -3816 3944 1769 -3683 1494 2834 -2809 412 3416 -2969 -1295 5102 -1414
3095a414l091Q745j840p496N855L499p398J439N226m985j076O090m121l823P651
$$ -1414 -4505 4240 2400 -5096 759 4258 -3140 -1701 3525 -1460 -2536 3554 -567 -4390 3261
3110C261j169p586N822M355q467R01O954m779l222O445k118m664O094J12p222
$$ 3261 2092 -5494 328 4683 -3784 -2883 4071 -708 -3930 2515 397 -4267 1827 1939 -5283
3125e283N037M857q705K88Q949n521n451P951M39p418M809L136p070K291N921
$$ -5283 -246 4611 -4094 -3806 5143 -378 -5829 2122 2561 -4857 -48 3088 -3982 -1691 4230
3140D230p180j061Q680m601o390Q278J535q734L752N586o618m95O481m721k678
$$ 4230 -2950 -4011 4669 68 -6322 1956 3491 -5243 -1491 4095 -2523 -3018 3463 -1258 -3936
3155c936P643l430n709P466J694r280L747P020p648k054Q156l341m886O689l58
$$ -3936 3707 277 -5432 2034 3728 -5552 -1805 5215 -2433 -4487 3669 328 -4558 2131 1773
3170A773o583O014K540q527K918P370p439l037R192k319o797O289K082o980L443
$$ 1773 -4810 1204 3744 -4783 -1865 5505 -1934 -4971 4221 1902 -4895 1394 3476 -3504 -61
3185f1M200p134J381O981o644l105R232k348q047O847L838q502J921O407o124
$$ -61 4139 -2995 -1614 5367 -1277 -4382 4850 2502 -5545 1302 5140 -3362 -1441 4966 -1158
3200a158j441P116m236l930P606j035p846O256M532r073P82Q003n126m001O941
$$ -1158 -2599 4517 281 -3649 3957 2922 -4924 1332 5864 -3209 -2427 5576 450 -3551 3390
3215C390j222n487N729N38o472M671L871p809N27P910n225m919P842j34p208N130
$$ 3390 2168 -3319 2410 2948 -3524 1147 5018 -2791 -2264 5646 421 -4498 3344 3210 -3998 1132
3231A132K573o818K967M679o933L3P520n090n127Q319K62q324M373N122p112L69
$$ 1132 3705 -3113 -146 4533 -2400 -2367 5153 63 -5064 3255 3517 -4807 -434 4688 -2424 -2055
3247b055N892m923j683O445l432m516P031O50q357M512N443p346q44P222l859
$$ -2055 3837 -1086 -2769 3676 244 -4272 2759 3409 -4948 -436 5007 -2339 -3183 4039 180
3262A80l551O213j458m912N624R40o956L700N319p222j238Q086l568n460O409
$$ 180 -3371 2842 1384 -3528 2096 3036 -3920 -220 5099 -2123 -3361 4725 1157 -4303 2106
3277B106P17o079L900K471n950K226M813o370r69P661l826n569O915J028p114
$$ 2106 2823 -3256 644 3115 -2835 -609 4204 -2166 -3135 4526 700 -4869 2046 3074 -4040
3292d040L264M228n838M98N142m880j780O897l272n630P056J782q204K998O019
$$ -4040 -776 3452 -2386 -1888 3254 -1626 -3406 3491 219 -5411 1645 3427 -4777 -1779 4240
3307D240o081j949O553k896l593N461j149m843N290J602p151K538O019o115k266
$$ 4240 -1841 -3790 2763 -133 -3726 1735 586 -4257 1033 2635 -4516 -1978 4041 -2074 -4340
3322d340P155k268n026N572J55n229L974K501o352K247N582o425k093P965k434
$$ -4340 2815 547 -4479 1093 1248 -3981 -7 2494 -3858 -1611 3971 -2454 -4547 3418 984
3337I84o520O163K157o535K627L979n209L31N242m538k649P201j804o501N911
$$ 984 -5536 627 2784 -3751 -1124 2855 -2354 -2023 3219 -1319 -3968 3233 1429 -5072 839
3352H39L201p518J605N788n096j562N820l007l261O138j118o051N445L309q035
$$ 839 4040 -3478 -1873 3915 -1181 -2743 3077 70 -3191 2947 1829 -4222 1223 4532 -3503
3367c503J417P168n432l300O816j338n095M790J094n841L855L241o521R02O585
$$ -3503 -2086 5082 -350 -3650 3166 1828 -3267 1523 2617 -3224 631 3872 -2649 -1747 4838
3382D838n014l670P285p69o190M294K843n928K034L733m969j45O036m223m063
$$ 4838 -176 -3846 3439 2670 -3520 774 3617 -2311 -277 3456 -1513 -1658 4378 155 -3908
3397c908P426n05p402M972M340p145N14N677m048k376N795k474m216N872M30p082
$$ -3908 3518 3013 -4389 583 4923 -2222 -1708 3969 -79 -2455 3340 866 -3350 2522 2952 -4130
3413d130M007N050p090o62O932l576m214N737k22m895L970J740n812K777M572
$$ -4130 -123 4927 -2163 -2825 4107 531 -3683 2054 1832 -3063 907 2647 -3165 -388 4184
3428D184o279r62P087l195m970N991R18o050L048L379n123O76M674m609j444O249
$$ 4184 -2095 -3057 4030 835 -4135 1856 2774 -3276 -228 3151 -1972 -1296 3378 -1231 -2675 3574
3444C574k942n046O218J540p082K617M883m865j179N130k987k485N076j446m656
$$ 3574 632 -4414 1804 3344 -3738 -1121 3762 -1103 -2282 2848 -139 -2624 2452 1006 -3650
3459c650N134J463o831K753N331n545j906O053j901m132M576N77n010L420K416
$$ -3650 1484 2947 -3884 -1131 4200 -1345 -3251 2802 901 -3231 1345 1922 -3088 332 2748
3474B748n758J358N468n185k488O295q87n516L955K524n078J196L372l935rM346
$$ 2748 -3010 -1652 3816 -1369 -3857 2438 1551 -3965 -10 2514 -2564 -1368 2004 -1931 -1940 2406
3490B406l620k137N792j353n367M456K602n515O29M541l678j243M389k516k487
$$ 2406 -1214 -3351 2441 1088 -4279 177 2779 -2736 -2107 2434 -1244 -2487 1902 -614 -3101
3505c101M932p79n017M314K651o135P00N325l417l013M817m41l614L407O81m251
$$ -3101 1831 1052 -3965 349 3000 -3135 -2435 2890 -527 -3540 1277 836 -2778 629 1310 -2941
3521b941K676K666m906M75N075l437l115N280j31m593K768K275l887J050K987
$$ -2941 -265 2401 -2505 -2030 3045 -392 -3507 1773 1642 -2951 -183 2092 -1795 -745 2242
3536B242l639r2M366l190k651N066Q5n014K701L162m200j82L810k687j132L657
$$ 2242 -1397 -1489 2877 -313 -2964 2102 2187 -2827 -126 3036 -1164 -1346 2464 -223 -1355 2302
3552B302j832k514M201j57m683L183K935m612k78M357k366k453L743p11k869L125
$$ 2302 470 -2044 2157 2000 -2683 500 3435 -1177 -1455 2902 536 -1917 1826 1115 -1754 1371
3568A371P58m467K755L137m977m80N265k185l801M194P84m263K258K065l749J286
$$ 1371 2129 -2338 417 3554 -1423 -1903 3362 1177 -2624 1570 2354 -1909 349 2414 -1335 -49
3584d9K835l712n61M559k476l224M350Q87m684J820L028l657J4L161k779p19L764
$$ -49 2786 -926 -1487 3072 596 -2628 1722 2609 -2075 -255 2773 -884 -870 2291 -488 -1207 2557
3601B557k377k827M716J86n139K361L605m189q75M005j850k290L568q03l074L280
$$ 2557 180 -2647 2069 2255 -2884 -523 3082 -1107 -1982 2023 173 -2117 1451 648 -2426 854
3617H54R97m549J907L823m300j288M956j680l606L836N93l631K074K006m259J586
$$ 854 1851 -2698 -791 3032 -1268 -2556 2400 720 -2886 950 1543 -2088 -14 1992 -2267 -681
3633f81L521m190j234N298j634m643M266J716m749J459L019l331l91L655k935
$$ -681 2840 -1350 -2584 2714 1080 -3563 703 2419 -2330 -871 2148 -1183 -1574 2081 -854
3648h54j646M581j439m324M285J854n240J128M102l354j599M022j853k234L938
$$ -854 -2500 2081 642 -3682 603 2457 -2783 -1655 2447 -907 -2506 1516 -337 -2571 1367
3663A367r62l759L873J784n335J145N092m350k379N389j072m068L871R48m331
$$ 1367 405 -3354 519 2303 -3032 -1887 3205 -1145 -3524 1865 793 -3275 596 1544 -2787
3678b787K596K536m953P11N000l828k957N583j96n201L231K715m688P00L528l459
$$ -2787 -191 2345 -2608 -1897 3103 -725 -3682 1901 1705 -3496 -265 2450 -2238 -1538 1990 -1469
3694a469n84M044k781k419M830j09n352L457L290n213o1M621k773k082M104j168
$$ -1469 -2053 1991 -790 -3209 1621 1512 -3840 -383 2907 -2306 -2367 2254 -519 -2601 1503 335
3710C35l145L945O34n022L049L722n529l32N664k655l694M746R8m023K861J670
$$ 335 -2810 1135 1769 -3253 -204 3518 -2011 -2343 3321 666 -3028 1718 1816 -2207 654 2324
3726B324m271J956L258m636m99N539k741m175N097J031n212K152L128l942j4L719
$$ 2324 -1947 9 3267 -1369 -1868 3671 930 -3245 1852 2883 -2329 -177 2951 -991 -1005 2714
3742B714l165j593M927j850m156M698J682n748J617M499l969j695M388j367k591
$$ 2714 -451 -2044 2883 1033 -3123 1575 3257 -2491 -874 3625 -344 -2039 2349 982 -1609
3757a609L487l63l623L364J696m969J283M422l919k058N099j150l782L302O96
$$ -1609 1878 1515 -2108 1256 2952 -2017 -734 3688 -231 -2289 2810 1660 -2122 1180 1876
3772A876l550K218J775l898Q64L916l717k359N672j072m651L209K353m275O34
$$ 1876 -1674 544 2319 -1579 -715 3201 -516 -2875 2797 1725 -2926 283 2636 -1639 -1005
3787a005L242k802p57L445k267k308M365l46m529L317K610m675J43M080k556j947
$$ -1005 2237 -565 -1322 2123 -144 -2452 1913 1567 -2962 355 2965 -1710 -1567 2513 -43 -1990
3803a990L560r81k384K772L81l813K774K587m631M8M384k430k972L768J50l208
$$ -1990 1570 589 -1795 977 1358 -2455 319 2906 -1725 -1677 2707 277 -2695 1073 1223 -1985
3819a985J955J174k759J351J931l372K68L751k503k580L691O01l910J680K178
$$ -1985 -30 1144 -1615 -264 1667 -1705 -1437 2314 -189 -2769 922 1523 -2387 -707 1471
3834A471k942L31K494k284p91L463j894k530L875L67m198J767L192l182j080L110
$$ 1471 -1471 -1140 1354 -930 -1721 1742 -152 -2682 1193 1560 -2638 -871 2321 -861 -1941 1169
3850A169j025j911K615m98k218K611M89l453J803K462k950j007L436q70k725K173
$$ 1169 144 -1767 848 350 -1868 743 1232 -2221 -418 2044 -906 -1913 1523 653 -2072 101
3866A01N76k052J633O23k714J566J911k841m83L425j346k808K864J036k898P75
$$ 101 677 -1375 258 881 -1833 -267 1644 -1197 -1680 1745 399 -2409 455 1491 -1407 -632
3882f32J662j829K23J817k061l93K912j390k492L123Q90l317O88K735k050r40
$$ -632 1030 -799 -576 1241 -820 -1213 1699 309 -2183 940 1830 -1487 -799 1936 -114 -1054
3898a054K212r92r44K056p35k090K651M53l263J165K674k305j228K812m54j979
$$ -1054 1158 166 -778 1278 543 -1547 1104 1557 -1706 -541 2133 -172 -1400 1412 958 -1021
3914a021J686L50j585J176P45k409R42K274k301j203K732j12k394J361J378j839
$$ -1021 665 1015 -570 606 1351 -1058 -116 2158 -143 -1346 1386 1274 -1120 241 1619 -220
3930b20J99J226j648N89J524j928m74K531o68k584K123J299k716K03K031j136
$$ -220 -21 1205 -443 146 1670 -258 -732 1799 1131 -1453 670 1969 -747 -544 1487 351
3946C51p74J685r07j059J864k47k252J818J445k624l30K827j038k042J893N20
$$ 351 -423 1262 355 -704 1160 913 -1339 479 1924 -700 -1030 1797 759 -1283 610 1130
3962A130j641R00L11j325R90R64k129r6K531j440j883K325P00k170L83J311j095
$$ 1130 -511 389 700 -625 365 1329 -800 -896 1635 195 -1688 637 1337 -833 -450 861 -234
3979b34j27R54j368M7J660q52j508J950P85k696N13K286j711q01J412k57q81J111
$$ -234 -361 593 -775 -728 932 80 -1428 522 1307 -1389 -876 1410 -301 -1102 310 53 -828 283
3997B83l75r96J316M02j976N99J986j452j467K257k0j817P96P89r02J79P42j246
$$ 283 -92 -1088 228 630 -1346 -747 1239 -213 -1680 577 557 -1260 -464 325 -577 -398 344 -902
4015i02K8J554j059j377K064M38k526O21K262j530q46J304r0q60R35j48r10R97
$$ -902 -874 680 -379 -1756 308 746 -1780 -1159 1103 -427 -1273 31 -59 -919 16 -132 -1042 -45
4033d5N88j778N75J807j391j439K096L87j796M31Q90n87p6N24p89K09J368j261
$$ -45 543 -1235 -660 1147 -244 -1683 413 800 -996 -565 325 -262 -338 186 -603 -394 974 -287
4051b87r99K074J53k400R21J680j375r18J324R8q63Q43N6j292J626J31j994Q54
$$ -287 -1286 788 941 -1459 -538 1142 -233 -1151 173 271 -592 251 307 -985 641 772 -1222 -368
4069c68J838j793j130K058K73j700N33J218j200J74Q98j080K7J608j122j176J997
$$ -368 1470 -323 -1453 605 878 -822 -289 929 -271 -97 801 -279 -252 1356 234 -942 1055
4086A055L01k295O25K059j594q58J749l32j074J330j83j181J236N79k222N13K278
$$ 1055 1356 -939 -314 1745 151 -707 1042 710 -364 966 783 -398 838 1417 -805 -292 1986
4103A986j660j579K336R6j992R62J025j493L52R10j240L81J543j624j119K414
$$ 1986 326 -1253 1083 1179 -813 149 1174 -319 33 943 -297 84 1627 3 -1116 1298
4119A298Mk445J466J629k254l14K241j284p00J550o93j491K272K40k619J032K425
$$ 1298 1302 -1143 323 1952 -302 -616 1625 341 -359 1191 498 -993 1279 1519 -1100 -68 2357
4136B357k409j220K946n19k310J799P13k028Q56R49j706L04K086k113j110K787
$$ 2357 -52 -1272 1674 1155 -1155 644 1357 -671 185 1134 -572 -268 1818 -295 -1405 1382
4152A382l89k663J979J250k525L46J657j302m08J677j032j268K375k67k566J663
$$ 1382 993 -1670 309 1559 -966 -620 1037 -265 -673 1004 -28 -1296 1079 812 -1754 -91
4168i1K019l014j63K635j222j731K123O6j686J383M98k533J465J883k744n33L275
$$ -91 1928 -1086 -1249 1386 164 -1567 556 622 -1064 319 817 -1716 -251 1632 -1112 -1645 1630
4185A630j270k666K721O62k702J170J379k102L45J871k129n28K860j149k789K978
$$ 1630 360 -2306 415 1077 -1625 -455 924 -1178 -833 1038 -1091 -1619 1241 92 -2697 281
4201B81J044l058N34K794k071j057K378o75j653K001J16k385K049J194l300O05
$$ 281 1325 -1733 -1199 1595 -476 -1533 845 170 -1483 518 634 -1751 298 1492 -1808 -1203
4217a203L198k025j843K636N9k376J408Q47k000J096J484k560J52K919k159j870
$$ -1203 1995 -30 -1873 763 822 -1554 -146 701 -1299 -203 1281 -1279 -1127 1792 -367 -2237
4233b237L254J75l136J546J968k541N0K202j654o62K431j442j717K881L85l385
$$ -2237 1017 1192 -1944 -398 1570 -971 -921 1281 -373 -1035 1396 -46 -1763 1118 1503 -1882
4249a882J594K318k608p58K898r09k097K509j91j962J860P82k912J245K464k764
$$ -1882 -288 2030 -578 -1336 1562 653 -1444 1065 874 -1088 772 1554 -1358 -113 2351 -413
4265d13j032L459p98k854K234J215k878J052J702k376J76K407k077j207L154o51
$$ -413 -1445 2014 1216 -1638 596 1811 -1067 -15 1687 -689 -513 1894 -183 -1390 1764 1113
4281A113k851K239J547l172M36K514k000o36K361j326j438K645m08k672K332J515
$$ 1113 -1738 501 2048 -1124 -688 1826 -174 -810 1551 225 -1213 1432 1024 -1648 684 2199
4297B199l368J96L363k027k031L079l39k438K130N90k693J520J966l020j91L347
$$ 2199 -1169 -973 2390 363 -1668 1411 1072 -1366 764 1354 -1339 181 2147 -873 -1064 2283
4313B283j866k477L209N89l255J435J750k581L74K215k266l80K782j613k188L100
$$ 2283 417 -2060 1149 1738 -1517 -82 1668 -913 -539 1676 -590 -970 1812 199 -1989 1111
4329A111O79l717J368K747k940m17K841j689j261K357m21k645K626Q20l485J338
$$ 1111 1790 -1927 -559 2188 -752 -1169 1672 -17 -1278 1079 658 -1987 639 1459 -2026 -688
4345f88K954l240j175L833j095k699K723O17l116J865J222l008P91L005l062j387
$$ -688 2266 -974 -2149 1684 589 -2110 613 1230 -1886 -21 1201 -1807 -1016 1989 -1073 -2460
4361b460M036q19l606L067J274l631J250K361k535m29L049k031j882L714l98l900
$$ -2460 1576 757 -2849 218 1492 -2139 -889 1472 -1063 -1492 1557 -474 -2356 1358 960 -2940
4377b940K954K282m374L87L832k595j678L350r57k456L090K03l563K320K189l791
$$ -2940 14 2296 -2078 -1691 2141 -454 -2132 1218 261 -2195 895 1098 -2465 -145 2044 -1747
4393a747k49M542k828k609M377m09l468K498J677l817J489K791l648n03M402k407
$$ -1747 -1996 2546 -282 -2891 1486 1077 -2391 107 1784 -2033 -544 2247 -1401 -1904 2498 91
4409I1l179M523N68m774K270L083l730l25L695k682j605M205j266l641L889J205
$$ 91 -3088 1435 2003 -2771 -501 2582 -1148 -1473 2222 -460 -2065 2140 874 -2767 1122 2327
4425B327m871J867L835m298r36M600k049k921L965j6l660K712K077m684J082M391
$$ 2327 -2544 -677 3158 -1140 -2076 2524 475 -2446 1519 1503 -2157 555 2632 -2052 -970 3421
4441C421m073j814N208j361l872L571J426m200J727K841m058M1M274l183k385
$$ 3421 -652 -2466 2742 1381 -2491 1080 2506 -1694 33 2874 -1184 -1143 3131 -52 -2437
4456b437N120p94m753L775K391n094R15M190l724j306M339j862l120M493Nn142
$$ -2437 2683 1889 -2864 911 3302 -1792 -877 3313 -411 -1717 2622 760 -2360 2133 2138 -3004
4472c004L415L270n429k3N423l234l266N118m16m502L554J642m918J975L898m806
$$ -3004 411 3681 -1748 -1771 3652 418 -2848 2270 1854 -2648 906 2548 -2370 -395 3503 -1303
4488a303q73N407k433m107N143N80n155K663L102m535J56M355l762j695N272j918
$$ -1303 -2176 3231 798 -3309 1834 2414 -2741 -78 3024 -1511 -1355 3000 -762 -2457 2815 897
4504H97m174M564J394n646K081M175m656j187N314k425l358M578l53m441L732
$$ 897 -3277 1287 2681 -2965 -884 3291 -1365 -2552 2762 337 -3021 1557 1204 -3237 495
4519D95K298n567J074N232m453k396N821j428m623M147J538m977K273L372n057
$$ 495 2793 -2774 -1700 3532 -921 -3317 2504 1076 -3547 600 2138 -2839 -566 2806 -2251
4534b251L92N017l794k971O038p04n542L823K976n464P05M638m038j286M963k233
$$ -2251 -1859 3158 -636 -3607 2431 1727 -3815 8 2984 -2480 -1775 2863 -1175 -2461 2502 269
4550B69l835M949N83n543K936L968n421m32N464l033l090M994q49m021L753J520
$$ 269 -3566 1383 1966 -3577 -641 3327 -2094 -2526 2938 -95 -3185 1809 960 -3061 692 2212
4566B212n137K029M114m799j063N615k580m074N049P22n040K818K620m570P65
$$ 2212 -2925 -896 3218 -1581 -2644 2971 391 -3683 1366 2088 -2952 -134 2486 -2084 -1319
4581a319M341l979j852N640j836m527M620J852n803J690M356m355r79M703k429
$$ -1319 3022 -957 -2809 2831 995 -3532 1088 2940 -2863 -1173 3183 -1172 -2151 2552 123
4596A23k745M455l76m620L568K477n513R20N125l981k307N226j294l890L990J007
$$ 123 -2622 1833 1457 -3163 405 2882 -2631 -1711 3414 -567 -2874 2352 1058 -2832 1158 2165
4612B165m754K544K984m685j2N115l295k900N247l06m956L454K309m514J107L550
$$ 2165 -2589 -45 2939 -1746 -1758 3357 62 -2838 2409 2103 -2853 601 2910 -1604 -497 3053
4628C053l904o78M408k372l116M672M27n132K846L336m765j68M245k813j972M112
$$ 3053 -851 -1529 2879 507 -2609 2063 2490 -2642 204 3540 -1225 -1393 2852 39 -1933 2179
4644B179j090l624L815J194m941K094L941m698r61N056k099l625M205O10m041
$$ 2179 1089 -2535 1280 2474 -2467 -373 3568 -1130 -2091 2965 866 -2759 1446 2056 -1985
4659a985K251K199l980O92L975l854j519M777j480l936L950J179m261J344L164
$$ -1985 266 2465 -1515 -823 3152 -702 -2221 2556 1076 -2860 1090 2269 -1992 -648 2516
4674B516l497n18L657k364j958L990o95m252L734J982m774Q30M092l387j790M063
$$ 2516 -981 -1499 2158 -206 -2164 1826 1131 -3121 613 2595 -2179 -1349 2743 -644 -2434 1629
4690A629j259k808L352M92l925K415K577m616L10M481l146k330M271r9l913K550
$$ 1629 370 -2438 914 1406 -2519 -104 2473 -2143 -1833 2648 -498 -2828 1443 1344 -2569 -19
4706a9J965m129J389K980l752n03M414k378k993M411K34m659K287L168l859l46
$$ -19 1946 -2183 -794 2186 -1566 -2069 2345 -33 -3026 1385 1619 -3040 -753 2415 -1444 -1790
4722a790L728k455j733L859j210l187L618Q81m323J762L411l792r91M273j616
$$ -1790 1938 -517 -2250 1609 399 -2788 830 1711 -2612 -850 2561 -1231 -2222 2051 435
4737D35l032L686P4l548K735J715m194J203L683l870j322M684j338l979L790J279
$$ 435 -2597 1089 1163 -2385 350 2065 -2129 -926 2757 -1113 -2435 2249 911 -3068 722 2001
4753B001m176J630K782l642o5L799k974j765M201m29m268L221K260m562N36L985
$$ 2001 -2175 -545 2237 -1405 -1470 2329 -645 -2410 1791 1362 -2906 315 2575 -1987 -1451 2534
4769B534k950j591L887j445k697L422N34m264K626K530m185%M292k684k544M242
$$ 2534 -416 -2007 1880 435 -2262 1160 1694 -2570 56 2586 -1599 -1599 2693 9 -2535 1707
4785A707k68l876L055J430m010J601L076l922n76M488k218l206M208Q50m677K254
$$ 1707 1439 -2437 618 2048 -1962 -361 2715 -1207 -1783 2705 487 -2719 1489 2339 -2338 -84
4801h4K575l636J3L557k660j392M096j528l272L643J255m575J609L601l637j242
$$ -84 2491 -1145 -1132 2425 -235 -1627 2469 941 -2331 1312 2567 -2008 -399 3202 -435 -1677
4817a677M353j955k746L808j67l672K839K110m650R06M402l826k079M948j023
$$ -1677 2676 721 -2025 1783 1616 -2056 783 2893 -1757 -851 3551 -275 -2354 2594 1571
4832A571l842L154J438m145J685K681l679k09M117k841k263M296j57m446K844
$$ 1571 -2271 883 2321 -1824 -139 2542 -1137 -1346 2771 -70 -2333 1963 1806 -2640 204
4847B04K626m583N99L721l115j395M021j490k939L606N58m528K353L299m615m03
$$ 204 2830 -1753 -1154 2567 -548 -1943 2078 588 -2351 1255 1813 -2715 -362 2937 -1678 -2081
4863b081M801k704k747M001n7l734K821J684m175J226L642m054j236M964j789
$$ -2081 2720 16 -2731 1270 1213 -2521 300 1984 -2191 -965 2677 -1377 -2613 2351 562
4878E62l653L805R64m255J860K732l670J93L665k843k090M371r29m097L755K028
$$ 562 -3091 714 1678 -2577 -717 2015 -1655 -1462 2203 -640 -2730 1641 712 -3385 370 2398
4894B398n042J103L888l314j420M049j321k981L733J54l845K556K393m439O02
$$ 2398 -2644 -1541 2347 -967 -2387 1662 341 -2640 1093 1247 -2598 -42 2351 -2088 -1486
4909a486M215l362j891M191o99l569K914J390l982J724K602l494m07M327k522
$$ -1486 2729 -633 -2524 1667 968 -2601 313 1703 -2279 -555 2047 -1447 -1854 2473 -49
4924d9k859M382J39m370K602K294l817K64L557k880j166L752j383l048L710R00
$$ -49 -2908 1474 1613 -2757 -155 2139 -1678 -1414 2143 -737 -1903 1849 466 -2582 1128 2028
4940B028m461J962K992l673o89L952j795k396L344o0l100K316J545l728J203L034
$$ 2028 -2433 -471 2521 -1152 -1841 2111 316 -2080 1264 1204 -1896 420 1965 -1763 -560 2474
4956B474l186j173L989j113l345L288R05l570J530K166l173J43L178k378j697
$$ 2474 -712 -1885 2104 991 -2354 934 1839 -1731 -201 1965 -1208 -1065 2113 -265 -1962
4971a962L723o92l284K502J951l758O84L032k567j046L351j479k178L187k00l109
$$ -1962 1761 1069 -2215 287 2238 -1520 -836 2196 -371 -1417 1934 455 -1723 1464 1264 -1845
4987a845K363J742l501L29L475k223k023L318k98k944K367R31k755J198K131k990
$$ -1845 518 2260 -1241 -912 2563 340 -1683 1635 1337 -1607 760 1691 -1064 134 2265 -725
5003g25k88L344j903k190K864M62l237J803J643k394RK269j792q69K687j171k143
$$ -725 -1013 2331 428 -1762 1102 1564 -1673 130 1773 -621 -612 1657 -135 -1004 1683 512 -1631
5020a631K540O09l232J582J927k422n96K811j452j275K128k00k209K078O46k682
$$ -1631 909 1518 -1714 -132 1795 -627 -1223 1588 136 -1139 989 789 -1420 658 1304 -1378
5036a378R85K321k483r87K965p01k392J985N63k204J090J218k160L14K180j762
$$ -1378 -393 1928 -555 -1542 1423 722 -1670 315 878 -1326 -236 982 -1178 -864 1316 -446
5052d46j215K541l77k299J690J215k344M28J780j697l51J838q63j283K024j91
$$ -446 -1661 880 503 -1796 -106 1109 -1235 -807 973 -724 -1075 763 -100 -1383 641 450
5068D50k206J416J606k515N1K321j193j378J807m6j466J319M42j805Q15J486j944
$$ 450 -1756 -340 1266 -1249 -1198 1123 -70 -1448 359 313 -1153 166 608 -1197 -382 1104 -840
5085h40k71K257j216j569J955K51j952J062J080j578J17J443j230m49J923q51
$$ -840 -1111 1146 -70 -1639 316 567 -1385 -323 757 -821 -704 739 -491 -940 983 132
5101A32j724J911P93k466P36J591j384o31J810n97j186J561k11j369J301P10j914
$$ 132 -1592 319 1112 -1354 -618 973 -411 -1042 768 171 -1015 546 335 -1034 267 977 -937
5118i37L27J954j525j048K131k80j481J121L93j257O92Q72j588M29J536j478q56
$$ -937 -610 1344 -181 -1229 902 622 -859 262 655 -602 90 962 -626 -197 1339 -139 -995
5135i95J829m9j592J057R77j635K35R74r39k88J483r08r28J620L3j962J122J246
$$ -995 834 785 -807 250 1227 -408 -173 801 -138 -426 1057 149 -779 841 874 -1088 34 1280
5153A280j619k26J600m63j143J369j70j010Q27M84j548P76J378j821l74J841k62
$$ 1280 -339 -565 1035 572 -571 798 628 -382 445 929 -619 157 1535 -286 -660 1181 919
5170I19j870J380P28j489J83J289j341k81J554j016p78J798m28j693J418R70k017
$$ 919 -951 429 1157 -332 -149 1140 -201 -482 1072 56 -722 1076 648 -1045 373 1343 -674
5187f74K95J591j014p59J408l78j006J364j70j442J095R76k072R2J966j033j176
$$ -674 -379 1212 198 -561 847 469 -537 827 657 -785 310 1286 -786 -694 1272 239 -937
5204i37J287M65j642Q80M81j311N75J315j641m32K067r52j609J845N94k210O30
$$ -937 350 815 -827 53 534 -777 -202 1113 -528 -960 1107 155 -1454 391 985 -1225 -595
5221e95J500j381k64J273o55r48J548k64j703J584P05k058M61J840j314j141J968
$$ -595 905 -476 -740 533 -122 -1070 478 214 -1489 95 800 -1258 -797 1043 -271 -1412 556
5238E56j54j733J291L91j477N59J166j652K16K019j477j246K212p6k116J138J142
$$ 556 402 -1331 -40 351 -1126 -567 599 -1053 -837 1182 -295 -1541 671 595 -1521 -383 759
5255G59j774M62J203j234l49J509o66j525K053L38k257Q74J830j884n79K135r14
$$ 759 -1015 -553 650 -584 -933 576 -90 -1615 438 776 -1481 -607 1223 -661 -1240 895 -19
5272a9j212J717j85j503J368P14k175O10K001j760j021K603n89k035J489P43j961
$$ -19 -1231 486 301 -1202 166 880 -1295 -685 1316 -444 -1465 1138 549 -1486 3 746 -1215
5289a215Q88J133j554M8J759j504j025K346j82k385J580J466k026o3J889j117
$$ -1215 -327 806 -748 -700 1059 -445 -1470 876 694 -1691 -111 1355 -671 -734 1155 38
5305C8r81J979o99j337J861R2k287J591J587k442l05K256q85j550J813J16j596
$$ 38 -943 1036 337 -1000 861 953 -1334 257 1844 -598 -903 1353 468 -1082 731 847 -749
5322g49J196O95j992Q50J697k019n84K574r96k171K134R76k451O88J497j834k04
$$ -749 447 1142 -850 0 1697 -322 -906 1668 672 -1499 635 1611 -840 -152 1345 -489 -693
5339f93J992j242j214K254l40k230J907J296k691L21K311j536j225K124m71j598
$$ -693 1299 57 -1157 1097 757 -1473 434 1730 -961 -640 1671 135 -1090 1034 563 -1035
5355a035J804K81k014J383J095k165j04K335j318j457K084J89k116J001J298j911
$$ -1035 769 1050 -964 419 1514 -651 -755 1580 262 -1195 889 1078 -1038 -37 1261 -650
5371f50M68J631j939l81K230j255j697K425K92k551J032J940k221m30K233j137
$$ -650 -182 1449 -490 -871 1359 104 -1593 832 1124 -1427 -395 1545 -676 -1106 1127 -10
5387a0j120J923l76j836J955P69k804Q83K327k102j104K702o10j988J594O79j998
$$ -10 -1130 793 417 -1419 536 1305 -1499 -616 1711 -391 -1495 1207 597 -1391 203 882 -1116
5404a116J003J309k312M21K167j923j180K718l63k292J501J348k450N56J650j792
$$ -1116 -113 1196 -1116 -695 1472 -451 -1631 1087 724 -1568 -67 1281 -1169 -613 1037 -755
5420g55k16J849j163j452K491k03k386J469J712k555J48K273j475j030J971m83
$$ -755 -971 878 -285 -1737 754 551 -1835 -366 1346 -1209 -1061 1212 -263 -1293 678 195
5436A95j564J657L31k199J438J611k453l48K789j323j694K238N2j902J184J087
$$ 195 -1369 288 619 -1580 -142 1469 -984 -1332 1457 134 -1560 678 730 -1172 12 1099
5452A099j904L12J758j877o19K454p85k247K384P02k882Q31K048j842l98J981
$$ 1099 -805 -493 1265 -612 -1231 1223 438 -1809 575 1277 -1605 -774 1274 -568 -966 1015
5468A015j155j168K229k62k236J954J098k692P15K078j964o48K331p86j449J792
$$ 1015 -140 -1308 921 659 -1577 377 1475 -1217 -502 1576 -388 -1036 1295 509 -940 852
5484H52K35j992J430J193k448L33K405j910j418K745l34k304J733R99k396P76
$$ 852 1087 -905 525 1718 -730 -397 2008 98 -1320 1425 1091 -1213 520 1519 -877 -101
5500a01J700k068mK258j838j518L117m20k619J774J531k550m8K545j759r06K374
$$ -101 1599 -469 -473 1785 -53 -1571 1546 1126 -1493 281 1812 -738 -786 1759 0 -906 1468
5517A468j095j542K260L50k841J865J871l212r6K893j488j600K309L4k122J711
$$ 1468 373 -1169 1091 1441 -1400 465 2336 -876 -972 1921 433 -1167 1142 1176 -946 765
5533G65Q00k576J006K011k672k88L032j637k010K471O05k735J406J387k394L47
$$ 765 1565 -1011 -5 2006 -666 -954 2078 441 -1569 902 1507 -1228 178 1565 -829 -482
5549d82J999k060p12L123j528k257K790O04l190J500K128k671m73K622j361j526
$$ -482 1517 -543 -1255 1868 340 -1917 873 1477 -1713 -213 1915 -756 -1229 1393 32 -1494
5565a494K835o17k569K439J156l387R65K730k717q32K990j028k206K349L21k640
$$ -1494 1341 724 -1845 594 1750 -1637 -672 2058 -659 -1491 1499 471 -1735 614 935 -1705
5581a705J785J430l128O34K885k703j242L418o41k901K432J321l467J193K173
$$ -1705 80 1510 -1618 -984 1901 -802 -2044 1374 733 -2168 264 1585 -1882 -689 1484
5596A484k771p7K942j867j876L462n00l227K695J564l316L01L069k268j356L306
$$ 1484 -1287 -1364 1578 -289 -2165 1297 797 -2430 265 1829 -1487 -1186 1883 -385 -1741 1565
5612A565j301k201L135j85l210K202J975l426OL590k393j990L424m48l132K764
$$ 1565 264 -1937 1198 1013 -2197 5 1980 -1446 -1440 2150 -243 -2233 1191 743 -2389 375
5628C75J125l412J431K455l351m11L619j817k425L308N48l683K036K072l516Q11
$$ 375 1500 -1912 -481 1974 -1377 -1788 1831 14 -2411 897 1445 -2238 -202 1870 -1646 -835
5644h35K709k750o82L243j361k732L441O86l922J946K634l424l33L465k006j903
$$ -835 1874 -876 -1558 1685 324 -2408 1033 1719 -2203 -257 2377 -1047 -1380 2085 79 -1824
5660a824L472q12k934K972J127l947J443L038l328r52L997j583k702L331J69l451
$$ -1824 1648 836 -2098 874 2001 -1946 -503 2535 -793 -1745 2252 669 -2033 1298 1467 -1984
5676a984K417J781l488O96L125k841j479M072j290l499L373J299l783J248K700
$$ -1984 433 2214 -1274 -578 2547 -294 -1773 2299 1009 -2490 883 2182 -1601 -353 2347
5691B347l146j67L219k188j760L551n83l386K713J708l839O08L315k780j189L525
$$ 2347 -799 -966 2253 65 -1695 1856 1273 -2113 600 2308 -1531 -923 2392 -388 -1577 1948
5707A948j500k215L173J10l398K152K046l725L83L693k747k031L875n80l237K751
$$ 1948 448 -1767 1406 1516 -1882 270 2316 -1409 -1026 2667 -80 -2111 1764 1184 -2053 698
5723F98J057l340J425K459l432K9L534k442k028L545O7l709K356J722l359N02
$$ 698 1755 -1585 -160 2299 -1133 -1104 2430 -12 -2040 1505 1572 -2137 219 1941 -1418 -916
5739i16K761k437r87L338j581k436L464L50l845J821K569l433l28L468j973j860
$$ -916 1845 -592 -1579 1759 178 -2258 1206 1556 -2289 -468 2101 -1332 -1660 1808 -165 -2025
5755b025L347r08k387K570O75l287J376K735l405o26L815j630k392L090K72l155
$$ -2025 1322 414 -1973 597 1272 -2015 -639 2096 -1309 -1935 1880 250 -2142 948 1220 -1935
5771a935K080J290k961Q90K647l189m56L538j704k592L117P06l408J612K010k731
$$ -1935 145 1435 -1526 -636 2011 -1178 -1634 1904 200 -2392 725 1431 -1977 -365 1645 -1086
5787a086PK662k005j282L224j119k690K849J144l374R88K835k714p41K660j116
$$ -1086 -1079 1583 -422 -1704 1520 401 -2289 560 1704 -1670 -682 2153 -561 -1302 1358 242
5803B42j885K530j56k455K225J099l136Q62K922k842j089L328j124k287K510K79
$$ 242 -1643 887 731 -1724 501 1600 -1536 -674 2248 -594 -1683 1645 521 -1766 744 1023
5819A023k592J521J308k596N96K588k513j033L227r11k623K543Q95k935J108J960
$$ 1023 -1569 -48 1260 -1336 -740 1848 -665 -1698 1529 618 -2005 538 1433 -1502 -394 1566
5835A566k371k25K592j689j365K960n84k744K411J395l240P12K525k040q21K512
$$ 1566 -805 -1030 1562 -127 -1492 1468 884 -1860 551 1946 -1294 -582 1943 -97 -918 1594
5851A594j010j687K235Jk715K137J631l289N30K715k136j190K695o20k031K033
$$ 1594 584 -1103 1132 1133 -1582 555 2186 -1103 -573 2142 6 -1184 1511 891 -1140 893
5867H93L45k399J666J246k732M30K516k348j091L052m66k615J919R63k175N55
$$ 893 1238 -1161 505 1751 -981 -551 1965 -383 -1474 1578 1112 -1503 416 1379 -796 -241
5883b41J898k329K34K240j914j387K807o5k958K197J337k752L62K315j887p71
$$ -241 1657 -672 -438 1802 -112 -1499 1308 1243 -1715 482 1819 -933 -571 1744 -143 -914
5899i14K434j274j600K596j81k794J843J772k813j03K790k009j248K304k05j907
$$ -914 1520 246 -1354 1242 1061 -1733 110 1882 -931 -1034 1756 -253 -1501 803 598 -1309
5915a309J660N63k337J342J517k720R4K837j753j678K574Kk385J565J095k281
$$ -1309 351 914 -1423 -81 1436 -1284 -1190 1647 -106 -1784 790 792 -1593 -28 1067 -1214
5931a214N71J951k203l46K869j677j897K765L38l050J460K163k851K2K282j671
$$ -1214 -643 1308 -895 -1241 1628 -49 -1946 819 1157 -1893 -433 1730 -1121 -1099 1183 -488
5947d88r54K493r88j990K597J96k862J326K182k636n20K658j071j831K488l35
$$ -488 -1442 1051 63 -1927 670 866 -1996 -670 1512 -1124 -1644 1014 -57 -1888 600 265
5963B65k006J849Q69k707J050K143k429q18L187j193k140K335O60k445J164J537
$$ 265 -1741 108 977 -1730 -680 1463 -966 -1784 1403 210 -1930 405 1065 -1380 -216 1321
5979A321k301M56K071k111q27K985j058k458K385R57k842R11K066k080m71K206
$$ 1321 -980 -524 1547 -564 -1391 1594 536 -1922 463 1420 -1422 -511 1555 -525 -996 1210
5995A210j499r62K613r12k231K107J214l028M92K698j959j308K804r14j622K096
$$ 1210 -289 -1251 1362 450 -1781 326 1540 -1488 -996 1702 -257 -1565 1239 325 -1297 799
6011G99J18k215J519J269k699M03K728j964j525K853k71k366J843Q18k131P71
$$ 799 917 -1298 221 1490 -1209 -806 1922 -42 -1567 1286 1015 -1351 492 1310 -821 -50
6027e0J491j901k75K361j805j326K836j21k685J690J454k521J33K279j739n12
$$ -50 1441 -460 -735 1626 -179 -1505 1331 1210 -1475 215 1669 -852 -719 1560 -179 -691
6043f91J909j284j388K533j63k520J876J404k615l5K580j372j504K226n14j465
$$ -691 1218 -66 -1454 1079 916 -1604 272 1676 -939 -974 1606 234 -1270 956 442 -1023
6059a023J680K95k239J289J761k622j60K990j844j674K359L38k186J118J203j993
$$ -1023 657 952 -1287 2 1763 -859 -1019 1971 127 -1547 812 1150 -1036 82 1285 -708
6075g08N55J511k167j51K554j357j970K412M46k439J151J383j850k9J720j475
$$ -708 -153 1358 -809 -960 1594 237 -1733 679 1125 -1314 -163 1220 -630 -659 1061 -414
6091d14n82K046r59j708K430K25k629J238J819k200n09K347j147j179J802k81
$$ -414 -996 1050 91 -1617 813 1038 -1591 -353 1466 -734 -1243 1104 -43 -1222 580 299
6107B99j543J642P59k651P88K346k527n67K765r86j886J945L39k033J365O82j999
$$ 299 -1244 398 1157 -1494 -706 1640 -887 -1454 1311 325 -1561 384 723 -1310 55 737 -1262
6124a262P77J862k172p86K865r81k194K110Q12k327O94J345j530r5J530j163q17
$$ -1262 -485 1377 -795 -1581 1284 303 -1891 219 1031 -1296 -602 743 -787 -882 648 -515 -1332
6141a332K217p06k098K241R53k804O51K214j710q70K006p75j195J837j87k096
$$ -1332 885 179 -1919 322 1275 -1529 -878 1336 -374 -1244 762 -13 -1208 629 442 -1654
6157a654K046R85k890Q89K295j965j047K553o49j861J734L06j747J124R35k156
$$ -1654 392 1377 -1513 -624 1671 -294 -1341 1212 563 -1298 436 742 -1005 119 1054 -1102
6173a102O65K191k118r02K603m59k294J745R94k034N71J379j498l19J896j201
$$ -1102 -437 1754 -364 -1266 1337 878 -1416 329 1323 -711 -140 1239 -259 -578 1318 117
6189A17j378K490k31k464J664J441k509K36J991j293q84J830p61j202K030k43
$$ 117 -1261 1229 998 -1466 198 1639 -870 -634 1357 64 -820 1010 249 -953 1077 834
6205H34k212J562J550k631K4K537j379j464K161k91j745J546P42k319J165J769
$$ 834 -1378 184 1734 -897 -873 1664 285 -1179 982 691 -1054 492 1234 -1085 80 1849
6221A849k467k88K439j183j917K492L66k434J160J344j918l8J808j724k74K111
$$ 1849 -618 -906 1533 350 -1567 925 1291 -1143 17 1361 -557 -595 1213 -511 -785 1326
6237A326r46j755K034M40k467J058J874k057m17J955j041q22J673m50j693J989
$$ 1326 380 -1375 659 1099 -1368 -310 1564 -493 -910 1045 4 -818 855 405 -1288 701
6253G01M63k462J088J875k224p74K540p76j569J696K77j798J275N79j862N60J805
$$ 701 1164 -1298 -210 1665 -559 -1333 1207 431 -1138 558 835 -963 312 891 -971 -411 1394
6270A394j959r00K594o76k035J726R91k161M67J535j527j44J643j486n53K043
$$ 1394 -565 -1465 1129 453 -1582 144 1135 -1026 -559 976 -551 -695 948 -538 -1091 952
6286I52n45k171J712J255k433L45J856j273q78J791o68j098J534j9j686J370R41
$$ 952 407 -1764 -52 1203 -1230 -885 971 -302 -1180 611 -57 -1155 379 360 -1326 44 985
6303I85k222K63K056j307j300J987K2j675J161O11j501N92R04j451KJ724j088
$$ 985 -1237 -974 1082 -225 -1525 462 484 -1191 -30 581 -920 -328 576 -875 -873 851 -237
6320b37j024J454L56j880Q98J252j546J61J065r49l41J392q57r00J635J22j647
$$ -237 -1261 193 549 -1331 -433 819 -727 -566 499 -450 -791 601 -256 -1156 479 601 -1046
6337a046N82J536j403n73J537m87r94J271k39r55J217K68j314L69J320j327q21
$$ -1046 -464 1072 -331 -904 633 146 -848 423 184 -771 446 714 -600 -231 1089 -238 -1059
6354a059J778k74j196Q23N51j099M79N83r59K49P59r15l48J369k48j332R56Q11
$$ -1059 719 445 -751 72 623 -476 3 586 -373 -124 635 -280 -628 741 493 -839 117 928
6372I28j313K2R40l11p13R19m67m84R92l4j279J219N37j317k08J543o54q49P97
$$ 928 -385 -363 577 266 -447 472 5 -479 513 479 -800 419 956 -361 -569 974 320 -529 268
6391B68K85p48M26K89p06K99N38q78j09J316o21j041J101L07j244K25P23l18l17
$$ 268 553 -195 231 520 -186 113 651 -227 -336 980 359 -682 419 726 -518 -293 430 112 -205
6410b05M54k48l59P55m50o04Q80J69p75n6R66k92o21L45K81k30J55K8o08M97K05
$$ -205 249 1 -358 397 -53 -657 223 392 -383 -439 527 235 -386 -41 240 10 165 193 -415 82 287
6431B87p06J40P02k48n52O23K01p54J19M02j89K8o7k68O9O37o26m77O94L25q52
$$ 287 -419 -279 423 175 -377 246 447 -307 -188 214 25 53 -14 -282 -213 424 -202 -679 15 340 -512
6452e12J13O52m8q72M90J39j37m6J44l22M37J12p22J90R45o49p05P02M87o96m6
$$ -512 -399 253 205 -667 -177 -38 -175 -221 -77 -399 38 150 -572 -382 563 -86 -791 -89 398 -298 -344
6473c44L57N7l20L13r7j57N68m15m35N20J66o57mQ44l91n57O54N4m28K67j34l17
$$ -344 13 70 -250 63 -34 -191 377 -38 -473 47 213 -444 -448 396 5 -552 102 156 -272 -5 -139 -456
6495d56K97K96q23K92P38l75p45P02M66r76J52N18l34J06J48k77N0M87l36o57
$$ -456 -159 137 -686 -394 344 -31 -776 -74 392 -584 -432 86 -248 -142 6 -271 -221 266 -70 -727
6515g27J037P6q51J48Q20m47m19N57p7k48J66N6l07N07J3n57J34R15p55o00Q77
$$ -727 310 386 -465 -317 503 56 -363 194 117 -131 35 91 -216 291 304 -253 -119 796 41 -559 318
6536C18K96r03L16M30o05J01L88m95K08L63l94m01Q44N1r62M46Q27j020r6Q41
$$ 318 614 -289 27 457 -148 -47 341 -154 54 417 23 -378 466 517 -445 1 828 -192 -288 553
6556E53k61l38M68k06l48P91o5j107P72O78j141k41J225l16r49P16K42o37M00
$$ 553 292 -46 422 216 -132 659 594 -513 259 937 -204 -445 780 464 -485 231 473 -164 236
6575B36J00o87M84P30j231k39J429k73j332R38O58j167J48R23q52O6P34p83l76
$$ 236 336 -351 133 863 -368 -607 822 549 -783 155 813 -354 -206 717 -135 -69 665 -118 -494
6594d94J222n07r63J136M17j350J93J134n97m25O98k84n57P69k74q74J066N36
$$ -494 728 221 -742 394 811 -539 -346 788 191 -234 464 180 -377 392 118 -756 310 846
6612H46j416R5J397r96q56J379k9j204R87K79j005M41P32j189RJ399q08j095J513
$$ 846 -570 -475 922 -74 -930 449 420 -784 203 482 -523 -82 650 -539 -530 869 61 -1034 479
6631D79J98j573O62R44j138J2R66q06l60J099o47j027J483K17j471N97J310j393
$$ 479 677 -896 -234 710 -428 -416 550 -256 -616 483 -164 -1191 292 509 -962 -365 945 -448
6649d48n92J553m45r92J054J03j217J094M49j668P12J433j404p40J890l40j602
$$ -448 -1040 513 68 -924 130 233 -984 110 559 -1109 -397 1036 -368 -1108 782 442 -1160
6666a160J112P35j373O03Q01j509L74J232j204n70J890n08j645J226J052j953
$$ -1160 -48 687 -686 -83 718 -791 -417 815 -389 -959 931 423 -1222 4 1056 -897
6682h97K62J334j200k13J359p25q03J436j81j463J303J033j997j46J903j034j105
$$ -897 -635 699 -501 -714 645 -80 -883 553 372 -1091 212 1245 -752 -898 1005 -29 -1134
6699a134J694k26j023Q23K65j399J008R52j690K1J914j142j245J951L40j942Q44
$$ -1134 560 334 -689 134 399 -1000 8 960 -730 -709 1205 63 -1182 769 1109 -833 11
6716A1R75j487J69J233j137l41J796j013j330J926L25k242P21J761j567m80J664
$$ 11 986 -501 -332 901 -236 -577 1219 206 -1124 802 1127 -1115 -394 1367 -200 -680 984
6733I84p20j128J655k87j499J590O09k018M74J819j662q26J948l42j780J543M83
$$ 984 264 -864 791 504 -995 595 1204 -814 -340 1479 -183 -1009 939 597 -1183 360 843
6750H43j453P18R70j692K71J749j654r61K282j18k241J398J245j927J87J415j032
$$ 843 -610 108 1078 -614 -343 1406 -248 -1209 1073 955 -1286 112 1357 -570 -383 1032 0
6767@n70J594q56j329J930J30k045J095J504k135k08J974r72j061J788m29j373
$$ 0 -570 1024 168 -1161 769 899 -1146 -51 1453 -682 -890 1084 112 -949 839 410 -963
6784i63J658K23k017J036J468k151k37K368j185j468J973L43j915Q32Q75j440
$$ -963 695 918 -1099 -63 1405 -746 -983 1385 200 -1268 705 1048 -867 -35 840 -600
6800f00K28J321j353p92K462r73j845J931O86k144P47J439j568k82J642j106q57
$$ -600 -372 949 -404 -1196 1266 293 -1552 379 1065 -1079 -332 1107 -461 -743 899 -207 -1064
6817a064J860m83j829J735Q15k236O17J738j442r64J976l14j525J420P2j489J189
$$ -1064 796 313 -1516 219 1034 -1202 -585 1153 -289 -1253 723 409 -1116 304 376 -1113 76
6834G6Q66j873J73K118j468j297K275r7k025J294R36j768M22J380j679q8K013
$$ 76 942 -931 -758 1360 -108 -1405 870 773 -1252 42 978 -790 -368 1012 -667 -755 1258
6851A258j270j334K370k86k195J212J449k020Q5J792j214p50J768o74j381J981
$$ 1258 -12 -1346 1024 738 -1457 -245 1204 -816 -731 1061 -153 -903 865 191 -1190 791
6867G91R9k118J052J655k138m49K262r74j247J671P9j605J199O59j970Q29J522
$$ 791 890 -1228 -176 1479 -659 -1108 1154 180 -1067 604 683 -922 277 936 -1034 -205 1317
6884A317j787l51K133q74j930K062N79k004R66P59j293J39J442j513n42K114q31
$$ 1317 -470 -821 1312 438 -1492 570 1149 -855 111 870 -423 -284 1158 -355 -897 1217 386
6901C86j640J864M53k119Q13J608j641m78J899j031j035J766k92j647J682P05
$$ 386 -1254 610 1063 -1056 -243 1365 -276 -754 1145 114 -921 845 553 -1094 588 1293
6917A293k409P02J947j697r26K069j42j873J620L58j826J079R64j840L93J780
$$ 1293 -1116 -414 1533 -164 -1090 979 837 -1036 584 942 -884 195 1159 -681 -288 1492
6933A492j571j085K313k77j924J206R53j780L33J356j284k48J763j162j128K215
$$ 1492 -79 -1164 1149 872 -1052 154 1107 -673 -340 1016 -268 -516 1247 85 -1043 1172
6949A172l73k084J542J224k223K71J524j146o88J616p58j106J566K33k192J386
$$ 1172 799 -1285 257 1481 -742 -471 1053 -93 -781 835 77 -1029 537 770 -1422 -36
6965c6J442k046l63K391j359j331K057n2j765J361L34j476O97J257j744l21K123
$$ -36 1406 -640 -1003 1388 29 -1302 755 703 -1062 299 633 -843 -146 1111 -633 -954 1169
6982A169j013j649K021L17k117R68J005j408N2J539j376n24J698o40j640K077
$$ 1169 156 -1493 528 845 -1272 -304 701 -707 -655 884 -492 -1016 682 42 -1598 479
6998D79M40k150P87J658j752k89J605r76p02J487k98j489J528O75k006M76J837
$$ 479 919 -1231 -444 1214 -538 -827 778 -198 -900 587 289 -1200 328 1003 -1003 -527 1310
7015A310j686r40K298p22j489J593J99j575Q91R73j621K32J582j305q43J843k10
$$ 1310 -376 -1316 982 260 -1229 364 563 -1012 -121 852 -769 -537 1045 -260 -1103 740 530
7032E30j910J696N27j772N99J176j244j87J381q37r91J806r5j966J396J243k115
$$ 530 -1380 316 843 -929 -330 846 -398 -585 796 -41 -1032 774 679 -1287 109 1352 -763
7049g63L1J669j052p32J641l93j318J446K21j599J004Q88j749l6J856r38j284
$$ -763 -732 937 -115 -847 794 401 -917 529 750 -849 155 1043 -706 -742 1114 176 -1108
7066a108J695L7j334Q73M70j186L91J201j619k78K022r09j389J780K75j796O79
$$ -1108 587 624 -710 163 633 -553 -162 1039 -580 -858 1164 255 -1134 646 921 -875 -196
7083a96J098j253k6J219r56m56J247k09j392J345O90k094Q04J312j319m22J396
$$ -196 902 -351 -377 842 -114 -570 677 468 -924 421 1111 -983 -179 1133 -186 -608 788
7100G88n19j087J425m8j131P34Q29j694L28J499j300o34J639k13j230R40M28j423
$$ 788 269 -818 607 559 -572 162 991 -703 -375 1124 -176 -810 829 616 -614 326 754 -669
7118f69O37R17j320J6J404r98p92J511j37j656J252O83j163q9J177q46l35J198
$$ -669 -32 885 -435 -419 985 -13 -805 706 569 -1087 165 848 -315 -404 773 -73 -408 790
7136G90o77q99J280J64j505P75R85j364k41J395l99j077J090J48j084P22M07j230
$$ 790 113 -786 494 658 -847 -72 913 -451 -692 703 304 -773 317 465 -619 103 510 -720
7154g20N11J103j364k34J342m92r99J107M09j218N20O27j159K96Q58q34l90J255
$$ -720 -209 894 -470 -704 638 146 -853 254 663 -555 -35 592 -567 -271 587 -247 -637 618
7172F18k62j223R97M77j182K12R77p44n83J016l73l95Q27k83j009Q35N23j090
$$ 618 356 -867 130 607 -575 -363 614 -130 -713 303 -70 -465 362 79 -930 -95 428 -662
7190f62J85R63m49p73R14J16j029P06M44q85L20P69r25K7Q46o24n39Q27J62j091
$$ -662 -477 486 37 -736 178 294 -735 -29 415 -470 -150 619 -306 -279 567 -57 -596 231 393 -698
7210f98N14N80p50J64P44o71k2N16k90n71R13q0q27L25Q10q47l35J025l28o28
$$ -698 -184 396 -354 -190 554 -117 -139 377 87 -484 429 349 -478 -153 657 -190 -525 500 172 -456
7230d56O48J3m67L91K81q23K49R19r83k36J027j11r81Q06O0n56L44K35m92J58
$$ -456 192 205 -262 129 410 -413 -164 755 -228 -464 563 452 -529 277 337 -219 125 360 -132 26
7250B6N10n84j75P14k14m96M36L21o80l3O83m46k41M65r3n59N08J00o17L92O81
$$ 26 536 -48 -223 491 277 -219 217 538 -142 -175 508 62 -179 286 193 -366 142 242 -375 17 698
7271F98r47j06R63n34n92P08N4m80K68J45m22K81M23p62J27P42l49n85O42J73
$$ 698 -249 -355 608 74 -518 190 244 -236 32 177 -245 36 459 -303 -176 566 217 -368 274 447
7291D47p10M33J85m26pL94k65k04N34l29m36O34J67p00K06N40m14m59O73j48l94
$$ 447 -263 170 355 -71 -78 316 51 -153 381 52 -384 250 417 -283 -77 463 49 -410 263 115 -279
7312b79M07J30m86K26L69o04m7O05l49n54P91O5n91K79K51j79QJ44l31K1K80j89
$$ -279 128 258 -228 -2 367 -237 -284 321 -28 -582 209 274 -317 -38 213 34 42 186 -145 -124 156 -33
7334c3k71O04m1p82L58N26n16K0K27j4j89R0p2k95M82K8n03J59M83m55k68O90
$$ -33 -304 300 259 -523 -165 361 -155 -135 92 78 -111 -21 -93 -388 94 122 -381 -222 261 -194 -462 228
7356B28k01n31K31L02l85J88L84n04J75L06n76k9N45j81m33M25K11m88K3M21j99
$$ 228 27 -504 -273 29 -356 -168 216 -288 -113 193 -383 -412 133 -48 -481 -56 155 -333 -310 111 -88
7377h8k80L65l78N7M84O0o03M16J88n66RN10k50l17M51K6k24K24j88l37M72J05
$$ -88 -368 -3 -381 -324 160 220 -383 33 221 -345 -336 174 -76 -393 58 84 -140 84 -104 -441 31 136
7399A36o15L60L59j48n04L36J99k83Q2M26m71M2K25k69j47N37j06m73M81K66o22
$$ 136 -479 -119 240 92 -412 -76 123 -160 -78 348 -123 -81 144 -125 -272 265 159 -314 167 433 -189
7420a89J46P33o29k25L57k6k44K27J14m86L62J91n50P9N90m14o47P43N9k98J09
$$ -189 -43 690 61 -164 193 167 -77 150 264 -222 140 331 -219 -140 450 36 -611 132 191 -107 2
7441BK08m41J68J94k62j86P05k04n04L32K98l89PM89m84o7K35j1j58L31M4o59
$$ 2 210 -231 -63 131 -131 -317 388 184 -320 12 310 -79 -72 417 -67 -134 101 90 -68 263 307 -352
7463c52M71K99o61jQ95m49m86N11j10k93J35J47k62K60K86n21M0N84p40l04R18
$$ -352 119 418 -243 -244 651 202 -284 227 117 -176 -41 106 -156 104 390 -131 -91 493 -247 -551 367
7484C67j14o02K37M63m10j13K55j71j63M26k92k72M52J30n37J78O56n01m23O21
$$ 367 253 -349 -112 351 -59 -172 83 -88 -251 175 -117 -389 63 193 -344 -166 490 -11 -434 187
7504A87j02l54K77N2l93K70K93m45R7M19o17k09O94j67m84N42J57n46J39M90l54
$$ 187 85 -269 8 60 -333 -63 230 -215 -118 301 -316 -525 169 2 -482 60 217 -329 -190 300 -54
7525e4j85M22k31k96N94k35o30N55N39q04j01R05m05m95N07q1l87M78J38n53J05
$$ -54 -239 183 -48 -344 250 15 -615 -60 479 -325 -426 479 74 -421 86 5 -382 96 234 -319 -214
7546b14N53n01k60Q02j98p18N43L87o33J32M29o85J44N35l80m14Q57l03p97P52
$$ -214 339 -162 -422 380 182 -536 7 394 -239 -107 322 -363 -219 316 -64 -478 379 76 -721 31
7566C1N44p13j42O22l84l41O94l76l02O11j45m71K35N29p86O0O49m01l64O31P7
$$ 31 575 -138 -280 342 -42 -383 311 -65 -367 244 99 -372 -137 392 -394 -334 315 -86 -450 181 258
7587B58o40L95K02n84L39O00q95q1R61m83p84J065J57q79M78K97o01K52M34n25
$$ 258 -382 13 215 -369 -30 570 -325 -406 555 72 -712 353 510 -369 109 406 -195 57 491 -34
7607c4n3M54j84n82P48J33o93J33N99n42l99Q52j93m83M82J36o78M67K56p15K55
$$ -34 -87 367 183 -399 349 482 -211 -78 521 -21 -420 432 239 -244 238 374 -304 163 419 -296 -41
7628d1O94p19j94O66qq73N52M34q47K69M86n85J6Q34o07m05P13k26o98M44N85
$$ -41 653 -66 -260 406 398 -475 77 511 -336 -67 419 -166 -150 684 77 -328 385 159 -539 -95 490
7649D90q35K08M18l03k87P15k73m95O89K31j025M76L87p51j46J037m63o02O64
$$ 490 -345 -137 281 -22 -309 406 133 -362 327 558 -467 9 396 -355 -501 536 73 -529 135
7668A35L8n55M81K57r25M68M08o56o1R64k83q14O52J23q19L55N51n39J42O18p43
$$ 135 173 -382 99 356 -569 -101 307 -349 -410 554 271 -543 109 232 -587 -232 319 -220 -78 540 -203
7689b03k17Q15l45o30O62L49r34K00Q31p05j77Q23n16m99Q85j66o85O61R9q31
$$ -203 -420 395 50 -580 82 431 -503 -303 528 -177 -354 469 -47 -546 339 173 -512 149 248 -583
7709e83L88N75m96m63Q32k6q16N75P5l02J18K74o89J11R43q42k32P04K07j216
$$ -583 -195 380 -116 -579 253 227 -589 -14 61 -241 -123 151 -538 -427 516 -326 -558 146 353 -863
7729h63P56M55q06J64O50p11r7R77n24m80Q31k1p44L01N29q12J64N93m97m22R49
$$ -863 -107 348 -458 -294 356 -355 -452 525 1 -479 352 331 -413 -112 417 -395 -231 362 -135 -557 392
7750C92k62m39O97k77n02J40P48r24p1R02k72p47Q87j31m51L35K74q15O06K69
$$ 392 130 -309 388 111 -391 -251 497 -427 -498 404 132 -615 272 141 -310 25 299 -516 90 359
7770C59o86j44R15l38n88P27J06o48K99O01p86K1M78l48k06Q17n23l62M81M43
$$ 359 -327 -471 444 106 -482 245 351 -297 2 603 -183 -162 316 -32 -238 579 56 -306 175 618
7790F18r41J84P10n45m00P04J9o07M88K2o34N51L41q06j8P70n32k60Q10j52p24
$$ 618 -323 -139 571 26 -374 330 349 -258 230 252 -382 169 510 -296 -314 456 -76 -336 474 322 -402
7811d02N03K66o97L84L64p78K04P46n02n80R56j29p77N41L40o03q7O85m47k66
$$ -402 101 367 -330 54 418 -360 -156 590 88 -492 464 335 -442 99 439 -164 -251 434 -13 -279
7831b79Q64k72o23O93q5p39N01O00r44J09N36k96m62O40K8o53O29j35m49K57O10
$$ -279 585 313 -310 383 298 -441 60 660 -284 -175 361 65 -397 243 271 -382 247 112 -337 -80 530
7852E30p43l17J141p71m06P13L9m65J88K49l47m7N04m24k95R54m62m99O20J09
$$ 530 -213 -530 611 -160 -566 147 186 -279 -91 158 -189 -236 268 -156 -451 503 41 -458 162 271
7872B71p04L23N71q17KP08k63l91N62k1n25L42M9n40J45P53l62m41N63j72m84
$$ 271 -433 -110 461 -356 -354 354 91 -300 262 241 -284 58 107 -433 -288 465 103 -338 225 53 -431
7893d31O06K16o62J10N39o19n6O93m19m21N58K3o97N26L50m92L6L98n23M7N61
$$ -431 175 391 -271 -161 378 -241 -297 396 -23 -444 114 137 -560 -34 316 -176 -140 258 -265 -218 343
7914C43l35n12P61On83K06M31n15k7N05l34k22M76rm98M59K31p33J69O06n31k14
$$ 343 8 -504 257 263 -320 -114 317 -198 -225 280 -54 -276 200 191 -307 152 383 -350 -181 425 -106 -320
7936c20O07j24m54N14R5n12K76K83o89K16M79m53l72Q97l05m74M15J71n82L13
$$ -320 287 163 -291 223 318 -194 82 365 -324 -108 371 -82 -454 443 138 -336 79 250 -332 -19
7956a9L20m08p1N95n07j76M88J71q04M89L22o21J46M09k04m70P81k97k72L57J88
$$ -19 301 -107 -178 417 -90 -266 222 393 -411 78 400 -221 -75 334 130 -340 441 144 -128 229 417
7977D17p82L91M39q71L34N95n40k50O02m9n67K95L39m93K71K79o41J24O37m63
$$ 417 -365 26 465 -406 -72 523 -17 -267 335 286 -281 14 353 -140 131 410 -231 -107 530 67
7997F7m64M95K27m66K9N05m39q0M28j58k46M14j58l96L60J66o43M51L18o28M4
$$ 67 -397 98 325 -141 -112 393 -46 -126 302 144 -102 312 154 -242 118 284 -359 92 410 -218 -174
8018a74N54m43j76L52J09m04K30Q9m47K71N46o97k1O41k32m51K11K12m45J93K41
$$ -174 380 -63 -239 113 222 -182 48 137 -310 -39 507 -190 -211 430 198 -253 -42 170 -275 -82 159
8039A59m16J59M79n03j67N16p0m40K78L05n91J80L63m35j12L97j11k93N56j80
$$ 159 -257 -98 381 -122 -289 227 157 -283 -5 300 -291 -111 252 -183 -295 102 -9 -302 254 74
8059G4n81N62J43m93K02L18l03k31O55l17l68L98O4l74L31Rl28P0M46l51k43L25
$$ 74 -507 55 198 -295 -93 225 -78 -309 346 29 -339 59 123 -251 80 89 -239 -169 277 -74 -317 8
8081HJ14m94L23L69m92K29J45m70n4M00k75r8L80k4m73L60L43o18R5O02k71l45
$$ 8 122 -372 -49 320 -172 57 202 -268 -322 78 -197 -295 85 61 -412 -52 291 -327 -232 370 99 -246
8103b46N57k24l88N49k9n28L33M57q36L45M04m75r8L24q8j45K21j8m73M65K29
$$ -246 311 87 -301 248 219 -309 24 481 -355 -10 394 -81 -179 145 57 -88 133 115 -358 107 336
8124C36n70K08L26j71k88L31L0l55K51R1m06K88J68n46P9N06k79l32L34L22n94
$$ 336 -234 -26 300 129 -159 172 202 -153 98 189 -217 71 239 -307 -228 278 -1 -333 1 323 -271
8145b71K82M08m80K4L86k76k76N25j79n12M97O0l94K76L31m93o9N12k32k19M24
$$ -271 11 419 -61 -37 349 73 -203 322 143 -369 128 188 -206 70 401 -92 -161 351 119 -100 324
8166C24j6m83J92K70m54K56J91m01k82N20O4n50M00K27n03K52L90n37J81L44k71
$$ 324 308 -175 17 287 -167 89 280 -121 -403 117 181 -369 31 258 -245 7 397 -140 41 385 114
8187A14l17N07k17l50
$$ 114 -203 304 87 -263
8191b63
$$ Imaginary data points
##PAGE= N=2
##DATA TABLE= (X++(I..I)), XYDATA
0@%%%%%%%%%%Qj6J6j6K4l2M0m9N7o9Q2j01J20j37J59j87K18k52K90l29L74m28
$$ 0 0 0 0 0 0 0 0 0 0 0 8 -8 8 -8 16 -16 24 -25 32 -37 45 -56 64 -73 86 -101 117 -135 155 -174 200 -228
32b28M88n53O19o92P79q74R76j086J205j340J488j644J813k000K206k433K682
$$ -228 260 -293 326 -366 413 -461 515 -571 634 -706 782 -862 951 -1049 1157 -1276 1406
49A406k953L250l581L952m364M823n343N941o633P441q399R556j0991J2823j5242
$$ 1406 -1547 1703 -1878 2074 -2290 2533 -2810 3131 -3502 3939 -4460 5096 -5895 6928 -8314
64h314J8590k3531L1523m6446Q2895l16840l13838J017896l77178o97884P68723
$$ -8314 10276 -13255 18268 -28178 54717 -262123 -575961 441935 64757 -633127 135596
75A35596J56346q30502M46778M60867p66931R5268P30714o27138l22076Q54761
$$ 135596 291942 -538560 -91782 369085 -397846 -302578 428136 -199002 -521078 333683
85C33683k19427p12973O63499K60318p81192K58771N53347o24403p4134O67017
$$ 333683 114256 -598717 64782 325100 -456092 -197321 356026 -268377 -342511 324506
95C24506m22986l78838P32631j12627o94938N82905L50195p99753J59072O81152
$$ 324506 -98480 -477318 255313 142686 -552252 30653 380848 -418905 -259833 421319
105D21319n64062k66847P14416k22696n10885N99743Q4999o62462M08423M20184
$$ 421319 -142743 -409590 304826 82130 -428755 170988 255987 -406475 1948 422132
115D22132p00176M2747O93398m68526l70396O88348p9106n85146M66799K31533
$$ 422132 -278044 -235297 458101 -10425 -380821 307527 228421 -356725 110074 341607
125C41607o07720K21196M49174n64392o6022O38782l67582m24033O37280J8728
$$ 341607 -266113 -44917 404257 -160135 -226157 412625 45043 -378990 258290 277018
135B77018o39878L67404L68264n81456L0791N15750l97432k21013N52982j84074
$$ 277018 -362860 4544 372808 -208648 -177857 337893 -59539 -280552 272430 88356
145H8356m43116M98879J16522n88734K58218M18114n09094p8936N27062k65287
$$ 88356 -354760 144119 260641 -328093 -69875 348239 -160855 -239791 287271 21984
155B1984l08199M64648l9563m21951L63656J67540n02782J83926M05278m54491
$$ 21984 -286215 178433 138870 -283081 80575 248115 -254667 -70741 334537 -119954
165a19954j18066N30357k11057l78378M37135P6613m58780K42401K68162m34252
$$ -119954 -238020 292337 81280 -297098 140037 216650 -242130 271 268433 -165819
175a65819M7061M10132l42952j90747M80834j19082m11272L68879J71387m55926
$$ -165819 -118758 291374 -51578 -242325 238509 119427 -291845 77034 248421 -207505
185b07505J23099L40865l42725p9174L84151k09759k28927L91498m5597l80694
$$ -207505 -84406 256459 -86266 -165440 218711 8952 -219975 171523 125926 -254768
195b54768L09427J95363m35793P8155L79930l05616j61670L92305j09787k87245
$$ -254768 54659 250022 -185771 -107616 272314 -33302 -194972 197333 87546 -199699
205a99699L17116M9592l54450K14782K18425l74536K4617L69200k52326k08116
$$ -199699 117417 167009 -187441 27341 245766 -128770 -104153 265047 12721 -195395
215a95395L66795k8296l19629K30631J32854l08502J01609K21323k77987k2143
$$ -195395 171400 143104 -176525 54106 186960 -121542 -19933 201390 -76597 -98740
225i8740L10399j99483j99482L33260o168l31926K04031J89292l13692K4056K73702
$$ -98740 211659 12176 -187306 145954 139786 -192140 11891 201183 -112509 -88453 185249
236A85249k17906j06476K94153j15024k26074K82367M6063l28614J56739K34815
$$ 185249 -32657 -139133 155020 39996 -186078 96289 142352 -186262 -29523 205292
246B05292k96245n0562L06444j43923j86964K52036j0069k29402J83690Q5874
$$ 205292 -90953 -141515 164929 21006 -165958 86078 76009 -153393 30297 116171
256A16171k61180R8415K06974k45559o1026K83941j16218k06179K34450L8904
$$ 116171 -145009 -46594 160380 -85179 -146205 137736 21518 -184661 49789 88693
266H8693k43717J31238J29814k28560M5495K03855k03819p7775K72686r2425k26864
$$ 88693 -155024 -23786 106028 -122532 -77037 126818 -77001 -154776 117910 25485 -201379
277b01379K31071Q7802k73472Q3252K00448k01078m2894K15712j18504j17388
$$ -201379 29692 117494 -155978 -72726 127722 -73356 -116250 99462 -19042 -136430
287a36430K15337l6150k02626J81369R9319k48929N4513K15936j79710r0639K23035
$$ -136430 78907 42757 -159869 21500 120819 -128110 -73597 142339 -37371 -128010 95025
298I5025o0956j56743J71869K0988j86957J25636J09689k14585K7860K14790j61485
$$ 95025 34069 -122674 49195 70183 -116774 8862 118551 -96034 -68174 146616 -14869
309a4869j21763K34074j8297k06619J42406R6244j88611M6670J41295j53448k3973
$$ -14869 -136632 97442 79145 -127474 14932 111176 -77435 -30765 110530 -42918 -66891
320f6891J81959j08235j21036J98045L81k03474J23230J21038j88898Q226J63482
$$ -66891 115068 6833 -114203 83842 84223 -119251 3979 125017 -63881 -55655 107827
331A07827j20922o2526J63691o6617j22186J65322J5196j94110J09637J37562
$$ 107827 -13095 -75621 88070 21453 -100733 64589 79785 -114325 -4688 132874
341A32874j95946k2329K01342r7067j25147J63916N558j51641J03936O9372j58012
$$ 132874 -63072 -85401 115941 18874 -106273 57643 63201 -88440 15496 84868 -73144
352g3144M6059J37326j45449n1063J84925o0248j46284J42424N0709j57525N2836
$$ -73144 -27085 110241 -35208 -86271 98654 38406 -107878 34546 85255 -72270 -19434
363a9434J01890j19013m233J18893r4411n5806J49128m5538j36288J35198N8931
$$ -19434 82456 -36557 -40790 78103 -16308 -72114 77014 31476 -104812 30386 89317
374H9317j71697M1456J36734j18600n1153J37435m6765r2911J16172M231j26891
$$ 89317 -82380 -40924 95810 -22790 -73943 63492 16727 -76184 39988 44219 -82672
385h2672R1691P6041j49204J5035J45548r8148q1711J39011m976j17461Q0128
$$ -82672 9019 85060 -64144 -49109 96439 -1709 -83420 55591 50615 -66846 13282
396A3282N0047j07740L9215Q0104j07970m240J27142q1667q5063J37948M901j37928
$$ 13282 63329 -44411 -5196 74908 -33062 -37302 89840 8173 -76890 61058 65959 -71969
408g1969P2765Q5064j16271n231J05925p1442m9200J08656l4715r3979J02618
$$ -71969 796 85860 -30411 -35642 70283 -1159 -50359 58297 23582 -70397 32221
419C2221L0710j29232M2769J02310r8166m3528J09602k4725p8558O9980J5249
$$ 32221 62931 -66301 -23532 78778 -19388 -62916 46686 21961 -56597 13383 28632
430B8632p5533N0167L5675q8497K8981Q0490q5627l4259J08866k6471r0121P4692
$$ 28632 -46901 3266 38941 -49556 -20575 59915 -25712 -59971 48895 22424 -67697 6995
442F995L8355q9835K5782O2135p3803l208Q1742o1680m7716J00192j1838j00521
$$ 6995 45350 -44485 -18703 43432 -30371 -33579 48163 -13517 -61233 38959 27121 -73400
454g3400O6189O3239r7369q615Q9167m4293m8667O7619r102n4688N4357J0259
$$ -73400 -7211 56028 -41341 -49956 39211 -5082 -53749 13870 4768 -49920 4437 14696
466A4696o9016L9335N0856p3511j0646Q0792l1302n7215O1519J6050o0150K9837
$$ 14696 -54320 -14985 35871 -37640 -48286 32506 1204 -56011 5508 21558 -38592 -8755
478h755L2867n1618J3758M8868n0526j7682P2106j9340o3790N5484L7251o8911
$$ -8755 24112 -27506 -13748 35120 -15406 -33088 39018 19678 -44112 11372 48623 -20288
490b0288L586N8610l4212k4400M3010j2679k5762L7143n363m0760L5398K4310
$$ -20288 -16702 41908 7696 -16704 26306 13627 -12135 25008 19645 -21115 14283 38593
502C8593n3908K376N1472k9720l1093M0983O21l2017K2267O660k9246K1750K0263
$$ 38593 -15315 -12939 38533 8813 -22280 18703 19324 -12693 9574 16234 -13012 8738 29001
515B9001m2911J226N2377k7070m3197N0314K1394n6293P413M5569k5498k0377
$$ 29001 -13910 -12684 39693 12623 -30574 19740 41134 -15159 -7746 37823 12325 -8052
527h052L1134m230k0754K4115J348l1119K2280K3233m0360m684M1885j5789l0788
$$ -8052 23082 18852 -1902 22213 23561 -7558 14722 37955 -2405 -7089 34796 19007 -11781
540a1781K3221J1743k1466P58P570r779O815O200k3412L321K9371k0706k6209
$$ -11781 11440 23183 1717 2475 10045 266 7081 13281 -10131 -6810 22561 1855 -24354
553b4354L2089J3218l5472k68K9898j0244j7628J6527J867j2560J5129K69k1587
$$ -24354 7735 20953 -14519 -14787 15111 4867 -12761 3766 5633 -6927 8202 8471 -13116
566a3116J9504J9009l2823n080L8521p078l2465J8455K0839k0719n184J4030o251
$$ -13116 6388 25397 -7426 -12506 26015 18937 -13528 4927 25766 5047 -137 13893 7642
579G642K037P415j9918K072K8207j7294k8445K8939J8249l7870n177L5307j1897
$$ 7642 9679 17094 -2824 -752 27455 10161 -18284 10655 28904 -8966 -14143 21164 9267
592I267k4176J9881K836j8139J5290K295k5686J6551K3364l4387j2612M4464n196
$$ 9267 -14909 4972 7808 -10331 4959 7254 -18432 -1881 21483 -12904 -25516 18948 13752
605A3752m2581K2763K8130l0711p031K3908q185n943J2594j3265m841K6791j0823
$$ 13752 -28829 -6066 22064 -8647 -15678 8230 45 -5898 6696 -6569 -11410 15381 4558
618D558k8954K7791J8220l9042J166L4072j9418j5687K3097q834j3409K4580q247
$$ 4558 -24396 3395 21615 -17427 -16261 17811 -1607 -17294 5803 -3031 -16440 8140 -107
631a07k9079K9699J7655m6920K647M8447k6344l4265L8806R371l5301J3071J7037
$$ -107 -29186 513 18168 -28752 -26105 22342 -4002 -38267 539 9910 -25391 -12320 4717
644D717k3085P801J8345k7917l13L8617k2740l0929M3334R706m5700J6385L1635
$$ 4717 -18368 -10567 7778 -20139 -20452 18165 -4575 -35504 7830 17536 -28164 -11779 19856
657A9856k9960m385K7441j9876p594L3337j9063k7783M3559O285n3360K2423M2207
$$ 19856 -10104 -14489 12952 -6924 -14518 18819 -244 -28027 15532 21817 -31543 -9120 33087
670C3087m2601j6419M3182j0612k6476K5235O49k3384K2753O103l5908J9765L1129
$$ 33087 -9514 -25933 17249 6637 -19839 5396 6045 -17339 5414 11517 -24391 -4626 26503
$$ [...]
8191c4
##END NTUPLES=NMR FID
##END=
