##TITLE=1H_SA_AC.II
 CDCl3, 8 sc, 
 3.08.2021
##JCAMPDX= 6.0         $$ Bruker NMR JCAMP-DX V2.0
##DATA TYPE= NMR FID
##DATA CLASS= NTUPLES
##ORIGIN= UXNMR, Bruker Analytische Messtechnik GmbH
##OWNER= root
$$ XWIN-NMR		Version 3.5
$$ Tue Aug  3 09:12:14 2021 Russian Standard Time (UT+4h)  she@DPX200
##.OBSERVE FREQUENCY= 200.131506
##.OBSERVE NUCLEUS= ^1H
##.DELAY= (6, 6)
##.ACQUISITION MODE= SIMULTANEOUS
##.ACQUISITION SCHEME= undefined
##.AVERAGES= 8
##.DIGITISER RES= 18
##SPECTROMETER/DATA SYSTEM= spect
##.PULSE SEQUENCE= zg30
##.SOLVENT NAME= CDCl3
##.SHIFT REFERENCE= (INTERNAL, CDCl3, 0, 15.7039)
##AUDIT TRAIL= $$ (NUMBER, WHEN, WHO, WHERE, WHAT)
$$ ##TITLE= Audit trail, XWIN-NMR		Version 3.5
$$ ##JCAMPDX= 5.01
$$ ##ORIGIN= Bruker BioSpin GmbH
$$ ##OWNER= she
$$ F:/spectra/data/she/nmr/H-F/1/audita.txt
$$ ##AUDIT TRAIL=  $$ (NUMBER, WHEN, WHO, WHERE, WHAT)
(   1,<2021-08-03 09:11:00.14 +0400>,<she>,<DPX200>,
      <created by zg, POWCHK disabled, PULCHK disabled
       configuration hash MD5:
       00 E9 B6 7A A2 85 ED C7 34 08 36 98 17 FE 4E 26
       data hash MD5: 16K
       B5 C7 02 C5 42 F6 8F 87 1E E5 EB 6D 63 A2 8E A7>)
$$ ##END=
$$ 
$$ hash MD5
$$ 26 9F 75 72 05 FA 9E DC DA A0 D8 DE 87 CE 72 09
##$RELAX= 
##$RELAX= 
##$RELAX= 
##$RELAX= 
##$RELAX= 
##$RELAX= 
$$ Bruker specific parameters
$$ --------------------------
##$DU= <F:/spectra>
##$EXPNO= 1
##$NAME= <H-F>
##$PROCNO= 1
##$TYPE= <nmr>
##$USER= <she>
##$AMP= (0..31)
100 100 100 100 100 100 100 100 100 100 100 100 100 100 100 100 100 100 
100 100 100 100 100 100 100 100 100 100 100 100 100 100 
##$AQSEQ= 0
##$AQ_mod= 1
##$AUNM= <au_zg>
##$AUTOPOS= <>
##$BF1= 200.13
##$BF2= 200.13
##$BF3= 200.13
##$BF4= 200.13
##$BF5= 200.13
##$BF6= 200.13
##$BF7= 200.13
##$BF8= 200.13
##$BYTORDA= 1
##$CFDGTYP= 0
##$CFRGTYP= 5
##$CHEMSTR= <none>
##$CNST= (0..31)
1 1 145 1 1 1 1 1 1 1 1 1 1 1 1 1 1 1 1 1 1 1 1 1 1 1 1 1 1 1 1 1 
##$CPDPRG= <>
##$CPDPRG1= <>
##$CPDPRG2= <>
##$CPDPRG3= <>
##$CPDPRG4= <mlev>
##$CPDPRG5= <mlev>
##$CPDPRG6= <mlev>
##$CPDPRG7= <mlev>
##$CPDPRG8= <mlev>
##$CPDPRGB= <>
##$CPDPRGT= <>
##$D= (0..31)
0 1.2 0 0 0 0 0 0 0 0.06 0 0.03 0 0 0 0 0.0002 0 0 0 0 0 0 0 0 0 0 0 0 
0 0 0 
##$DATE= 1627967459
##$DBL= (0..7)
120 120 120 120 120 120 120 120 
##$DBP= (0..7)
150 150 150 150 150 150 150 150 
##$DBP07= 0
##$DBPNAM0= <>
##$DBPNAM1= <>
##$DBPNAM2= <>
##$DBPNAM3= <>
##$DBPNAM4= <>
##$DBPNAM5= <>
##$DBPNAM6= <>
##$DBPNAM7= <>
##$DBPOAL= (0..7)
0.5 0.5 0.5 0.5 0.5 0.5 0.5 0.5 
##$DBPOFFS= (0..7)
0 0 0 0 0 0 0 0 
##$DE= 6
##$DECBNUC= <off>
##$DECIM= 32
##$DECNUC= <off>
##$DECSTAT= 4
##$DIGMOD= 1
##$DIGTYP= 9
##$DL= (0..7)
0 120 120 120 120 120 120 120 
##$DP= (0..7)
150 150 150 150 150 150 150 150 
##$DP07= 0
##$DPNAME0= <>
##$DPNAME1= <>
##$DPNAME2= <>
##$DPNAME3= <>
##$DPNAME4= <>
##$DPNAME5= <>
##$DPNAME6= <>
##$DPNAME7= <>
##$DPOAL= (0..7)
0.5 0.5 0.5 0.5 0.5 0.5 0.5 0.5 
##$DPOFFS= (0..7)
0 0 0 0 0 0 0 0 
##$DQDMODE= 0
##$DR= 18
##$DS= 0
##$DSLIST= <SSSSSSSSSSSSSSS>
$$ [...]
##$SUBNAM2= <"">
##$SUBNAM3= <"">
##$SUBNAM4= <"">
##$SUBNAM5= <"">
##$SUBNAM6= <"">
##$SUBNAM7= <"">
##$SUBNAM8= <"">
##$SUBNAM9= <"">
##$SW= 20.0188882624521
##$SWIBOX= (0..15)
0 0 2 0 0 0 0 0 0 0 0 0 0 0 0 0 
##$SW_h= 4006.41025641026
##$TD= 16384
##$TD0= 1
##$TE= 0
##$TE2= 300
##$TE3= 300
##$TEG= 300
##$TL= (0..7)
0 120 120 120 120 120 120 120 
##$TP= (0..7)
150 150 150 150 150 150 150 150 
##$TP07= 0
##$TPNAME0= <>
##$TPNAME1= <>
##$TPNAME2= <>
##$TPNAME3= <>
##$TPNAME4= <>
##$TPNAME5= <>
##$TPNAME6= <>
##$TPNAME7= <>
##$TPOAL= (0..7)
0.5 0.5 0.5 0.5 0.5 0.5 0.5 0.5 
##$TPOFFS= (0..7)
0 0 0 0 0 0 0 0 
##$TUNHIN= 0
##$TUNHOUT= 0
##$TUNXOUT= 0
##$USERA1= <user>
##$USERA2= <user>
##$USERA3= <user>
##$USERA4= <user>
##$USERA5= <user>
##$V9= 5
##$VALIST= <valist>
##$VCLIST= <CCCCCCCCCCCCCCC>
##$VD= 0
##$VDLIST= <DDDDDDDDDDDDDDD>
##$VPLIST= <PPPPPPPPPPPPPPP>
##$VTLIST= <TTTTTTTTTTTTTTT>
##$WBST= 1024
##$WBSW= 4
##$XGAIN= (0..3)
0 0 0 0 
##$XL= 0
##$YL= 0
##$YMAX_a= 741477
##$YMIN_a= -606396
##$ZGOPTNS= <>
##$ZL1= 120
##$ZL2= 120
##$ZL3= 120
##$ZL4= 120
##$ABSF1= 10
##$ABSF2= 0
##$ABSG= 5
##$ABSL= 3
##$ALPHA= 0
##$AQORDER= 0
##$ASSFAC= 0
##$ASSFACI= 0
##$ASSFACX= 0
##$ASSWID= 0
##$AUNMP= <proc_1d>
##$AZFE= 0.1
##$AZFW= 0.1
##$BCFW= 1
##$BC_mod= 2
##$BYTORDP= 1
##$COROFFS= 0
##$CY= 11.3945322036743
##$DATMOD= 1
##$DC= 2
##$DFILT= <>
##$DTYPP= 0
##$F1P= 2.36226072786647
##$F2P= -0.459571619588291
##$FCOR= 0.5
##$FTSIZE= 0
##$FT_mod= 4
##$GAMMA= 1
##$GB= 0.15
##$INTBC= 1
##$INTSCL= 1
##$ISEN= 128
##$LB= 0.24
##$LEV0= 0
##$LPBIN= 0
##$MAXI= 10000
##$MC2= 0
##$MEAN= 0
##$ME_mod= 0
##$MI= 1.114404
##$NCOEF= 0
##$NC_proc= 0
##$NLEV= 6
##$NOISF1= 3.799351
##$NOISF2= 2.8
##$NSP= 1
##$NTH_PI= 0
##$NZP= 0
##$OFFSET= 15.70392
##$PC= 1
##$PHC0= -13354.79
##$PHC1= 11.40099
##$PH_mod= 1
##$PKNL= yes
##$PPARMOD= 0
##$PSCAL= 0
##$PSIGN= 0
##$REVERSE= no
##$SF= 200.130013532006
##$SI= 16384
##$SIGF1= 3
##$SIGF2= 2
##$SINO= 400
##$SIOLD= 16384
##$SREGLST= <1H.CDCl3>
##$SSB= 0
##$STSI= 0
##$STSR= 0
##$SW_p= 3612.71676300578
##$SYMM= 0
##$S_DEV= 0
##$TDeff= 0
##$TDoff= 0
##$TI= <>
##$TILT= no
##$TM1= 0
##$TM2= 0
##$TOPLEV= 0
##$USERP1= <user>
##$USERP2= <user>
##$USERP3= <user>
##$USERP4= <user>
##$USERP5= <user>
##$WDW= 1
##$XDIM= 8192
##$YMAX_p= 0
##$YMIN_p= 0
$$ End of Bruker specific parameters
$$ ---------------------------------
##NTUPLES= NMR FID
##VAR_NAME=  TIME,          FID/REAL,        FID/IMAG
##SYMBOL=    X,             R,               I
##VAR_TYPE=  INDEPENDENT,   DEPENDENT,       DEPENDENT
##VAR_FORM=  AFFN,          ASDF,            ASDF
##VAR_DIM=   8192,          8192,            8192
##UNITS=     SECONDS,       ARBITRARY UNITS, ARBITRARY UNITS
##FACTOR=    0.0002496,     1,               1
##FIRST=     0,             0,               0
##LAST=      2.0444736,     0,               0
##MIN=       0,             -606396,         0
##MAX=       2.0444736,     741477,          0
$$ Real data points
##PAGE= N=1
##DATA TABLE= (X++(R..R)), XYDATA
$$ [...]
366 27166 23178 -75873 41035 64011 -112632 -20191 133706 -55335 -119621 97480 49286
377 49286 -119113 4769 66556 -66566 -17895 44438 -75366 -23562 85293 -77470 -105218
388 -105218 103651 15686 -160355 13934 93278 -102673 -70855 69121 -39208 -68993 43864
399 43864 -40437 -79093 71519 -3234 -136790 39478 91520 -120622 -62181 113836 -23850
410 -23850 -102703 53515 24655 -71564 32424 20249 -82775 38294 69779 -106902 -31613
421 -31613 126272 -40886 -119500 81236 54291 -110202 -4002 62704 -62184 -21104 44866
432 44866 -70293 -33593 80513 -58639 -107721 82856 31321 -143252 -5150 91151 -79530
443 -79530 -71803 59648 -26005 -60382 41695 -27747 -72782 64293 15130 -119576 25677
454 25677 99689 -92344 -68739 107091 1239 -93192 44067 36839 -60522 23211 32016 -67295
466 -67295 20106 71145 -80686 -47386 106915 -15220 -115337 49934 56568 -94041 -24362
477 -24362 49325 -52074 -35709 28914 -60507 -49905 55857 -44573 -112485 45752 33444
488 33444 -128882 -35380 72422 -61866 -82874 35082 -15681 -64385 18876 -14243 -68508
499 -68508 36276 25262 -98313 -1481 92692 -56112 -73608 81183 26442 -75566 22243
510 22243 49717 -34817 8790 35869 -42004 10483 70197 -49191 -49988 88635 10938 -99079
522 -99079 26604 66864 -67009 -42571 43300 -26815 -44759 18003 -36913 -54886 33391 -23369
534 -23369 -101995 14507 39907 -98979 -60053 54447 -30361 -87063 9394 4768 -55922 -5754
546 -5754 -4969 -54353 13349 27717 -72305 -22062 73360 -26856 -75418 50919 44535 -62180
558 -62180 -8230 48332 -18134 -10219 29326 -24801 -8674 50525 -26927 -54769 56642 28887
570 28887 -84418 -10373 63580 -36992 -58211 27240 -2350 -44648 247 -17508 -41607 19355
582 19355 -4804 -77854 -1707 48355 -59966 -62115 50296 6563 -72056 504 29459 -29650
594 -29650 -7375 13602 -26681 7483 36919 -35774 -22969 67405 8825 -63966 29508 61304
606 61304 -34739 -19979 46424 3412 -17592 18497 -5279 -9417 33868 -10604 -51327 28506
618 28506 34828 -62736 -28669 49697 -19957 -62231 8082 7196 -38322 -13484 -13088 -38548 1673
631 1673 1145 -61737 -19606 39511 -39417 -67409 27379 18202 -57962 -18721 22832 -18630 -18573
644 -18573 4185 -18496 -1551 25145 -29112 -31866 45790 14079 -56169 7422 48683 -24462
656 -24462 -30686 27578 9220 -16677 5163 -7369 -12693 24291 -4219 -44115 16581 32947
668 32947 -46364 -32189 39821 878 -47296 -2415 13536 -18816 -11259 -6105 -18869 7543
680 7543 4546 -42513 -9874 37945 -18605 -46917 20043 23336 -33879 -15637 19918 -2001 -8863
693 -8863 -290 -13460 5989 22247 -23450 -22993 35951 10614 -43444 737 36744 -12334 -26484
706 -26484 10330 6545 -7144 -1461 -13396 -4454 20518 -13852 -35861 17613 23550 -35751 -23067
719 -23067 25640 -5 -28777 -2421 5557 -5437 -1733 -14551 -13202 20989 2983 -36389 1125
732 1125 32407 -15847 -29382 18881 16956 -17782 -7199 6609 3141 7796 -6899 -16021 19439
745 19439 18230 -28739 -10102 34864 1605 -30769 7386 20345 -9681 -7569 1959 -2512 10056
758 10056 177 -26412 5484 29164 -21055 -29771 25716 14134 -31907 -6368 19627 -6603
770 -6603 -9514 -24 -10483 7197 13175 -26858 -13062 34350 -2980 -39890 14094 29369 -25206
783 -25206 -16474 20688 -1317 -9045 7239 -11433 -3787 24942 -12710 -30692 28421 21776 -40919
796 -40919 -7691 38980 -10017 -28210 17059 6739 -13327 8863 -5371 -16411 24786 6788
808 6788 -40444 9692 40830 -29615 -30133 39368 8873 -36084 9786 17043 -18034 7146 9134
821 9134 -26259 11491 30399 -34683 -19100 49854 -2404 -49923 24156 33020 -35231 -7182
833 -7182 28201 -15011 -6004 22430 -20483 -11439 40668 -10663 -43209 37337 30773 -50278 -2510
846 -2510 49978 -18816 -24904 33440 133 -19224 28445 377 -29544 34873 23990 -48652
858 -48652 8490 57880 -29010 -33163 51098 10294 -38880 22380 20960 -27114 15622 21511 -35627
871 -35627 8432 46052 -36402 -29513 58865 1880 -57429 28813 36282 -43066 -3055 36092
883 36092 -24707 -8526 36637 -24258 -23739 52680 -2508 -55732 39862 42854 -55451 -3942 59788
896 59788 -20162 -27386 43424 1376 -25992 38385 7926 -39871 37658 37131 -54104 3903 67142
909 67142 -29123 -38676 55663 11149 -46016 25519 23831 -38241 14504 30103 -45447 -2060
921 -2060 53414 -37591 -42157 58218 4806 -65908 23281 38276 -48565 -8791 38651 -29525
933 -29525 -16432 41588 -23910 -33523 53552 3052 -60537 36144 47706 -54655 -7542 62885
945 62885 -18131 -29319 48611 4094 -30136 43701 15610 -43541 37379 46592 -51839 -189
957 -189 73009 -21601 -41412 57527 18566 -46515 27021 31083 -38435 13450 37740 -41632 -5472
970 -5472 57272 -29082 -43499 56504 12393 -62313 21677 42025 -45276 -7770 42669 -27277
982 -27277 -17382 45288 -18019 -35129 51708 10980 -57318 29760 51020 -47034 -10461 61003
994 61003 -13201 -28687 46784 6825 -29731 40052 19061 -40808 30249 47262 -44579 -5777
1006 -5777 66387 -15540 -39848 50448 17854 -42793 23321 27898 -36475 11122 35436 -39192
1018 -39192 -9384 53038 -23982 -44287 48972 14533 -57630 15810 38571 -39328 -8809 36869
1030 36869 -23153 -16012 39371 -14579 -32055 44875 12569 -50341 24264 46171 -38910 -9600
1042 -9600 52445 -9250 -23058 39162 5842 -23353 35410 16520 -35159 26116 41595 -37856
1054 -37856 -5403 57175 -12113 -33831 40434 15318 -33433 18073 20990 -29089 9263 27489
1066 27489 -33028 -6903 43102 -21624 -36599 39632 10803 -45497 12342 28182 -30430 -5810
1078 -5810 26442 -19980 -9533 31437 -15838 -25492 38718 7469 -42178 21184 35492 -32331
1090 -32331 -7417 38725 -7806 -15451 28339 278 -16429 28997 7463 -28921 24437 28875
1102 28875 -33727 -2130 42928 -12052 -23374 29601 7167 -22832 15835 10699 -21212 13956
1114 13956 17442 -29809 1935 35326 -20183 -23224 34097 5767 -31520 13898 20227 -19339
1126 -19339 2882 18033 -16360 1907 26039 -16685 -11876 35370 120 -29775 22734 23953
1138 23953 -24175 794 25869 -10416 -4884 21366 -8296 -7660 26765 -5148 -23953 25914
1150 25914 16222 -30956 3671 29154 -16805 -13962 22373 -2630 -13917 15618 -3176 -17623
1162 -17623 19871 6999 -28962 10045 25228 -24610 -12566 29414 -3051 -21384 15727 6084
1174 6084 -16789 12253 7620 -20343 11405 19228 -25372 -4966 32827 -9472 -24497 22981
1186 22981 10479 -23860 7207 14926 -16309 3085 14109 -19720 -1346 25719 -16035 -20375
1198 -20375 27504 3992 -31183 11047 20611 -22057 -4382 18256 -14016 -5941 20595 -13351
1210 -13351 -15253 26537 -1197 -30568 18578 22140 -29072 -4407 28548 -12436 -14558 22201
1222 22201 -3315 -15507 20357 637 -24237 19732 17760 -30947 314 32832 -17182 -19975
1234 -19975 28321 2039 -23787 15739 8135 -21818 12546 14799 -27061 2537 29474 -22098
1246 -22098 -19350 33899 919 -32569 17063 17640 -25689 3248 19833 -19694 -2274 23723
1258 23723 -18525 -14553 32657 -3880 -33368 22819 20095 -33580 969 29210 -19474 -12424
1270 -12424 24735 -10582 -16763 26214 -3550 -30250 23065 16990 -37765 2756 35159 -24179
1282 -24179 -20898 31421 -3204 -26140 20149 5941 -26724 14755 15775 -31722 3563 32788
1294 32788 -25710 -20583 36746 -2103 -33971 21082 16184 -29482 5600 20599 -24009 -2002
1306 -2002 27468 -21808 -18665 34897 -4755 -37298 23930 19814 -37870 -750 28601 -22354
1318 -22354 -14541 24693 -13207 -21314 25157 -4209 -33810 21784 16606 -40908 299 34157
1330 34157 -25461 -22036 30593 -4612 -27971 20223 6202 -28728 15523 17453 -33528 2632
1342 2632 35124 -25095 -21264 38154 -685 -34647 20837 18078 -29517 4705 22759 -24243
1354 -24243 -4258 28427 -20409 -20463 33273 -3558 -37913 19724 18979 -36425 -3561 26389 -22404
1367 -22404 -16633 23022 -12870 -23162 23040 -3510 -34738 18061 17285 -37753 -2773 32363
1379 32363 -21254 -22489 28545 -1051 -25798 18874 8689 -25472 14479 19361 -28155 2324
1391 2324 34321 -18685 -19411 34631 3768 -29653 18142 18419 -24815 4455 20960 -21087 -3846
1404 -3846 25811 -18136 -19804 28988 -1804 -35632 14594 18178 -32673 -7218 22699 -18907
1416 -18907 -17521 17756 -11192 -21793 17437 -2694 -30740 12341 15475 -31907 -5851 27546
1428 27546 -15823 -20755 21948 913 -20958 13657 7218 -19729 11065 15674 -22345 384
1440 384 28429 -14115 -18361 27189 5443 -25186 11525 15547 -18681 608 14691 -15440 -4709
1453 -4709 18100 -14126 -17396 20694 -1187 -29616 8373 14436 -25112 -9002 15593 -12896
1465 -12896 -14166 10328 -8332 -15512 11920 -2815 -23569 9522 12417 -24276 -5677 21086
1477 21086 -10123 -16613 14548 2624 -13690 7616 5015 -12138 7459 10243 -15815 409
1489 409 19907 -9819 -13688 17836 4564 -17255 4913 10009 -10394 -1173 6818 -10021 -1950
1502 -1950 10227 -11427 -11337 14036 -1812 -20655 5211 9817 -16052 -7123 8841 -6268 -8200
1515 -8200 4608 -5512 -7469 8236 -3514 -13944 8253 7859 -15170 -2463 14014 -4331 -8765
1528 -8765 7957 2904 -4855 4742 1143 -4476 8295 4433 -10574 3984 13142 -7247 -7495 11321
1542 11321 3577 -9115 1918 4797 -3617 360 706 -6175 2312 4403 -10388 -4614 9272 -3916
1556 -3916 -12400 2843 4320 -8443 -4541 1722 -3419 -1943 -807 -7086 -456 5727 -7852 -8018
1570 -8018 8064 1847 -11103 -402 7181 -3754 -4675 2203 -453 -180 1954 -5134 -1621 8061
1584 8061 -2508 -9438 5308 6345 -8319 -4188 5992 -718 -4766 254 -1802 -1424 2380 -5335
1598 -5335 -6266 6241 760 -11905 -586 7886 -5701 -7982 3974 1101 -5067 -156 -1094 -2461
1612 -2461 3900 -1456 -7891 4680 7061 -8140 -3908 9787 584 -7926 3235 4977 -2800 709
1626 709 1184 -3046 4195 3616 -8080 -211 10273 -4162 -9854 7161 5656 -9271 -2181 5865
1640 5865 -3310 -3079 2037 -4144 -898 5204 -6097 -7190 8319 2208 -12247 555 9406 -6422
1654 -6422 -6447 6195 424 -4318 2848 -1468 -3432 6853 854 -9242 4891 9552 -8517 -5540
1668 -5540 12265 1405 -9334 4093 5252 -4640 1432 3041 -4618 2932 5824 -8036 -2814 12089
1682 12089 -1442 -11420 7061 7755 -9446 -1560 8121 -2605 -2826 4262 -3393 -1718 8085 -2705
1696 -2705 -8864 8801 6110 -12608 -189 13207 -4792 -8328 7567 2198 -6350 3447 1744
1709 1744 -5826 4572 3903 -10061 1089 11931 -7665 -9700 11306 3011 -11951 2375 7238
1722 7238 -6601 -1510 4857 -5366 -675 8106 -6479 -7380 11707 1211 -13835 5317 11075
1735 11075 -9948 -5142 10325 -1447 -6231 6459 132 -6263 7241 1950 -10852 5787 10632
1748 10632 -11552 -5152 13908 -1789 -11670 7421 5541 -9446 1529 5392 -7379 1815 7881
1761 7881 -9826 -3902 13785 -3732 -12879 10784 8089 -13573 105 12397 -5460 -4197 9751
1774 9751 -2383 -4976 11237 -91 -9172 11520 8503 -13451 2178 17234 -5802 -7914 14031
1787 14031 3063 -9002 8002 5522 -7339 6723 7418 -11322 1824 14913 -8635 -9763 15376
1800 15376 1911 -16082 6275 9803 -11765 -1653 8898 -8759 -4192 10258 -6912 -9906
1812 -9906 12813 625 -17536 6667 12677 -14364 -4697 14739 -4773 -8844 11238 936 -8411
1825 -8411 10221 4392 -11732 8665 14210 -12678 -1758 20393 -3366 -11691 15765 7513 -11629
1838 -11629 7027 10138 -9332 3461 12661 -10066 -3404 17088 -5729 -14698 14858 6373 -18928
1851 -18928 2568 12473 -12857 -6207 11163 -7632 -9248 10653 -4941 -14820 11422 4560 -20007
1864 -20007 3116 15315 -14688 -8565 16829 -2575 -12751 11607 4326 -11752 9278 9356 -13211
1877 -13211 4934 17752 -10998 -5845 21805 181 -14680 13965 10953 -13234 4397 13614
1889 13614 -9650 -700 14610 -8966 -7639 17251 -2859 -17553 12517 9208 -19478 -327
1901 -327 15100 -11766 -9183 12740 -5541 -11521 11724 -886 -15993 10600 8833 -18645 1589
1914 1589 18844 -10857 -9954 18493 1733 -12521 11987 7986 -10745 8978 12221 -11671 4125
1927 4125 19319 -8846 -7329 21355 2573 -15660 12760 12357 -13766 2496 13649 -9660 -2552
1940 -2552 14063 -8400 -9412 15821 -1452 -18463 10091 10344 -19251 -2668 15161 -10315 -10054
1953 -10054 11915 -3862 -11385 10383 109 -14585 9316 9305 -16891 675 18443 -9325 -9998
1966 -9998 17057 2004 -12213 10569 7341 -10129 7246 10451 -11208 2570 17166 -8993
1978 -8993 -8583 18492 1570 -15363 9906 10066 -12599 1196 10362 -9020 -2202 10995 -8553
1991 -8553 -8071 14243 -2327 -16461 9881 8796 -16650 -1107 13140 -8858 -6886 10496 -3578
2004 -3578 -7696 10365 -568 -11720 10397 8058 -14955 2160 16215 -8723 -7665 14327 1025
2017 1025 -9129 8575 4112 -7988 7123 6102 -11200 3892 13050 -10753 -6188 15381 -1775
2030 -1775 -12941 8468 5335 -10801 1987 5651 -9214 555 8023 -10342 -4697 13024 -5286
2043 -5286 -13274 10563 5169 -13761 1538 9386 -7552 -2106 8175 -5145 -2608 10907 -3775
2056 -3775 -7922 13262 4521 -12905 6361 12921 -8543 -2344 12605 -1388 -4149 9591 -232
2069 -232 -5212 10558 2235 -11070 8063 10269 -12283 -2138 13940 -4475 -9092 8546 1115
2082 1115 -8217 4927 1156 -9581 5300 5073 -13285 -304 12430 -9339 -10242 11641 662
2095 662 -12533 4646 4894 -9084 2102 5359 -9623 1132 10995 -9570 -6737 14666 -724
2108 -724 -13476 8574 8648 -11044 506 9469 -6652 -1429 9222 -6816 -4718 12920 -3390
2121 -3390 -12885 11071 6871 -15424 674 12318 -8951 -6591 9882 -4065 -7479 9081 -2730
2134 -2730 -11054 10015 4190 -16417 3104 13533 -12015 -7778 14071 -1998 -11030 8419 2348
2147 2348 -9760 7124 4741 -12636 5056 12447 -12937 -4857 17681 -3357 -13739 11695 6350
2160 6350 -13016 4426 8735 -10182 1678 10976 -10806 -3946 16340 -5628 -14581 14045 6541
2173 6541 -17321 3284 12890 -11184 -3990 11378 -6771 -6218 12269 -4858 -12497 13034 4068
2186 4068 -18607 4843 14670 -14437 -7258 15203 -4605 -11351 10555 -192 -11918 9321 3956
2199 3956 -15793 5763 13622 -15769 -6427 18604 -4892 -15024 12609 5106 -13920 5520 7964
2212 7964 -11836 3220 11745 -12863 -3738 18296 -5964 -14933 16100 6994 -17596 4864 13503
2225 13503 -11306 -2009 12823 -7977 -5263 14632 -5086 -13176 15117 5041 -19816 5105
2237 5105 15654 -14461 -7026 15386 -5356 -11142 10580 -1215 -12380 9717 3394 -17667 4967
2250 4967 13497 -16570 -7130 17831 -5739 -15572 11528 3969 -13901 5202 6540 -13119 2833
2263 2833 11704 -13302 -4781 18007 -6087 -15779 14475 7165 -16604 3709 12269 -10572 -2069
2276 -2069 11683 -7797 -4888 14081 -5463 -13314 14479 5278 -18728 4124 14352 -13212 -6722
2289 -6722 13379 -4840 -9504 9541 -2103 -12004 9812 3296 -16889 4755 13085 -15061 -7196
2302 -7196 16220 -3720 -13637 9596 3884 -11318 5448 6017 -10970 3645 11058 -11907 -3518
2315 -3518 17005 -3925 -13192 12953 7091 -13218 3683 10822 -7859 -807 9787 -6966 -2980
2328 -2980 13233 -4579 -11096 12513 4719 -15845 3332 12427 -10156 -5993 10163 -3786 -7091
2341 -7091 7582 -2394 -9326 8421 1484 -14042 4288 10639 -12186 -6179 12833 -2709 -10176
2354 -10176 7534 2837 -7849 4780 3344 -8555 4790 8873 -9991 -2024 13868 -3195 -10111
2367 -10111 10336 5858 -9477 2640 7226 -5458 1067 6306 -6372 -953 9643 -5207 -8252
2380 -8252 10171 2923 -12397 1899 8433 -7726 -4093 5884 -3614 -3806 4640 -4481 -5941 7351
2394 7351 -659 -11092 3983 7503 -9674 -4106 9263 -1929 -6519 4601 867 -3702 4496
2407 4496 449 -5726 5690 5256 -8318 192 10424 -3148 -6693 7266 3272 -5342 2395 2716
2421 2716 -3263 2774 2136 -5945 1789 7063 -6052 -5461 8046 923 -8631 2082 4683 -4857 -1494
2436 -1494 2146 -2928 661 2936 -5238 -1724 7489 -1864 -7291 5851 5450 -6326 -311 6491 -891
2451 -891 -847 3572 -476 847 5362 -1680 -2899 8105 3452 -6885 2874 8393 -3158 -2885 5741
2466 5741 1119 -1832 2268 -755 -1418 4599 -909 -6350 3949 4929 -7490 -2848 6855 -1898 -5970
2481 -5970 2536 818 -3223 1194 -941 -3566 3520 1957 -6869 520 7862 -3900 -5402 6921
2495 6921 2782 -5036 1991 3923 -1301 2050 2444 -2749 3007 6309 -4281 -2170 9411 1381 -6941
2510 -6941 4368 6436 -4176 -772 4411 -1246 -73 3332 -3233 -1159 6467 -2131 -7238 5552
2524 5552 4472 -8256 -1449 6902 -2868 -4638 3139 -317 -2336 3032 -1609 -4221 5520 2408 -8093
2539 -8093 1999 8471 -4796 -4969 7259 2001 -4686 2672 2841 -2308 3327 2433 -4779 3209 7105
2554 7105 -5637 -3204 9560 600 -7518 4255 5575 -4575 -683 3975 -2411 78 3836 -4202
2568 -4202 -2234 7278 -2191 -8088 5974 5014 -8257 -1459 7154 -2414 -3978 3823 -343 -2476 4132
2583 4132 -1204 -4978 6029 3727 -8025 1079 9386 -3661 -5367 7334 3096 -4627 2801 3336
2597 3336 -2331 3388 3280 -4723 2616 8036 -4691 -3975 9549 2282 -7660 3341 6742 -4101
2611 -4101 -1080 4697 -1932 -282 4507 -3735 -2757 7440 -440 -8424 4479 6719 -7142 -3141
2625 -3141 7283 -1131 -5172 3151 426 -3055 3386 -367 -5312 4487 4562 -7801 -1470 9062 -2454
2640 -2454 -7369 5709 3832 -5440 602 3505 -2625 1386 3035 -4697 107 7290 -3558 -6168
2654 -6168 7597 3874 -8386 674 7257 -3331 -3066 4008 -950 -1764 3680 -2338 -3734 6218 1757
2669 1757 -8583 2141 7986 -5718 -4968 7180 937 -5505 2186 1820 -2947 2333 1242 -5116
2683 -5116 2532 5782 -6287 -3455 8903 -121 -8282 3680 5427 -4899 -1417 4034 -1631 -586
2697 -586 3399 -3396 -1448 7020 -1536 -7128 5700 5686 -7450 -1834 7556 -1343 -4708 3382 828
2712 828 -2516 2761 -412 -4446 4727 3313 -7701 -203 8501 -3594 -6738 5756 3216 -5994
2726 -5994 193 3395 -2789 476 1867 -4493 507 6012 -4606 -5552 7378 2165 -8442 1057
2740 1057 6699 -3760 -3450 3880 -564 -1587 3126 -2115 -2813 6148 548 -7624 3331 7238 -6073
2755 -6073 -4090 7476 925 -5400 2371 2299 -2496 2151 942 -4348 3086 4531 -6454 -2244 8324
2770 8324 -1195 -7972 3832 4762 -5508 -1573 3584 -2101 -863 1849 -3953 -1235 5536 -3071 -6904
2785 -6904 5474 3788 -8586 -1428 6932 -2615 -4934 3015 75 -2435 2176 -1520 -3751 4565
2799 4565 1646 -7649 906 7567 -4434 -6159 5701 2089 -5815 741 2487 -2114 833 620 -4316
2814 -4316 1720 4886 -5670 -4016 7285 264 -8364 1987 5303 -4431 -2784 2816 -1078 -1247
2828 -1247 1605 -3101 -1778 5377 -1621 -7023 4346 5031 -7035 -2697 6278 -701 -4397 1804 1131
2843 1131 -1548 1848 -871 -2982 4407 2412 -6773 8 7424 -2858 -5737 4605 3142 -4342
2857 -4342 -365 2178 -1250 894 501 -4007 1185 4643 -4821 -4249 6339 1256 -7275 233 4746
2872 4746 -2612 -2888 1605 -765 -495 1092 -3466 -1449 5172 -1535 -6560 3266 4885 -5359 -2931
2887 -2931 5168 136 -3524 916 732 -487 1951 -1703 -2951 4376 2358 -6305 -25 6508 -2138
2902 -2138 -5275 3185 2730 -2877 -671 592 -918 1688 -412 -4512 1945 4076 -5165 -4023 5375
2917 5375 919 -6289 76 3358 -2193 -2071 16 -1540 854 899 -4801 -1207 5147 -2183 -6167 3213
2933 3213 3873 -4765 -2400 3526 -215 -1587 244 -1407 684 3074 -3077 -2967 5344 1396 -6590
2948 -6590 313 5770 -2267 -3885 2510 975 -1737 220 -1391 -833 3348 -1361 -5378 2968 4247
2963 4247 -5739 -3425 5359 -90 -5233 819 1638 -1817 218 -1127 -2656 3125 1553 -6179 -108
2978 -108 6482 -2969 -5895 4605 3473 -4689 -326 2779 -1025 837 1022 -2993 1709 5002 -4232
2993 -4232 -3589 7050 1647 -7050 1504 5594 -3010 -2174 2918 -785 -360 2162 -3236 -1572 5657
3008 5657 -1384 -6974 4148 5139 -6985 -2699 6084 -1258 -4553 2048 -125 -2428 2546 -1291 -4726
3023 -4726 4317 3007 -7700 -360 8089 -3558 -6313 5532 2488 -5166 1158 2202 -2886 2227
3037 2227 1890 -5500 1337 6855 -5062 -5274 8226 1725 -8336 2470 5723 -4485 -1357 3725
3051 3725 -2662 -508 4230 -4208 -3466 7621 -853 -8935 4571 6196 -7889 -2652 6977 -2220
3065 -2220 -4335 3576 -1101 -3401 4329 -1147 -6559 5178 4381 -9435 -995 9323 -4138 -6838
3079 -6838 6123 1712 -5671 2116 2050 -4593 2677 3146 -7250 523 8451 -5711 -6508 8931 2023
3094 2023 -8853 2721 5813 -4896 -857 4521 -3706 -559 6030 -4425 -4386 8807 330 -9897
3108 -9897 4797 7395 -7903 -2572 7691 -2236 -4287 4791 -1129 -4007 5982 -132 -7871 5379
3122 5379 6065 -9389 -1580 10061 -3260 -7155 6268 2346 -5873 2936 2393 -5544 3316 4305 -7574
3137 -7574 -22 9647 -4974 -7241 8843 3113 -9000 2534 6531 -5103 -467 5133 -3832 -652
3151 -652 7033 -4308 -5314 9123 1354 -9967 4021 8134 -7240 -3077 7549 -2108 -4283 4893
3165 4893 -1103 -4350 5868 270 -8378 4630 6787 -8967 -2726 9690 -2659 -7641 5682
3178 5682 2202 -5939 2641 2213 -5612 2859 4709 -7565 -1112 9383 -4042 -7814 8004 3550
3192 3550 -8281 1652 5818 -4455 -347 4642 -4090 -800 6850 -3641 -5588 8319 2357 -9474
3206 -9474 3049 8074 -6181 -2981 6758 -1648 -3559 4620 -958 -4225 5593 786 -7859 3864
3220 3864 6966 -7807 -3356 8806 -1606 -6833 4720 2199 -4769 2371 2063 -4853 2833 4738
3234 4738 -6788 -1201 9063 -2914 -7088 6785 3828 -6734 1150 4994 -3347 -17 3953 -3368
3248 -3368 -501 6522 -3158 -5215 7324 2640 -8335 2073 7152 -4472 -2831 5035 -914 -2459
3262 -2459 3507 -1116 -3328 5463 660 -7112 3480 6305 -6377 -2968 7396 -610 -5359 3615
3276 3615 1873 -3224 2428 1415 -3952 3287 4523 -5856 -895 8027 -1847 -5818 5437 3832
3290 3832 -4905 677 3902 -2146 644 2885 -3317 228 5606 -3101 -4331 6495 2025 -6854 1516
3305 1516 5364 -3334 -2231 3349 -1189 -1170 2614 -2280 -2275 5079 -201 -6438 2982 5048 -5325 -2350
3321 -2350 5492 -447 -3599 2382 583 -1746 2682 -388 -3668 3671 3104 -5621 -101 6522 -2004
3336 -2004 -4536 4203 2281 -3444 864 1607 -1794 1596 1360 -3998 1338 4708 -3895 -3335 5531 1049
3352 1049 -5579 1153 3597 -2386 -951 1725 -1698 694 2318 -3614 -1134 5249 -1291 -5348 3644
3367 3644 3722 -4641 -1160 4125 -918 -1433 2060 -1088 -176 3653 -1628 -3198 5029 2294 -5612 1118
3383 1118 5834 -2273 -2725 3945 699 -1878 1853 -45 -1228 3725 562 -4632 2867 4888 -4517
3398 -4517 -2138 5854 -24 -4561 2340 2156 -2202 1218 460 -2815 2210 2609 -4850 -493 6067 -2227
3414 -2227 -5269 4332 2616 -4587 333 2983 -1949 209 2046 -2811 548 4448 -3248 -3434 5870
3429 5870 1388 -6224 2015 5110 -3471 -1753 3900 -859 -1158 3028 -2057 -2177 5037 -128 -5732
3444 -5732 3426 5117 -5691 -2043 5856 -1298 -3723 3098 516 -2782 2603 68 -4140 3327 3033
3459 3033 -6310 -562 6846 -3073 -5413 4976 1869 -5126 1146 2193 -3243 1220 2255 -4511 522
3474 522 5659 -4029 -4484 6574 1391 -7250 2235 4997 -4161 -1122 3756 -2291 -996 3940 -2752
3489 -2752 -2757 6050 -220 -6952 3868 5368 -6361 -1804 6193 -2015 -3542 3610 -315 -3065 3557
3504 3557 35 -5461 3568 3759 -6907 -957 7356 -3259 -5764 5029 1639 -5372 1552 2043 -3958
3519 -3958 1510 2693 -5408 -116 6370 -4163 -5197 6662 1528 -7332 1880 4743 -4386 -916
3533 -916 3839 -2661 -877 4723 -3157 -3445 6546 389 -7090 3709 5861 -5887 -1823 6122 -1542
3548 -1542 -3433 3806 -378 -2996 4045 361 -5662 3722 4474 -6913 -1483 7276 -2582 -5753 4484
3563 4484 1540 -5032 1474 1876 -4412 1175 2809 -5820 -683 6148 -3819 -5607 5954 1936 -7140
3578 -7140 1195 4604 -3949 -1348 3423 -2772 -1148 4330 -2794 -3851 5810 899 -7183 2552 5584
3593 5584 -5311 -2621 5242 -1039 -3497 3045 -661 -3293 3337 -10 -5720 2719 3945 -6378
3607 -6378 -2423 6307 -1837 -5939 3147 1488 -4680 725 1236 -3749 1046 2512 -5025 -1296 5559
3622 5559 -2864 -5494 4693 2190 -5921 420 4017 -2931 -1230 2533 -2070 -888 3759 -2174 -3324
3637 -3324 5007 1379 -6306 1520 5334 -3653 -2635 4157 -259 -2825 1984 -344 -2349 2588 34
3652 34 -4860 1843 3664 -5046 -2624 4974 -1068 -4950 1798 1467 -3306 96 604 -2854 704 1912
3668 1912 -4307 -1146 4677 -2069 -4901 3377 2269 -4551 -293 3043 -1552 -992 1543 -1341 -336
3683 -336 2961 -1899 -2809 3944 1476 -4804 696 4240 -2329 -2715 2480 55 -1839 701 -848 -1628
3699 -1628 2054 -555 -4059 1198 2909 -4287 -2579 3505 -729 -3795 345 960 -2006 -466 -286
3714 -286 -1871 926 815 -3585 -660 3635 -1631 -3702 2099 1866 -3040 -660 1635 -494 -372 314
3730 314 -1202 347 2105 -2153 -2015 3179 733 -3879 145 2664 -1406 -2267 1003 293 -1013 -280
3746 -280 -1384 -892 1442 -1383 -3456 1005 1675 -3400 -2297 1899 -267 -2636 -668 210 -628 -351
3762 -351 -1200 -1260 1647 362 -3182 -108 2621 -1062 -2699 1547 1475 -1495 -855 721 351 494 -349
3779 -349 -1207 1310 1573 -2422 -1079 2810 290 -2673 -4 1719 -791 -1329 -217 -153 231 -458 -2102
3796 -2102 -185 2001 -1603 -2590 1323 1234 -2452 -1646 1484 115 -1361 -620 -296 416 280 -1847 -894
3813 -894 2214 -25 -2729 357 2715 -988 -1835 1416 1030 -498 -250 -60 435 1278 -922 -1534 1995
3830 1995 1614 -2400 -1151 2659 70 -2409 174 1187 -606 -721 -493 -704 909 -228 -2672 112
3846 112 2146 -1618 -2784 1451 1277 -2386 -922 1151 -225 -617 -167 -951 545 1155 -1988 -1292 2496
3863 2496 307 -2942 446 2697 -1377 -1904 1130 536 -632 -138 -479 -239 1491 -860 -2252 1437
3879 1437 1976 -2500 -1624 2494 138 -2588 247 1077 -815 -264 -380 -864 891 632 -2621 -332 2781
3896 2781 -1070 -3191 1641 1960 -2571 -931 1643 -144 -492 327 -712 302 1705 -1252 -2005 2709
3912 2709 1282 -3253 262 3380 -800 -1931 1717 831 -887 566 7 -381 1936 388 -2527 1199
3928 1199 3253 -2202 -1920 3195 1182 -2669 585 1950 -622 -135 768 -979 788 1944 -1964 -1221
3944 -1221 3253 -2 -3488 1743 2803 -2417 -1141 2446 -145 -1381 1115 -565 -906 1864 -415
3959 -415 -2884 2085 2123 -3552 -1138 3566 -682 -3140 1761 1343 -1947 464 490 -1633 1102 1567 -2848
3976 -2848 -227 3911 -1352 -3149 3114 1961 -3369 170 2713 -1285 -542 1896 -1011 -262 2853
3991 2853 -1335 -2180 3621 1356 -4328 858 3884 -2231 -2158 2910 -174 -2031 1675 18 -1982 2094
4007 2094 565 -3633 1267 3422 -3331 -2263 4229 44 -3892 1787 1845 -2427 796 1707 -2160 699
4023 699 2817 -2749 -1038 4538 -547 -4142 3136 3149 -3732 74 3776 -1605 -1063 2582 -971 -1289
4039 -1289 3257 -506 -3622 3149 2354 -4554 -126 4411 -2343 -2817 3231 -22 -2650 1783 406
4054 406 -2840 1709 1751 -4219 671 4405 -3119 -3055 4584 654 -4076 2126 2517 -2609 708 2838
4070 2838 -2042 499 3815 -2143 -1732 5115 643 -4177 3168 3634 -3375 66 4175 -1149 -1191 3445
4086 3445 -573 -1446 3853 321 -3949 3333 3180 -4549 -303 5042 -1942 -3031 3366 381 -3046
4101 -3046 2085 967 -3429 1892 2442 -4244 -56 4729 -2774 -3271 4391 802 -4146 1740 2694 -2647
4117 -2647 487 2724 -2474 78 3994 -2415 -2318 4682 553 -4524 2571 3557 -3582 -739 3673 -1486
4133 -1486 -1559 3106 -1154 -2071 3402 -148 -4095 2511 2893 -4301 -707 4381 -1943 -3049 3166 -71
4149 -71 -2788 2073 705 -2997 2174 2136 -3892 229 4642 -2392 -2993 4313 804 -3643 1986 2620
4165 2620 -2344 882 2419 -2326 446 3917 -2152 -1901 4577 723 -3876 2479 3248 -3128 65
4180 65 3148 -1380 -621 2832 -1257 -1453 3452 -380 -3504 2687 2548 -4089 -100 3919 -1871 -2321
4196 -2321 2834 -137 -2002 2235 -42 -2559 2304 1519 -3785 527 4021 -2208 -2085 3838 423
4211 423 -2800 2230 1417 -1856 1477 1658 -2174 1279 3299 -2389 -1162 4260 -182 -3237 2786 1964
4227 1964 -2832 412 2172 -1643 257 2062 -1992 -635 3253 -1392 -2853 2962 1394 -3759 402
4242 402 2550 -2273 -1229 2148 -1193 -789 2224 -1072 -1965 2888 488 -3738 1626 3021 -2976 -1148
4258 -1148 3377 -915 -1645 2234 -31 -1446 2316 332 -2792 2127 2357 -3224 -391 3999 -1491
4273 -1491 -2407 3042 541 -2664 1515 880 -2168 1319 1573 -3197 129 3381 -2534 -2496 3676 34
4289 34 -3766 1722 1928 -2704 328 1871 -2317 21 2901 -2410 -1616 4215 -332 -3739 2927 2472
4305 2472 -3466 381 3176 -1752 -688 2946 -1181 -1172 3511 -610 -3111 3234 1881 -4239 951 4087
4321 4087 -2771 -2044 3638 -777 -2315 2754 120 -3065 2750 1140 -4237 1451 3854 -3689 -1698
4336 -1698 4570 -1069 -3660 2824 1192 -3283 1656 1869 -3487 969 3500 -3769 -1383 5210 -1411
4351 -1411 -4032 3910 1860 -4301 1342 3114 -3244 -2 3532 -2538 -1301 4428 -1621 -3779 4551
4366 4551 1512 -5355 1571 4248 -3450 -1284 4264 -1695 -2343 3838 -427 -3465 4001 1226 -5345
4381 -5345 2209 4557 -4555 -1832 5446 -1560 -3935 3774 708 -4023 2540 1594 -4571 1474 3742
4396 3742 -4435 -1467 5456 -1947 -4829 4309 1414 -5213 1485 2906 -4102 -115 3621 -3603 -1530
4411 -1530 4821 -2304 -4509 4790 1182 -6019 1857 4324 -4329 -1245 4511 -2453 -2487 4208 -1218
4426 -1218 -3853 4057 1456 -5554 2060 4660 -4662 -1699 5638 -1953 -3612 4101 312 -3956 3035
4441 3035 1876 -4837 1673 4039 -4700 -1367 5836 -1891 -4748 4609 1409 -4813 2137 2835 -4004
4456 -4004 380 3822 -3561 -1342 5436 -1863 -4449 5128 1563 -5470 1793 4290 -3984 -827 4304
4471 4304 -2115 -1987 4347 -952 -3742 4427 1486 -5311 2199 4608 -4634 -1679 5128 -1828 -3468
4486 -3468 3593 1 -3963 2774 1337 -4823 1512 3821 -4840 -1578 5308 -2069 -4200 3630 967
4501 967 -4504 1471 2247 -3799 475 3120 -3779 -1357 4657 -2091 -4075 4263 1378 -5081 1568
4516 1568 3534 -3305 -631 3423 -1977 -1560 3661 -1358 -3243 3931 871 -5024 1764 3832 -3883
4531 -3883 -1224 3997 -1500 -2588 2850 -230 -2984 2449 799 -4188 1604 3065 -4124 -1157 4420
4546 4420 -1736 -3583 3134 763 -3365 1302 1546 -3065 779 2361 -3202 -546 3935 -1762 -3087
4561 -3087 3804 1060 -3840 1534 2585 -2552 -408 2651 -1950 -920 2727 -1805 -2385 3514 320
4576 320 -4085 1588 2683 -3276 -1136 2899 -1262 -1808 2219 -853 -1939 2252 68 -3285 1913
4591 1913 2030 -3465 -519 3556 -1407 -2163 2466 246 -2155 1441 777 -2033 1558 1378 -2557 282
4607 282 3267 -1524 -1796 3108 565 -2754 1432 1734 -1676 495 1526 -1502 351 2259 -1685 -1341
4623 -1341 2971 -5 -3033 1771 1969 -2378 -119 1966 -1055 -732 1549 -1162 -871 2037 -938 -2446
4639 -2446 2011 1269 -2900 37 2640 -1584 -1642 1659 -358 -1351 1104 -482 -1597 1649 429 -2730
4655 -2730 569 2451 -2248 -1247 2390 -207 -1923 951 357 -1573 731 232 -1956 805 1305 -2196
4671 -2196 -674 2691 -761 -2359 1564 880 -2203 383 960 -1262 189 935 -1567 -297 1941 -1082
4687 -1082 -1974 2001 739 -2633 696 1884 -1633 -444 1312 -804 -536 1580 -909 -1089 2139 265
4703 265 -2463 1314 2160 -2219 -734 2140 -740 -1170 1439 -86 -1101 1377 162 -1845 1210 1504
4719 1504 -2372 -290 2709 -1105 -1784 2033 455 -1608 788 927 -1330 736 1084 -1703 63 2368
4735 2368 -1522 -1695 2497 626 -2478 1054 1342 -1643 -42 1382 -1014 -144 1779 -1035 -1099 2345
4751 2345 47 -2683 1330 1884 -2321 -530 2169 -795 -1154 1493 -301 -1363 1435 142 -1972
4766 -1972 1459 1535 -2432 -162 2672 -1308 -1750 2104 491 -2031 1077 833 -1369 494 1091 -2009
4782 -2009 -82 2419 -1529 -1695 2315 604 -2629 592 1747 -1775 -270 1617 -1212 -533 1518
4797 1518 -1209 -1425 2033 128 -2841 923 1874 -2145 -905 1988 -619 -1685 1380 -67 -1402
4812 -1402 1233 357 -2031 1217 1683 -2170 -610 2833 -637 -2024 2082 1011 -2060 772 1091 -1423
4828 -1423 355 1350 -1523 -278 2453 -867 -1966 2052 993 -2729 372 1847 -1523 -977 1643
4843 1643 -771 -1174 1543 -461 -1552 1685 654 -2554 571 2502 -1741 -1454 2335 26 -2048
4858 -2048 1272 798 -1480 881 883 -1650 542 2020 -1877 -1202 2703 49 -2515 1362 1560 -1819
4874 -1819 -106 1640 -876 -465 1519 -728 -844 2193 -64 -2356 1702 1787 -2556 -441 2422 -1020
4890 -1020 -1574 1430 8 -1471 1138 218 -1806 1100 1433 -2537 -142 2769 -1246 -2165 2293 777
4906 777 -2083 803 1604 -1256 246 1546 -1361 -211 2415 -1154 -1646 2460 843 -2746 856 2197
4922 2197 -1696 -1031 1813 -440 -1290 1441 -440 -1536 1633 367 -2811 777 1995 -2275 -1419 2525
4938 2525 -402 -2370 1069 699 -2005 357 592 -2109 432 1763 -2084 -1029 2724 -551 -2542
4953 -2542 1770 1567 -2363 246 1914 -1254 -373 1509 -962 -786 1959 -344 -2178 2138 1517 -2884
4969 -2884 -21 2712 -1435 -1662 2047 -38 -1563 1346 188 -1630 1330 925 -2564 298 2746
4984 2746 -1780 -1868 2572 26 -2670 1125 1334 -1638 379 1238 -1436 335 2033 -1579 -1282 2808
5000 2808 265 -2628 1628 2156 -2013 -123 2111 -733 -721 1764 -449 -802 2366 136 -2248 1861
5016 1861 1908 -2790 -398 2655 -1023 -1791 1761 91 -1585 1036 223 -1850 1043 1163 -2456 -160
5032 -160 2614 -1755 -2333 2317 624 -2482 612 1192 -1627 46 1174 -1517 -71 1886 -1585 -1497
5048 -1497 2820 354 -2679 1264 1984 -1872 -606 1754 -517 -712 1356 -539 -960 1970 -60 -2379
5064 -2379 1668 1819 -2487 -565 2356 -775 -1795 1258 187 -1354 749 27 -1584 1036 811 -2552
5080 -2552 288 2407 -1452 -2080 1792 464 -1935 549 842 -1214 247 647 -1391 337 1851 -1494
5096 -1494 -1051 2543 174 -2370 1013 1657 -1394 -499 1408 -614 -32 1019 -1134 -419 1866 -402
5112 -402 -2017 1641 1383 -2255 -594 1898 -729 -1194 1194 43 -514 830 -459 -1155 1693 498
5128 498 -2356 431 2147 -1154 -1244 1809 437 -1366 507 556 -645 902 149 -1414 1063 1505 -1807
5145 -1807 -732 2603 -100 -1889 995 1055 -1182 151 737 -779 486 705 -1403 125 1966 -1076
5161 -1076 -1773 1749 934 -2150 307 1307 -945 -331 670 -655 11 1243 -1142 -931 1939 184
5177 184 -2354 764 1753 -1679 -864 1799 -584 -669 902 -524 -491 1451 -349 -1623 1493 1343 -2290
5194 -2290 -465 2435 -756 -1640 1262 246 -1014 543 -98 -1091 1297 629 -2322 278 2299 -1736
5210 -1736 -1623 2393 323 -2074 844 809 -1424 398 631 -1272 418 1553 -1836 -986 2663 -338
5226 -338 -2700 1407 1754 -2244 -248 1576 -1114 -357 1059 -1191 -513 1973 -716 -2111 2142 1130
5242 1130 -2965 91 2443 -1533 -1336 1609 -360 -1034 1357 -487 -1612 1882 803 -2909 977
5257 977 2908 -1952 -1415 3024 278 -2128 1507 899 -1369 922 1116 -1988 746 2374 -2186 -916
5273 -916 3386 -319 -2685 1961 1620 -2371 8 1962 -1356 -192 1658 -1736 -958 2829 -974 -2784
5289 -2784 2412 1417 -3342 127 2685 -1798 -1178 2121 -557 -1164 2009 -307 -2005 2388 1131 -3268
5305 -3268 869 3233 -2184 -1602 3239 -35 -2459 1592 867 -1876 1261 1277 -2569 734 2450 -2475
5321 -2475 -1601 3451 -404 -3305 1874 1630 -2764 -32 1596 -2047 -353 2044 -2103 -1326 2892 -848
5337 -848 -3323 2323 1733 -3590 24 2997 -1703 -1562 2506 -559 -1499 2426 -233 -2275 2555 1671
5353 1671 -3290 738 3633 -2030 -1682 3173 82 -2238 2043 1035 -2285 1365 1396 -2641 736 3003
5369 3003 -2380 -1638 3574 -377 -3619 1915 1779 -2899 73 1777 -2045 -303 2039 -2078 -1304 3050
5385 3050 -657 -3112 2506 1934 -3358 138 3071 -1504 -1178 2575 -233 -1155 2441 73 -2057 2647
5401 2647 1863 -3198 688 3760 -1891 -1615 3132 217 -2159 1762 811 -1874 1313 1076 -2847 733
5417 733 2762 -2533 -1825 3179 -261 -3487 1600 1631 -2490 7 1430 -1760 -123 1965 -1745 -1039
5433 -1039 3006 -405 -3062 2450 1886 -2867 145 2937 -1275 -773 2193 -349 -868 2346 -166 -1927
5449 -1927 2709 1597 -3040 700 3320 -1855 -1530 2507 149 -1825 1273 191 -1785 1154 598
5464 598 -2680 652 2283 -2596 -1763 2783 -436 -2762 1221 994 -2025 61 1009 -1653 127 1486
5480 1486 -1992 -678 3062 -811 -2613 2171 1585 -2338 396 2328 -811 -462 1554 -553 -227 2091
5496 2091 -622 -1605 2518 1021 -2568 798 2573 -1455 -1069 2111 54 -1321 1007 -348 -1237 1418
5512 1418 125 -2313 1058 1907 -2387 -1015 2373 -416 -2070 976 730 -1283 443 404 -1335 1061
5528 1061 1156 -1930 -187 2815 -897 -1901 2300 1403 -1608 561 1751 -551 342 1154 -755 415
5544 415 2030 -1075 -1010 2750 663 -2255 1060 2232 -1414 -783 1639 -458 -666 1148 -887 -696
5560 -696 1922 -453 -2463 1456 1541 -2503 -603 2321 -654 -1578 884 106 -896 875 -205 -1542
5576 -1542 1665 679 -2380 566 2404 -1159 -1569 2086 535 -1477 697 868 -668 711 435 -1569
5592 -1569 856 1985 -1918 -1030 2538 -108 -2480 1263 1531 -1752 -123 976 -956 61 899 -1607
5608 -1607 -546 2121 -899 -2297 1798 1243 -2685 -285 1938 -1089 -850 1203 -710 -400 1428 -766
5624 -766 -1129 2122 722 -2520 740 2725 -1633 -1202 2229 73 -1233 1151 29 -808 1403 343
5640 343 -2131 1236 2192 -2207 -866 2965 -508 -2326 1484 1302 -1444 586 835 -1295 561 1332
5656 1332 -2002 -447 2785 -1074 -2524 2302 1298 -2683 341 2046 -1351 -346 1285 -1017 -379
5671 -379 1968 -1157 -1679 2636 616 -3157 871 2674 -2111 -1305 2152 -361 -1254 1319 -341 -1286
5687 -1286 1638 179 -2597 1405 2383 -2800 -1049 3133 -562 -2628 1693 799 -1982 626 823 -1498
5703 -1498 687 1621 -2458 -316 3190 -1012 -2803 2392 1129 -3002 299 2026 -1242 -433 1591
5718 1591 -1245 -531 2280 -1183 -2103 2846 725 -3396 473 2757 -2159 -1561 2182 -360 -1493 1290
5734 1290 -417 -1528 1693 448 -2996 1257 2708 -2726 -1305 3199 -289 -2603 1348 896 -1737
5749 -1737 756 659 -1988 739 1626 -2590 -807 3140 -1133 -2919 2154 1603 -2795 -180 1868 -1434
5765 -1434 -659 1301 -1569 -565 2144 -1301 -2364 2512 972 -3507 304 2752 -1706 -1603 1921
5780 1921 -13 -1204 1260 -345 -1433 1753 471 -2763 1013 2680 -2237 -1280 3064 76 -2267
5795 -2267 1316 1087 -1388 699 655 -1568 960 1695 -2202 -718 3097 -652 -2971 1824 1559 -2454
5811 -2454 -347 1449 -1222 -448 873 -1380 -718 1973 -1177 -2437 2080 1140 -3214 -339 2496 -1498
5827 -1498 -1573 1534 -302 -945 972 -439 -1118 1919 484 -2523 878 2649 -1861 -1469 2581 544
5843 544 -2016 686 1039 -954 394 409 -1484 650 1404 -2100 -1060 2505 -497 -2664 1090 1273
5859 1273 -2060 -853 766 -715 -531 235 -1452 -836 1355 -1351 -2324 1403 873 -2861 -558 2094
5875 2094 -808 -1486 940 6 -444 617 -394 -963 1599 507 -2125 625 2363 -1246 -1375 1928
5891 1928 780 -1299 146 837 -362 224 67 -1206 753 1186 -1772 -1087 2024 -274 -2352 268
5907 268 1052 -1414 -989 209 -265 -407 -9 -1184 -243 1260 -1114 -1875 1302 1058 -1958 -525 1423
5924 1423 -22 -1156 441 337 152 475 -445 -512 1470 347 -1642 553 2107 -698 -1339 1327 864
5941 864 -743 -305 500 124 387 -443 -895 778 830 -1603 -896 1389 -170 -2088 -62 1047 -950
5958 -950 -1168 -118 -294 -37 -336 -1349 -174 1161 -926 -1903 871 809 -1293 -633 1160 173 -725 -183
5976 -183 245 529 92 -734 -225 1579 91 -1480 364 1492 -504 -1250 785 853 -416 -348 -295 292
5994 292 373 -774 -1130 744 656 -1590 -1009 1424 -29 -1740 -184 764 -359 -726 -417 84 502 -293
6012 -293 -1280 -29 1220 -769 -1441 836 989 -1281 -814 889 226 -270 -328 -69 800 383 -746 -447
6030 -447 1427 271 -1864 137 1304 -574 -1128 608 456 -236 -605 -579 48 565 -895 -1199 812
6047 812 760 -1699 -1093 1159 -113 -1421 -143 521 -151 -373 -635 -303 911 -9 -1444 154 1541
6064 1541 -461 -1404 1125 970 -977 -541 947 439 6 -192 -297 681 845 -1037 -506 1912 440
6081 440 -1658 179 1584 -534 -976 293 497 -54 -149 -615 -2 800 -399 -1448 764 1377 -1569
6098 -1569 -1009 1442 97 -1307 13 444 -160 162 -262 -540 968 426 -1861 -199 1806 -651 -1684
6115 -1684 1117 1171 -1201 -465 512 152 24 -84 -678 217 1049 -1221 -1338 1702 581 -2172 -97 1658
6133 1658 -571 -1259 640 230 -341 90 -687 -484 1358 -179 -1815 892 1572 -1663 -1046 1700 406
6150 406 -1427 117 654 -447 259 -205 -845 900 961 -1678 -306 2312 -186 -1851 980 1386 -1198
6167 -1198 -440 1178 -124 25 428 -984 209 1589 -990 -1515 1717 1137 -2111 -98 1951 -595
6183 -595 -1187 882 83 -384 597 -390 -619 1598 501 -2058 534 2342 -1359 -1533 2002 422 -1654
6200 -1654 332 815 -677 528 191 -1254 630 1544 -1765 -990 2388 -177 -2368 1009 1600 -1396
6216 -1396 -522 893 -567 -135 1008 -1103 -409 1875 -796 -1937 1842 1736 -2295 -9 2311 -457
6232 -457 -1158 1280 248 -488 1255 -268 -1057 1752 892 -2448 502 2596 -1357 -1760 2141 543
6248 543 -1633 764 730 -763 716 460 -1475 634 1756 -1865 -1145 2622 161 -2575 892 1604
6264 1604 -1495 -563 1188 -618 -179 1201 -1326 -506 2289 -570 -2253 1799 1905 -2237 -329 2203
6280 2203 -439 -1076 1261 177 -461 1453 -75 -1285 1820 1282 -2464 116 2740 -1070 -1769 1996
6296 1996 690 -1630 693 790 -1074 672 672 -1716 254 1795 -1704 -1623 2455 375 -2501 1039 1691
6313 1691 -1446 -383 1054 -650 31 1286 -1066 -708 2552 -138 -2150 1791 2055 -2040 -272 2405
6329 2405 -274 -865 1330 76 -314 1553 -61 -1474 1827 1249 -2263 150 2793 -905 -1524 1694
6345 1694 376 -1525 581 350 -1103 816 426 -1890 489 2123 -1652 -1419 2347 391 -2226 825
6361 825 1379 -1066 22 862 -879 440 1405 -1364 -310 2509 -132 -2119 1630 1790 -1782 -172
6377 -172 2007 -350 -516 1264 -412 -267 1806 -676 -1405 1974 1054 -2139 287 2650 -1112 -1423
6393 -1423 1524 270 -972 440 -75 -832 897 249 -2216 542 1886 -1955 -1144 2352 8 -1984
6409 -1984 770 941 -864 314 459 -835 949 1135 -1502 -95 2534 -350 -2036 1649 1480 -1629
6425 -1629 -11 1568 -534 -64 773 -594 203 1575 -873 -1325 2256 698 -2240 597 1902 -908
6441 -908 -891 1180 -132 -461 812 -431 -699 1565 -36 -2058 1040 1664 -1891 -715 2151 -239
6457 -239 -1164 1097 563 -369 886 199 -829 1364 1403 -1785 173 2458 -711 -1454 2056 1038 -1124
6474 -1124 549 964 -627 490 799 -1334 422 1918 -1328 -1472 2346 283 -2293 744 1550 -1358
6490 -1358 -591 867 -540 -167 962 -1201 -569 1935 -500 -2210 1643 1460 -2053 -255 1900 -463
6506 -463 -1062 998 13 -297 1228 -327 -1290 1724 898 -2379 256 2479 -1234 -1498 1872 356 -1369
6523 -1369 824 322 -780 1056 542 -1834 700 2089 -1945 -1155 2413 14 -2087 1120 1364 -1214
6539 -1214 50 865 -1050 542 1312 -1530 -611 2338 -669 -2085 1761 1420 -2073 -139 1746 -770
6555 -770 -605 1089 -556 -386 1408 -643 -1612 1856 944 -2651 606 2308 -1469 -1365 1710 -46
6571 -46 -1211 759 -216 -1016 1224 312 -2328 760 1822 -1957 -1273 2477 -46 -1995 1218 1058 -1225
6588 -1225 367 657 -1310 769 1266 -1862 -469 2619 -357 -2075 1650 1411 -2337 282 1543 -1002
6604 -1002 -119 1268 -975 -180 1862 -954 -1764 2033 1005 -2567 359 2321 -1412 -1171 1574 -149
6620 -149 -829 1126 -264 -1133 1410 336 -2062 1108 1939 -2028 -1014 2393 -111 -1838 1079 444
6636 444 -1331 533 524 -1554 640 1276 -2028 -768 2353 -753 -2179 1595 1172 -2032 -76 1240
6652 1240 -941 -357 804 -934 -265 1600 -997 -1762 1871 656 -2842 209 1912 -1410 -996 1280
6668 1280 -274 -828 1049 -680 -1088 1602 73 -2131 867 1849 -1877 -1071 2010 -274 -1548 782
6684 782 550 -1030 562 206 -1350 810 1122 -1966 -544 2201 -547 -2081 1302 913 -1695 62
6700 62 811 -950 -63 745 -1164 -240 1728 -839 -1798 1691 795 -2045 -85 1696 -944 -949 849 -322
6718 -322 -444 895 -551 -741 1482 310 -2087 827 1883 -1320 -1068 1538 183 -1229 559 308
6734 308 -626 566 -108 -1166 760 1021 -1719 -536 1660 -557 -1749 837 701 -1091 -170 407 -688
6751 -688 138 429 -1276 2 1298 -987 -1397 1318 756 -1696 -155 1418 -510 -713 591 -107 -160
6768 -160 742 -806 -416 1626 280 -1617 574 1398 -1011 -937 1177 223 -831 169 -148 -248 544
6785 544 -253 -1099 613 733 -1489 -596 1515 -487 -1618 434 578 -792 -206 -5 -639 174 19 -1102
6803 -1102 64 1208 -928 -1131 1051 639 -1477 -40 1042 -282 -256 177 -274 183 495 -733 -259
6820 -259 1223 193 -1303 384 997 -822 -884 702 166 -384 58 -409 -225 396 -567 -945 843 528
6838 528 -1215 -357 894 -95 -1070 249 338 -351 -165 -294 -395 576 -45 -958 172 1082 -476 -1002 937
6857 937 372 -663 -186 654 -26 105 14 -199 522 616 -939 -193 1032 18 -1146 273 816 -549
6875 -549 -475 206 284 -199 -13 -376 78 504 -616 -813 681 297 -1178 -529 869 -209 -751 -69 48
6894 48 -214 -34 -414 -192 806 -98 -854 251 805 -539 -767 545 482 -481 19 155 -60 241 -252 -314
6914 -314 407 401 -729 -201 1107 -192 -1035 162 532 -489 -297 -78 -181 14 -324 -801 33 349 -676
6933 -676 -871 606 406 -1087 -444 467 -159 -583 -235 13 151 67 -496 -284 608 -100 -1054 185 778
6952 778 -535 -815 509 401 -514 -51 55 53 138 -280 -537 560 464 -778 -437 796 -177 -998 7
6971 7 497 -259 -288 -29 -42 180 -137 -601 56 733 -429 -855 685 399 -1012 -322 669 1 -405 93
6991 93 96 53 201 -542 -103 706 333 -708 6 1036 -274 -715 502 443 -421 -283 101 -189 315 -48
7011 -48 -659 356 471 -779 -591 791 59 -850 30 503 -448 -396 147 -202 210 -56 -646 -119 673 -169
7031 -169 -892 429 740 -727 -488 682 84 -497 209 54 -3 170 -177 -495 519 361 -851 -3 964
7050 964 -219 -775 495 628 -393 -7 138 -92 57 50 -629 129 808 -598 -608 756 273 -1152 37
7069 37 610 -115 -297 46 -84 -69 214 -381 -265 773 250 -942 210 778 -612 -482 650 130 -341
7088 -341 24 283 -50 151 -125 -462 326 586 -807 -332 977 33 -773 389 453 -409 -241 269 -3
7107 -3 6 273 -690 49 795 -386 -847 784 536 -728 -38 655 -56 -371 376 188 -123 340 -242 -158 589
7128 589 166 -833 170 809 -456 -697 707 264 -615 132 152 -76 138 259 -462 363 537 -631 -297
7147 -297 1003 138 -694 340 603 -226 -139 456 -67 282 359 -219 -178 849 -72 -553 737 822 -679 -200
7167 -200 774 113 -342 135 219 -124 355 -355 -439 321 407 -827 -2 877 -334 -682 416 322 -639 -48
7187 -48 177 -228 81 32 -424 183 556 -633 -646 671 30 -881 398 661 -289 -165 482 159 183 390
7207 390 -451 -168 835 -83 -478 557 628 -598 -221 733 -36 -409 209 84 -245 272 -205 -489 517
7226 517 379 -882 -128 842 -279 -573 511 196 -350 -77 156 -107 291 138 -425 189 903 -582 -276
7245 -276 829 226 -634 94 648 57 149 502 169 103 339 -355 9 945 226 -455 424 655 -315 -42
7265 -42 609 86 -201 132 100 95 524 -196 -621 428 254 -773 -87 576 -284 -557 251 163 -266 -151 -2
7286 -2 -269 263 112 -487 280 778 -661 -345 909 196 -374 260 557 -96 -13 309 63 273 259 -203 114
7307 114 798 177 -569 567 534 -541 -178 581 -137 -92 184 -111 118 439 -424 -626 582 232 -834
7326 -834 -175 506 -171 -510 251 84 -205 219 -94 -133 373 -89 -682 402 841 -499 -374 725 135
7345 135 -522 242 583 -36 193 165 -276 538 554 -593 75 856 -97 -619 353 481 -406 100 314 -286
7365 -286 -6 164 -396 100 507 -350 -379 586 209 -889 176 531 -262 -385 391 8 -32 208 -163 -320
7385 -320 733 -9 -493 344 718 -469 -279 840 159 -331 455 206 -204 519 108 -191 501 428 -634
7404 -634 -23 983 -188 -674 556 417 -693 -105 303 -317 134 242 -531 91 471 -539 -641 811
7422 811 189 -744 137 607 -362 -310 698 -276 -4 378 -261 -456 765 -18 -913 444 819 -711 -187
7441 -187 916 60 -359 359 173 -207 409 -156 -527 452 508 -761 -52 855 -203 -726 526 348 -529
7460 -529 79 201 -646 249 245 -787 -70 775 -443 -595 634 355 -941 98 626 -531 -82 525 -225
7479 -225 -30 568 -262 -355 917 80 -977 341 963 -587 -89 682 -153 -373 501 121 -288 602 143
7498 143 -663 452 628 -758 -351 1065 -246 -809 594 161 -520 370 241 -659 288 547 -769 -78
7516 -78 922 -457 -786 840 249 -870 412 659 -447 -27 432 -437 -187 790 -340 -453 883 184
7534 184 -990 333 710 -787 -260 730 -197 -468 415 113 -301 430 3 -706 447 594 -887 -411
7552 -411 797 -284 -651 558 109 -616 289 206 -600 371 391 -707 53 843 -277 -629 559 333 -890
7571 -890 -1 423 -341 -160 494 -361 -175 522 -233 -520 803 257 -948 297 613 -638 -265 697 -199
7590 -199 -351 556 -139 -501 591 43 -779 401 570 -1021 -383 721 -84 -836 446 210 -519 276
7608 276 377 -442 117 474 -632 -206 791 -399 -865 619 272 -762 57 514 -464 -82 308 -501 -162
7627 -162 464 -316 -750 549 104 -944 206 537 -485 -244 473 -258 -280 419 -115 -425 430 113 -726
7646 -726 372 544 -628 -166 735 -197 -676 475 262 -380 195 164 -388 248 340 -726 -237 611 -456
7665 -456 -683 408 99 -656 40 422 -468 -10 362 -296 -244 473 -304 -366 507 143 -835 78 623 -578
7685 -578 -166 460 -43 -191 531 -277 -480 430 -88 -615 341 554 -488 -98 681 -87 -423 470 50 -319
7705 -319 225 -70 -520 239 301 -640 26 556 -318 -418 367 73 -655 8 311 -476 -43 154 -345 -18
7725 -18 414 -468 -468 729 36 -645 131 384 -460 -101 409 -112 -87 497 -322 -204 776 63 -607 384 470
7746 470 -545 -236 578 -69 -177 122 -104 -348 276 -10 -531 249 192 -691 -84 492 -511 -682 379
7765 379 140 -585 196 -201 -348 -15 62 -587 117 534 -415 -470 758 85 -567 318 292 -399 -20 297 -56
7786 -56 216 361 -214 -291 590 65 -431 436 485 -597 -79 468 -125 -322 279 -175 -426 369 -132 -491 466
7807 466 72 -771 -162 590 -485 -480 582 -151 -504 114 57 -394 147 120 -432 264 609 -482 -93 576
7827 576 76 -472 327 201 -306 201 262 -158 120 344 -238 -95 702 -170 -467 549 250 -608 110 425
7847 425 -349 -345 208 -187 -137 282 -227 -581 418 198 -801 62 458 -467 -413 402 -38 -346 275 -63 -372
7868 -372 377 167 -591 223 546 -523 -197 641 -7 -526 219 322 -304 127 271 -242 188 245 -343 -8
7888 -8 544 -51 -492 531 259 -605 -150 367 -192 -230 220 -187 -170 319 -296 -593 367 232 -786 34 435
7909 435 -398 -269 482 4 -294 318 37 -250 316 149 -437 294 568 -513 -286 729 135 -558 385
7928 385 279 -478 39 366 -312 249 351 -359 -212 730 -49 -581 479 311 -565 126 426 -334 6 71
7948 71 -152 2 339 -66 -491 503 176 -560 66 352 -447 -400 395 32 -404 177 279 -121 343 90 -525
7969 -525 259 644 -260 -357 504 86 -372 308 366 -327 187 295 -377 106 312 -439 -203 473 -87 -448 421
7990 421 565 -521 -133 453 -185 -379 126 -327 -355 355 -205 -267 314 115 -464 -156 549 -282 -335 187 135
8011 135 -195 159 -94 -266 279 239 -366 164 536 -340 -448 501 -57 -453 176 356 -249 7 263 -228
8031 -228 101 324 -240 -284 421 -106 -502 337 449 -326 -222 368 -191 -1 181 -32 -48 205 -1 -436 446
8052 446 271 -350 -192 382 -56 -309 296 51 -133 49 92 -244 189 131 -369 -63 463 1 -410 278 307
8073 307 -244 79 214 -167 60 59 -171 21 286 -343 -167 350 161 -444 77 299 -250 -89 178 67 50
8094 50 255 -14 -64 402 -41 -278 279 366 -384 20 159 72 -239 -118 143 -203 -27 -32 -218 173 137 -352
8116 -352 -182 233 -123 -409 20 -66 -183 122 234 61 -78 -23 -24 111 173 -91 21 218 162 -275 24 287
8138 287 -114 -310 164 -111 14 62 -218 -90 174 -104 -384 281 307 -122 -182 124 -38 -150 -45 60 -96
8159 -96 -31 -94 -91 30 -75 -336 75 241 -92 -266 187 168 -14 -142 59 160 15 27 -245 207 37 -113
8181 -113 -193 317 87 -342 86 210 -98 -235 189 48
8191D8
$$ Imaginary data points
##PAGE= N=2
##DATA TABLE= (X++(I..I)), XYDATA
0 0 0 0 0 0 0 0 0 0 0 0 8 -8 8 -8 16 -16 24 -30 32 -40 48 -56 69 -78 88 -104 123 -141 162 -182 208 -237
32 -237 270 -305 341 -382 430 -485 538 -596 662 -736 816 -901 996 -1096 1211 -1334 1470
49 1470 -1618 1782 -1964 2167 -2395 2649 -2938 3272 -3660 4117 -4660 5324 -6154 7230 -8672
64 -8672 10709 -13801 19002 -29274 56783 -271596 -606396 447331 125209 -587326 105109
75 105109 300757 -417481 -26186 315488 -349126 -127379 476634 -248593 -420587 490070
85 490070 133387 -584981 175968 412943 -405522 -142459 382382 -197429 -217813 323130
95 323130 -143637 -347889 353786 44756 -549478 172183 364599 -496027 -210134 436945
105 436945 -178020 -383268 263241 8077 -354117 173333 80921 -393201 136535 285561
115 285561 -425990 -114554 474312 -172642 -372613 362271 139899 -369280 137673 243556
125 243556 -253384 59799 279239 -257144 -51514 415751 -151987 -302035 393977 138309
135 138309 -415420 121267 323597 -261877 -93720 268370 -141701 -139742 243457 -116260
145 -116260 -246167 272484 33332 -402144 117688 266850 -331549 -149724 291580 -114351
155 -114351 -245125 172152 -11270 -215775 146425 29943 -281162 119956 202249 -298109
165 -298109 -75759 325835 -110747 -254357 227125 97078 -221084 85971 125231 -163597
175 -163597 66907 161451 -194058 -12122 276333 -128475 -205783 264624 88597 -272210
185 -272210 70936 192142 -162626 -42396 147473 -108584 -50382 160545 -118231 -146310
195 -146310 214405 8712 -274234 99010 185978 -215206 -87225 190065 -63537 -121606
205 -121606 109997 -29217 -97770 131064 -7146 -173261 129412 135057 -205679 -22482
215 -22482 231917 -64854 -141845 148370 54789 -103027 72455 45902 -81438 92439 72420
226 72420 -148302 38515 187870 -114532 -120730 184075 35383 -168462 54909 93178 -96687
237 -96687 -1691 52023 -91472 12333 92255 -126131 -75283 159893 -31170 -185154 85390
248 85390 101026 -144665 -35187 97344 -51970 -35670 57679 -59889 -22740 115433 -51708
259 -51708 -114480 135405 76774 -157119 19191 157742 -59514 -63819 102535 12626 -31128
270 -31128 71482 -12490 -42315 117747 27769 -125717 72641 139346 -106775 -55366 145528
281 145528 4329 -88704 58870 32063 -42690 50437 5287 -78317 73416 73404 -127855 -14142
293 -14142 153302 -50483 -119111 101090 57362 -95648 14797 52966 -45145 25076 41495
304 41495 -80613 18809 115801 -78279 -83039 140022 34026 -134217 43196 103143 -65222
315 -65222 -19225 66079 -30069 2498 72009 -59407 -35673 130951 -8420 -127982 92310
326 92310 107295 -114881 -22497 122411 -22850 -50477 67900 -4639 -30406 81146 -11837
337 -11837 -83710 98807 69010 -131829 7916 144598 -59557 -87110 98161 24384 -75115
348 -75115 38790 20085 -60940 51027 32021 -110559 24055 114093 -101042 -86192 129196
359 129196 7928 -132131 40632 67281 -79893 -7775 47987 -61322 3170 73041 -81996
370 -81996 -47571 129604 -16060 -130164 84048 92430 -108179 -14147 106188 -31387 -34925
381 -34925 71906 -20218 -28061 96906 -15153 -91050 104159 74097 -128959 7574 139366
392 139366 -56474 -79922 95658 17133 -72995 46575 15081 -69815 55561 38363 -115044
403 -115044 15124 113669 -90327 -87054 116088 11725 -120402 36549 60680 -73587 1226
414 1226 47553 -64805 6843 82852 -73498 -51462 126389 1330 -121137 72810 99777
425 99777 -90742 -17446 103707 -20410 -31343 72509 -13210 -30944 92502 343 -88695
436 -88695 83319 82258 -110194 -12320 127595 -37106 -83253 75471 20686 -68515 33336
447 33336 12334 -70236 38817 38082 -107646 -7902 102284 -74550 -101555 91125 22147
458 22147 -118659 11843 55919 -68764 -16364 41684 -56835 -14388 69186 -55408 -65424
469 -65424 97384 18493 -114134 38101 94444 -70904 -33976 84149 -8567 -36661 53969
480 53969 -3858 -34623 69989 12900 -81483 52444 82250 -86988 -32605 107175 -14934
491 -14934 -82181 50001 29889 -59340 13007 19842 -56696 15341 40155 -81730 -27490 87783
503 87783 -40715 -99262 59793 39422 -93831 -10952 56140 -40552 -28433 33024 -32196
514 -32196 -18838 57821 -30624 -64104 72681 34935 -94527 13136 91019 -44710 -50670
525 -50670 64125 11990 -41972 29753 8603 -37544 38534 19051 -71773 16845 71146 -64075
537 -64075 -58233 72595 5435 -83682 11157 35285 -49093 -18450 14412 -41194 -6091 30213
549 30213 -58194 -40699 63369 -13532 -87986 31466 54100 -65887 -31431 55127 -8408
560 -8408 -30689 28580 -4896 -17361 46103 -1058 -47631 51757 53364 -63590 -10499 86459
572 86459 -4994 -54056 43113 35232 -32885 8114 18889 -21356 19518 19814 -53173 -3691 60235
585 60235 -36661 -65889 47751 24510 -75678 -14177 39993 -30940 -32177 11050 -24628 -17508
597 -17508 21974 -33417 -43109 43356 8028 -76173 4246 59954 -37927 -44418 41315 9896
609 9896 -33726 10883 8446 -13527 23548 4188 -41508 22840 49083 -44091 -30846 60278
621 60278 4805 -58276 15002 33712 -28561 -14179 8398 -21070 -967 13293 -42366 -22887
633 -22887 41402 -21697 -68160 22164 31641 -57275 -30528 30109 -12957 -32027 3745 -9208
645 -9208 -12543 16811 -18517 -34724 35999 23197 -52817 -2331 56431 -13718 -36073 33494
657 33494 26161 -16956 6634 13244 -2632 24485 13961 -27919 17276 46998 -26351 -28412 49201
670 49201 19821 -42822 462 31078 -11026 -14612 4709 -9567 505 7153 -33001 -16364
682 -16364 33512 -13173 -53085 10756 26608 -37590 -28195 19656 -2140 -22853 -4431 -8630
694 -8630 -3269 15090 -18085 -26685 28874 16862 -40713 -3967 42963 -4943 -29262 16202 20271
707 20271 -5470 1770 2042 1872 22082 712 -25245 19911 34558 -24392 -21245 33613 12962
720 12962 -27313 -447 16927 -4027 -5077 -6046 -9670 14744 5392 -33832 -5870 30756 -13534
733 -13534 -36676 13410 18624 -24291 -16284 8695 373 -2760 -7150 -15696 10458 16484 -25970
746 -25970 -15972 32562 5991 -33498 3953 27094 -8118 -12292 8869 3520 5640 4607 -16520
759 -16520 4084 31040 -11204 -28728 25904 23762 -28688 -9246 27697 -783 -14853 4618
771 4618 -1373 1862 12212 -18027 -15929 30001 3689 -40326 6930 33592 -22986 -25738 22040
784 22040 5016 -18184 3554 -3065 -9192 17339 -5182 -30698 19540 26255 -37120 -16335 40667
797 40667 -2128 -35647 14525 17536 -16961 2264 5220 -14156 15797 13844 -33337 1473 43292
810 43292 -18795 -35756 37321 21533 -37986 3245 29957 -13785 -2678 17839 -15776 2480
822 2480 32834 -20906 -23642 46564 11695 -49275 16559 45727 -29330 -18243 36026 -3084
834 -3084 -16594 22707 -5920 -17626 33321 2302 -43595 25151 39234 -45715 -17529 52422
846 52422 -9427 -39725 27891 12120 -29366 15135 10597 -31813 17216 28991 -43684 -8621
858 -8621 56303 -18872 -46852 43313 23696 -45967 9125 33663 -25025 -278 29358 -24638
870 -24638 -5262 46354 -19949 -37372 52403 19260 -58684 16492 51149 -36777 -18874 43361
882 43361 -11611 -23957 33186 -8301 -33747 39068 10716 -59234 19699 49613 -52741 -26941
894 -26941 57785 -12149 -48733 31781 12230 -40334 17811 16874 -44047 13515 40169 -48888
906 -48888 -18692 63548 -17005 -54761 46423 26933 -52244 10807 39669 -32054 -2308 40249
918 40249 -28676 -14682 55992 -14728 -47791 53124 27745 -62756 12557 56783 -36668 -22890
930 -22890 47991 -10877 -29204 39164 -3413 -40708 40573 19425 -60911 16415 56600 -48399
942 -48399 -29202 61744 -6399 -48863 36290 17923 -41985 22453 26777 -44833 13074 50661
954 50661 -43781 -21822 69099 -7637 -56030 46220 35540 -50845 9937 46103 -31236 -5058
966 -5058 45753 -25298 -19788 56269 -8806 -50404 47658 31573 -60888 6570 55594 -35530
978 -35530 -25970 46991 -11590 -33498 37615 -1568 -45021 34716 22814 -59442 7740 55118
990 55118 -42135 -33875 55788 -2921 -48148 32318 18582 -40986 18821 27764 -41622 7585
1002 7585 49338 -36320 -24870 61655 -1354 -52140 39179 34118 -45700 7809 41820 -28966
1014 -28966 -5249 42386 -23597 -21717 51290 -5097 -49852 39332 31833 -55928 1026 50360
1026 50360 -30706 -25728 39577 -10142 -30623 31789 -1087 -40762 28980 22109 -52278 4042
1038 4042 49571 -34791 -29942 47725 -572 -39383 27035 16328 -31999 18053 24336 -34535
1050 -34535 8072 44633 -29593 -20665 54376 648 -43433 32876 29914 -35191 6382 32879
1062 32879 -22198 -3331 33166 -19978 -17026 41579 -6681 -42050 31983 24137 -46219 -330
1074 -330 36769 -25636 -19872 28113 -10600 -22225 25013 -5467 -33083 26427 15857 -44016
1086 -44016 6225 40144 -28636 -21706 38961 765 -26506 22488 11794 -20565 19662 18410
1098 18410 -25551 14256 36498 -24625 -10355 46648 753 -28568 28492 21413 -22834 10311
1110 10311 22728 -16102 5099 23942 -20674 -6869 36035 -10668 -30696 28267 14294 -35750
1122 -35750 3191 25332 -20263 -11358 17769 -12953 -11581 20612 -11912 -22807 25379 5048
1134 5048 -35346 11149 27705 -24894 -11300 27547 -5004 -14724 19700 889 -13108 21942
1146 21942 5209 -23609 20166 25351 -26022 -2765 35278 -7617 -18936 24462 8673 -16798
1158 -16798 12586 8097 -16782 13541 14545 -25411 1217 28354 -18873 -20596 27499 3331
1170 3331 -28353 8742 12572 -19760 1619 11562 -19559 -53 19761 -20442 -13968 29693 -2848
1183 -2848 -30333 17095 18606 -24299 -366 22079 -11652 -4565 18835 -9869 -6451 26801 -4484
1196 -4484 -21600 25957 15887 -27691 7363 30515 -14785 -9901 24580 -2726 -10520 21585
1208 21585 -1175 -17093 23159 9742 -28592 11920 29171 -23756 -12926 31459 -3816 -22059
1220 -22059 19393 6268 -20636 12968 9271 -23817 9982 22636 -26481 -9542 33396 -9203
1232 -9203 -27591 24483 11386 -27920 7879 17357 -20024 2759 20490 -20557 -6504 30521
1244 30521 -12068 -25320 29997 11264 -34438 9692 27202 -22374 -6212 25218 -11715 -11236
1256 -11236 24575 -7531 -19820 27673 6737 -34381 14741 28960 -29412 -9247 33948 -10864
1268 -10864 -21652 24279 771 -22619 19349 7073 -30559 12986 24457 -32749 -8868 37314
1280 37314 -15557 -30771 28197 7579 -32147 11089 15306 -27100 2812 21150 -26427 -8747
1292 -8747 32453 -16771 -29977 31470 8311 -38711 11416 25318 -28150 -6033 26343 -16285
1304 -16285 -12534 27542 -10366 -24828 30209 7871 -37737 15578 30700 -32263 -10062 35513
1316 35513 -11421 -22502 25327 332 -25173 20231 9030 -32375 12146 25679 -34576 -10410
1328 -10410 37558 -15984 -31966 27129 6098 -34135 10573 15093 -29562 1708 21859 -29123
1340 -29123 -11201 33983 -17215 -32299 31206 8805 -40074 10014 26678 -27800 -7276 27635
1352 27635 -15760 -14356 28688 -7608 -25424 29134 9920 -36573 13487 30953 -28814 -10659
1364 -10659 33752 -9924 -22639 24681 1639 -25587 18437 9577 -32375 9138 25520 -31900
1376 -31900 -13415 33939 -13012 -32410 22912 7281 -32988 7338 14705 -27867 -543 20780
1388 20780 -25987 -12577 29912 -13600 -30960 25882 10254 -35727 6520 24331 -24130 -7784
1400 -7784 24167 -14235 -13463 25159 -7454 -24370 24530 9404 -34246 8211 27513 -26180
1412 -26180 -14537 27835 -8567 -23502 17358 2 -24465 11637 6257 -29899 3294 19831
1424 19831 -28074 -16360 26397 -10335 -30357 15108 6716 -27602 2878 11148 -21981 -1601
1436 -1601 15999 -20333 -10818 24902 -9150 -25964 20860 12031 -27920 3647 21743 -15976
1448 -15976 -7320 18565 -7955 -9974 18268 -4563 -18958 18072 8349 -27196 3796 21609
1460 21609 -19655 -14176 18941 -5715 -18917 9114 -1087 -18505 6124 2297 -24005 1044
1472 1044 13958 -22971 -14579 19196 -7279 -24332 8848 5798 -18848 -204 7054 -13302 -991
1485 -991 10470 -13497 -6389 18630 -5557 -17539 15139 10193 -17467 1605 15397 -7227 -4348
1498 -4348 10537 -3660 -4070 11602 -4184 -11175 13497 4573 -19126 2587 14484 -12894 -10781
1511 -10781 10607 -2923 -12416 2580 -2404 -10892 3295 -2013 -16615 1602 7012 -16934 -9717
1524 -9717 10861 -5390 -15678 3049 2662 -9758 -1481 1022 -7357 1999 3782 -10778 -1170 12273
1538 12273 -5654 -10399 10380 6101 -10117 139 8074 -2578 -1642 3190 -3040 882 5739 -7049
1552 -7049 -5629 9243 -932 -13011 1384 6194 -8759 -7658 1930 -3454 -6163 -2511 -7207 -4689
1566 -4689 2181 -8549 -12124 3386 378 -14576 -5579 5183 -5737 -9511 -227 -844 -3897 -706
1580 -706 -4021 -3482 5801 -753 -9110 4049 8451 -6268 -4360 8759 3201 -4285 2516 3273 445
1595 445 4009 -158 -3267 7260 4769 -8444 -8 10535 -2658 -8334 4572 3500 -6026 -1892
1609 -1892 629 -3508 544 -1613 -8585 387 5460 -9295 -8379 6626 -304 -11516 -757 4406
1623 4406 -5454 -4003 732 -3701 160 2978 -6919 -2671 9222 -2149 -10131 6208 8547 -7898
1637 -7898 -3297 8668 -55 -3856 3928 345 -1095 5555 -1909 -5946 8006 5585 -10241 -733
1651 -733 11006 -3733 -8454 6308 3117 -6101 1071 921 -4358 3629 1453 -9436 1104 8866
1665 8866 -7818 -8785 9888 2530 -11800 938 6886 -5591 -2511 3597 -3744 -669 5323 -5887
1679 -5887 -5042 10197 543 -12417 4591 9966 -8594 -4703 9353 -509 -5397 4263 -8 -3056
1693 -3056 6270 83 -8601 6237 8438 -10641 -2908 13992 -1989 -10836 7131 5923 -7010
1706 -7010 1311 4617 -4742 1620 5542 -7645 -1414 11632 -4510 -11679 9610 6109 -12536 -419
1720 -419 9350 -5531 -5243 5517 -2713 -3661 6768 -3328 -8830 9078 4384 -13414 2098 13085
1734 13085 -7971 -8262 11288 2457 -8065 5232 4530 -5788 5285 6228 -7702 3683 13239
1747 13239 -6911 -6025 15711 3988 -10790 7438 11354 -6701 460 10212 -2734 -148 10116
1760 10116 -4222 -5000 13620 1524 -13024 8335 11565 -12474 -3683 13811 -3012 -8855 8168
1773 8168 605 -8303 7026 2183 -11166 5823 9288 -13281 -3635 16020 -4003 -12816 10896
1786 10896 6280 -11525 3576 8890 -7276 2092 9855 -7841 -1264 15942 -3275 -10754 14898
1799 14898 8328 -14373 4394 15824 -7426 -3873 12896 -2231 -5445 11658 -223 -9950 11206
1812 11206 6283 -15651 3527 16015 -11250 -9342 14995 -858 -13132 8170 4568 -11305
1824 -11305 4155 6519 -12280 1851 13841 -10721 -8338 18167 53 -15790 11301 11687 -12673
1837 -12673 1715 13913 -6588 -1175 14755 -3947 -5604 17561 2416 -13604 13939 14372 -14721
1850 -14721 1052 19233 -5781 -7395 14573 816 -9650 10771 3450 -13117 8716 10262
1862 10262 -16874 -1292 17865 -10194 -13455 15624 2081 -16787 6628 8140 -13130 1937
1874 1937 11191 -12113 -2160 17040 -7317 -11120 18867 5296 -16900 10098 16657 -11012 267
1887 267 18121 -3556 -3322 17548 331 -7306 18473 6900 -14306 12060 18191 -13306 -1703
1900 -1703 21368 -3677 -10604 15232 3482 -12020 9998 6387 -14797 5656 13081 -15849 -4802
1913 -4802 18811 -7488 -16176 14439 5324 -17212 5208 10756 -12715 721 13070 -9968 -3209
1926 -3209 18080 -4780 -11933 18646 8314 -16286 8708 18215 -10230 -1119 18589 -2632 -4585
1939 -4585 16763 660 -8909 16394 7494 -15100 8667 17612 -13472 -4931 19563 -3233 -12769
1952 -12769 12444 3091 -12746 7346 5569 -14185 3713 11605 -15014 -5863 17555 -6186 -15619
1965 -15619 13542 5918 -15606 4886 11036 -10332 1346 12616 -7845 -2081 17763 -2920
1977 -2920 -10416 17891 8997 -14204 8383 17517 -8117 -465 16415 -1821 -2937 14704 234
1990 234 -7099 15021 5871 -13741 8519 15166 -12591 -3949 16752 -3780 -10214 10527 1531
2003 1531 -10180 6932 3199 -12685 4769 10077 -14115 -3651 16011 -6295 -12762 12018 4578
2016 4578 -11933 5067 7899 -7745 3266 9687 -7677 1133 15379 -4648 -7145 17159 5848
2029 5848 -11405 9185 13421 -6737 1995 12747 -2565 612 12726 -2414 -3888 15364 2363
2042 2363 -11502 10344 11559 -11298 -258 13683 -4134 -5409 9101 -1128 -5636 8752 -319
2055 -319 -10123 8839 6775 -14017 1039 13700 -7861 -7655 11574 704 -8308 6944 3268
2068 3268 -6838 7027 5605 -10018 4653 13214 -8517 -4515 15732 727 -10024 9228 7408
2081 7408 -7079 4275 7104 -6252 3501 9450 -8466 -1847 14757 -3973 -11161 11686 5820
2094 5820 -12506 2475 9303 -7598 -1488 7902 -6538 -2696 10836 -5694 -9782 12321 3084
2107 3084 -15026 5073 11702 -10307 -3788 11355 -3471 -5325 9601 -1716 -6544 11449 2222
2120 2222 -12387 8796 11900 -12380 -1530 16448 -3406 -8173 11832 2848 -7587 8742 4221
2133 4221 -9195 8175 9921 -12204 718 16897 -6593 -9940 14912 3820 -12278 6701
2145 6701 8026 -8993 3480 8621 -10093 533 13849 -8762 -8749 16349 1283 -16151 8653
2158 8653 10887 -12964 -708 11834 -7921 -3674 11709 -6606 -8015 14482 -666 -16253 10481
2171 10481 10996 -16237 -1474 16143 -7740 -8614 12403 -1421 -9190 10723 1280 -12784 9930
2184 9930 9384 -16229 820 18067 -9612 -11085 16394 1828 -13582 8915 6430 -11610 5621
2197 5621 8953 -12756 1295 15895 -10945 -10373 18177 911 -17753 9326 10587 -14420 147
2210 147 11496 -9881 -2941 12237 -9037 -9111 16001 -1607 -18199 10997 10913 -18351 -1536 15900
2224 15900 -9355 -8537 12463 -3541 -10147 11894 273 -15168 10264 9717 -18495 -135 18639
2237 18639 -10690 -11961 15724 451 -14095 8463 4926 -12841 5391 7971 -15035 59
2249 59 15827 -12208 -11845 17101 -241 -18764 8010 8910 -15003 -387 9713 -11263 -3514
2262 -3514 11928 -9871 -10409 15435 -1581 -18878 9978 11096 -17346 -2230 14589 -8490 -7822
2275 -7822 11760 -3494 -9131 11587 139 -14516 10424 10238 -17179 -284 17684 -8975 -10780
2288 -10780 14558 975 -12323 7730 4077 -11823 5896 7828 -14498 -243 15073 -11452
2300 -11452 -11646 15364 239 -17120 5740 7658 -13055 -933 7670 -10525 -3193 10102 -9836
2313 -9836 -9504 13700 -1783 -17309 7684 9185 -15034 -2703 11877 -7140 -6966 8929 -3763
2326 -3763 -7472 10356 -1046 -13131 8841 8234 -15242 -815 14810 -7353 -9878 10374 467
2339 467 -10045 5556 1627 -10072 4706 4593 -13308 -170 11550 -10506 -10593 11372 -453
2352 -453 -14277 3469 4586 -10295 -976 4170 -9329 -1439 7352 -9669 -7615 10930 -2066
2365 -2066 -14100 5975 7080 -11457 -2499 8247 -5001 -3620 6039 -4152 -4363 8396 -2247
2378 -2247 -9868 8017 5830 -12093 -636 10607 -5782 -7029 6599 -879 -6554 3442 -1516
2391 -1516 -7281 4368 1084 -11657 274 7758 -9369 -8359 7389 -1406 -10713 1251 1393 -6817
2405 -6817 -181 294 -7528 905 4072 -8600 -4049 8714 -2653 -9709 5069 4779 -6857 -347
2419 -347 4509 -2962 248 3501 -4065 75 7509 -3380 -5998 7852 3689 -8642 1129 6879
2433 6879 -4071 -3366 3450 -1730 -2009 2035 -4117 -4072 5037 -1780 -9540 1909 4594 -8712 -5217
2448 -5217 4614 -2715 -6188 595 -2042 -3786 1512 -3152 -6183 3542 1803 -9158 -1103 7059 -3973
2463 -3973 -6414 4227 1452 -4315 849 847 -2355 2921 563 -5680 2339 5894 -5928 -4017 7205
2478 7205 207 -7123 1984 2910 -3797 -601 341 -3928 1128 1622 -6831 -2271 6006 -3993 -8573 3806
2494 3806 2636 -8067 -2074 3075 -3551 -2353 784 -3926 -1155 3567 -4677 -5383 6149 1158 -8707
2509 -8707 1324 6513 -4870 -3660 4649 -290 -2348 2754 -1437 -2324 5291 1 -7074 4036
2523 4036 6180 -7403 -3176 7760 -1125 -6359 2800 1418 -3872 1086 -323 -4962 2531 2583 -8117
2538 -8117 -1805 7403 -4544 -8213 5126 2124 -7483 -216 2962 -3951 -561 1700 -4987 -353
2552 -353 5731 -5037 -6193 7590 1716 -9160 1829 6821 -4719 -3132 4767 -1045 -2029 3656
2566 3656 -2121 -3077 6443 390 -7817 4281 6992 -7061 -3162 8152 -319 -5808 3505 1803
2580 1803 -3516 2429 821 -5123 3456 4381 -7532 -1646 8903 -2624 -7926 5573 4036 -6720
2594 -6720 -401 4121 -3117 -214 2982 -4592 -731 6665 -4050 -6265 7165 3082 -9006 311
2608 311 7183 -4248 -4139 4364 -1142 -3033 3385 -2130 -4296 5299 871 -8772 1963 7328 -6720
2623 -6720 -5664 7059 342 -6951 2124 2326 -3844 1082 1234 -5195 1950 5140 -6490 -3354 8302
2638 8302 -796 -8656 3931 5637 -5962 -1429 4712 -1902 -889 3503 -2931 -1316 6569 -1692
2652 -1692 -7057 6244 5640 -8094 -1032 8432 -1896 -4995 4193 1272 -2868 2615 -113 -3807
2666 -3807 4466 3055 -7353 378 8556 -4145 -6639 6826 3031 -6519 927 3810 -2904 279
2680 279 2321 -3757 863 6043 -4343 -4691 8060 2091 -8851 2160 7277 -4391 -3299 4885
2694 4885 -23 -2115 3074 -1335 -2573 5496 468 -7185 3888 7038 -6493 -3488 7944 296
2708 296 -5895 2859 2972 -3030 1207 1223 -3653 2864 4334 -6272 -1693 8718 -1611 -7817 5163
2723 5163 5436 -5869 -1204 5050 -1420 -1051 3051 -2500 -843 5797 -2444 -6049 6316 4347 -7981
2738 -7981 -367 8249 -2346 -4931 4374 1604 -2943 2398 21 -3051 4484 2037 -7132 1493 7909
2753 7909 -5011 -5846 7114 2626 -6680 1012 4211 -2704 58 2250 -3267 1082 4834 -4636 -3443
2768 -3443 7848 1004 -8377 2721 6660 -4999 -3288 5005 -602 -2294 2315 -1823 -1713 4961
2782 4961 -989 -6915 4244 5330 -7306 -2807 7829 -985 -6237 2801 2385 -3062 1007 318 -3140
2797 -3140 3157 2911 -6290 -222 8094 -2702 -6547 5684 4468 -5446 -38 4660 -1243 -332 2366
2812 2366 -2062 987 5407 -2906 -4000 7503 3035 -7386 1648 7684 -2900 -3596 4431 1238
2826 1238 -1796 2086 -868 -1639 4548 407 -6131 2925 6132 -5878 -4057 6966 909 -5619 1389
2841 1389 2612 -2167 373 435 -2727 2694 3073 -5726 -1268 7401 -1381 -6450 4051 4758 -4425 -1419
2857 -1419 3814 -17 -328 1497 -2107 598 4966 -2334 -3862 6306 3193 -6647 -51 6508 -1457
2872 -1457 -3621 2548 1194 -882 1362 -1455 -1629 4412 -29 -6233 2265 5841 -4857 -4331 5271
2887 5271 1174 -4745 285 2001 -1043 593 -784 -3110 2823 2714 -5432 -1241 6522 -1021 -5984
2902 -5984 2832 4057 -2957 -1454 2053 -90 860 732 -3111 1354 4835 -3422 -4001 5751 2939 -5836
2918 -5836 -90 5091 -982 -2597 1396 315 376 1664 -2978 -1216 5125 -516 -5834 2488 4837
2933 4837 -4399 -3352 4350 956 -2994 187 9 79 2248 -1905 -2951 4331 2426 -5868 -344 6570
2949 6570 -1088 -4808 2966 2977 -1831 211 738 -591 3064 355 -4116 2501 5678 -3975 -3653 6109
2965 6109 1992 -5134 1008 3628 -1365 -372 655 -1615 2036 2402 -4653 -1099 6255 -1187 -6522
2980 -6522 3617 4593 -4865 -1739 3852 -780 -1116 1351 -1975 -2 4214 -2861 -4341 5777 2740
2995 2740 -6965 173 6717 -2479 -4025 3522 822 -1914 1960 -1179 -2190 4735 354 -6554 2570
3010 2570 6536 -5612 -4074 6912 535 -5724 1768 2156 -2763 1417 630 -4033 2668 4083 -6523
3025 -6523 -1833 7997 -1640 -7585 4527 4311 -5730 -543 3740 -2236 -65 2645 -3912 -370 6354
3040 6354 -3299 -6257 7241 3563 -8560 617 7226 -3705 -3740 4525 -880 -2220 3778 -1806 -3996
3055 -3996 6148 1425 -8655 2537 7725 -6654 -4926 7599 6 -6084 3083 1523 -4078 2890
3069 2890 1191 -6017 2876 5792 -7829 -3067 9499 -1865 -8391 5562 4498 -6270 477 4276
3083 4276 -3805 528 4387 -5002 -1415 8523 -3061 -7651 7672 4844 -9180 436 7994 -3936
3097 -3936 -3228 5413 -1439 -2626 5616 -1918 -5545 7224 2761 -9693 2462 9056 -6616 -5094
3111 -5094 8399 99 -6134 4084 1592 -4847 3719 2078 -7344 2612 7334 -7782 -4037 10136
3125 10136 -1089 -9119 5203 4860 -6665 310 4467 -4362 348 5179 -5836 -2402 9034 -2457
3139 -2457 -8897 7188 5025 -9496 -221 7946 -4475 -3778 5473 -2142 -3345 5852 -2081 -6751
3153 -6751 6802 3440 -10268 1019 9247 -5926 -5962 7676 204 -6579 3783 1578 -5391 3796
3167 3796 2514 -7909 1900 8000 -7263 -5249 9610 -35 -9357 4221 4877 -6487 301 4281
3181 4281 -4834 106 5465 -5630 -3350 8890 -1689 -9262 5984 5723 -8794 -880 7569 -3377
3195 -3377 -3311 5027 -1989 -2941 5868 -1372 -6605 6513 4322 -9521 541 9221 -4915 -5469 7113
3210 7113 782 -5425 3434 1375 -4726 3606 2739 -7289 1457 7810 -6072 -5508 8559 482 -8402
3225 -8402 3171 4415 -5461 -5 3407 -4239 47 4898 -5233 -3440 7917 -855 -8642 4893
3239 4893 5737 -7165 -1274 6153 -2483 -2581 4206 -1696 -2382 5645 -953 -6075 5659 4513 -8032
3254 -8032 8 8388 -3392 -5003 5455 1203 -3953 2532 833 -3740 3592 2304 -6567 1295
3268 1295 7076 -5229 -5005 7212 859 -6899 2154 3480 -4012 144 2143 -3963 410 4197 -4998
3283 -4998 -3129 6911 -810 -7474 3673 4696 -5575 -1465 4553 -1811 -1736 2841 -1971 -1352 4955
3298 4955 -1699 -5078 5075 3348 -6868 -88 6555 -2427 -3808 3694 449 -2627 2008 -481
3312 -481 -3185 3826 1146 -6307 1444 5705 -4646 -4040 5316 440 -5083 1288 2070 -2680 818
3327 818 530 -3703 1636 3212 -5171 -1792 6212 -1073 -6010 3358 3554 -4206 -619 2685 -1548 93
3343 93 2020 -2709 105 4712 -2420 -4007 5185 2677 -5490 513 5010 -1813 -2028 2600 -204 -631
3359 -631 2492 -1839 -1943 4838 248 -5494 2609 4696 -4318 -2694 4740 -82 -2994 1717 -69
3374 -69 -1572 2504 -605 -3495 3696 2875 -5474 -667 6005 -1670 -4452 3416 1831 -3044 1031 1064
3390 1064 -1765 2036 1119 -4308 1434 5038 -3548 -3601 5566 1127 -5393 1336 3455 -2723 -412 1537
3406 1537 -2195 792 2909 -3915 -1914 5511 -1024 -5964 3348 4061 -4654 -1300 3926 -1592 -1548 2206
3422 2206 -1849 -1035 3798 -1991 -4404 4555 2742 -6371 4 5749 -2917 -3649 4028 284 -2864
3437 -2864 2427 -477 -2927 3900 1201 -5634 1851 5688 -4655 -3607 6331 349 -5256 2379 2407
3452 2407 -3180 1243 1640 -3731 1903 3933 -4947 -1847 6918 -1131 -6438 4241 3778 -5315 -24
3467 -24 3878 -2538 -674 2983 -2930 -1062 5500 -2287 -5273 5611 3164 -7003 579 6329 -3363
3482 -3363 -2978 4268 -658 -2126 3497 -827 -3738 4684 1605 -6798 2104 6555 -5277 -3614 6604
3497 6604 69 -5043 3193 1960 -3599 2089 1928 -4765 2082 5204 -5462 -2483 7752 -1233 -6630
3512 -6630 4672 3848 -5372 322 4161 -2944 -156 3702 -3447 -1625 6288 -1873 -6006 5848 3703
3527 3703 -7342 656 6239 -3489 -2907 4571 -835 -2666 4034 -945 -4441 5064 2096 -7262 1703
3542 1703 6832 -5012 -3772 6316 275 -5097 2952 1744 -3727 2539 2007 -5253 1796 5260 -5431
3557 -5431 -2950 7225 -783 -6846 3999 3887 -5259 -128 3582 -3263 -489 3748 -3907 -2147 6022
3572 6022 -1884 -6696 4810 3756 -7206 -610 5922 -2943 -3409 3826 -1153 -2748 3534 -1007 -4325
3587 -4325 4538 2414 -6935 1039 6769 -4048 -4015 5759 830 -4542 2683 1971 -3134 2368 2217 -4592
3603 -4592 1606 5488 -4319 -3272 6793 454 -5988 2836 4075 -4135 -490 3207 -2669 -310 3462
3618 3462 -3256 -2032 5494 -982 -6075 3871 3986 -5831 -1122 5166 -2048 -2787 3056 -624 -2019
3633 -2019 3201 -642 -3983 3912 2910 -5847 89 6216 -2670 -3870 4587 1411 -3347 1863 1609
3648 1609 -2064 1827 1790 -3671 1144 4817 -3364 -3206 5500 879 -5256 1489 3280 -2958 -819 1902
3664 1902 -1894 -334 2160 -2866 -2013 4212 -784 -5457 2387 3404 -4776 -1804 3660 -1016 -2597
3679 -2597 1455 -638 -1400 1999 -952 -3063 3221 2319 -4725 -237 4965 -1554 -3165 3169 1765
3694 1765 -2176 758 980 -1028 1598 856 -2932 1012 3700 -2796 -2643 4041 837 -3887 412 2276
3710 2276 -1562 -1059 626 -1238 136 1043 -2887 -1406 3095 -1016 -4341 1556 2284 -3245 -1884 2027
3726 2027 -289 -1590 314 -663 -299 1644 -1263 -2147 2863 1678 -3427 -123 3800 -501 -2117 1706
3742 1706 1603 -607 257 197 -185 1731 349 -2419 1513 2897 -2096 -1909 2861 835 -2520 -212
3758 -212 1340 -491 -680 -504 -845 927 552 -2779 -576 2755 -913 -3123 1242 1926 -1869 -1207 1145
3775 1145 510 -343 -450 -851 1034 1629 -1570 -1179 2741 976 -2467 151 2398 -122 -1295 612
3791 612 797 508 30 -976 313 2116 -636 -2246 1616 2014 -2126 -1474 1888 358 -1802 -322
3807 -322 188 -97 13 -1551 -1024 1693 126 -2943 -173 2343 -1001 -2370 993 1140 -1103 -792 250
3824 250 221 638 -660 -1425 1343 1760 -2289 -1186 2721 674 -2375 187 2018 -316 -801 113 -113
3841 -113 748 96 -1888 164 2205 -1024 -2900 1400 1701 -2428 -1323 1507 -60 -1284 -340 -443
3857 -443 20 720 -1585 -1575 1906 527 -3130 -363 2712 -1317 -2552 1098 1047 -1039 -314 -1 -96 1284
3875 1284 -97 -1829 1157 2351 -1991 -1787 3014 1009 -2556 242 1915 -431 -373 396 -548 691
3891 691 978 -1788 -489 2887 -263 -3149 1446 2574 -2216 -1416 2444 246 -1246 215 -124 17
3907 17 1355 -663 -1948 1859 1765 -2874 -402 3496 -521 -2772 1415 1512 -1080 -40 461 -661 931
3924 931 704 -2212 262 3151 -1574 -2764 2841 1600 -2932 -167 2302 -893 -1007 742 -617 -287
3940 -287 1423 -1407 -1863 2707 623 -3689 695 3025 -2189 -2342 2228 217 -1988 519 222 -1199
3956 -1199 1117 -86 -2815 1283 2624 -3096 -1855 3541 57 -3569 1251 2120 -2271 -461 1423
3971 1423 -1327 118 1778 -2313 -1039 3359 -628 -3450 2488 2560 -3478 -913 3401 -665 -1630 1986
3987 1986 -190 -1125 2328 -371 -2574 2942 2140 -3821 -177 4437 -1269 -2848 3053 1102 -2462
4002 -2462 1131 1296 -1999 1430 1638 -3128 192 3713 -2107 -3172 3864 1033 -4467 936 2859
4017 2859 -2462 -883 2054 -1821 -833 2403 -1939 -2273 3728 305 -4739 1730 3750 -3592 -1497
4032 -1497 3926 -751 -2339 2487 284 -1776 2831 671 -3160 2192 3556 -3706 -809 5150 -1008
4047 -1008 -3493 3336 1982 -2837 1356 1943 -2432 1173 2749 -2959 -541 4486 -1764 -4097 4206
4062 4206 1968 -4576 967 3457 -2550 -1124 2807 -1524 -1351 3063 -1351 -3067 3761 1377 -4756
4077 -4756 1574 4377 -3466 -1737 4434 -203 -2685 2887 546 -2362 2812 1448 -3736 1680 3884
4092 3884 -3847 -1580 5399 -606 -4019 3037 2028 -3504 869 2178 -2971 297 2882 -3386 -1593
4107 -1593 4385 -1627 -4548 3484 1694 -4754 91 3368 -2829 -1281 2664 -1725 -1717 3331 -1155 -3358
4123 -3358 3727 1680 -4700 1349 4537 -2853 -1781 4225 43 -2388 3187 747 -2438 2835 1802
4138 1802 -3543 2018 4235 -3296 -1494 4962 -367 -3573 2995 1935 -2826 1402 2090 -2439 678
4153 678 2874 -3130 -1119 4475 -1403 -3833 3301 2156 -4469 644 3090 -2577 -644 2697 -1800
4168 -1800 -1001 3367 -1275 -2662 3737 1452 -4237 1405 4014 -2611 -1283 3632 -330 -1728 2680
4183 2680 163 -1860 2827 889 -3297 2137 3689 -3207 -1090 4313 -835 -3099 2509 909 -2478
4198 -2478 1398 989 -2394 1112 2298 -3229 -490 3838 -1708 -3204 3306 1179 -3523 950 2166
4213 2166 -2211 -93 1888 -1934 -291 3049 -1722 -2115 3965 690 -3663 1862 3258 -2502 -442
4228 -442 3078 -972 -785 2321 -678 -1180 3246 67 -3051 2271 2603 -3183 -446 3489 -1413 -1935
4244 -1935 2301 -223 -1732 1618 -117 -2378 1935 1120 -3647 306 3462 -2569 -2433 3203 55
4259 55 -2701 1720 943 -2104 1146 1216 -2344 837 3029 -2634 -1139 4234 -529 -3094 2919 2002
4275 2002 -2557 912 2200 -1747 356 2429 -1943 -393 3820 -1255 -2825 3470 1510 -3797 970
4290 970 3096 -2429 -633 2577 -1292 -982 2719 -1310 -2324 3407 795 -4035 1746 3386 -3460
4305 -3460 -926 3632 -1167 -2070 2571 -219 -2249 2775 583 -3356 2444 3007 -3881 -292 4535
4320 4535 -1706 -2867 3531 652 -3049 2119 1449 -2988 1379 2498 -3535 -30 4419 -2620 -2984
4335 -2984 4345 610 -4206 2081 2512 -3450 258 2992 -2693 -385 3713 -2538 -2581 4595 -79 -4746
4351 -4746 2815 3324 -4402 -173 4018 -2333 -1801 3713 -1242 -2598 3807 68 -4398 3128 2984 -5094
4367 -5094 138 4966 -2901 -2884 4153 -267 -3698 2814 893 -4049 2320 2539 -4934 305 5062 -3494
4383 -3494 -3266 5106 -12 -4885 2693 2121 -4319 778 2855 -3965 -378 4342 -3231 -2863 5252 -419
4399 -419 -5359 3307 2968 -5135 -36 4336 -3166 -1790 4063 -1995 -2973 4528 -454 -5184 3533 3152
4415 3152 -5800 188 5377 -3284 -2892 4845 -537 -3876 3539 802 -4226 2887 3064 -5098 428
4430 428 5557 -3656 -3251 5540 64 -4776 3477 2319 -4111 1676 3202 -3909 89 4828 -3133
4445 -3133 -2699 5741 -217 -5583 3418 3361 -5095 427 4238 -3495 -1316 4177 -2360 -2793 4772 -488
4461 -488 -5358 3326 3093 -5753 12 5101 -3502 -2861 4241 -1018 -3615 3391 308 -4524 2554 2495
4477 2495 -5423 200 5266 -3697 -3412 5015 -262 -4424 2849 1696 -3988 1434 2564 -3932 40
4492 40 4518 -3472 -2975 5321 -464 -5226 2942 2597 -4527 58 3461 -3000 -1185 3477 -2367 -2561
4508 -2561 4420 -369 -4813 3073 2641 -5125 -92 4608 -2831 -2345 3563 -690 -2881 3129 115
4523 115 -3578 2821 2499 -4678 544 4862 -3000 -2570 4350 -192 -3762 2215 1352 -3104 1408 2048
4539 2048 -3766 291 3572 -3261 -2314 4456 -498 -4386 2452 1991 -3678 -16 2489 -2756 -689
4554 -689 2702 -2552 -1932 3360 -854 -3998 2496 2107 -4329 160 3044 -2160 -1554 2880 -904 -1778
4570 -1778 2555 -361 -2878 2688 1624 -3781 810 3473 -2472 -1989 3322 -92 -2282 1729 545
4585 545 -2105 1691 1116 -3005 1023 2790 -2897 -1589 3444 -532 -3177 1969 1329 -2722 580 1486
4601 1486 -2138 205 1900 -2458 -842 3114 -1168 -2939 2402 1201 -3063 292 2193 -1845 -640
4616 -640 1795 -1300 -712 2145 -1174 -1901 2373 483 -3089 918 2562 -2222 -1275 2235 -653 -1531
4632 -1531 1334 -540 -1299 1360 -24 -2592 1186 1659 -2812 -1092 2515 -953 -2515 1536 52
4647 52 -1877 629 221 -1824 848 1082 -2408 -333 2492 -1533 -2027 2134 392 -2354 808 1340
4663 1340 -1509 389 1211 -1246 243 1872 -1366 -1100 2576 37 -2423 1170 1676 -1891 -288 1662
4679 1662 -1054 -378 1421 -981 -623 2062 -494 -2124 1862 1328 -2586 14 2417 -1233 -1151 1601
4695 1601 -233 -1123 1166 -69 -1496 1432 560 -2351 511 2309 -1905 -1358 2459 62 -1953 976
4711 976 682 -1444 622 540 -1643 593 1668 -1967 -659 2584 -468 -2405 1587 1431 -1996 303
4727 303 1387 -1165 -146 1188 -1389 -407 2281 -766 -1995 2101 1013 -2515 469 2286 -1158
4742 -1158 -823 1736 -501 -743 1507 -215 -1558 1881 479 -2562 713 2465 -1935 -1362 2445 -178
4758 -178 -1844 1117 479 -1589 941 526 -1943 602 1802 -2165 -1014 2774 -560 -2327 1676 1318
4774 1318 -1988 43 1395 -1242 -200 1552 -1400 -762 2389 -707 -2274 1919 1310 -2568 226
4789 226 2252 -1147 -1037 1933 -461 -995 1713 -173 -1621 1853 936 -2496 519 2615 -1609 -1461
4805 -1461 2302 115 -2055 1145 879 -1334 798 1105 -1624 366 2028 -1503 -1209 2604 64 -2467
4821 -2467 1361 1901 -1750 -82 1746 -1010 -348 1753 -864 -796 2035 -192 -2139 1740 1809 -2370
4837 -2370 -128 2640 -787 -1293 1945 198 -1516 1253 340 -1499 1171 1333 -2153 -210 2577 -1334
4853 -1334 -2095 2240 787 -2288 682 1251 -1368 2 1131 -1298 -273 2047 -1046 -1662 2388 781
4869 781 -2499 968 2378 -1736 -812 2120 -425 -808 1647 28 -1224 1837 749 -2221 1137 2398
4885 2398 -1811 -810 2826 -239 -1971 1779 1042 -1562 900 985 -1596 311 1724 -2003 -866 2698
4901 2698 -627 -2589 1835 1396 -2378 -25 1936 -1126 -782 1513 -884 -1074 1995 -414 -2072 1852
4917 1852 1257 -2648 95 2696 -1098 -1314 2068 337 -1589 1288 617 -1411 1156 1316 -2184 427
4933 427 2628 -1528 -1649 2518 574 -2681 1112 1720 -1539 59 1588 -1415 -197 2120 -1353 -1370
4949 -1370 2519 275 -2830 1271 2436 -2238 -760 2333 -531 -909 1868 -167 -1064 2043 599
4964 599 -2016 1733 2360 -2017 -381 3229 -330 -1899 2352 997 -1521 1085 1193 -1274 954 1966
4980 1966 -1740 -221 3036 -760 -2147 2571 1206 -2648 588 2186 -1461 -596 1484 -1030 -640
4995 -640 1963 -1036 -1884 2224 575 -3133 791 2599 -2056 -1179 2386 -375 -1407 1310 185 -1376
5011 -1376 1610 778 -2169 1142 2517 -2214 -957 3334 -158 -2145 1878 1115 -1594 619 1250 -1368
5027 -1368 473 1930 -1615 -739 2867 -852 -2261 2124 1249 -2364 214 1875 -1163 -660 1426 -1034
5043 -1034 -701 1742 -681 -1943 2104 834 -2719 466 2546 -1513 -1281 2073 80 -1366 1143
5058 1143 208 -1134 1476 566 -1999 976 2465 -1857 -902 2858 231 -2007 1529 1136 -1288 441
5074 441 994 -1211 667 1553 -1691 -295 2602 -748 -2348 1628 1254 -1835 -90 1522 -984 -286
5090 -286 1188 -877 -303 1656 -913 -1478 1902 777 -2393 461 2206 -1220 -847 1615 67 -604
5106 -604 1102 -380 -684 1498 246 -2020 1412 2208 -1862 -734 2333 -55 -1556 1230 602 -1055
5122 -1055 741 -33 -940 1214 1194 -1966 -17 2302 -849 -1792 1570 927 -1708 261 830 -688 299
5139 299 543 -1311 384 1550 -1293 -1196 2271 357 -2172 908 1519 -1273 -288 1048 -635 -197 863
5156 863 -961 -396 1719 -566 -1885 1517 1401 -1930 -491 1779 -710 -1010 939 -253 -457 1055
5172 1055 -828 -1358 1670 597 -2189 436 2039 -1466 -1284 1821 -56 -1162 773 19 -1007 864
5188 864 235 -1649 1039 1592 -2057 -834 2519 -280 -2140 1320 907 -1298 377 439 -1071 709
5204 709 749 -1851 -182 2337 -983 -2064 2053 930 -2422 242 1589 -1070 -256 1155 -856 -164
5220 -164 1664 -1123 -1435 2282 387 -2801 969 2296 -2007 -794 2014 -562 -937 1397 -359 -1026
5236 -1026 1810 -50 -2432 1527 1901 -2514 -636 2905 -932 -2076 1769 489 -1529 972 436
5251 436 -1641 1133 1378 -2537 -128 3012 -1444 -2442 2560 858 -2655 544 1519 -1690 -131 1248
5267 1248 -1476 -258 2127 -1577 -1712 2894 213 -3282 1357 2316 -2324 -688 2137 -1141 -1394 1532
5283 1532 -727 -1679 2116 -100 -3180 1464 1937 -3339 -942 2945 -1427 -2569 1670 152 -2259
5298 -2259 943 283 -2634 1102 1441 -3090 -427 3247 -1876 -2832 2524 740 -2869 670 1673 -2069
5314 -2069 152 1588 -1961 -280 2899 -1474 -2219 3245 502 -3496 1247 2526 -2716 -918 2362
5329 2362 -1078 -1231 2198 -973 -1981 2435 -139 -3283 1444 2373 -3454 -1122 2994 -1374 -2743
5344 -2743 1757 170 -2536 1272 414 -2788 1054 1895 -3351 -465 3446 -1657 -2833 2883 909
5359 909 -3101 947 1930 -1953 345 1938 -2071 -208 3072 -1607 -2294 3266 727 -3553 1066 2721
5375 2721 -2459 -889 2171 -1483 -1286 1812 -1180 -2154 2309 -15 -3683 1388 2313 -3440 -1350 3103
5391 3103 -1285 -2581 1765 -81 -2239 1217 255 -2670 1149 1940 -3292 -691 3593 -1370 -3010
5406 -3010 2597 951 -2877 835 1453 -1874 462 1694 -2041 -463 2892 -1547 -2690 2928 712
5421 712 -3794 927 2424 -2492 -958 2086 -1339 -1123 1694 -1372 -2029 2123 63 -3648 956 2245
5437 2245 -3399 -1373 2636 -1192 -2318 1206 -211 -2120 1199 82 -2643 1258 1806 -3020 -494
5452 -494 3175 -1302 -2506 2526 914 -2116 735 1208 -1767 475 1187 -1982 -254 2486 -1709 -2161
5468 -2161 2676 497 -3185 503 1901 -2090 -880 1105 -1233 -871 1345 -1537 -1573 2113 -278 -3214
5484 -3214 1170 1744 -2888 -1010 2168 -843 -1482 1281 -294 -1161 1294 -137 -2068 1630 1398 -2711
5500 -2711 -138 2773 -1131 -1906 2004 600 -1641 759 760 -1155 935 1011 -2134 361 2257 -1807
5516 -1807 -1681 2366 222 -2649 541 1276 -1589 -573 709 -1318 -228 936 -1979 -1082 2102 -816
5532 -816 -2822 1410 1324 -2371 -641 1651 -986 -806 1076 -750 -404 1586 -910 -1737 1950 843
5548 843 -2736 357 2350 -1256 -1332 1548 26 -1040 730 -140 -1033 1439 51 -2271 736 1743
5564 1743 -2302 -1341 2053 -292 -2324 508 417 -1504 -7 -102 -1658 420 681 -2400 -518 2185
5580 2185 -1252 -2525 1609 1009 -2172 -66 1100 -987 0 838 -1253 355 1836 -1244 -1545 2615
5596 2615 644 -2678 650 2184 -1513 -709 1497 -464 -469 937 -767 -889 1841 -294 -2447 1229
5612 1229 1751 -2566 -893 2183 -656 -1576 1004 -38 -1131 694 -239 -1726 1275 873 -2725 -245
5628 -245 2813 -1352 -2162 2175 645 -1849 537 840 -1131 831 940 -1868 627 2179 -1829 -1537
5644 -1537 2807 249 -2743 1112 1816 -1755 -331 1139 -943 -192 1291 -1430 -982 2416 -393 -2880
5660 -2880 1647 1701 -2770 -589 2410 -1109 -1470 1382 -471 -1169 1433 -382 -2065 1903 1342 -3109
5676 -3109 126 2973 -1613 -1928 2305 511 -1830 985 369 -1455 1009 1005 -2147 480 2611 -2028
5692 -2028 -1659 3369 253 -3037 1156 1704 -1967 -191 1577 -1189 -31 1783 -1775 -1170 3042 -346
5708 -346 -2967 1749 2079 -2871 -534 2379 -1072 -1215 1667 -445 -1074 1877 -451 -2278 1974 1495
5724 1495 -3220 84 3237 -1395 -2300 2292 530 -1929 928 604 -1779 956 1053 -2611 295 2713
5740 2713 -2006 -2011 2881 498 -3020 1156 2076 -1490 176 1458 -1204 244 2189 -1548 -1178 3384
5756 3384 60 -2984 2010 2656 -2294 -586 2838 -566 -957 1793 -335 -796 2196 -234 -2265 2360
5772 2360 2047 -3024 -414 3152 -1078 -2237 2167 725 -1607 1054 475 -1553 1284 1038 -2341 294
5788 294 2960 -1721 -2274 2896 799 -2644 624 1987 -1402 -187 1421 -1036 203 1983 -1442
5803 -1442 -1373 2988 282 -2867 1451 2622 -1840 -622 2392 -260 -965 1492 -175 -630 1875 -174
5819 -174 -2034 1769 1843 -2849 -720 2822 -734 -2246 1506 531 -1365 560 301 -1124 721 887
5835 887 -2338 -51 2569 -1379 -2234 2326 1096 -2243 336 1667 -805 87 1083 -580 515 1839
5851 1839 -1100 -1035 2695 616 -2455 1163 2301 -1332 -703 1856 232 -569 1026 -328 -205 1486
5867 1486 -169 -1891 1334 1755 -2138 -652 2489 -283 -1960 824 714 -781 247 71 -808 1117
5883 1117 747 -1838 135 2372 -892 -1649 1840 1309 -1350 157 1644 53 304 846 -308 789
5899 789 1818 -754 -758 2477 844 -1746 836 2211 -505 -791 1268 502 -332 442 -364 -147 1365
5916 1365 -397 -1681 985 1588 -1735 -913 1744 24 -1577 186 650 -170 1 -179 -438 973 430
5933 430 -1617 256 1909 -512 -1428 1331 1545 -762 -120 984 359 222 220 -423 811 1296 -868 -473
5951 -473 1945 670 -1464 254 1552 -351 -837 566 401 -14 -87 -929 241 1203 -576 -1578 912
5968 912 1296 -1373 -992 1083 384 -1140 57 467 220 183 -415 -294 1221 448 -1109 396 1818 -149
5986 -149 -1121 999 1309 -348 -212 577 609 696 -239 -414 1006 1318 -1003 -484 1741 513 -1284 58
6004 58 1381 -85 -806 -10 62 194 -241 -911 150 1168 -530 -1417 708 1147 -1128 -958 906 392
6022 392 -683 -243 296 560 337 -684 -368 1422 699 -1246 227 1827 -82 -858 841 1336 -135
6039 -135 -83 307 611 934 -4 -686 853 1249 -832 -564 1658 786 -1387 -24 1117 -40 -380 -252
6057 -252 155 587 71 -1233 -32 1629 -418 -1526 720 1244 -1093 -669 928 358 -323 -64 -126 499
6075 499 680 -796 -751 1467 631 -1555 22 1870 -262 -1007 600 804 -362 -23 7 181 1080 -167
6093 -167 -1173 569 1566 -1268 -1085 1586 558 -1516 -184 921 -327 -483 -257 -343 668 405 -1446
6110 -1446 -417 1778 -428 -2112 575 1435 -1295 -1067 914 224 -547 146 -368 227 1069 -578 -1175
6127 -1175 1676 1052 -1883 -92 2084 -256 -1258 718 735 -366 32 138 -255 1138 570 -1510 658
6144 658 1820 -1069 -1328 1902 892 -1563 -37 1242 -287 -66 168 -639 610 979 -1370 -689 2046
6161 2046 183 -2040 691 1740 -1099 -941 1096 96 -561 481 -479 -353 1209 -597 -1733 1464
6177 1464 1302 -2183 -792 2252 -327 -1629 855 406 -572 213 -235 -919 1044 732 -1904 33 2375
6194 2375 -1055 -2076 1733 974 -1977 -119 1251 -393 -43 540 -836 356 1580 -1277 -1316 2304
6210 2304 296 -2599 568 1971 -1484 -1033 1191 -143 -638 705 -544 -640 1450 -303 -2237 1029
6226 1029 1676 -2248 -1022 2250 -197 -1809 864 565 -1041 352 66 -1059 1109 1034 -1995 -312
6242 -312 2604 -758 -2117 1908 1360 -1868 225 1294 -579 -83 789 -1076 80 1874 -1268 -1792
6258 -1792 2328 673 -2822 246 2125 -1434 -1302 1368 -228 -910 642 -715 -1091 1554 -201 -2647
6274 -2647 969 2097 -2254 -1227 2200 -195 -1984 899 612 -1195 549 370 -1345 1064 1502 -1856
6290 -1856 -456 2915 -515 -2249 1748 1424 -1625 72 1242 -780 149 903 -1145 -135 1995 -1291
6306 -1291 -1796 2126 1019 -2686 476 2222 -1328 -1051 1163 -437 -815 862 -772 -1389 1821 81
6322 81 -2423 906 2190 -2156 -1394 2108 19 -1736 792 563 -1063 865 290 -1688 944 1588
6338 1588 -2292 -625 2513 -678 -2189 1560 1393 -1545 225 1105 -961 278 982 -1608 -40 2033
6354 2033 -1148 -1940 1987 860 -2620 87 1770 -1258 -1161 994 -832 -521 859 -1108 -1167 1803
6370 1803 -191 -2578 749 1888 -2015 -1071 2003 -79 -1235 796 147 -785 1141 -70 -1421 1409
6386 1409 1558 -2238 -291 2695 -606 -1996 1497 860 -1191 401 452 -771 585 508 -1755 86
6402 86 1923 -1564 -1795 1836 357 -2215 257 1092 -1158 -587 639 -1048 -15 1025 -1307 -931
6418 -931 2265 -55 -2421 1155 1693 -1668 -639 1776 -421 -701 1007 -148 -306 1566 -279 -1248
6434 -1248 1933 1297 -2046 -51 2338 -655 -1171 1457 539 -851 397 -2 -709 1156 191 -2075
6450 -2075 539 1885 -1702 -1511 1843 31 -2199 577 768 -1135 -157 115 -1258 525 861 -1724
6466 -1724 -740 2002 -643 -2283 1228 1243 -1646 -161 1276 -613 -210 893 -864 -100 1761 -707
6482 -707 -1554 2060 897 -2382 284 1889 -955 -968 1160 -110 -420 841 -425 -973 1502 143
6498 143 -2388 704 1821 -2049 -1056 1912 -284 -1606 609 229 -1023 654 93 -1472 1093 1333
6514 1333 -2144 -505 2362 -824 -2012 1668 920 -1495 307 1021 -906 514 947 -1469 231 2158
6530 2158 -1427 -1507 2401 680 -2450 512 1781 -1074 -628 1212 -798 -259 1302 -1081 -1018 1950
6546 1950 10 -2709 1161 1686 -2112 -917 1858 -470 -1337 817 -24 -1049 1086 -371 -1838 1333
6562 1333 1292 -2354 -86 2505 -1049 -1922 1671 706 -1559 486 720 -983 931 738 -1899 381
6578 381 2250 -1567 -1577 2347 720 -2251 701 1627 -1294 -223 1019 -926 159 1448 -1280 -874
6594 -874 2162 29 -2452 1225 1714 -2095 -763 2024 -530 -1010 1225 -341 -824 1384 -375 -1961
6610 -1961 1476 1312 -2452 -357 2803 -840 -1875 1561 484 -1372 707 339 -1437 928 677 -2045
6626 -2045 114 2117 -1652 -1678 2153 474 -2309 410 1301 -1190 -60 796 -1127 83 1437 -1468
6642 -1468 -1161 2144 -64 -2451 1255 1595 -1908 -716 1646 -656 -730 1085 -582 -845 1538 -472
6658 -472 -1859 1435 1397 -2373 -444 2112 -883 -1675 1402 196 -1130 878 226 -1201 1000 720
6674 720 -1877 218 2247 -1238 -1513 2085 275 -1794 554 1137 -992 313 811 -881 452 1483
6690 1483 -1268 -836 2374 -34 -2183 1049 1715 -1392 -373 1345 -441 -500 917 -824 -488 1566
6706 1566 -356 -1763 1334 1218 -2089 -240 1953 -453 -1500 832 106 -919 435 -148 -1127 1184
6722 1184 863 -1736 332 1974 -1227 -1665 1621 396 -1392 184 790 -591 221 477 -761 556
6738 556 1356 -1166 -687 2026 89 -1941 857 1277 -990 -674 791 -213 -234 523 -882 -416 1414
6755 1414 -630 -1612 1231 1010 -1688 -484 1517 -346 -1175 375 18 -426 425 -237 -798 1037 385
6772 385 -1594 368 1731 -957 -1317 1414 519 -1083 192 543 -159 403 73 -837 417 932 -1042
6789 -1042 -622 1509 60 -1468 456 1040 -702 -410 292 -327 -25 305 -695 -155 1165 -653 -1330
6806 -1330 983 865 -1511 -564 1004 -237 -646 212 63 -78 571 -408 -479 1222 286 -1309 145 1535
6824 1535 -588 -985 912 283 -350 95 64 46 626 -89 -720 649 828 -923 -488 1247 231 -1078
6842 -1078 350 755 -323 -264 142 -152 222 62 -953 85 829 -644 -1092 735 325 -977 -339 683
6860 683 -224 -236 -136 -235 252 474 -613 -325 1010 133 -1060 410 1174 -309 -529 503 454 -15 -163
6879 -163 -89 340 627 -170 -656 501 817 -1008 -574 1098 170 -859 20 272 -117 -101 -204 -146 486 -279
6899 -279 -934 -74 755 -758 -954 560 448 -772 -317 275 -54 -27 -164 -197 595 647 -705 -357 1085
6918 1085 166 -1008 194 901 -220 -385 319 217 159 13 -405 99 517 -405 -770 676 603 -829 -520
6937 -520 875 2 -494 121 329 -63 17 -360 -386 474 71 -874 -29 898 -700 -728 626 435 -536 -228
6957 -228 306 266 150 2 -327 385 745 -356 -253 882 203 -815 114 885 -80 -417 323 161 288
6976 288 150 -358 -99 497 -367 -724 589 669 -572 -584 632 129 -621 -173 -115 -199 150 -314 -335 598 238
6997 238 -1179 -207 873 -317 -901 242 497 -533 -356 302 108 42 -13 -488 341 488 -668 -532 623
7016 623 334 -854 20 788 -194 -434 155 94 -40 100 -299 -202 623 -74 -731 333 840 -687 -444 895
7036 895 135 -703 -139 88 -104 140 -111 -423 347 361 -755 -256 798 -92 -861 427 458 -307 -324 356
7056 356 30 -170 157 -306 -42 554 -442 -792 734 567 -953 -288 788 -36 -383 296 203 -132 165
7075 165 -192 -250 530 212 -828 -29 1056 -533 -780 763 437 -645 -3 424 -34 160 33 -283 95
7094 95 540 -466 -573 920 116 -1192 165 549 -399 -361 438 159 -116 8 -432 -227 510 -265 -925
7113 -925 661 589 -721 -295 763 47 -681 228 202 -141 146 86 -383 506 530 -643 146 1045 -264 -716
7133 -716 729 715 -610 -74 635 -27 -39 32 -373 119 367 -552 -589 898 279 -893 -107 730 -380 -519
7153 -519 357 -107 -223 92 -320 -326 586 -206 -732 413 672 -758 -619 758 120 -645 85 226 -337 162
7173 162 3 -356 482 590 -484 -7 897 -205 -805 431 687 -407 -413 376 -324 -93 214 -305 -133
7192 -133 587 -428 -650 695 274 -899 81 755 -379 -504 413 130 -231 254 -195 -98 615 235 -759
7211 -759 452 866 -386 -362 827 289 -388 277 350 19 324 57 -261 392 525 -492 -176 1108 -48
7230 -48 -626 595 497 -341 -153 476 -47 -110 159 -358 95 445 -395 -630 779 421 -889 -88 632 -137
7250 -137 -328 297 150 -160 42 -197 -185 728 37 -921 375 860 -480 -380 793 240 -195 247 330 53
7270 53 299 141 -296 316 296 -382 -264 779 -118 -664 276 336 -376 -93 -76 -221 88 122 -509 47 474
7291 474 -477 -648 404 462 -922 -76 459 -6 -257 281 -129 82 187 -230 -71 732 64 -622 495
7310 495 771 -301 -236 635 267 -329 250 101 -13 472 18 -185 414 513 -645 -106 886 -28 -441 104
7330 104 297 -331 47 56 -366 180 130 -495 -15 601 -389 -459 574 153 -681 119 427 -168 -63 141 -245
7351 -245 280 633 -361 -192 998 92 -684 708 716 -386 -44 722 190 9 326 19 11 638 -90 -384
7371 -384 662 471 -622 -149 730 -55 -397 357 132 -229 129 -3 -292 441 148 -844 124 604 -414
7390 -414 -609 696 142 -689 131 336 -90 113 254 -433 396 731 -535 -29 835 205 -688 654 786
7409 786 -509 -7 697 -138 177 355 -255 -130 791 -184 -674 546 470 -855 -90 640 -358 -348 461 -31
7429 -31 -267 245 -117 -371 422 51 -820 156 751 -343 -647 917 157 -579 316 164 -372 303 258 -537
7449 -537 399 525 -634 -358 997 13 -895 547 523 -477 114 482 -227 137 520 -343 -227 773 -131
7468 -131 -878 804 522 -822 -84 768 -443 -344 390 -232 -238 571 -180 -611 618 246 -801 217 889
7487 889 -490 -556 951 107 -493 352 210 -294 525 219 -731 339 853 -692 -383 847 6 -836 480
7506 480 632 -520 -19 455 -320 46 830 -474 -208 734 -260 -836 679 662 -951 -100 872 -190 -470
7525 -470 610 -102 -250 607 -402 -372 630 452 -848 77 821 -540 -575 646 9 -501 355 241 -406
7544 -406 77 277 -800 221 689 -677 -483 849 110 -939 348 464 -703 -66 570 -448 141
7561 141 572 -542 -278 920 -108 -872 599 583 -744 82 703 -562 -139 557 -174 -256 684 -26 -632
7580 -632 594 355 -977 42 956 -595 -572 629 151 -577 301 149 -597 279 399 -775 125 837
7598 837 -604 -368 733 -18 -856 393 504 -598 134 450 -489 -97 585 -454 -289 585 -227 -864
7616 -864 617 584 -741 36 680 -248 -254 430 -232 -205 526 -124 -626 631 435 -956 -23 803 -569 -562
7636 -562 616 -241 -677 97 36 -367 207 142 -608 216 754 -558 -489 661 82 -731 382 312 -533 170
7656 170 306 -446 115 380 -399 -250 663 21 -535 433 533 -639 -110 606 -418 -122 358 -24 -124
7675 -124 554 -266 -848 403 452 -899 -63 573 -424 -321 276 38 -508 346 -58 -485 259 64 -682 -49
7695 -49 510 -455 -431 546 75 -602 333 165 -431 67 369 -459 -27 494 -434 -278 569 -199 -845 416
7715 416 425 -757 -32 428 -335 -200 319 -335 -235 323 -373 -568 341 316 -660 72 454 -541 -361 297 -278
7736 -278 -458 283 25 -418 422 63 -788 215 433 -362 -296 536 78 -374 272 212 -168 409 227 -573
7756 -573 191 497 -460 -234 682 -124 -596 442 81 -472 119 247 -360 -47 121 -584 -44 319 -546 -586
7776 -586 411 112 -869 -99 412 -373 -303 348 -62 -147 233 -350 -306 458 92 -569 215 359 -432 -201 618
7797 618 -18 -172 382 70 -342 369 95 -437 330 419 -710 -364 537 -222 -643 242 33 -656 114 337
7817 337 -446 -128 177 -610 -390 404 -479 -569 399 -103 -646 31 233 -480 -105 231 -495 -174 206 -274
7837 -274 -382 484 -25 -722 431 473 -627 -269 654 -361 -369 430 69 -390 393 -77 -505 321 350 -487
$$ [...]
8191A74
##END NTUPLES=NMR FID
##END=
