##TITLE=1H_SA_ACV
 CDCl3, 8 sc, 
 3.08.2021
##JCAMPDX= 6.0         $$ Bruker NMR JCAMP-DX V2.0
##DATA TYPE= NMR FID
##DATA CLASS= NTUPLES
##ORIGIN= UXNMR, Bruker Analytische Messtechnik GmbH
##OWNER= root
$$ XWIN-NMR		Version 3.5
$$ Tue Aug  3 09:21:18 2021 Russian Standard Time (UT+4h)  she@DPX200
##.OBSERVE FREQUENCY= 200.131506
##.OBSERVE NUCLEUS= ^1H
##.DELAY= (6, 6)
##.ACQUISITION MODE= SIMULTANEOUS
##.ACQUISITION SCHEME= undefined
##.AVERAGES= 8
##.DIGITISER RES= 18
##SPECTROMETER/DATA SYSTEM= spect
##.PULSE SEQUENCE= zg30
##.SOLVENT NAME= CDCl3
##.SHIFT REFERENCE= (INTERNAL, CDCl3, 0, 15.7039)
##AUDIT TRAIL= $$ (NUMBER, WHEN, WHO, WHERE, WHAT)
$$ ##TITLE= Audit trail, XWIN-NMR		Version 3.5
$$ ##JCAMPDX= 5.01
$$ ##ORIGIN= Bruker BioSpin GmbH
$$ ##OWNER= she
$$ F:/spectra/data/she/nmr/H-F/1/audita.txt
$$ ##AUDIT TRAIL=  $$ (NUMBER, WHEN, WHO, WHERE, WHAT)
(   1,<2021-08-03 09:20:09.92 +0400>,<she>,<DPX200>,
      <created by zg, POWCHK disabled, PULCHK disabled
       configuration hash MD5:
       00 E9 B6 7A A2 85 ED C7 34 08 36 98 17 FE 4E 26
       data hash MD5: 16K
       D5 71 60 64 7F BA 67 D6 E6 88 33 C8 3B 65 BC 4E>)
$$ ##END=
$$ 
$$ hash MD5
$$ 07 6A F1 3F 42 9B 21 F9 D6 36 57 3D A4 C6 D5 C5
##$RELAX= 
##$RELAX= 
##$RELAX= 
##$RELAX= 
##$RELAX= 
##$RELAX= 
$$ Bruker specific parameters
$$ --------------------------
##$DU= <F:/spectra>
##$EXPNO= 1
##$NAME= <H-F>
##$PROCNO= 1
##$TYPE= <nmr>
##$USER= <she>
##$AMP= (0..31)
100 100 100 100 100 100 100 100 100 100 100 100 100 100 100 100 100 100 
100 100 100 100 100 100 100 100 100 100 100 100 100 100 
##$AQSEQ= 0
##$AQ_mod= 1
##$AUNM= <au_zg>
##$AUTOPOS= <>
##$BF1= 200.13
##$BF2= 200.13
##$BF3= 200.13
##$BF4= 200.13
##$BF5= 200.13
##$BF6= 200.13
##$BF7= 200.13
##$BF8= 200.13
##$BYTORDA= 1
##$CFDGTYP= 0
##$CFRGTYP= 5
##$CHEMSTR= <none>
##$CNST= (0..31)
1 1 145 1 1 1 1 1 1 1 1 1 1 1 1 1 1 1 1 1 1 1 1 1 1 1 1 1 1 1 1 1 
##$CPDPRG= <>
##$CPDPRG1= <>
##$CPDPRG2= <>
##$CPDPRG3= <>
##$CPDPRG4= <mlev>
##$CPDPRG5= <mlev>
##$CPDPRG6= <mlev>
##$CPDPRG7= <mlev>
##$CPDPRG8= <mlev>
##$CPDPRGB= <>
##$CPDPRGT= <>
##$D= (0..31)
0 1.2 0 0 0 0 0 0 0 0.06 0 0.03 0 0 0 0 0.0002 0 0 0 0 0 0 0 0 0 0 0 0 
0 0 0 
##$DATE= 1627968009
##$DBL= (0..7)
120 120 120 120 120 120 120 120 
##$DBP= (0..7)
150 150 150 150 150 150 150 150 
##$DBP07= 0
##$DBPNAM0= <>
##$DBPNAM1= <>
##$DBPNAM2= <>
##$DBPNAM3= <>
##$DBPNAM4= <>
##$DBPNAM5= <>
##$DBPNAM6= <>
##$DBPNAM7= <>
##$DBPOAL= (0..7)
0.5 0.5 0.5 0.5 0.5 0.5 0.5 0.5 
##$DBPOFFS= (0..7)
0 0 0 0 0 0 0 0 
##$DE= 6
##$DECBNUC= <off>
##$DECIM= 32
##$DECNUC= <off>
##$DECSTAT= 4
##$DIGMOD= 1
##$DIGTYP= 9
##$DL= (0..7)
0 120 120 120 120 120 120 120 
##$DP= (0..7)
150 150 150 150 150 150 150 150 
##$DP07= 0
##$DPNAME0= <>
##$DPNAME1= <>
##$DPNAME2= <>
##$DPNAME3= <>
##$DPNAME4= <>
##$DPNAME5= <>
##$DPNAME6= <>
##$DPNAME7= <>
##$DPOAL= (0..7)
0.5 0.5 0.5 0.5 0.5 0.5 0.5 0.5 
##$DPOFFS= (0..7)
0 0 0 0 0 0 0 0 
##$DQDMODE= 0
##$DR= 18
##$DS= 0
##$DSLIST= <SSSSSSSSSSSSSSS>
$$ [...]
##$SUBNAM2= <"">
##$SUBNAM3= <"">
##$SUBNAM4= <"">
##$SUBNAM5= <"">
##$SUBNAM6= <"">
##$SUBNAM7= <"">
##$SUBNAM8= <"">
##$SUBNAM9= <"">
##$SW= 20.0188882624521
##$SWIBOX= (0..15)
0 0 2 0 0 0 0 0 0 0 0 0 0 0 0 0 
##$SW_h= 4006.41025641026
##$TD= 16384
##$TD0= 1
##$TE= 0
##$TE2= 300
##$TE3= 300
##$TEG= 300
##$TL= (0..7)
0 120 120 120 120 120 120 120 
##$TP= (0..7)
150 150 150 150 150 150 150 150 
##$TP07= 0
##$TPNAME0= <>
##$TPNAME1= <>
##$TPNAME2= <>
##$TPNAME3= <>
##$TPNAME4= <>
##$TPNAME5= <>
##$TPNAME6= <>
##$TPNAME7= <>
##$TPOAL= (0..7)
0.5 0.5 0.5 0.5 0.5 0.5 0.5 0.5 
##$TPOFFS= (0..7)
0 0 0 0 0 0 0 0 
##$TUNHIN= 0
##$TUNHOUT= 0
##$TUNXOUT= 0
##$USERA1= <user>
##$USERA2= <user>
##$USERA3= <user>
##$USERA4= <user>
##$USERA5= <user>
##$V9= 5
##$VALIST= <valist>
##$VCLIST= <CCCCCCCCCCCCCCC>
##$VD= 0
##$VDLIST= <DDDDDDDDDDDDDDD>
##$VPLIST= <PPPPPPPPPPPPPPP>
##$VTLIST= <TTTTTTTTTTTTTTT>
##$WBST= 1024
##$WBSW= 4
##$XGAIN= (0..3)
0 0 0 0 
##$XL= 0
##$YL= 0
##$YMAX_a= 836574
##$YMIN_a= -715115
##$ZGOPTNS= <>
##$ZL1= 120
##$ZL2= 120
##$ZL3= 120
##$ZL4= 120
##$ABSF1= 10
##$ABSF2= 0
##$ABSG= 5
##$ABSL= 3
##$ALPHA= 0
##$AQORDER= 0
##$ASSFAC= 0
##$ASSFACI= 0
##$ASSFACX= 0
##$ASSWID= 0
##$AUNMP= <proc_1d>
##$AZFE= 0.1
##$AZFW= 0.1
##$BCFW= 1
##$BC_mod= 2
##$BYTORDP= 1
##$COROFFS= 0
##$CY= 11.3945322036743
##$DATMOD= 1
##$DC= 2
##$DFILT= <>
##$DTYPP= 0
##$F1P= 2.36226072786647
##$F2P= -0.459571619588291
##$FCOR= 0.5
##$FTSIZE= 0
##$FT_mod= 4
##$GAMMA= 1
##$GB= 0.15
##$INTBC= 1
##$INTSCL= 1
##$ISEN= 128
##$LB= 0.24
##$LEV0= 0
##$LPBIN= 0
##$MAXI= 10000
##$MC2= 0
##$MEAN= 0
##$ME_mod= 0
##$MI= 1.114404
##$NCOEF= 0
##$NC_proc= 0
##$NLEV= 6
##$NOISF1= 3.799351
##$NOISF2= 2.8
##$NSP= 1
##$NTH_PI= 0
##$NZP= 0
##$OFFSET= 15.70392
##$PC= 1
##$PHC0= -13354.64
##$PHC1= 11.40099
##$PH_mod= 1
##$PKNL= yes
##$PPARMOD= 0
##$PSCAL= 0
##$PSIGN= 0
##$REVERSE= no
##$SF= 200.130013532006
##$SI= 16384
##$SIGF1= 3
##$SIGF2= 2
##$SINO= 400
##$SIOLD= 16384
##$SREGLST= <1H.CDCl3>
##$SSB= 0
##$STSI= 0
##$STSR= 0
##$SW_p= 3612.71676300578
##$SYMM= 0
##$S_DEV= 0
##$TDeff= 0
##$TDoff= 0
##$TI= <>
##$TILT= no
##$TM1= 0
##$TM2= 0
##$TOPLEV= 0
##$USERP1= <user>
##$USERP2= <user>
##$USERP3= <user>
##$USERP4= <user>
##$USERP5= <user>
##$WDW= 1
##$XDIM= 8192
##$YMAX_p= 0
##$YMIN_p= 0
$$ End of Bruker specific parameters
$$ ---------------------------------
##NTUPLES= NMR FID
##VAR_NAME=  TIME,          FID/REAL,        FID/IMAG
##SYMBOL=    X,             R,               I
##VAR_TYPE=  INDEPENDENT,   DEPENDENT,       DEPENDENT
##VAR_FORM=  AFFN,          ASDF,            ASDF
##VAR_DIM=   8192,          8192,            8192
##UNITS=     SECONDS,       ARBITRARY UNITS, ARBITRARY UNITS
##FACTOR=    0.0002496,     1,               1
##FIRST=     0,             0,               0
##LAST=      2.0444736,     0,               0
##MIN=       0,             -715115,         0
##MAX=       2.0444736,     836574,          0
$$ Real data points
##PAGE= N=1
##DATA TABLE= (X++(R..R)), XYDATA
$$ [...]
3267e443P427L157j1051L126R898q177n224R854k49q296N153K967o192K951L738
3282C639p374J683P935p104m500R945j79r477M482N967o491q65M878k859r25M004
3298B759l554k397O938j415p505N278N245p521j416O769j760l881L274j51j934
3313a271K947j073m197M614K573o579M23O442k727m852L781K381l325L4J167q84
3329e46J511j38l366K066L674l905k722M976R87m504K56L219p65j432J76n3J611
3346A045K36k902K56L733j344l456J977K702j802k215J194J952k8k498l52L100
3362A598L97l976O41L417r65k652J069J577k16q01j111M26K586j196l496K759
3378E7L298m047k027M212N01l233O66J007m36Q10p56j954L084J633n494M18O098
$$ y = [-5443, 1984, 5141, -5910, -2784, 7114, -1063, -6287, 3567, 3318, -4978, 175, 3142, -3050, -99, 3639, -3735, -2052, 5883, -1221, -5721, 4224, 4045, -5432, -950, 5017, -1474, -2339, 2539, -320, -1245, 2759, -795, -3192, 3746, 2331, -5174, 104, 5349, -2172, -3588, 3181, 1421, -2460, 814, 663, -1271, 1676, 603, -3594, 1020, 3593, -2986, -2563, 3879, 1152, -3700, 81, 2462, -863, -829, 338, -546, 965, 827, -2539, -473, 3201, -704, -3426, 1550, 2537, -1967, -1711, 1508, 743, -689, -513, -566, 1045, 1281, -1621, -1365, 2368, 1024, -2432, -455, 2247, 445, -1770, -576, 1376, 1348, -1150, -1502, 1598, 1995, -1981, -1340, 2077, 1112, -1540, -471, 1106, 890, 89, -1022, -596, 1990, 794, -2702, 57, 3355, -692, -2719, 1493, 1994, -1239, -573, 434, -2, 808, 52, -1902, 1182, 2815, -2679, -2261, 3837]
3395C837k713m901M309K145m118M78J959j619R43J461m296J030N654m526m192
3410d549O831J321p345K023N211l867j349L454k319p46M195l316l470P320m0q541
3426e187M175O726p158k852P584j584m970M563L49m444M314J299p413L994O470
3441E866q176k652R773k255q134O070L516o576J320M168n394J579N297o634j977
3456d209R673l555q878Q590M433j0042J024Q051n791k649O790l408l765P867k297
3471A834p974Q352M083j1414J780J0319o908n836R321o64p254O004J176p407N571
3486I83M187r949J819J0253q017o595J1702J85j0615N473N795q509J305O364p091
3501b710k45Q597o448n897J1218J54j2214O363Q333j0237j463R298m501m403P391
$$ y = [3837, 1124, -3777, 532, 2677, -1441, -963, 996, -623, 320, 1781, -2515, -1485, 4169, -357, -4549, 2282, 3603, -3742, -1719, 3492, -375, -1724, 1730, -589, -1335, 2860, -456, -3926, 3394, 3354, -5187, -1012, 5714, -1444, -4296, 3288, 1704, -3266, 1297, 1646, -2798, 1516, 2815, -4598, -604, 5866, -2310, -4962, 4811, 2556, -5578, 492, 4008, -2568, -1248, 2920, -2474, -895, 4402, -2232, -4209, 5464, 1909, -6969, 1621, 6054, -3988, -2964, 5087, -704, -3353, 3437, 29, -3736, 4131, 1834, -6140, 2212, 6295, -5119, -3339, 6980, 72, -5764, 3557, 2893, -4361, 1643, 2819, -4588, 983, 5170, -4779, -2960, 7293, -724, -7319, 4383, 4568, -6047, -574, 5221, -3288, -1983, 4381, -2710, -2955, 5642, -806, -6703, 4515, 4669, -7545, -1182, 7151, -3086, -4549, 4749, 248, -4155, 3236]
3516C236k558n616Q442K69j0369O312P823j1332j880J2341m718q122Q701J315
3530C844p977N169L031q391L995O849r737j604J2078n145r805J0207L563j0816
3544d739K850O986p097n12O811n939k221R082m062q279R565L515j2144L061R569
3559F446p546m162Q609k365n158O443o52o697O699K920j0170L151R386q426m677
3574f199J0021o88q133N142L262o167K715L370o496J872O729p256l478J0413k115
3589B992r165O477M967p974J88O213m513j417N295l922k811P378j795p710O364
3604E67M714q734j59P725l315m552M933k8l503L477Rm759M601K748p294J033P351
3621D814m668m625O129J316n233J716K319k903J220J864l963J287M618m662k874
$$ y = [3236, 678, -4938, 3504, 3773, -6596, -284, 7539, -3793, -5673, 6668, 1950, -6172, 2529, 3844, -4133, 1036, 4067, -4324, -329, 6520, -3217, -4821, 7257, 2112, -7693, 2514, 6077, -4739, -1889, 5097, -2000, -2512, 4299, -1640, -3861, 5221, 1159, -7120, 2445, 5960, -6184, -3123, 6446, -1100, -5262, 3347, 982, -4176, 2267, 1615, -5082, 1617, 4537, -5633, -2482, 6904, -1522, -6199, 3822, 3134, -4999, 143, 3405, -2762, -47, 3323, -3173, -1301, 5428, -1828, -5306, 5107, 2992, -6173, 304, 5271, -2703, -2515, 3698, -815, -2232, 3063, -859, -3670, 3708, 1913, -5797, 567, 5281, -3453, -3612, 4113, 798, -3754, 1179, 1151, -2352, 1125, 1134, -3625, 976, 3724, -3570, -2537, 4814, 146, -4479, 1650, 2966, -2267, -551, 1768, -1135, 85, 1949, -2014, -727, 3891, -771, -3645]
3636c645O140L99o270K209M151l211j294K531j087j98J793k729n68M279j421m416
3652c337L218L280m460j131L944n85k233J119J2m28J635j631j821L403Q19m169
3668b365O33L618j476k372J486J411r12m56p39J032J804k071j640K815J166l037
3684a103k55K574l07j476M0O03N80N1j821J0L212j076l313K125K551k802j237
3701a644K234R3q49Qo97P08J823k282j886M048O58m807J206L741k359k185K691
3718E01n8j260J505j246j398L596k35m619K717L969m767j651N089q81l633K593
3734B22P19k168J879K37l607L045K884n562p10O711k619n458N279K098n251J036
3750a265L398l317K54L344m098o11N999l251n103O168K493p361J445N631l955
$$ y = [-3645, 2495, 2894, -3376, -1167, 2984, -227, -1521, 1010, -77, -275, 1518, -1211, -1779, 2500, 1079, -3337, -119, 3161, -1299, -2430, 1514, 929, -1304, -185, -173, -601, 1034, -597, -2418, 985, 1804, -2365, -1732, 1886, 410, -1962, -476, 935, 23, -433, -1172, -140, 1664, -407, -2047, 768, 1934, -1103, -1358, 1216, 909, -567, -527, 76, 656, 707, -1114, -1104, 2108, 1032, -2281, -156, 2395, -407, -1644, 590, 683, -166, -158, -855, -147, 1676, -606, -2492, 1556, 2214, -2593, -1387, 2354, -5, -2190, 501, 443, -817, 688, -558, -1956, 1640, 1405, -3214, -497, 3472, -1295, -2946, 2143, 1262, -2371, 222, 941, -1227, 652, 889, -2718, 327, 3211, -2351, -3061, 3650, 1031, -4427, 852, 2950, -2301, -1265, 2133, -1184, -930, 2414, -1684, -2295, 3704, 453, -4650, 1518, 4011, -3350, -1905, 3726, -229]
3765b29k307M531j744k422M362j691m217N875J265p639K811O389o094l166P044
3780B768q26n212L883J225m567L364J996o278K343O230o619l120Q614j464p085
3795d748M740L884o315P76M368m382J23N060m811k396P568j906p488O073M516
3810E062q111lP290l843l657N667j657l631N227o19o064N279L682q104L03Q048
3826D869m201n365O730O55o025L563J918m496K511L106o154O91O883n161m674
3841e150P716R63p908L598M760n524l88M457l469q21N027l566l706O859K36p568
3857d484L707N740o443j877O404j892l617L729k07l337L708L86n399L215M551
3872D184o149j666P209k008n492M291K105m514J387K190l156J259K765m254p89
$$ y = [-229, -2536, 1995, 251, -2171, 2191, 500, -3717, 2158, 3423, -4216, -1405, 4984, -1110, -4276, 2768, 1942, -3270, 613, 1838, -2729, 635, 2631, -3647, -1304, 4926, -1693, -4813, 3801, 2337, -4748, -8, 3876, -2439, -1663, 2705, -1677, -1554, 3506, -1305, -3701, 3867, 1961, -5527, 546, 5062, -3049, -3052, 4238, 395, -3262, 2405, 748, -2883, 2344, 1725, -4339, 940, 4622, -3482, -3179, 4869, 668, -4697, 2033, 2688, -3337, 226, 2144, -2352, 159, 3265, -2889, -2198, 4685, -476, -5150, 2566, 3529, -4379, -781, 3979, -1545, -1933, 2524, -945, -1766, 3261, -305, -4011, 2848, 3084, -4484, -777, 4963, -1480, -3357, 3047, 1155, -2462, 1267, 1060, -2277, 1431, 1817, -3582, -367, 4184, -1965, -3631, 3578, 1570, -3922, 369, 2474, -2040, -653, 1537, -1619, -360, 2405, -1849, -2638]
3887b638N825k414n047N038K355n447N88L786k158j129K021j171n31K651j801
3902g2k536M217Q16n221J454M396l035k372L196M25k033R68J46j046J875jl148
3919a971J856L082l221j957L850J04k884M65J980n06p66P2k40J105J58k207J90
3936h90K792r67k542J430J772j338j138O47J050r2j446p4J620J79k118j14K070
3953H41j04j426j23R32N00r41j095J353J435j983j426K501R77k479k32K161l92
3970D99j119L64l14Q40R43k312l43K984l28l616J807L138k877j486K599k29j115
3987e65J330j001p19K697j155l363L450K525m816o95N158j644l717L145J265k981
4003a086J548Q27l075K418K209m824j42N746k779m664N249J777n666J256L875
$$ y = [-2638, 3187, 773, -4274, 764, 3119, -2328, -1740, 2046, -112, -1241, 780, -391, -922, 1729, -72, -2608, 1609, 2425, -2796, -1342, 3054, 19, -2353, 843, 1268, -765, 203, 349, -697, 1178, 1177, -1971, -115, 2967, -254, -2211, 1639, 1743, -1141, -676, 1304, 798, 32, 104, -136, 969, 1127, -1080, -890, 1902, 935, -1607, -177, 1595, 257, -881, -234, 816, 724, -722, -796, 824, 1003, -1115, -1229, 841, 737, -689, -812, 120, 620, -321, -1416, -63, 1372, -611, -2037, 464, 1441, -1038, -1270, 891, 499, -620, -256, -570, 270, 1213, -1099, -1442, 1542, 1214, -2402, -595, 2543, -334, -1820, 779, 550, -565, 765, -236, -955, 1742, 587, -2776, 674, 3199, -1617, -2312, 2846, 1202, -2515, 630, 1895, -1086, 462, 1289, -1786, 632, 2841, -1983, -2125, 3621, 842, -3822, 1427, 3204, -2462, -1206, 2669]
4018B669l117k20K670l193m99M955k935m349O246J193p085J924N959m966k270
4033c018N456j801l264M185j016l942M817J463p081K639O565o675k864P897j530
4048A831o094M724K208n719K819L057n951J508O093o246k900Q823k015p855O237
4063E20M140p921R91N991n041j520O249l949l539P607j208q004O469M734r287
4078c768O27Q421n336m138P124r07n518N584O24p010N020M517q724O48R106o280
4094a0n516Q919K82q053M722L882p128K156N317o954m28Q437n414o032R312Q02
4110D294r856M729O320p843r20P415m688l053P209l029n905P902J045r647M902
4125a125P165q809k151R323l663n927P116K68o681N317K612q062L360O549q088
$$ y = [2669, -448, -668, 2002, -1191, -1690, 3265, 330, -4019, 2227, 3420, -3665, -1741, 4218, -748, -3018, 2438, 637, -2627, 1558, 542, -3400, 1417, 2880, -4201, -1562, 5003, -1672, -4536, 3361, 1831, -4263, 461, 2669, -3050, -231, 2826, -3125, -1617, 4476, -1770, -4670, 4153, 2138, -5717, 520, 4660, -3261, -2270, 3721, -1320, -2840, 3409, -540, -4079, 3528, 2320, -5684, 785, 5519, -3768, -3141, 5280, -56, -4194, 2930, 2023, -3495, 2089, 2713, -4297, 723, 5240, -3484, -2836, 6270, -10, -5526, 3393, 3675, -4378, 344, 4226, -2902, -746, 4571, -2383, -2811, 5626, 212, -5820, 3492, 4294, -5562, -833, 5487, -2356, -3276, 4139, -549, -3602, 3607, 578, -5327, 2575, 3620, -6027, -1125, 6040, -2769, -4920, 4403, 740, -5187, 1929, 2197, -4484, 833, 3445, -4617, -1257, 5292, -2796]
4140b796k185J0006l394p807P574K585q034K866N225o609M74O287n628k469Q430
4155D525k899p469P585L287r431K137P534o467k363P163l021m309O773j123o857
4170d935O345L420r070J620Q584o419m367Q303j135o530N380J674o061L326L496
4185C631o821J359O949n805m170Q380m94p649M617M046o365P33M923m697o88N475
4201C424l938l417O931n82p283M763M509o895l18N892l002l132M737j201l225
4216b737M305o1n211L833L607o512k08O586l310m081N077N18m386K639J609l944
4232b276K036K772m669R2N430l290l774N375P94n115J826L112k956n3J969j918
4248f45k10K982k139k187M327n12m249K521K825l415p46K770r19j172J589r96
$$ y = [-2796, -4981, 5025, 1631, -6176, 1398, 3983, -4051, -1185, 4040, -2569, -2095, 4192, -1436, -3905, 4525, 1626, -5843, 1742, 5029, -4402, -2265, 5269, -1198, -3561, 3602, 581, -3728, 3045, 1922, -4935, 1410, 4830, -4240, -2620, 5964, -455, -4822, 3481, 2346, -4184, 1196, 2870, -3191, 135, 3631, -3190, -1831, 5118, -687, -4857, 3523, 3029, -4620, -3, 4043, -2322, -1589, 3334, -1363, -2051, 3424, -514, -3931, 3000, 2418, -4865, -102, 4407, -2488, -2806, 3086, 84, -3048, 1689, 488, -2737, 1568, 1507, -3704, 129, 3736, -2776, -2984, 3602, 292, -3789, 1288, 1806, -2580, 59, 1668, -2276, -240, 2532, -2137, -2045, 3385, 95, -3679, 1696, 2490, -2625, -799, 2313, -643, -696, 1273, -645, -855, 2127, -12, -2199, 2128, 1616, -2633, -112, 2713, -702, -1448, 1322, 403, -769, 820, -176]
4264a76q74K326o04k978K878J590l700K70L083j330j735J393K78p81P64o63p94
4281a053K008q6k600J442K187k505p87K193k62j181N12Lp6Q63q59j236K037O19
4299A219k701O65K496j765r08J475m69m35Q64q56l76J964p04k570K478J731l519
4316a411o5L441j781j618K390p30j113J625k27k350K463J526m093P22M075l081
4332b27k195M026l47l102K239O73k725K005J294l740J129L841l691k024N051p88
4348A419m734L541K085m421J339L074l899K66M005l376k188N607j146n434M468
4363F06L045o367Q72N180l961j724M822k170l304N204l49n741M414L543p113Q72
4379b171O737m955l295O223o78n532M668J746n912L063M212o558P8O989m714m340
$$ y = [-176, -1050, 1276, 672, -2306, 572, 2162, -1538, -1268, 1815, 485, -1250, 143, 421, -360, 404, -259, -1053, 955, 869, -1731, -289, 1898, -607, -1394, 799, 537, -644, -132, -129, -205, 658, -201, -1437, 600, 1219, -1482, -817, 1679, -86, -994, 481, 12, -423, 441, -415, -791, 1173, 469, -2101, 377, 2108, -1411, -1476, 1965, 184, -1434, 956, 226, -887, 738, 511, -1839, 624, 2150, -1943, -1221, 2854, -227, -2422, 1604, 1257, -1845, 394, 1067, -1658, 347, 1641, -2099, -970, 2871, -820, -2844, 2207, 1419, -3315, 226, 2311, -2110, -771, 2303, -1596, -1330, 2675, -701, -2889, 2718, 1572, -3862, 606, 3651, -2716, -1844, 3336, -625, -2349, 2473, 303, -3001, 2203, 1854, -3887, 527, 4070, -3043, -2171, 4566, -389, -3684, 2539, 1861, -3671, 997, 2743, -3169, -106, 4106, -2452, -2374, 4615, -99, -4439]
4395d439P472j81p046M294L886o415J235N059n413j081O676m006m419P652j14
4410C160p981M913M718p519J73O919m674l321O884k146n609O640J112p970M273
4425d28N642q087o24Q177m272n561P569J24o951M958K807p107K416O057p468j079
4441c827Q409l965o237P918J300q307L729N304o878n7O716n264k619P661k892
4456I91o087P056K230q788L291O504p054j465P251l413m387O816j056o045N742
4471A586K475q017K873O552p090k348Q340k677o059O515J099o793L927L602o766
4486b781J290O341o055k621Q017k296o652O030K853p449K162N035n395r25N795
4501C349m051k702O472j823n636N377K773p415J495O129n007k342O012k218l755
$$ y = [-4439, 3033, 2852, -4194, 100, 3986, -2429, -1194, 3865, -1548, -2629, 4047, 41, -4378, 3274, 3160, -4821, 92, 4810, -2709, -2536, 4383, -291, -3612, 3272, 1126, -4483, 2157, 3269, -4701, -428, 5214, -2873, -3497, 4680, 408, -5153, 2416, 2540, -4411, 547, 3354, -3753, -1337, 4720, -2748, -3827, 4582, 617, -5620, 2298, 3598, -4709, -980, 4324, -2554, -2611, 4105, -1159, -3778, 3883, 991, -5096, 1960, 4190, -4598, -1307, 5197, -1857, -3322, 3929, 516, -3871, 2945, 1889, -4156, 1586, 4061, -3956, -1083, 5469, -1621, -3969, 4371, 1694, -4365, 2150, 3249, -3544, 383, 3985, -2781, -1491, 4850, -1205, -3826, 4191, 1895, -4757, 1273, 4126, -3323, -1161, 3874, -1521, -2446, 3349, -702, -3404, 3068, 1245, -4391, 986, 3759, -3656, -2161, 3968, -1039, -3381, 2631, 413, -3342]
4516c342M914k56m841L985K448o061J357N609m741k632O102j087m920L973J813
4531B321m764K280K762m831J071M559m200k400O184j289n083M028K156m637R45
4546h98L432l186m25L395k452j787M325j179m115L461K190m643P80L655k808j368
4562a623L008j029j614K753j092k351K870R63l746J089L297l225j124L355q24
4577G07j936K110k15j794J859J87k569J733K155l408n24L356j195k101K279K65
4593I09j811J223m1j319J400O31k706P91K809k359j373K770j51k183J326O42j497
4610i39R03K97j759J283J674k579l56L270j551k381K547N36k269J209O61j564
4626a018J052J026k425O49K961k564k048L744O0l365K116J655l008Q44J891k531
$$ y = [-3342, 1572, 1316, -3525, 460, 2908, -3153, -1796, 3813, -928, -3560, 2542, 1455, -3465, 508, 2321, -2443, -163, 2599, -2232, -1161, 3398, -802, -3202, 2982, 1693, -3390, 638, 2794, -1843, -898, 2534, -652, -1077, 2318, -134, -1921, 2404, 1225, -2890, 571, 2761, -1882, -1102, 2553, -255, -1623, 1385, 356, -1258, 1495, 403, -1948, 922, 1885, -1861, -772, 2525, -700, -1824, 1531, 707, -1229, 881, 666, -1128, 731, 918, -1651, 82, 2237, -1171, -1695, 1661, 466, -1635, 644, 909, -902, 321, 280, -1039, 361, 992, -1714, -923, 1886, -473, -1846, 924, 773, -1410, -84, 558, -939, -36, 261, -1498, -215, 1459, -1120, -1476, 1794, 243, -2138, 409, 945, -1324, -115, 546, -1018, 34, 1060, -1365, -716, 2245, -319, -2367, 1377, 1437, -1928, 188, 1843, -1165, -321, 1570, -961]
4642i61M85K750k591j791M231o43l997K931K378m266N56L201k637o90K909j958
4658i3j711L863j015m002L804K152n343Q45M618l567j798M252j292k967L447L
4674A196l937L293K005n173J178M895m119k810N677p11m638L692J539m498K090
4689c21K821m640N34N181m260k940O327q22n831M105L378n681Q10M044l530j333
4705b158M904k644l184N592n76n923M290L704o311J97N833l852l021N420j232
4720A039l993M520M43n296L577L367o315K06O653m288l680O054j21n539L876K243
4736B746n156J557M263n472l97O369l875m263O562M96o510L329M089n738J37M878
4752C015l534j924N470k444m306N736N91o490L281M746n862j214O076k482m081
$$ y = [-961, -476, 2274, -317, -2108, 2123, 1480, -2517, 414, 2792, -1474, -918, 2283, -354, -1044, 1865, -93, -1804, 2059, 1044, -2958, 846, 2998, -2345, -1500, 3118, -449, -2247, 2005, 713, -2254, 1193, 1196, -2741, 552, 2557, -2616, -1438, 3457, -662, -3472, 2205, 1494, -3144, 548, 2087, -2411, -321, 2500, -2140, -1606, 3575, -685, -3625, 2702, 1880, -3951, 154, 3532, -2149, -1339, 2705, -825, -2158, 2746, 102, -3082, 2510, 1934, -3989, 301, 4005, -2306, -2109, 3724, -128, -3149, 2271, 1039, -2954, 1566, 2009, -3287, 290, 3657, -2658, -2452, 4201, -87, -3767, 2287, 2166, -3373, 503, 2746, -2410, -853, 3410, -2062, -2459, 3910, 35, -4228, 2334, 2830, -3680, -351, 3738, -2000, -1863, 3015, -519, -2443, 3027, 583, -3723, 2013, 2604, -3886, -605, 4141, -1721, -2935, 3141, 659, -3422]
4767c422N156k13m570M145J434n739K226M946n687j416O414k221m892M739J696
4782B596n184K036L036m603Q98M234m378j307N790k318m634N027K056n944J297
4797a398M409l800j044M142k329k304M422j093m181M160K031n615J200N052l815
4812a63k738M872q84l400L037Q14l428K183J989m192O59M303l368k529M708p7
4828A786m229K433K039l464O64K408k482j8K759k318j822L900k15m017K331K567
4844B322l602l22L165j377j453K020p95j319K239j66k678K037J934l256m22L422
4860A749j277k227J971P38j635P18N29j294Q36J001k024k5K641j102k238K152
4876E13Q71j876k60J424l52m12K60j79oP01o46p69J219L67j324p9J368l18j057
$$ y = [-3422, 1734, 1521, -3049, 1096, 2530, -3209, -983, 3963, -1724, -3140, 3274, 1053, -3839, 900, 2596, -2588, -552, 2484, -2119, -1221, 3013, -1365, -2672, 3118, 800, -3834, 1193, 3249, -2695, -1398, 3011, -789, -1833, 2309, -20, -2324, 2098, 1005, -3176, 984, 3015, -2600, -1400, 3652, -163, -2901, 1971, 1087, -2313, 724, 1538, -1890, 293, 2282, -1910, -1251, 3052, -316, -2845, 1863, 1786, -2443, -10, 2029, -1435, -771, 1637, -845, -863, 1896, -422, -2244, 1656, 1441, -2576, -245, 2322, -1280, -1602, 1563, 186, -1267, 753, -42, -1361, 878, 712, -1966, 71, 2005, -1251, -1673, 1749, 472, -1755, 216, 954, -681, 37, 566, -728, 108, 1109, -915, -940, 1701, 599, -1639, 513, 1384, -492, -752, 672, 320, -92, 168, -11, -17, 684, 38, -731, 488, 855, -469, -548, 820, 502, -555]
4895e55J97P03J10p96o3K13L75k46o10O37K83l21o26M19R21n94j062Q77R71j037
4915b04q12J324L80q16k07M98l5J48k24p40N85J177j471p42K084o8k133R28J466
4934A138j269m50J163o87j22R43q95q71K293k83k705J796J892k653p72K771q07
4951D82j761J773L93j904J643M58k397J262K173k999o12L542j121k971K614J161
4967A736k812O69J988k167k0K204k096j052L609j303l475L491J555m457J069L580
4983B519k996j146L420j478k334L423p98l115L412J449m702Q50M559l491k518
4998b946M498j64l932L014J316l914K125K247m282P01M480l658k713N399k22n289
5014c340L430K857m827O73L836l478p52M110k312k926M829K21n532L270L527n310
$$ y = [-555, -358, 345, 455, -341, -404, -191, 184, -62, -672, -35, 248, -73, -699, -280, 641, 47, -1015, -138, 833, -204, -1016, 308, 688, -128, -335, 163, 128, 276, 52, -688, -103, 1074, -397, -1139, 945, 877, -1256, -328, 1138, -131, -581, 582, -105, -227, 716, -179, -1050, 1243, 960, -1745, 51, 1943, -710, -1482, 1289, 482, -1279, 494, 887, -1017, 626, 1084, -1313, -51, 2122, -877, -1489, 2053, 932, -2039, 575, 1736, -1076, -407, 1581, -586, -606, 1598, -498, -1550, 2059, 756, -2719, 772, 2327, -2130, -1061, 2519, -477, -1623, 1797, 319, -2015, 1408, 610, -2505, 907, 2356, -2346, -1496, 3063, -428, -2946, 1552, 1388, -2544, 470, 1786, -2128, -3, 2244, -2038, -1337, 3143, -515, -3228, 2171, 1949, -3340, 90, 2947, -1880, -1207, 2629, -849, -1601, 2509, 197, -2729, 2100, 2321, -3211, 59, 3586, -1724]
5030a724l18N132k835k669M371p93l641L773P42m777K743L536n570l97O034l007
5046F00m109N148O99n181K723K631m739J239M110m593j182N781k592m466N546
5061A615J293o282K491M127m475p17M370k810k137M717j336m311M734J501o070
5076c290K168M738m638j803N364j764l631M165L44m097L093J894n048J301M727
5091C523m456k050N927j543m701L852K079m666J463L037l847J80M201l409k217
5106b627N376j364m804M177K428n472J055M006l107j620L859j734k421M107n91
5121A268m401L671K345n172O05M786l358k553M396k59l447K583J027l314K131
5136C08J838m045P99L923l328k231M397N0m088K175K036l072N84K256k561k45
$$ y = [-1724, -2042, 3090, 255, -2414, 1957, 1164, -2477, 1296, 2038, -2739, 4, 3540, -2030, -2427, 3607, 600, -3509, 1639, 2338, -2843, -120, 2511, -2228, -989, 3121, -1472, -2654, 3127, 535, -3931, 1615, 2908, -3374, -883, 3244, -1231, -1948, 2422, -388, -2525, 2192, 856, -3455, 1279, 2780, -3290, -1122, 3616, -1022, -2825, 2539, 775, -2856, 1309, 1653, -2444, 649, 2543, -2505, -1204, 3523, -933, -2983, 2944, 1401, -3300, 552, 2631, -2035, -572, 2465, -1382, -1202, 2999, -410, -2627, 2749, 1385, -3419, 758, 3186, -2286, -1231, 2775, -332, -1952, 1907, 173, -2248, 1859, 1268, -3133, 538, 2883, -2289, -1684, 3102, -256, -2809, 1587, 1328, -2119, 464, 1491, -1823, 308, 2146, -1899, -1100, 2823, -505, -2736, 1661, 1711, -2377, -202, 1834, -1238, -654, 1602, -959, -1204]
5152a204L202k398j785L815j29m068K487K417l631k1K908j706j199K478j218j373
5168a425K493l31k839K319J843l411j12L328j381k256K492J20j959J491J53j662
5184a137J518Q99k574L81K840j690j921K503M34k226P70Q81j020K32O57j235N48
5201a40J387j727p17K349l98k152J432J007j415j18P23n08K14N34j363M55J491
5218A054j408q24J704N53j975L16J308q48j16K34n69Q59L02j191L5J761r03j619
5236a327J417J025j699M0J201p95J66L26j011M12J565j706q73K134R0k403J213
5253b25J669j778j74J164r10Q6J403j670m53K338j051k235K281J470l017J77K474
5270A549j469j211J923p45j201K432q21k297K536J036l424P00L159k265j788K922
$$ y = [-1204, 1998, -400, -2185, 1630, 1501, -2567, -80, 2337, -1294, -1315, 1593, -113, -1312, 1166, -52, -1425, 1068, 737, -2102, 217, 2060, -1351, -1463, 1865, 484, -1772, 720, 840, -1119, 372, 525, -1137, 381, 1280, -1294, -913, 1927, 237, -1684, 819, 1253, -973, -203, 678, -342, -110, 547, -688, -140, 1247, -480, -1197, 1152, 754, -1398, 34, 1041, -374, -492, 231, -277, -63, 471, -892, -437, 1054, -354, -1178, 526, 1079, -896, -580, 728, -120, -236, -2, -571, 288, 590, -601, -566, 1195, 292, -1327, 90, 1115, -584, -544, 657, -138, 28, 354, -657, -245, 1320, -386, -1259, 875, 965, -1438, -225, 1444, -334, -508, 656, -254, -168, 1235, -435, -888, 1450, 399, -1836, 445, 1915, -1102, -925, 1549, 80, -1131, 792, 47, -1154, 1278, 457, -1840, 696, 1732, -1692, -992, 2167, -98, -1886, 1036]
5286A036k19k368J855M29k233J862Q92l177J060L229l022j678M097n89l511K482
5302A45J650k959P98J867k508K57K913k753j544M236q45m163L075K216m083L00
5318a398L534k500j024K934j566j965L668p17l935L441K229m719J41M560k681
5333Bk503L829j57l264K764P41l339J979K357m303Q9M884k936l207M647Q8m173
5350b502K314K433l634P99K489l001k73L987k876k583M889N4n108K597L517m390
5366a288n18M184k682j465L511j447k729M058K63m959K778L637m971q49N093j877
5382G39l351L708K19l477K796R98l718J939L102m481p01N167k199l811M234J125
5398B289m382J617K521l092K40L038l164r26M379k074l543M384J339n221J596
$$ y = [1036, 817, -1551, 304, 733, -1500, 362, 1254, -1923, -863, 2366, -656, -2334, 1763, 1174, -2337, 145, 1795, -1164, -366, 1501, -1007, -750, 2163, -590, -2134, 2102, 1257, -2906, 169, 2385, -1698, -1398, 2136, -364, -1388, 1546, -20, -1985, 1683, 966, -2969, 472, 2701, -2018, -1877, 2683, 2, -2501, 1328, 1171, -2093, 671, 1412, -1927, 52, 2409, -1894, -1805, 3079, 143, -3064, 1583, 1671, -2502, -188, 2245, -1389, -590, 1899, -1102, -1375, 2612, -264, -2847, 2042, 2096, -3012, -415, 3102, -1288, -1806, 2378, -304, -1769, 1742, 295, -2434, 1624, 1887, -3072, -294, 3343, -1628, -2477, 2616, 739, -2612, 1096, 1315, -2162, 634, 1632, -2086, -147, 2955, -1526, -2227, 2940, 741, -3070, 1164, 2289, -2093, -476, 2045, -1047, -807, 2231, -933, -1859, 2520, 446, -3097, 1287, 2626, -2595, -999]
5413i99L507l126j210L488j764j645L212r31k851L282J151m615J576M098l815
5428f42j721M202p83l147K696O70k883J930J452l543J505L160l700j441M517j021
5444A251l662K754J661l069L46K309k206L9K233k256q56L331j282l060K932J548
5460B013l583L26K867j662j092J951p68j231K242p20k263K599J061l358O33K963
5476A978k039j528K408j49j722J261J50j253J586J29k237J245K170k516j004K775
5492A254l11k068J143R27j345L21N15j087Q94O64j640j29K269q59j952J566J120
5509A282j758k26J227n80m5M82j219P23J043j345q33K071K8j773M85J124q27j87
5527c28N23m75N22N95j544J79J743q27j760J860Q79j743j6R36j88l38K75o43L66
$$ y = [-999, 2508, -618, -1828, 1660, -104, -1749, 1463, 532, -2319, 963, 2114, -2501, -925, 3173, -642, -2363, 1839, 1056, -2091, 605, 1275, -1608, 322, 1774, -1769, -264, 2896, -804, -2245, 2272, 1251, -2411, 343, 2004, -1065, -719, 1590, -616, -577, 1656, -600, -1456, 1875, 593, -2467, 465, 2013, -1570, -1244, 1623, -39, -1131, 820, 52, -1179, 1063, 343, -1920, 679, 1740, -1618, -985, 1978, -61, -1589, 819, 670, -1052, 209, 359, -894, 692, 821, -1416, -171, 1999, -517, -1521, 1254, 943, -1125, 18, 945, -400, -79, 436, -651, 243, 907, -733, -862, 1407, 548, -1404, 162, 1282, -476, -702, 525, -55, -100, 382, -837, -114, 929, -416, -1249, 822, 850, -923, -438, 686, -141, -328, 195, -280, 242, 837, -707, -528, 1215, 388, -1372, 488, 1367, -376, -392, 544, 356, 18, 293, -350, 16]
5546A6J234j597p12K227k37k084R92J307j172m50J074o42Q7N88j103j47J861r09
5564C33j959K135R42k572K67J994j201q82J349m38o55J394p58j382K221N17l165
5581a860J130K767k483j200K667k40k017J460M01j740J569O01k647J142K616l145
5597i79q62L558o97k932K077J463k533O56J444k056M31K117k421p53L456j118
5613H51l161K887J669l700M72L148k388j020K699j612j191K813o81l200L092J832
5629B510m484P22L827k602k185L619n41k731K614L04l035K404J604l774O23M163
5645C038l281k433M391K9m069K372J987l359P45K488k869j44L710k814k193M210
5661A808J17m695K542L057m269k12L923k389j708L396j393k347L671j10m091K642
$$ y = [16, 1250, -347, -1059, 1168, 931, -1153, -161, 1146, -26, -476, 598, -44, 43, 631, -472, -619, 1242, 333, -1626, 509, 1451, -1121, -854, 1140, -61, -943, 406, -32, -687, 707, -51, -1433, 788, 1305, -1860, -730, 2037, -446, -1646, 1021, 781, -1236, 224, 625, -1115, 454, 1055, -1592, -450, 2166, -979, -1841, 1717, 1020, -1912, 165, 1628, -905, -249, 1195, -861, -430, 1687, -734, -1487, 1969, 851, -2310, 577, 2246, -1454, -982, 2166, -222, -1242, 1457, -155, -1346, 1467, 786, -2414, 678, 2510, -1974, -1252, 2575, -27, -2212, 1407, 866, -1865, 749, 1053, -1982, 422, 2026, -1748, -1125, 3038, -243, -2676, 1715, 1744, -2325, 47, 2034, -1325, -580, 1908, -961, -1105, 2605, -209, -2402, 1808, 1925, -2770, -228, 2829, -1440, -1652, 2271, -118, -1826, 1570, 177, -2170, 1501, 1391, -2700, -58]
5677e8K978m549o04M977k485k784L838k54l194K655J017l693J911K840m123m82
5693b010M758k414l479M319Q04m215J793K570l353K00L179k871j137M271j822
5708E93l487M091J046m789J572L842l457j245L768j655j993L085m12l238L211
5723I32J099m219J340L879l564j882M429r15l343K778R39l076J709J541l381Q63
5739h71L447l397j567M593j014l870K916J819l539M62K541k229n20L034k103j694
5755a992L575o41l561K790K101m055L04L486j898j997K722j95k138K083K83k778
5771a911J951J871l276O5L397j846k427L080M96k668J162J139k030Q80J372k148
5787h93J32K621j807j782K679O21l067R54K091j930q03J827o55p52J674r67j279
$$ y = [-58, 2920, -1629, -2233, 2744, 259, -2525, 1313, 1059, -2135, 520, 1537, -2156, -245, 2595, -1528, -2010, 2748, 334, -3145, 1174, 1978, -2237, -444, 2126, -1227, -1027, 2152, -719, -1856, 2415, 593, -2894, 1197, 2243, -2546, -974, 2868, -589, -1834, 1934, 279, -1714, 1371, 959, -2279, 932, 2031, -2188, -848, 3031, -533, -2415, 2014, 1099, -2244, 534, 1473, -1603, 106, 1647, -1734, -871, 2576, -821, -2388, 2205, 1191, -2679, 237, 2056, -1483, -1021, 1520, -709, -1229, 1805, -298, -1992, 1583, 942, -2619, 171, 2272, -1783, -1479, 2007, 109, -1888, 834, 639, -1499, 584, 867, -1911, 40, 1911, -1365, -1300, 2097, 251, -2176, 904, 1400, -1268, -106, 1033, -997, -117, 1255, -893, -761, 1860, 53, -1729, 950, 1571, -1496, -542, 1549, -381, -1184, 643, -12, -764, 910, -57, -1336]
5804a336K166J90k560J223J873j869j184K327q6j772J236L6p88Q41J21j555J056
5821h1J272j774n01K030k14k121J174J220j213l63R08n81K69L58q68J02J137m88
5839B66j251R81Q94j404l30J234R9p65j58K85L83P4n91j01P38J38j219J51J160
5858E84m63q53K61R53l72m61q9N67J65p61N9N32J51o11o7K55O74m24q28M85R72
5879G29p56p30J021M33j150q8Q64j9l64o4k50M43K77n71p05J340K67j706N31J509
5899A011q09j250J416J28r31L40O4n61R64O0j472P07J831j779j022K197O2j944
5917i88N88J111j023K60M84o73Q7J187j666n89K492p11k252J612J600k318o1J701
5935H41p66r16J308m54r32J932p17k047J901J483k824O1K726j059j921K008J44
$$ y = [-1336, 830, 1020, -1540, -317, 1556, -313, -1497, 830, 744, -1028, 208, 244, -544, 297, 418, -1137, -81, 1191, -583, -1084, 946, 732, -1389, -215, 1005, -208, -571, 337, -244, 25, 383, -485, -383, 754, 266, -985, -4, 890, -514, -844, 390, 489, -276, -434, -149, 234, 308, -283, -384, 354, 492, -727, -576, 584, 121, -732, -471, 482, 110, -351, -440, 127, 292, -469, -410, 122, 273, -338, -405, -150, 524, 100, -728, -243, 729, -27, -757, 264, 697, -453, -541, 323, 304, -60, -124, -374, 69, 346, -225, -930, 410, 677, -1029, -498, 1011, 202, -1048, 368, 496, -435, -95, -31, -592, 372, 432, -1040, -333, 1498, -281, -1303, 894, 956, -988, -400, 711, -312, -52, 432, -241, -154, 1033, -633, -1222, 1270, 559, -1693, -81, 1519, -799, -860, 841, 75, -841, 467, 13, -919, 1013, 296, -1751, 150, 1633, -1191, -1130, 1596, 537, -1384, 624, 768]
5952G68j500Q87M68j534J169J207k533q8K946j632k230K750P76k783Q21J745j790
5969e53JJ556j751j54K367j644j936K904N72l355J209K561k304r82K386p19j314
5986a156J774m87j565K416J62l082J682K435k866j042L286o54k507J946O97k015
6002i76J271O07j904R34K067k704r02L540q53l181K404J633l011N78J892j572
6018a77n61J995j538r05K655r00k590K520J348l391L82L002j832j512K136l91
6034B41j232J517k19k104K279R31l021O46K875k207j767L006J99k316J087Q84
6050G99j500N30J049j859N67K168k119j484L182pk958J208K000k078k27J474p82
6067c7m84J313j003j091K338k67k615K003J582k621m29K396p08j449J117Q3q05
$$ y = [768, -732, 155, 623, -911, 258, 1465, -1068, -1156, 1790, 158, -2072, 678, 1454, -1329, -508, 1237, -553, -552, 1004, -747, -901, 1466, -178, -2114, 790, 1362, -1993, -784, 1777, -527, -1509, 877, 158, -1156, 618, 131, -1434, 982, 1144, -1938, -256, 2179, -687, -1729, 1557, 903, -1604, 342, 1039, -976, 295, 902, -1002, -68, 1999, -705, -1607, 1933, 1080, -2101, 303, 1936, -1075, -497, 1395, -177, -738, 1257, -281, -1186, 1469, 569, -2021, 499, 1847, -1544, -1162, 1840, 8, -1504, 632, 241, -991, 526, 307, -1797, 482, 1413, -1608, -962, 1913, -294, -2061, 945, 1144, -1172, -85, 799, -701, -171, 878, -981, -414, 1754, -365, -1849, 1333, 1326, -1632, -424, 1576, -502, -729, 745, -37, -521, 792, -211, -1302, 1036, 769, -1846, 157, 1739, -882, -1311, 1085, 377, -1072, 45, 128, -677]
6084f77J024j90j447J660R78k347o6K412j071j582J516P38j463L66N03n02M25
6101B77M93j452K86K063j502j474K226M88k001J69J180l63n68N36k74K32M73j229
6119d40k40J710k13j952Q66J524j422p65J183m6j84j38l02L09O46q10o42J426
6137E10K85j560j67J482k19r57K62O36m2l44m37J88J167n74j282J111P23j132
6155c50m63R06L13l52m69K33N00Q5q70j21J456l22j389L85J381n28q00M89J69
6174B53j6j09n92K67J181j059j052J497Q02j938K57J312m65p58K86L37n1J35m36
6193a49m86J393P0j895M53K005j430j247J764J34j187M70L25n46Q21k18j214R80
6211D3J394k113q43K771n90j971J023J316j389j47O99l50o0J117j436l83K343
$$ y = [-677, 347, 157, -1290, 370, 1348, -999, -1065, 1347, 276, -1306, 210, 948, -515, -149, 354, -148, 277, 770, -682, -396, 1667, 165, -1309, 917, 1405, -596, -427, 753, 390, -178, 358, 84, 316, 789, -440, -680, 1030, 817, -1135, -269, 1255, -167, -932, 251, 205, 21, -117, -419, -110, 536, -274, -916, 510, 795, -765, -932, 550, 331, -626, -364, 272, 230, -114, -551, -363, 804, 230, -1052, 59, 782, -350, -813, 93, 406, 54, -415, -182, 318, 403, -467, -588, 868, 546, -843, -458, 923, 395, -405, 84, 253, 237, 128, -464, -197, 984, -75, -1127, 370, 1172, -766, -509, 803, 338, -420, -134, 203, 152, 287, -149, -635, 758, 828, -1067, -614, 1391, -39, -1286, 478, 612, -575, -105, 220, -326, 495, 277, -937, 43, 1437, -676, -1519, 1252, 662, -1309, -286, 1030, -359, -506, 193, -157, -217, 900, -536, -919, 1424]
6228A424o53k506J884J580k526k38K063q92q05J039l62o01J499o54j853K008J031
6245A438k960N66K721j583j635J924L95j671P50O90j543J282O61k296O50K725
6261B114k325j956L355M6k565J001J529j816J47J264j303L0J750j678j335L012
6277A270j35l026J642K202k633n71K268q23j166J525n96j148K063k03k397J906
6293A78J810l021m86L173j074k249J991P22j931R73M63j713J140J407k537j19
6309a273L180j804k367K745J046k878O51K091j900j99J833j571m80K307j441j891
6325a951K634P44k947O04K759k104j199K540o66j379J748n15j368J889L94k719
6341a536J156K587k565j210K828l15k228J395P09j423N39O32j626Q76J844k411
$$ y = [1424, 771, -1735, 149, 1729, -797, -1035, 1028, 136, -669, 370, 8, -593, 906, 252, -1601, 407, 1438, -1522, -956, 1765, 182, -1453, 471, 866, -805, -55, 635, -908, 374, 1035, -1261, -611, 2114, -211, -2167, 1188, 1234, -1331, -330, 1199, -617, -470, 794, -509, -479, 1271, -407, -1742, 1270, 1135, -1891, -249, 1953, -680, -1251, 1017, 194, -972, 553, -43, -1191, 872, 669, -1728, 178, 1988, -1033, -1519, 1654, 580, -1669, 322, 1044, -887, 86, 549, -1164, -24, 1383, -1154, -1273, 1907, 103, -2264, 481, 1527, -1351, -700, 1391, -509, -708, 1125, -446, -926, 1381, -60, -1951, 683, 1427, -1520, -916, 1843, -261, -1460, 1080, 414, -965, 783, 268, -1100, 789, 1183, -1536, -380, 2207, -358, -1568, 1260, 945, -1283, 112, 821, -602, -63, 569, -1057, -181, 1663, -748]
6357g48n73K929j059k477J794J480k200J30J532j101m08J326j161m49K054q93
6373A76k104K128J331k668J19K192j320r64J428N7j035J083m65j033J678N00k289
6390a186M14K351j390j531J813M39j483M82O10p15L19K81j040N33J372j648q59
6407a238K143j00j822O75J303j034m50O51k82j5P87j168M1J462q79j405J378J124
6425A171j919OJ194Nr38K71q0K99L57p06k59J022L06j789P47J099p63q26P08M79
6445C84n03n7j66L32N22o06o79Q46O58j396l8J136k09n70R2K10K26j37n50J88
6465c17R42m33j231R22J040j089o78J077K88o42j01K4L00M53o95o94J252L83j493
6484f92lJ596o95j088Q48M55m49N2k4m03J026k83j136O76J315j542o62J755K9
$$ y = [-748, -1321, 1608, 549, -1928, -134, 1346, -854, -724, 808, -293, -701, 625, -536, -985, 1069, 176, -1928, 200, 1531, -1137, -1018, 1174, -146, -1110, 318, 375, -660, 423, -42, -1075, 603, 1103, -1186, -772, 1579, 189, -1342, 471, 910, -573, -91, 519, -196, 123, 404, -636, -103, 1269, -379, -1238, 905, 805, -1017, -342, 961, -73, -523, 128, -154, -169, 618, -550, -509, 953, 74, -1331, 47, 1171, -748, -742, 452, 457, -481, -210, -290, 9, 366, -340, -599, 423, 729, -1060, -313, 786, 23, -803, -95, 384, -119, -176, -342, -10, 512, -94, -773, 73, 731, -665, -703, 433, 224, -346, -254, -44, 182, 45, -505, -317, 625, 192, -1039, -117, 923, -166, -844, 233, 521, -121, -222, -198, 102, 555, -140, -834, 418, 801, -692, -695, 901, 206, -882, -34, 421, -28, 24, 0, -403, 623, 340, -796, -120, 1195, -347, -1009, 746, 775]
6503G75j602P03M86l22J40L20j019O11Q61j606k53K235o92k139J660J068j855
6520f29L57Q94q87J3Q83j013j87J688q97j874K139R47k660N28J782j338r13J691
6538E24l84r78J278j46j620J867L53k457Q57K253k048j195K575k64j759J315M78
6555F49j407Q52O80j692O65K002k382q55L054p54k552J912J313k275M10J527j595
6572d48o9J901j604r92K728q72k545K378J451l012P3K824j797j336K213m54j734
6589a295K049j39k281K033J296l272M37L317k073j974K858J5k508J482J030k180
6605a205R82J672k543J26K802k075j800L017M05l223J543K079k570L8J985j466
6621b33o93K247j372j525K798r7l221J954K175k832o42K976j324j455K032k36
$$ y = [775, -827, -124, 362, 40, 180, 500, -519, 92, 953, -653, -906, 1329, 637, -1502, 158, 1226, -629, -272, 622, -265, -252, 631, -382, -569, 1119, 222, -1652, 487, 1434, -1226, -698, 1084, -254, -1167, 524, 140, -838, 440, 294, -1326, 541, 894, -1563, -706, 1547, -501, -1696, 879, 615, -1144, 171, 649, -758, 94, 774, -918, -253, 1749, -633, -1488, 1566, 812, -1740, 172, 1485, -790, -380, 1147, -448, -517, 1384, -220, -1212, 1516, 644, -1901, 477, 1928, -1084, -1011, 1813, 16, -1320, 893, 439, -1295, 754, 615, -1666, 367, 1663, -1609, -1172, 2145, 72, -1902, 956, 971, -1537, -55, 975, -1205, -223, 1449, -1094, -968, 1834, -241, -2041, 976, 1381, -1842, -299, 1780, -790, -752, 1233, -233, -926, 1321, -51, -1576, 1222, 1125, -2096, -142, 2033, -799, -1441, 1535, 211, -1244, 788, 552]
6637E52j908K017N04k644J362K077l036n07L490j432k520K553O35k483J204J179
6653A043k073O74J782k240l33K889j402k405K828Q07k957P91K266k100l37J887
6669A120j343o79K204j051j870K524M21k738P79K686k286j123K378m59j598J541
6685E06J09j678J566N01k377J112J999k302j044K826m07k426J657R69j863O69
6701a83R32j486M44J550j967n99K421n16k403K077R82k071J3J710r66o00J426
6718G64q59o41J570m71j651J772Q62k226P0K113j127j121J247R9q54Q13p4r15
6736f29J026L81j607M33J692j458j112K125o1j620P36M30o39L50K93q16M00Q69
6754G93j217n81J864m96j552J107Q96j188j78O22M5k56K83m37j93J160n57j128
$$ y = [552, -1356, 661, 1165, -1479, -117, 1960, -1076, -1583, 1907, 475, -2045, 508, 1143, -1340, -136, 1043, -1030, -356, 1426, -814, -1147, 1742, 340, -2065, 763, 1570, -1387, -596, 1670, -430, -767, 1120, -223, -902, 1302, 251, -1619, 905, 1326, -1412, -633, 2053, -233, -1356, 1022, 563, -1035, 506, 615, -1063, 503, 1004, -1373, -261, 1738, -564, -1608, 1218, 811, -1615, 42, 1011, -852, -183, 749, -737, -293, 1257, -710, -1309, 1112, 596, -1807, 270, 1252, -819, -806, 904, -62, -662, 764, -95, -736, 834, 363, -1288, 484, 1346, -880, -810, 1303, 176, -945, 302, 401, -453, 360, 286, -629, 397, 778, -829, -396, 1296, -162, -1274, 851, 790, -830, -94, 336, -303, 47, 340, -476, -76, 793, -424, -1005, 859, 363, -1189, -82, 814, -374, -552, 70, 115, -141, 142, -295, -488, 672, 115, -1013]
6772a013J203P56j492j5J207l64p01O05j56j28M07m99k02J115l46j201N79J073
6790H28r35m67O80J26k15k16K10K9M58m31o84R31M61j292k9J189l98p08M09K76
6810B22r4j70k26K5P20k61q36N20Q36j022k94P58J46n59k2J98J26J39l06m71Q45
6831B74K42j248J71J412q47p97Q24L02n29j47K05q9M97j20n98L60J037j171o78
6850i00J451L6j215O03N10o36p8M03j56M8N16j055k09J632n00j502J170R16j420
6869c86j54J078m16l44L93k97j82R04m41j049J227O01j629M2J715q87q96R27N7
6888B63p74N43J03p62R91L63j695N90J502j062j207J577L18j647Q77O55q29J10
6906h4O19j070J29J380j232o52J726n1j963R48J440j521j78J073o48k01Q57q39
$$ y = [-1013, 190, 946, -546, -561, 646, 282, -419, 186, 30, -98, 309, -190, -392, 723, 377, -824, -245, 828, -107, -574, 106, 232, 17, -199, 11, 40, 498, 67, -617, 314, 775, -517, -546, 643, 245, -463, -54, 222, 128, -42, -268, -243, 477, 216, -620, -100, 736, -286, -580, 178, 324, -235, -257, -59, 67, 206, -100, -571, 274, 516, -732, -561, 851, 4, -793, 31, 333, -196, -343, -138, -227, 270, 150, -448, -88, 949, -222, -900, 551, 587, -628, -25, 485, -151, -229, 174, 18, 66, 582, -473, -682, 950, 450, -1052, 118, 1034, -386, -540, 538, 122, -222, 171, -126, -308, 596, 155, -894, 333, 934, -695, -653, 1062, 175, -721, 206, 263, -511, 32, 135, -627, 364, 727, -968, -378, 1124, 62, -1145, 432, 750, -897, -20, 635, -194, -84, 535, -535, -406, 974, -258, -910, 816, 765, -1198, -250, 1190, -331, -509, 564, -84, -285, 572, -267]
6924b67m79J452j75j641J209J032j725l66J747n83j094J143R3r67Q06Q1j169J118
6942B15P43j725j04J922r98j199J579M01j551P96M90q38K47P46j342M6J746j180
6960fj150J934K21j989R05J201j309k79J170o56l29R39o34q07J539O7j656O51
6978a88J161j419k97J374m06r30R80r0q61Q66K81j189N67J041j269k85J502n16
6996C22j276R68M82j105L89O42q98K88Q38j103k24J363m30j133J184M27j352K87
7014c31R48o20m23P66l61k14Q09n15q13R75K37j084K89J197q47o77R23L4p06O47
7034B34j39k12K26K49q79N74P37j022m52J107r3r54M81M38m60p9K36j96K59K89
7054C44q57J86Q75m02q56Q32L03n85j22M63j12o4J25l47Q8M75l74l85O92J03n51
$$ y = [-267, -746, 706, 531, -1110, 99, 1131, -594, -960, 787, 204, -890, 253, 346, -621, 185, 266, -903, 215, 958, -767, -871, 1051, 53, -1146, 433, 834, -717, 79, 569, -269, -22, 724, -618, -572, 1174, -6, -1156, 778, 999, -990, -85, 1116, -193, -472, 698, 42, -287, 652, 18, -789, 750, 817, -839, -188, 973, -446, -743, 631, 225, -705, 275, 185, -676, 190, 471, -718, -151, 890, -379, -664, 838, 322, -954, 14, 496, -609, -220, 422, -476, -188, 650, -453, -677, 686, 256, -877, 307, 734, -618, -331, 617, -3, -426, 340, -21, -235, 574, 59, -754, 221, 458, -626, -337, 860, 13, -664, 259, 293, -413, 234, 95, -117, 109, 358, -521, 53, 790, -232, -684, 423, 330, -624, -143, 295, -165, -244, -8, -204, 55, 344, -513, -327, 548, 146, -710, 122, 425, -160, -282, 181, 69, 5, 130, -217, -129, 346, -28, -413, 279, 382, -169]
7075a69j59P89k72n65M70K1J40j72l39K43K28j73m58O65K10o25QL76j20j23m3
7096f8k5K84J8n16K2N12k17n69L38N48l97k49K00J33k2k3k99K81M42l10m85O92
7118B90mo61J96N31j43l14J31J20j9p5j52o9N40j79p10O23M83n19l06P54j74o16
7140b73M14pr9L02p2q45P15N36j115k5J130n41r22R01J61o48K99M02p05K57M72
7161C37p20J53Q85n95j007J461o2j199M10R33p71k02O11n46L0Q19m82p72J170
7180D53J75j446N05J175j090m03R52k20o09O78J53p30O73J84j002O76P71j216
7198c21j89J381n11j047J034L3o49K86M32q17K75Q16r14l46J236m48j168J067
7216A50N03j105l7J037p60j53Q35n32m40J064j75j256J134O22j654N60J148r46
$$ y = [-169, -328, 461, 189, -376, 94, 115, 255, 83, -256, -13, 215, 42, -416, 249, 459, -166, -158, 218, 98, -25, -68, -93, 191, 209, -307, -285, 227, 10, -559, -221, 327, -70, -319, -119, 14, -8, -31, -330, -49, 393, 83, -402, 290, 286, -375, -179, 352, 209, -105, 26, 146, 127, 52, -100, -169, 371, 192, -518, 105, 588, 69, -237, 517, 343, -273, 141, 134, 35, 337, 265, -580, 135, 671, -444, -469, 661, 120, -802, 99, 260, -388, -89, 313, -392, -135, 337, -383, -230, 655, 60, -947, 514, 452, -747, -337, 596, -175, -377, 234, -312, -282, 537, 55, -717, 453, 628, -818, -313, 862, -228, -631, 321, 101, -508, 170, 323, -407, 266, 450, -552, 124, 895, -321, -510, 871, 360, -687, 347, 380, -269, 17, 449, -368, -93, 723, -191, -537, 699, 251, -917, 150, 653, -452, -489, 548, -212, -365, 470, -62, -502, 562, 387, -869, 265, 887, -767, -207, 941, -5]
7234en73J004P3r32Q01j16j030J106M57j322J88J301q66r39J455K4j348O52O62
7253E92r51Q5R16q47r3R76p97p04J320lj359O74J105j260j70J094n96m53J045
7272E74p02n60J173j39j255Q03Q62r87l87J209k05j253J132J95q77M59K90q25
7290d93N39O58r42k18J151m87r97J172M11j366M66O88p28k5P07p13j53J048o95
7309B3p89J209K00j225L20R95o30m23N67j20l14N19l56l85O97J97j176M35J147
7328H91j093l74Q41J63q93N05J77n00L41J99m47K56M58p73k37R61k24p43N51M75
7348E34q38O3N35n68M03R9k78k52O00j24p05N48M62o86j34P67j96m71J75Q1K8
7369D3k8J6k42L53J42p81K60O89m48l88N01R0m30J21J49J02N2k78rK62N9l38l38
$$ y = [-5, -578, 426, 499, -433, 368, 252, -778, 328, 785, -537, -349, 952, 86, -853, 602, 626, -722, -70, 592, -359, -274, 642, -205, -298, 678, -119, -823, 497, 494, -865, -191, 914, -346, -516, 578, -18, -471, 574, -128, -688, 485, 346, -909, -106, 756, -231, -618, 591, 386, -867, 265, 460, -417, 42, 332, -493, 46, 704, -238, -456, 695, 208, -789, 383, 794, -572, -106, 582, -146, -171, 536, -177, -330, 718, 23, -766, 443, 643, -582, -262, 733, 103, -320, 247, 127, -187, 332, -24, -409, 288, 485, -691, -256, 891, -202, -576, 265, 428, -465, 40, 217, -283, 58, 257, -190, 66, 524, -249, -486, 475, 251, -492, 59, 534, -304, -241, 294, -274, 129, 228, -50, -302, 298, 174, -531, 17, 479, -207, -341, 426, 230, -241, -66, 15, 43, 15, 31, -211, 142, 284, -497, -237, 452, 4, -384, 117, 207, -223, -102, 47, 149, 201, -77, -86, 176, 235, -103, -441]
7392d41O04o1l96J84J36N0k62J81MK92m93n3M32P8l55k50M52J45k30k36K59M9
7414H9J19l87Q0M35k2o86L47M26j78m06L04O2j49n4j48J56M45m89l60L79L08l87
7436a16M3L81l01k80J81K25o6l9j37o6M35j05o22K69N18m30k81N66J5o51K91M36
7458B66n30K54O5l61L44N37p70l12R05j76p84L99O25p41M4O76l97j12L77m39j21
7479b51P25k57q81P95N19r78j04J061n76k98N27k95k92N58q4p00P90L07j290K00
7499e24J177n08q78Q20L19r72O24K46o69K63N46p07P7P16n10r55J239K50j202
7518f48N82P24r37o4P47n61j17O06m21o41J105K37j394Q01P39j179n5J055k70
7537C09p60P68N3q90Q86R5j066O11R02j150k31J057k62j025R05K09q01N62J62
$$ y = [-441, 163, 102, -294, -110, 26, 76, -186, -5, -1, 291, -202, -255, 177, 255, -100, -350, 102, 247, 17, -219, 40, 89, 208, -179, -99, 336, 314, -372, -25, 401, 223, -183, 121, 183, 34, -20, -168, -12, 433, -56, -416, -37, 271, -116, -73, 308, 7, -273, -92, 133, 67, 28, -109, -175, 260, 155, -467, -198, 320, -110, -391, 175, 190, -461, -170, 266, -264, -10, 55, -306, 38, 575, -195, -507, 398, 222, -562, -163, 462, -279, -235, 441, 44, -68, 309, -130, -251, 474, 217, -664, 131, 650, -328, -432, 629, 53, -245, 282, -13, -305, 253, 169, -531, 259, 566, -724, -524, 653, 145, -733, 87, 406, -566, 58, 304, -365, -102, 444, -263, -186, 530, 20, -935, 304, 554, -648, -66, 658, -279, -343, 404, -157, -274, 332, -89, -730, 375, 612, -782, 19, 758, -421, -476, 579, 309, -451, 317, 370, -520, 366, 461, -605, 6, 908, -242, -473, 584, 322, -703, 202, 411, -390, 172, 334]
7556C34q07K89P57q78j74J187p18r01J021N72j244J28J180r27l46J058o90k47
7574d06R40l21r86J086M96j436K10J241r37m74J069k98n75O62N5q40P48K95r87
7593d58K37J095j083n92J489j09j218O35M93p69K06N38q71J81P87o86n64J092
7611D03R5j341O22Q76j075j42J122o28l21P51o37l15J094l27p56P18M49r56j72
7630e40J192n37n60P01jp77P00J6n23L98L29q34J93Q66n09n46Q37J31q93L79L64
7651C86o44L09M17p13N9P10m80n67R63j00p49J56O80p02L9L62j97j59L98k06l10
7672c48P27k71n30K68N43l75k34N09k1o44M18K06m17J54M9l13K66L06o64J87N26
7693C42j04n54N09L3l80J54J13k73K19p7k57L36L83l51l09M86N3n39J17M11j75
$$ y = [334, -473, -184, 573, -305, -479, 708, -10, -911, 110, 682, -562, -434, 746, -181, -527, 531, -159, -406, 534, 213, -773, 313, 809, -627, -417, 824, -113, -587, 482, 184, -391, 271, 326, -514, 234, 529, -458, -221, 874, -209, -801, 688, 579, -639, -4, 489, -280, -74, 464, -407, -226, 561, -125, -689, 403, 498, -843, -221, 655, -420, -562, 560, -68, -389, 362, -275, -590, 504, 177, -579, 139, 588, -368, -540, 652, 115, -445, 256, 255, -522, 178, 194, -329, 69, 398, -436, -243, 623, 114, -432, 405, 536, -357, 22, 386, -258, 51, 468, -245, -186, 524, 44, -523, 440, 340, -409, -253, 427, -275, -236, 126, -71, -230, 168, -38, -348, 379, 108, -422, -154, 389, 14, -220, 289, 268, -376, 42, 248, -169, -15, 34, -279, -13, 293, -371, -184, 342, 238, -316, 193, 226, -154, 0, 113, -160, 59, -18, -275, 61, 444, 93, -216, 270, 323, -216, -99, 312, 137]
7714A37k62O7J82j66J45k19j7M50k65n09P66Q8n73Q7L59k29j42J50n4o5K90k08
7736A2k09K62K46o40L79K62l46j74P8J10M9J01j78K7L23k17l65J54L15l67o5L67
7758A24J9k30J47J08k47J96k27k07N45j17m81K20M72j57k52Q6M45m89K3o5J06
7779A9K33p7o72O32J26n47j12P88j54o43L87K03m31K96J95m02J78J65m31K3N89
7800C65k42o25O29J32m51o0O33m19j02K87k94J85L34m11m53Q62k4o75j2P44m80
7821g7j12M35k53k39J84k9j85N58Jo48K06P13o95m78R11j09m75M60J99n79K21
7842IK80m73J96K67m17k32R02j54q54N96L81q95K80K41k61J05K44l29j10O99l99
7863G6n60O04L20p11J77M57k30m94N62j26m04L68M0j80K33J70n95J3Q07n83o34
$$ y = [137, -125, -58, 124, -42, 103, -116, -133, 317, 52, -457, 309, 397, -176, -89, 270, 41, -101, 49, -5, -70, 220, 12, -197, 65, 311, -329, 50, 312, -34, -208, -130, -20, 29, 130, -48, -21, 302, 85, -280, -126, 189, -178, -243, 124, 143, -87, 60, 168, -79, 117, -110, -317, 228, 111, -370, -150, 322, 165, -87, -1, 444, -45, -22, -87, 19, 252, 175, -497, 135, 261, -286, -398, 390, 236, -407, -20, 183, -248, 48, 243, -159, 19, 184, -247, -224, 365, 123, -502, 127, 259, -192, -252, 381, -38, -140, 147, -147, 38, 372, -39, -492, 370, 346, -329, -341, 403, -77, -189, 246, -7, -246, -62, -91, -276, 282, 283, -365, -159, 554, -141, -619, 292, 183, -292, 168, 367, -212, 9, 289, -184, 12, 279, -138, -370, 532, 378, -476, 120, 501, -394, -114, 127, -134, -29, 215, -114, -224, 475, 76, -484, 120, 440, -271, -94, 363, 133, -361, 201, 75, -329, 39, 79, -101, 132, 302, -293, -280, 527, -56, -690]
7884f90J024q0o33L47L37n72K79L09l99r9O07m11m99Q07r4o66K99Q00p15m05P19
7905B65k99n9J83k07j82N97j68n39M18L86n40j76N87j71l87M68J09m65K96K1n51
7926d14N58L16n66k25P47k29n33M82K8k45Q3J34k94J10L53l42j77N54k70o03Q17
7947B84P3n15j1N41l69j02K51j00r7L19j57l58M04O7k99j10N15m65k59M89J02
7968B03l93K21J13k43K13k2k92K13L12m11l11P58q1m78K74K03l53J14N0j42J27
7989G5J43k87p4K30l8m39M25J02k94%K32N8l00J40J42k20K1Oj03K60k2l55K04
8012i4K54j29j76N7J10j70K9Q2J69N6k20j40R9L79l15k46L95k10J03o3J04J80
8034B54k53l94K23L85k41l4L8K36j41l2oj08J08J4j05J15J95m79j22O14q5k54
$$ y = [-690, 334, 254, -379, -32, 305, -267, 12, 321, -78, -177, 430, 19, -480, 327, 233, -433, -134, 666, -49, -454, 265, -34, -93, 90, -117, -299, 298, 130, -409, 9, 395, -145, -321, 266, 95, -292, 176, 285, -180, 116, 137, -414, 144, 460, -106, -331, 416, 187, -346, 136, 164, -81, 2, 136, -158, -48, 305, -37, -214, 340, 70, -533, 284, 357, -158, -169, 372, 3, -99, 152, 52, -45, 274, 117, -241, 163, 230, -69, -179, 336, -129, -388, 101, 203, -190, 31, 144, -99, 114, 92, -200, 13, 325, -86, -397, 361, 280, -198, 76, 279, -74, 40, 90, -52, 75, 218, -69, -143, 87, 49, -390, 35, 137, -157, -157, 75, 133, -167, -27, 115, -105, -84, -78, -181, 79, 57, -298, -94, 160, 31, -145, -88, 22, -148, -119, -37, 132, 188, -32, -172, -73, 306, -9, -255, 140, -70, 33, -30, 74, 254, 1, -393, -170, 215, -26, -60, -22, 214, 73, 41, 35, -73, 35, 49, -56, 59, 254, -225, -347, 267, 182, -72]
8056g2J40M7n8l4L6N6O8k06K7p4K94k30m07L55K88n39J08L57j56k27K18J7j27
8079a19K16j40k66M25P4m00JN03m04j93M05j45r7J32J59k80L21Ll60J84N08p02
8101a75r8L94K28n72J89L59n98J37J62l1jL70n15p8N96k05m62L19L47l92k33M96
8123B37j90k35N12k21m26M32j30k92O10o2m95n7O52k53l73L68J41n25M38m0l20
8144b29K40K69m49n4O45m43l96P71P9p19K79K92m35M1N13m46q0N18k01n70P35
8165C60j38p33L44O56n55k87N89j03l96N07j16l91M96Mp10K15Q27p89k99P83j92
8186G2n82M70K76n57K91
$$ y = [-72, 68, 115, 57, 23, 59, 115, 183, -23, 4, -70, 224, -6, -413, -58, 230, -309, -201, 156, 0, -227, -9, 8, -119, 97, -43, -309, 116, 190, -210, -209, 294, -110, -303, 102, -43, -140, -8, 151, -129, 192, 195, -165, 19, 527, -175, -273, 121, 349, -223, -34, 325, -273, -136, 26, -5, -6, 364, -151, -229, 367, 162, -300, 19, 366, -26, -259, 237, 47, -188, 324, 103, -323, 109, -21, -313, 297, 235, -260, -317, 335, 82, -291, 77, 218, -307, 131, 91, -229, 11, 280, -169, -223, 422, -21, -417, 354, 433, -286, -7, 285, -150, -109, 404, -42, -122, 396, 195, -375, 360, 222, -511, -167, 489, -66, -353, 236, 133, -263, 244, 128, -263, 233, 237, -473, -258, 569, -220, -519, 264, 72, -510, -40, 236, -321, -30]
8191c0
$$ Imaginary data points
##PAGE= N=2
##DATA TABLE= (X++(I..I)), XYDATA
0@%%%%%%Jj%%Qj6J7k5L2l6M4n6P2q2R6j18J42j66J90k20K59l02L43l89M44n08
32b71N79o55P35q24R27j041J163j292J434j593J768j956K159k382K626k895L191
49A673l513L866m262M702n191N740o360P070p893Q855r996J1376j3085J5266j8148
64i900K2140k8032L7569n5398R9000l77764l89240J242787l96198q60079Q39004
75A23889K30370q95248M63830M59360q16854J87548P68186p87381k91690J034445
85D76455l14872q50301Q10207L31085r17234K55999O41353o46749q2756O75871
95C79058m70471l33414Q01574k16538p37146P25144L46337r42980K00701P86160
105E38425o20048l26428P45378k04981n04143N80111K5010o19655M87898L27330
$$ y = [0, 0, 0, 0, 0, 0, 0, 1, 0, 0, 0, 8, -8, 9, -16, 16, -20, 24, -32, 40, -42, 54, -64, 78, -88, 102, -118, 141, -161, 182, -207, 237, -271, 308, -347, 388, -436, 491, -550, 613, -679, 755, -838, 930, -1026, 1133, -1249, 1377, -1518, 1673, -1840, 2026, -2236, 2466, -2725, 3015, -3345, 3725, -4168, 4687, -5309, 6067, -7018, 8248, -9900, 12240, -15792, 21777, -33621, 65379, -312385, -701625, 541162, 144964, -715115, 123889, 354259, -540989, -77159, 382201, -434653, -247105, 521081, -266300, -557990, 476455, 161583, -688718, 121489, 452574, -464660, -208661, 432692, -214057, -296813, 379058, -91413, -424827, 376747, 160209, -576937, 148207, 494544, -448436, -247735, 538425, -81623, -408051, 337327, 132346, -371797, 208314, 233324, -386331, 101567, 428897]
115D28897p78560J57860P30581n88855l74971P72488j00564o31298M73883K32485
125C21946n82339K37435L74575n72159L9455O11095m72307l61622P14292n0338
135B60033o78128M16102L86308n82650J3957M76806l46764j57305M57835k28547
145A7647l07421M97962j5952n36813L45544L47874n26165l5832M90303k44591
155C2556k61363L67674m8284k76891K95756K4523l67845K60060K43753m45543
165a75604j544M56239k42119l06086L73799O4063l40532J56612J55805k58740
175a18107Q9388J93958k81273n919L37266k09755k48049L52346O7061l60683J19808
186f3959K38615k20683m2815J91229j23902m2897J91577j35979j30602K68322
$$ y = [428897, -349663, -191803, 538778, -50077, -425048, 347440, 246876, -384422, 89461, 321946, -260393, -22958, 351617, -220542, -181087, 430008, -42299, -403921, 310371, 260033, -418095, -1993, 384315, -198335, -184378, 292428, -54336, -211641, 246194, 17647, -289774, 208188, 192236, -344577, 967, 348841, -177324, -213156, 277147, 32556, -228807, 138867, 90583, -186308, 109448, 133971, -233874, 26186, 269939, -175604, -177148, 279091, 36972, -269114, 104685, 168748, -171784, -15172, 140633, -118107, -28719, 165239, -116034, -121953, 215313, 5558, -242491, 109855, 176916, -183767, -63959, 174656, -46027, -88842, 102387, -21515, -64412, 127165, -8814, -139416, 128906]
196A28906m725k89888J54049K13651k36519p2660K23607n0965j16285J04790j7813
207C6148o1890J18220l7370j38022J42106Q7950j99800j433J89482p5601j20138
218f0348R9009K5428n9127L4563k8105l7495J05031k0195j44569Q9677J23225
229A27094j46059o8132J52082l361j11639M1431L4748l0600K8646l0056n1518
240e7364R6113K2131j35343L0716J27800p6595q1447Q7871K2445n1487J8449j6763
252a3474r121Q3777m5404j06668J18040P8280j64424j1375J63085n4879j08808
263g0971R1332K4258o9270N3680o051q0785J04305M1052j71816M6578J75216j34031
275C497j12867J78637J3650j54708P5173O5164j08588N2558O0930j42188M7619
$$ y = [128906, 124181, -165707, -11658, 201993, -34526, -107186, 116421, 65456, -50829, 53961, 36148, -25742, 92478, 55108, -82914, 59192, 147142, -52658, -54091, 135391, 59790, -60348, 38661, 64089, 4962, 39525, 11420, -26075, 78956, 58761, -85808, 3869, 127094, -18965, -87097, 64985, 61624, -50015, -8584, 26164, -4436, 24210, -5846, -57364, 38749, 60880, -74463, -43747, 84053, 7458, -73989, 13882, 36327, -15160, 3289, -13474, -22595, 61182, 15778, -90890, 27150, 105430, -58994, -70369, 92716, 37837, -70971, 20361, 44619, -24651, 29029, 22978, -57807, 46498, 87550, -84266, -37688, 137528, 3497, -109370, 69267, 82917, -71791, 3382, 68546, -40042, 12516, 73446, -68742, -21123]
286b1123J56164j64320q9873K31022k3579k18591J28750J29863j77248m753J38296
297H4608j01157k6862J30932j07494p1441J96809m9240k02226J69006J21572k33891
308h9384N694K08669j22975r9251J68229m9331j13490J63155k0366j88870J69312
319C1392J12541k66245K7513K66241j70141j67154K47370R762k17861J32805Q8667
330I4890j90368P9743J34869k09214M248K42344j63281j68701K69086K0550k72889
341a58723J31719J67487k14441j904J83764j45391n4443K04993j12905j53556
351a53400K43149J5699k79697J45473K04799k55652n1755K59186j06949j52381
361a31528J94464j3700j69670J62087M7980k27540J15932J82817k46721m8695
$$ y = [-21123, 135041, -29279, -119152, 111870, 88291, -130300, -1550, 128313, -48935, -53688, 84608, -16549, -43411, 87521, -19973, -91414, 105395, 56155, -146071, 22935, 144507, -89384, -83690, 124979, 2004, -97247, 70982, 21651, -91839, 71316, 50950, -137920, 31392, 143933, -122312, -94799, 171442, 1301, -165853, 81517, 91279, -126582, 6223, 94890, -95478, -15735, 119134, -90080, -85832, 156512, -6769, -175470, 93616, 114166, -158723, -27004, 140483, -73958, -75862, 107902, -37489, -91932, 113061, 156, -153400, 89749, 105448, -174249, -28776, 176023, -79629, -131384, 127802, 20853, -131528, 62936, 49236, -120434, 41653, 89633, -137907, -21975, 160842, -85879, -134574]
371a34574K83971j13174k06382K21491M9612k23224J09376J16360j99065M8813
381d6796J78893k00909o0181K72054j06426k30741K43084R3629k84919P2304K11419
392A41411j89077o0128K04101j00268j14762K00351l8476j98028J87859R5670
402A28653k63097N7872K30090j85267j06791K26595m3456j64874J52416L0362
412F2503j72688J16055R5946k10910M2311K09481j77799j15183K44491k4562k14332
423a44687J41351J03992j84241L5450J35420j42716j5948J71075j20479j05928
433a26711K10308j6546k11211J38562J30179j98900m406J76572j03312p7543J49843
444F6835m9685j08635J52654K646j80575J20616J25321k00838j6876K04858r1553
$$ y = [-134574, 149397, 36223, -170159, 51332, 100944, -122280, -12904, 103456, -95609, -46796, 132097, -68812, -128993, 143061, 36635, -194106, 48978, 142607, -142312, -70008, 141411, -47666, -107794, 96307, -3961, -118723, 81628, 43152, -154876, 32983, 128653, -134444, -76572, 153518, -31749, -138540, 88055, 44599, -120275, 32141, 62503, -110185, 5870, 101816, -109094, -66783, 142698, -35101, -150284, 94207, 69645, -144687, -3336, 100656, -83585, -48135, 87285, -55431, -71379, 99696, -20783, -126711, 83597, 67051, -144160, -5598, 124581, -74319, -78725, 97847, -5465, -83008, 66835, 17150, -91485, 61169, 63815, -116760, 3856, 129177, -71661, -88537, 116321, 24768]
455B4768j36867J51230K6898j40093P3969N9617j24090M7726R7520j36538j7238
466g3098J62145p9628j26310J41120M4619j49527L8246R6117r0357j0604Q0724
477C3447p0766j8632J07009o6600q5386J31876K2383j50118N2388J18804j02855
488b8450m9712J09519k0866o3671O5542o236n7962P2816J4770r9869M8674R1125
500G5680r4549m5998J13573l992r0030M4404M3348m8050R051K0627l7679K6520
512A2905L6458o7282j0687Q7021k5483q1094N4105N1249o5237j8529M8031n846
524A5611k0030M696j1366P055K4132k8459k7555M1576J5768m9929m810M2903k732
537F860l0945k901J9886J4594j8961k3807K5862K6503l0439k3300L2789K0622
$$ y = [24768, -112099, 39131, 66029, -74064, -95, 59522, -64568, -16842, 80678, -55860, -73098, 89047, 9419, -116891, 24229, 68848, -80679, -42433, 53684, -36673, -47277, 33447, -37319, -55951, 51058, -15542, -100928, 30948, 53331, -96787, -44399, 74405, -28450, -78162, 31357, 10491, -53180, 12362, 6126, -51836, 20980, 35750, -64119, -15445, 75680, -18869, -64867, 48706, 44714, -45316, -912, 42436, -5614, 3437, 24064, -13615, 12905, 49363, -17919, -28606, 58415, 32932, -48162, 5943, 57192, -8045, -26574, 21457, 15611, -4419, 277, -11089, -4034, 20098, -8361, -35916, 5660, 21428, -28501, -33311, 9592, 6860, -24085, -26986, -7100, 7494, -11467, -35274, -9412, 17091, -13348, -36648, -3859, 16763]
549A6763k7339j5284K0118J7090q062k3188N469L6975r483m2234K1372L7908k6058
562D047k2296K2346P108p189R60j5247N206L8113k7006m9427N6065L8297p7822
575b6845q494P7103k4244n4423M1536J7088l5062J9858L493l9907M1204L0124
587D1431p8385P529Q9962n2534o7972Q3133K5826q1034K1228M9840m9303M075
599f204M6204n5383m922Q3649n4338p0451J04368K4464j19319L4629R3786p8258
611a775l8172Q4996k4591m8718O5400j9147o4497Q2744J7985j14667M7402R6191
623H3151j04813m2974J20731k6094r1184P5381K0269q3730N5224L9331j04102
634e8810L7626R8026j12787m3951J49507l4428j31738J01608O6114j27032J9909
$$ y = [16763, -10576, -25860, -5742, 11348, 3286, -19902, -14433, 22542, 13059, -29175, -7803, 30105, 4047, -18249, 4097, 11205, 4016, 4976, -10271, -5065, 33048, 6042, -43385, 12680, 50977, -26845, -35339, 41764, 17520, -36903, 4633, 21721, -13341, 6517, 10010, -29897, 11307, 41431, -36954, -29425, 60537, 8003, -59969, 23164, 48990, -32044, -10816, 39024, -10279, -6204, 40000, -15383, -20305, 63344, 9006, -61445, 42923, 67387, -51932, -17303, 76483, -1775, -39947, 45049, 20458, -28260, 37140, 17993, -46504, 36240, 54225, -60442, -13040, 83151, -21662, -64636, 56095, 30001, -61183, 14198, 34467, -49263, 5961, 45292, -58810, -21184, 76842, -35945, -79896, 69611, 35183, -96555, 5053, 71167, -55865, -35956]
645c5956R6479q5740j7603J01186p0494n6040J29472k3048j29410J03472P6769
656H9087j44617P375J31479q0039o3036J09495k6116p7032R6608J056j12158Q6351
668A8453P0240j42993J0025J47032q9868r4225J34401Q395j21176P0460N4218
679F4962j04922L4809P7192j07092n286J29524q1776r5013J40949J5134j48282
690g9801O8447R3992j17535p079J03139p5053l6555J10059n4058q7696J25866
701D3726J5099j50442P2283J14294j34785l5113J40820m9739q8490J00409M772
712C2834r3794P3470L7491j13059M5110R9402j13484l8881J39496l8980j08405
723g8800R6825L9627j04363L4542O2854q0345J0045Q0158q0188l3379J17721l7878
$$ y = [-35956, 60523, -25217, -42820, 58366, -12128, -68168, 61304, 38256, -91154, 12318, 89087, -55530, -48155, 83324, 3285, -59751, 49744, 23628, -53404, 43204, 44260, -67898, 18453, 88693, -54300, -44275, 102757, 12889, -81336, 53065, 61460, -59716, 10744, 64962, -39960, -5151, 72041, -35051, -40337, 89187, 7411, -87602, 53347, 68481, -79801, -11354, 82638, -34897, -41976, 61163, -13890, -50445, 59614, 5556, -82140, 43726, 58825, -91617, -19334, 94960, -39825, -74938, 65882, 16143, -72347, 28062, 32834, -60960, 12510, 50001, -63058, -17948, 81454, -32030, -70911, 68585, 29605, -78800, 18025, 57652, -46711, -12169, 50685, -29660, -19615, 60543, -19645, -53024, 64697, 26819]
735B6819j05231J00314M9897j23956K0397R6926p2400l5247Q3402l3848n1208
746d4135Q0182j1868q4819P6063M5601j12279J5808J03034p0425n6098R0871m881
758B7054p1136N1439J9749o5275M0242L9925q2343J1785Q7855o5292n5713R4966
770C3256N673q9318L9346N3493n9518l888M8288l7549j1278N4041l4889l8479
782d0822O7610L108p3624L3152N4334n3604k1524N1557j0140k8732K6080m759
794B636k0763L3648l933m5566L3970L5530n4549j3418N8353j1110m6004K6931
806d275K2733k7644J341J2987j6058R889J5122k9377l038L8095j2015l6783K3291
819e732K8371k7691j7305K4780P897j5313m884N531Q089J041j2892l977J6158
$$ y = [26819, -78412, 21902, 71799, -52157, -31760, 65166, -7234, -42481, 40921, 7073, -44135, 36047, 24179, -60640, 15423, 61024, -51255, -35447, 67587, -2838, -58936, 31935, 27054, -44082, 7357, 27106, -38169, 2073, 41998, -40345, -28560, 59295, -5997, -61710, 33256, 38929, -50389, -11043, 42450, -17068, -20956, 27332, -10217, -21495, 32546, -2343, -40822, 26788, 29896, -43728, -10576, 43758, -9846, -31370, 20187, 10047, -18685, 7395, 2636, -18127, 15521, 11588, -33978, -8, 35522, -19027, -32445, 25908, 14798, -31206, -4275, 18458, -9186, -7845, 5142, -10916, -1027, 14095, -15282, -18320, 19775, 7760, -29023, -5732, 22639, -5052, -22357, 2423, 10320, -4993, -9877, -4346, 3743, 4784, -8108, -12085, 4073]
832D073O561j8971q113K2603Q013k5629n753K7850K132k7337K766K4289p700j5303
846a0519R602K668k940Q434j1461j0692K7482L303l8629J0779M0767k7290l1464
859b9960L8083J2514l6492P338J9419j7524M655J1544k5943P555L4309l3072k6623
872c4197N2658L715n7390K3758M0820m1948r395L8791k2265j3976L8861k2338
884b906l1937N5528M009p0343L5262N9042o7400k3315P6192k0001n3473N0359
896A1017J0130n1048L5438K3139o2260K3440O0049o8059k5801R0060k3822p6185
908e3902O5233L2684p6668K0339N2172n8192k461O3359n1873l3280Q6199k0444
920B3166q4804P2807M5811r9130J1319Q4454n9670l7685P6021k2182n3913O7139
$$ y = [4073, 10634, -8337, -16450, 6153, 14166, -11463, -17216, 10634, 12766, -14571, -11805, 12484, 4784, -10519, -917, 1751, -1189, 7245, -4216, -14908, 12574, 15877, -22752, -11973, 28794, 1504, -29960, 8123, 20637, -15855, -8517, 10902, -6622, -1967, 9577, -16366, -8811, 25498, -7574, -34197, 18461, 22176, -35214, -11456, 29364, -12584, -21979, 16812, -5453, -19429, 19432, -2906, -34843, 20685, 24694, -45649, -10387, 48655, -18745, -42060, 34132, 14131, -39342, 11017, 21147, -29901, 5537, 28676, -33584, -10144, 49905, -18154, -43955, 46105, 22283, -53902, 11331, 44015, -32653, -12314, 39858, -18334, -20795, 42564, -9309, -42589, 43610, 23166, -61638, 11169, 56980, -42150, -30831, 53623, -6047, -43732, 32289, 10107, -43806, 23333]
932B3333P65p8227N9391M7577r8950J0333R7684o7832n5647R6148o576q2059O1121
945G061L0959q2476L6258N9814q8985o32J02445o7255o8452J12594L847j12012
957f6834O0944O8321r6153J002Q6312o3747l3864R2855l7561p2879R5497J3745
969D7638j11462N4596Q0269j00795j7409J03833m8168o2351Q6606o402p9512P0160
981A7003K8284r9599M1680Q0566r8484k3911J14729m4054q5376R1313K3080r7666
993e2435M4479N7635q5516J0459Q0983p4100l2869J04656l4042q8495Q9531L5995
1005E6281j07896L0907Q1775p9876k0266Q8801m6831n0561Q9020j4582q5919P7060
1017A7913M2604j08906K2498R6575p9069m5519J01088k1557p7655P1652J8919
$$ y = [23333, 24098, -54129, 5262, 52839, -46111, -35778, 61906, -5926, -61573, 34575, 27999, -54060, 7061, 38020, -44456, -8198, 51616, -37369, -38001, 64444, -2811, -71263, 41331, 45178, -66834, -5890, 62431, -33722, -32720, 53592, -10155, -44019, 48836, 11275, -61604, 33893, 47638, -63824, -9228, 71041, -29754, -47163, 56670, 8502, -53849, 32757, 26355, -53157, 17003, 45287, -54312, -12632, 67934, -30550, -54461, 60268, 16214, -69162, 22151, 45231, -52435, -7956, 49679, -35837, -25378, 55605, -18495, -51364, 53292, 19250, -69245, 20286, 56281, -51615, -20708, 61067, -18809, -39075, 49726, 2895, -47666, 41354, 26772, -59147, 17913, 60517, -48389, -25891, 70684, -8385, -53904, 47184, 25627, -52028, 19624, 38543]
1028C8543q3168M5237N0305q6605P148Q6833o4731m9795R4631q735q5314N9438
1040C787L8623p9298K0435N7370o4657p248P3444m8349m5970Q4206m464q5518
1052e7639N6169N1565q3512K651P4984m9218l2913O8337j9674n0872O1861Q396
1064C0135p2928M1919N1644p5331o025P8594l9711m8019O4389J627n5891L9280
1076I683K1376n6624K3531M3182n9116p064O8886l6015n0777O3406J1269o4429
1088c2692K6116L8359m7489j116M0807l2544j4594M7226k1920l8953M9457J0061
1100B2718n6774K2675M0188m2538j0935M1224j6688j9947L1085q775k4836L3948
1112A1345L405m2279K5833L1805m4295p235M5911j5847k9385K8794O551k5711
$$ y = [38543, -44625, 612, 50917, -35688, -28540, 58293, -6438, -56233, 38398, 29663, -55651, 3787, 42410, -36888, -16453, 40917, -23740, -30988, 42456, -5893, -51863, 32343, 27879, -57639, -1470, 50095, -33417, -30766, 44218, -5000, -37913, 30424, 10750, -40122, 21739, 30135, -42793, -874, 50770, -24561, -30586, 48008, 8297, -39722, 24667, 26294, -29597, 9683, 31059, -25565, -2034, 41148, -17968, -25032, 43854, 7839, -42938, 20468, 31737, -32692, -6576, 31783, -15706, -16822, 23985, -8559, -23153, 24073, 2153, -36800, 12657, 22718, -34056, -11381, 28807, -13731, -24666, 16558, -130, -20077, 11008, 2233, -22603, 11345, 14750, -27529, -1696, 30109, -14186, -21421, 24490, 8643, -20742, 8052, 14603, -11108]
1124a1108J4220J0292k3739J1920J9065k9923k726L4679j5812k5729K6178R007
1136A6324k5577M607J3834j1051R09O512j3983M739J6811j9013r742K6312l375
1149G307k3851J2639J3372j4202j790P788n484K950M917j3162L805J7317j4730
1162c124j2230K0801K592j7039O488P655p803L200K041r514R559J0003k1051j927
1176a0349K6842j0658k1699K0764Q912k1197L759J1928j0228K518P456j5318K643
1189d627K0803j7790j5205K9358o7k9952J5295J7147k2455J601J6089j7435L11
1202f927K1743k1042j2197L6247q032l8279K9817K3592m0939L96L6002k1595j6548
1215a7762K9558q485k0286K8705j304l4996K7702K3572m5578K136M6211k8188
$$ y = [-11108, 3112, 13404, -10335, 1585, 20650, -9273, -11999, 22680, 6868, -18861, 7317, 16324, -9253, -4646, 9188, -1863, -954, 5558, -8425, -3686, 13125, -5888, -15630, 10682, 7307, -16544, -3905, 9467, -4735, -6525, 1263, -4221, -1271, 3646, -9516, -5711, 11606, -3124, -15354, 5447, 8039, -9000, -2512, 5143, -2660, 540, 2581, -6933, 2626, 12629, -8422, -10349, 16493, 5835, -15864, 4900, 13812, -7385, -3626, 8302, -1926, 592, 8048, -7270, -4627, 16176, -1614, -16819, 12539, 12472, -17480, -2185, 14962, -7493, -5892, 10197, -7238, -6927, 14816, -6226, -18423, 17824, 9792, -28487, 1330, 24922, -16017, -15621, 20381, -1214, -17762, 11796, 3311, -16975, 11730, 10426, -24570, 3132, 26704, -18874, -16738, 29473, 1285]
1227A285k7830M1659J35l5011K5003J1494l5261J8743K5660m3157J973M8877l3935
1240c65l3094N4362J853n2321K7736K9558m3432L638L6148l2827r167M3960k6633
1253e84l1763N2824M05n6966L3463L7036n4106l046N1106k9484k5357M6288j2699
1266G117l7774M5908P016n7590L2943M2037o1644p087O6562l0748m4288N4579
1278A7031O177n3089L2367K6176n2313J5448M4569n1200j2260O4521k7612m9423
1290c9608N6617J4682o1951K4092M0899m8707k441M7223l6319j9954N6348k0573
1302A0308m8354N4929J6704o7919K3071N3497n3312j8322N9535k3026l8085M9888
1314A8914k184m9384M1659K1480o2145J8964N4700n3290k3889O6553j6871n1718
$$ y = [1285, -26545, 15114, 15249, -19762, 5241, 16735, -18526, 217, 25877, -17280, -15307, 33570, -365, -33459, 20903, 22756, -29565, -1829, 27729, -15703, -12065, 24083, -8744, -17911, 26049, -584, -32347, 20477, 20882, -36084, -2621, 34415, -19691, -22737, 28369, -1115, -26472, 19816, 7117, -30657, 15251, 22267, -35323, -2380, 39657, -21987, -29074, 37488, 6740, -37548, 17031, 23208, -29881, 2486, 28662, -23651, -8203, 36366, -14834, -27094, 37427, 9815, -39608, 17009, 31691, -30260, -6168, 34731, -13976, -16417, 30806, -5513, -25467, 30881, 10308, -38046, 16883, 33587, -34332, -11261, 42236, -11076, -29398, 30137, 7111, -30974, 18914, 16730, -32654, 9005, 30485, -31660, -12696, 42004, -11286, -35175, 31378, 14507, -37211]
1326c7211M7713J5179n3647K6049L1318n2115Q268N1496m6555k5355O6421j3756
1338A7805n9517M8278K9349o1725J0596M8032m1220j3352M8766k5606l0114N0941
1350B2233m635n2420L9641L0670n8747M136N3702l5606k5947M7687r680l4998
1362b3964L6920M249m2839K9833K6313n2429M911N3329l7053l1785N3748j664
1374A9569m7547L0445K0794m1238J2027K9734l7177k983M3870k8257l0172M8861
1386A7926J800m9933K6387L0488m0908j550L4899k3223j2527L2785j5274k3411
1398b2541L6687J001m1942K5519K9164m1326m575M0542j7642k3116K8271K59k2911
1411a2610J9213O384k6778J5194K0174l0841k888L3924j5793k3330K5742N552
$$ y = [-37211, 10502, 25681, -27966, -1917, 29401, -22714, -14446, 37050, -9505, -34860, 31561, 17805, -41712, 6566, 35915, -25810, -15214, 32818, -8402, -21754, 27012, 1406, -28708, 22233, 17598, -34822, 4819, 35489, -23258, -19122, 34580, -1026, -26973, 20714, 11034, -23964, 12956, 17205, -25634, 4199, 30512, -21917, -17006, 36323, -730, -32515, 21233, 19569, -27978, 2467, 23261, -17977, -5950, 23784, -13393, -16376, 27494, -763, -30935, 17926, 19726, -30207, -3820, 26668, -14240, -15790, 19109, -4114, -16641, 16144, 870, -22541, 14146, 15147, -26795, -1276, 27888, -13438, -18013, 22529, 4887, -18229, 10042, 10301, -12610, 6603, 12987, -13791, 1403, 21577, -9264, -12152, 21772, 5979, -17351, 8391, 13943]
1423A3943k3534R250J0563j6379N851J1478j9849J381K3538j7505j7105K7332
1435H964K512k7167J0493J6686j6443l472J3331q254l071J2319r446q432J8545
1448F565j523j8996J1113J2959j4551m218J1957j720m191K717k901K063O908q446
1462b264n625J4302J33j4284N781R557p353k598L938j351K489J006q468L662J1148
1477A0073j0171q742J4830J694j4097N418O844q223K836L305r753N965R970j5738
1491e789m370K1860o587k0354J6309J0734k0147K396J3619j1396j042J1547j2013
1504e233l197J9184j0140j7454K2651O805k7706Q717K1021j9978n111K0766j1868
1517a543r047K1309q912j9060K6216N444l4554J4689K8904l1718j0773L6552j1680
$$ y = [13943, -9591, -341, 10222, -6157, -306, 11172, -8677, -7296, 16242, -1263, -18368, 8964, 11476, -15691, -5198, 11488, -4955, -8427, 4904, -3350, -6421, 5898, -3548, -11980, 6565, 5042, -13954, -2841, 10118, -4433, -8651, 3306, 1586, -2605, 112, -2789, -726, 6182, -2264, -7889, 6413, 6546, -7738, -1957, 7600, 247, -2351, 1587, 236, 2725, 3731, -4737, -1075, 10073, -98, -8840, 5990, 7684, -6413, -995, 5849, -2374, 462, 3767, -5986, -21, 9949, -5789, -10159, 11701, 5114, -15240, 1069, 11803, -8344, -5948, 7671, -3725, -4767, 6780, -5233, -8430, 10754, 614, -16840, 5811, 12616, -15090, -6373, 14648, -5330, -10441, 10325, -1543, -10590, 10719, 1807, -17253, 8963, 14407, -20147, -5458, 23446, -8272, -19045, 17507, 5827]
1530E827k5583K7136L073k7656J9350J3307l2782R992L0289l2349j2822M2093
1542A9875j2268l4797L2414J2190l7268J3920K3905l1353J117L2202k6999j5968
1554b3030M2399j0863l9233L6484J8112m6936J0804L7430l2766j2641L9022j6184
1566B598k5380L7089j649l9115L1543K1579m8491Q782M4589l5816k0856M7216
1578B2089j0406l6836L5592R448m2478K3376K7509m6668L650M8401l6302k7712
1590c0337N4211n589m9713L5627K4218m8892R360L9099l8052j1220M7155k3927
1602A940l3440M8746J478n2201L1235L2325n0390J35M6952l0927k3347M5590j0889
1615G207l7084M0238Q443m9345K6322L5217n0320m071N3579k8369l3977M8585
$$ y = [5827, -19756, 7380, 10453, -17203, 2147, 15454, -17328, -7336, 22953, -9396, -22218, 19875, 7607, -27190, 5224, 17414, -19854, -5934, 17971, -13382, -12265, 19937, -7062, -23030, 19369, 8506, -30727, 5757, 23869, -23067, -12263, 25167, -7599, -20240, 18782, 2598, -22782, 14307, 12658, -26457, 5086, 26665, -21826, -13044, 31545, -4271, -25127, 22089, 11683, -25153, 10439, 19887, -22591, 785, 28294, -18374, -14724, 33677, -2625, -30337, 23874, 18285, -31428, 4199, 28417, -20475, -11115, 27984, -10068, -21288, 25867, 1940, -31500, 17246, 18724, -33477, -2242, 30083, -20307, -20172, 26780, -4147, -27494, 18096, 7207, -29877, 10361, 18804, -30541, -4219, 30998, -19322, -23393, 30186, 1817, -32160, 16425]
1627A6425J773m5821L0125K2642m5815J2452L8624m1040j1332N1401k2309l8863
1639c1738M7384R334n1444K2980L3892m4318j070M2891l0662k0048M6297j3618
1651I880l9779M2164J3354n2458J8586M0850m3766j2300M9035k0088l2256M0593
1663A3815J271m0084K8587K0255m4180R677L9282l5471j6969M6514j2100l6733
1675b6136L4436J1874l9466J6675K5587l5426J438L5371k7181j8053M1421q101
1687A2439l7992L1792J8131m2091R161L3448l0193j0944L5091j5057k3239L2609
1699A3155J80l4730K3111K0478l6871K346L4873k3589j8184L2388m725k5932K2551
1712E051P723k7944J2983J9269k8207o29L0694j8812j9789L0308J106k8167J6351
$$ y = [16425, 18198, -27623, 2502, 25144, -20671, -8219, 30405, -10635, -21967, 29434, 7125, -31738, 15646, 24980, -26464, -3484, 30408, -13910, -14980, 27911, -2751, -22799, 23498, 9880, -29899, 12265, 25619, -26839, -8253, 32597, -11169, -23469, 25566, 5478, -26778, 13815, 15086, -24998, 3589, 23844, -20336, -10659, 28623, -6848, -23817, 22697, 10597, -26136, 8300, 20174, -19292, -2617, 22970, -12456, -11018, 24353, -2828, -20881, 20540, 12439, -25553, 6239, 24370, -17721, -8560, 24888, -5305, -16249, 18842, 3785, -19454, 13155, 13335, -21395, 1716, 22194, -14677, -12331, 22542, -1047, -19231, 13157, 8432, -17500, 5051, 12774, -15170, -2187, 17082, -11125, -11754, 18940, 128, -19661, 10647, 11753, -16414, -63]
1725f3J5182k3910K475J9788j7024n822K2712j0404j7006K2538L286k3731J1175
1738h04J6154j9186l061J7891q281q710J3832l324j1560J3740K468j7381R314
1751A092J2779j7507l736J8445o003j2800J1421L769j1703M203O566r291J679
1764a086Q353r370l871J2540k738j0944P551N935q603k056O840o39l574J348j52
1779d66l6K260k471j989M444J010m958l51M559Q89m405j094M879L61m876M21N097
1796C274j398l917K237J399j830J967q86l761N300K351q845J397J0053n823q671
1811g153R314M204j0337J939P349o443p42N919o130j104J0165o569q807J2863
1825D468K787j5483N518J2612j2597m033J3856o450p470J3270l686j2643J4497
$$ y = [-63, 15119, -8791, -6316, 13472, -3552, -9374, 13338, 2934, -14072, 8466, 11752, -11979, -804, 15350, -3836, -6897, 10994, 2713, -5997, 7835, 4511, -7049, 6691, 9159, -8222, 1092, 13871, -3636, -7372, 11073, 5070, -7730, 3691, 7460, -4243, -40, 6526, -2765, -1086, 7267, -2103, -5974, 6566, 3828, -7116, 435, 6370, -2233, -4289, 2551, 1912, -1662, -314, -466, -502, 1758, -713, -2702, 1742, 2752, -2206, -2557, 2002, 2891, -1514, -2608, 2271, 2632, -2244, -1823, 3274, 1876, -2041, 196, 1595, -235, 1732, 846, -2915, 2385, 4736, -4109, -2712, 7341, 1518, -7153, 2161, 6365, -3972, -2033, 5316, -1127, -1869, 4050, -2080, -3184, 6981, 412, -8395, 4468, 7255, -8228, -2710, 9902, -2695, -6728, 7128, 678, -6792, 6478, 2792, -9851, 4646]
1838D646M675k0225P103J8665j8199r400K3345m168j9090J5506O554j8796Q055
1851a329J1938j8405J691J9747j6062j1944K5394l154k4377J7286J3258k4453
1863a0410L211J9915j6953n717K1343j1236j4960K4120k52k6812J7892J7840k9570
1876a1589j13K8848j6713j5815K5573l029k1496J9295O873k6069J2718K0105k8479
1889i891k893L2103j6714k2099L0036K022k9402J6975J5680k7448N062K3620k4117
1902g066q260L2785j3950k6583L1886P385l6800J4859K5948k9420n784L0865j6019
1915a54j7600K8915m071k7466K5148J2088l5060J0389K9605k8293j1661L4401
1927A6241j0463k4675K6120M755k8573J7247J6059l0944N463L0114k6739j4405
$$ y = [4646, 9321, -10904, -3801, 14864, -3335, -12735, 10610, 6442, -12648, 2858, 9412, -9384, -1329, 10609, -7796, -6105, 13642, -2420, -14364, 11030, 7876, -16501, 785, 14043, -10410, -7199, 12716, -4237, -9954, 11389, 153, -14807, 9313, 9061, -17751, 141, 17981, -11589, -11702, 17146, 433, -15382, 10191, 7162, -14334, 4961, 11834, -14235, -1517, 18588, -9891, -12784, 19319, 2605, -19494, 10542, 12564, -16838, 137, 15817, -11631, -6569, 17051, -7066, -15326, 17459, 3509, -23074, 8812, 16197, -20603, -5744, 20204, -9216, -15000, 15865, -154, -17754, 11161, 7090, -20376, 4772, 16860, -18200, -7811, 21794, -6499, -18160, 16241, 5778, -18897, 7223, 11978, -16595, 652, 16711, -14233, -8770, 21344, -5395, -19800]
1939a9800L6460p948l1445K6062J3559l2902Q841K4493k6144m521K9882j8340
1951a803j8390L2763k703l2601K3491J8464l3976K810L0622k1770j3547K9838
1963A3198q642k2438K6406L431l0382J8688K0293l2550m73L3690j9596k0720L1029
1976A1934N9k7955J8825J2792k7703Q633K1442k5457m779L0102j4922k1845K8220
1989I346M135k9522J3482J8231k4413J46K1880j7765q041K4887j0835j9660K5042
2002F913M490k9472J2919K1298k4880n494K6207j1658j5487K1542j851j9427J7360
2015B460P609k4253Q921K0530k1807p540K6069p396j9305J8508N697j9321R455
2028c73J0229j7057M147J5858j6551n938K2101o987j8213J7408P810k0287M919
$$ y = [-19800, 16660, 8712, -22733, 3329, 16888, -16014, -7173, 17320, -8824, -13345, 16537, -1803, -20193, 12570, 9867, -22734, 757, 19221, -14755, -11945, 18677, -3093, -16640, 13198, 4556, -17882, 8524, 11955, -18427, 261, 20554, -11996, -12469, 21221, 1625, -19095, 11934, 11993, -15962, 2863, 15655, -12048, -3415, 18027, -7430, -12209, 17893, 2971, -18874, 9346, 13481, -16041, -2559, 15672, -8741, -8595, 13285, -4480, -12521, 12366, 1531, -18129, 6913, 11403, -18069, -5150, 16148, -8732, -14226, 11981, 323, -15164, 6378, 4527, -14900, 2460, 10069, -14184, -5263, 15267, -6540, -14080, 11989, 4593, -14712, 3796, 9493, -9828, -373, 9856, -7201, -3054, 12804, -3747, -9685, 12416, 5429, -12784, 4624, 12434, -7853, -2934]
2041b934J4063j2872k558J2951q729n727J4364m488j3543J3838O108j8059L907
2054c679J4275j1023n982J2079l678o385Q585k505p794J0317J564j3583O267J1581
2068A0039j2908m390J3758l133r434P526J925o613M547J770p569M771O153r640
2082c198j447J0786l630p956O690K871n314J044J212k274L450j62o037M166N617
2097E818p852k564Q691j530o794M378J767l344K270n03l966N573J905q781K130
2112b802Q976o763n373Q920lo543M325J128m707N366P73q770N880P930j1149k861
2128e673J3830l831j0985R375M352r954L761M701p820L284O892j0504p71J3651
2142A0308p386j0891J3448L660j4829N330R486j1303M69R479r644k077J3854q926
$$ y = [-2934, 11129, -1743, -4301, 8650, -79, -5806, 8558, 4070, -9473, 4365, 10473, -7586, -3679, 10596, -427, -6409, 5670, 1992, -4393, 4192, 1687, -6107, 4210, 5774, -7809, -1542, 10039, -2869, -7259, 6499, 3366, -6068, 1458, 3383, -3230, 1317, 3087, -4482, 289, 6442, -3198, -4645, 6141, 2511, -5445, 1245, 4116, -1198, -154, 1058, -1216, 2234, 2072, -3965, 201, 5818, -2034, -4598, 4093, 2563, -4231, 147, 1914, -1430, 840, 337, -3629, 1944, 3849, -4932, -2802, 6174, -589, -5962, 2958, 2955, -3588, 737, 1865, -2842, 2524, 3297, -5473, 407, 8337, -2812, -5673, 8157, 4326, -6659, 2716, 7068, -2886, 875, 5576, -2244, 1040, 7932, -2572, -3343, 10308, 2922, -7969, 5479, 9139, -5690, -360, 9126, -2177, -1708, 7771, -1873, -3950, 9904, 978]
2156I78j0969J7228J840j9807Q835J4711j7234l730J7364q490r292J4815l454
2169B795j3127J4764L682j9801Q785J6347j9108n756K2205p745j5512J6650K785
2182F964j6854J0801P844j8034O251J6372j8734o064K4805q788j9847K0376P437
2195A2529k3314P936J5732j7765j162J8202j3742q950K2579n878k0902K0209R257
2208A4731k6441O396K1416j9039p364K2032r158j3943J9865j452k0791J7542J0645
2221A4439k7213N837K5162k1052j2591K7463m837k2419J8559P696k2643R767J5316
2234A3484k2735N33K4574j7398j5038K7949j899k6285J7304J3902k4233L342J9280
2247A2780j7142n287K1844j1842j4782K4479r25k6193J7400J6542k7099J01K5439
$$ y = [978, -9991, 7237, 9077, -10730, -1895, 12816, -4418, -8148, 9216, 726, -8566, 6249, 2795, -10332, 4432, 8114, -11687, -2902, 13445, -5663, -11419, 10786, 3041, -12471, 4179, 6964, -9890, 911, 8755, -9279, -3028, 13344, -5390, -11454, 13351, 4563, -15284, 5092, 12529, -10785, -2849, 12883, -4882, -6044, 12158, -1584, -10534, 12045, 6167, -14735, 5474, 14731, -11710, -5314, 16102, -2937, -10301, 11731, 2573, -11370, 8495, 7043, -13748, 3794, 14439, -12774, -6937, 18225, -2827, -15418, 12045, 7208, -15211, 3348, 11044, -11599, -1832, 13484, -9251, -8718, 15856, -1542, -16580, 11369, 9470, -16815, 489, 14391, -9842, -6500, 12780, -4362, -9649, 12195, 353, -14429, 10050, 9125, -17068, 332, 16874, -10225, -10124, 15315]
2260A5315j5585j3328K2947l937j8701J8443M698k3710J2556J7242k5007k453
2272a1520K7115j3888j8133K3905K351k2783J2707J1276k0758N437J7315j9314
2284f290m457K4745j2067j8717K3984M753k5742J0055J7589j9945k944J9997j1699
2297g38r789J9738n652j7318J8642O242k3722P666J9098j8571p302K1239o251
2310C282j4210J4949J259j5209J1885O561j8362N960J6244j7003o831K1549n203
2323D871j7747J4831O902j7006N556J0892j3690L67J3787j1593o676J7958l858
2336D594j6603J2948R181j7032J075J4006r072n611J1205m518o551J0869j606
2349B885j1470J0139O413j4847J319J4139q394q462J1501N14q780N637K512p339
$$ y = [15315, -270, -13598, 9349, 5412, -13289, 5154, 9852, -13858, -1302, 15940, -9067, -11520, 15595, 1707, -16426, 7479, 9830, -12953, -246, 11030, -9728, -4291, 13024, -6290, -10747, 13998, 1931, -16786, 7198, 11951, -13791, -3736, 13853, -6092, -9036, 10961, -738, -10527, 9211, 3559, -13759, 4883, 11125, -12597, -4931, 14167, -4404, -11706, 9533, 3282, -10928, 4021, 5280, -9929, 1956, 8517, -9845, -3885, 12359, -4644, -11475, 10074, 4871, -12876, 1955, 8857, -8149, -2593, 8299, -5391, -5024, 8763, -2830, -9506, 8452, 4594, -12009, 939, 10120, -6912, -5837, 8169, -903, -6514, 4691, 173, -6378, 4491, 2885, -8585, 1554, 7967, -6880, -5561, 8578, 184, -8278, 3223, 3737, -5043, 594, 3106, -4233]
2363d233M554M354r165J364J0006p176p074J0382J745r673L090N698m778r01L243
2378A436l039P19M082m950k530P704j077p844M468N608n895k552M976k96k087
2393a277P87o68J07K482k147l150M051K482m988j263M621N21l556o34K668J506
2409A542l111j926L587K058m004j192L401M66k321J4M94Q26J402l191j529N814
2425B330J02p019K569O228m697l529N414N73l622K252k66k244M922o53p104N275
2441E31O497r198k648J0767j906q888N772M225o855J787L847o104K247O080q503
2456b349j929J1630m480j0657R869N080j2082J506R371p452k520Q336n880l999
2470e556J1139m396j1100J2120N524j6379K844J4880j0470p900J3767j604j0346
$$ y = [-4233, 321, 4675, -4490, -3126, 6880, -296, -7370, 3012, 4757, -4916, -1826, 3872, -906, -1807, 1436, -1603, -884, 3198, -1752, -4282, 3422, 2345, -5499, -1031, 4577, -1318, -3870, 1106, 810, -1277, -490, -1158, -1051, 1431, -716, -3866, 185, 2667, -2321, -3584, 1037, 1558, -1998, -2632, 36, 1542, -1569, -3495, 92, 2150, -1854, -3046, 355, 821, -1500, -1486, -992, -166, 1236, -1955, -3484, 2330, 2432, -4587, -2018, 4210, -487, -4016, 1398, 1971, -1651, 601, 335, -1909, 3013, 2360, -4744, 531, 7028, -2170, -4818, 5949, 4043, -4845, 927, 5152, -1703, 84, 3931, -2173, 74, 6154, -2349, -4278, 7352, 2872, -7785, 2084, 7164, -4918, -3412, 5959, -1493, -4013, 4323, -1557, -5556, 5583, 1187, -9913, 2207, 7731, -8648, -5804, 9076, -1394, -9294, 4473, 2869, -7477]
2483g477R568J601j1216Q241O831j4853K344J5732j1479r842J7329J82j5887R242
2497C16P972j3323L281R735j1812k31J4350j0752r731J8573n95j9242J1123J2595
2511A2259j7480j365J5918r523o931J4260n177j1039J4612J258j7931J0518J3465
2524A2844j9186k956K0660q702j3463J5866J171j4403J0172N745j5698O875J3072
2537A1997j7386l446K2026r400j7069J8842N628k0412O956J3245j4877o79J4614
2550A0039j1375o752J8337o153j6773J7576P086k2329N662J7943j5506o958J7158
2563G955n602j0887J3953j213j4474J3088O849k0218N533J8565j6723r336K1331
2576H821l573j6842J3031O299j5717O292J0062j5265J647J6705j3753r725K1112
$$ y = [-7477, 2091, 3692, -7524, 717, 7548, -7305, -4961, 10771, -708, -10550, 6779, 6961, -8926, 316, 8288, -5035, -1754, 7981, -3831, -4062, 10288, -464, -10195, 8378, 7783, -11459, -336, 12259, -5221, -6586, 9332, -191, -7122, 7138, 1961, -9078, 5534, 6792, -11139, -621, 12844, -6342, -9298, 11362, 2660, -10803, 5063, 6234, -8169, 2003, 7748, -7950, -1075, 11997, -5389, -8835, 13191, 3791, -13278, 5564, 11192, -9220, -2264, 10981, -3896, -4575, 10039, -1336, -8088, 10249, 4096, -12677, 4899, 11985, -10344, -4682, 13261, -2245, -9203, 7955, 2353, -8534, 5419, 4206, -10268, 2820, 9669, -10549, -5016, 13549, -3174, -12510, 8821, 5248, -11594, 1437, 7736, -7981, -1689, 8373, -6892, -5245, 11460, -2293, -12018, 9094]
2589I094k277j9496J2889J1172j7550R43J4451j0480m702J4229p540r375J6762
2602H120j105j8286J2780J1857j9281j305J8769r113j0909J4181k00j2034J0044
2615C518L238j4324Q008J0746j6618j464J8187q706j3107J4502L866j4554N309
2628a399Q148j0619J591Q979j0778j530J4312q034j1483J5205L825j7163N105
2641c841J2608j0858m305J1414m761n725R749l215q940J1438K838j4774N092J2939
2655I659j1488o816J3713q76j0056O380L029o958M388K820q757L813Q716j0082
2669b515m453J3125j667j1777O761O705q343n86N929l989l92M682n137k040Q576
2684D879k509r409P256O413r416j983Q482j799n075L143M88j330K733k212l540
$$ y = [9094, 6817, -12679, 210, 11382, -6168, -5225, 9226, -1254, -5956, 8273, 733, -8642, 8120, 7015, -11271, 1509, 13366, -5915, -7220, 11549, 2436, -8473, 5708, 5508, -6526, 3518, 6756, -7568, 440, 11186, -5432, -6896, 11291, 2585, -10522, 3980, 7846, -6708, -1399, 6749, -3870, -2279, 6700, -4078, -5608, 8704, 670, -10813, 4392, 8217, -8946, -3841, 8767, -2091, -6396, 5018, 257, -5468, 4281, 1066, -7874, 3564, 6402, -8372, -3280, 9659, -1829, -8645, 5068, 4192, -5864, 516, 3545, -3413, 975, 3795, -4962, -1149, 7567, -2515, -6968, 6157, 4490, -7287, -526, 6179, -2164, -2750, 3179, -810, -1202, 3480, -1657, -3697, 4879, 2370, -7039, 217, 6630, -2786, -4769, 3713, 1914, -3161, -18, 470, -860, 1873, -339, -3879]
2699c879N955J977q063O42Q420l522o387N119L168m187p99J618j8J095m54l147
2715b462J841M418m024m189N540K676n809r89M453R30l326j481K576K086k262
2730b2k597J899L017j732l154J413L139j061l160K62M108k83m765N16N127j491
2746A216m335J526L247j009k078K2J183J865j285l723K867M957n391m076O797
2761A783K096o746K36N131j655k322J384n22O90K589m177k364P653m34q728M019
2777a367P132o257l894O383J35m153K731k50k994N263n11p919N532P125r722l581
2793f347J1447j566r604N700M885o921P22M176n493K093N712p858k462J1117k924
2808B677j0909Q342O769j0752q39R180m640l504O288l521l275Q613k898r230R533
$$ y = [-3879, 2076, 4053, -4010, -3368, 5052, 1530, -4857, 262, 3430, -757, -1556, 62, 44, 1139, 685, -2462, -621, 3797, -227, -4416, 1124, 3800, -2009, -2998, 1455, 2385, -941, -2422, 154, 2240, -22, -2619, -720, 2297, 565, -2589, -1176, 1963, 902, -2258, -1996, 2112, 1829, -2936, -2420, 2707, 1216, -3119, -1593, 1654, 645, -1433, -1411, -228, 1637, 352, -3371, -504, 4453, -938, -5014, 1783, 3879, -2867, -2631, 2500, 845, -1477, -93, -615, 75, 2664, -1513, -3877, 3776, 3342, -5386, -1367, 5765, -492, -4386, 1997, 2132, -2021, 710, 460, -2534, 2729, 2218, -5701, -169, 6956, -2766, -6347, 5100, 3534, -6070, -370, 4515, -2406, -1684, 2492, -3001, -908, 4804, -3054, -5516, 5601, 2677, -8232, 110, 6879, -3873, -4712, 4468, -172, -3676, 2612, -909, -4184, 4429, 1531, -7699, 1834]
2823A834N533j3337P80J2994o709q108R874Q44q347N876J788p850O049N071j1656
2838e364J001J3435q594r434J3336K068j3105M923P804q876Q55O982p870q04J0686
2853G043p341q319J3806J677j5842O378J1679j1727l742J1683m356o489Q848k116
2867A182p840R778J952j3589O136J1851j3091m741J4931l498j0935Q914L255q990
2881d685M847L998r501L906R115j1503l302J5153m832j2846J1472N829j2705K262
2895b792Q713p661j291Q510o609l819J1650l914j1654J1301O225j4737J411J2961
2909H294q061o145R784j591o426P085m62q495Q072M740j2898K325J2840r361p615
2924g914J2185O62j0367N182M395p072K435M729p886J307R292q289n846J2121
$$ y = [1834, 7367, -5970, -5190, 7804, 1095, -7013, 2861, 3705, -4642, 1234, 3022, -4828, 1221, 6292, -5364, -4363, 9072, 478, -8956, 4380, 6448, -6657, -1734, 6070, -2806, -1951, 5031, -2839, -3643, 7043, -298, -8617, 5189, 6866, -8976, -2598, 9081, -2646, -6388, 5295, 939, -5550, 3298, 1182, -6658, 3120, 5072, -8517, -2381, 9470, -3621, -8362, 6569, 3071, -7864, 1050, 4305, -4685, 162, 4160, -5341, -1435, 7680, -3823, -7125, 8028, 3196, -9650, 1822, 7651, -5054, -2792, 5921, -1740, -3031, 5479, -1130, -4949, 6701, 2787, -8867, 2434, 8659, -6078, -4667, 8294, 233, -5912, 3872, 2281, -4145, 2940, 2478, -6017, 2055, 6795, -6103, -3778, 9062, -299, -7914, 4271, 4933, -5434, -252, 4143, -2929, -494, 4235, -3651, -2344, 6948, -1341, -7187, 4934]
2938D934P4j1803N579P153q025j282O849l949j487N400m634l329R382j998r880
2953g016P531O329j0252j299R432l118n664N206L05m097M570l18o233N618M185
2968E179r482N18R434m318o710O170K525n464Q78K661k805J964J150n091K461
2983i30N462n419l993P297R96o881J818M477k712j069J646j465J251J987m284
2998a819l04O006k283n366M327L639m721j161L061j08q38M1j542J877K648m407
3014i50j710N619q2n763J795L955k461j733J583k24O79K03k831Q51M215l309l894
3031d057M970K068n314K43L651j379j089O80j331J560K407m560j404O895j439
3046A901o785M406M638n770j055M600j805j216K828k814j177N945k526o479O811
$$ y = [4934, 5008, -6795, -1216, 5937, -2088, -3370, 3479, -470, -1957, 3443, -1191, -4520, 4862, 2864, -7016, 515, 6844, -3408, -4707, 4725, 1607, -4057, 1149, 1454, -2643, 1927, 1609, -4624, 994, 5179, -4303, -3785, 5649, 1331, -5379, 791, 3316, -2148, -1270, 1391, -1414, 550, 1700, -3391, -930, 4532, -887, -4880, 2417, 3413, -3468, -1650, 2827, 115, -954, 692, -773, 478, 2465, -1819, -2123, 3883, 1600, -3766, 561, 4200, -521, -1682, 1379, 1271, 433, 474, -1068, 809, 3457, -950, -2660, 2959, 2877, -2886, -1091, 2864, 403, -1330, 253, 29, 708, 911, -1920, -1069, 3146, -163, -4057, 913, 2981, -2333, -2090, 1561, 182, -907, -227, -1558, 2, 2409, -2151, -3555, 3340, 1901, -4884, -478, 4160, -1610, -2665, 1935, 130, -1086, 1742, -1072, -2249, 3696, 1170, -5309, 1502]
3061A502L841q818O43P664l919m374N286k68l486M089r89n159O188K257r400K680
3077b263R159p456n533R532Q7q030M622L063o218L203L533p821K162Q243q200
3092a917m772J1770j257j0665O376O265q928O47O846o109q27P596o314m346J1247
3107E612k082j1671R117O970j2851Q5J1891o701n822R401k018p223Q663K50j0539
3122f918P637P077j3239J35J3596p565q898J1754J066j0662O359M157r544M429
3136f16O845j1067K78J2738q396r089J3991J396j4344O649Q992j1212k98J0024
3150E891p832l148J1312n972q408J2703J592j5085P212J1267j2976l091J3535
3163G000n765p869J0839j182r541R711K434j3284O492J0837j3576l611J6232n576
$$ y = [1502, 5343, -3475, -2832, 4832, 913, -3461, 1825, 1557, -1929, 2160, 1171, -3988, 2200, 4457, -4943, -2263, 6896, -560, -6093, 3439, 3526, -4504, 118, 3181, -3037, 166, 3699, -4122, -1960, 6283, -1917, -6689, 5081, 3824, -6841, -465, 5800, -3128, -2481, 4365, -1744, -2571, 5025, -1289, -5635, 5612, 3530, -8141, 976, 7946, -4905, -4820, 7071, 370, -5452, 3949, 1931, -5292, 3371, 3621, -6918, 719, 7796, -5443, -5308, 8288, 723, -8175, 3579, 4645, -6017, 342, 4499, -5045, -616, 6229, -4838, -4560, 8178, -218, -9307, 4684, 6080, -8264, -1615, 7377, -3835, -4133, 5891, -1941, -5089, 6223, 251, -8157, 4546, 6138, -8947, -1735, 9532, -3444, -6535, 7000, 1235, -6634, 4205, 3023, -6518, 3193, 5627, -7657, -1165, 9672, -3904, -7515, 8717, 3141]
3177C141j2036J1741L515j2362N522O574j0607K252J0091j0707m139J4882m796
3190C071j3106J2332N600j4469L177J0811r706k523J0225o238m978J1352l350
3203B198j0900J1329N169j5259L299J3479j0676o165J2825k769r038R214R88r954
3217f260P511N562j2924K207J3168j0305p660J4505q85j2452P749N874j0269K390
3231a789P172q691J07J0032q014o277J3328j112j3230Q095Q378j1993m98R940
3245E448n673m253Q196l206o028R271n8j1095P273P810j1969j095J1861m829p758
3260f105Q249J085p055M684K116p246M418N615r838j6J0843n765q168R594K587
3275D998r494K917O037o428J29N565n531j122P907m577o651R077K311j0326K690
$$ y = [3141, -8895, 2846, 6361, -6001, -479, 6095, -4512, -2260, 7831, -2876, -7015, 7867, 3071, -10035, 2297, 7897, -6572, -3395, 7416, -2290, -4813, 5412, -826, -5804, 5548, 2198, -8702, 2627, 7796, -7463, -4164, 9315, -1361, -7526, 5299, 2530, -6508, 2706, 3694, -6260, 1251, 6813, -6111, -3904, 9264, -1041, -8701, 5804, 4919, -7533, 216, 6090, -4179, -1789, 5383, -3308, -3201, 6831, -1183, -7460, 5868, 4756, -8474, -379, 7999, -3994, -4492, 5448, -225, -4478, 3718, 512, -5516, 3755, 3697, -7398, -125, 7685, -4284, -5379, 6482, 1653, -6105, 2144, 3229, -3826, 858, 2974, -4272, 146, 5761, -4077, -4093, 6750, 985, -7183, 2411, 4998, -4496, -1579, 4458, -1970, -1841, 3724, -1807, -2929, 4978, 401, -6250, 2827, 5138, -5188, -2498]
3290b498P998n837l577O176j189l241M043j618l443N432O16p447L455O570o495
3305a055l539P424m53n420K702K249l114J523P21l637K922L099n491j364O753
3320C320j376o005L697L688m202q57K334o01J97N82k799J267L819l141l190M409
3336A142J901m865m18L975p10k173O31Q20M20L69k441O2L479q27l426J147L395
3353B481k009k316J627J959o23k054m82K803O80l714k8L679o41l364J307K102
3369A407q70r66l97M19J907p78l357K104L604l607k709M490J082m087L63K398
3385A003q13j23j33j670K115K181m773n32O117j782n573L644L662m440q12L387
3401A458j378p19K048k818l16N130k780n227N846K950p425N00O640l302l457L888
$$ y = [-2498, 5500, -337, -3914, 2262, 1073, -2168, 1875, 257, -3186, 2246, 2862, -4585, -1130, 5440, -1055, -4594, 2830, 2377, -3043, -341, 1908, -1206, 317, 1038, -2599, 323, 3422, -2069, -3433, 3320, 1944, -4061, -364, 3324, -878, -1735, 599, -2, 195, 777, -2022, -755, 3064, -77, -3267, 1142, 3043, -1822, -2240, 1735, 1025, -1148, -517, 303, 723, 1092, -1349, -1287, 2192, 1365, -2061, -914, 2481, 472, -1844, -217, 1742, 1119, -935, -1417, 1386, 2066, -1648, -1676, 2003, 1362, -2002, -695, 1407, 537, -429, -826, -407, 1500, 722, -2635, -531, 3073, -534, -3243, 1247, 2329, -1758, -1395, 1003, 190, 67, -66, -1736, 379, 2560, -2213, -2745, 3372, 1590, -3983, -339, 3323, -1117, -1929, 1458, 80, -639, 1409, -1409, -1725, 3405, 625, -4602, 1244, 4194, -3231, -2731, 3909, 607, -2850, 1038]
3417A038m68k276L591j384m122N562J931q497K274P967n964m795P636N45o663
3432c625L362K943n150K333L105o261J229P631o559n007R776q0r145M477O123
3447E152p016r10N881l885j428O068m307m186Q603o74r654O187O901r497j842
3462d607R572l604n713O745m54n805O004R40q405N481O300j0036j582J1574m767
3477A643q236Q588K504q945L622M654p145K168O147q229j139J0772n251r013J0378
3492B518L641j1987L016Q869p783k112P970m637l685Q339k568q189R369L229j2192
3507f202L405J0603q799m865J0215j807p223O660R72p174N833L389r989L243R267
3522G528r067n104J2374j791j0688P430M794r036K075O002p325L19Q041o936m758
$$ y = [1038, 570, -1706, 1885, 501, -3621, 1941, 3872, -4625, -2351, 5616, -348, -5143, 2493, 3038, -3625, -263, 2680, -2470, -137, 2968, -3293, -2064, 5567, -992, -5999, 3777, 3697, -5448, -971, 5152, -1864, -2774, 3107, -778, -2206, 3862, -445, -4631, 3972, 3298, -6356, -169, 6732, -2765, -4607, 4965, 1361, -4352, 2393, 1939, -3866, 2138, 3078, -5327, 154, 6454, -3582, -5164, 6410, 1643, -6593, 1995, 4499, -4446, -824, 3830, -3315, -1147, 5000, -3229, -4368, 6404, 1153, -7860, 2518, 6159, -5828, -2812, 6057, -1726, -3838, 4132, -505, -4190, 4149, 1581, -6608, 2761, 5990, -6202, -2797, 7806, -993, -5858, 4357, 2550, -4673, 1987, 2959, -4215, 1618, 5007, -4982, -1739, 7528, -1539, -6643, 5731, 3940, -6748, 682, 5476, -3560, -1485, 4517, -2808, -2489, 5552, -1384, -6142]
3537f142J1397j513j1501P884O708j0792k00R252n434l858P562k918n100Q333
3551C678q98r455P310O173j1447k03J1382n920o803Q655O69p163M574K268o772
3566c952L907N264r013j65J0516o095p485J0010J882r635L487N642o034L8M911
3581C278m848r49P333n020n357R363P37j0252M441P259p605k222P350k628l749
3596b869N377j753m374O127O62q302M471O616q086k589Q908j897o399M534K331
3611B757m693J967J909m533K526L921o244q57P734k929o216N442L067o091K45
3626a995M251k613o69L020l186k35M723l139m056N513J913o648J152N223k764
3641D90k842L241j02j588J712j211j567L890l86m845K471M096l976k390M484R2
$$ y = [-6142, 5255, 3742, -7759, 125, 6833, -3959, -4159, 5093, -341, -4199, 3363, 445, -4655, 3678, 2780, -6675, 635, 6808, -4639, -4842, 6540, 620, -6183, 2472, 3141, -4022, 552, 2820, -3952, -45, 5219, -3794, -3959, 6557, 462, -7023, 2987, 4869, -4766, -1279, 4363, -1671, -1633, 3278, -1570, -2519, 4814, -206, -5563, 3800, 4537, -5715, -1274, 5985, -1620, -3842, 3508, 880, -2869, 2508, 755, -3619, 2508, 3170, -5132, -661, 5955, -2131, -4720, 4188, 2291, -4108, 426, 2757, -1936, 31, 1940, -2593, -67, 3854, -2390, -3247, 4487, 1558, -4658, 784, 3851, -2240, -1995, 2256, -357, -1026, 1994, -1192, -1427, 3296, 157, -3899, 1614, 3527, -3121, -1969, 3254, 490, -2352, 889, 787, -801, 911, -300, -1867, 2023, 1637, -3208, -737, 3359, -617, -3007, 1477, 1569]
3657A569k988R58R36q52J067p37j860K654J394l771k99L900q38l270J513K169
3673A545j171r72J35P67J078j323j970K502J527k973p36K818R7k182O1J229J95
3690F27N7j361l14K677l74l450J664K939k784j589K520P89j950L97k28K22J298
3707A140j384k200L307J490m374M9M525j979l039K559R39j926Q62j55j333K392
3723H73O62m379J642M720m097k991N335N01m475J764K343k829P57J440l136J555
3739c15L360m421j693O392j251o143L956M038n366o25M223k217j414L553k507
3754d30k267N600j200o320N052M200p119n48O984l070m055M550J69l735L450J57
3770A418m874M144K936o999Q70P280m501n025O759J126o356K640L457m681J069
$$ y = [1569, -1419, -461, 475, -377, 690, -47, -1907, 747, 2141, -1630, -1929, 1971, 1133, -2137, -624, 1545, 374, -598, -463, 304, 1382, 59, -1911, 591, 2118, -855, -1591, 1227, 1324, -858, -797, 432, 627, 684, -677, -991, 1686, 1312, -2138, -474, 2465, -319, -1908, 612, 1401, -549, -152, -380, -158, 1140, -244, -2444, 863, 2353, -2021, -1972, 2553, 574, -2465, 94, 1033, -893, -31, -186, -1519, 873, 1535, -2844, -1202, 3518, -579, -3570, 1765, 2266, -2209, -445, 1898, -931, -174, 1266, -1870, -315, 3045, -1376, -3069, 3323, 2072, -4071, -115, 3923, -1443, -2068, 2155, -62, -1476, 2077, -430, -2697, 2903, 1703, -4617, 435, 4635, -2484, -3032, 3952, 882, -3173, 1377, 1546, -2189, 1261, 1418, -3456, 688, 3624, -3375, -2505, 4775, 274, -4751, 2008, 3134, -3222, -582, 2875, -1806, -737]
3785g37L564n004j82O812m724m956Q091R53q508L280O005o035j235N363k779k311
3801b403N061k396m394O588M72q110M295O325p353k314P932k099n639N290Q99
3816B154n086L740J764n998K898N238o711k029Q725k763p035O084L098o660J260
3831a321M374m393J69M212m664j369O736k664o296O782K785p984J205O809n017
3846f36k448N378k163k674M673j257m832N186K244p365J623P082n370l955O852
3861B338p9n466L267J725l877K201K211m898J415N064m793l203O863l22o480L501
3877e33M009m846k62L574k513n67L211k901j908N463j003n619M015L781n673q16
3893b588N053j715k455K261j10j493K261n70l097L368K056n038l1N210k178l591
$$ y = [-737, 2827, -2177, -2359, 4453, -271, -5227, 2864, 3817, -4691, -1411, 4594, -1441, -2676, 2687, -92, -2403, 2658, 262, -4132, 2456, 2928, -5182, -887, 5438, -1915, -4229, 3703, 1604, -4035, 1255, 2154, -2932, 808, 2572, -3426, -528, 4710, -2001, -4030, 4695, 1932, -5103, 981, 4079, -2581, -1321, 3053, -1340, -1171, 3041, -1623, -2992, 3744, 1080, -5216, 1566, 4351, -3633, -2428, 4381, -636, -3084, 2294, 131, -2543, 2130, 873, -3959, 1227, 3471, -3894, -2271, 4811, -559, -4514, 2338, 2259, -3207, 60, 1785, -2092, 109, 2320, -2578, -1163, 3901, -892, -4095, 2768, 2446, -4034, -533, 3476, -1370, -1632, 1942, -571, -1138, 2073, -828, -2736, 2727, 1724, -3895, 120, 3901, -1772, -2588, 2465, 750, -1705, 556, 446, -1047, 1214, 644, -2453, 915, 2971, -2067, -2098, 3112, 934, -2657]
3909b657L484J185k883N56J287j263R26O30k788Q93L188k524k518L820J006l722
3925a380J61K668o95j462L70L99J62M99j779N4K543q28k534J034K179j371j508
3942a488J101R33k83j233R4J124L54j711n29K269J51k012K82J296J19j026q89
3959a448J426J372j682j579K260J281k387q78K499rj559M03O23Q2P28j636q27
3976a331K979pl469J178L556k633j963K590N91j987Q20L1q71J779r9l200K255
3993B19L255m363j812N217l91m740K510K417l199K70J898k234O33K647l527j567
4009b767N577j413n568M205L424n462l12M856k520k019L393j527j893M052j152
4024H74m514M460L098p274N02P111l892m301N551M68m862L315J208m312K713K902
$$ y = [-2657, 827, 2012, -871, -315, 972, -291, 635, 1265, -1523, -630, 2558, 34, -2484, 1336, 2342, -1380, -1219, 1449, 754, -708, -338, 61, 223, 722, -1057, -1003, 1540, 712, -1822, -788, 1391, 20, -1488, -387, 546, 263, -970, -876, 248, 602, -1109, -1638, 631, 782, -1230, -948, 348, 467, -559, -1448, -22, 1350, -332, -1911, 349, 1630, -757, -1635, 864, 855, -704, -301, 322, 404, 1132, -504, -1331, 1648, 1641, -1828, -650, 2906, 273, -1690, 900, 1491, -496, 324, 355, -516, 1263, 1164, -2036, 219, 3474, -889, -2701, 2516, 2125, -2615, -105, 2312, -887, -617, 1281, -953, -320, 2327, -1200, -2767, 2810, 1397, -4171, 34, 3458, -2004, -2316, 2540, 20, -1999, 1394, -133, -2026, 2026, 874, -3640, 820, 3918, -3356, -2854, 4257, 365, -3936, 1615, 2083, -2779, 536, 1744, -2568, 145, 3047]
4040C047n951M83P056m553n353P618R02p271L422M286n590M31M397m509q33O467
4056D049m028m614P809O34q959M438O378p460j445P194l300l963O068j098n404
4071c701O090J312q170M027O555p946k315R332l353o398O414J555o643L669L154
$$ y = [3047, -2904, -2421, 4635, 82, -5271, 2347, 3249, -4022, -600, 3686, -1904, -1473, 2924, -1585, -2418, 4049, 21, -4593, 3216, 3850, -5109, -671, 5707, -1753, -3198, 3996, 696, -3267, 2801, 1703, -3701, 2389, 3701, -4469, -442, 6113, -1833, -4148, 5184, 1831, -4567, 1847, 3402, -3241, 428, 3582]
$$ [...]
8191A09
##END NTUPLES=NMR FID
##END=
