##TITLE=1H_SA_6/SL
 CDCl3, 8 sc, 
 25.11.2020
##JCAMPDX= 6.0         $$ Bruker NMR JCAMP-DX V2.0
##DATA TYPE= NMR FID
##DATA CLASS= NTUPLES
##ORIGIN= UXNMR, Bruker Analytische Messtechnik GmbH
##OWNER= root
$$ XWIN-NMR		Version 3.5
$$ Thu Nov 26 10:12:19 2020 Russian Standard Time (UT+4h)  she@DPX200
##.OBSERVE FREQUENCY= 200.1315066352
##.OBSERVE NUCLEUS= ^1H
##.DELAY= (6, 6)
##.ACQUISITION MODE= SIMULTANEOUS
##.ACQUISITION SCHEME= undefined
##.AVERAGES= 8
##.DIGITISER RES= 18
##SPECTROMETER/DATA SYSTEM= spect
##.PULSE SEQUENCE= zg30
##.SOLVENT NAME= CDCl3
##.SHIFT REFERENCE= (INTERNAL, CDCl3, 0, 15.7039)
##AUDIT TRAIL= $$ (NUMBER, WHEN, WHO, WHERE, WHAT)
$$ ##TITLE= Audit trail, XWIN-NMR		Version 3.5
$$ ##JCAMPDX= 5.01
$$ ##ORIGIN= Bruker BioSpin GmbH
$$ ##OWNER= she
$$ F:/spectra/data/she/nmr/H-F/1/audita.txt
$$ ##AUDIT TRAIL=  $$ (NUMBER, WHEN, WHO, WHERE, WHAT)
(   1,<2020-11-26 10:10:58.64 +0400>,<she>,<DPX200>,
      <created by zg, POWCHK disabled, PULCHK disabled
       configuration hash MD5:
       00 E9 B6 7A A2 85 ED C7 34 08 36 98 17 FE 4E 26
       data hash MD5: 16K
       F2 72 FF 48 53 EC B7 7A 67 AD E1 50 F5 B1 8F AC>)
$$ ##END=
$$ 
$$ hash MD5
$$ 2E CF 4E DD 55 53 9C 97 0A 4A 59 B7 25 1C DE 2D
##$RELAX= 
##$RELAX= 
##$RELAX= 
##$RELAX= 
##$RELAX= 
##$RELAX= 
$$ Bruker specific parameters
$$ --------------------------
##$DU= <F:/spectra>
##$EXPNO= 1
##$NAME= <H-F>
##$PROCNO= 1
##$TYPE= <nmr>
##$USER= <she>
##$AMP= (0..31)
100 100 100 100 100 100 100 100 100 100 100 100 100 100 100 100 100 100 
100 100 100 100 100 100 100 100 100 100 100 100 100 100 
##$AQSEQ= 0
##$AQ_mod= 1
##$AUNM= <au_zg>
##$AUTOPOS= <>
##$BF1= 200.13
##$BF2= 200.13
##$BF3= 200.13
##$BF4= 200.13
##$BF5= 200.13
##$BF6= 200.13
##$BF7= 200.13
##$BF8= 200.13
##$BYTORDA= 1
##$CFDGTYP= 0
##$CFRGTYP= 5
##$CHEMSTR= <none>
##$CNST= (0..31)
1 1 145 1 1 1 1 1 1 1 1 1 1 1 1 1 1 1 1 1 1 1 1 1 1 1 1 1 1 1 1 1 
##$CPDPRG= <>
##$CPDPRG1= <>
##$CPDPRG2= <>
##$CPDPRG3= <>
##$CPDPRG4= <mlev>
##$CPDPRG5= <mlev>
##$CPDPRG6= <mlev>
##$CPDPRG7= <mlev>
##$CPDPRG8= <mlev>
##$CPDPRGB= <>
##$CPDPRGT= <>
##$D= (0..31)
0 1.2 0 0 0 0 0 0 0 0.06 0 0.03 0 0 0 0 0.0002 0 0 0 0 0 0 0 0 0 0 0 0 
0 0 0 
##$DATE= 1606371058
##$DBL= (0..7)
120 120 120 120 120 120 120 120 
##$DBP= (0..7)
150 150 150 150 150 150 150 150 
##$DBP07= 0
##$DBPNAM0= <>
##$DBPNAM1= <>
##$DBPNAM2= <>
##$DBPNAM3= <>
##$DBPNAM4= <>
##$DBPNAM5= <>
##$DBPNAM6= <>
##$DBPNAM7= <>
##$DBPOAL= (0..7)
0.5 0.5 0.5 0.5 0.5 0.5 0.5 0.5 
##$DBPOFFS= (0..7)
0 0 0 0 0 0 0 0 
##$DE= 6
##$DECBNUC= <off>
##$DECIM= 32
##$DECNUC= <off>
##$DECSTAT= 4
##$DIGMOD= 1
##$DIGTYP= 9
##$DL= (0..7)
0 120 120 120 120 120 120 120 
##$DP= (0..7)
150 150 150 150 150 150 150 150 
##$DP07= 0
##$DPNAME0= <>
##$DPNAME1= <>
##$DPNAME2= <>
##$DPNAME3= <>
##$DPNAME4= <>
##$DPNAME5= <>
##$DPNAME6= <>
##$DPNAME7= <>
##$DPOAL= (0..7)
0.5 0.5 0.5 0.5 0.5 0.5 0.5 0.5 
##$DPOFFS= (0..7)
0 0 0 0 0 0 0 0 
##$DQDMODE= 0
##$DR= 18
##$DS= 0
##$DSLIST= <SSSSSSSSSSSSSSS>
$$ [...]
##$SUBNAM2= <"">
##$SUBNAM3= <"">
##$SUBNAM4= <"">
##$SUBNAM5= <"">
##$SUBNAM6= <"">
##$SUBNAM7= <"">
##$SUBNAM8= <"">
##$SUBNAM9= <"">
##$SW= 16.9725356469052
##$SWIBOX= (0..15)
0 0 2 0 0 0 0 0 0 0 0 0 0 0 0 0 
##$SW_h= 3396.73913043478
##$TD= 16384
##$TD0= 1
##$TE= 0
##$TE2= 300
##$TE3= 300
##$TEG= 300
##$TL= (0..7)
0 120 120 120 120 120 120 120 
##$TP= (0..7)
150 150 150 150 150 150 150 150 
##$TP07= 0
##$TPNAME0= <>
##$TPNAME1= <>
##$TPNAME2= <>
##$TPNAME3= <>
##$TPNAME4= <>
##$TPNAME5= <>
##$TPNAME6= <>
##$TPNAME7= <>
##$TPOAL= (0..7)
0.5 0.5 0.5 0.5 0.5 0.5 0.5 0.5 
##$TPOFFS= (0..7)
0 0 0 0 0 0 0 0 
##$TUNHIN= 0
##$TUNHOUT= 0
##$TUNXOUT= 0
##$USERA1= <user>
##$USERA2= <user>
##$USERA3= <user>
##$USERA4= <user>
##$USERA5= <user>
##$V9= 5
##$VALIST= <valist>
##$VCLIST= <CCCCCCCCCCCCCCC>
##$VD= 0
##$VDLIST= <DDDDDDDDDDDDDDD>
##$VPLIST= <PPPPPPPPPPPPPPP>
##$VTLIST= <TTTTTTTTTTTTTTT>
##$WBST= 1024
##$WBSW= 4
##$XGAIN= (0..3)
0 0 0 0 
##$XL= 0
##$YL= 0
##$YMAX_a= 220257
##$YMIN_a= -183813
##$ZGOPTNS= <>
##$ZL1= 120
##$ZL2= 120
##$ZL3= 120
##$ZL4= 120
##$ABSF1= 10
##$ABSF2= 0
##$ABSG= 5
##$ABSL= 3
##$ALPHA= 0
##$AQORDER= 0
##$ASSFAC= 0
##$ASSFACI= 0
##$ASSFACX= 0
##$ASSWID= 0
##$AUNMP= <proc_1d>
##$AZFE= 0.1
##$AZFW= 0.1
##$BCFW= 1
##$BC_mod= 2
##$BYTORDP= 1
##$COROFFS= 0
##$CY= 11.3945322036743
##$DATMOD= 1
##$DC= 2
##$DFILT= <>
##$DTYPP= 0
##$F1P= 15.9154993809931
##$F2P= -4.1035820241983
##$FCOR= 0.5
##$FTSIZE= 0
##$FT_mod= 4
##$GAMMA= 1
##$GB= 0.15
##$INTBC= 1
##$INTSCL= 1
##$ISEN= 128
##$LB= 0.24
##$LEV0= 0
##$LPBIN= 0
##$MAXI= 10000
##$MC2= 0
##$MEAN= 0
##$ME_mod= 0
##$MI= 1.114404
##$NCOEF= 0
##$NC_proc= 0
##$NLEV= 6
##$NOISF1= 3.799351
##$NOISF2= 2.8
##$NSP= 1
##$NTH_PI= 0
##$NZP= 0
##$OFFSET= 15.70392
##$PC= 1
##$PHC0= -11047.39
##$PHC1= 8.20088
##$PH_mod= 1
##$PKNL= yes
##$PPARMOD= 0
##$PSCAL= 0
##$PSIGN= 0
##$REVERSE= no
##$SF= 200.130013532006
##$SI= 16384
##$SIGF1= 3
##$SIGF2= 2
##$SINO= 400
##$SIOLD= 16384
##$SREGLST= <1H.CDCl3>
##$SSB= 0
##$STSI= 0
##$STSR= 0
##$SW_p= 3612.71676300578
##$SYMM= 0
##$S_DEV= 0
##$TDeff= 0
##$TDoff= 0
##$TI= <>
##$TILT= no
##$TM1= 0
##$TM2= 0
##$TOPLEV= 0
##$USERP1= <user>
##$USERP2= <user>
##$USERP3= <user>
##$USERP4= <user>
##$USERP5= <user>
##$WDW= 1
##$XDIM= 8192
##$YMAX_p= 0
##$YMIN_p= 0
$$ End of Bruker specific parameters
$$ ---------------------------------
##NTUPLES= NMR FID
##VAR_NAME=  TIME,          FID/REAL,        FID/IMAG
##SYMBOL=    X,             R,               I
##VAR_TYPE=  INDEPENDENT,   DEPENDENT,       DEPENDENT
##VAR_FORM=  AFFN,          ASDF,            ASDF
##VAR_DIM=   8192,          8192,            8192
##UNITS=     SECONDS,       ARBITRARY UNITS, ARBITRARY UNITS
##FACTOR=    0.0002944,     1,               1
##FIRST=     0,             0,               0
##LAST=      2.4114304,     0,               0
##MIN=       0,             -183813,         0
##MAX=       2.4114304,     220257,          0
$$ Real data points
##PAGE= N=1
##DATA TABLE= (X++(R..R)), XYDATA
0@%%%%%%%%%%%%%%Qj6J6j6J6j6K4l2L4m2N1n9P2q3R2j05J21j41J61j82K06k33
$$ 0 0 0 0 0 0 0 0 0 0 0 0 0 0 0 8 -8 8 -8 8 -8 16 -16 18 -24 27 -32 40 -43 49 -56 65 -76 85 -97 109 -124
36a24K64k97L31l70M15m62N13n69O30o97P70q51R40j035J138j255J384j524J683
$$ -124 140 -157 174 -196 219 -243 270 -299 331 -366 404 -447 493 -542 596 -659 725 -799 884
55H84j860K058k285K544k846L205l635M163m831N708o923Q738j1794J8351o2741
$$ 884 -976 1082 -1203 1341 -1505 1700 -1935 2228 -2603 3105 -3818 4920 -6874 11477 -51264
70e1264M5552j168j17113n9820K8573J40397K476j21128m2647Q9731R3188M424
$$ -51264 -5712 -6880 -123993 -183813 -155240 -14843 -12367 -133495 -176142 -86411 6777 11201
82A1201j21141k6549R2980Q5708l4044j04239j3045R2871P8879n2716q7997P891
$$ 11201 -109940 -136489 -43509 42199 8155 -96084 -109129 -16258 62621 9905 -78092 -70201
94g0201R8812O6664o3345p3374J4879J00282L8221p2679q0227K4875Q4924J1834
$$ -70201 28611 95275 31930 -41444 -26565 73717 111938 39259 -40968 -16093 68831 80665
106H0665p8496q2606M2128P5298J817p6884o4932N7790P7271l180q0005l9348
$$ 80665 2169 -80437 -38309 36989 38806 -38078 -103010 -45220 32051 28871 -51134 -90482
118i0482N8383P6526k0716q4333k4802N5876P0226m0382p9048j2239O4731O0094
$$ -90482 -32099 44427 23711 -60622 -85424 -29548 40678 296 -78752 -90991 -26260 33834
130C3834m4663o8298L739P9429M0800m3114o3525J4571P8856J9305n1118o2626
$$ 33834 -10829 -79127 -75388 4041 44841 1727 -61798 -47227 31629 50934 -184 -62810
142f2810K2786O6490R921o4518n0029L5410N8386R801o7632l0750M7637N6845
$$ -62810 -40024 26466 36387 -28131 -78160 -42750 15636 25437 -42195 -72945 -25308 31537
154C1537J47o2235k0198N0094N4099k2085n4935j7153N0812M5091l5582m8282
$$ 31537 31684 -30551 -50749 -655 53444 31359 -23576 -40729 10083 55174 19592 -28690
166b8690p702N5818L2943l3620m5293P079N5627K0858l4105m6193J7366M5274
$$ -28690 -36392 19426 52369 18749 -26544 -19465 36162 57020 22915 -23278 -5912 39362
178C9362Q961m2710m2989K0975L6248Q18m9543k7639K3597L6643m479m5440j1588
$$ 39362 48323 5613 -37376 -16401 19847 20665 -28878 -56517 -32920 3723 -756 -46196 -57784
191e7784K7030L7459j3570l5652n084L0375K7879j8830k9775l108L5286J4728
$$ -57784 -30754 6705 -6865 -42517 -47601 -17226 10653 -8177 -37952 -41060 -5774 8954
203H954j5639k4420K874L6678Q975j2071j9893J0732K8947R119j7361j6616J1939
$$ 8954 -6685 -31105 -28231 8447 17422 5351 -14542 -3810 25137 34256 16895 279 12218
216A2218J6303P357k4831j2915Q064J1631K086k1655r887N736J5723m421j3054
$$ 12218 28521 35878 11047 -1868 6196 17827 19913 -1742 -11629 -5893 9830 5409 -7645
229g645q423P417J5868p146r252r305J0383R794m840j1965m751J1458M903J57
$$ -7645 -16068 -8651 7217 71 -9181 -18486 -8103 1691 -3149 -15114 -19865 -8407 -3504 -3347
243c347j3604L079J0028N881q7r787O489O475O410o200k467J379L898K246p794
$$ -3347 -16951 -13872 -3844 2037 1950 -7837 -1348 5127 11537 5337 2870 4249 8147 10393 2599
258B599P07l299L633k716k377O99k376J375l476M433j059M82n313J400O242j076
$$ 2599 3306 7 3640 924 -1453 -754 -3130 -1755 -5231 -798 -1857 -1375 -6688 -5288 954 -122
274a22j272r041O737N719J151p780n301Q883Q505J504j3966R87Q329J2191l830
$$ -122 -1394 -10435 -3698 2021 3172 -4608 -9909 -1026 7479 8983 -4983 -3996 4333 16524 12694
289A2694j5423J967J1404J1709j1858j3270q80J6967O594j5795j2427l46K1601
$$ 12694 -2729 -762 10642 22351 10493 -2777 -3657 13310 19904 4109 -8318 -8664 12937
302A2937J607j6389j4973O656K0252K45j7408j6371J5503J6816R48k1465j2971
$$ 12937 14544 -1845 -16818 -10162 10090 10335 -7073 -23444 -7941 8875 9823 -11642 -24613
315b4613K0027J7134j563k5245o132J9847K1050r788k4912j504K0730K2271j7372
$$ -24613 -4586 12548 10985 -14260 -20392 -545 20505 10717 -14195 -15699 5031 27302 9930
328I930k3618O81K6200J7073k0760k4690M003L2371P905k2472k7018J0654L2804
$$ 9930 -13688 -13007 13193 30266 9506 -15184 -11181 21190 29095 6623 -20395 -9741 23063
341B3063R13k5901k5688J7993L0163q20l2569j7316K3396K8011k227l7192q297
$$ 23063 23976 -1925 -27613 -9620 20543 19723 -12846 -30162 -6766 21245 19018 -18174 -26471
354b6471K6542K7374r692l6071m028K8952K5221j8578l1545l389L3692K1009k5130
$$ -26471 71 27445 17753 -18318 -22346 6606 31827 13249 -18296 -21685 12007 33016 7886
367G886k8304J150L8207J4055k6741k9668R861L6691P896k9856l1605J8054L3203
$$ 7886 -20418 -19268 18939 32994 6253 -23415 -13554 23137 31033 1177 -30428 -12374 20829
380B0829L419l6621k6854K3498L2858j171m0369j6980K8049L5972q211l9916r205
$$ 20829 24248 -12373 -39227 -15729 17129 15958 -24411 -41391 -13342 22630 14419 -25497 -34702
393c4702L2148L5830j8266l8183m675L7497K8903k5619l6503J140M3057J9228
$$ -34702 -2554 33276 15010 -23173 -27848 9649 38552 12933 -23570 -22430 20627 39855
405C9855k6578l5800J0565M4672J1153k9494l4065J8210M0575M772l8626k8895
$$ 39855 13277 -22523 -11958 32714 43867 14373 -19692 -1482 39093 43865 5239 -23656
417b3656K1198L4732j014m6134k0246K4214L3836p729m4735j2247L1253L3078
$$ -23656 -2458 32274 31260 -14874 -35120 -10906 22930 15201 -29534 -41781 -10528 22550
429B2550j5851l8513q773L7821K8276k3705l5556m469M1279K1265k6495l6255
$$ 22550 6699 -31814 -40587 -2766 25510 1805 -33751 -38220 3059 24324 -2171 -38426
441c8426O694M2287J6619k7062l4259J7959M1623J1998l2959k8487K1996L7628
$$ -38426 -31732 10555 27174 112 -34147 -16188 25435 37433 4474 -24013 -2017 35611
453C5611M408m0982k2991K2499L5993o213m2870j5686K6223L4787j4052l8079
$$ 35611 40019 -963 -23954 -1455 34538 28325 -14545 -30231 -4008 30779 16727 -21352
465b1352r524L3538L0850k0300l5732l164L7163K1051k3147l7132L678L8343J1980
$$ -21352 -30876 2662 33512 13212 -22520 -25684 11479 32530 9383 -27749 -24071 14272 26252
478B6252k4830l4515J3246L8000R050k8522k5305J9386L4681N518l5081j7373
$$ 26252 1422 -33093 -19847 18153 27203 -1319 -26624 -7238 27443 32961 -2120 -19493
490a9493J8755L0895k821l7474j5455K0698K7516j2261l1457j2818K5603K4565
$$ -19493 -738 30157 27336 -10138 -25593 -4895 22621 10360 -21097 -33915 -8312 16253
502A6253j4330k6946p311L0199K1485j5596k8660R69L0314J4987j9052k9310Q506
$$ 16253 1923 -25023 -32334 -2135 19350 3754 -24906 -23937 6377 21364 2312 -26998 -18492
515a8492K8697J1453k0798k4881J4759K9857R534k5416j6049J6729K9659K872
$$ -18492 10205 21658 860 -24021 -9262 20595 30129 4713 -11336 5393 35052 37924
527C7924k8487j3119J6177K5971p708k8216j2945J8971K1044j3912k6109q339
$$ 37924 9437 -3682 12495 38466 30758 2542 -10403 8568 29612 15700 -10409 -18748
539a8748K3380J6116j3621k4515j373K4786J0913j4158k3967M081K2133P024j7291
$$ -18748 4632 20748 7127 -17388 -18761 6025 16938 2780 -21187 -17106 5027 12051 -5240
552e240k0099Q659J9978O943j9732j1376J1734K0960N376j8910o211J3842K0002
$$ -5240 -25339 -16680 3298 10241 -9491 -20867 -9133 11827 17203 -1707 -7918 5924 25926
565B5926j743j6839p445J5003J5512q508j5614p352J5413J1078j0085j4981k032
$$ 25926 24183 7344 -101 14902 30414 21906 6292 -1060 14353 25431 15346 365 -1667
578a667J5705P188q340j5566L818J2859M296r590j4227M923R996J781j2787q032
$$ -1667 14038 21226 12886 -2680 1138 13997 18293 8703 -5524 -601 9395 11176 -1611 -9643
592i643L837J0698R99j1914j951N177J1086m03p633j207P062P971k529n385l451
$$ -9643 -5806 4892 5891 -6023 -7974 -2797 8289 7886 253 -954 6108 14079 11550 6165 2714
607B714P656K759k890n342k594O291J072r61n469J397L422K494j025m397J303
$$ 2714 10370 13129 10239 4897 2303 8594 9666 8705 3236 4633 8055 10549 9524 5127 6430
622F430J819L120m049k133j242J457J815m209n66j569K815N11m31m10R53L210
$$ 6430 8249 11369 7320 5187 3945 5402 7217 3008 2442 873 3688 4199 3768 3358 4311 7521
638G521p36K575j956K212L07m51Q04o48k8k872P29r35K003l048k844J497J032
$$ 7521 6785 9360 7404 9616 9923 9472 10276 9628 9600 6728 7457 6522 8525 5477 2633 4130 5162
655E162K929m490k416J042M889K75n749l754J832P540m250n896m100N619P136
$$ 5162 8091 3601 1185 2227 7116 7391 1642 -2112 -280 7260 3010 -2886 -6986 -1367 5769
670E769m266p008k252J0780N248l566q966J814J1907M216o100j0359N537J0604
$$ 5769 1503 -5505 -7757 3023 8271 4705 -4261 -2447 9460 13676 7576 -2783 2754 13358
684A3358L397j1067q710P028J0436J578j4032n319P827J2230k218j4233l826R296
$$ 13358 16755 5688 -3022 4006 14442 16020 1988 -3331 4496 16726 14508 275 -3551 5745
698E745J2638p251j3504l852J2622R190r717j3647k059J6057O322r859j3956K767
$$ 5745 18383 11132 -2372 -6224 6398 15588 5871 -7776 -9835 6222 12544 2685 -11271 -8504
712h504J7008N121j1476j3666P573J5261M632j4949j2072J0068J4575K244j7775
$$ -8504 8504 13625 2149 -11517 -3944 11317 15949 1000 -11072 -1004 13571 15815 -1960
725a960r083J0565J6500k535j8054o060J1715J7658p518j7345m615J5346J3891
$$ -1960 -11043 -478 16022 13487 -4567 -10627 1088 18746 11228 -6117 -10732 4614 18505
738A8505r784j7975k877J9260R178j0886j8388J306K0368P114j2840j7993O568
$$ 18505 8721 -9254 -12131 7129 16307 5421 -12967 -11661 8707 15821 2981 -15012 -8444
751h444J9784O533j6378j5509J0039J9180M479k0093j1519J0908K0253j20k1438
$$ -8444 11340 17873 1495 -14014 -3975 15205 19684 -409 -11928 -1020 19233 19113 -2325
764b325q980J3018K0347n190k0964q133J7185J7682q579k0801o582K1090J4201
$$ -2325 -11305 1713 22060 16870 -4094 -12227 4958 22640 14061 -6740 -13322 7768 21969
777B1969j1190k2309j751K2534J1499j4052k2564M140K2023J0332j8700k0366
$$ 21969 10779 -11530 -13281 9253 20752 6700 -15864 -11724 10299 20631 1931 -18435
789a8435R517K2089O794k2224j6163J2463K3892N37k3743j2026J5528K3835n885
$$ -18435 -8918 13171 19965 -2259 -18422 -5959 17933 18470 -5273 -17299 -1771 22064 16179
802A6179k3587q442J9223K0240j0314k2862n362K2633J4681j2110k3263Q9K3468
$$ 16179 -7408 -15850 3373 23613 13299 -9563 -14925 7708 22389 10279 -12984 -12895 10573
815A0573J0580j4131k2055N647K2005Q107j7041j8668Q336K1076N818k0649j3984
$$ 10573 21153 7022 -15033 -9386 12619 20726 3685 -14983 -6647 14429 20247 -402 -14386
828a4386R930K1009K044k1187j0585J1906K0802k401j9595r820J5628J8632o018
$$ -14386 -4456 16553 18597 -2590 -13175 -1269 19533 17132 -2463 -12283 3345 21977 15959
841A5959j9740q492J9020J5120q838k1048l830J9530J2350j0753k1664J420J9242
$$ 15959 -3781 -12273 6747 21867 13029 -8019 -11849 7681 20031 9278 -12386 -10966 8276
854H276J1374j4855j9645N500J9510Q502j8102j5827P099K0652M100j9728j2282
$$ 8276 19650 4795 -14850 -9350 10160 18662 560 -15267 -8168 12484 16584 -3144 -15426
867a5426R475K1083o62j8745j0061J3522J9365m348j7554q196J7342J4707o100
$$ -15426 -5951 15132 14470 -4275 -14336 -814 18551 14203 -3351 -11547 5795 20502 14402
880A4402j9158l992J7879J1042r020j9263N86J6959R373j2118j7315M134J6453
$$ 14402 -4756 -8748 9131 20173 11153 -8110 -7524 9435 18808 6690 -10625 -6491 9962
893I962P338j5137j3613N171J6956M065j6919j0657O578J6931m78j5615r235J0766
$$ 9962 17300 2163 -11450 -6279 10677 14742 -2177 -12834 -6256 10675 10197 -5418 -14653 -3887
907c887J5129k927j4020p281J4116J2122m263j3618l593J4236R745n883j4623
$$ -3887 11242 8315 -5705 -12986 1130 13252 8989 -4629 -8222 6014 15759 9876 -4747
920d747O62J1975Q186q621j3275L706J0755O462j0827j0195M014J2071K672j1219
$$ -4747 -4085 7890 16076 7455 -5820 -2114 8641 15103 4276 -5919 -1905 10166 12838 1619
934A619p075L254J2332j083j0402o088N121R707k213r298n626Q153P253j646q577
$$ 1619 -5456 -2202 10130 9047 -1355 -7443 -2322 7385 5172 -4126 -9752 -1599 5654 4008 -4569
949d569l107Q986O217k019r219j31P404N916l754q064R32O239N293n356o716J097
$$ -4569 -7676 1310 7527 5508 -3711 -3842 3562 9478 5724 -2340 -1408 4831 10124 4768 -1948 -851
965h51P015L543o554m352P82P590Q66o045m455K137O468j186m932m879M554L666
$$ -851 6164 9707 3153 -1199 -417 7173 8039 1994 -2461 -324 6144 4958 26 -4853 -299 3367
981C367j176n033k866N605K538r50m841P14L873K920j558l757K419K483K318k851
$$ 3367 2191 -2842 -5708 -103 2435 1485 -3356 -2642 1231 4151 2593 -1164 1255 3738 6056 3205
997C205j082J705J942R76k687R24l2K206j256p45N70n40J369k187J054r45N51
$$ 3205 2123 3828 5770 6746 4059 4983 4951 7157 5901 5156 5726 5186 6555 4368 5422 4477 5028
1014E028j958m72k38j01k3l046J215K81J261k448j946J360J303J771m109N7R34
$$ 5028 3070 2598 2360 2259 2236 -810 405 686 1947 -501 -2447 -1087 216 1987 -2122 -2065 -1131
1031a131L188N01l223l45J615M322j380k432j794L831L629j673l296j641N364
$$ -1131 2057 2558 -665 -1010 605 4927 3547 1115 -679 3152 6781 5108 1812 171 5535
1046E535K422j251n233j49M883K291k266o493J277M808L055n261n920J906O198
$$ 5535 7957 6706 1473 1324 6207 8498 6232 -261 1016 5824 8879 3618 -2302 -396 5802
1061E802K849p704m544K614P758N24p501m099M249Q743k168o996m569O582Q322
$$ 5802 8651 947 -3597 -983 6775 7299 -202 -4301 -52 8691 6523 -473 -5042 1540 9862
1076I862l709p820k911Q714N901l436r974k6R291M671m993j0607K590R395L822
$$ 9862 6153 -1667 -4578 4136 10037 6601 -3373 -3399 5892 10563 5570 -5037 -2447 6948 10770
1091A0770p556q721K928R566L569j0833o286L482J0480J285j0882n751N253J1070
$$ 10770 3214 -5507 -2579 6987 10556 -277 -6563 -3081 7399 8684 -2198 -7949 -2696 8374
1105H374j671r750o332Q098J0394k836j0428m909J0492Q716l738j2268j952J1655
$$ 8374 6703 -3047 -9379 -1281 9113 6277 -4151 -9060 1432 10148 6410 -5858 -7810 3845
1119C845P795n616j3306J301J1941P076r059j1797L398J2561N783j2506r457M732
$$ 3845 11640 6024 -7282 -5981 5960 13036 3977 -7820 -4422 8139 13922 1416 -8041 -3309
1133c309J3474K561j3317q616O883J3777j506j2731q106R465J2918l718j3423
$$ -3309 10165 12726 -591 -9207 -2324 11453 9947 -2784 -10890 -1425 11493 7775 -5648
1146e648n679J1552J1044m715j4670k724J3185Q713n827j5410J098J3331P722
$$ -5648 -11327 225 11269 6554 -8116 -10840 2345 11058 5231 -10179 -9081 4250 11972
1159A1972q960j3413K618J3751O808j2375j0622L676J5097L801j3514r550N925
$$ 11972 3012 -10401 -7783 5968 12776 401 -10221 -6545 8552 12353 -1161 -10711 -4786
1172d786J5661K86j3818q948R119J4291k502j4207p654J2185J1986m025j5303
$$ -4786 10875 11161 -2657 -11605 -2486 11805 9303 -4904 -12558 -373 11613 7588 -7715
1185g715m419J3599J0273n838j5959n32J3614R395r023j4469J942J3850P926j1981
$$ -7715 -12134 1465 11738 5900 -10059 -10591 3023 12418 3395 -11074 -9132 4718 12644 663
1199F63j2040L601J5259M274j2892j0133N886J5288P26j2685r114Q779J3800k143
$$ 663 -11377 -7776 7483 11757 -1135 -11268 -5382 9906 10632 -2053 -11167 -2388 11412 9269
1213I269j2685p476J1148J1137l016j4452m034J1867R516m587j4612j250J1774
$$ 9269 -3416 -10892 256 11393 8377 -6075 -10109 1758 11274 6687 -7925 -9175 2599
1226B599R024p013j3207J04J2435P987j0270j1026J588J3331N465j1013r987L332
$$ 2599 11623 4610 -8597 -8493 3942 11929 1659 -9367 -7779 5552 11017 4 -9983 -6651
1240f651J3828K791j1234r378O165J3211K71j1370q421R013J1459q88j3520n234
$$ -6651 7177 9968 -1266 -10644 -4479 8732 9003 -2367 -10788 -1775 9684 8796 -4724 -9958
1254i958J0173R974l038j3549k476J0639R460o341j2356m9J0994P966q764j0761
$$ -9958 215 10189 7151 -6398 -8874 1765 11225 4884 -7472 -7521 3473 11439 2675 -8086
1268h086J644J1566M961r827r008L104J2342J803r299q056N173J1325n17r228
$$ -8086 -6442 5124 10085 258 -8750 -5646 6696 8499 -800 -8856 -3683 7642 7125 -2103
1282b103p093P426R215o83j0239m689Q329P605j582j0739j761P592P424m062r632
$$ -2103 -9196 -1770 7445 6762 -3477 -8166 163 7768 6186 -4553 -6314 1278 8702 4640 -4992
1297d992j25P866O165o096p450M59Q760L891p062o096Q18R233J721o462o019L079
$$ -4992 -5117 2749 8914 2818 -4632 -4173 4587 8478 1416 -4680 -3862 5371 7092 630 -5389 -2310
1313b310Q046J31o035n886N133O195j03o867m144N884N035r98p304j498M665M771
$$ -2310 5736 5867 -168 -6054 -921 5274 5171 -1696 -5840 44 5079 4081 -3223 -4721 -56 4715
1329D715k041o272q4M132M703l739m817j38M558L223l839l834k92N221J261l158
$$ 4715 2674 -3598 -3682 450 5153 1414 -3403 -3541 1017 4240 401 -3433 -3725 1496 2757 -401
1345d01l363N90N086O08k678l808K528L409J111l789k734K883K497J170m373j431
$$ -401 -3764 -3174 1912 2520 -158 -3966 -1438 1971 3082 -707 -3441 -558 1939 3109 -1264 -2695
1361b695K400K749k71l642rJ595L507j657k324k79K262J752k231j363p56L118
$$ -2695 -295 2454 2183 -1459 -1468 127 3634 1977 -347 -626 1636 3388 1157 -206 -962 2156
1377B156o24j408j674K79J953j156n79j029J628L86m29n33j70J687j341K72q56
$$ 2156 1532 124 -1550 -1271 682 -474 -1053 -2082 -454 -68 -497 -1030 -1200 487 -854 -582 -1438
1394a438J305l90j237%N86J182j464m02m09K114Q76j875o98O18K593l16j886k087
$$ -1438 -133 -523 -1760 -1760 -1174 8 -1456 -1858 -2267 -153 723 -1152 -1850 -1232 1361 1045 -841 -2928
1412b928K193K223j276k292k231L318J724j037l697r9L487J879j612l724J664
$$ -2928 -735 1488 212 -2080 -4311 -993 731 -306 -4003 -4102 -615 1264 -348 -4072 -2408
1427b408L257K181k907l510J694L520J850m381k233J144M806L44m614j826K104
$$ -2408 849 3030 123 -3387 -1693 1827 3677 -704 -2937 -1793 3013 3357 -1257 -3083 -979
1442i79M885l46l992k648L701L999j291m750k847M723L012j620o026j884N119
$$ -979 3906 3560 -432 -3080 621 4620 3329 -1421 -4268 455 3467 1847 -4179 -6063 -944
1457i44L290k665o473L60N086M216l859n893J571N904L213n248m621J208O760
$$ -944 2346 -319 -6792 -6432 -1346 2870 -989 -6882 -5311 593 3806 -1442 -6063 -4855 1905
1472A905J895n997m312K310P509M84n499m585M944P194m56o391m285P377N411
$$ 1905 3800 -2197 -6509 -4199 3310 3794 -1705 -6290 -1346 5848 5392 -999 -5284 2093 7504
1487G504j892p694k946O608N059l111r050m86N693O020m697q287O21Q193M969
$$ 7504 5612 -2082 -5028 1580 6639 3528 -5522 -6008 -315 5705 1008 -7279 -6658 1535 6504
1502F504o361p532R44R171L535q014o672K448R605J272q439o122M994R637j72
$$ 6504 143 -7389 -6445 2726 6261 -1753 -8425 -5977 3628 4900 -3539 -9661 -4667 4970 4798
1517D798q081n451P723Q698j233r264l566Q560P571k614j0831j107P639O743o057
$$ 4798 -3283 -8734 -1011 7687 6454 -2810 -6376 2184 9755 7141 -3690 -4797 2842 9585 3528
1532C528r931O00Q594N556p501q395J513J0338L611q296p786L322J0349Q37q942
$$ 3528 -6403 -5803 2791 8347 846 -7549 -6036 4302 7913 -383 -8169 -4847 5502 6339 -2603
1547b603p140N097R263m22q984o220P224Q493r45r191l390Q006P912j948r959
$$ -2603 -9743 -4646 4617 4195 -4789 -11009 -3785 4708 3763 -5428 -8818 -812 7100 5152 -4807
1562d807j616P557P482l973j0130q51Q514O498o225r062J33R915M947p152p823
$$ -4807 -6423 1134 8616 4643 -5487 -6338 2176 8674 2449 -6613 -6480 3435 8382 1230 -6593
1577f593J284J0939L015q130q138M173J0021Q90q942p649O295Q682j50r906n389
$$ -6593 -5309 5630 8645 515 -7623 -3450 6571 7461 -1481 -9130 -2835 5847 5697 -4209 -9598
1592i598P443Q675j586j0498k045P684Q624l744j0231q74Q382O875o047r105l75
$$ -9598 -2155 6520 4934 -5564 -7609 75 8699 4955 -5276 -6150 2232 9107 3060 -6045 -6420
1607f420R531M774p078p824J341R952K775p202p241L198R649J341p919o635N022
$$ -6420 3111 7885 807 -7017 -5676 4276 7051 -151 -7392 -4194 5455 6796 -1123 -7758 -2736
1622b736Q122J12q836n424O053P265r05r118k658O460P483k199q908q98O965O833
$$ -2736 5386 5498 -3338 -8762 -2709 4556 3651 -5467 -8125 -1665 5818 3619 -5289 -6187 778 7611
1638G611m229p924m69Q264M472n656o904K09Q637K739o003o708K204Q425J719
$$ 7611 3382 -4542 -5011 3253 7725 2069 -4835 -4626 4011 6750 747 -5961 -3757 4668 6387
1653F387o647o203M354O936O54p086m935M559O135m44q140k643M521O128k339
$$ 6387 -260 -6463 -2109 4827 5481 -1605 -6540 -1981 4154 3710 -4430 -7073 -2552 3576 1237
1668A237o952r87M940N803l353n615n01O284M312l838n147k1O558K462l708n342
$$ 1237 -5715 -6702 -1762 4041 688 -4927 -5428 856 5168 1330 -3817 -3838 2720 5182 1474 -3868
1684c868J045O238J890m126m997K820N161J393m909l993K881M914K19n688k754
$$ -3868 -2823 3415 5305 1179 -3818 -998 4163 5556 647 -3346 -465 4449 4668 -1020 -3774
1699c774K976M155r62n746k038L206M582k596m426j390M444L125k733l833m55
$$ -3774 -798 3357 2395 -3351 -5389 -2183 2399 -197 -4623 -6013 -1569 1556 -1177 -5010 -5465
1714e465M983J782k633l344P37M246R74k555k890K256L048P81k407k431K669K416
$$ -5465 -482 1300 -1333 -4677 -3940 306 1280 -1275 -4165 -1909 1139 1920 -487 -2918 -249 2167
1730B167K73k964q04J694K427k08l198l3J334J732j579j311p39J631J007j260
$$ 2167 2440 -524 -1328 366 2793 2585 -613 -646 688 2420 841 -470 -1209 422 1429 169
1746A69j200r04K085M11o81j254k45J392j63J90j634N18Q75M58o79o85N30j87
$$ 169 -1031 -1935 150 561 -120 -1374 -1619 -227 -390 -200 -1834 -1316 -441 17 -662 -1347 -817 -1004
1764a004J154j345J20j1O26n3o52L89m29P58q76L44J09j19j13o86J106l35M6j182
$$ -1004 150 -1195 -1075 -1086 -460 -513 -1165 -776 -1205 -447 -1323 -979 -870 -989 -1102 -1788 -682 -1017 -971 -2153
1784b153R5J255J18p84j058Q70J069K68j099o33J345J678j72j880R7J405K070
$$ -2153 -2058 -803 -685 -1469 -2527 -1657 -588 -320 -1419 -2052 -707 971 799 -1081 -984 421 2491
1801B491j150k453M45J503K117k224k366J51K643J012k399j854N50L637j67k440
$$ 2491 1341 -1112 -667 836 2953 729 -1637 -1486 1157 2169 -230 -2084 -1534 2103 1936 -504
1817e04k326J552K810k82k992k529K342K432k61l652j701L202K650n56l876K15
$$ -504 -2830 -1278 1532 1250 -1742 -4271 -1929 503 242 -3410 -5111 -1909 741 185 -3691 -3476
1833c476K175L845j637l751K35L206K988k959l348k39M592J691l332l260o8N428
$$ -3476 -1301 2544 907 -2844 -2609 597 3585 626 -2722 -2961 1631 3322 -10 -3270 -3338 2090
1849B090J062l357l903J900N288K87m144l843L381L658M47n457l266M040M344
$$ 2090 3152 -205 -4108 -2208 3080 3367 -777 -4620 -1239 2419 2866 -2591 -5857 -1817 2527
1864B527j213n839j193M085M828k186n097m83M877M444l071n032j99O081K747
$$ 2527 1314 -4525 -5718 -1633 3195 1009 -4088 -4571 306 4750 1679 -3353 -3552 2529 5276
1879E276m005n090N65O149J769m706m784J964O164J100n027m702L653N704N66
$$ 5276 1271 -3819 -3254 2895 4664 -42 -4826 -2862 3302 4402 -625 -5327 -1674 4030 4596
1894D596o305l876M109N452q28p267k329M473N776k658o514q49N134N765l435
$$ 4596 -1709 -5585 -1476 3976 3148 -4119 -6448 -1975 3801 1143 -5371 -6220 -1086 4679 1244
1909A244n676j37O915L810m122o081Q20P518J826m898n845J735P039J269n928
$$ 1244 -4432 -4569 2346 6156 2034 -4047 -3227 4291 6117 1219 -4626 -2891 4148 5417 -511
1924e11n512M531O069P04o640l934M663N894o64p431k504M395N930k881p151j649
$$ -511 -6023 -1492 4577 5281 -1359 -5293 -630 5264 4600 -2831 -5335 -940 4990 2109 -5042 -6691
1940f691M957N814l934o102m82O591M530l804n490M66P312K668l744o151J675
$$ -6691 -1734 4080 146 -5956 -6438 153 4683 879 -4611 -4145 3167 5835 2091 -4060 -2385
1955b385O705J646n420n632L050O408J156o037m416L990O264P25o928l362M369
$$ -2385 4320 5966 546 -5086 -2036 4372 5528 -509 -4925 -935 5329 6054 -874 -4236 133
1970A33O122j427p525k091M372N965l604o845j600N847M960m072o060o93P781
$$ 133 6255 4828 -2697 -4788 -416 5549 1945 -4900 -6500 -653 4307 235 -5825 -6518 1263
1985A263L305l475o288J452P335K316n179n774K959O193J226o433m260L765N754
$$ 1263 4568 1093 -5195 -3743 3592 5908 729 -5045 -2086 4107 5333 -1100 -5360 -1595 4159
2000D159O48o608k904M316O138j247o428j556M276N102l053o028j660M944L606
$$ 4159 4807 -1801 -4705 -389 5749 4502 -1926 -3482 794 5896 2843 -3185 -4845 99 3705
2015C705l546n622r83O066K510l427m863Q79O010J938l449m539K347M866J721
$$ 3705 159 -5463 -6446 -380 2130 -1297 -6160 -5281 729 2667 -782 -5321 -2974 1892 3613
2030C613m811m010K827M668Q28n385k289K833M846k69m569j421L517M784j686
$$ 3613 -1198 -5208 -2381 2287 3115 -2270 -4559 -1726 3120 2851 -1718 -3139 378 5162 3476
2045C476m401r38L575L413k602m453j202M071J926k583m259L8M083J615k618l822
$$ 3476 -925 -1863 1712 5125 2523 -1930 -3132 939 2865 282 -3977 -3939 144 1759 -859 -4681
2061d681J173M055J483l280l291J861L220J071l826k413J535L552j34l565j622
$$ -4681 -3508 547 2030 -1250 -4541 -2680 540 1611 -2215 -4628 -3093 459 325 -3240 -4862
2076d862K096M124r82k696j382K963L036j144k882j028L364J583j764l026n09
$$ -4862 -2766 1358 376 -2320 -3702 -739 2297 1153 -1729 -2757 607 2190 426 -2600 -3109
2091c109K947Q08j653k855P91K472J357k289k171J757K041J154k957j168J542
$$ -3109 -162 646 -1007 -3862 -3071 -599 758 -1531 -3702 -1945 96 1250 -1707 -2875 -1333
2106a333K315n58k442k86P93K355j134j820j74J977J413j145q99n8K171j02o54
$$ -1333 982 424 -2018 -2304 -1511 844 -290 -2110 -2284 -307 1106 -39 -938 -996 1175 1073 419
2123D19j256P29J142q74p79j099N98nj52q58m23O24j67J66q18M71k8O9j26l66
$$ 419 -837 -108 1034 160 -619 -1718 -1120 -1125 -1277 -2135 -2558 -1934 -2101 -1935 -2753 -2282 -2310 -2241 -2367 -2733
2143b733O99l41J88m82N75k30j3N1k4R28Q4K26j40P91N17L10l19m26R50M73O4
$$ -2733 -2034 -2375 -2187 -2669 -2094 -2324 -2337 -2286 -2310 -1382 -1298 -1072 -1212 -421 96 406 87 -339 611 1084 1148
2164A148j125j27lP80n6j400r5j98J254m75j562k49P54J198q42j040r50J398M73
$$ 1148 23 -104 -107 673 617 -783 -878 -1076 178 -297 -1859 -2108 -1354 -156 -998 -2038 -2988 -1590 -1117
2183a117q42j421m83K511p4n64k069R14K223N75j083j956J558J867J004k530p91
$$ -1117 -1959 -3380 -3863 -1352 -1426 -1990 -4059 -3145 -922 -347 -1430 -3386 -1828 39 1043 -1487 -2278
2200b278J470K201j4k633r60J585K495p46k810q68K030K758j823k537p21K863
$$ -2278 -808 1393 1379 -1254 -2214 -629 1866 1120 -1690 -2558 -528 2230 407 -2130 -2851 12
2216A2J770j870k944j43L508J226k245l161Q01L207J153k580k910J730L149R26
$$ 12 1782 -88 -3032 -3175 333 1559 -686 -3847 -3046 161 1314 -1266 -4176 -2446 703 1629
2232A629l333k526K446L460L51m000j983K727L637r26l946j338L292L615k407
$$ 1629 -1704 -4230 -1784 1676 2027 -1973 -3956 -1229 2408 1482 -2464 -3802 -510 3105 698
2247F98l730j283M147K816k553m240p2M609J558k671m222J268M411J547l308l765
$$ 698 -3032 -4315 -168 2648 95 -4145 -4217 392 1950 -721 -4943 -3675 736 2283 -1025 -4790
2263d790K312M516Q34m330k788K767M072J73m352j879L007M170j102m239j467
$$ -4790 -2478 2038 2872 -1458 -4246 -1479 2593 2766 -1586 -3465 -458 3712 2610 -1629 -3096
2278c096L665L816k118m077j184M149L227k863m307o86M652J818k917m494K42
$$ -3096 569 4385 2267 -1810 -2994 1155 4382 1519 -2788 -3474 1178 2996 79 -4415 -4173
2293d173M765J575l087m442J840M161J953m559l437K105N086Q22n088k617K681
$$ -4173 592 2167 -920 -5362 -3522 639 2592 -1967 -5404 -3299 1787 2609 -2479 -5096 -2415
2308b415N029m51n124k152L791M904j290n090j407N021L635k263n037p06N532
$$ -2415 2614 2163 -2961 -5113 -1322 3582 2292 -2798 -4205 816 4451 2188 -2849 -3555 1977
2323A977K019k507n224L17N227K287m341m674P35N671P79l700l625K250M828J382
$$ 1977 3996 1489 -3735 -3418 1809 4096 -245 -4919 -4184 1487 2266 -1434 -5059 -2809 2019 3401
2339C401m898k531K490N075n01n554j524K664M245j471l563j573L726M158j840
$$ 3401 -1497 -4028 -1538 3537 3036 -2518 -4042 -1378 2867 1396 -2167 -3740 -14 4144 2304
2354B304m700q80M559L031k015m972j09M864J998k998n225R94M023J814m372l322
$$ 2304 -2396 -3276 1283 4314 2299 -2673 -2782 2082 4080 1082 -4143 -3149 874 2688 -1684 -5006
2370e006J609L851J258m730k189J761N222O7m122k257K679M305q65m383j736L357
$$ -5006 -3397 454 1712 -3018 -5207 -3446 1776 1843 -2279 -4536 -1857 2448 1583 -2800 -4536 -1179
2386a179M087j825m036j121M506L342j901m063M67M220J954k479l957R65L887
$$ -1179 2908 1083 -2953 -4074 432 3774 1873 -2190 -1723 2497 4451 1972 -1985 -1020 2867
2401B867J279l389l511J268L172J311m198k486J665L648K40l487j952J973L968
$$ 2867 4146 757 -2754 -1486 1686 2997 -1201 -3687 -2022 1626 1866 -1621 -3573 -1600 2368
2416B368j180k978j859K761L306j768l134j104K774K301r33l575n6L616J761r15
$$ 2368 1188 -1790 -3649 -888 2418 650 -2484 -3588 -814 1487 554 -3021 -3077 539 2300 1385
2432A385l941R36L244J732k209l080J009K892Q51l308j996Q50K818j20k678j719
$$ 1385 -2556 -1620 1624 3356 1147 -1933 -924 1968 2819 -489 -2485 -1635 1183 1063 -1615 -3334
2448c334J447L139o95k127j357K060K325q59k308o89K075R95o68k204m53K401
$$ -3334 -1887 1252 557 -1570 -2927 -867 1458 599 -1709 -2398 -323 672 4 -2200 -2653 -252
2464b52J011r94j797O01J898J295j124j526Q22J572P43j895p95J01J624K05k018
$$ -252 759 -235 -2032 -1431 467 1762 638 -888 -66 1506 2249 354 -441 -340 1284 1489 -529
2481e29r03J99J467k08j056j300J239J321n01r98p50J172P59l81j402n6Q93K37
$$ -529 -1432 -1233 234 26 -1030 -2330 -1091 230 -271 -1269 -2019 -847 -88 -469 -1871 -1927 -1034 -797
2499g97m49j117M65O25M68m37j72R11N67K99l42Q05p6K22o71k2L59K1K19o61j34
$$ -797 -1246 -2363 -1898 -1273 -805 -1242 -1414 -503 64 363 21 826 750 972 301 279 638 659 878 217 83
2520H3k99O6k5n72P06j54K81q16n4L82k6j73r08M34n2O37j251o68N97M01K7o28
$$ 83 -216 -150 -175 -747 -41 -195 86 -730 -784 -402 -428 -601 -1509 -1075 -1127 -490 -1741 -2409 -1812 -1411 -1384 -2012
2542b012l19N80J293k77m45j16R42R21n28o23l33J088O12o37j134j78J595J27
$$ -2012 -2331 -1751 -458 -735 -1180 -1296 -354 567 39 -584 -917 171 783 146 -988 -1166 429 556
2560E56l03j450L81J295O11p91j625J173J090L52j763j024N83J323K78k132q39
$$ 556 253 -1197 -816 479 1090 299 -1326 -153 937 1289 -474 -1498 -915 408 686 -1446 -2285
2577b285Q14K138l96j936o41J222K308p11j785n35J891K001j188k177n97K627
$$ -2285 -1471 667 271 -1665 -2306 -1084 1224 513 -1272 -1807 84 2085 897 -1280 -1877 750
2593G50Q67j127k819K32K599J124j765k573J098K373R13k515j842J208K440K18
$$ 750 1617 490 -2329 -2097 502 1626 -139 -2712 -1614 759 1672 -843 -2685 -1477 963 1181
2609A181k721j669J370K826l16l038j726K214K943j108k720j045L348K242j132
$$ 1181 -1540 -3209 -1839 987 671 -2367 -4093 -1879 1064 -44 -2764 -3809 -461 1781 649
2624F49k730o46L620J755j523l203L32L275J643k189l143J047L171J525l242k598
$$ 649 -2081 -2727 893 2648 1125 -2078 -1746 1529 3172 983 -2160 -1113 2058 3583 341 -2257
2640b257J593L384O95l956j886J834L081l7l995j828K421L358j386l499j432L251
$$ -2257 -664 2720 3415 -541 -2427 -593 2488 2451 -1544 -3372 -951 2407 1021 -2478 -3910 -659
2656f59K369j335l488o76L755K070j482l977M36L447K242k589l564J166L470J825
$$ -659 1710 375 -3113 -3789 -34 2036 554 -3423 -2987 460 2702 113 -3451 -2285 1185 3010
2672C010k998k899J120L779J141l609k219J633L807K21l877j996K215L888q46
$$ 3010 12 -2887 -1767 2012 3153 -456 -2675 -1042 2765 2986 -891 -2887 -672 3216 2370
2687B370l879j482K680L293j169l871j229L537K620j315m323p7L871K314k330
$$ 2370 -1509 -2991 -311 2982 1813 -2058 -3287 250 2870 1555 -2768 -2845 1026 3340 1010
2702A010l908O58L782K147l122l479J519L706J836l881k794J193M520J76l911
$$ 1010 -2898 -2240 1542 3689 567 -2912 -1393 2313 4149 268 -2526 -1333 3187 3363 -548
2717e48k331K464M023p16l741k608L562L205j067m116j296L742K485j612m028
$$ -548 -2879 -415 3608 2892 -849 -3457 105 3310 2243 -1873 -3169 573 3058 1446 -2582
2732b582q2L337K193j937l929R05L504J784k738l286J313L543J361l360k163J268
$$ -2582 -2664 673 2866 929 -3000 -2095 1409 3193 455 -2831 -1518 2025 3386 26 -2137 -869
2748h69L719M06l331k185K002L381m34l041k443K873L019q29l151j647L183K080
$$ -869 2850 3256 -75 -2260 -258 3123 2689 -352 -2795 78 3097 2268 -883 -2530 653 2733
2764B733j114l326q64L203K002j303l555J40L022K021k462k812N38K959J610k601
$$ 2733 1619 -1707 -2571 632 2634 1331 -2224 -2084 938 2959 497 -2315 -1777 1182 2792 191
2780A91k125P12L627P25k785j993J423L000R1k741k006K024K893n81k453j788
$$ 191 -1934 -1222 2405 3130 345 -1648 -225 2775 2866 125 -1881 143 3036 2455 2 -1786
2796a786K421K035r50k837n19K078K108r89k996k48K168J925j751k445J77K332
$$ -1786 635 2670 1720 -1117 -1636 442 2550 1561 -1435 -1683 485 2410 659 -1786 -1609 723
2812G23J612k500j473Q4K771J136k474j587J102K853K73k213j392J836K019m73
$$ 723 2335 -165 -1638 -1554 1217 2353 -121 -1708 -606 2247 2520 307 -1085 751 2770 2297
2828B297k225r51J798J612n24k383m85J612J101l95k336Q3J480R47r13j792L15
$$ 2297 72 -879 919 2531 2007 -376 -861 751 1852 1457 -879 -796 684 1631 718 -1074 -759
2845g59J402R48j893p57J60J606Rj308n81L84J659k90j026o6P17R96M09j076n29
$$ -759 643 1591 -302 -1059 -899 707 716 -592 -1173 -789 870 580 -446 -512 205 1201 1610 534 5
2864ER79P61P4j088m71Q58N10k5r42k4K68O42K3j107p2O97L99m64m83l25M13K43
$$ 5 984 1745 1819 731 260 1118 1628 1603 661 637 905 1547 1570 463 391 1088 1487 1023 540 215 628 871
2886H71o09q1k17K54J89l78o86O14M37k7p8n38N32J73K48l49K61j3j08L39n23
$$ 871 262 181 -36 218 407 29 -657 -43 394 367 289 -249 283 456 704 355 616 603 495 834 311
2907C11M02k41K40m03M20j40p0l6j41N58k82k24l94K7P91m29j63p11J264p61q6
$$ 311 713 472 712 309 729 589 519 483 342 900 618 394 0 27 818 389 226 -485 779 18 -68
2928f8J15o96J340q91J176j677J458J122L73j230l05l73J284Q84j262k43q01J183
$$ -68 47 -649 691 -200 976 -701 757 1879 2252 1022 717 344 1628 2512 1250 1007 206 1389
2946A389M99p22j081N12J024K05j247r98R81J326n82j282j043J560J212q46j683
$$ 1389 1888 1166 85 597 1621 1826 579 -419 562 1888 1306 24 -1019 541 1753 907 -776
2963g76n80J336J002p19j979L23J624R87j312j634O25J974R25j784j406O71K156
$$ -776 -1356 -20 982 263 -1716 -1393 231 1218 -94 -1728 -1103 871 1796 12 -1394 -723 1433
2980A433N37k142r16Q94K290j22k133r11J667J990o51j739j122J952J497o16k293
$$ 1433 1970 -172 -1088 -194 2096 1974 -159 -1070 597 2587 1936 197 -925 1027 2524 1908 -385
2997c85m68K297J052q00k570J58J964J197j503k408O18K328P80k111j708O24K250
$$ -385 -853 1444 2496 1696 -874 -716 1248 2445 942 -1466 -848 1480 2260 149 -1559 -935 1315
3014A315J055k539j383P30L017Q0k301j417J299K705k82k596j448K185K186l72
$$ 1315 2370 -169 -1552 -822 2195 2275 -26 -1443 -144 2561 2279 -317 -1765 420 2606 2234
3030B234k507j221K613J982j259k647m99K356J947j382l230M07K619J671k141
$$ 2234 -273 -1494 1119 3101 1842 -805 -1304 1052 2999 1617 -1613 -1206 1413 3084 943
3045I43k850O08K830J277k860j610N62L355J64k531j990J749L127m07k676j887
$$ 943 -1907 -1299 1531 2808 -52 -1662 -1100 2255 2419 -112 -2102 -353 2774 2367 -309 -2196
3061b196K654K324n37l048r08K908K083q39l607j46K804J742j338k982J12K567
$$ -2196 458 2782 2245 -803 -1711 1197 3280 2441 -1166 -1312 1492 3234 1896 -1086 -974 1593
3077A593J702k211k523N26K713R92k322k171P61L017N79k583j968J000L504m83
$$ 1593 3295 1084 -1439 -913 1800 2792 470 -1701 -940 2077 2656 73 -1895 -895 2609 2126
3093B126k432k026K217K595l86k972j004K254K127l68l346l36K547J983j094l267
$$ 2126 -306 -2332 -115 2480 2094 -878 -1882 372 2499 2131 -1215 -1551 996 2979 1885 -1382
3109a382J93K588J887j847k687N10K774J156k380k166N81L122N34k414k323J401
$$ -1382 -1189 1399 3286 1439 -1248 -738 2036 3192 812 -1354 -773 2349 2883 469 -1854 -453
3125d53K776J50k704j807J706K807o57k468j194K067K124o07k749m15J962J804
$$ -453 2323 2473 -231 -2038 -332 2475 1818 -650 -1844 223 2347 1740 -1009 -1424 538 2342
3141B342r01k742N9K146J728j763j887j56K342J443j699k243N58K542O66j868
$$ 2342 1441 -1301 -1242 904 2632 869 -1018 -1174 1168 2611 912 -1331 -773 1769 2435 567
3157E67j762P78K348L40j793k108J414K177K90k234j635K007J671j69k129q21
$$ 567 -1195 -417 1931 2271 478 -1630 -216 1961 2251 17 -1618 389 2060 1891 -238 -1059
3173a059J633J823q93k433J51J557J750j114k308J74J860J392j611j792K01K248
$$ -1059 574 2397 1504 -929 -778 779 2529 1415 -893 -719 1141 2533 922 -870 -669 1579
3189A579O16j759j290M59J829K17j271j365R80J261n5j231j179J245J171o8j665
$$ 1579 2195 436 -854 -395 1434 1651 380 -985 -5 1256 1201 -30 -1209 36 1207 1139 -526
3206e26p16J243J193k54j584j50J087J195q44j247K51R81J009j223r25J36J430
$$ -526 -1242 1 1194 940 -644 -794 293 1488 644 -603 -352 629 1638 415 -510 -374 1056
3223A056M91r95r58M21J466j42r67o77O28J157k97r62n73O77P14J19j005l95N23
$$ 1056 1547 552 -406 15 1481 1339 372 -305 323 1480 1183 221 -352 325 1039 1158 153 -242 281
3242B81K12m5q54L41O25L60m20p38K27N21J02k61K7l30O75l3k96j42k85Q15l60
$$ 281 493 448 -406 -65 560 920 500 -238 -11 510 612 351 378 48 723 690 394 252 -33 782 422
3263D22j96l16L60J4Q7j25m11J38L52lm04j01q0K20K25m88N21k34m3k9K2N0j1
$$ 422 226 -90 270 284 371 246 -165 -27 325 322 -82 -183 -263 -43 182 -306 215 -19 -62 -91 -69 -19 -30
3286c0j20K67R6k47K55r9N8L00M4l6o4J45O6J3l72o1J25M41J28o03p6J39M99J
$$ -30 -150 117 213 -34 221 122 180 480 524 488 424 569 635 648 276 215 340 781 909 306 230 369 868 869
3310H69q23j74L03O36m79o91Q9N64N63p04o95J40P43M26j053n23M32J099k91k84
$$ 869 46 -128 175 811 332 -359 -270 294 857 153 -542 -402 341 767 -286 -809 -377 722 431 147
3330A47j294J255Q78m0j608l96J378O36M4j167j10O42O81k67j706M67J161P44
$$ 147 -1147 108 986 946 -662 -1058 320 956 1000 -167 -277 365 1046 779 -927 -460 701 1445
3348A445j593n66N12O07R65j266j403M26J810L06j399j444J403P59L17j513p57
$$ 1445 -148 -714 -202 405 1370 104 -1299 -873 937 1243 -156 -1600 -197 562 879 -634 -1391
3365a391J017J291M62j827m88Q60J976j524j138k16J696N54k69j626l20J145J518
$$ -1391 -374 917 1379 -448 -936 -76 1900 376 -762 -978 718 1272 1003 -623 -943 202 1720
3382A720j108k246L88J710J086j588q70L80K400p07r92j795N42K747l97j688j450
$$ 1720 612 -1634 -1246 464 1550 -38 -908 -528 1872 1165 173 -1622 -1080 1667 1270 -418 -1868
3399a868J524J901n82j680j152J642J457m24j902n99J629J936r25j962j81J642
$$ -1868 -344 1557 975 -705 -1857 -215 1242 818 -1084 -1683 -54 1882 957 -1005 -1186 456
3415D56J436j102j729k49J928J223j947j297P3K287P87j745j681O44K144M20j881
$$ 456 1892 790 -939 -1188 740 1963 16 -1281 -1208 1079 1866 121 -1560 -916 1228 1648 -233
3432b33j787J535J850N0k044j497J604J882k45k531o96J854J818j036k182J7J865
$$ -233 -2020 -485 1365 1415 -629 -2126 -522 1360 1115 -1416 -2112 -258 1560 524 -1658 -1641 224
3449B24J751j272k466K57K209J354j691j735l2K568O16j619j951J012K329K52
$$ 224 1975 703 -1763 -1506 703 2057 366 -1369 -1401 1167 1783 164 -1787 -775 1554 1806
3465A806j660k150J796J876K1j982j030J417J694m72k130q92J574J900p61k392
$$ 1806 146 -2004 -208 1668 1689 -293 -1323 94 1788 1316 -814 -1706 -132 1768 1007 -1385
3481a385k3J431J596j257j710J5J514J539j307j631k64K105R05j626j437J63J992
$$ -1385 -1408 23 1619 362 -1348 -1333 181 1720 413 -1218 -1482 623 1528 -98 -1535 -1372 620
3498F20N07j459j451Q91J859K01j356j712J299K003m9k137j101J337K067m16k136
$$ 620 1127 -332 -1783 -892 967 1168 -188 -1900 -601 1402 1353 -784 -1885 -548 1519 1103 -1033
3515a033p90J637J536q40j762j54J610J293j310j246m44K350M81j116j480J64
$$ -1033 -1823 -186 1350 510 -1252 -1406 204 1497 187 -1059 -1503 847 1328 212 -1268 -1104
3531a104K088J79j100j735Q07J681M79j641j323J348J646mj569j182J551J474
$$ -1104 984 1163 63 -1672 -865 816 1295 -346 -1669 -321 1325 1321 -248 -1430 121 1595
3547A595m36j925k06J045J540p01j771k45J320J094j121j019o7J207R19j099j262
$$ 1595 1159 -766 -972 73 1613 912 -859 -1104 216 1310 189 -830 -897 310 1229 130 -1132
3564a132j57J875J94j257r57L43J277M69j293l78L23J78J064j695m02J198J321
$$ -1132 -1289 586 780 -477 -1434 -1091 186 655 -638 -1016 -693 -515 549 -1146 -1548 -350 971
3581I71p85j180N5Q67Q64j99j218%O82J124p53n88m23J080L26l57p48j18R81K89
$$ 971 186 -994 -939 -72 792 593 -625 -625 57 1181 428 -160 -583 497 823 466 -282 -400 581 870
3601H70m09j061M38P33J08m92p01L02M01M12r51m00N02N45K4q75l38N52P38k63
$$ 870 461 -600 -162 571 679 187 -514 -212 189 601 -350 -750 -248 297 321 -554 -892 -340 398 135
3621A35p05n1M31M08r2m12o0M32K37m05j01k46P85Qj83n91K41L68Rm4l45L67O3
$$ 135 -570 -621 -190 218 126 -286 -346 86 323 -82 -183 -429 356 364 181 -410 -169 199 208 164 -181 186 249
3644B49J6m5j26L3Pj6l11J64r1J94q7k47M12l42M2j05L26J4j02m60Q8M62k60P1
$$ 249 265 220 94 127 134 118 -193 -29 -120 74 -13 -260 152 -190 -148 -253 73 87 -15 -475 -387 75 -185 -114
3668a14m24K10M52N9l70l65L32Q3K36m30O9nN41O7o09Q7J93M57k65l72r4M33K49
$$ -114 -538 -328 124 183 -187 -552 -220 -137 99 -331 -262 -267 274 341 -268 -181 12 469 204 -168 -262 171 420
3691D20l61l56m2M52J39l14l88J76P26r4m30o31N53P01p9m14m96M86N34j63o93
$$ 420 59 -297 -339 113 252 -62 -450 -274 452 358 -72 -703 -150 551 472 58 -438 48 582 419 -274
3712b74k54N61M58j51p44l43N58J067m42j039p6Q79M83q12o10j04J258K12p93
$$ -274 -528 33 491 340 -404 -747 -189 878 436 -603 -679 200 683 -129 -739 -843 415 627 -166
3731a66m79M6J268j38q45m75K44J085M18j229r15R78J080r4j107p12R17J202k42
$$ -166 -645 -599 669 531 -314 -789 -545 540 958 -271 -1186 -208 872 778 -329 -1041 -124 1078 836
3750H36j382l50R56J067n09j140n81J399Q13n75j043n09J793M50r46j083K24J662
$$ 836 -546 -896 60 1127 618 -522 -1103 296 1109 534 -509 -1018 775 1225 279 -804 -580 1082
3768A082J75j115j505Q43J375J62j537q69J099J194j48j352q22J256J534m83j698
$$ 1082 1257 142 -1363 -520 855 1017 -520 -1389 -290 904 756 -596 -1418 -162 1372 889 -809
3785h09l72J051J509r85j517l41J481J378j035j603k64K260M77j153r53l6K033
$$ -809 -1181 -130 1379 394 -1123 -1464 17 1395 360 -1243 -1507 753 1230 77 -876 -912 1121
3802A121J52j247j435O86J752J01j263j343R19J351K53j465q02Q27J515j65j655
$$ 1121 1273 26 -1409 -723 1029 1130 -133 -1476 -557 794 1047 -418 -1220 -393 1122 957 -698
3819f98j98O23J782p08j601n7J115J111j051j229o01J856P46p89j487r7J841P81
$$ -698 -896 -273 1509 801 -800 -857 258 1369 318 -911 -1512 344 1090 301 -1186 -1283 558 1339
3837A339j047j549M51J669M29j473r38P48J041N04j652r97P71J830k43j508m67
$$ 1339 292 -1257 -806 863 1292 -181 -1119 -371 670 1174 -478 -1475 -704 1126 883 -625 -1092
3854a092N88K085p72j345m45J124J463r94j404k14J237J108j095j625J45J773
$$ -1092 -504 1581 809 -536 -981 143 1606 612 -792 -1006 231 1339 244 -1381 -1236 537
3870E37K87o14j526L31J686L82j183j310P83J238M07j414q36N9J909k51j367m43
$$ 537 824 210 -1316 -985 701 1083 -100 -1410 -627 611 1018 -396 -1232 -1173 736 485 -882 -1325
3888a325P93J376rj676j84R49J306o28j170m64J586P20n89j496j21J558K60J27
$$ -1325 -532 844 835 -841 -1025 -76 1230 602 -568 -1032 554 1274 685 -811 -932 626 886 1013
3906A013j497o16J477P15r36j130M58J300K42j194o99P37J125p1j286n77N86J083
$$ 1013 -484 -1100 377 1092 156 -974 -516 784 1026 -168 -867 -130 995 924 -362 -939 -353 730
3924G30j68j365o97J297P90n02p29k0Q78Q24m61j281k83J322L06l02j218K5J167
$$ 730 562 -803 -1500 -203 587 85 -644 -664 214 1038 577 -704 -987 335 641 339 -879 -854 313
3943C13M49o51j166M98Q42M82j119l74N00Q40P6p59o01L01J185m53p66k28L94
$$ 313 762 111 -1055 -557 285 767 -352 -726 -226 614 690 -69 -670 -369 816 363 -403 -631 -237
3962b37O23l22n90j41N46M20l80l77l87J017N52m74n64p8Q62J6k76p37K85N76
$$ -237 386 64 -526 -667 -121 299 -81 -458 -845 172 724 250 -314 -392 470 486 210 -527 -242 334
3982C34K07m66n15L29L00l3k26km5O35K15n57k86J49N42j90m91j4m9L70k06m98
$$ 334 541 75 -440 -111 189 156 -70 -72 -117 518 733 176 -110 39 581 391 -100 -114 -163 207 1 -497
4004d97J2M45J67O7n37LL48K37m31j6J2Q2N46o66J94m18L88M34n39nP4L29j43
$$ -497 -485 -40 127 194 -343 -340 8 245 -186 -202 -190 -108 438 -228 -34 -452 -64 370 -169 -174 -100 229 86
4027H6o2K50k35M79o26L63m03J74K4j65J95r0k42M6j61L9K08k8J01m12M50L16
$$ 86 24 274 39 518 -108 255 -148 26 50 -115 80 -10 -252 -206 -367 -328 -120 -148 -47 -459 -9 307
4049C07n34L8j42K40K36k92l19L01K60n7l56rN29K47m58m6j36M40L37j94l67Q
$$ 307 -227 -189 -331 -91 145 -147 -466 -165 95 38 -318 -327 202 449 -9 -55 -191 249 586 392 25 33
4071C3K80K70l26n50P1N08k13r8n49K70P11ro67k08J45O74j19r59j04M44O51j05
$$ 33 313 583 257 -293 -222 286 73 -25 -574 -304 407 398 -269 -477 -332 342 223 -736 -840 -396 255 150
4093A50n64n07Q70K04j45p13j1Q43L13m52m53k7R19j2j97o48K70M14N44q81p66
$$ 150 -414 -921 -51 153 8 -705 -716 127 440 -12 -465 -492 427 415 218 -430 -160 254 798 -83 -849
4114h49P63O22Q5p97m46L70Q24n8p34o84M47R51k66o40n19O60J179n98q72m79
$$ -849 -86 536 621 -176 -622 -252 572 514 -220 -904 -457 494 228 -412 -931 -271 908 310 -562 -1041
4134a041J127N25l96r16q5J155K15l49j148K35R98M28n91j070K73J185L54q80
$$ -1041 86 611 215 -701 -786 369 584 235 -913 -678 320 748 157 -913 -640 545 899 19
4152A9p74O43Q34K61j222n63M23J387m71j043l59N64J089m59r17n39J317Q02n59
$$ 19 -755 -112 722 983 -239 -802 -379 1008 537 -506 -865 -301 788 329 -588 -1127 190 992 433
4171D33j387M6J129O51o11j441J95J327M49p76j071K87J191N46j319o76Q35R51
$$ 433 -954 -908 221 872 261 -1180 -985 342 791 15 -1056 -769 422 968 -351 -1027 -192 759
4189G59M3j238n19M97J211k50q94q13J222P32k46r61m73R91P52l48j389j76J454
$$ 759 802 -436 -955 -458 753 503 -391 -1204 18 750 504 -457 -930 61 813 465 -924 -1100 354
4208C54O67n15j085j09R66O49q18r42N72P97K50q83j008N13J114M78j191o27M74
$$ 354 1021 506 -579 -688 278 927 109 -833 -261 536 786 -97 -1105 -592 522 1000 -191 -818 -344
4227c44J210n8j240m14L78J154j85j071r61J188R50m10j191l17J214P22n28j236
$$ -344 866 808 -432 -846 -468 686 501 -570 -1531 -343 607 197 -994 -1311 -97 625 97 -1139
4245a139J18Q78Q10m45j677O08J058N31r46j012K43J244J50q85q05M73J332%r76
$$ -1139 -1021 -143 667 222 -1455 -847 211 742 -204 -1216 -973 271 421 -464 -1269 -796 536 536 -440
4264d40p01O67J370j26j287n34J063R43n97j104k44J049M44n1j416j44J226O29
$$ -440 -1141 -474 896 770 -517 -1051 12 955 358 -746 -990 59 503 452 -964 -1108 118 747
4282G47q32p25J82J088M25r58n16j54J046O12j204q99M80Q55O0n95q57Q01O12
$$ 747 -85 -810 -628 460 885 -73 -589 -743 303 915 -289 -1188 -708 147 207 -388 -1245 -444 168
4301A68r0n56k77O12N48l20q40oL62P75l60j177J21Q96M95n04o76J0N06P40p29
$$ 168 78 -478 -755 -143 405 85 -755 -761 -399 376 16 -1161 -1040 -144 351 -153 -829 -819 -313 427 -302
4322c02n30L97O04L18m96r88M00N77J66n11n11K55Q68qm46n34M71M88J90p00l08
$$ -302 -832 -435 169 487 -9 -997 -597 -20 146 -365 -876 -621 247 239 -207 -741 -270 218 408 -292 -600
4343f00N86K29Lr92k0M52M71j48j053K85M52N81p80j99O6M94M56p37j39j26P55
$$ -600 -14 215 218 -774 -794 -342 129 -19 -1072 -787 -335 246 -534 -733 -667 -173 283 -454 -593 -719 36
4364C6J55l90l53l7P51l46j93l88N47K6L30m27j23O65O0j12l78O3K46j70Q8j10
$$ 36 191 -199 -552 -589 162 -184 -377 -765 -218 -192 138 -289 -412 253 313 201 -177 -114 132 -38 50 -60
4386f0l1m3K99n51J73j92O6P7j29K60j11N1m7J48p3o1J47m42M61j85K0q4k7J57
$$ -60 -91 -134 165 -386 -213 -405 -339 -262 -391 -131 -242 -191 -238 -90 -163 -224 -77 -519 -58 -243 -223 -307 -334 -177
4410a77l17J6J76J11j31R1J28L16k61J33N5k75K72l91N8K33q7l7j91L25j22j86
$$ -177 -494 -478 -302 -191 -322 -231 -103 213 -48 85 140 -135 137 -254 -196 37 -50 -87 -278 47 -75 -261
4432b61o8K90K39j88j20J44j04J54J7l60k06M16J10k33l74J76J56P7mj70L9K12
$$ -261 -329 -39 200 12 -108 36 -68 86 103 -257 -463 -47 63 -170 -544 -368 -212 -135 -139 -309 -270 -58
4454e8M66m08j83K12J95K98m41r1m7M80m09j98k86L21L78l1k98m12M82K35m9n81
$$ -58 408 0 -183 29 224 522 81 -10 -57 423 14 -184 -470 -149 229 198 -100 -512 -30 205 156 -425
4476d25p0M60J57op49K44K80J34k65l60l23P28M99o79m00L29Q54m5n10m06L45
$$ -425 -495 -35 122 116 -633 -389 -109 25 -240 -600 -923 -195 304 -375 -775 -446 408 363 -147 -553 -208
4497b08P99j83n15k32L35O03k90n64n82J257K35l88p57k4J105n2J47j383Q14N16
$$ -208 591 408 -107 -339 -4 599 309 -255 -837 420 655 267 -490 -514 591 539 686 -697 117 633
4517F33N30o45j002l77J258L00j024p68N19J319l20o73o44N54Q13J69r84j79J64
$$ 633 1163 518 -484 -861 397 697 -327 -1095 -576 743 423 -250 -894 -340 473 642 -342 -521 -357
4536c57J042q9p49m55N53O80k89n62n55N64J155l38j111l37R92O35p53o70L3O47
$$ -357 685 596 -153 -608 -55 625 336 -226 -781 -217 938 600 -511 -848 144 779 26 -644 -611 36
4556C6O13o74p08J93O57K66m38q32J37J148K21q88p67P85J088j20j125n27P04
$$ 36 649 -25 -733 -540 117 383 -55 -887 -750 398 619 -269 -1036 -251 837 717 -408 -935 -231
4575b31R54n3j079k79R04O17j90j001j57P18Q87o46j189M42P67M10o64j098L06
$$ -231 723 670 -409 -688 216 833 643 -358 -515 203 1090 444 -745 -303 464 874 210 -888 -582
4594e82J158L2q63o43N04M40J45n95m52M69L54M35n85q27L77J147m84o13p96J455
$$ -582 576 608 -255 -898 -394 46 191 -404 -856 -387 -33 402 -183 -1010 -633 514 30 -583 -1379 76
4614G6n40J099j329q8L10M13O99j529R75m95J710j858m9M19K49Q04p55r44o9O83
$$ 76 -464 635 -694 -782 -472 -59 640 -889 86 -409 1301 -557 -606 -187 62 866 111 -833 -902 -219
4634b19O62r98r51J298M46n39q5j408J171J613n78j284L27K23J202p43n66j30
$$ -219 443 -555 -1506 -208 238 -301 -386 -1794 -623 990 412 -872 -545 -322 880 137 -429 -559
4652e59O37N84K8j507o3O35O16j11j131j43Q76O05n98o21m2O53L45K2j007J68
$$ -559 78 662 690 -817 -880 -245 371 260 -871 -1014 -138 467 -131 -752 -794 -141 204 226 -781 -613
4672f13N13P16j320l35R98M30k22k18q93O64J384o37q37k34M06N06l24k34j41
$$ -613 -100 616 -704 -1039 -41 389 167 -51 -944 -280 1104 467 -370 -604 -198 308 -16 -250 -391
4691c91N6R41k78q28L37L52K94p6q60K9P24L40p44n99K11O04J91n97m50M71L32
$$ -391 -335 606 328 -500 -163 189 483 407 -453 -424 300 640 -104 -703 -492 112 303 -294 -744 -273 59
4712E9K30p31j63M02L01O9q36K15K76L5K2l58J3M86L68q8n17p8M28N39n20l26
$$ 59 289 -442 -605 -203 98 167 -669 -454 -178 -143 -121 -479 -466 20 388 300 -217 -295 133 672 152 -174
4734a74r7K93L82j89o26J14O48j21j07n58K88M68k4l45k66n9M84K10o19J09L42
$$ -174 -271 22 404 215 -411 -297 351 230 123 -435 -147 321 297 -48 -314 -373 111 321 -298 -189 153
4755A53j33J00m13nj7M56p9m24K07Q1m8j5j15J4L12K44j72k40k3J87j38j44J31
$$ 153 20 120 -293 -298 -315 141 62 -362 -155 -74 -122 -137 -252 -238 74 318 146 -94 -117 70 -68 -212 -81
4778h1j84J16K21j80j09J86l5r1R9P7n6Jr9m2J45J29L8j49N9k45J7J06k97L89
$$ -81 -265 -149 72 -108 -217 -31 -66 -157 -58 19 -37 -36 -135 -177 -32 97 135 -14 45 -200 -183 -77 -374 15
4802A5l21M6K45j53K86J67l88J20k0J55J33J5k87J24N9r0j13k50K37K07l74P4
$$ 15 -306 -260 -15 -168 118 285 -103 17 -3 152 285 300 13 137 196 106 -7 -257 -20 187 -187 -113
4824a13m1J05L40l34k14l24N69N7k0j34k77M70L4l52p6J13J91J12j82j53N2M92
$$ -113 -154 -49 291 -43 -257 -581 -12 45 25 -109 -386 84 118 -234 -310 -197 -6 106 -76 -229 -177 315
4846C15r2m01j62L34K4K61l00j36m4L98j0m80r7L26O63m87k49l85M67N18l09m80
$$ 315 223 -178 -340 -6 18 279 -21 -157 -201 197 187 -293 -390 -64 599 112 -137 -522 -55 463 154 -326
4868c26r9O33k05j82n06R8O25L49m61o63N89K78L24n07l43M62N91k43o20L8L19
$$ -326 -425 208 3 -179 -685 -587 38 387 -74 -737 -148 130 454 -53 -396 66 657 414 -206 -168 151
4889A51N29j90q70N5O61L70k87p96R3N95N24p65k68M6M69L10l87p72p8J023J3
$$ 151 680 490 -380 -325 336 706 419 -377 -284 311 835 70 -198 -152 317 627 240 -532 -610 413 426
4910D26o36o30O31N27O6p57l76N31P64j07p84n04O37R11m44p51K5O10L66m55m01
$$ 426 -210 -840 -209 318 384 -373 -749 -218 546 439 -345 -849 -212 699 255 -496 -471 139 505 50 -351
4931c51J8L42P69m02p74l8Q38K73l93j057O18O15L41o60m62J24O26J28q60l05
$$ -351 -333 9 778 376 -398 -436 402 675 282 -775 -157 458 799 139 -323 -199 427 555 -305 -610
4951f10M87O18j77p08l66O41Q25k46q08m25O58N68j74q65j06P56M82l81q06kJ044
$$ -610 -123 495 318 -390 -756 -115 710 464 -344 -769 -111 457 283 -582 -688 68 550 169 -637 -639 405
4972D05K59n17n76J85R30K68o61p26K86Q35l13n10m16M9Q72K21p73o64Q08O00
$$ 405 664 147 -429 -244 686 954 293 -433 -147 688 375 -135 -551 -502 370 591 -182 -846 -38 562
4992E62j46q08m66N25R87m16o03m38R31O51o06o60q0R03J94l44p97L96L12M53
$$ 562 416 -392 -858 -333 654 238 -365 -803 128 779 173 -487 -567 336 530 186 -611 -215 97 550
5012E50k84j072N21P30J17o67m63L07O79K81o01r05N94R61k13j004n0K98M50j78
$$ 550 266 -806 -285 445 562 -105 -568 -261 418 699 98 -807 -213 748 535 -469 -519 -221 229 51
5032E1m96j34O26M54l66l65k78P07M14m43p76J54P86Q0j85p44K33N78M14n72o29
$$ 51 -445 -579 47 501 135 -230 -508 199 613 170 -606 -452 334 414 229 -515 -282 296 710 138 -491
5053d91L75L88K04o32q1J20P33R2j045kL07N62j78m33l75O48L47l07m74l48R24
$$ -491 -116 272 476 -156 -237 -117 616 708 -337 -339 -32 530 352 -81 -456 192 539 232 -242 -590 334
5074C34N8l28n99NN98K00l43n56k3Q08J32k84m26K10L98K23n44j32L3M56L05o19
$$ 334 392 64 -535 -530 68 268 -75 -631 -654 154 286 2 -424 -214 184 407 -137 -269 -236 220 525 -94
5096i4k98L84N21l92k28j98L33J84Q5l57k39J45O28j06p29n5O84R9m00l67L41
$$ -94 -392 -8 513 121 -107 -305 28 212 297 -60 -299 -154 474 368 -361 -416 268 367 -33 -400 -59
5117e9J12L01k51l65L61J00Pj06m49M34O5l1k35m7J77o4Mk79L32k31N25l40Lm08
$$ -59 53 354 103 -262 99 199 206 100 -349 85 150 119 -116 -163 14 -50 -46 -325 7 -224 301 -39 -36 -444
5141d44N39J5jk81m6J88R8J68m07m1M85k87J01j20k74L27O9k13q5K20j33J45M5
$$ -444 95 110 109 -172 -218 -30 68 236 -171 -212 273 -14 87 -33 -307 20 89 -124 -209 11 -122 23 68
5164F8K6j73K08q2kq7M90j56k01J05k45O2j26J05r7K42K00l19r0r9J32J73k41
$$ 68 94 -79 129 47 45 -42 448 292 91 196 -49 13 -113 -8 -105 137 337 18 -72 -171 -39 134 -107
5187a07J05K38o6j23l1J07J06o1j98j64J18M05j09o47M40O6L56m40q7k0K42%k5
$$ -107 -2 236 170 47 16 123 229 168 -30 -194 -76 329 220 -427 13 79 435 -5 -92 -112 130 130 105
5210A05k70M1M10m5j39l48K25J50M12p13p3J96J79J57n71m9Q1L53Qk66k77L53
$$ 105 -165 -124 286 241 102 -246 -21 129 541 -172 -245 -49 130 287 -284 -333 -252 101 109 -157 -434 -81
5232h1L98K8m02k90L10M68j81m84p8O35L2l93l48K38M06J91m69k24J30RN85n75
$$ -81 317 345 -57 -347 -37 431 250 -234 -312 323 355 -38 -386 -148 258 449 -20 -244 -114 -105 480 -95
5254i5m44L07M93L1l76l37J80N91m0l62k19Q8N32Mn59l53O81M18k33n26j41L31
$$ -95 -539 -232 261 292 -84 -421 -241 350 310 -52 -271 -183 349 353 -206 -559 122 540 307 -219 -360 -29
5276b9L78l9l85j73O97J26l06l90j65P31M3m21n03O39O50k84p87k31R5R20o0p17
$$ -29 349 310 -75 -248 449 575 269 -121 -286 445 488 67 -436 203 853 569 -218 -449 -354 566 506 -211
5298b11n89M90Q70m15q59R6K70P41l60o54p7R28J57J36j180L4P72J73o0q58K17
$$ -211 -800 -310 560 145 -714 -618 -348 393 33 -621 -698 230 387 523 -657 -623 149 322 262 -596 -379
5319c79P05L65n11o95N5J068L87o38l48n46J414m50n58N24k67L85L49j174l66
$$ -379 326 691 180 -515 -460 608 995 357 9 -537 877 427 -131 393 126 511 860 -314 -680
5338f80J144J81m58q12m6O37O34k61n15j11L29J64L02n82m84Q19j13L47j284M48
$$ -680 464 645 187 -625 -671 -34 600 339 -176 -287 42 206 508 -74 -558 261 148 495 -789 -341
5358c41R80M98p34j263M4J541j18m14q02M41R50m06m48r39R13P17j95q25J7L17
$$ -341 639 1137 403 -860 -816 725 607 193 -609 -168 782 376 -72 -1011 -98 619 424 -401 -384 -67
5378f7O35l25p32n5M79Q26o49p90J89N81M49p20n14K10N72O19q18m22N65N58j52
$$ -67 568 243 -489 -544 -65 761 112 -678 -489 92 541 -179 -693 -483 89 708 -110 -532 33 591 439
5399D39p50qR0R31l09o20l8M87L32m29j45n36R03K50k69n61r0L86M72k32n80J52
$$ 439 -311 -319 -229 702 393 -227 -265 222 554 125 -20 -556 347 597 328 -233 -323 63 535 303 -277 -125
5421a25L95J10n7p43q9L85M90l00n73L56M86j0n01o5k89Q96o8j32m23j98N25K05
$$ -125 270 380 323 -420 -509 -124 366 66 -507 -151 335 325 -176 -241 -530 366 298 166 -257 -455 70 275
5443B75m05m69M25N75J00q75J05L18K57o4m45l0M93J05k5o31Q0L85J66k02m89
$$ 275 -130 -599 -174 401 501 -374 -269 49 306 242 -203 -233 260 365 340 -291 -211 174 340 138 -351
5464c51L76J81j27j21k95J44L73j73P8l91K03L33n7k03l75M71J42j42j50j13K07
$$ -351 25 206 79 -42 -337 -193 180 7 85 -306 -103 230 173 -30 -405 66 208 66 -84 -197 10
5485A0J72o2j86M3K67K01n77J21p5K61L21n38j75J47K6J58j52p2j44N30m01L4
$$ 10 182 120 -66 -23 244 445 -132 -11 -86 175 496 -42 -217 -70 -44 114 -38 -110 -254 276 -125 -91
5507i1k35J63L02j21j67j44J69Q0K8k52J97J25J40n6n2l87L14O2M8k42K62k28
$$ -91 -326 -163 139 18 -149 -293 -124 -44 -16 -268 -71 54 194 138 86 -301 13 75 123 -119 143 -85
5529h5K76k42k1P9J93J32m10P8J2j43L66j91oj25K11k5J74j17m1q4N6j0j47J7
$$ -85 191 -51 -72 7 200 332 -78 0 12 -131 235 44 38 -87 124 99 273 156 115 31 87 77 -70 -53
5553e3k38M92l18K41j22K11j24o5K61k95q9J16L71k89k41j81M26J55m5l56k8R1
$$ -53 -291 201 -117 124 2 213 89 24 285 -10 -99 17 388 99 -142 -323 103 258 213 -143 -171 -80
5575h0N44n81L51l19J53K34j90j82J00O9J28k72k60n5L62K51m26j10P4M15J07
$$ -80 464 -117 234 -85 68 302 112 -70 30 99 227 -45 -305 -360 2 253 -173 -283 -209 206 313
5596C13j27j44j14L05J42m75r7O6L06r6l5l53J83O76m98k95L1M25J30j08m83J44
$$ 313 186 42 -72 233 375 -100 -197 -131 175 79 44 -309 -126 550 52 -243 -212 213 343 235 -248 -104
5618a04J87L27l30n16Q7L15L80m79k14K00Q6N73m55m27J87M20M19p25j95M4O28
$$ -104 83 410 80 -436 -349 -34 346 -133 -347 -147 -61 512 57 -370 -183 237 656 -69 -264 -220 408
5639D08N7o04r3K98L77j42n85M4L19J55J25m65q0K38L26J19o80k17L28L52j31
$$ 408 465 -139 -232 66 443 301 -284 -240 79 234 359 -106 -186 52 378 497 -183 -400 -72 280 149
5660A49m96J12L90K80n88j76L49oL52l58n14J73O79O9o51j71K09N73O3o89m07
$$ 149 -347 -235 155 435 -153 -329 20 14 366 8 -506 -333 346 415 -236 -407 -198 375 438 -251 -658
5681f58P13M12R1r41j33M66N18l21n86j25O08K24j98n25K12L95J93j81n36K01
$$ -658 55 467 558 -383 -516 -50 468 147 -439 -564 44 268 70 -455 -243 152 345 164 -372 -171
5701a71L04L16o57j64J93N68J36n76k73L69N73l14o61j06M19O44l14p48q3Q47
$$ -171 133 449 -208 -372 -179 389 525 -51 -324 45 618 304 -357 -463 -44 600 286 -462 -545 302
5721C02M46n68l63j28L43M62k68o71P2N51K93k12p63j72J010K91p14m71J56O12
$$ 302 748 180 -183 -311 32 494 226 -445 -373 178 471 259 -504 -676 334 625 -89 -560 -404 208
5741B08L70q08k18J01N03J4j68o58O15O35j44o07o3K83M31J01q07j92O26L30j71
$$ 208 578 -230 -448 -347 156 170 2 -656 -41 594 450 -157 -220 63 494 595 -212 -404 222 552 381
5762C81n94O9K95J28l19m0k38M73M04n30r18M21R35k45q99M40L70OK91q35j97
$$ 381 -213 -144 151 279 -40 -80 -318 155 559 29 -889 -468 467 222 -677 -237 133 139 430 -405 -602
5783f02R63k14J73j49l67R9R72r29m46k05J091N20r63l89k57R61J0j82N0j49Q17
$$ -602 361 147 320 171 -196 -97 875 -54 -500 -705 386 906 -57 -446 -703 258 268 86 136 -13 804
5804H04l30k72m70M82k63O97R9j479J20N89L33m36j91J28K09N0p43K19P6N30L39
$$ 804 474 202 -268 214 -49 648 747 -732 -612 -23 310 -126 -317 -189 20 70 -673 -454 -378 152 491
5825D91o96j72L58M25m0p37J39M6R75p92j012O07N42J7M61o62n96O02P77j58j146
$$ 491 -205 -377 -19 406 366 -371 -232 -186 789 -3 -1015 -408 134 151 612 -50 -646 -44 733 575 -571
5846e71L25P29J9o63l74J165p28n56O4M04L45k67M22n57R7M36R5j48l37k3R3L62
$$ -571 -246 483 502 -161 -535 630 -98 -654 -590 -186 159 -108 314 -243 -146 290 385 237 -100 -123 -30 332
5868C32k71j13j84K7K73k01k63Q57k67M15o69j12N38j99L01m06M59m49o8L07l11
$$ 332 61 -52 -236 -209 64 -137 -400 457 190 605 -64 -176 362 163 464 58 517 68 0 307 -4
5889dm85M71J8k03L06R5J08j41j02l22j3L32o9J7k99J38L12L4k52K35J6j48k63
$$ -4 -489 -18 0 -203 103 198 306 165 63 -259 -272 60 -9 8 -291 -153 159 193 -59 176 192 44 -219
5912b19J05K52k78L96n31K8K02m2K35k65J55j92R5K20J5k5j28k17J60J04p2R1
$$ -219 -114 138 -140 256 -275 -247 -45 -87 148 -117 38 -154 -59 161 176 151 23 -194 -34 70 -2 89
5934H9p7M2k8J10K72l92M8j30R4K73j62l03l4J36P1R8k16L57p4N4r3p0J68Q7k63
$$ 89 12 54 26 136 408 16 64 -66 28 301 139 -164 -198 -62 9 107 -109 248 174 228 135 65 233 320 57
5959E7j39k37K1L20M07o75j9N48L53j155l62P17N46j01l56J63l49M67R5r4n05
$$ 57 -82 -319 -298 22 429 -246 -265 283 636 -519 -881 -164 382 281 -75 88 -261 206 301 207 -298
5980b98K14N02m66q2k29M82N2k6k28k65J77J98L74n76K82j73L76m35r0O1K57J74
$$ -298 -84 418 -48 -130 -359 123 175 149 -79 -344 -167 31 405 -171 111 -62 314 -121 -211 -150 107 281
6002B81nn30k7L99J76l48j90k9K30M42l86j40J95J71L9j28l02O7M63l27k73k78
$$ 281 276 -254 -281 118 294 -54 -244 -273 -43 399 13 -127 68 239 278 150 -152 -85 378 51 -222 -500
6024e00M13J86K81q79L15N43pn13Q4n8K53R1K83q32j78N47J59m55m78K17Q64k75
$$ -500 -87 99 380 -499 -184 359 352 -161 -77 -135 118 209 492 -340 -518 29 188 -267 -745 -528 336 61
6046F1j88o00O11K0J26J07J29P4l26j16r2Q2N9K97J11n61r1K79N69m10n74J46
$$ 61 -127 -727 -116 -96 30 137 266 340 14 -102 -194 -112 -53 244 355 -206 -297 -18 551 141 -433 -287
6068b87K45M37j77m61K4L27J16j90k31o2N42K39o43j95J32L94K13n76l47N29J74
$$ -287 -42 395 218 -243 -219 108 224 34 -197 -259 283 522 -121 -316 -184 210 423 -153 -500 29 203
6089B03L07n87l94K68O35k0o76j01L31K56J59n02m0K95M82m16l75k42M94M94n49
$$ 203 510 -77 -471 -203 432 412 -264 -365 -34 222 381 -121 -161 134 616 200 -175 -417 77 571 22
6110B2j80m78J013J13n49l23P1O83R6m99l20M0N48J53l12p38N41L21J42p88k2
$$ 22 -158 -636 377 490 -59 -382 -311 372 468 -31 -351 -311 237 390 78 -660 -119 202 344 -444 -466
6131d66L00N41n2p55K65MM34J8m79l16O03J59k45m46j08O20L71l58m29o4P99q9
$$ -466 -166 375 323 -432 -167 -163 271 289 -190 -506 97 256 11 -435 -543 77 448 90 -339 -403 396 307
6153C07j12p09L10O63k9m80p48R09K32j13j97l59L00N28k54n44L6J59O76m82l13
$$ 307 195 -514 -204 459 430 -50 -798 111 343 230 33 -326 -26 502 248 -296 -260 -101 575 93 -220
6174b20q8N25L9j19l89p6M61K18l75l75N44j34O13m02m85K96P3N19o07k87J15
$$ -220 -308 217 256 137 -252 -328 133 351 -24 -399 145 11 624 222 -263 33 106 625 18 -269 -154
6195a54O35j46l30l77J44N48K8q03oJ21M91L0j08n08N09K95j07l14j48O69k05
$$ -154 481 335 5 -372 -228 320 348 -455 -461 -340 151 181 73 -435 74 369 262 -52 -200 469 264
6216B64m79J34j98M62j24ok48Q7J86RN5k71M59L7r0k13QK12p8Rn12K25J18p5J88
$$ 264 -215 -81 -279 183 59 53 -195 -108 78 87 142 -129 330 367 277 64 72 284 206 215 -297 -72 46 -29 159
6241A59l39j7Q3j3N2P6j2q7K54rj91j74K90K87m60l03R7L01m8p0j00K10J76O6
$$ 159 -180 -197 -114 -127 -75 1 -11 -98 156 147 -44 -218 72 359 -101 -404 -307 -6 -54 -124 -224 -14 162 228
6265B28j23k51J49M4J18j39j14K22J61l44k3r7K30O6N3r7k88L99nr0l16K46jm5
$$ 228 105 -146 3 47 165 26 -88 134 295 -49 -72 -169 61 127 180 83 -205 194 189 99 -217 29 28 -17
6289a7Mj68R3J65o8N6l24J35k5K43l48K61l3O5j17P6p5P9R8r0m8M5N9o7O7Q5n8
$$ -17 -13 -181 -88 77 9 65 -259 -124 -149 94 -254 7 -26 39 -78 -2 -77 2 100 10 -38 7 66 -1 66 151 93
6316I3l4K7k50qj8L03o6j8R1p%j43L00M1l78N0m4k42K91M4l11M7L36J47k32j97
$$ 93 59 86 -164 -172 -190 113 47 29 120 113 113 -30 270 311 -67 -17 -61 -303 -12 32 -279 -232 104 251 19 -178
6342a78j62L76M5k9l11q5L21k3q6k00J7M07m0j80j50M9J17J54k38j3K5N16m6n46
$$ -178 -340 36 81 52 -259 -344 -23 -46 -132 -332 -315 92 52 -128 -278 -229 -112 42 -196 -209 -184 332 286 -260
6366b60k5K1K88j48k01l5L90m2J29j95k1j10L82k34k87L41J71P8l44J7N5J76P0
$$ -260 -285 -264 24 -124 -325 -360 30 -12 117 -78 -99 -209 173 -61 -348 -7 164 242 -102 -85 -30 146 216
6389B16j77n86M16N08j23l55k01J11K89J79m69J67k29L30J55l17K2q6M21l8m89
$$ 216 39 -547 -131 377 254 -101 -302 -191 98 277 -192 -25 -254 76 231 -86 -64 -150 271 233 -256
6410b56l7K55N11k72l89l29L74M14p4l82K6J05O27n11n37K44N98l6n87l94O32
$$ -256 -293 -38 473 201 -188 -517 -143 271 197 -185 -159 -54 573 62 -475 -231 367 331 -256 -650 -18
6431a8L11l3m02l63M27L79o9n00j62L37O32m53k95OP1M00k01m82L73M01j16j20
$$ -18 293 260 -142 -505 -78 301 232 -268 -430 -93 539 86 -209 -203 -132 268 67 -415 -42 359 243 123
6453A23m49m7L44M13m56m25K22M55K29m15m12k14Q41J7m36m22K88O75j83l73k28
$$ 123 -326 -373 -29 384 -72 -497 -275 180 409 -6 -418 -632 209 226 -210 -632 -344 331 148 -225 -453
6474d53L13M13k10m53J5L25L09j49l28r4L26L26k82m42J77M29R8m67k18J99K54
$$ -453 -140 273 63 -390 -375 -50 259 110 -218 -312 14 340 58 -384 -207 222 320 -147 -365 -166 88
6495H8M36n88k25J09L93n3l79j79K39J54K68o28j46M14Q1J78k31l93L97M95m68
$$ 88 524 -64 -289 -180 213 160 -219 -398 -159 -5 263 -365 -511 -97 -16 162 -69 -462 -65 430 -38
6516c8o4p6J94L46j09o98K43M37J05k09m22n6N65P7k89l24L18m2K44l24l96J30
$$ -38 -102 -178 16 362 253 -445 -202 235 340 131 -291 -347 218 295 6 -318 0 -42 202 -122 -518 -388
6538c88M49M00o52l29K32N92k25j01o41O82K81k87k74j52P53l02k13j5p9K88J24
$$ -388 61 461 -191 -520 -288 304 79 -22 -663 19 300 13 -261 -413 340 38 -175 -190 -269 19 143
6559A43j37l06j37M39L30l94m19L50L17J44j72n28O7M45n3k36j98L5M13j0k54
$$ 143 6 -300 -437 2 332 -62 -481 -131 186 330 158 -370 -303 142 89 -147 -345 -310 103 93 -161
6580a61m28M41M76n4l88p0J8J88%k13l2J34K54q3j51k72M62Q4k08j98K31%p5k61
$$ -161 -589 -148 328 274 -114 -184 -166 22 22 -191 -223 -89 165 82 -69 -341 121 205 -3 -201 30 30 -45 -306
6604c06L51m55O28j70l04l0j47O41j30M8k77qO33l97k69p6M27J35j73l49L9L11
$$ -306 45 -410 218 48 -256 -286 -433 208 78 126 -151 -159 474 77 -192 -268 159 294 121 -228 -189 122
6626A22J91k19l09J04L44k24K72k85l3r8L41k33j31J52j57J34P2j29P6j27k4R2
$$ 122 313 94 -215 -111 233 9 281 -4 -37 -135 206 -27 -158 -6 -163 -29 43 -86 -10 -137 -161 -69
6648f9l87L49j53J94q9LK06j70M23m89j37O17p1j17n01M61j41J77R7m39L7L73
$$ -69 -456 -107 -260 -66 -155 -152 54 -116 307 -182 -319 298 227 110 -391 70 -71 106 203 -236 -199 174
6670A74j58R2j55KP2Q5j21K77j25o0j89J9N33m89R0K1J22o33L94j26q7N52q0K31
$$ 174 16 108 -47 -45 27 112 -9 268 143 83 -106 -87 446 -43 47 68 190 -443 -49 -175 -262 290 210 441
6694D41n35o9L08n1k08Q2j08K29m6k92L77j93Q9J01j07K7q2R1J90k48n0J73j70
$$ 441 -94 -163 145 94 -114 -32 -140 89 43 -249 128 -65 24 125 18 45 -37 54 244 -4 -54 119 -51
6717e1K61l07K5j4l2J07J00n54N26J03n4k60L4K83k02j5j96j04K61LM1j5j13L35
$$ -51 210 -97 -72 -86 -118 -11 89 -465 61 164 110 -150 -116 167 -35 -50 -246 -350 -89 -86 -45 -60 -173 162
6741A62r6j19nl1J56j00j7j82M33J19j48k67j95M46J32l44O7J07j67L22k55l82
$$ 162 66 -53 -58 -89 67 -33 -50 -232 201 320 172 -95 -290 156 288 -56 11 118 -49 273 18 -364
6763c64J14L22nr0l60K17J98J58k03o8j33N73k43j61k12l4M76k78m8k07N05J42
$$ -364 -250 72 67 -23 -383 -166 32 190 -13 -81 -214 359 116 -45 -257 -291 185 -93 -141 -348 157 299
6785B99k11l80K83L24j36R8J8n48M68L0l3k72q3L83J29n16j20J16L56K3J0l96
$$ 299 88 -292 -9 315 179 277 295 -253 215 245 212 -60 -143 240 369 -147 -267 -151 205 228 238 -158
6807a58k97P15J31n26n28L91O83l88J49o13R51m72M64m14q41R51P1M7p18K22O
$$ -158 -455 260 391 -135 -663 -272 411 23 172 -441 510 38 502 88 -753 198 269 316 -402 -180 -174
6828a74M82l54Q7k83K95K97j67n93J35O42k2k54n71K96N95m3l43n73N02M57l38
$$ -174 308 -46 41 -242 53 350 183 -410 -275 367 345 91 -480 -184 411 368 25 -548 -46 411 73
6849G3j59m52N15Lp7P6l74R5O97n12om60J171n66L51n80K69L58m29K57o49M83
$$ 73 -86 -538 -23 -20 -97 -21 -395 -300 397 -115 -121 -581 590 24 375 -205 64 422 -7 250 -399 84
6871H4o87O62l54J37K4K56J52j98m69K03L27K66l81l80J70M12j33m48lL24K33
$$ 84 -603 59 -295 -158 -134 122 274 76 -393 -190 137 403 22 -358 -188 224 91 -357 -360 -36 197
6892A97m5k22m90P02K62l30m35rM85L03k03m64R9L66M9o40L59k07K62M57n19j84
$$ 197 152 -70 -560 142 404 74 -361 -370 115 418 215 -249 -150 216 265 -375 -16 -223 39 496 -23 -207
6914b07k2N57r1m05j00J02M02J50m78l62K78L44R4k81l19K12L26N1n29o5J03M47
$$ -207 -229 328 237 -168 -268 -166 236 386 -92 -454 -176 168 262 -19 -338 -126 200 251 -278 -343 -240 207
6936B07o8n81K80J04M42l27k11J91j4J66l34o9J51K64L8m35K55j99J38J12M2m94
$$ 207 139 -442 -162 -58 384 57 -154 37 23 189 -145 -214 -63 201 239 -196 59 -140 -2 110 152 -342
6958c42O1N09J57n50m2Q4K68m1l73j1K91J97K7m12j2J58J80q3l12N5R5K48j82
$$ -342 -281 228 385 -165 -207 -123 145 104 -269 -280 11 208 235 -177 -189 -31 149 66 -246 -191 -96 152 -30
6981c0j61O9N6K76k21r0J57o4J44J3k74J38l7M26k59j68J06l5J74m64M3L17k7
$$ -30 -191 -122 -66 210 -11 -101 56 -8 136 149 -125 13 -24 402 143 -25 81 46 220 -244 -201 116 89
7004H9L2j14n6K48K02k32m33J4K51l5j23k55K32M23l63Oj30K08R8oJ8k58J50J3
$$ 89 121 7 -49 199 401 169 -264 -250 1 -34 -157 -412 -180 243 -120 -114 -244 -36 62 56 74 -184 -34 -21
7028b1J08j20r9L1J51o2L8j3q8K40qj85k48j25M31K00k96N6K61k96N0M2l20J58
$$ -21 87 -33 -132 -101 50 -12 26 13 -75 165 157 -28 -276 -401 30 230 -66 -10 251 -45 5 47 -273 -115
7052a15K79k04P8j11K27j85R0l90K92J95j72k02J29J71m6ok18L14r5k7j49J77
$$ -115 164 -40 38 -73 154 -31 59 -331 -39 156 -16 -218 -89 82 36 30 -188 126 31 4 -145 32
7074C2q5kj8RK11q5j19L1l9N7o9j03J03k74L49M2k75K09r1K12j72l2P5K64K42
$$ 32 -53 -55 -73 -64 147 62 -57 -26 -65 -8 -77 -180 -77 -351 -2 40 -235 -26 -117 95 -77 -109 -34 230 472
7099D72l94n0j84J42J12r1j83K03P8K82n26j36M61L4n2j92j19o2J80J64k09j29
$$ 472 78 28 -156 -14 98 7 -176 27 105 387 -139 -275 186 220 168 -24 -143 -205 -25 139 -70 -199
7121a99QL17J9j80j28J27m5pP6k65J87L19j28j80k00L15J86J36n59K76l5O4m24
$$ -199 -191 126 145 -35 -163 -36 -81 -88 -12 -277 -90 229 101 -79 -279 36 222 358 -201 75 40 104 -320
7144c20K87l7J97L0k44k9J6M77l25K3l58p7P47p7n92L4L28K10J86p59J31K50L7
$$ -320 -33 -70 127 157 -87 -116 -100 377 52 75 -283 -360 387 310 -282 -248 80 290 476 -283 -152 98 135
7167A35J52o10q1K42M70j64m29J10l4L44K5k87j33K82n5j62l81L68N09j18p0o34
$$ 135 287 -323 -404 -162 308 144 -285 -175 -209 135 160 -127 -260 22 -33 -195 -576 -208 301 183 113 -521
7189e21j79J023k15l56k34L80L68Q6m22l49N05J86j81k64j64J67N84k36j45j55
$$ -521 -700 323 108 -248 -482 -102 266 352 -70 -419 86 272 91 -173 -337 -170 414 178 33 -122
7209a22M26jr4o10J8M77J96k84j32k11O05P2n60J47qL60J6l35p6O9L98J08o15
$$ -122 304 303 209 -401 -383 94 290 6 -126 -337 268 340 -220 -73 -81 279 295 -40 -116 -47 351 459 -156
7232a56k24N25m6nj49k84L49J77j49k51j42N52Q2k57m74Q9M16L85n15q7k48O30
$$ -156 -380 145 99 94 -55 -339 10 187 38 -213 -355 197 279 22 -452 -363 53 438 -77 -164 -412 218
7254B18r2k85j84m1M32J57o2o99N02M67k4p91J25L69M1K19m40k08M32J78N0n43
$$ 218 126 -159 -343 -384 48 205 143 -556 -54 413 389 -402 -277 92 133 352 -88 -296 136 314 364 -179
7276a79K4K65J68j54k80k54N23Q5J46l10k20L55J90l01o11N6O67j02m74n8J71
$$ -179 -155 110 278 124 -156 -410 113 198 344 34 -186 169 359 58 -553 -497 170 68 -406 -464 -293
7297b93O94l97k9k13M5N00j49j69j7j08M61m3n41k2K55M12l39j32j76K80J12J61
$$ -293 401 4 -25 -238 -193 307 158 -11 -28 -136 325 282 -259 -281 -26 386 47 -85 -261 19 131 292
7319B92p47K54M70k33M6l86J32K23K09k25k90K4K11Q4l10J01J24l8J30j62k25
$$ 292 -455 -201 269 36 82 -304 -172 51 260 35 -255 -231 -20 64 -246 -145 -21 -59 71 -91 -316
7340c16L83J86n2l10M0Q1L78l94k56K17J08L56l56j85kk4N08k78k68m1M10k47
$$ -316 67 253 201 -109 -69 12 390 -4 -260 -43 65 421 65 -120 -122 -146 362 84 -184 -225 185 -62
7362f2J08k67J18J41P1j41J52q2j41K27l74K1J09L06k4m53K20j41K02JL7nM4J46
$$ -62 46 -221 -103 38 109 -32 120 38 -103 124 -250 -229 -120 186 162 -291 -71 -212 -10 -9 28 23 67 213
7386B13N2l13r4K98r7J3j09j38K97l42N47l99P3j04N6k65L07J54J5j26r8J25L6
$$ 213 265 -48 -142 156 59 72 -37 -175 122 -220 327 -72 1 -103 -47 -312 -5 149 164 38 -60 65 101
7409A01r3j26r9K80k76J4J27J72k4J2L70q18J198j001L38p90J094n7q84K07N4
$$ 101 8 -118 -217 63 -213 -199 -72 100 76 88 458 -360 838 -163 175 -615 479 422 -462 -255 -201
7430b01L97n16M49k47M69o41N47j47R5l91m7K49J152j154o22M86k42N71j90k17
$$ -201 196 -320 129 -118 351 -290 257 110 205 -186 -233 16 1168 14 -608 -122 -364 207 17 -200
7450b00N87l85K03N1r49P45O04l21p23L27K62n92J45L30k36K85j96j43M92j37
$$ -200 387 2 205 256 -693 52 656 335 -388 -61 201 -391 -246 84 -152 133 -63 -206 286 149
7470A49J5J80m67L1J40J55k42J33l56L41R0o6j50j97L17P1k48o6j10L35Jk09o2
$$ 149 164 344 -123 -92 48 203 -39 94 -262 79 169 103 -47 -244 73 144 -104 -170 -280 55 56 -153 -215
7493b15J12J7K14j20m00L2M60q4q8J01j15K37jj99M9OK39Kj10m61L71J29N9m24
$$ -215 -103 -86 128 8 -392 -360 100 16 -72 29 -86 151 150 -49 0 6 245 247 137 -324 47 176 235 -189
7517a89J00M87k3k31k11J07K84j09J39l26q6J32m4jk35L03K6O9k89k64M14K12
$$ -189 -89 398 375 144 -67 40 324 215 354 28 -58 74 30 29 -206 97 123 192 -97 -361 53 265
7539B65k57j30j33PM81j09m9l51K67K34k27k31j32O72k48m29K38m30R15o67L87
$$ 265 8 -122 -255 -248 233 124 75 -276 -9 225 -2 -233 -365 307 59 -370 -132 -562 353 -314 73
7560G3n41P5O97m6k30j87l01Q54j42j62l60J84M48j47j10m18R8N12k4r5k66L29
$$ 73 -468 -393 304 258 28 -159 -460 394 252 90 -270 -86 362 215 105 -313 -215 297 273 178 -88 241
7582B41l4N6l53j42N26K38l64k22k36N22M25m71o36K72L76O9q8l83J8M18j3k30
$$ 241 207 263 -90 -232 294 532 168 -54 -290 232 657 186 -450 -178 198 267 179 -204 -186 232 219 -11
7604a1k58N7L7N06m69k14N36k44M78l58o6j6P72o51q8j4J31K84k26n62l15J033
$$ -11 -269 -212 -175 331 -138 -352 184 -60 418 60 -6 -22 750 99 11 -3 128 412 186 -376 -691 342
7626C42j73J02n18k89O31L17l60l32J78L48J46m26k15J74M42l69k80rK10K87o9
$$ 342 169 271 -247 -536 95 412 52 -280 -102 246 392 -34 -249 -75 367 -2 -282 -291 -81 206 137
7647A37m66P8R9N02j64m56n9M44K29k11m75L2O42P2j78l27j89L84J25j69n32L00
$$ 137 -329 -251 -152 350 186 -270 -329 115 344 133 -342 -310 332 404 226 -101 -290 94 219 50 -482 -182
7669a82M75j12l01k62J93M23O8j62l18pL82p4j75l35K72M02k33k77l54P98J49
$$ -182 293 181 -120 -382 -189 234 302 140 -178 -185 197 123 -52 -387 -115 287 54 -223 -577 221 370
7690C70j73l64L4J70J94j14l71M2J47M04j54m79K37R7J75j46o04K87M12J39k81
$$ 370 197 -167 -133 37 231 117 -254 -212 -65 339 185 -294 -57 40 215 69 -535 -248 164 303 22
7711B2j91j68N32n5k35o3L8K79k51k8l52M28M02m56j47j22M88l8j50J9k33K42
$$ 22 -169 -337 195 140 -95 -158 -120 159 -92 -120 -472 -44 358 -98 -245 -367 121 83 -67 -48 -281 -39
7733c9J18j15l10L77J68j12Q7m57J69K95J08l16j18J26N1R7k16K68k34K55o9j37
$$ -39 79 -36 -346 31 199 87 174 -283 -114 181 289 -27 -145 -19 32 129 -87 181 -53 202 133 -4
7755dl0m5L60m50N9j89L93q1k54J62mM8q1J84n70L97q7K72Ol42K18r0J49j04k02
$$ -4 -34 -79 281 -169 -110 -299 94 13 -241 -79 -83 -35 -116 68 -502 -105 -192 80 86 -256 -38 -128 21 -83 -285
7780b85K50j48K73q9m0j60J55O8l2L2K5J92q3J13m43J29n5K12j81j1K63m33K13
$$ -285 -35 -183 90 1 -39 -199 -44 24 -8 24 49 241 158 271 -172 -43 -98 114 -67 -78 185 -248 -35
7803c5L70l7l56j79L31m75J097o82j7j34J171p33K34p38o4P02p50K80L3J0k59
$$ -35 335 298 -58 -237 94 -381 716 34 17 -117 1054 321 555 -183 -247 455 -295 -15 18 28 -231
7824b31O1J73K58o3n2J31j97M4n1o0l67L11O7j84L37k88Rj07K24J48q2L5k52J36
$$ -231 -170 3 261 198 146 277 80 124 73 13 -354 -43 24 -160 177 -111 -102 -209 15 163 81 116 -136 0
7848@K13l18j92K08L49l76J26l34M05k03J26k4k1J08J04N8j82j81K27L16o60p3
$$ 0 213 -105 -297 -89 260 -116 10 -324 81 -122 4 -20 -41 67 171 229 47 -134 93 409 -251 -324
7870c24M05k2K34k42k01J69N5J15k31j74M11J15j28m02m6K52R7r1l03K3J99J60
$$ -324 81 59 293 51 -150 19 74 189 -42 -216 195 310 182 -220 -266 -14 83 -8 -311 -288 -89 71
7892G1K19k47J17R3J33l60k77Q5J16L55k42k69K88Q6K35o11K27j65K08O6j63j13
$$ 71 290 43 160 253 386 26 -251 -166 -50 305 63 -206 82 168 403 -208 19 -146 62 128 -35 -148
7914a48K23L8J02k21j87Q9K70K80j137J120o96N96q24P45k2o35J422j017K95p76
$$ -148 75 113 215 -6 -193 -104 166 446 -691 429 -267 329 -495 250 228 -407 1015 -2 293 -483
7934d83Q2L71J12k82K1P09k63o13K39k52Q16m8k5j007R86k83K58l95m26O41L86
$$ -483 -401 -30 82 -200 -179 530 267 -346 -107 -359 457 409 384 -623 363 80 338 -57 -483 158 544
7955E44k29m01p18Q74k38L4r9o52J224m94N51j209m1J517m82K60j109J255q57
$$ 544 315 -86 -804 70 -168 -134 -233 -885 339 -155 396 -813 -854 663 181 441 -668 587 -270
7974b70M61K1q77O78L16l12m99N82l4j2j14L18o74M21N42k97r06Q37j038J024
$$ -270 191 212 -665 13 329 17 -482 100 66 54 -60 258 -416 5 547 250 -656 181 -857 167
7994A67j74o16K87j38M37L97q06n9N58l15J60l97k11J192n00j85P54p51Q4k62
$$ 167 -7 -623 -336 -474 -37 360 -446 -505 53 -262 -102 -499 -710 482 -18 -203 551 -200 -116 -378
8014c78N04l92l94M73J73r6j90L02K75k66q1l01J92N49j04m79J19L03j35N7k33
$$ -378 126 -266 -660 -187 -14 -110 -300 2 277 11 -70 -371 -179 370 266 -213 -94 209 74 131 -102
8035a02O5K59Kn4m68J99J53K55j26m28K73L80r2k60j88J35J96m45L00m73L75O0
$$ -102 -37 222 224 170 -298 -99 54 309 183 -245 28 408 316 56 -132 3 199 -246 54 -419 -44 16
8057A6K07k60NK01M1K09o88L7K75K26k06q0k2R7n6J70l47MJ28K10k18k80k44N12
$$ 16 223 -37 -32 169 210 419 -269 -232 43 269 63 -17 -39 58 2 172 -175 -171 -43 167 -51 -331 -575 -63
8081f3K75k75l56K56L36J52p47J74J61K35r5m5j11J3M86l2j89n34M77J89n0k69
$$ -63 212 -63 -419 -163 173 325 -422 -248 -87 148 53 8 -103 -90 396 364 175 -359 118 307 257 -12
8103a2j07K28J7j05j80O4J69J42j77k98J73J58N0j14k69OL08L57m26k24J22K93
$$ -12 -119 109 126 21 -159 -95 74 216 39 -259 -86 72 122 8 -261 -255 53 410 -16 -240 -118 175
8125A75j59lj38K44J13j83j5j80J07L28k22l08qR5M91j16n18K37OL48m38p7L40
$$ 175 16 13 -125 119 232 49 34 -146 -39 289 67 -241 -249 -154 337 221 -297 -60 -54 294 -144 -221 119
8148A19j01r4j31R9l2J40J11K59n35J7K66j17n3L9rj0j22L48m34J62J57k5n1J19
$$ 119 18 -76 -207 -108 -140 0 111 370 -165 -148 118 1 -52 -13 -22 -32 -154 194 -240 -78 79 54 3 122
8172A22j9p6j35j6J43O8k8K19l33J31j26L3qL6r9o0L6K99j23
$$ 122 103 27 -108 -124 19 87 59 278 -55 76 -50 -17 -25 11 -88 -148 -112 187 64
8191F4
$$ Imaginary data points
##PAGE= N=2
##DATA TABLE= (X++(I..I)), XYDATA
0@%%%%%%%%%%%%qJ6j6J6k4L2l2M0m8N6p2Q5r5J09j31J53j75J99k26K59k97L38
$$ 0 0 0 0 0 0 0 0 0 0 0 0 0 -8 8 -8 8 -16 16 -16 24 -24 32 -40 45 -50 59 -72 81 -94 105 -121 138 -159 179
34A79l80M29m83N42o07O76p52Q37r30J030j138J257j391J535j689J858k047K258
$$ 179 -201 228 -255 287 -320 356 -396 441 -489 541 -597 660 -731 804 -885 973 -1074 1184
52A184k488K744l032L353l717M137m621N188n867O692p722R053j0845J3401j7372
$$ 1184 -1304 1440 -1592 1761 -1956 2181 -2440 2748 -3119 3573 -4149 4904 -5941 7460 -9912
67i912K4436m0830J51564R4999j84055q437L2355J08454m0307j40736m2368J10709
$$ -9912 14524 -26306 125258 220257 36202 27765 60120 168574 128267 -12469 -54837 55872
79E5872N4291l8374j19424j4839J12103N6970o4620j00176Q336J00917M2303p5932
$$ 55872 110163 71789 -47635 -62474 49629 106599 41979 -58197 -49861 51056 93359 17427
91A7427r4730L3661R0487L6546q5063o5644M6861R9297K4716p9910m8259N9463
$$ 17427 -77303 -43642 46845 83391 -1672 -67316 -20455 78842 103558 23648 -24611 34852
103C4852R7844j312p8058m7396O1305Q3458l0367p9997m5487O5865O7723l8250
$$ 34852 132696 131384 53326 5930 67235 150693 120326 40329 -5158 60707 128430 90180
115I0180q3634k2929P2854N9467l7453q5438J814P1753M8922m9113q3595J4768
$$ 90180 6546 -16383 56471 115938 78485 -6953 -5139 66614 115536 66423 -17172 -2404
127b404O5821L5036o3985p1889K1438P2018J9183o5400n0543L0216Q1381N217
$$ -2404 63417 98453 34468 -37421 -15983 56035 75218 9818 -40725 -10509 70872 76089
139G6089o1362l7407M0171P1915p852o6436l6413N0367M9717j8221p0550k8835
$$ 76089 14727 -22680 17491 89406 81554 15118 -21295 29072 78789 60568 -9982 -38817
151c8817N8273L8610k3973o4823r462N9783M0580l4197n5297P258N3663L6610
$$ -38817 19456 58066 34093 -30730 -40192 19591 60171 25974 -29323 -22065 31598 68208
163F8208m7094m7478J3163N1071K2362n0174l9106J9122N5275Q727m3077l0627
$$ 68208 21114 -26364 -13201 37870 60232 10058 -29048 -9926 45349 54076 10999 -19628
175a9628L0539N4594j968l8688k5889L6972M1757j0801m5584j9511L5779K6126
$$ -19628 10911 65505 63537 24849 -1040 35932 77689 66888 21304 1793 37572 63698
187F3698j7408m9971p141L2250K1132k2222m2955N295L0538J8915k7176l0485
$$ 63698 46290 -3681 -10822 21428 42560 20338 -22617 -17322 13216 32131 4955 -25530
199b5530O497L2102R151l0384k0439M646L2545O68k6244j4245J0900K9329L91
$$ -25530 -19033 13069 22220 -8164 -28603 -23957 8588 9256 -16988 -31233 -20333 8996 9387
212I387j8459j0565K1181K1092K749j6175q989K2240J2481L62j8594n988J3421
$$ 9387 -9072 -19637 1544 22636 25385 9210 221 22461 34942 35304 16710 10722 24143
225B4143J1539n531j8128j481P347J4305r836j2907j181Q843J1139j0630j0473
$$ 24143 35682 30151 12023 10542 17889 32194 22358 9451 8270 17113 28252 17622 7149
238G149l286J1821K015p830j1891k122J2378l157m334j0427M153Q722N05l988
$$ 7149 3863 15684 17699 9869 -2022 -4144 8234 5077 743 -9684 -5531 3191 3696 -292
252b92m656P451L391M571o530J656K624J388K223n566L444k946J165j827J086
$$ -292 -4948 2503 5894 10465 3935 5591 8215 9603 11826 6260 9704 6758 7923 6096 7182
267G182Q32l744o56j300P553l657k612m837M161P959n610n917n477R536N011l463
$$ 7182 8014 4270 3614 2314 9867 6210 3598 -1239 2922 10881 5271 -646 -6123 3413 8424 4961
283D961j2256l79J3103M358l453j5677O502J4212O500r770j1846Q093J5332O708
$$ 4961 -7295 -7674 5429 9787 6334 -9343 -2841 11371 17871 8101 -3745 4348 19680 26388
297B6388j7892p319P219J7834K099k1232p384J0097J9000n642j9311j0157J6140
$$ 26388 8496 1177 8396 26230 28329 7097 -287 9810 28810 23168 3857 -6300 9840
310I840J7172j0590j9363j0331K2286J3281j1978k3108l472K3933J1785j4076
$$ 9840 27012 16422 -2941 -13272 9014 22295 10317 -12791 -16263 7670 19455 5379
322E379k6403N990K2297J2871j9342k4975J1321K4341J0987k5403j9846J3020
$$ 5379 -21024 -15034 7263 20134 792 -24183 -12862 11479 22466 -2937 -22783 -9763
334i763L0857L249k8126j5578J6290L3735n890k9278j3750K2210K9664j1617l2447
$$ -9763 21094 24343 -3783 -19361 -3071 30664 24774 -4504 -18254 3956 33620 22003 -10444
347a0444j1192K9577K1510j3690l5554m049L3914J6342j6459l4134M382L3686
$$ -10444 -21636 7941 29451 15761 -19793 -23842 10072 26414 9955 -24179 -19797 13889
359A3889J6137k3916k9934R998L2624J4713l2644k3931J3128L4591Q079l4426
$$ 13889 30026 6110 -23824 -13826 18798 33511 867 -23064 -9936 24655 32734 -1692
371a692k0682J8842L7013r52l2404k0030K5989L5173q799l4702j8203L1516K8214
$$ -1692 -22374 -3532 33481 32529 125 -19905 6084 41257 32458 -2244 -20447 11069 39283
384C9283j4896m0215j1624L4088K3749j9764m2655q45L5843K3108k6445l9103
$$ 39283 24387 -15828 -27452 6636 30385 10621 -32034 -32879 2964 26072 -373 -39476
396c9476Q532L7856J9554l4022l3244J3288M0999R830l7309k7663J8141M4438
$$ -39476 -30944 6912 26466 -7556 -40800 -27512 13487 23317 -13992 -41655 -23514 20924
408B0924l38l5750k1300K6714M2749n465l6898j5308L4450L3985r199m2092j0327
$$ 20924 20586 -15164 -36464 -9750 32999 27534 -9364 -24672 9778 43763 34564 -7528 -17855
421a7855L7120K4459j6397m4901l994L7012K1535k5807l9516L725L7904K0376
$$ -17855 19265 43724 27327 -17574 -21568 15444 36979 11172 -28344 -24619 13285 33661
433C3661l3856l2349R133L9130J3503l7878l0113J4312M0168K640l7051k8014
$$ 33661 -195 -32544 -23411 15719 29222 -8656 -38769 -24457 15711 18351 -18700 -46714
445d6714K2782M0114l449l5652k0767L2049L6800n964l7730j2117L5622L1069
$$ -46714 -23932 16182 12733 -22919 -43686 -11637 25163 19199 -18531 -30648 4974 36043
457C6043j2575m2052m620L4475K5071k2408m0827K153L5226K1289k9277l3699
$$ 36043 23468 -18584 -23204 11271 36342 13934 -26893 -24740 10486 31775 2498 -31201
469c1201Q637L9022J3878l2195k8195J2973M0801K098l3408k5017J7725L6330
$$ -31201 -22564 16458 30336 -1859 -30054 -17081 23720 25818 -7590 -32607 -14882 21448
481B1448m487l4839j8741K5060L1668n283l5099j0226L2105K6165p161l4422m045
$$ 21448 16961 -17878 -36619 -11559 20109 14826 -20273 -30499 1606 27771 20610 -13812 -17857
494a7857L0814K1825j6289l2641j881K8007J7693k4601k8469J782K9554J4058
$$ -17857 12957 34782 18493 -14148 -16029 11978 29671 5070 -23399 -21617 7937 21995
506B1995k5989k4161P794L1614P164k5032k3626J3521L0317l36k6358k1840J8295
$$ 21995 -3994 -28155 -20361 11253 18417 -6615 -30241 -16720 13597 13261 -13097 -34937 -16642
519a6642K7147l713k8195j3353K3290K4534k832k8553m398K6993K3359r147k6331
$$ -16642 10505 6792 -21403 -34756 -11466 13068 10236 -18317 -22715 4278 27637 18490 -7841
532g841J271K4743J9484j7594k4635J485K4233J2346k1758k1565M178K5914N138
$$ -7841 -6570 18173 37657 20063 -4572 -3087 21146 33492 11734 -9831 -5653 20261 25399
545B5399j9858j8798Q715K4470o99k0194j6204J1821J7839l288k2997j3124J4430
$$ 25399 5541 -13257 -4542 19928 19229 -965 -17169 -5348 12491 9203 -13794 -26918 -12488
558a2488J3796l438k2678o133J7542J4549n670j7655K29J7724J5702j0618j3518
$$ -12488 1308 -2130 -24808 -30941 -13399 1150 -4520 -22175 -21946 -4222 11480 862 -12656
571a2656K139J6558J1340j4113j2205L114J6754M466j1732j1677O881J6497m66
$$ -12656 -10517 6041 17381 3268 -8937 -5823 10931 15397 3665 -8012 -1131 15366 14900
584A4900r183r639R070J2352j357j1992o956Q246O905k275j5019l088O645N260
$$ 14900 5717 -3922 5148 17500 16143 4151 -2805 5441 12346 10071 -4948 -8036 -1391 3869
598C869l474j1531L26O803O256m468n391K33Q063N006n751l016o95P198R76m040
$$ 3869 395 -11136 -10810 -4007 2249 -2219 -7610 -7377 686 5692 -59 -3075 -3770 3428 4404 364
614C64m015N5N170j94j770m439K479L316J731k030k966K589J137K090m371j470
$$ 364 -3651 -3596 1574 1380 -390 -4829 -2350 966 2697 667 -2299 290 1427 3517 -854 -2324
630b324M0K08O60m128k59j419K699j777L04m67N74K995j512L372r6J261l01J234
$$ -2324 -2284 -2076 -1416 -5544 -5803 -7222 -4523 -6300 -5996 -6463 -5889 -2894 -4406 -1034 -1130 131 -170 1064
648A064J301N39k26l677L534K14J523l316l007L745L080N13n949j18L047O297
$$ 1064 2365 2904 2678 -999 2535 2749 4272 956 -2051 1694 4774 5287 -662 -780 2267 8564
664H564l274p836L18M187N723p227p633r11Q851K594q408p075J607J2345L82q189
$$ 8564 5290 -2546 -2228 1959 7682 455 -7178 -8089 762 3356 -5052 -12127 -10520 1825 2207 -5982
680e982p067P070J1842j114r553o594J0172R905k205j3047l733J1835Q550m339
$$ -5982 -13049 -5979 5863 4749 -4804 -11398 -1226 8679 6474 -6573 -10306 1529 10079 5740
694E740j4752N12J2158R129p764j3394K851J2984P918j2952j1061K601J5161L753
$$ 5740 -9012 -8500 3658 12787 5023 -8371 -5520 7464 15382 2430 -8631 -6030 9131 12884
708A2884j5104r995M658J6191J80j4470j0359R725J5749j890j4340r616J4371
$$ 12884 -2220 -12215 -7557 8634 8814 -5656 -16015 -6290 9459 7569 -6771 -16387 -2016
721b016J3490l305j6777n796J5239J2423n815j8475j155J5024J2458r632j8161
$$ -2016 11474 8169 -8608 -14404 835 13258 7443 -11032 -12187 2837 15295 5663 -12498
734a2498K179J6599J0953j3361j5839L343J9210O667j5961j3929M981K0903J342
$$ -12498 -10319 6280 17233 3872 -11967 -8624 10586 17253 1292 -12637 -7656 13247 14589
747A4589j6437j4071R561J9790j139j8185j2180J4398J7665k137k0998q267J7045
$$ 14589 -1848 -15919 -6358 13432 12293 -5892 -18072 -3674 13991 11854 -9144 -17411 -366
760c66J5936m512k2353l982J7707J5728r279k1666q67J9268J4829j4284j9117
$$ -366 15570 11058 -11295 -15277 2430 18158 8879 -12787 -13654 5614 20443 6159 -12958
773a2958J008K1938J0915j7388j7584L822K4203O180j8687j8379R484K2998K236
$$ -12958 -11950 9988 20903 3515 -14069 -10247 13956 20136 1449 -16930 -7446 15552 17788
786A7788k0473j7248J5194K1457j627k3455j2339J8251K0090n521k5760n621J9959
$$ 17788 -2685 -19933 -4739 16718 15091 -8364 -20703 -2452 17638 12117 -13643 -19264 695
799F95J8841j1213k4452n43K1191J6234j5628k1356K347K4004J0850j8685j8795
$$ 695 19536 8323 -16129 -16672 4519 20753 5125 -16231 -13884 10120 20970 2285 -16510
812a6510N757K5320M601j8827j7298R841K3651P69j9671j4766J4214K0067j239
$$ -16510 -10753 14567 19168 341 -16957 -7116 16535 17304 -2367 -17133 -2919 17148 15909
825A5909k1746j0473J6050J6838l217k3080o023J6464J6249o918k1786l216J8027
$$ 15909 -5837 -16310 -260 16578 13361 -9719 -15742 722 16971 10053 -11733 -14949 3078
838C078J5784j1693j8852j204K0450J2740j4383j7826J657K2155P817j5656j7834
$$ 3078 18862 7169 -11683 -12887 7563 20303 5920 -11906 -10249 11906 19723 4067 -13767
851a3767O078K1214L922j7120j7069J1308J9677J588j9802j3221J3170J8224j127
$$ -13767 -7689 13525 17447 327 -16742 -5434 14243 15831 -3971 -17192 -4022 14202 13075
864A3075k2131q012J3969J7044n594k1599m883J6057J5861j0065j8863j699J8783
$$ 13075 -9056 -17068 -3099 13945 8351 -13248 -18131 -2074 13787 3722 -15141 -16840 1943
877A943J2628j1782j5883N73K0966P813j2777j5432N262J9250M461j3933j4714
$$ 1943 14571 2789 -13094 -12521 8445 16258 3481 -11951 -6689 12561 17022 3089 -11625
890a1625R147J6733K139j6180j1115J1350J4838K44j8511p010J2041J3750l779
$$ -11625 -2478 14255 16394 214 -10901 449 15287 15531 -2980 -9990 2051 15801 12022
903A2022j8012m302J1625J2884q821j5292l176J3935J0337j0412j2741m48J5511
$$ 12022 -5990 -10292 1333 14217 5396 -9896 -13072 863 11200 788 -11953 -12401 3110
916C110P014r950j2194L848J4588L703r451j1784P137J2426J540j0824q922Q223
$$ 3110 10124 174 -12020 -8172 6416 10119 668 -11116 -3979 8447 9987 -837 -9759 -1536
930a536J0916N13j2479m452P649J0442j767j2665j536P071R241n118j0105k299
$$ -1536 9380 9893 -2586 -7038 611 11053 9286 -3379 -4915 2156 11397 6279 -3826 -6125
944f125Q386O216o613p746j842R304L964m884p649l99J0014K560m302q034L419
$$ -6125 2261 8477 1864 -5882 -7724 1580 5544 660 -6989 -7388 2626 5186 884 -7150 -3731
959c731P725K965n829o346M293O330K877p487l859M038O647P58p499j713L713
$$ -3731 3994 6959 1130 -5216 -923 5407 8284 797 -3062 976 7623 8381 882 -831 2882
974B882O888k286n675k131M790M516m004m417k399N667J532l695m437k20M413
$$ 2882 9770 7484 1809 -322 4468 8984 4980 563 -1836 3831 5363 1668 -2769 -2989 1424
989A424J42k420m283K491K572K25k276k369K867J268Q32l013O43J386J170P8k190
$$ 1424 1566 -854 -5137 -2646 -74 151 -2125 -4494 -1627 -359 473 -2540 -1897 -511 659 737 -1453
1006a453K424j78O12k01O57Q72M55N14j340J614J041o09k129M77K261o09j469
$$ -1453 971 793 1405 1204 1861 2733 3188 3702 2362 3976 5017 4408 2279 2756 5017 4408 2939
1023B939k789R37J236J67k774k235K443J186J48m998L91J735L191k222l536K66
$$ 2939 150 1087 2323 2490 -284 -2519 -76 1110 1258 -3740 -3349 -1614 1577 -645 -4181 -3915
1039c915K503L730l201l163k36N302K029l223l377M66O675J006l340m559K285
$$ -3915 -1412 2318 -883 -4046 -4282 1020 3049 -174 -3551 -3085 3590 4596 1256 -3303 -1018
1054a018O338P98m917n025M548N136Q11p555m226N215N628r85q610k365N520O797
$$ -1018 5320 6118 1201 -3824 724 5860 6671 -884 -5110 105 5733 4748 -3862 -6227 -707 6090
1070F090l977q432r13O281P414o733p587J39Q589M654o832p439J297J0804J835
$$ 6090 2113 -6319 -7232 -951 6463 -270 -7857 -7718 871 5525 -1307 -8746 -7449 3355 5190
1085E190o659q216M144J0478Q30q178o977O359R105N98j0726n032P672Q313n54
$$ 5190 -1469 -9685 -5541 4937 5767 -2411 -9388 -3029 6076 6674 -4052 -9084 -1412 6901 6347
1100F347j1830l477P668R289l752j1609k140Q690R092o670j0563j294J0961P288
$$ 6347 -5483 -8960 -1292 7997 4245 -7364 -9504 -814 8278 1608 -8955 -10249 712 8000
1114H000q175j0326K15J3513M130q759j0626L685J3653K628j0300j0163P367J2135
$$ 8000 -175 -10501 -10286 3227 7357 -1402 -12028 -8343 5310 7938 -2362 -12525 -5158 6977
1128F977J500j2782p985R500J1561l32j4551m835R872J2161m314j4352k790J0749
$$ 6977 8477 -4305 -12290 -2790 8771 8439 -6112 -10947 -1075 11086 6772 -7580 -10370 379
1142C79J1066p592j2903j849J2662Q877r043j2744J60J4591N419r489j3051L372
$$ 379 11445 3853 -9050 -10899 1763 10640 1597 -11147 -10987 3604 9023 -466 -13517 -10145
1156a0145J5268K858j0608j2010O462J3802K350j3563r527Q890J2923N53j5233
$$ -10145 5123 7981 -2627 -14637 -8175 5627 7977 -5586 -15113 -6223 6700 7253 -7980
1169g980o277R966J3502k771j5194m406J1690J2634o444j4025l112J3806J0587
$$ -7980 -14257 -4291 9211 6440 -8754 -13160 -1470 11164 4720 -9305 -12417 1389 11976
1182A1976r028j3506q54J5635P083r881j4001L264J5575M340j1079j3003O319
$$ 11976 2948 -10558 -11412 4223 11306 1425 -12576 -9312 6263 10603 -476 -13479 -7160
1195g160J4381K745j2911j0858Q752J3446K62j5031p188R470J3619k740j5214
$$ -7160 7221 9966 -2945 -13803 -5051 8395 8657 -6374 -13562 -4092 9527 6787 -8427
1208h427m337J0300J2751o084j3573k613J2531R892p650j2913q91J4051O396q004
$$ -8427 -12764 -2464 10287 4203 -9370 -11983 548 10440 2790 -10123 -11014 3037 9433 1429
1222A429j2697J527J4012M519r228j2364M620J2830M088j1370j0413O279J2223
$$ 1429 -11268 -9741 4271 8790 -438 -12802 -8182 4648 8736 -2634 -13047 -6768 5455
1235E455K487j3565p547O999J2630p45j3357n497Q456J2116l599j2840m599J1184
$$ 5455 7942 -5623 -13170 -6171 6459 5714 -7643 -13140 -4684 7432 3833 -9007 -13606 -2422
1249b422J0486o051j1608k481J2290P972o763j2272O10J2803N649q134j1765L838
$$ -2422 8064 2013 -9595 -12076 214 8186 1423 -10849 -10239 2564 8213 79 -11686 -7848
1263g848J2062M172j0137r668N643J1412K310j1868o741O119J1099o72j1391m959
$$ -7848 4214 8386 -1751 -11419 -5776 5636 7946 -3922 -10663 -4544 6555 5883 -5508 -10467
1277a0467P055J0265l110j0709l747Q586Q678m792r685k521R620O466n533r589
$$ -10467 -3412 6853 3743 -6966 -10713 -2127 6551 1759 -7926 -10447 -827 5639 106 -9483
1291i483RR628M387n814r320K389R074L386o987p752L692Q090K751q672n136M022
$$ -9483 -9474 154 4541 -1273 -10593 -8204 870 4256 -2731 -10483 -6791 1299 4050 -4622 -9758 -5736
1307e736P910K17q160l644M427P913j900p008l111N733O631l257o067k171O927
$$ -5736 2174 2391 -5769 -9413 -4986 2927 1027 -5981 -9092 -3359 3272 15 -6052 -8223 -1296
1322a296M163l148o401n01O571K726l171o274J636N065K786l629n258K175M535
$$ -1296 2867 -281 -6682 -7183 -612 2114 -1057 -7331 -5695 -630 2156 -1473 -6731 -4556 -21
1337b1K251m507l498J443M795J276m828k325R53N054n85l960k383K248M134r93
$$ -21 2230 -2277 -5775 -4332 463 1739 -3089 -5414 -4461 593 8 -3952 -6335 -4087 47 -946
1353i46l129k410L838K735j202l142j637L707J940q96m309N73K554J895j874k979
$$ -946 -4075 -6485 -2647 88 -1114 -4256 -5893 -2186 -246 -1142 -5451 -4878 -2324 -429 -2303 -5282
1369e282J247J913K018k533j223Q73K180P23k476l48M06K043j086j477k27R21
$$ -5282 -4035 -2122 -104 -2637 -3860 -2987 -807 -84 -2560 -2908 -2502 -459 -1545 -3022 -3249 -2328
1385b328P61j614k4k66J518q27k27N49K40O94j415l2O88J247j433j271N92J320
$$ -2328 -1567 -3181 -3205 -3471 -1953 -2780 -3007 -2458 -2218 -1524 -2939 -2971 -2283 -1036 -2469 -3740 -3148 -1828
1403a828J135k853l74J029K300n51k047k48J974K725j923k011q85L250K044k908
$$ -1828 -693 -3546 -3920 -2891 -591 -1142 -3189 -3437 -1463 1262 -661 -2672 -3557 -307 1737 -1171
1419a171k838J39L488N52k350l509J584L575M86k784l400L157L547L60m147j903
$$ -1171 -4009 -3870 -382 170 -2180 -5689 -4105 -530 -44 -2828 -6228 -3071 476 836 -3311 -5214
1435e214L071L159j03n273q44L002L774j305n041m13M255M049k954l743q45N485
$$ -5214 -2143 1016 913 -4360 -5204 -2202 1572 267 -4774 -5187 -932 3117 163 -3580 -4425 1060
1451A060L447l459m613l6N708J671l953n363J068N639J146m520n722K947N625
$$ 1060 4507 1048 -3565 -3601 2107 3778 -175 -5538 -4470 1169 2315 -2205 -7927 -4980 645
1466F45J304o068m169L830N541R80p473k876M189O141j443p046k556M912O800
$$ 645 1949 -4119 -8288 -4458 1083 2063 -5410 -8286 -4097 2044 601 -6445 -9001 -4089 2711
1481B711l039o385j935P377N827l879n683p53Q383M053m399p528J343P654K700
$$ 2711 -328 -6713 -8648 -1271 4556 677 -5006 -5759 2624 6677 2278 -5250 -3907 3747 6447
1496F447n358q095L001P367L056p643o541L576Q754Q43r304m341M813Q625j095
$$ 6447 1089 -7006 -4005 3362 6418 -1225 -7766 -4190 4564 5407 -3897 -8238 -3425 5200 4105
1511D105r736m065O134Q253l766r181l544Q217P425m741q903r79R739N811m972
$$ 4105 -5631 -9696 -3562 4691 925 -8256 -11800 -3583 3842 -899 -9802 -10781 -1042 4769 -203
1526b03q759J070J0340M059o338r183L303R571L040r191p484M803R663J114j0306
$$ -203 -8962 -7892 2448 6507 169 -9014 -5711 3860 6900 -2291 -9775 -4972 4691 5805 -4501
1541d501n008N986R713j157r704l903O901Q482l512r318l671Q080P170n197r140
$$ -4501 -9509 -3523 6190 5033 -4671 -8574 -1673 6809 3297 -6021 -9692 -1612 5558 361 -8779
1556h779k157R370N743m886r515Q26R816M399n274r104K686R055M120p657p734
$$ -8779 -10936 -1566 4177 -709 -10224 -9398 418 4817 -457 -9561 -6875 2180 6300 -1357 -9091
1571i091K967R466K809r563n861L834R897J115r968n196O220R670j409r233m746
$$ -9091 -6124 3342 6151 -3412 -9273 -5439 4458 5573 -4395 -9591 -3371 6299 4890 -4343 -9089
1586i089P910Q418l831r617l605R185O265m725j0572m98R494N933n749j0002K361
$$ -9089 -1179 7239 3408 -6209 -9814 -629 5636 911 -9661 -10159 -665 5268 -481 -10483 -8122
1601h122R689M553p381q327L473R328K536q667o647L885R583N75q982n226N200
$$ -8122 1567 6120 -1261 -9588 -6115 3213 5749 -2918 -9565 -5680 3903 4478 -4504 -9730 -4530
1616d530Q837o84q710m137O774Q369k823q712k913P852O167l692r304j259Q379
$$ -4530 4307 3623 -5087 -9224 -2450 5919 3096 -5616 -8529 -677 5490 1798 -7506 -8765 -386
1631c86M828m742q875J087Q300M016n717p485K853Q138L534p229n906L401P940
$$ -386 4442 -300 -9175 -8088 212 4228 -1489 -8974 -6121 2017 5551 -1678 -7584 -4183 3757
1646C757J646q149m321L863Q123p45o982m035N498P222j828o976l016O720N469
$$ 3757 5403 -2746 -7067 -3204 4919 4174 -2808 -6843 -1345 5877 4049 -2927 -5943 777 6246
1661F246k674p221j271O296L866l648p408J06N710L581m682o502J556O002K602
$$ 6246 3572 -3649 -4920 1376 5242 1594 -5814 -5708 2 3583 -1099 -7601 -6045 -43 2559
1676B559n414m455J628O554J125n153l603J988O387N6m816l601L693N580n35m662
$$ 2559 -2855 -7310 -5682 872 1997 -3156 -6759 -4771 1616 1672 -3144 -6745 -3052 2528 1993 -2669
1692b669k894N203M358p45n095j442M971L491j235n419n96M314L327l287m864
$$ -2669 -5563 -360 3998 3253 -1842 -3284 1687 5178 3943 -1476 -2072 2242 5569 2282 -2582
1707b582O42L945K504m016l715Q24M192J145m066k601J220M339n28l339k317K216
$$ -2582 -1940 2005 4509 493 -3222 -2398 1794 2939 -1127 -3728 -2508 1831 1303 -2036 -4353 -2137
1723b137L740j373l010j279K638K519j081k412p43L117J765q55k704N58K244J362
$$ -2137 1603 230 -2780 -4059 -1421 1098 17 -2395 -3138 -21 1744 889 -1815 -1257 987 2349
1739B349q83k412Q93J328J345j804j060O6J406M70j285o24l32J489k34o10j176
$$ 2349 1466 -946 -53 1275 2620 816 -244 -178 1228 1698 413 -211 -543 946 712 102 -1074
1756a074J38J482n31k78p50P53J02L86m95j38O72k15L14n32L27O4Q1n3j26K27
$$ -1074 -936 546 15 -263 -1013 -260 -158 228 -267 -405 267 52 366 -166 161 225 306 253 127 354
1776C54j09R8m95O67K63l38m40l68J425p39m59q96P05J128p74j316j031J918Q04
$$ 354 245 343 -152 515 778 440 0 -368 1057 318 -141 -1037 -332 796 22 -1294 -2325 -407 397
1795C97o68j999L47K050R93o02k394Q93K374J413k474j841J625K142R32l022j326
$$ 397 -271 -2270 -1923 127 1120 518 -1876 -983 1391 2804 330 -1511 114 2256 3188 166 -1160
$$ [...]
8191b83
##END NTUPLES=NMR FID
##END=
