##TITLE=1H_SA_64.243
 CDCl3, 8 sc, 
 29.06.2021
##JCAMPDX= 6.0         $$ Bruker NMR JCAMP-DX V2.0
##DATA TYPE= NMR FID
##DATA CLASS= NTUPLES
##ORIGIN= UXNMR, Bruker Analytische Messtechnik GmbH
##OWNER= root
$$ XWIN-NMR		Version 3.5
$$ Tue Jun 29 09:04:13 2021 Russian Standard Time (UT+4h)  she@DPX200
##.OBSERVE FREQUENCY= 200.131506
##.OBSERVE NUCLEUS= ^1H
##.DELAY= (6, 6)
##.ACQUISITION MODE= SIMULTANEOUS
##.ACQUISITION SCHEME= undefined
##.AVERAGES= 8
##.DIGITISER RES= 18
##SPECTROMETER/DATA SYSTEM= spect
##.PULSE SEQUENCE= zg30
##.SOLVENT NAME= CDCl3
##.SHIFT REFERENCE= (INTERNAL, CDCl3, 0, 15.7039)
##AUDIT TRAIL= $$ (NUMBER, WHEN, WHO, WHERE, WHAT)
$$ ##TITLE= Audit trail, XWIN-NMR		Version 3.5
$$ ##JCAMPDX= 5.01
$$ ##ORIGIN= Bruker BioSpin GmbH
$$ ##OWNER= she
$$ F:/spectra/data/she/nmr/H-F/1/audita.txt
$$ ##AUDIT TRAIL=  $$ (NUMBER, WHEN, WHO, WHERE, WHAT)
(   1,<2021-06-29 09:02:55.70 +0400>,<she>,<DPX200>,
      <created by zg, POWCHK disabled, PULCHK disabled
       configuration hash MD5:
       00 E9 B6 7A A2 85 ED C7 34 08 36 98 17 FE 4E 26
       data hash MD5: 16K
       73 78 DD E1 B7 EB 34 C6 70 4F 54 93 20 EC AD D6>)
$$ ##END=
$$ 
$$ hash MD5
$$ 6D 58 83 2B 89 0F B9 26 C0 0E C8 65 94 24 64 24
##$RELAX= 
##$RELAX= 
##$RELAX= 
##$RELAX= 
##$RELAX= 
##$RELAX= 
$$ Bruker specific parameters
$$ --------------------------
##$DU= <F:/spectra>
##$EXPNO= 1
##$NAME= <H-F>
##$PROCNO= 1
##$TYPE= <nmr>
##$USER= <she>
##$AMP= (0..31)
100 100 100 100 100 100 100 100 100 100 100 100 100 100 100 100 100 100 
100 100 100 100 100 100 100 100 100 100 100 100 100 100 
##$AQSEQ= 0
##$AQ_mod= 1
##$AUNM= <au_zg>
##$AUTOPOS= <>
##$BF1= 200.13
##$BF2= 200.13
##$BF3= 200.13
##$BF4= 200.13
##$BF5= 200.13
##$BF6= 200.13
##$BF7= 200.13
##$BF8= 200.13
##$BYTORDA= 1
##$CFDGTYP= 0
##$CFRGTYP= 5
##$CHEMSTR= <none>
##$CNST= (0..31)
1 1 145 1 1 1 1 1 1 1 1 1 1 1 1 1 1 1 1 1 1 1 1 1 1 1 1 1 1 1 1 1 
##$CPDPRG= <>
##$CPDPRG1= <>
##$CPDPRG2= <>
##$CPDPRG3= <>
##$CPDPRG4= <mlev>
##$CPDPRG5= <mlev>
##$CPDPRG6= <mlev>
##$CPDPRG7= <mlev>
##$CPDPRG8= <mlev>
##$CPDPRGB= <>
##$CPDPRGT= <>
##$D= (0..31)
0 1.2 0 0 0 0 0 0 0 0.06 0 0.03 0 0 0 0 0.0002 0 0 0 0 0 0 0 0 0 0 0 0 
0 0 0 
##$DATE= 1624942975
##$DBL= (0..7)
120 120 120 120 120 120 120 120 
##$DBP= (0..7)
150 150 150 150 150 150 150 150 
##$DBP07= 0
##$DBPNAM0= <>
##$DBPNAM1= <>
##$DBPNAM2= <>
##$DBPNAM3= <>
##$DBPNAM4= <>
##$DBPNAM5= <>
##$DBPNAM6= <>
##$DBPNAM7= <>
##$DBPOAL= (0..7)
0.5 0.5 0.5 0.5 0.5 0.5 0.5 0.5 
##$DBPOFFS= (0..7)
0 0 0 0 0 0 0 0 
##$DE= 6
##$DECBNUC= <off>
##$DECIM= 32
##$DECNUC= <off>
##$DECSTAT= 4
##$DIGMOD= 1
##$DIGTYP= 9
##$DL= (0..7)
0 120 120 120 120 120 120 120 
##$DP= (0..7)
150 150 150 150 150 150 150 150 
##$DP07= 0
##$DPNAME0= <>
##$DPNAME1= <>
##$DPNAME2= <>
##$DPNAME3= <>
##$DPNAME4= <>
##$DPNAME5= <>
##$DPNAME6= <>
##$DPNAME7= <>
##$DPOAL= (0..7)
0.5 0.5 0.5 0.5 0.5 0.5 0.5 0.5 
##$DPOFFS= (0..7)
0 0 0 0 0 0 0 0 
##$DQDMODE= 0
##$DR= 18
##$DS= 0
##$DSLIST= <SSSSSSSSSSSSSSS>
$$ [...]
##$SUBNAM2= <"">
##$SUBNAM3= <"">
##$SUBNAM4= <"">
##$SUBNAM5= <"">
##$SUBNAM6= <"">
##$SUBNAM7= <"">
##$SUBNAM8= <"">
##$SUBNAM9= <"">
##$SW= 20.0188882624521
##$SWIBOX= (0..15)
0 0 2 0 0 0 0 0 0 0 0 0 0 0 0 0 
##$SW_h= 4006.41025641026
##$TD= 16384
##$TD0= 1
##$TE= 0
##$TE2= 300
##$TE3= 300
##$TEG= 300
##$TL= (0..7)
0 120 120 120 120 120 120 120 
##$TP= (0..7)
150 150 150 150 150 150 150 150 
##$TP07= 0
##$TPNAME0= <>
##$TPNAME1= <>
##$TPNAME2= <>
##$TPNAME3= <>
##$TPNAME4= <>
##$TPNAME5= <>
##$TPNAME6= <>
##$TPNAME7= <>
##$TPOAL= (0..7)
0.5 0.5 0.5 0.5 0.5 0.5 0.5 0.5 
##$TPOFFS= (0..7)
0 0 0 0 0 0 0 0 
##$TUNHIN= 0
##$TUNHOUT= 0
##$TUNXOUT= 0
##$USERA1= <user>
##$USERA2= <user>
##$USERA3= <user>
##$USERA4= <user>
##$USERA5= <user>
##$V9= 5
##$VALIST= <valist>
##$VCLIST= <CCCCCCCCCCCCCCC>
##$VD= 0
##$VDLIST= <DDDDDDDDDDDDDDD>
##$VPLIST= <PPPPPPPPPPPPPPP>
##$VTLIST= <TTTTTTTTTTTTTTT>
##$WBST= 1024
##$WBSW= 4
##$XGAIN= (0..3)
0 0 0 0 
##$XL= 0
##$YL= 0
##$YMAX_a= 615107
##$YMIN_a= -801019
##$ZGOPTNS= <>
##$ZL1= 120
##$ZL2= 120
##$ZL3= 120
##$ZL4= 120
##$ABSF1= 10
##$ABSF2= 0
##$ABSG= 5
##$ABSL= 3
##$ALPHA= 0
##$AQORDER= 0
##$ASSFAC= 0
##$ASSFACI= 0
##$ASSFACX= 0
##$ASSWID= 0
##$AUNMP= <proc_1d>
##$AZFE= 0.1
##$AZFW= 0.1
##$BCFW= 1
##$BC_mod= 2
##$BYTORDP= 1
##$COROFFS= 0
##$CY= 11.3945322036743
##$DATMOD= 1
##$DC= 2
##$DFILT= <>
##$DTYPP= 0
##$F1P= 15.9154993809931
##$F2P= -4.1035820241983
##$FCOR= 0.5
##$FTSIZE= 0
##$FT_mod= 4
##$GAMMA= 1
##$GB= 0.15
##$INTBC= 1
##$INTSCL= 1
##$ISEN= 128
##$LB= 0.24
##$LEV0= 0
##$LPBIN= 0
##$MAXI= 10000
##$MC2= 0
##$MEAN= 0
##$ME_mod= 0
##$MI= 1.114404
##$NCOEF= 0
##$NC_proc= 0
##$NLEV= 6
##$NOISF1= 3.799351
##$NOISF2= 2.8
##$NSP= 1
##$NTH_PI= 0
##$NZP= 0
##$OFFSET= 15.70392
##$PC= 1
##$PHC0= -11568.38
##$PHC1= 9.001011
##$PH_mod= 1
##$PKNL= yes
##$PPARMOD= 0
##$PSCAL= 0
##$PSIGN= 0
##$REVERSE= no
##$SF= 200.130013532006
##$SI= 16384
##$SIGF1= 3
##$SIGF2= 2
##$SINO= 400
##$SIOLD= 16384
##$SREGLST= <1H.CDCl3>
##$SSB= 0
##$STSI= 0
##$STSR= 0
##$SW_p= 3612.71676300578
##$SYMM= 0
##$S_DEV= 0
##$TDeff= 0
##$TDoff= 0
##$TI= <>
##$TILT= no
##$TM1= 0
##$TM2= 0
##$TOPLEV= 0
##$USERP1= <user>
##$USERP2= <user>
##$USERP3= <user>
##$USERP4= <user>
##$USERP5= <user>
##$WDW= 1
##$XDIM= 8192
##$YMAX_p= 0
##$YMIN_p= 0
$$ End of Bruker specific parameters
$$ ---------------------------------
##NTUPLES= NMR FID
##VAR_NAME=  TIME,          FID/REAL,        FID/IMAG
##SYMBOL=    X,             R,               I
##VAR_TYPE=  INDEPENDENT,   DEPENDENT,       DEPENDENT
##VAR_FORM=  AFFN,          ASDF,            ASDF
##VAR_DIM=   8192,          8192,            8192
##UNITS=     SECONDS,       ARBITRARY UNITS, ARBITRARY UNITS
##FACTOR=    0.0002496,     1,               1
##FIRST=     0,             0,               0
##LAST=      2.0444736,     0,               0
##MIN=       0,             -801019,         0
##MAX=       2.0444736,     615107,          0
$$ Real data points
##PAGE= N=1
##DATA TABLE= (X++(R..R)), XYDATA
$$ plain form
0 0 0 0 0 0 0 0 0 0 -8 0 -8 8 -16 16 -24 24 -33 40 -48 64 -73 88 -104 122 -145 169 -198 227 -265 303 -347 394
32 394 -450 510 -576 648 -729 817 -913 1017 -1134 1260 -1398 1548 -1713 1893 -2090 2305
48 2305 -2538 2798 -3083 3393 -3742 4128 -4561 5047 -5603 6235 -6974 7840 -8879 10148
62 10148 -11746 13817 -16634 20701 -27134 38882 -67520 294228 202356 -130933 405759
73 405759 615107 521636 342203 241321 58883 149309 460636 522986 53702 -229278 93683
84 93683 457145 237936 -21528 112415 223549 97993 185524 384504 281985 61753
94 61753 186130 394408 262387 91776 270345 382581 118237 -74270 160748 388506
104 388506 201454 -50378 18526 131463 125702 242201 336988 66392 -167014 174650 606880
$$ packed form
0@%%%%%%%%qQqJ6k4L2m0M8n7P3q8J12j37J61j92K26k67L14l67M25m92N68o50P41
32C94q44R60j086J224j377J546j730J930k151K394k658K946l261L606l983M395
48B305m843N336n881O476p135P870q689R608j0650J1838j3209J4814j6719J9027
62A0148k1894K5563l0451L7335m7835O6016j06402L61748r1872l33289N36692
73D05759K09348r3471j79433j00882j82438R0426L11327O2350m69284k82980L22961
84I3683L63462k19209k59464J33943J11134j25556Q7531J98980j02519k20232
94F1753J24377K08278j32021j70611J78569J12236k64344j92507K35018K27758
104C88506j87052k51832O8904J12937n761J16499R4787k70596k33406L41664M32230
$$ plain form
115 606880 429191 5435 -4664 287452 448419 404083 298794 142783 10895 205673
125 205673 574692 470017 -24730 -102378 302595 474994 262574 127131 145508 118278
135 118278 170164 354039 344340 68454 -37603 212593 361732 154435 20451 172716
145 172716 225353 65307 62014 244381 236476 71052 100323 214192 146172 122058 295523
156 295523 305653 40234 -36268 252338 427409 207423 -32626 25933 179472 221723 243121
167 243121 203921 -20852 -111569 221771 494529 241099 -97521 2490 299551 374460
177 374460 272423 178977 89831 63711 242667 427677 257897 -76050 -48300 252747 284021
188 284021 56140 -6949 72888 46713 34720 153185 164636 4635 -13398 166704 208336
$$ packed form
115F06880j77689m23756j0099K92116J60967m4336j05289j56011j31888J94778
125B05673L69019j04675m94747p7648M04973J72399k12420j35443J8377k7230
135A18278N1886J83875r699k75886j06057K50196J49139k07297j33984J52265
145A72716N2637j60046l293J82367p905j65424K9271J13869o8020k4114J73465
156B95523J0130k65419p6502K88606J75071k19986k40049N8559J53539M2251K1398
167B43121l9200k24773r0717L33340K72758k53430l38620J00011K97061P4909
177C74460j02037r3446q9146k6120J78956J85010j69780l33947K7750L01047L1274
188B84021k27881o3089P9837k6175j1993J18465J1451j60001j8033J80102M1632
$$ plain form
199 208336 68903 78399 233403 203230 24286 53487 250860 246058 62600 23600 93905
210 93905 76876 96991 203246 120703 -121588 -91772 221142 314620 59357 -113978 16531
221 16531 196893 230547 195892 119230 -23280 -11747 261894 386430 100919 -148952 9841
232 9841 250156 212008 61186 15474 -1251 -3437 117812 215824 72858 -116316 -20486
243 -20486 200332 165020 -9087 20007 133313 75534 6586 105105 159992 42405 -3163
254 -3163 96422 93278 1346 63345 172990 64778 -107976 -14031 209473 179159 -29545
265 -29545 -66043 45859 90425 110089 147559 38741 -141804 -43668 243167 237551 -56507
276 -56507 -167750 18113 170069 129995 48576 -10220 -78778 -21518 182428 215618 -33890
$$ packed form
199B08336j39433R496J55004l0173j78944K9201J97373m802j83458l9000P0305
210I3905j7029K0115J06255q2543k42291K9816L12914R3478k55263j73335J30509
221A6531J80362L3654l4655p6662j42510J1533K73641J24536k85511k49871J58793
232I841K40315l8148j50822m5712j6725k186J21249R8012j42966j89174R5830
243b0486K20818l5312j74107K9094J13306n7779o8948R8519N4887j17587m5568
254c163R9585l144r1932O1999J09645j08212j72754R3945K23504l0314k08704
265b9545l6498J11902M4566J9664L7470j08818j80545R8136K86835n616k94058
276e6507j11243J85863J51956m0074q1419n8796o8558N7260K03946L3190k49508
$$ plain form
287 -33890 -173711 24342 206363 100114 -33448 -3012 23124 -986 56682 119878 23944
298 23944 -91331 -4809 122547 49513 -55361 23854 107494 4611 -78427 45934 141321
309 141321 34489 -44962 14911 35433 9770 77161 124413 -20769 -147603 7185 208982
320 208982 118795 -103866 -117464 34149 98797 73999 49481 -46610 -142817 -9876 207308
331 207308 135857 -133487 -168544 52566 156311 54949 -25560 -36716 -48063 5151 126099
342 126099 115717 -70559 -133849 46897 147755 15460 -73743 3079 34497 -34062 -18385
353 -18385 58829 10475 -75106 -24686 40595 -16534 -52313 38938 71006 -64187 -115942 45550
365 45550 140040 14912 -93551 -39818 24394 29476 64466 53383 -93852 -151430 35103
$$ packed form
287c3890j39821J98053J82021j06249j33562L0436K6136k4110N7668O3196r5934
298B3944j15275Q6522J27356p3034j04874P9215Q3640j02883q3038J24361R5387
309A41321j06832p9451N9873K0522k5663O7391M7252j45182j26834J54788K01797
320B08982r0187k22661j3598J51613O4648k4798k4518r6091r6207J32941K17184
331B07308p1451k69344l5057K21110J03745j01362q0509j1156j1347N3214J20948
342A26099j0382j86276o3290J80746J00858j32295q9203P6822L1418o8559J5677
353a8385P7214m8354q5581N0420O5281n7129l5779R1251L2068j35193n1755J61492
365D5550R4490j25128j08463N3733O4212N082L4990j1083j47235n7578J86533
$$ plain form
376 35103 180901 36020 -169474 -127811 46604 88026 24918 -23716 -82456 -105134 23369
387 23369 161107 55142 -157608 -123512 82494 115829 -12251 -62575 -30249 -29354 -14011
398 -14011 54976 39069 -84547 -100854 27985 63562 -46172 -74146 21950 21824 -78817 -57192
410 -57192 48798 29087 -61431 -53964 -8606 -28295 -22157 49845 21391 -115685 -111592 68650
422 68650 133758 -19971 -129154 -45798 52241 56698 48732 6698 -101218 -100170 77689 156856
434 156856 -24420 -186391 -90640 67716 55786 -38510 -76333 -88457 -80783 12216 88824
445 88824 -15608 -155826 -78584 86812 65945 -56483 -53489 10020 -13809 -38277 13319
456 13319 13752 -72510 -87838 -14036 -16089 -92333 -72996 7431 -39044 -141109 -82329 52361
$$ packed form
376C5103J45798j44881k05494M1663J74415M1422o3108m8634n8740k2678J28503
387B3369J37738j05965k12750L4096K06006L3335j28080n0324L2326Q95J5343
398a4011O8987j5907j23616j6307J28839L5577j09734k7974R6096j26j00641K1625
410e7192J05990j9711r0518P467M5358j9689O138P2002k8454j37076M093J80242
422F8650O5108j53729j09183Q3356R8039M457p966m2034j07916J048J77859P9167
434A56856j81276j61971R5751J58356j1930r4296l7823j2124P674R2999P6608
445H8824j04432j40218P7242J65396k0867j22428K994O3509k3829k4468N1596
456A3319M33q6262j5328P3802k053p6244J9337Q0427m6475j02065N8780J34690
$$ plain form
468 52361 34795 -72227 -71713 -3749 16502 39371 76200 9283 -101443 -44855 123729 123094
480 123094 -61269 -146416 -39220 51758 22501 -28698 -74698 -130868 -90708 56042 80957
491 80957 -88801 -176913 -37954 90611 38526 -49489 -47242 -27267 -24734 21300 54665 -30965
503 -30965 -121630 -54556 43422 -13242 -107412 -67429 -6855 -63061 -103402 -28900 10991 -50833
515 -50833 -75601 -23471 -10323 -35265 9059 55258 -24364 -106177 -14558 113515 58100 -82125
527 -82125 -84462 5851 33033 25512 19019 -53884 -121158 -30471 112679 66035 -112455 -139803
539 -139803 1530 72808 10883 -50055 -69223 -83386 -44663 49723 34770 -113999 -152899
550 -152899 -15422 57204 -29255 -92450 -48556 -21663 -43416 -16889 20200 -28053 -78849 -27638
$$ packed form
468E2361j7566j07022N14O7964K0251K2869L6829o6917j10726N6588J68584o35
480A23094j84363q5147J07196R0978k9257n1199m6000n6170M0160J46750K4915
491H0957j69758q8112J38959J28565n2085q8015K247J9975K533M6034L3365q5630
503c0965r0665O7074R7978n6664r4170L9983O0574n6206m0341P4502L9891o1824
515e0833k4768N2130J3148k4942M4324M6199p9622q1813R1619J28073n5415j40225
527h2125k337R0313K7182p521o493p2903o7274R0687J43150m6644j78490k7348
539a39803J41333P1278o1925o0938j9168j4163L8723R4386j4953j48769l8900
550a52899J37477P2626q6459o3195M3894K6893k1753K6527L7089m8253n0796N1211
$$ plain form
562 -27638 27266 -23432 -70778 -9401 19423 -69613 -101998 -5006 41012 -36055 -85654 -41520
574 -41520 -9548 -6141 33473 38353 -48316 -80274 40781 142546 53317 -83104 -56021 50310
586 50310 66417 23394 -14063 -71246 -100158 -13703 76876 -8659 -157236 -131607 7247 41235
598 41235 -36085 -76352 -52232 -37430 -9493 49447 31337 -64316 -68303 37654 64670 -27494
610 -27494 -60591 -453 -1231 -59426 -46454 1711 -23367 -73668 -51519 -12941 -36443 -38525 23868
623 23868 22976 -61677 -58386 63082 105655 3409 -57295 605 46421 42911 43703 11225 -70343
636 -70343 -74515 42679 94628 -29205 -138558 -72610 36859 33127 -27321 -50120 -61490 -56659
648 -56659 21467 77575 -10924 -111664 -51661 63192 49104 -39175 -49787 -11852 -15803 -17012
$$ packed form
562b7638N4904n0698m7346O1377K8824q9036l2385R6992M6018p7067m9599M4134
574d1520L1972L407L9614M880q6669l1958J21055J01765q9229j36421K7083J06331
586E0310J6107m3023l7457n7183k8912Q6455R0579q5535j48577K5629J38854L3988
598D1235p7320m0267K4120J4802K7937N8940j8110r5653l987J05957K7016r2164
610b7494l3097O0138p78n8195J2972M8165k5078n0301K2149L8578k3502k082O2393
623B3868q92q4653L291J21468M2573j02246o0704N7900M5816l510P92l2478q1568
636g0343m172J17194N1949j23833j09353O5948J09469l732o0448k2799j1370M831
648e6659P8126N6108q8499j00740O0003J14853j4088q8279j0612L7935l951j209
$$ plain form
660 -17012 15473 3922 -56908 -52402 20974 24035 -40972 -29791 32483 9323 -51191 -16686
672 -16686 54451 32095 -31947 -25245 8859 5906 14586 40970 2132 -70991 -37787 78556
684 78556 83979 -35857 -81577 -1351 57054 41525 17442 -13720 -59025 -30511 72060 80514
696 80514 -45497 -112120 -23862 63655 26473 -42862 -48340 -35063 -26215 20061 46793 -20976
708 -20976 -80375 -13010 70585 33244 -33601 -8770 32578 7847 -11876 22845 30619 -17236
720 -17236 -28686 11057 7679 -29217 -5493 32054 -16578 -71903 -12159 69775 33321 -45954
732 -45954 -35142 19596 34656 37269 38711 -9606 -57270 766 97215 64049 -60278 -80881
744 -80881 13557 58922 16560 -20445 -35752 -51092 -14307 62287 47511 -57818 -79120 21163
$$ packed form
660a7012L2485j1551o0830M506P3376L061o5007J1181O2274k3160o0514L4505
672a6686P1137k2356o4042O702L4104k953Q680K6384l8838p3123L3204J16343
684G8556N423j19836m5720Q0226N8405j5529k4083l1162m5305K8514J02571Q454
696H0514j26011o6623Q8258Q7517l7182o9335n478J3277Q848M6276K6732o7769
708b0976n9399O7365Q3595l7341o6845K4831M1348k4731j9723L4721P774m7855
720a7236j1450L9743l378l6896K3724L7547m8632n5325N9744Q1934l6454p9275
732d5954J0812N4738J5060K613J442m8317m7664N8036R6449l3166j24327k0603
744h0881R4438M5365m2362l7005j5307j5340L6785P6594j4776j05329k1302J00283
$$ plain form
756 21163 77904 20442 -29788 -6820 13046 6750 27454 43253 -4504 -42073 7721 52072
768 52072 5680 -34632 7466 32123 -16120 -33253 21116 42901 -4744 -26978 3999 14392
780 14392 5509 28392 35233 -23398 -53878 22689 88045 23596 -62168 -38220 29483 41495
792 41495 22129 3807 -33394 -48513 20311 86916 29184 -72358 -55615 43473 67108 7006
804 7006 -25045 -16619 -14067 11039 53798 27126 -51133 -48658 36381 57119 -9822 -34779 6336
817 6336 16283 -7855 3632 28826 3468 -26287 4801 31088 -2369 -14239 27730 27601 -31857
830 -31857 -34562 37739 54314 -11774 -41963 -6421 18192 17078 23271 9137 -42708 -44102 41644
843 41644 80034 -2371 -72500 -24909 49761 46570 8139 -8988 -25906 -21198 39129 72698
$$ packed form
756B1163N6741n7462n0230K2968J9866o296K0704J5799m7757l7569M9794M4351
768E2072m6392m0312M2098K4657m8243j7133N4369K1785m7645k2234L0977J0393
780A4392q883K2883O841n8631l0480P6567O5356o4449q5764K3948O7703J2012
792D1495j9366j8322l7201j5119O8824O6605n7732j01542J6743R9088K3635o0102
804G006l2051Q426K552K5106M2759k6672p8259K475Q5039K0738o6941k4957M1115
817F336R947k4138J1487K5194k5358k9755L1088K6287l3457j1870M1969j29n9458
830c1857k705P2301J6575o6088l0189L5542K4613j114O193j4134n1845j394Q5746
843D1644L8390q2405p0129M7591P4670l191l8431j7127j6918M708O0327L3569
$$ plain form
855 72698 5220 -67585 -27133 57293 49694 -15746 -28265 -4461 -1817 5222 28012 10213 -40571
868 -40571 -28588 34243 32353 -20836 -17885 25360 17481 -18693 306 40221 20204 -16818 -2337
881 -2337 17926 4824 4961 29040 7350 -48295 -27835 49092 46568 -33017 -58049 -5608 30122
894 30122 20207 8732 -10160 -42378 -18332 56935 64641 -22558 -68365 -1428 61574 32562
906 32562 -14662 -21759 -20481 -11310 26186 37440 -22501 -67322 -15049 46278 17029 -34566 -22598
919 -22598 9129 1491 -4816 19064 15922 -18603 -10136 28376 19607 -13764 3064 33660 2828
932 2828 -33802 2925 47877 18418 -28285 -18276 11947 14264 14738 21036 -11233 -46770 -4678
945 -4678 62368 37180 -45680 -54393 11869 40334 13637 -8399 -23991 -35288 -4080 49746
$$ packed form
855G2698o7478p2805M0452Q4426p599o5440j2519K3804K644P039K2790j7799n0784
868d0571J1983O2831j890n3189K951M3245p879l6174J8999L9915k0017l7022J4481
881b337K0263j3102J37K4079k1690n5645K0460P6927k524p9585k5032N2441L5730
894C0122r915j1475j8892l2218K4046P5267P706q7199m5807O6937O3002k9012
906C2562m7224p097J278R171L7496J1254n9941m4821N2273O1327k9249n1595J1968
919b2598L1727p638o307K3880l142l4525Q467L8512q769l3371J6828L0596l0832
932B828l6630L6727M4952k9459m6703J0009L0223K317M74O298l2269l5537M2092
945d678O7046k5188q2860q713O6262K8465k6697k2036j5592j1297L1208N3826
$$ plain form
957 49746 35020 -42683 -58807 14705 55465 12178 -27124 -15688 -2169 -811 17510 21955
969 21955 -21571 -45501 153 34080 -1890 -34468 -7113 17090 -7041 -16112 17245 26752
981 26752 -3001 -6765 20456 21121 6463 24474 35463 -6426 -30858 19004 56090 8180 -47660
994 -47660 -30897 9296 11378 -1259 -10867 -38374 -49450 2604 52677 10724 -60708 -41983
1006 -41983 33072 47356 6384 -13371 -12136 -11254 12348 43078 14634 -48979 -44977 19858 32770
1019 32770 -18981 -41039 -13540 -2084 -11823 1342 14851 -8992 -20409 16633 36787 8283
1031 8283 -1332 31018 35748 -2010 -3928 37429 40572 -2510 -18811 3110 10792 3126 10029
1044 10029 2141 -37276 -38219 21916 45641 -12447 -56202 -19626 28895 25147 2284 -10769 -25742
$$ packed form
957D9746j4726p7703j6124P3512M0760m3287l9302J1436J3519J358J8321M445
969B1955m3526k3930M5654L3927l5970l2578K7355K4203k4131r071L3357R507
981B6752k9753l764K7221O65j4658J8011J0989m1889k4432M9862L7086m7910n5840
994d7660J6763M0193K082j2637r608k7507j1076N2054N0073m1953p1432J8725
1006d1983P5055J4284m0972j9755J235Q82K3602L0730k8444o3613M002O4835J2912
1019C2770n1751k2058K7499J1456r739J3165J3509k3843j1417L7042K0154k8504
1031H283r615L2350M730l7758j918M1357L143m3082j6301K1921P682p666O903
1044A0029p888l9417r43O0135K3725n8088m3755L6576M8521l748k2863j3053j4973
$$ plain form
1057 -25742 -19674 24724 46438 -6143 -60677 -27398 35668 27492 -19923 -29411 -12543 -7199 4891
1070 4891 23638 2478 -36398 -18101 32208 29228 -13370 -15803 16281 15142 -8033 4148 24131
1083 24131 5499 -12843 5856 18965 1415 906 25883 13776 -24025 -8428 40778 35952
1095 35952 -16110 -30294 3595 20538 9573 2937 -13280 -40167 -24960 27756 30489 -35200
1107 -35200 -64300 -10337 32810 13123 -14431 -17999 -15598 -2061 32103 39152 -10339 -40697
1119 -40697 3954 48219 22770 -20774 -15783 5858 139 -1587 12199 -2040 -27635 -10853
1131 -10853 22668 12555 -14915 124 27624 11601 -9145 15166 40794 20152 -6597 4090
1143 4090 20007 10748 9527 15930 -9949 -37721 -9865 32814 11530 -45485 -45521 604 18055
$$ packed form
1057b5742O068M4398K1714n2581n4534L3279O3066q176m7415r488J6868N344J2090
1070D891J8747k1160l8876J8297N0309k980m2598k433L2084j139k3175J2181J9983
1083B4131j8632j8342J8699J3109j7550n09K4977j2107l7801J5597M9206m826
1095C5952n2062j4184L3889J6943j0965o636j6217k6887J5207N2716K733o5689
1107c5200k9100N3963M3147j9687k7554l568K401J3537L4164P049m9491l0358
1119d0697M4651M4265k5449m3544M991K1641n719j726J3786j4239k5595J6782
1131a0853L3521j0113k7470J5039K7500j6023k0746K4311K5628k0642k6749J0687
1143D090J5917r259j221O403k5879k7772K7856M2679k1284n7015l6M6125J7451
$$ plain form
1156 18055 2745 -10366 -19942 -25039 1355 42019 29143 -29977 -37843 18835 45974 11304
1168 11304 -19634 -13098 -4243 274 17250 13993 -24057 -36088 4133 31284 2597 -25109 -3971
1181 -3971 17010 3091 -1458 17784 15769 -5870 -753 20929 11509 -5497 10057 19993 -9123
1194 -9123 -24296 9144 32668 884 -31218 -14003 12114 10222 5262 2984 -17537 -27458 10599
1207 10599 44535 8691 -43165 -26864 23665 29441 614 -14535 -15763 -12966 10092 34039
1219 34039 10125 -35127 -25850 27194 38166 -1947 -18997 1132 9258 5201 15037 13775 -12037
1232 -12037 -17651 12131 23096 -5536 -17347 6153 12195 -10842 -11393 15391 16053 -9186 -10795
1245 -10795 8926 9132 2753 13561 10782 -16995 -18098 22577 35208 -7534 -36595 -10175 18952
$$ packed form
1156A8055j5310j3111r576n097K6394M0664j2876n9120p866N6678K7139l4670
1168A1304l0938O536Q855M517J6976l257l8050j2031M0221K7151k8687k7706K1138
1181c971K0981j3919m549J9242k015k1639N117K1682r420j7006J5554R936k9116
1194i123j5173L3440K3524l1784l2102J7215K6117j892m960k278k0521r921L8057
1207A0599L3936l5844n1856J6301N0529N776k8827j5149j228K797K3058K3947
1219C4039k3914m5252R277N3044J0972m0113j7050K0129Q126m057R836j262k5812
1232a2037n614K9782J0965k8632j1811K3500O042k3037n51K6784O62k5239j609
1245a0795J9721K06o379J0808k779k7777j103M0675J2631m2742k9061K6420K9127
$$ plain form
1258 18952 13517 -1824 -10590 -21667 -17093 18276 35142 -5806 -42510 -11865 35554 27583 -6491
1271 -6491 -13081 -2646 2938 15671 25374 2251 -28227 -11762 27285 22225 -14911 -18591 6345
1284 6345 7226 -5355 2939 10679 -5417 -11261 8853 15292 -3450 -3815 15993 9616 -15103 -5898
1298 -5898 25532 20312 -13664 -16994 6822 13448 6616 7488 -1480 -21019 -8498 31220 30427 -17575
1312 -17575 -33905 4652 31458 15989 -4893 -9610 -10321 -119 25550 26601 -13897 -34589 2165
1325 2165 36195 15099 -16636 -11587 4185 4567 8776 15022 -1465 -18507 -1778 24120 12397
1338 12397 -13773 -5414 14518 4253 -10705 3184 16421 146 -12783 1384 8629 -349
1350 -349 2755 11843 -2494 -19960 604 31249 15820 -21161 -18150 12123 21164 9114 916
$$ packed form
1258A8952n435j5341q766j1077M574L5369J6866m0948l6704L0645M7419p971l4074
1271f491o590J0435N584J2733R703k3123l0478J6465L9047n060l7136l680K4936
1284F345Q81j2581Q294P740j6096n844K0114O439j8742l65J9808o377k4719R205
1298e898L1430n220l3976l330K3816O626o832Q72q968j9539J2521L9718p93m8002
1312a7575j6330L8557K6806j5469k0882m717p11J0202K5669J051m0498k0692L6754
1325B165L4030k1096l1735N049J5772L82M209O246j6487j7042J6729K5898j1723
1338A2397k6170Q359J9932j0265j4958J3889J3237j6275j2929J4167P245q978
1350c49L104R088j4337j7466K0564L0645j5429l6981L011L0273R041j2050q198
$$ plain form
1363 916 -7085 -14674 3731 33820 19082 -25536 -27934 14502 31949 6013 -14629 -9512 -3003
1376 -3003 4758 20007 13954 -16471 -23313 11980 32587 5745 -15950 251 14012 6404 5056
1389 5056 13596 6285 -8057 2669 19150 6099 -8254 4289 13834 -3981 -14837 7191 21048
1402 21048 -1366 -17491 -2809 10778 7667 6704 7439 -6992 -14137 13972 35659 8583 -25063
1415 -25063 -12155 21210 23385 2488 -7969 -10299 -9564 8658 24745 2843 -30880 -20215 20117
1428 20117 25587 -4609 -15402 -1659 6763 9492 16290 11867 -8307 -8183 18991 25940 53
1441 53 -10153 7929 13438 -2191 -3852 11049 6218 -9746 -5017 7322 1809 -3756 6454 7531
1455 7531 -11344 -11723 17045 24228 -4821 -20316 -601 17715 11323 2540 -2088 -12640 -9698
$$ packed form
1363I16q001p589J8405L0089j4738m4618k398M2436J7447k5936k0642N117O509
1376c003P761J5249o053l0425o842L5293K0607k6842k1695J6201J3761p608j348
1389E056Q540p311j4342J0726J6481j3051j4353J2543R545j7815j0856K2028J3857
1402B1048k2414j6125J4682J3587l111r63P35j4431p145K8109K1687k7076l3646
1415b5063J2908L3365K175k0897j0457k330P35J8222J6087k1902l3723J0665M0332
1428B0117N470l0196j0793J3743Q422K729O798m423k0174J24K7174O949k5887
1441E3j0206J8082N509j5629j661J4901m831j5964M729J2339n513n565J0210J077
1455G531j8875l79K8768P183k9049j5495J9715J8316o392q783m628j0552K942
$$ plain form
1468 -9698 17225 26145 -6473 -31296 -7097 25427 17606 -6786 -11059 -4374 1780 14004 20504
1481 20504 202 -21790 -4271 27641 20662 -8448 -9573 8272 10714 4661 9700 9802 -3941
1494 -3941 -3172 15651 16299 -2361 -2851 12440 8958 -9207 -3048 15596 7828 -13309 -11433 2654
1508 2654 2527 -2235 1575 -4555 -18929 -8270 19719 17134 -15166 -23090 5298 22394 10482
1521 10482 -2639 -5786 -7410 675 20323 17529 -14367 -27876 1508 24237 6942 -16055 -12326
1534 -12326 -140 3713 9095 11866 -2179 -12761 5880 27143 15302 -5752 1287 16987 10739
1547 10739 172 7435 11340 -2765 -7924 2787 3210 -7958 -5990 3194 -7054 -19859 -4611
1560 -4611 15883 4010 -18649 -12396 8905 12118 4059 2060 -4205 -11136 3980 24993 10898
$$ packed form
1468i698K6923Q920l2618k4823K4199L2524p821k4392m273O685O154J2224O500
1481B0504k0302k1992J7519L1912o979k9110j125J7845K442o053N039J02j3743
1494c941P69J8823O48j8660m90J5291l482j8165O159J8644p768k1137J876J4087
1508B654j27m762L810o130j4374J0659K7989k585l2300p924K8388J7096j1912
1521A0482j3121l147j624Q085J9648k794l1896j3509K9384K2729j7295k2997L729
1534a2326J2186L853N382K771j4045j0582J8641K1263j1841k1054P039J5700o248
1547A0739j0567P263L905j4105n159J0711M23j1168J968R184j0248j2805J5248
1560d611K0494j1873k2659O253K1301L213q059j999o265o931J5116K1013j4095
$$ plain form
1573 10898 -21226 -20915 10320 20220 -133 -13394 -10129 -5386 3140 15590 9084 -15355 -16529
1586 -16529 14087 27120 4838 -10343 1325 11752 8487 7550 9861 -135 -8353 4386 14826
1599 14826 1191 -11262 -1015 8076 -4198 -11091 3013 9017 -5871 -12813 -1916 3816 -1604
1612 -1604 -488 1336 -10583 -15315 4499 17273 -2608 -24129 -12499 11537 11076 -2271 -7110
1625 -7110 -8736 -6650 9186 20851 2655 -21569 -10512 19232 19975 -3047 -12164 -3436 3253
1638 3253 5480 9496 2587 -14412 -10395 13070 16640 -4244 -11295 4005 10583 1080 1319 8641
1652 8641 2845 -5215 1375 8429 316 -6571 1659 2751 -12243 -13076 5178 8026 -11930 -20083
1666 -20083 -4131 6080 1049 -1472 -2738 -10389 -6085 14421 19930 -4293 -20121 -1311 20326
$$ packed form
1573A0898l2124L11L1235R900k0353j3261L265M743Q526J2450o506k4439j174
1586a6529L0616J3033k2282j5181J1668J0427l265r37K311r996q218J2739J0440
1599A4826j3635j2453J0247R091j2274o893J4104O004j4888o942J0897N732n420
1612a604J116J824j1919m732J9814J2774j9881k1521J1630K4036m61j3347m839
1625g110j626K086J5836J1665j8196k4224J1057K9744P43k3022r117Q728O689
1638C253K227M016o909j6999M017K3465L570k0884p051J5300O578r503K39P322
1652H641n796q060O590P054q113o887Q230J092j4994q33J8254K848j9956q153
1666b0083J5952J0211n031k521j266p651M304K0506N509k4223j5828J8810K1637
$$ plain form
1679 20326 12491 -5139 -9156 -5719 -1710 7804 11610 -7305 -23182 -6137 17364 9814 -10953
1692 -10953 -11214 2439 5595 3621 6708 2812 -7532 -3005 12054 9716 -7072 -7676 5183 2709
1706 2709 -9679 -5165 5057 -1109 -12252 -7812 1498 -1458 -3876 1261 -2239 -12087 -4811 13739
1720 13739 10627 -12217 -15807 3859 13231 3923 -4084 -6491 -8639 -1324 13550 10514 -13769 -20209
1734 -20209 2797 18587 5153 -11457 -8741 244 3501 7878 6783 -7029 -14348 1616 16677
1747 16677 3883 -13256 -7074 5492 1912 -3716 874 848 -6723 -5051 5057 3493 -6285 -2994
1761 -2994 6185 -932 -10404 -301 11339 1014 -13120 -7241 5007 3407 -1441 -1841 -6840 -11397
1775 -11397 344 14397 3715 -18199 -14326 8757 14109 -99 -8888 -6316 -3873 3162 11929
$$ packed form
1679B0326p835j7630m017L437M009R514L806j8915j5877J7045K3501p550k0767
1692a0953k61J3653L156j974L087l896j0344M527J5059k338j6788o04J2859k474
1706B709j2388M514J0222o166j1143M440R310k956k418N137l500r848P276J8550
1720A3739l112k2844l590J9666R372r308q007k407k148P315J4874l036k4283o440
1734b0209K3006J5790j3434j6610K716Q985L257M377j095j3812p319J5964J5061
1747A6677j2794j7139O182J2566l580n628M590k6p571J672J0108j564r778L291
1761b994R179p117r472J0103J1640j0325j4134N879J2248j600m848m00m999m557
1775a1397J1741J4053j0682k1914L873K3083N352j4208q789K572K443P035Q767
$$ plain form
1788 11929 3561 -16393 -14960 8094 14933 -3494 -15035 -6720 1801 850 975 429 -8101 -10735
1802 -10735 2590 10545 -1789 -11295 -1579 6301 -1942 -6027 2590 4281 -5316 -6820 1635 2289
1816 2289 -3161 -778 1504 -6524 -9818 3917 11834 -2992 -16471 -5678 8868 6162 -2564 -5083
1830 -5083 -7119 -5961 5993 12822 -1982 -19089 -9102 12450 11659 -5882 -11740 -4385 478 3480
1844 3480 6773 -1300 -14605 -8308 10323 10627 -7392 -12120 -456 4164 -1482 -1832 638 -4315
1858 -4315 -7220 1139 5446 -3404 -7684 1405 3274 -6501 -6209 5627 6160 -7227 -9769 916 4550
1873 4550 -227 -1116 -2543 -8714 -6364 7520 9808 -8600 -18068 -2305 11354 4534 -6853 -8088
1887 -8088 -5835 -1833 7057 8553 -7099 -16787 -2290 14149 7259 -9306 -9253 771 3164 2500
$$ packed form
1788A1929q368j9954J433K3054O839j8427j1541Q315Q521r51J25n46q530k634
1802a0735J3325P955j2334r506R716P880q243m085Q617J691r597j504Q455O54
1816B289n450K383K282q028l294J3735P917j4826j3479J0793J4546k706q726k519
1830e083k036J158J1954O829j4804j7107R987K1552p91j7541n858P355M863L002
1844C480L293q073j3305O297J8631L04j8019m728J1664M620n646l50K470m953
1858d315k905Q359M307q850m280R089J869r775K92J1836N33j3387k542J0685L634
1873D550m777q89j427o171K350J3884K288j8408r468J5763J3659o820j1387j235
1887h088K253M002Q890J496j5652r688J4497J6439o890j6565N3J0024K393o64
$$ plain form
1901 2500 3271 -2315 -9926 -3700 8755 5110 -8984 -7946 3036 2327 -5187 -3061 2801 -1408 -6918
1916 -6918 -1258 3331 -1466 -2669 2474 114 -7345 -2592 10099 6191 -9418 -9616 3593 7583
1930 7583 777 -3977 -5053 -7027 -1511 9504 5801 -12386 -14929 3117 13624 2653 -8586
1943 -8586 -5427 652 3845 8615 6288 -5928 -9876 4623 14916 3121 -9912 -4966 3987 1978
1957 1978 -1780 -556 -2519 -7813 -3718 4605 455 -7921 -3700 3776 -577 -6613 525 7431 -29
1972 -29 -7223 -1551 4563 2136 -763 -21 -3338 -7565 1103 10375 1067 -13661 -9176 6567 9239
1987 9239 -695 -5407 -3556 -1085 5406 11570 4401 -9573 -6598 11055 15064 383 -7590 -857
2001 -857 5082 4898 4923 2263 -5420 -6139 5639 9822 -1716 -8686 -562 5676 98 -3102 1480 1781
$$ packed form
1901B500P71n586p611O226J2455l645j4094J038J0982p09p514K126N862m209n510
1916f918N660M589m797j203N143k360p459M753J2691l908j5609j98J3209L990
1930G583o806m754j076j974N516J1015l703j8187k543J8046J0507j0971j1239
1943h586L159O079L193M770k327j2216l948J4499J0293j1795j3033M946Q953k009
1957A978l758J224j963n294M095Q323m150q376M221P476m353o036P138O906p460
1972b9p194N672O114k427k899P42l317m227Q668R272r308j4728M485J5743K672
1987I239r934m712J851K471O491O164p169j3974K975J7653M009j4681p973O733
2001h57N939j84K5k660p683p19J1778M183j1538o970Q124O238n578l200M582L01
$$ plain form
2017 1781 -4298 -2487 3386 1120 -3745 -330 2656 -3368 -6069 3796 8827 -1903 -9407 -481 7904
2032 7904 5244 -247 -835 -2298 -2136 7187 11406 -924 -11978 -2808 12228 9475 -3182 -5933
2046 -5933 -513 3161 6515 8708 498 -8227 -1216 13141 11604 -2836 -5679 3390 6492 2651
2060 2651 1836 1297 -4064 -4184 3556 4428 -4949 -7451 450 2110 -4664 -4391 3615 2895 -4202 -3274 4039
2077 4039 4621 1335 2827 2635 -2092 -683 9803 9060 -4073 -8618 2579 10100 4132 -2941 -3319
2092 -3319 -1607 1567 8827 8481 -3119 -8536 3992 15828 8867 -3206 -2230 5163 7185 6958 5657
2107 5657 -475 -5414 1114 10168 4313 -6786 -5568 3050 2914 -2539 -1215 1174 -1902 -3189 2405
2122 2405 3989 -1168 -1637 3718 2605 -3437 133 8099 4120 -5615 -3800 5018 6023 1011 -460
$$ packed form
2017A781o079J811N873k266m865L415K986o024k701R865N031j0730p504Q926Q385
2032G904k660n491n88j463J62R323M219j2330j1054R170J5036k753j2657k751
2046e933N420L674L354K193q210q725P011J4357j537j4440k843R069L102l841
2060B651q15n39n361j20P740Q72r377k502P901J660o774K73Q006p20p097R28P313
2077D039N82l286J492j92m727J409J0486p43j3133m545J1197P521n968p073l78
2092c319J712L174P260l46j1600n417J2528J1836o961j2073R76P393K022k27j301
2107E657o132m939O528R054n855j1099J218Q618j36n453J324K389l076j287N594
2122B405J584n157m69N355j113o042L570P966l979r735J815Q818J005n012j471
$$ plain form
2137 -460 -739 -2731 2051 10116 5794 -6640 -6568 7434 12645 3104 -3829 -1329 2460 4964 8249
2152 8249 4787 -5163 -6462 5995 12550 1752 -7076 -1969 4762 4266 1841 2218 -895 -3919 1916
2167 1916 7558 1647 -5292 -1200 4801 981 -3395 857 4007 -838 -4153 876 3901 799 205
2182 205 2926 266 -2576 4340 10133 2754 -6166 -1164 9035 8528 771 -1566 -1035 272 4848
2197 4848 8275 1327 -8365 -4354 8695 9896 -1707 -5857 -22 4322 4819 5231 2128 -3991 -2497
2212 -2497 7754 9065 -1065 -5895 748 5377 1059 -1574 815 -575 -3162 118 3770 224
2226 224 -3363 896 3951 -958 -2536 4573 6736 -987 -4158 2341 6713 2835 306 363 -1503 -1149
2242 -1149 5562 7579 -2184 -9179 -146 9723 5282 -3020 -3739 -21 2317 5595 6036 -1174 -7315
$$ packed form
2137d60k79j992M782Q065m322j2434P2J4002N211r541o933K500L789K504L285
2152H249l462r950j299J2457O555j0798q828N107O731m96k425L77l113l024N835
2167A916N642n911o939M092O001l820m376M252L150m845l315N029L025l102n94
2182B05K721k660k842O916N793p379q920N002J0199n07p757k337N31J307M576
2197D848L427o948r692M011J3049J201j1603m150N835M344M97M12l103o119J494
2212b497J0251J311j0130m830O643M629m318k633K389j390k587L280L652l546
2226B24l587M259L055m909j578P109K163p723l171O499M372l878k529N7j866L54
2242a149O711K017r763o995R033R869m441q302p19L718K338L278M41p210o141
$$ plain form
2257 -7315 60 10665 6795 -4043 -5214 2301 4706 2139 1655 127 -3743 -905 6055 5123 -2755
2272 -2755 -3672 3228 4514 -676 -500 3774 2483 -1955 -113 3853 2248 -496 1657 1650 -2220 -534
2288 -534 6127 5126 -4008 -5528 3201 7482 2141 -1898 -1687 -916 1656 6387 4913 -4414 -7510 2700
2304 2700 9893 2782 -5564 -3851 1437 2938 2985 2220 -3279 -5823 1789 8581 2717 -5893 -3285 4307
2320 4307 3774 -5 472 1322 -1632 -706 3962 3168 -2593 -1512 3292 1562 -2813 34 4734 1134
2336 1134 -3825 -1835 3923 3084 -352 -138 -416 -2290 1657 6756 2765 -6258 -4527 5378 7335 28
2352 28 -3965 -1858 919 2888 5071 1765 -5659 -5028 5093 8459 -465 -6343 -1629 3474 2747 1350
2368 1350 576 -2287 -3121 3033 6101 348 -4728 -440 4479 1605 -1415 991 2485 -895 -1723 2142
$$ packed form
2257g315P375J0605l870j0838j171P515K405k567m84j528l870K838O960r32p878
2272b755r17O900J286n190J76M274j291m438J842L966j605k744K153pl870J686
2288e34O661j001r134j520Q729M281n341m039K11P71K572M731j474r327l096J0210
2304B700P193p111q346J713N288J501M7p65n499k544P612O792n864q610K608P592
2320D307n33l779M77Q50k954R26M668p94n761J081M804j730m375K847M700l600
2336A134m959J990N758q39l436K14k78j874L947N099l991r023J731R905J957p307
2352B8l993K107K777J969K183l306p424O31J0121L366q924n878M714N103p27j397
2368A350p74k863q34O154L068n753n076M288M919k874l020K406J494l380q28L865
$$ plain form
2384 2142 2267 -1094 -467 1925 -699 -2937 1902 4951 -379 -6027 -1599 5264 3168 -1430 -1959 -1211
2400 -1211 -708 3136 5582 23 -7390 -2606 7085 6063 -2652 -5232 -688 2145 2491 2480 -910 -5796
2416 -5796 -2597 5287 5480 -3421 -6169 118 3464 556 -721 219 -1317 -2010 1525 3630 -1203 -3730
2432 -3730 697 2957 -1086 -2382 2048 2926 -2195 -3282 1498 2719 -299 -702 -19 -1901 -1419 3722
2448 3722 4797 -2817 -6085 1013 6732 3056 -2607 -2283 241 1730 3937 4031 -2322 -5739 600 7526
2464 7526 3633 -4731 -4880 890 2203 770 168 -2347 -4312 -1619 4052 2142 -4723 -4539 1618 2307
2480 2307 -1343 -1668 1265 -102 -2213 466 2236 -804 -2298 565 842 -2700 -1866 3146 1930 -4366
2496 -4366 -4145 2162 3731 -363 -2001 -831 -995 1132 5031 3309 -4077 -4799 3575 7605 1315 -4533
$$ packed form
2384B142J25l361O27K392k624k238M839L049n330n648M428O863k096m598n29P48
2400a211N03L844K446n559p413M784R691j022q715k580M544K833L46j1l390m886
2416e796L199P884J93q901k748O287L346k908j277R40j536o93L535K105m833k527
2432c730M427K260m043j296M430Q78n121j087M780J221l018m03O83j882M82N141
2448C722J075p614l268P098N719l676n663L24K524J489K207R4o353l417O339O926
2464G526l893q364j49N770J313j433o02k515j965K693N671j910o865J84O157O89
2480B307l650l25K933j367k111K679J770l040j494K863K77l542Q34N012j216o296
2496d366K21O307J569m094j638J170j64K127L899j722p386p22Q374M030o290n848
$$ plain form
2512 -4533 -2538 1105 1992 2254 739 -4348 -5497 1117 5667 -365 -6754 -3733 2305 1480 -1074 -979
2528 -979 -1422 -2800 -348 3292 630 -3795 -2151 2330 895 -2775 -812 2474 -150 -3583 -207
2543 -207 2315 356 -1010 292 7 -1721 1151 5034 1372 -4782 -2608 4820 4938 -605 -2684 -980
2559 -980 651 1997 3924 292 -5222 -3521 4410 5649 -1683 -5683 -1531 1745 1293 97 -992
2574 -992 -4159 -3702 1604 3462 -2687 -6333 -2132 2133 -488 -2808 -908 -37 -2015 -1169 1926 919
2590 919 -2153 -558 2096 -338 -2137 1446 3756 -806 -4090 -300 3768 1437 -1516 -1184 -1038 -557
2606 -557 2301 4311 -778 -5431 -833 6012 4429 -2519 -3226 179 1850 2188 2183 -1231 -5160 -1870
2622 -1870 4660 3012 -4558 -5833 -231 1848 -406 -1561 -1292 -2689 -2192 1746 2633 -2256 -3711 1110
$$ packed form
2512d533J995L643Q87K62j515n087j149O614M550o032o389L021O038q25k554R5
2528i79m43j378K452L640k662m425J644M481j435l670J963L286k624l433L376
2543b07K522j959j366J302k85j728K872L883l662o154K174P428J18n543k079J704
2559i80J631J346J927l632n514J701P931J239p332m000M152L276m52j196j089
2574i92l167M57N306J858o149l646M201M265k621k320J900Q71j978Q46L095j007
2590I19l072J595K654k434j799L583K310m562l284L790M068k331k953L32J46M81
2606e57K858K010n089m653M598O845j583o948p07L405J671L38nl414l929L290
2622a870O530j648p570j275N602K079k254j155K69j397M97L938Q87m889j455M821
$$ plain form
2638 1110 2825 -690 -1662 1447 1585 -1687 -1186 1923 1224 -957 -407 294 -1144 -1103 2698 3140 -2652
2655 -2652 -4266 1270 4727 1482 -2102 -1530 228 1187 3002 2698 -2679 -5190 639 5566 1465 -4880
2671 -4880 -3938 752 1443 577 -432 -2298 -4200 -444 4014 1364 -4463 -3465 1716 2383 -1227 -1612
2687 -1612 210 -905 -1392 1286 1569 -1508 -1803 1320 1708 -1737 -707 3116 1704 -2832 -1613 2850
2703 2850 2951 -457 -732 73 -920 429 3668 1831 -3944 -3858 2720 5207 -32 -3852 -1499 1209
2719 1209 1811 2439 849 -3157 -3366 2539 5691 -213 -5039 -1626 2686 1783 -235 -686 -1439 -2231 556
2736 556 3412 65 -3582 -1262 2393 1304 -1819 -45 1737 -233 -1470 1153 2153 100 -596
2751 -596 1028 263 -1761 621 3116 -3 -3990 -1738 3237 2980 -1454 -2176 -526 47 1633 2946
$$ packed form
2638A110J715l515r72L109J38l272N01L109o99k181N50P01j438M1L801M42n792
2655b652j614N536L457l245l584N72J758R59J815l04n377k511N829M927m101o345
2671d880R42M690O91q66j009j866j902L756M458k650n827R98N181O67l610l85
2687a612J822j115m87K678K83l077k95L123L88l445J030L823j412m536J219M463
2703B850J01l408k75Q05r93J349L239j837n775Q6O578K487n239l820K353K708
2719A209O02O28j590m006k09N905L152n904m826L413M312r03k018m51p53p92K787
2736E56K856l347l647K320L655j089l123J774J782j970j237K623J000k053o96
2751e96J624p65k024K382K495l119l987K252M975k57m434p22J650N73J586J313
$$ plain form
2767 2946 177 -4271 -2120 4575 4547 -1712 -3809 -277 2462 1763 801 -615 -2855 -1708 3111 3864
2783 3864 -1580 -4276 71 3403 1104 -1009 235 181 -508 1020 2423 417 -2038 305 2533 401
2799 401 -1710 1056 2573 -445 -2220 818 2990 729 -830 59 -86 -574 2317 3460 -978 -4086
2815 -4086 131 4964 2676 -2177 -2169 353 1530 2156 1983 -972 -3706 -346 5162 2952 -2994 -3072 1234
2832 1234 2928 1151 385 -399 -1746 -405 3128 2544 -2097 -2766 1628 2794 -428 -1198 788 666
2848 666 -1170 -182 1702 486 -1046 200 989 -345 -719 2295 2393 -1918 -2571 1363 3587 756 -1852
2865 -1852 -791 319 643 2342 1906 -2255 -3695 1579 5248 1424 -3591 -1991 1417 2392 1486 737
2881 737 -1339 -2240 1006 4718 1595 -3470 -1959 2381 2723 -224 -507 80 -155 -299 2226 1826 -1537
$$ packed form
2767B946k769m448K151O695k8o259k097L532K739o99r62j416k240J147M819P53
2783C864n444k696M347L332k299k113J244n4o89J528J403k006k455K343K228k132
2799D01k111K766J517l018j775L038K172k261j559Q89j45m88K891J143m438l108
2815d086M217M833k288m853QK522J177O26j73k955k734L360N508k210n946p8M306
2832A234J694j777p66p84j347J341L533n84m641o69M394J166l222p70J986j22
2848F66j836R88J884j216j532J246P89j334l74L014R8m311o53L934K224k831k608
2865a852J061J110L24J699m36m161j440N274L669l824n015J600L408R75r06p49
2881G37k076r01L246L712l123n065J511M340L42k947k83N87k35j44K525m00l363
$$ plain form
2898 -1537 -1482 1991 1696 -1095 -668 2262 890 -1771 -368 2275 1230 -690 -26 290 -390 357 2969
2915 2969 1357 -2910 -2299 2796 3945 -560 -2939 -908 835 1277 1691 123 -3062 -2741 2755 4211
2931 4211 -648 -4023 -1201 1976 1826 -194 -547 -1350 -1756 1135 2905 -36 -3125 -912 2594 1435
2947 1435 -1074 -281 833 -407 -405 1244 1332 -678 -743 1540 679 -1084 542 2926 285 -2637 -475
2964 -475 3232 1713 -921 -1147 127 488 1343 2272 -102 -3516 -1210 3679 3139 -1874 -3345 -273
2980 -273 1806 1011 732 -723 -2959 -1230 2865 2712 -2251 -3987 -4 2798 876 -693 -377 -581
2996 -581 -714 1193 2202 -175 -2659 301 2308 213 -1391 966 1639 -582 -1369 1223 1898 -203
3012 -203 -418 721 -153 -453 1624 2653 -962 -3147 735 3763 1343 -2179 -1692 94 795 996 940
$$ packed form
2898a537N5L473k95k791M27K930j372k661J403K643j045j920O64L16o80P47K612
2915B969j612m267O11N095J149m505k379K031J743M42M14j568l185L21N496J456
2931D211m859l375K822L177j50k020l53q03m06K891J770k941l089K213L506j159
2947A435k509P93J114j240KJ649Q8k010o5K283q61j763J626K384k641k922K162
2964d75L707j519k634k26J274L61Q55R29k374l414K306M889n40n013j471L072
2980b73K079p95k79j455k236J729M095j53m963j736L983K802j922j569L16k04
2996e81j33J907J009k377k484K960K007k095j604K357O73k221p87K592O75k101
3012b03k15J139q74l00K077J029l615k185L882L028k420l522M87J786P01K01n6
$$ plain form
3029 940 -2042 -3790 -294 3414 1600 -3551 -3378 653 1727 212 -368 -1469 -1959 -166 2622 1771
3045 1771 -2462 -2708 1532 2313 -21 -1425 223 590 -518 814 1726 -75 -815 870 1677 -350
3061 -350 -365 2105 1919 -1087 -1284 2055 2996 179 -1077 -22 182 387 2198 1428 -2294 -3023 1229
3078 1229 3899 46 -3480 -1694 943 1002 860 20 -2237 -2680 1198 3669 177 -3769 -1834 2099
3094 2099 1903 -374 -860 -407 -734 155 2278 967 -1843 -995 1842 1766 -605 -462 1644 965 -904
3111 -904 358 1979 571 -633 490 744 -621 537 2319 906 -2534 -1620 2554 2685 -778 -2315
3127 -2315 -559 525 798 1554 -191 -3106 -2198 2269 3318 -1218 -3883 -1206 1877 1179 -58 -876
3143 -876 -1469 -1205 1871 2967 -454 -3020 136 2986 1617 -804 186 807 181 364 2046 1214 -1021
$$ packed form
3029I40k982j748L496L708j814n151J73M031J074j515n80j101m90J793K788q51
3045A771m233k46M240P81k334j404J648L67j108J332R12j801p40J685Q07k027
3061c50j5K470j86l006j97L339R41k817j256J055K04K05J811p70l722p29M252
3078A229K670l853l526J786K637N9j42q40k257m43L878K471l492l946J935L933
3094B099j96k277m86M53l27Q89K123j311k810Q48K837p6k371J43K106o79j869
3111i04J262J621j408j204J123K54j365J158J782j413l440R14M174J31l463j537
3127b315J756J084K73P56j745k915R08M467J049m536k665K677L083o98j237q18
3143h76n93K64L076J096l421k566L156K850j369k421R90O21o26J83J682q32k235
$$ plain form
3160 -1021 -100 1757 1008 -861 476 2108 462 -1545 222 2305 1075 -861 -565 536 90 956
3176 956 2032 -485 -2827 -654 3133 2074 -2107 -2843 -73 1350 822 432 -1096 -2711 -739 3023
3192 3023 2276 -1940 -3160 298 2511 1112 -470 -586 -729 -299 1857 2127 -1106 -2097 961 2286
3208 2286 120 -1313 224 1008 -319 -463 1060 828 -648 -316 835 30 -818 1120 1924 -830 -2378
3225 -2378 579 2799 537 -1693 -1153 339 597 1250 1078 -1222 -2754 414 3752 1404 -2779 -1951
3241 -1951 1119 2119 882 128 -892 -1221 223 3109 1287 -2373 -1922 1559 2481 211 -886 140
3257 140 89 -124 1151 1578 -753 -1233 1200 1429 -552 -969 1482 959 -1333 -1065 1208 1417 -503 -825
3275 -825 23 -71 125 1651 1060 -2238 -1870 1481 3000 -212 -2501 -726 969 1115 1015 299 -1820
$$ packed form
3160a021R21J857p49j869J337J632j646k007J767K083j230j936K96J101m46Q66
3176I56J076k517k342K173L787j059m181p36K770J423n28l90j528j615J972L762
3192C023p47m216j220L458K213j399j582j16j43M30K156K70l233r91L058J325
3208B286k166j433J537P84j327j44J523k32j476L32J151q05q48J938Q04k754j548
3225b378K957K220k262k230N40J492K58O53j72k300j532L168L338k348m183Q28
3241a951L070J000j237p54j020l29J444K886j822l660M51L481R22k270j097J026
3257A40n1k13J275M27k331m80K433K29j981m17K451n23k292K68K273K09j920l22
3275h25Q48r4J96J526n91l298L68L351J519l212k289J775J695J46j00p16k119
$$ plain form
3292 -1820 -1941 1707 3195 14 -3227 -1522 2075 1766 -173 -349 -894 -932 702 2141 269 -2323
3308 -2323 -973 2049 1313 -1070 -682 769 30 -868 606 984 -299 -819 548 808 -823 -26 1759
3325 1759 374 -1987 -820 2097 2013 -645 -1298 247 547 775 1315 256 -2224 -988 2522 2843 -1119
3342 -1119 -2885 -312 2030 1281 352 -460 -1750 -735 2043 2440 -960 -2847 -151 2583 1349 -1082
3358 -1082 -698 164 -352 491 1427 -114 -1714 -220 1739 366 -1306 -247 1124 -207 -1418 233
3374 233 1492 216 -1040 39 150 -429 792 1516 -365 -2357 -252 3019 1465 -1893 -1559 213
3390 213 1199 827 807 -762 -2167 -375 3174 1773 -1891 -2558 551 2388 831 -568 -709 -886 -75
3407 -75 1729 1478 -1278 -2164 636 2401 622 -1056 170 660 -212 -41 1146 560 -930 -237 1158
$$ packed form
3292a820j21L648J488l181l241J705L597l09j939j76n45l8J634J439j872k592
3308b323J350L022p36k383L88J451p39q98J474L78j283n20J367K60j631P97J785
3325A759j385k361J167K917q4k658o53J545L00K28N40j059k480J236L510L21l962
3342a119j766K573K342p49r29q12j290J015K778L97l400j887K696K734j234k431
3358a082L84Q62n16Q43R36j541j600J494J959j373j672J059J371j331j211J651
3374B33J259j276j256J079J11n79J221P24j881j992K105L271j554l358L34J772
3390B13R86l72k0j569j405J792L549j401l664o67L109J837j557j399j41j77Q11
3407g5J804k51k756q86K800J765j779j678J226M90q72J71J187n86j490O93J395
$$ plain form
3424 1158 34 -801 1109 1251 -950 -1701 839 2132 224 -1413 -651 375 311 683 821 -1152 -2426
3441 -2426 545 3167 689 -2734 -1896 1216 1421 522 -205 -1148 -1444 496 2970 752 -2344 -1974 1673
3458 1673 2258 20 -989 22 -52 108 1561 905 -1179 -1138 1047 1640 -348 -844 921 566 -665
3475 -665 -329 1188 1070 -510 -562 449 -168 -179 1264 587 -1550 -1864 1356 2168 -666 -2038 -763 800
3493 800 711 406 12 -1856 -1407 1642 2744 -179 -2705 -998 2016 1665 78 -475 -640 -566 1174 2380
3511 2380 109 -1910 -522 2028 2027 -472 -335 636 636 180 1132 1072 -624 -674 1032 957 -755 -158 1396
3530 1396 325 -1688 -544 1471 971 -1027 -1574 30 47 325 921 -165 -2142 -1233 1996 1943 -1323
3547 -1323 -2472 -462 1403 582 103 -843 -1848 -872 1796 2123 -727 -2587 -145 2468 960 -427
$$ packed form
3424A158j124q35J910J42k201p51K540J293j908j637P62J026o4L72J38j973j274
3441b426K971K622k478l423Q38L112K05q99p27r43k96J940K474k218l096L70L647
3458A673N85k238j009J011p4J60J453o56k084M1K185N93j988m96J765l55j231
3475f65L36J517j18j580n2J011o17j1J443o77k137l14L220Q12k834j372J275J563
3493H00q9l05l94j868M49L049J102k923k526J707L014l51j587n53j65P4J740J206
3511B380k271k019J388K550jk499J37R71%m56R52o0j696n0J706p5j712N97J554
3530A396j071k013J144K015n00j998n47J604J7K78N96j086j977R09L229n3l266
3547a323j149K010J865q21m79r46j005R76K668L27k850j860K442K613j508j387
$$ plain form
3563 -427 -209 -9 167 1113 1683 23 -1571 430 2079 607 -949 -103 713 -108 -770 154 987 -487
3581 -487 -690 377 86 -842 414 1037 -333 -2177 -522 1869 943 -1421 -1392 302 589 560 426 -849
3599 -849 -2082 -78 2608 1162 -1668 -2116 695 2287 819 -320 -619 -701 407 2100 1529 -1303
3615 -1303 -1874 1111 2598 535 -852 248 356 175 381 1163 -296 -1299 161 1226 -70 -1067
3631 -1067 372 841 -1044 -1604 387 1277 -203 -1464 -726 -45 -336 530 437 -1790 -2188 433 2310
3648 2310 435 -2301 -1283 1011 1323 498 -164 -1128 -1458 734 2622 780 -2317 -1787 1544 2033 -35
3665 -35 -667 -324 -162 566 1722 1059 -1198 -1120 1674 1560 -316 -909 455 562 -470 -153 1066 176
3683 176 -715 -410 444 -273 -579 624 636 -1269 -1409 1086 1826 -688 -1572 -377 906 783 781 150 -1545
$$ packed form
3563d27K18K00J76R46N70j660j594K001J649j472j556Q46Q16q21o62R24Q33j474
3581d87k03J067k91r28J256O23j370j844J655K391r26k364K9J694K87k9j34j275
3599h49j233K004K686j446k830m48K811J592j468j139k99q2J108J693n71k832
3615a303n71K985J487k063j387J100J08j81K06P82j459j003J460J065j296r97
3631a067J439M69j885n60J991Q90j480j261P38O81k91Q66r3k227l98K621J877
3648B310j875k736J018K294L12q25o62r64l30K192J888j842l097N30L331M89k068
3665c5o32L43J62P28J156o63k257P8K794j14j876n93J364J07j032L17J219q90
3683A76q91L05Q54p17l06J203J2j905j40K495P40k514q84J195J283j23ko31j695
$$ plain form
3702 -1545 -1275 1457 2529 -143 -2493 -513 1771 1333 -222 -444 -856 -720 1298 2257 32 -2429
3718 -2429 -828 1825 1512 -735 -601 176 20 -14 779 519 -1183 -873 910 897 -848 -664 690 174
3736 174 -1247 -434 1190 637 -850 -426 158 96 100 1007 -146 -1767 -988 1896 1926 -1315 -1926 174 1370
3755 1370 515 213 -236 -1097 -374 2006 1906 -971 -2283 331 2425 970 -735 -510 -206 -235 1176
3772 1176 1498 -454 -1904 30 1766 651 -1140 -315 926 194 -323 428 845 -274 -424 455 655
3789 655 -697 281 1201 -232 -1112 -9 2157 752 -1248 -759 575 594 643 773 -632 -1576 51 2563
3807 2563 1544 -1749 -1682 772 1833 764 -476 -705 -790 -48 2080 1286 -1593 -1999 1016 2250 210
3824 210 -1195 -234 265 84 516 692 -502 -1277 454 1428 138 -949 499 1098 -284 -666 847
$$ packed form
3702a545K70K732J072k672k350J980K284m38j555k22m12J36K018R59k225k461
3718b429J601K653l13k247J34P77j56l4P93k60j702L10J783j3j745J84J354n16
3736A74j421Q13J624n53j487M24N84o2MR07j153j621P79K884L0l241o11K100J196
3755A370q55l02m49q61P23K380j00k877j312K614K094j455j705K25L04k9J411
3772A176L22j952j450J934J736j115j791Q25J241p32n17P51M17j119j50Q79K00
3789F55j352R78R20j433q80J103K166j405k000M89J334J9M9J30j405r44J627K512
3807B563j019l293O7K454J061j069j240k29q5P42K128p94k879m06L015J234k040
3824B10j405R61M99j81M32J76j194p75J731R74j290j087J448N99j382l82J513
$$ plain form
3841 847 1452 -101 -550 421 253 76 871 954 -698 -1313 857 2143 226 -1800 -829 1015 1007 692 311
3860 311 -700 -1243 538 2773 970 -2046 -1092 1487 2081 307 -576 -496 -211 407 1704 732 -1375
3877 -1375 -1186 1407 1393 -540 -972 420 654 -310 249 813 156 -654 596 981 -116 -394 806 992
3895 992 -871 -855 902 1673 -212 -1098 -50 477 364 597 265 -1305 -1136 1285 2087 -255 -1999 -688
3913 -688 1701 1349 58 -573 -673 -700 1040 2181 -80 -2197 -512 2004 1462 -516 -831 -41 138
3930 138 602 1126 176 -1199 -555 1086 1000 -638 -689 822 443 -538 54 1036 569 -492 -75 441 48
3949 48 143 946 327 -1223 -728 1622 1596 -1036 -1552 141 1024 884 409 -301 -1083 -387 1976 2125 -685
3968 -685 -1790 278 2293 998 -245 -349 -58 -55 1204 1588 -514 -1872 99 1899 734 -1166 -666
$$ packed form
3841H47O05j553m49R71j68j77P95Q3j652o15K170J286j917k026R71J844ql15l81
3860C11j011n43J781K235j803l016R54K579N94j774q83Q0K85O18J297r72k107
3877a375J89K593j4j933m32J392K34r64N59N64o57q10J250L85j097k78J200J86
3895I92j863J6J757P71j885q86J048N27j13K33l32j570J69K421Q02k342j744J311
3913f88K389l52j291o31j00k7J740J141k261k117J685K516n42j978l15P90J79
3930A38M64N24r50j375O44J641q6j638n1J511l79r81N92R82m67j061M17N16l93
3949D8R5Q03o19j550M95K350k6k632n16J693Q83j40m75p10p82O96K363J49k810
3968f85j105K068K015j295j243j04K91LJ259L84k102j358J971J800j165j900N00
$$ plain form
3985 -666 671 35 -137 461 472 -441 -293 827 472 -820 -42 696 74 -1172 -395 1292 177 -916
4003 -916 -613 181 67 330 553 -379 -1386 -86 2130 1485 -1452 -1530 705 1817 790 -60 -428 -545
4021 -545 435 2208 1255 -1397 -1416 849 2176 417 -955 -251 17 377 742 1006 -719 -1308 283 1562
4039 1562 -36 -1278 -134 578 -519 -605 380 697 -750 -357 362 384 -364 470 761 -306 -1240 501
4057 501 1942 423 -1487 -669 793 967 673 250 -661 -1023 785 2374 871 -1739 -1027 1555 1955
4074 1955 657 -188 -200 -221 836 1894 796 -1444 -1107 1300 1266 -271 -1144 -405 -153 -370 20 336
4092 336 -654 -1063 240 909 -336 -781 620 685 -584 -996 930 870 -595 -860 133 -77 46 632 643
4111 643 -937 -1146 1197 2209 -217 -1818 -452 1304 1450 444 280 -482 -459 1547 2147 172 -1904
$$ packed form
3985f66J337o36j72N98J1r13J48J120l55j292P78P38o22j246P77J687j115j093
4003i16L03P94j14K63K23r32j007J300K216o45k937p8K235J112j027q50l68j17
4021e45R80J773r53k652j9K265J327j759j372P04K68L60L65K64j725n89J591J279
4039A562j598j242J144P12j097q6R85L17j447L93P19K2p48Q34K91j067r34J741
4057E01J441j519j910Q18J462J74k94m23r11l62J808J589j503k610P12K582M00
4074A955j298q45j2k1J057J058j098k240L37K407l4j537q73P39K52k17L90L16
4092C36r90m09J303O69j245m45J401O5j269m12J926o0j465k65R93k10J23N86J1
4111F43j580k09K343J012k426j601J366J756J46j006j64p62K3K006O00j975k076
$$ plain form
4128 -1904 -525 1768 1504 -445 -733 -177 -81 460 1026 44 -1495 -516 1354 906 -735 -644 378 498
4146 498 -158 89 747 39 -938 203 670 -390 -154 703 196 -1000 -647 1393 1399 -732 -1134 121 1085
4165 1085 701 479 58 -1082 -594 1738 1644 -720 -1907 -165 1671 853 -342 -509 -468 -147 1055 1504
4183 1504 -666 -1778 31 1851 719 -1080 -773 220 227 88 475 -80 -1129 -646 1052 314 -880
4200 -880 -523 428 149 -952 -4 939 3 -765 -118 461 211 306 714 -11 -1147 -47 1830 1083 -1244
4219 -1244 -1344 505 1155 396 51 -634 -901 145 2035 1354 -1317 -1818 789 2020 390 -694 -719
4236 -719 -184 -196 863 731 -853 -1369 292 1527 -48 -999 -246 547 -63 -451 447 -8 -766 -278 652
4255 652 410 -561 13 908 -413 -1320 250 1251 152 -1141 -741 405 411 374 298 -721 -1136 551 1867
$$ packed form
4128a904J379K293k64j949k88N56R6N41N66r82j539R79J870m48j641R1J022J20
4146D98o56K47O58p08r77J141M67j060K36Q57n07j196L53K040Ok131m02J255R64
4165A085l84k22m21j140M88K332r4k364j187J742J836q18j195j67M1L21J202M49
4183A504k170j112J809J820j132j799L07R93Pj39L87n55j049M83J698p38j194
4200h80L57R51k79j101R48R43r36p68O47N79k50R5M08p25j136J100J877p47k327
4219a244j00J849O50p59l45o85k67J046J890o81k671n01K607J231j630j084k5
4236g19N35j2J059j32j584n16J661J235j575r51P53P93o10l88Q98m55p58M88R30
4255F52k42r71N74Q95j321r07J570J001j099j293M00J146Ol7p6j019m15J687J316
$$ plain form
4274 1867 418 -1780 -1364 937 1249 287 -722 -947 -725 420 1171 451 -1999 -1496 955 1491 -324
4291 -324 -1249 -302 136 182 614 573 -703 -898 436 1175 -225 -963 306 574 -876 -715 717 525 -524
4310 -524 -732 172 276 -509 188 691 -880 -924 619 1517 -84 -1573 -362 513 802 -19 -363 -1082 -1080
4329 -1080 656 1629 -227 -2308 -920 1273 1172 -492 -1339 -242 -372 387 1153 -38 -1590 -796 1270
4346 1270 1019 -451 -1070 383 297 -292 -2 444 -630 -1132 -124 481 -538 -439 447 241 -1057 -703
4364 -703 951 871 -1075 -1199 -37 286 -154 272 -75 -1250 -821 1158 1467 -932 -2128 -363 1253
4381 1253 717 -523 -775 -741 -485 1085 1257 -779 -2284 -374 1766 1052 -952 -963 -23 190 375 996
4399 996 57 -1295 -334 1019 752 -989 -502 620 35 -683 -148 370 -59 -678 -275 356 -366 -163 738
$$ packed form
4274A867j449k198M16K301L12r62j009k25K22J145P51p20k450N03K451N36j815
4291c24r25R47M38M6M32m1j276j95J334P39j400p38J269K68j450J61J432j92j049
4310e24k08R04J04p85O97N03j571m4J543Q98j601j489J211Q75K89q21l44p19K
4329a080J736R73j856k081J388K193j01j664q47J097j30P59P66j191j552P94K066
4346A270k51j470o19J453q6n89K90M46j074n02J008O05j019R9Q86k06j298L54
4364g03J654q0j946j24J162L23m40M26l47j175M29J979L09k399j196J765J616
4381A253n36j240k52L4K56J570J72k036j505J910K140p14k004j1R40K13J85O21
4399I96r39j352R61J353k67j741M87J122n85p18N35N18m29o19M03O31p22K03R01
$$ plain form
4418 738 -155 -1160 -336 1396 853 -1125 -1364 534 1058 292 -40 -302 -897 -192 1386 881 -1393 -1909
4436 -1909 166 1271 319 -960 -1090 -508 -292 639 705 -1079 -2104 128 1577 106 -1219 -527 406
4453 406 -42 -73 188 -135 -868 -342 491 -93 -773 -390 654 -133 -1102 20 813 -200 -1151 -389 375
4472 375 108 280 343 -449 -1062 207 1951 783 -1776 -1144 1180 1236 140 -617 -775 -712 349 1229 399
4491 399 -1868 -1754 438 1275 -330 -1146 -655 -108 -5 470 450 -1102 -1030 747 1364 -180 -1019 -113 638
4510 638 -646 -545 157 122 -1090 -639 308 -242 -704 -73 417 -568 -858 741 1460 88 -1110 -172 903
4529 903 731 436 -53 -752 -750 691 1471 -407 -2112 -1154 950 890 -496 -970 -564 -349 235 869 -60
4548 -60 -2013 -986 923 866 -699 -1114 -91 58 -129 -87 124 -733 -1136 278 665 -670 -810 469
$$ packed form
4418G38q93j005Q24J732n43j978k39J898N24p66l32k62n95P05J578n05k274n16
4436a909K075J105r52j279j30N82K16R31O6j784j025K232J449j471j325O92R33
4453D06m48l1K61l23p33N26Q33n84o80L83J044p87r69J122P93j013r51P62P64
4472C75k67J72O3p92o13J269J744j168k559O32K324N6j096p57j58O3J061Q80q30
4491C99k267J14K192Q37j605q16M91N47J03M75k0j552P2J777O17j544q39R06P51
4510F38j284J01P02l5j212M51R47n50m62O31M90r85k90J599P19j372j198R38J075
4529I03j72k95m89o99KJ441P80j878j705R58K104o0j386m74M06K15N84O34r29
4548f0j953J027J909n7j565m15J023J49j87M2K11q57m03J414L87j335j40J279
$$ plain form
4566 469 487 -563 -489 890 634 -694 -470 433 434 320 330 153 -770 -635 1495 1572 -627 -1356 110 1272
4586 1272 775 -269 -482 -630 -254 791 1382 -749 -2095 -648 1301 503 -1047 -1522 -335 -162 448
4603 448 388 -517 -1267 -354 1188 858 -1011 -549 490 287 -464 220 494 -406 -636 -3 95 -580 -324 376
4623 376 137 -936 -585 1230 365 -823 -873 363 705 396 58 -60 -875 -119 1164 1033 -1392 -1882
4641 -1882 -23 1173 -74 -1225 -1016 -781 -358 759 360 -1178 -1789 262 1497 293 -1218 -498
4657 -498 502 337 183 227 -53 -960 -138 944 242 -1085 -469 597 6 -600 393 801 79 -675 -7
4676 -7 461 403 140 718 -342 -947 162 1617 488 -1305 -1034 498 889 -144 -430 -731 -633 35 1174
4695 1174 338 -1596 -1452 723 1493 -230 -1151 -478 216 275 516 130 -1164 -1194 576 1282 -259 -1314
$$ packed form
4566D69J8j050P4J379k56j328K24R03Jj14J0j77r23J35K130P7k199p29J466J162
4586A272m97j044k13j48L76J045N91k131j346J447J949p98j550m75J187J73O10
4603D48o0r05p50R13J542l30j869M62J039k03p51O84K74r00k30O33R8o75K56P00
4623C76k39j073L51J815q65j188n0J236L42l09l38j18q15P56J283j31k425m90
4641a882J859J196j247j151K09K35M23J117l99j538o11K051J235j204j511P20
4657d98J000j65j54M4k80r07Q22J082p02j327O16J066n91o06R93M08p22p54O68
4676gM68n8k63N78j060o05J109J455j129j793K71J532L91j033k86l01R8O68J139
4695A174q36j934J44K175P70j723r21O73O94N9K41l86j294l0J770P06j541j055
$$ plain form
4713 -1314 -257 527 154 -225 381 136 -484 -21 1116 15 -439 368 487 -248 -911 384 1014 -147
4731 -147 -1217 -463 476 143 69 67 -638 -768 805 1591 125 -1640 -635 1298 1102 -308 -548 -647 -140
4750 -140 803 1155 -251 -1798 -907 1307 1093 -602 -1157 151 663 250 435 350 -722 -553 842 1101
4768 1101 -207 -659 511 600 -507 -291 277 270 -524 -689 464 290 -413 251 234 -867 -622 908 1069
4787 1069 -536 -1309 -126 1024 585 -155 -276 -772 -388 1037 1262 -706 -1884 -450 1437 872 -887
4804 -887 -930 -124 345 633 767 -69 -1306 -278 1598 858 -991 -774 521 385 -107 87 147 -502 -452
4823 -452 333 496 -482 -402 471 320 -896 -224 1388 592 -653 -726 452 589 74 242 -106 -836 -356
4842 -356 1282 857 -939 -1766 286 1468 460 -307 -350 -86 403 1306 1052 -753 -1445 649 1941 182
$$ packed form
4713a314J057P84l73l79O06k45o20M63J137j101m54Q07J19p35o63J295O30j161
4731a47j070P54R39l33p4kp05j30J573P86j466j765J005J933j96j410k40r9N07
4750a40R43L52j406j547Q91K214k14j695n55J308N12m13J85q5j072J69J395K59
4768A101j308m52J170Q9j107K16N68pp94j65J153j74p03O64j7j101K45J530J61
4787A069j605p73J183J150m39p40j21m96L84J425K25j968j178J434J887n65j759
4804h87m3Q06M69K88J34q36j237J028J876p40j849K17J295j36m92J94O0o49N0
4823d52P85J63r78Q0Q73j51j216O72J612p96j245p3J178J37n15J68l48p30M80
4842c56J638m25j796q27K052J182j008p67m3K64M89R03k54j805o92K094J292j759
$$ plain form
4860 182 -942 -560 388 301 -29 472 -442 -962 -156 1177 202 -975 -471 814 233 -513 136 355 -162
4879 -162 -617 234 309 -95 46 305 -38 -1056 -47 1116 96 -1177 -663 613 840 -6 -410 -493 -831
4898 -831 256 1605 649 -1330 -1160 1026 1481 75 -815 -322 247 319 792 588 -1069 -1173 661 1556
4916 1556 -224 -1055 -154 594 29 -88 386 -95 -752 167 903 313 -582 292 775 -90 -334 619 947
4935 947 196 -681 186 427 244 82 96 -592 -535 263 1396 -219 -1579 -597 1445 967 -456 -555 -426
4954 -426 -359 427 1506 91 -1403 -573 1455 1305 -545 -1178 -264 251 318 390 -4 -1058 -688 585 1064
4973 1064 -232 -993 447 628 -458 -168 574 128 -280 -330 521 217 42 583 762 -324 -567 957
4991 957 1126 -466 -1145 -16 951 349 -213 -223 -765 -645 794 1044 -746 -1976 -345 1395 753 -616
$$ packed form
4860A82j124L82R48q7l30N01r14n20Q06J333r75j177N04J285n81p46O49K19n17
4879a62m55Q51P5m04J41K59l43j018J009J163j020j273N14J276K27q46m04q3l38
4898h31J087J349r56j979J70K186M55j406q90M93N69P2M73k04j657j04J834Q95
4916A556j780q31R01P48n65j17M74m81o57R19P36n90q95Q74M83q65k44R53L28
4935I47p51q77Q67K41j83j62J4o88N7P98J133j615j360R82K042m78j423r9J29
4954d26O7P86J079j415j494Q30K028j50j850o33R14N15O7P2l94j054L70J273M79
4973A064j296p61J440J81j086K90P42m46m08n0Q51l04j75N41J79j086k43J524
4991I57J69j592o79J129R67o02n62j0n42J20J439K50j790j230J631J740o42j369
$$ plain form
5009 -616 -725 -25 261 724 1383 -167 -1270 18 1451 890 -790 -1009 122 434 104 205 228 -398
5027 -398 -213 804 613 -424 -502 942 719 -161 156 1057 788 -181 -206 774 439 49 446 165 -935
5046 -935 -397 915 645 -1490 -1449 90 1025 -57 -673 -580 -303 165 963 1085 -756 -1249 281 1826
5064 1826 548 -903 -603 22 129 220 427 -772 -1270 -83 1161 606 -1057 -425 535 456 -231 566
5082 566 744 -64 -13 777 768 -47 68 596 46 -609 81 977 447 -1273 -573 470 433 -235 7 -403 -874
5103 -874 55 1336 532 -1277 -1353 1061 1401 302 -927 -552 5 368 737 401 -1015 -1129 870 1828
5121 1828 219 -813 -90 824 541 512 272 130 -428 83 952 155 -743 64 786 -117 -560 407 981
5140 981 -77 -443 565 442 -45 154 268 -545 -574 683 1165 -42 -1723 -1036 819 445 -564 -780
$$ packed form
5009f16j09P00K86M63O59j550j103J288J433n61j680k19J131L12l30J01K3o26
5027c98J85J017j91j037p8J444k23q80L17R01k69r69k5R80l35l90L97k81j100
5046i35N38J312k70k135M1J539R35j082o16R3K77M68P98J22j841m93J530J545
5064A826j278j451L00O25J07R1K07j199m98J187J244n55j663O32R60p9o87P97
5082E66J78q08N1P90rq15J15N28n50o55O90Q96n30j720P00J043l7o68K42m10m71
5103h74R29J281q04j809p6K414L40j099j229L75N57L63L69l36j416j14J999R58
5121A828j609j032P23R14k83k9k40j42n58N11Q69p97q98Q07P22r03m43R67N74
5140I81j058l66J008j23m87J99J14q13k9J257M82j207j681O87J855l74j009k16
$$ plain form
5158 -780 -729 -676 464 1169 -156 -1656 -632 1478 1423 -337 -848 -152 334 854 766 233 -1006 -606 1110
5177 1110 1099 -871 -968 38 657 -54 -39 195 155 -462 63 896 80 -187 675 703 22 -500 633 1109
5197 1109 -587 -854 -20 370 -97 -363 -236 -693 -500 815 1189 -352 -1469 46 1570 1122 -777
5214 -777 -513 -213 130 793 909 -234 -1554 -94 1515 768 -966 -1000 207 457 -43 312 177 -414
5232 -414 -297 943 879 -679 -471 430 654 -596 -394 492 172 -851 -411 411 -132 -368 226 6 -741
5251 -741 -374 1088 781 -1018 -998 260 1052 184 -395 -491 -333 -162 987 661 -1086 -1592 130 1628
5269 1628 488 -898 -719 -127 226 677 569 -234 -987 385 1538 648 -1020 -797 693 228 -102 80
5287 80 107 -615 -430 296 335 -780 -482 707 354 -521 -21 1014 507 -786 -431 814 700 -121 256
$$ packed form
5158g80N1N3J140P05j325j500J024K110n5j760n11O96M86N20q8n33j239M00J716
5177A110j1j970r7J006O19p11J5K34m0o17N25Q33q16k67Q62K8o81n22J133M76
5197A109j696k67Q34L90m67k66J27m57J93J315L74j541j117J515J524m48j899
5214g77K64L00L43O63J16j143j320J460J609p47j734l4J207K50n00L55j35n91
5232d14J17J240o4j558K08R01K24j250K02Q86l20j023M40Q22n43k36N94k20p47
5251g41L67J462l07j799K0J258P92q68n79r6J58J71J149l26j747n06J722J498
5269A628j140j386J79N92L53M51j08q03p53J372J153q90j668K23J490m65l30J82
5287H0K7p22J85P26L9j115K98J189l53q75N00J035n07j293L55J245j14q21L77
$$ plain form
5306 256 -166 -794 175 1151 483 -1471 -1142 817 1220 125 -762 -598 -315 415 804 473 -1211 -1239 517
5325 517 1529 -350 -1248 -536 323 197 147 45 -604 -646 85 936 -156 -1169 -237 554 185 -710 164
5344 164 320 -470 -497 115 80 -271 -275 170 -305 -690 154 1021 -16 -1081 -369 698 515 -105 55 -381
5364 -381 -621 781 1333 -5 -1486 -882 1128 841 -742 -1143 -402 -70 176 553 -264 -1375 -747 990
5382 990 908 -635 -1125 254 720 142 42 61 -303 -409 495 425 -190 -801 209 329 -327 -719 211 598
5402 598 -795 -920 -57 405 -66 -332 -182 -433 -283 846 1107 -549 -1478 -235 1470 697 -790 -623
5420 -623 -445 95 652 709 -478 -1732 -481 1311 388 -1196 -1196 -27 294 83 327 -393 -1005 -106 1286
5439 1286 852 -639 -592 564 643 -217 -101 554 -399 -686 -153 151 -451 -640 191 -61 -652 -436 849
$$ packed form
5306B56m22o28R69R76o68j954L29J959M03j095q87J64K83P30L89l31j684k8J756
5325E17J012j879q98P12Q59j26n0j02o49m2P31Q51j092j013R32P91l69q95Q74
5344A64J56p90k7O12l5l51mM45m75l85Q44Q67j037j065P12J067j83o20J60m36
5364c81k40J402N52j338j481O04K010k87j583m01P41L32K46L77q17j111O28J737
5382I90q2j543m90J379M66n78j00J9l64j06R04p0o15o11J010J20o56l92R30L87
5402E98j393j25Q63M62m71k66J50k51J50J129K61j656r29J243J705p73j487J67
5420f23J78N40N57N7j187j254J251J792r23j584%J169L21k11K44p20o12Q99J392
5439A286m34j491M7J156P9q60J16O55r53k87N33L04o02j89Q31k52n91K16J285
$$ plain form
5458 849 504 -803 -868 340 802 337 52 -263 -491 -52 1033 828 -767 -1515 454 1132 225 -995
5476 -995 -715 135 -30 438 477 -710 -1302 268 1363 364 -1032 -405 605 635 63 144 79 -516 69 533
5496 533 584 -761 -510 440 28 -890 -290 445 -192 -945 -517 143 -52 -264 128 -340 -926 -198 803 359
5516 359 -1510 -1184 812 1030 -24 -827 -483 -195 315 1062 571 -1152 -1242 713 1454 -123 -1232 -394
5534 -394 480 488 3 288 -721 -843 547 1177 40 -907 -107 703 368 53 269 307 -260 -164 401 326 -753
5555 -753 -380 220 -138 -1052 228 427 -211 -1230 -352 469 250 -216 -170 -172 -163 440 1244 460 -1250 -422 1162
5576 1162 1138 -172 -869 -413 170 296 495 -471 -1344 -817 1008 982 -288 -1114 -11 953 85 372 535
5595 535 -195 -289 699 669 -477 -898 187 510 -399 -789 60 258 -690 -1038 -41 66 -411 -182 99 -559
$$ packed form
5458H49l45j307o5J208M62m65k85l15k28M39J085k05j595p48J969O78r07j220
5476i95K80Q50j65M68L9j187n92J570J095r99j396O27J010L0n72Q1o5n95N85M64
5496E33N1j345K51R50m12r18O00P35o37p53M28O60j95k12L92m68n86P28J001m44
5516C59j869L26J996K18j054q03L44K88N10P47m91j723r0J955P41j577j109Q38
5534c94Q74Qm85K85j009j22J390O30j137r47Q00Q10l35l15K16L8n67R6N65p5j079
5555g53L73O00l58r14J280J99o38j019Q78Q21k19m66M6kRO03Q04p84j710Q28J584
5576A162k4j310o97M56N83J26J99r66q73N27J825k6j270q26J103R64q68K87J63
5595E35p30r4R88l0j146m21J085L23r09l90Q49J98r48l48R97J07m77K29K81o58
$$ plain form
5615 -559 -489 682 803 -400 -1131 230 1257 475 -325 -520 -383 -177 577 817 -414 -1599 -26 1358
5633 1358 764 -923 -803 367 580 648 675 -221 -715 -12 1316 809 -536 -921 443 690 -215 -242 151
5652 151 -283 -344 267 506 -82 -536 338 238 -463 -432 734 448 -982 -1092 319 690 -415 -581 -436
5671 -436 -514 -125 910 837 -961 -1334 356 1335 361 -585 -453 78 428 651 529 -732 -1047 -126 1305
5690 1305 210 -1513 -759 119 603 -163 70 -344 -862 3 1171 488 -514 -287 731 439 -328 -109
5708 -109 419 -170 -758 11 287 -424 -663 -16 -370 -752 -186 779 278 -1083 -529 1001 1121 -73 -495
5727 -495 116 -89 511 1207 386 -1151 -1051 894 1452 -93 -1307 -462 144 580 506 206 -713 -844 663
5746 663 1243 95 -1233 -80 811 428 -370 185 -197 -389 -65 380 -106 -858 -278 704 159 -614 425
$$ packed form
5615e59P0J171J21j203p31J361J027p82q00j95J37K06P54K40j231j185J573J384
5633A358n94j687J20J170K13O8K7q96m94P03J328n07j345l85J364K47r05k7L93
5652A51m34o1O11K39n88m54Q74j00p01L1J166k86j430j10J411L71j105j66J45
5671d36p8L89J035p3j798l73J690R79r74r46J32N31L50K23j22j261l15R21J431
5690A305j095j723P54Q78M84p66K33m14n18Q65J168o83j002K27J018k92p67K19
5708a09N28n89n88P69K76p11k39O47l54l82N66R65n01j361N54J530J20j194m22
5727d95O11k05O00O96q21j537J00J945N58j545j214Q45O06M36p4l00r19j31J507
5746F63N80j148j328J153Q91l83p98N55l82j92L24M45m86p52N80R82n45p73J039
$$ plain form
5765 425 984 117 -816 -77 799 286 -100 177 -158 -458 110 1020 -301 -1447 -838 981 563 -489 -901
5784 -901 -190 -19 356 971 -62 -1115 -645 1272 1176 -618 -1398 -87 369 426 -34 -37 -726 -653 510 910
5804 910 -454 -1035 -12 557 -225 -360 443 579 -321 102 679 290 -393 304 413 -238 -533 709 879
5823 879 -722 -1113 49 1004 129 -310 -178 -165 -252 637 986 -398 -1511 -136 1521 672 -600 -769
5841 -769 16 536 640 458 -288 -1002 -122 1195 892 -809 -1041 425 568 41 -1 185 -279 -398 390
5860 390 494 -454 -634 501 568 -534 -305 495 476 -489 -362 486 726 4 -240 96 -492 -317 669 509
5880 509 -809 -1142 176 975 260 -783 -390 -240 175 891 654 -581 -1207 558 1536 515 -948 -513
5898 -513 476 685 186 97 -284 -743 145 941 309 -908 -669 616 387 -542 -84 128 92 -227 371 580
$$ packed form
5765D25N59q67r33P39Q76n13l86K77l35l00N68R10j321j146O09J819m18j052m12
5784i01P11J71L75O15j033j053M70J917r6j794p80J311M56N7m60lo89P3J163M00
5804I10j364n81J023N69p82j35Q03J36r00M23N77l89o83O97J09o51k95J242J70
5823H79j601l91J162R55q75m39J32J3q7Q89L49j384j113J375J657q49j272j69
5841g69P85N20J04j82p46p14Q80J317l03j701k32J466J43n27m2J86m64j19P88
5860C90J04r48j80J135O7j102K29Q00j9r65J27Q48K40p22k44L36n88J75R86j60
5880E09j318l33J318P99p15j043L93J50M15P16k37j235o26J765R78j021j463M35
5898e13R89K09m99q9l81m59Q88P96o32j217K39J285k29r29M58K12l6l19N98K09
$$ plain form
5918 580 43 -120 322 362 -504 116 1119 282 -520 -420 862 873 -213 -412 -403 -522 48 837 296 -1040
5938 -1040 -1138 672 1393 4 -1020 -408 338 1019 456 169 -705 -466 729 1151 130 -1076 -336 574
5956 574 493 -151 -262 -203 -710 38 537 -295 -882 -387 621 22 -601 102 549 -291 -383 99 815 340 -102
5977 -102 401 -32 -466 363 885 40 -1141 -606 1061 648 -578 -661 -129 132 513 967 237 -990 -400
5996 -400 1359 1371 -128 -862 150 772 753 291 -63 -649 -284 710 866 -558 -1106 -295 660 -91 -608
6015 -608 -152 -97 -399 -63 514 50 -482 279 605 10 -434 409 987 -233 -790 54 1115 303 -381 -149
6035 -149 -280 -129 488 884 -360 -1183 100 1594 771 -556 -607 156 464 425 686 -376 -1116 -68 1272
6054 1272 671 -928 -847 246 751 -69 -208 -104 -517 -203 226 80 -498 -917 91 582 -466 -489 174
$$ packed form
5918E80n37j63M42M0q66O20J003q37q02J00J282J1j086j99Rj19N70P89n41j336
5938a040r8J810P21j389j024O12P46O81n63k87q74K39J195M22j021j206P40R10
5956E74q1o44j11N9n07P48M99q32n87M95J008n99o23P03M47q40r2M82P16m75m42
5977a02N03m33m34Q29N22q45j181N35J667m13j226q3N32K61L81M54p30j227N90
5996d00J759J2j499p34J012O22j9m62l54n86L65R94J56j424n48Q11R55p51n17
6015f08M56N5l02L36N77m64n32P61L26n95m44Q43N78j220n57Q44J061q12o84K32
6035a49j31J51O17L96j244q23J283J494q23j327n1P63L08l9K61j062p40J048J340
6054A272o01j599Q1J093N05q20j39J04m13L14M29j46n78m19J008M91j048k3O63
$$ plain form
6073 174 76 -325 -380 536 265 -7 175 457 -258 14 1015 907 -277 -550 654 1155 117 -584 12
6092 12 -128 152 351 411 -656 -1139 468 1122 327 -898 -480 487 602 422 339 -423 -684 421 1159 344
6112 344 -992 -730 386 371 -373 -430 -260 -534 -380 151 120 -385 -272 384 385 -379 301 623 276 -491 -256
6133 -256 879 709 -202 -179 -185 -184 -106 425 114 -1159 -906 645 1056 -134 -1065 -342 547 528 422 217 -794
6154 -794 -729 721 1195 -64 -1222 -354 551 252 -336 -77 -405 -341 208 582 -6 -920 -290 513 370 -286
6174 -286 118 516 -105 -141 302 508 -90 -317 58 -109 -275 227 945 4 -685 -222 1301 618 -326 -323 -85
6195 -85 36 555 824 84 -1151 -460 852 1117 -728 -1107 -225 354 52 233 -230 -906 -573 644 564
6214 564 -364 -1178 126 712 4 -540 -9 181 -532 -90 412 -249 -642 -125 161 -427 -488 174 375 -257
$$ packed form
6073A74r8m01n5R16k71k72J82K82p15K72J001j08j184k73J204N01j038p01N96
6092A2j40K80J99O0j067m83J607O54p95j225M18R67J15j80q3p62k61J105P38q15
6112C44j336K62J116j5p44n7J70k74J54N31l1n05J13O56Jp64O80L22l47p67K35
6133b56J135j70r11K3oJP8N31l11j273K53J551M11j190r31P23Q89j9j06k05j011
6154g94O5J450M74j259j158Q68R05k99n88K59l28O4N49L74n88r14O30Q03j43o56
6174b86M04L98o21l6M43K06n98k27L75j67j66N02P18r41o89M63J523o83r44LK38
6195h5J21N19K69p40j235O91J312K65j845l79Q82N79l02J81m63o76L33J217q0
6214E64r28q14J304N86p08n44N31J90p13M42N02o61l93N17K86n88o1O62K01o32
$$ plain form
6234 -257 -840 171 486 235 -172 168 -129 -76 388 797 -272 -1231 -69 1159 297 -712 -874 -218 -67
6253 -67 239 260 -218 -618 -175 1183 844 -732 -877 94 552 170 -32 -340 -581 -350 696 126 -811 -928
6273 -928 394 621 -282 -449 309 363 -402 174 536 84 -238 -24 154 -196 -327 342 127 -675 -944 219
6293 219 400 -141 -596 -208 -117 93 562 207 -818 -1028 289 1109 -15 -762 -548 427 93 -7 -90 -541
6313 -541 -935 222 661 -44 -1304 -832 488 289 -321 -211 -56 -59 247 675 652 -565 -532 260 -17 -580
6333 -580 -430 188 95 -873 -298 236 -55 -408 -461 -109 -445 -70 712 351 -792 -524 752 1104 -217 -663
6353 -663 -76 176 237 441 -78 -828 -927 397 1039 -346 -1138 -347 675 417 88 -111 -172 -177 134 639 56
6374 56 -913 -38 723 281 -476 -40 154 -644 -351 129 -146 -337 -478 -66 -170 -583 -265 589 -180 -777
$$ packed form
6234b57n83J011L15k51m07L40k97N3M64M09j069r59J162J228q62j009j62O56J51
6253f7L06K1m78m00M43J358l39j576j45R71M58l82k02l08k41K31J046n70r37j17
6273i28J322K27r03j67P58N4p65N76L62m52l22K14J78l50j31O69k15q02k69J163
6293B19J81n41m55L88R1K10M69l55j025k10J317Q20j124p47K14R75l34j00q3m51
6313e41l94J157M39p05j260M72J320j99o10J10J55lL06M28k3j217L3P92k77n63
6333e80J50O18r3r68N75N34k91l53n3L52l36L75P82l61j143K68J276L52j321m46
6353f63N87K52O1K04n19p50r9J324O42j385p92P91J022k58l29j99o1nL11N05n83
6374E6r69Q75P61m42p57M36J94p98K93M80k75j91j41M12j04m13L18Q54p69n97
$$ plain form
6394 -777 -141 562 26 -459 -401 -372 -247 59 462 -117 -913 -362 801 895 -513 -981 -42 442 135 -27
6414 -27 -487 -798 -583 715 700 -800 -1044 102 508 284 -421 -149 -173 -205 315 812 -192 -423 197 402
6434 402 153 -519 26 316 -528 -410 90 171 -226 -300 -63 -146 -120 444 674 -125 -965 146 836 309 -619
6455 -619 -242 14 287 539 454 -453 -966 40 924 450 -901 -884 211 327 -172 -99 -419 -595 -219 488
6475 488 341 -687 -814 473 479 -5 -500 239 108 -390 198 416 80 -539 83 280 -179 -461 366 409
6495 409 -718 -690 164 441 -224 -545 -122 -224 66 653 358 -449 -771 382 1270 224 -838 -396 364
6514 364 323 235 19 -681 -884 82 791 -214 -1157 -621 146 317 -83 -195 -19 -132 175 657 198 -531
6534 -531 -36 688 464 -147 -75 367 48 -153 -16 249 315 -235 90 178 69 -47 499 259 -660 -489 745
$$ packed form
6394g77O36P03n36m85N8K9J25L06M03n79p96N51J163R4j408m68R39M84l07j62
6414b7m60l11K15J298j5j500k44J146M06k24p05K72k4l2N20M97j004k31O20K05
6434D02k49o72N45K90q44J18N00Q1l97p4K37q3K6N64K30p99q40J111O90n27r28
6455f19L77K56K73K52q5r07n13J006Q84m74j351J7J095J16m99P3l20j76L76P07
6475D88j47j028j27J287Om84m95P39j31m98N88K18l36o19O22J97m59k82Q27M3
6495D09j127K8Q54K77o65l21M23j02K90N87k95q07l22J153Q88j046j062M42P60
6514C64m1q8k16p00k03R66P09j005r43N36P67J71m00j12J76j13L07M82m59p29
6534e31M95P24k24o11P2M42l19k01J37K65O6n50L25Q8j09j16N46k40r19J71J234
$$ plain form
6555 745 895 -149 -184 54 259 229 371 -132 -823 -525 468 594 -376 -1152 -296 408 220 -185 -289 -681
6575 -681 -429 348 456 -235 -628 -247 749 226 -138 -23 -7 -7 65 275 96 -250 -136 488 204 -155 -101 485
6597 485 267 -344 33 610 371 -299 -200 115 -118 204 396 -7 -1039 -318 917 558 -441 -755 273
6616 273 471 591 23 -151 -580 -178 1042 542 -530 -745 -132 592 125 -84 -343 -138 -171 247 520 -305
6636 -305 -390 273 786 50 -110 353 494 -48 40 509 485 -206 -6 211 79 -376 495 524 -197 -633 -120
6657 -120 845 156 -255 -183 -12 248 256 692 -186 -1032 63 1049 402 -835 -596 239 418 -2 -229 -270 -542
6678 -542 -118 688 341 -600 -553 351 702 -41 -180 338 153 -147 397 433 -13 -245 263 443 -356 -286 333
6699 333 287 -106 -456 213 311 -167 -60 115 149 197 592 478 -219 -431 746 942 -58 -682 -640 152 465
$$ packed form
6555G45J50j044l5K38K05l0J42n03o91K98R93J26r70p76Q56P04j88m05j04l92
6575f81K52P77J08o91l93L81R96n23l64J15J6%P2K10j79l46J14O24k84l59N4N86
6597D85k18o11L77N77k39o70R9L15k33L22J92m03j032P21J235l59r99l14J028
6616B73J98J20n68j74m29M02J220n00j072k15O13P24m67k09k59K05l3M18K73q25
6636c05q5O63N13p36j60M63J41n42Q8M69k4o91K00K17j32m55Q71K9p21m36N13
6657a20R65o89m11P2J71K60QM36q78q46J095R86o47j237K39Q35J79m20k27m1k72
6678e42M24Q06l47r41M7R04L51p43j39N18j85l00N44L6m46k32N08J80p99P0O19
6699C33m6l93l50O69R8m78J07J75L4M8L95j14o97k12J177J96j000o24M2P92L13
$$ plain form
6720 465 337 242 -327 -507 495 852 199 -943 -300 678 638 -52 99 -78 -191 110 724 198 -710 -704 274
6741 274 401 -473 -82 285 207 -215 131 397 41 -167 300 155 -204 48 446 66 -674 -356 565 238
6761 238 -400 -365 -193 158 328 406 -61 -451 -569 705 955 -252 -659 89 522 285 191 1 -473 -384 281
6782 281 707 -423 -848 21 473 -74 -264 -298 -192 -27 232 264 42 -622 45 439 -133 -177 -82 446 -19
6803 -19 -440 70 432 29 -231 -81 -184 -91 187 517 110 -889 -118 879 246 -298 -398 269 303 329 279 -238
6825 -238 -632 -159 777 626 -562 -682 318 509 17 -1 -199 -404 -279 395 461 -382 -676 318 402 -32
6845 -32 -475 -143 44 -193 -242 164 -200 -659 -142 418 -172 -306 42 275 -207 -563 298 616 -146 -286 -103
6866 -103 102 15 246 425 -486 -706 133 746 71 -561 -631 454 455 124 121 -108 -376 197 889 319 -460 -381
$$ packed form
6720D65j28r5n69j80J002L57o53j142O43R78m0o90J51j77j13L01O14n26r08OR78
6741B74J27q74L91L67p8m22L46K66l56k08M67j45l59K52L98l80p40L18R21l27
6761B38o38L5J72L51J70P8m67l90j18J274K50j207m07P48M33k37r4j90m74Q9O65
6782B81M26j130m25Q69M52n47j90l4J06J65K59L2k22o64O67L94n72m4R5N28m65
6803a9m21N10L62m03k60J50j03R3K78L30m07r99P71R97o33n44j00O67L4K6n0n17
6825b38l94M73R36j51j188j20J000J91m92j8j98k05J25O74O6q43k94R94Q4m34
6845c2m43L32J87k37m9M06l64m59N17N60n90j34L48K33m82l56Q61L18p62j40J83
6866a03K05q7K31J79r11k20Q39O13o75o32p0J085Jl31lk29k68N73O92n70p79P9
$$ plain form
6888 -381 519 461 -173 -132 -63 -202 -242 154 162 -361 -304 60 120 -37 -328 101 182 -319 -129 291 174 -24 -277
6911 -277 176 -101 -4 356 367 -444 -352 378 550 -30 -386 -163 164 46 67 -42 -694 -563 377 1148 -86
6932 -86 -1134 -605 661 484 -171 -346 -323 -42 446 569 -62 -586 -351 254 294 -545 -341 -79 -307 49
6952 49 144 140 -106 -165 222 -4 -41 83 384 192 -176 2 402 300 -99 34 73 -58 174 47 -72 -730
6974 -730 -408 580 817 -538 -677 40 185 111 -136 -61 -360 -87 317 816 -152 -824 -90 556 321 -162
6994 -162 83 -215 -36 160 406 -247 -576 107 332 143 -352 -141 136 -12 -456 96 473 -162 -75 104
7014 104 -17 -119 -15 547 31 -626 -99 525 383 -533 -431 194 -65 149 -57 -111 -639 -328 504 341
7034 341 -583 -774 13 572 85 -407 -49 -122 15 577 511 -88 -541 258 609 182 -295 -36 176 -509 97
$$ packed form
6888c81R00n8o34M1O9j39m0L96Qn23N7L64O0j57k91M29Q1n01J90M20j17j98k53
6911b77M53k77R7L60J1q11R2P30J72n80l56K23L27j18K1j09o52J31R40P71j234
6932h6j048N29J266j77o55j75K3K81M88J23o31n24K35O05M0q39K04K62k28L56
6952D9R5mk46n9L87k26l7J24L01j92l68J78M00j02l99J33L9j31K32j27j19o58
6974g30L22R88K37j355j39P17J45p4k47P5k99K73M04M99r68o72P34O46k35m83
6994a62K45k98J79J96K46o53l29O83K25j89m95K11K77j48m44N52L77o35Q7J79
7014A04j21j02J04N62n16o57N27O24j42r16J02O25k59K14k06n4n28L11Q32j63
7034C41r24j91P87N59m87m92L58p3J37N62o6n99m53P99L51m27m77K59K12o85O06
$$ plain form
7055 97 240 -234 -382 46 76 -123 -428 110 437 -306 -206 266 536 -17 -172 133 177 201 231 405 -479 -463
7077 -463 -70 566 105 -575 -431 41 313 -78 288 -333 -357 262 777 288 -594 -389 398 703 70 1 -202
7098 -202 -113 357 469 169 -471 -555 275 277 -235 -226 155 59 -18 -13 278 85 -158 76 -124 167 -64 169 210 -157
7122 -157 -554 177 496 -99 -295 -266 67 68 -63 86 -274 -333 358 772 -199 -533 -229 445 187 75 -200
7143 -200 -434 -40 378 774 171 -460 -108 488 366 96 102 138 105 33 326 176 -210 -311 341 305 -330 -258
7165 -258 316 -37 -419 -322 258 220 -136 -88 219 22 25 425 195 -531 -100 519 189 -50 -427 -34 293 159
7187 159 -90 -399 -619 -192 803 619 -337 -661 130 614 341 -87 -75 130 -38 205 327 -127 -447 -108
7207 -108 559 32 -448 139 127 117 -129 -16 69 -293 64 195 94 -60 174 287 17 -172 86 571 228
$$ packed form
7055I7J43m74j48M28L0j99l05N38L27p43J00M72K70n53j55L05M4K4L0J74q84J6
7077d63L93O36m61o80J44M72K72l91L66o21k4O19N15m89q82K05P87L05o33o9k03
7098b02Q9M70J12l00o40q4Q30Kn12RL81r6p7NK91j93k43K34k00K91k31K33M1l67
7122a57l97P31L19n95j96K9L33Jj31J49l60n9O91M14r71l34L04O74k58j12k75
7143b00k34L94M18L96o03o31L52N96j22k70OL6l3p2K93j50l86j01O52l6o35P2
7165b58N74l53l82R7N80l8l56M8L07j97LM00k30p26M31O19l30k39l77L93L27j34
7187A59k49l09k20M27R95j84r56l24P91M84k73m28J2K05j68K43J22m54l20L39
7207a08O67n27m80N87j2j0k46J13Q5l62L57J31j01j54K34J13k70j89K58M85l43
$$ plain form
7228 228 -397 -98 105 144 283 171 -94 -510 -59 648 534 -376 -378 52 600 351 -3 -109 -86 170 661
7249 661 271 -422 -626 77 362 46 -296 -231 135 -6 441 577 15 -361 69 460 86 -171 340 -63
7269 -63 129 -110 -63 359 48 -211 181 146 44 32 320 25 -362 163 579 26 -395 -195 235 406 187
7290 187 -30 -402 -238 25 685 173 -743 -304 201 527 -16 -218 -358 -117 -80 414 174 -418 -288 203
7310 203 375 13 -309 264 72 -95 -214 211 193 -201 24 234 132 -262 188 179 -174 -191 248 176 54 -362
7332 -362 -27 144 214 110 -99 -235 -135 408 389 -324 -481 -87 478 231 -86 -205 -401 -267 69 813 -121
7353 -121 -652 -193 351 390 -104 -310 46 -197 -30 48 -153 -431 -119 387 401 -331 -173 578 101 -123 5
7374 5 225 116 -126 -56 154 -168 -229 -52 175 -244 -151 518 386 -387 -594 109 351 23 114 -87 -301 152
$$ packed form
7228B28o25K99K03L9J39j12k65m16M51P07j14r10kM30N48k49l54j06K3K56M91
7249F61l90o93k04P03K85l16l42O5L66j41M47J36n62l76M30L91l74k57N11m03
7269f3J92k39M7M22l11k59L92l5j02j2K88k95l87N25M16n53m21K00M30J71k19
7290A87k17l72J64K63O60n12r16M39N05L26n43k02j40K41L7M94k40n92J30M91
7310B03J72l62l22N73j92j67j19M25j8l94K25K10j02l94M50rl53j7M39p2j22m16
7332c62L35J71P0j04k09j36J00N43j9p13j57L94N65k47l17j19j96J34L36P44r34
7353a21n31M59N44L9m94k06L56k43J67P8k01k78L12N06J4p32J58P51m77k24J28
7374EK20j09k42P0K10l22o1J77K27m19R3O69j32p73k07P03K42l28R1k01k14M53
$$ plain form
7396 152 419 323 -355 -580 110 500 142 -281 -317 -211 -57 269 181 -496 -637 -99 634 59 -363 -242 162
7417 162 152 -51 180 124 -359 -3 208 -67 130 -18 134 -125 -176 39 463 23 -11 -157 128 16 60 84
7439 84 -342 -440 57 552 168 -176 -333 336 125 -31 -94 -154 -302 -63 374 320 -389 -507 47 204 76 -433
7461 -433 -251 -252 -159 208 184 -195 -284 154 297 -72 -160 289 222 -276 -220 15 151 -316 -270 241 -189 -74 74
7484 74 -13 -312 -451 -87 274 45 -420 -136 205 211 7 82 -121 -327 223 285 21 -348 -394 298 497 -64
7506 -64 -120 76 10 81 496 225 -377 -476 373 221 -194 -112 106 284 -60 183 103 -198 -390 131 191 -224 -81
7529 -81 373 313 -424 -99 223 246 -346 -431 227 96 -122 -62 -28 -289 -229 469 356 -197 -343 -189 447 168
7551 168 -56 -107 -436 -35 170 573 -295 -739 2 311 216 -318 -258 13 -83 35 295 190 -324 -92 337
$$ packed form
7396A52K67r6o78k25O90L90l58m23l6J06J54L26q8o77j41N38P33n75m22J21M04
7417A62j0k03K31n6m83L56K11k75J97j48J52k59n1K15M24m40l4j46K85j12M4K4
7439H4m26r8M97M95l84l44j57O69k11j56o3o0j48K39M37n4p09j18N54J57j28n09
7461d33J82jR3L67k4l79q9M38J43l69q8M49o7m98N6K35J36m67M6N11m30J15J48
7484G4q7k99j39L64L61k29m65K84L41Ok04P5k03k06N50O2k64l69m6O92J99n61
7506f4n6J96o6P1M15k71o02r9Q49j52m15Q2K18J78l44K43q0l01j92N21O0m15J43
7529h1M54o0p37L25L22K3n92q5O58j31k18O0L4k61O0O98j13n53j46J54O36k79
7551A68k24n1l29M01K05M03q68m44P41L09r5n34O0K71r6J18K60j05n14K32M29
$$ plain form
7572 337 258 -289 -142 188 97 -65 69 82 -190 -4 58 103 -54 76 340 150 -508 -81 200 172 -251 -349
7594 -349 -96 150 96 121 -5 -200 164 345 562 -194 -110 109 405 137 -58 -211 -211 -113 296 119 -355 -435
7616 -435 211 135 -40 -348 -174 -105 -191 375 156 -95 -505 -101 287 54 -527 97 165 -2 -527 -5 100
7637 100 -207 -354 -49 -33 -90 -21 61 -211 -318 -165 226 -55 -438 -193 231 102 219 -386 -93 -253 6
7658 6 216 6 -540 -571 246 430 24 -70 -120 -44 146 207 183 -266 -391 79 348 21 -213 -131 -16 -139 61
7681 61 5 -99 -326 -125 209 60 -86 -21 133 -362 -113 328 331 -48 -61 -152 179 5 126 -140 -314 -189
7703 -189 107 627 25 -644 124 553 579 160 -91 -69 -85 42 697 231 -729 -328 86 383 -365 -244 -234
7724 -234 81 29 -17 32 -73 -168 139 255 -242 -419 189 212 -195 -193 126 123 13 -111 22 -18 8 288 217 -503
$$ packed form
7572C37p9n47J47L30r1j62J34J3k72J86O2M5j57J30K64j90o58M27K81k8m23r8
7594c49K53K46n4K5j26j95L64J81K17p56Q4K19K96k68j95j53%R8M09j77m74q0
7616d35O46p6j75l08J74O9q6N66k19k51m10M04L88k33n81O24O8j67n25N22J05
7637A00l07j47L05J6n7O9Q2k72j07J53L91k81l83K45M24j29J17o05K93j60K59
7658FK10k10n46l1Q17J84m06r4n0P6J90O1k4m49j25M70K69l27k34Q2J15j23K00
7681F1n6j04k27K01L34j49j46O5J54m95K49M41Ll79j3r1L31j74J21k66j74J25
7703a89K96N20o02o69P68M29K6m19k51K2j6J27O55m66r60M01M14K97p48J21J0
7724b34L15n2m6M9j05r5L07J16m97j77O08K3m07KL19lj10j24J33m0K6K80p1p20
$$ plain form
7748 -503 -182 266 167 -498 -320 36 205 271 108 6 -113 -74 330 484 -244 -413 -412 444 244 -119 -238 -229
7770 -229 152 109 157 -195 -348 59 197 291 -6 121 182 241 -82 46 95 -26 -224 253 26 -222 -60 136
7792 136 102 -414 -120 262 -33 19 -247 339 126 31 -38 -10 -449 -57 306 146 -470 -392 103 135 139 -255 -338
7815 -338 -152 -63 288 275 -285 -408 75 313 277 -203 -251 76 -45 311 87 -120 -244 -15 205 -56 -239
7836 -239 16 119 15 -97 64 292 -27 56 9 302 -89 56 199 -8 -232 109 -16 65 -240 -179 200
7857 200 -27 -168 -120 -95 -192 206 186 19 -432 -203 254 382 -383 6 106 98 -61 199 164 -209 -41 431
7879 431 243 -3 0 17 81 -254 36 68 83 -80 127 153 -35 -198 210 -15 -28 -216 44 284 -178 -234 198
7902 198 233 -189 236 -124 -169 -394 435 238 38 -372 -391 218 207 -170 -271 -312 -205 -68 237 -221 -323 -3
$$ packed form
7748e03L21M48r9o65J78L56J69O6j63j02j19L9M04J54p28j69JQ56k00l63j19R
7770b29L81m3M8l52j53M07J38R4k97J27O1N9l23J28M9j21j98M77k27k48J62J96
7792A36l4n16K94L82k95N2k66N86k13r5o9K8m39L92L63j60o16P8M95L2Ml94q3
7815c38J86Q9L51j3n60j23M83K38l6m80m8L27j21L56k24k07j24K29K20k61j83
7836b39K55J03j04j12J61K28l19Q3m7K93l91J45J43k07k24L41j25Q1l05O1L79
7857B00k27j41M8K5r7L98k0j67m51K29M57J28p65L89J00qj59K60l5l73J68M72
7879D31j88k46LJ7O4l35K90L2J5j63K07K6j88j63M08k25j3j88K60K40m62n6M32
7902A98L5m22M25l60m5k25Q29j97k00m10j9O09j1l77j01m1J07J37L05m58j02L20
$$ plain form
7924 -3 70 212 -213 -106 90 105 83 1 22 -17 -88 460 249 -135 -145 69 5 -162 -205 282 214 -103 -74 277 -117
7949 -117 21 218 83 -39 -110 563 167 70 -164 218 318 73 -159 -354 -299 -163 238 194 -320 -414 -93 400
7971 400 230 -297 0 -162 63 165 135 106 -191 222 158 211 -319 -74 311 219 -162 264 45 -93 -297 167
7993 167 109 -62 220 214 -7 -336 3 228 54 -84 -295 84 193 -256 -15 142 -354 -252 333 211 -279
8014 -279 -197 100 448 -21 114 -10 -85 -37 104 53 -487 -503 140 495 -25 -361 -53 -31 113 32 177 -244
8036 -244 -388 136 223 68 -119 75 355 74 3 109 10 -336 -19 21 102 -63 92 232 -37 -220 66 76
8058 76 -60 -138 -96 243 138 -167 -27 -44 -319 154 449 77 -383 -336 66 138 27 -105 -208 -170 265 85
8080 85 114 -279 -239 204 127 -286 -199 52 382 60 42 80 -193 -269 46 35 -20 -352 -54 234 -240 -156 -102 271
$$ packed form
7924cP3J42m25J07J96J5k2q2K1l9p1N48k11l84j0K14o4j67m3M87o8l17K9L51l94
7949a17J38J97j35j22p1O73l96r7k34L82J00k45k32j95N5J36M01m4n14r4L21M93
7971D00j70n27K97j62K25J02l0k9k97M13o4N3n30K45L85r2l81M26k19j38k04M64
7993A67n8j71K82ok21l29L39K25j74j38k11L79J09m49K41J57m96J02N85j22m90
8014b79Q2K97L48m69J35j24p5M8J41n1n40j6O43L55n20l36L08K2J44q1J45m21
8036b44j44N24Q7j55j87J94K80k81p1J06r9l46L17M0Q1j65J55J40k69j83K86J0
8058G6j36p8M2L39j05l05J40j7k75M73K95l72m60M7M02P2j11j32j03L8M35j80
8080H5K9l93M0M43p7m13Q7K51L30l22j8L8k73p6L15j1n5l32K98K88m74Q4N4L73
$$ plain form
8104 271 -91 -233 130 187 100 78 -58 -298 -75 299 240 -32 -281 1 305 170 -100 -57 -123 -108 181 220 -259
8127 -259 -336 -166 465 95 -197 -46 -144 185 319 167 -117 56 64 407 424 -193 -321 20 70 -222 -167 113
8149 113 23 -56 -78 307 15 -281 317 265 -139 -26 174 137 71 -173 140 138 121 188 2 -298 -311 310 317 -207
8173 -207 -263 8 260 11 -155 -108 -58 -118 169 -21 -259 -288 83 276 -119 3 -278 -59
$$ packed form
8104B71l62j42L63N7q7k2j36k40K23L74n9k72k49K82L04j35k70M3o6J5K89L9m79
8127b59p7J70O31l70k92J51r8L29J34j52k84J73QL43J7o17j28L41N0k92N5K80
8149A13r0p9k2L85k92k96N98n2m04J13K00l7o6k44L13kj7O7j86l00j3O21Pn24
8173b07n6K71K52k49j66M7N0o0K87j90k38k9L71J93l95J22k81K19
8191e9
$$ Imaginary data points
##PAGE= N=2
##DATA TABLE= (X++(I..I)), XYDATA
$$ plain form
0 0 0 0 0 0 0 0 8 0 0 -8 8 -8 16 -16 16 -24 32 -38 48 -56 64 -80 96 -112 128 -150 176 -202 234 -266 305
31 305 -348 395 -445 503 -565 634 -710 792 -884 985 -1090 1210 -1342 1481 -1638 1807 -1989
48 -1989 2194 -2416 2663 -2932 3233 -3570 3945 -4372 4858 -5417 6073 -6846 7780 -8937
62 -8937 10408 -12345 15034 -19027 25566 -38168 71371 -349948 -801019 -81475 168787
73 168787 -44495 -259369 -220957 -212579 -47536 204925 193506 -242619 -425686 -47995 279909
84 279909 -25462 -374960 -240081 -62708 -202098 -202755 -46260 -141140 -345666 -207689 32807
95 32807 -62923 -233759 -59404 89059 -123120 -263393 -3171 200643 -30148 -303189
105 -303189 -194679 -19238 -65928 -89417 -73087 -293579 -458229 -134034 211783 -59446
$$ packed form
0@%%%%%%Qq%qJ6j6K4l2L2m0N6p0Q6j04J20j44J76k08K40k78L26l78M36n00N71
31C05o53P43q40R48j068J199j344J502j676J869k075K300k552K823l119L445l796
48a989M183m610N079n595O165o803P515q317R230j0275J1490j2919J4626j6717
62h937J9345k2753K7379l4061M4593o3734J09539m21319m51071P19544K50262
73A68787k13282k14874L8412Q378J65043K52461j1419m36125j83067L77691L27904
84B79909l05371l49498J34879J77373j39390o57J56495r4880k04526J37977K40496
95C2807r5730j70836J74355J48463k12179j40273K60222K03814k30791k73041
105c03189J08510J75441m6690k3489J6330k20492j64650L24195L45817k71229
$$ plain form
115 -59446 -498092 -398673 -4143 119342 -32789 -174618 -227422 -212478 -4293 263323 103608
126 103608 -347604 -331627 141182 283063 -32186 -203624 -95127 -29810 8378 124545
136 124545 85570 -152740 -197469 78088 216546 -14961 -169098 736 88600 -70518
146 -70518 -101544 61055 47163 -139828 -128824 14198 -28172 -91435 30751 44282 -171135
157 -171135 -195157 103479 238045 -23340 -239132 -95319 116277 114628 32055 -35662 -174745
168 -174745 -199158 89262 266989 -51424 -375174 -189483 153524 162104 -32884 -119997 -100478
179 -100478 -32965 136606 259988 85650 -174590 -64550 272011 280408 897 -68423 69382
190 69382 78763 25681 83196 72238 -87341 -111685 57684 90156 -67032 -80099 72620
$$ packed form
115e9446m38646R9419L94530J23485j52131j41829n2804J4944K08185K67616j59715
126A03608m51212J5977M72809J41881l15249j71438J08497O5317L8188J16167
136A24545l8975k38310m4729K75557J38458k31507j54137J69834Q7864j59118
146g0518l1026J62599j3892j86991J1004J43022m2370o3263J22186J3531k15417
157a71135k4022K98636J34566k61385k15792J43813K11596j649q2573o7717j39083
168a74745k4413K88420J77727l18413l23750J85691L43007Q580j94988q7113J9519
179a00478O7513J69571J23382j74338k60240J10040L36561Q397k79511o9320J37805
190F9382R381n3082N7515j0958j59579k4344J69369L2472j57188j3067J52719
$$ plain form
201 72620 62448 -88281 -38628 166975 160553 -28725 -44242 92376 112334 86415 133866
212 133866 61343 -126235 -69777 208438 226177 -81913 -230259 -33112 159694 120599 6517
223 6517 -55557 -99226 -29326 203882 268693 -18322 -206700 31770 296874 203399 -4557
234 -4557 -24188 37648 65412 136987 175927 24625 -130933 -11707 198633 134280 -70604
245 -70604 -44817 100335 63240 -19989 63160 126020 17032 -33246 78840 105544 12274
256 12274 43417 137193 45286 -94940 11772 213689 146380 -81571 -87906 80831 133202
267 133202 88966 75896 3482 -101690 15750 260107 200966 -105078 -161553 88012 232156
278 232156 119016 -12986 -33582 -23459 48117 192354 173098 -65496 -154455 81051 255137
$$ packed form
201G2620j0172j50729M9653K05603o422j89278j5517J36618J9958k5919M7451
212A33866p2523j87578N6458K78215J7739l08090j48346J97147J92806l9095j14082
223F517o2074m3669O9900K33208O4811k87015j88378K38470K65104r3475k07956
234d557j9631O1836K7764P1575L8940j51302j55558J19226K10340o4353k04884
245g0604K5787J45152l7095q3229Q3149O2860j08988n0278J12086K6704r3270
256A2274L1143R3776r1907j40226J06712K01917o7309k27951o335J68737N2371
267A33202m4236j3070p2414j05172J17440K44357n9141l06044n6475K49565J44144
278B32156j13140j32002k0596J0123P1576J44237j9256k38594q8959K35506J74086
$$ plain form
289 255137 103089 -63111 119 82887 64559 85159 124134 39262 -54115 38573 163723
300 163723 82763 -37576 33556 124263 33348 -47384 69221 160008 39369 -51830 34440
311 34440 91191 55227 78096 107248 -3046 -84719 75402 244138 113160 -109463 -72518
322 -72518 124296 172849 80243 21659 -21203 -53182 73161 233111 118612 -138184 -121213
333 -121213 134806 212453 45642 -58551 -19142 21492 65748 135379 97229 -62787 -87866
344 -87866 106407 197121 39486 -60594 41486 104673 36415 29658 99768 61557 -25800
355 -25800 22372 97185 42268 -10080 57711 85906 -29008 -67174 87691 162370 14229
366 14229 -90467 3867 102141 85854 68742 53808 -39260 -54502 123256 224010 46546
$$ packed form
289B55137j52048j66200O3230Q2768j8328K0600L8975q4872r3377R2688J25150
300A63723q0960j20339P1132R0707r0915q0732J16605R0787j20639r1199Q6270
311C4440N6751l5964K2869K9152j10294q1673J60121J68736j30978k22623L6945
322g2518J96814M8553r2606n8584m2862l1979J26343J59950j14499k56796J6971
333a21213K56019P7647j66811j04193L9409M0634M4256O9631l8150j60016k5079
344h7866J94273R0714j57635j00080J02080O3187o8258o757P0110l8211q7357
355b5800M8172P4813n4917n2348O7791K8195j14914l8166J54865P4679j48141
366A4229j04696R4334R8274j6287j7112j4934r3068j5242J77758J00754j77464
$$ plain form
377 46546 -139797 -46361 152869 156394 28321 -30104 -32823 -12001 91796 172423 46314
388 46314 -135980 -60661 162285 168640 -2676 -50824 28097 60729 59770 93249 71120 -31607
400 -31607 -32559 97310 124634 2665 -34408 65015 79146 -18284 -5611 98543 74278 -28225
412 -28225 -16912 52341 42082 21293 60898 35267 -72145 -51425 111774 139456 -35965
423 -35965 -128225 -3283 112490 79030 22917 -4205 -50232 -14844 140985 180549 -7357
434 -7357 -132894 11211 179895 125246 -13428 -40633 -4930 20710 73905 101077 -9606
445 -9606 -124964 -29853 131856 87747 -57059 -44677 54262 51319 17305 60756 73274 3264
457 3264 -4133 75870 80426 -318 381 66419 22392 -77396 -30082 82935 35350 -94676 -88359
$$ packed form
377D6546j86343R3436J99230L525j28073n8425k719K0822J03797Q0627j26109
388D6314j82294P5319K22946O355j71316m8148P8921L2632r59L3479k2129j02727
400c1607r52J29869K7324j21969l7073R9423J4131r7430J2673J04154k4265j02503
412b8225J1313O9253j0259k0789L9605k5631j07412K0720J63199K7682j75421
423c5965r2260J24942J15773l3460n6113k7122m6027L5388J55829L9564j87906
434g357j25537J44105J68684n4649j38674k7205L5703K5640N3195K7172j10683
445i606j15358R5111J61709m4109j44806J2382R8939k943l4014M3451J2518p0010
457C264p397Q0003M556q0744O99O6038m4027r9788M7314J13017m7585j30026O317
$$ plain form
470 -88359 5559 25431 9799 20717 -20440 -81592 -778 154258 130725 -47158 -87978 67281
482 67281 164063 93023 8046 -13863 -21528 21621 119360 99127 -75111 -139513 19782 135283
494 135283 39904 -72088 -45252 17040 31226 54048 71664 5453 -55034 26655 124626 60524
506 60524 -43630 -4311 65566 10798 -45869 12411 43451 -34025 -72444 -17444 3172 -32429
518 -32429 -16820 17993 -41294 -98294 -1445 110842 37523 -98392 -68937 56047 78063
529 78063 27948 3956 -33396 -60439 29901 137324 62499 -105380 -95293 74157 131148
540 131148 28244 -44855 -27108 1662 37404 91469 57267 -73824 -89846 56322 112403
551 112403 -6307 -83329 -23716 21960 -7806 -6732 21361 -18017 -60073 -5613 52328 4712
$$ packed form
470h8359R3918J9872j5632J0918m1157o1152Q0814J55036k3533j77883m0820J55259
482F7281R6782p1040q4977k1909p665M3149R7739k0233j74238o4402J59295J15501
494A35283r5379j11992K6836O2292J4186K2822J7616o6211o0487Q1689R7971o4102
506F0524j04154L9319O9877n4768n6667N8280L1040p7476l8419N5000K0616l5601
518c2429J5609L4813n9287n7000R6849J12287p3319j35915K9455J24984K2016
529G8063n0115k3992l7352k7043R0340J07423p4825j67879J0087J69450N6991
540A31148j02904p3099J7747K8770L5742N4065l4202j31091j6022J46168N6081
551A12403j18710p7022N9613M5676k9766J074K8093l9378m2056N4460N7941m7616
$$ plain form
563 4712 -46100 8862 45885 -30805 -62172 29971 63354 -33114 -89408 -32671 8129 -13482
575 -13482 -13865 -18892 -82608 -91275 24766 99135 -2156 -117615 -47487 91757 97673 25814
587 25814 -4195 -11177 -1476 74286 128530 27908 -106391 -57833 83381 80773 -39565 -90647
599 -90647 -46417 -15955 -9648 13431 -10162 -86190 -70821 41479 66106 -28801 -57656 21284
611 21284 40444 -17870 -12600 34485 6963 -50949 -35781 2450 -25876 -53316 -17523 -22636
623 -22636 -96705 -88899 20947 45388 -63844 -110258 -17391 50268 29295 10263 -4095 -41512
635 -41512 -18589 86140 110878 -19871 -108626 -14508 96252 57307 -38081 -58513 -36299
646 -36299 -19067 28748 52669 -36525 -116110 -35930 79647 45822 -58075 -59486 5252 12302
$$ packed form
563D712n0812N4962L7023p6690l1367R2143L3383r6468n6294N6737M0800k1611
575a3482l83n027o3716q667J16041P4369j01291j15459P0128J39244N916p1859
587B5814l0009o982R701P5762N4244j00622j34299M8558J41214k608j20338n1082
599i0647M4230L0462O307K3079k3593p6028J5369J12300K4627r4907k8855P8940
611B1284J9160n8314N270M7085k7522n7912J5168L8231k8326k7440L5793n113
623b2636p4069P806J09846K4441j09232m6414R2867O7659k0973j9032j4358l7417
635d1512K2923J04729K4738j30749q8755R4118J10760l8945r5388k0432K2214
646c6299J7232M7815K3921q9194p9585Q0180J15577l3825j03897j411O4738P050
$$ plain form
658 12302 -5130 10306 -674 -51282 -44769 22116 20565 -51458 -51210 11543 -5808 -65314 -33247
671 -33247 34383 5820 -62743 -46737 7144 6289 -5777 5511 -21753 -70218 -29634 67336
683 67336 50425 -73243 -99900 5857 65181 18597 -26623 -36181 -42523 -4360 75136 62295
695 62295 -57754 -96584 14409 94787 28718 -59190 -51188 -11653 -3715 11070 14228 -50401
707 -50401 -96109 -25236 50232 -1109 -76856 -44481 14232 -4198 -29348 3866 18923 -21799
719 -21799 -30427 14626 19277 -20431 -10902 20846 -19847 -67922 -13798 53206 593 -84743 -60452
732 -60452 11962 19706 -4245 -12291 -36613 -54210 8365 85684 38618 -75416 -67692 46728
744 46728 83350 11090 -39029 -31252 -20584 7157 51287 18256 -80217 -84353 22516 64905
$$ packed form
658A2302j7432J5436j0980n0608O513O6885j551p2023K48O2753j7351n9506L2067
671c3247O7630k8563o8563J6006N3881q55j2066J1288k7264m8465M0584R6970
683F7336j6911j23668k6657J05757N9324m6584m5220r558o342L8163P9496j2841
695F2295j20049l8830J10993Q0378o6069q7908Q002L9535P938J4785L158o4629
707e0401m5708P0873P5468n1341p5747L2375N8713j8430k5150L3214J5057m0722
719b1799q628M5053M651l9708R529L1748m0693m8075N4124O7004n2613q5336K4291
732f0452P2414P744k3951q046k4322j7597O2575P7319m7066j14034P724J14420
744D6728L6622p2260n0119P777J0668K7741M4130l3031r8473m136J06869M2389
$$ plain form
756 64905 -15029 -71815 -31771 8786 21 3486 14148 -21002 -45869 5847 49373 742
768 742 -44377 -2510 28747 -16979 -38339 12224 29898 -24123 -48374 -7489 12004 -6738
780 -6738 -1527 4352 -36161 -51269 21168 70520 -3611 -82863 -36723 44669 40767 -5691 -26561
793 -26561 -37229 -32285 25157 65578 -3110 -91261 -51982 54419 60516 -21913 -54473 -19627
805 -19627 1725 13850 34335 4215 -59347 -43150 41677 52556 -26511 -52330 1126 20166
817 20166 -10355 -9635 13844 -5181 -33165 -3596 26833 -4606 -24234 13346 18617 -31411 -30455
830 -30455 37305 46544 -26181 -50934 1994 32547 14410 1904 -8933 -37779 -28226 43247
842 43247 61677 -27907 -84738 -16733 60115 35915 -24487 -34896 -23481 -7508 35610 49265
$$ packed form
756F4905p9934n6786M0044M0557q765L465J0662l5150k4867N1716M3526m8631
768G42m5119M1867L1257m5726k1360N0563J7674n4021k4251M0885J9493j8742
780f738N211N879m0513j5108P2437M9352p4131p9252M6140Q1392l902m6458k0870
793b6561j0668M944N7442M0421o8688q8151L9279J06401O097q2429l2560L4846
805a9627K1352J2125K0485l0120o3562J6197Q4827J0879p9067k5819N3456J9040
817B0166l0521P20K3479j9025k7984K9569L0429l1439j9628L7580N271n0028R56
830c0455O7760R239p2725k4753N2928L0553j8137j2506j0837k8846R553P1473
842D3247J8430q9584n6831O8005P6848k4200o0402j0409J1415J5973M3118J3655
$$ plain form
854 49265 -18891 -73026 -15492 68220 45185 -33300 -38803 5780 15784 8994 16405 -243 -40092
867 -40092 -25370 32671 24968 -35618 -35254 12341 7706 -30048 -15242 24127 4690 -32823 -13270
880 -13270 18568 8154 -1231 15883 4140 -34943 -11732 55448 40398 -43015 -56450 10632
892 10632 42686 9964 -18486 -26846 -36039 -9710 47043 36987 -46812 -72445 10138 71080
904 71080 23867 -34462 -24594 1906 14112 33293 30693 -23298 -53728 3469 57381 13779
916 13779 -47296 -29828 11581 3419 -15341 -515 579 -28608 -21386 18444 11928 -23160 -10161
929 -10161 21735 -690 -33001 2766 43806 8796 -38812 -18517 22249 20316 4164 3786 -14023
942 -14023 -33024 7921 60438 24080 -54851 -46080 32277 53085 4051 -26129 -23310 -16453 9671
$$ packed form
854D9265o8156n4135N7534Q3712k3035p8485n503M4583J0004o790P411j6648l9849
867d0092J4722N8041p703o0586L64M7595m635l7754J4806L9369j9437l7513J9553
880a3270L1838j0414r385J7114j1743l9083K3211O7180j5050q3413j3435O7082
892A0632L2054l2722k8450q360r193K6329N6753j0056q3799k5633Q2583O0942
904G1080m7213n8329R868K6500J2206J9181k600n3991l0430N7197N3912m3602
916A3779o1075J7468M1409q162j8760J4826J094k9187P222L9830o516l5088J2999
929a0161L1896k2425l2311L5767M1040l5010m7608K0295M0766j933j6152l78j7809
942a4023j9001M0945N2517l6358p8931Q771P8357K0808m9034l0180K819O857K6124
$$ plain form
955 9671 42113 14828 -54704 -55501 24491 55517 -4045 -46902 -19832 9659 8322 11210 11066
968 11066 -22392 -37079 8483 37183 -6366 -43423 -14711 11889 -14498 -32300 -4398 3656
980 3656 -28118 -33476 -1671 4692 -12552 -1535 13923 -12351 -24338 27031 59617 9411 -38225
993 -38225 -5232 44465 36323 4109 -8169 -20411 -22340 17118 44238 -9007 -73490 -42329
1005 -42329 35483 36649 -21846 -39903 -15898 861 17835 34568 6874 -41155 -23523 42505
1017 42505 45920 -16797 -40462 -5088 9495 -11213 -14127 -6941 -28995 -42049 -10054 7703
1029 7703 -23275 -35832 -2080 9293 -20861 -18615 25814 30856 -9742 -18571 15868 30239 15172
1042 15172 10761 6452 -18980 -15592 33381 41986 -22566 -59410 -10898 38651 18380 -19912 -25988
$$ packed form
955I671L2442k7285o9532p97P9992L1026n9562m2857K7070K9491j337K888j44
968A1066l3458j4687M5562K8700m3549l7057K8712K6600k6387j7802K7902Q054
980C656l1774n358L1805O363j7244J1017J5458k6274j1987N1369L2586n0206m7636
993c8225L2993M9697q142l2214j2278j2242j929L9458K7120n3245o4483L1161
1005d2329P7812J166n8495j8057K4005J6759J6974J6733k7694m8029J7632O6028
1017D2505L415o2717k3665L5374J4583k0708k914P186k2054j3054L1995J7757
1029G703l0978j2557L3752J1373l0154K246M4429N042m0598q829L4439J4371j5067
1042A5172m411m309k5432L388M8973Q605o4552l6844M8512M9549k0271l8292o076
$$ plain form
1055 -25988 -20659 -6456 26408 33590 -17856 -57307 -12341 49084 27147 -32357 -36997 -5787
1067 -5787 2468 460 4411 -15604 -45365 -24368 22505 12321 -34430 -34213 3954 7194 -18774
1080 -18774 -11575 10334 -5541 -24687 -4693 12269 -4982 -11879 8497 3086 -26265 -9208
1092 -9208 36619 26515 -24152 -27390 19240 38250 15505 1517 -3545 -13555 3673 42224
1104 42224 31171 -34220 -53846 5861 42406 2535 -38049 -33127 -16646 -4263 13268 9434
1116 9434 -32772 -49424 2621 44371 10608 -33888 -19438 14480 10552 -2078 5215 -5207
$$ packed form
1055b5988N329J4203L2864P182n1446l9451M4966O1425k1937n9504m640L1210
1067e787Q255k008L951k0015k9761K0997M6873j0184m6751K17L8167L240k5968
1080a8774P199K1909j5875j9146J9994J6962j7251o897K0376n411k9351J7057
1092i208M5827j0104n0667l238M6630J9010k2745j3988n062j0010J7228L8551
1104D2224j1053o5391j9626N9707L6545l9871m0584M922J6481J2383J7531l834
1116I434m2206j6652N2045M1750l3763m4496J4450L3918l928j2630P293j0422
$$ [...]
8191A39
##END NTUPLES=NMR FID
##END=
