##TITLE=1H_SA-61.242
 DMSO-d6, 8 sc, 
 8.06.2021
##JCAMPDX= 6.0         $$ Bruker NMR JCAMP-DX V2.0
##DATA TYPE= NMR FID
##DATA CLASS= NTUPLES
##ORIGIN= UXNMR, Bruker Analytische Messtechnik GmbH
##OWNER= root
$$ XWIN-NMR		Version 3.5
$$ Tue Jun  8 13:39:20 2021 Russian Standard Time (UT+4h)  she@DPX200
##.OBSERVE FREQUENCY= 200.131506
##.OBSERVE NUCLEUS= ^1H
##.DELAY= (6, 6)
##.ACQUISITION MODE= SIMULTANEOUS
##.ACQUISITION SCHEME= undefined
##.AVERAGES= 2
##.DIGITISER RES= 18
##SPECTROMETER/DATA SYSTEM= spect
##.PULSE SEQUENCE= zg30
##.SOLVENT NAME= DMSO
##.SHIFT REFERENCE= (INTERNAL, DMSO, 0, 15.7039)
##AUDIT TRAIL= $$ (NUMBER, WHEN, WHO, WHERE, WHAT)
$$ ##TITLE= Audit trail, XWIN-NMR		Version 3.5
$$ ##JCAMPDX= 5.01
$$ ##ORIGIN= Bruker BioSpin GmbH
$$ ##OWNER= she
$$ F:/spectra/data/she/nmr/H-F/1/audita.txt
$$ ##AUDIT TRAIL=  $$ (NUMBER, WHEN, WHO, WHERE, WHAT)
(   1,<2021-06-08 13:38:04.53 +0400>,<she>,<DPX200>,
      <created by zg, POWCHK disabled, PULCHK disabled
       configuration hash MD5:
       00 E9 B6 7A A2 85 ED C7 34 08 36 98 17 FE 4E 26
       data hash MD5: 16K
       36 CA 52 CB 7F 21 06 67 25 06 F5 8E 96 6B AE 3B>)
$$ ##END=
$$ 
$$ hash MD5
$$ FF E4 73 98 19 C2 D7 8B 2B 08 2B 3F 60 07 9A B0
##$RELAX= 
##$RELAX= 
##$RELAX= 
##$RELAX= 
##$RELAX= 
##$RELAX= 
$$ Bruker specific parameters
$$ --------------------------
##$DU= <F:/spectra>
##$EXPNO= 1
##$NAME= <H-F>
##$PROCNO= 1
##$TYPE= <nmr>
##$USER= <she>
##$AMP= (0..31)
100 100 100 100 100 100 100 100 100 100 100 100 100 100 100 100 100 100 
100 100 100 100 100 100 100 100 100 100 100 100 100 100 
##$AQSEQ= 0
##$AQ_mod= 1
##$AUNM= <au_zg>
##$AUTOPOS= <>
##$BF1= 200.13
##$BF2= 200.13
##$BF3= 200.13
##$BF4= 200.13
##$BF5= 200.13
##$BF6= 200.13
##$BF7= 200.13
##$BF8= 200.13
##$BYTORDA= 1
##$CFDGTYP= 0
##$CFRGTYP= 5
##$CHEMSTR= <none>
##$CNST= (0..31)
1 1 145 1 1 1 1 1 1 1 1 1 1 1 1 1 1 1 1 1 1 1 1 1 1 1 1 1 1 1 1 1 
##$CPDPRG= <>
##$CPDPRG1= <>
##$CPDPRG2= <>
##$CPDPRG3= <>
##$CPDPRG4= <mlev>
##$CPDPRG5= <mlev>
##$CPDPRG6= <mlev>
##$CPDPRG7= <mlev>
##$CPDPRG8= <mlev>
##$CPDPRGB= <>
##$CPDPRGT= <>
##$D= (0..31)
0 1.2 0 0 0 0 0 0 0 0.06 0 0.03 0 0 0 0 0.0002 0 0 0 0 0 0 0 0 0 0 0 0 
0 0 0 
##$DATE= 1623145084
##$DBL= (0..7)
120 120 120 120 120 120 120 120 
##$DBP= (0..7)
150 150 150 150 150 150 150 150 
##$DBP07= 0
##$DBPNAM0= <>
##$DBPNAM1= <>
##$DBPNAM2= <>
##$DBPNAM3= <>
##$DBPNAM4= <>
##$DBPNAM5= <>
##$DBPNAM6= <>
##$DBPNAM7= <>
##$DBPOAL= (0..7)
0.5 0.5 0.5 0.5 0.5 0.5 0.5 0.5 
##$DBPOFFS= (0..7)
0 0 0 0 0 0 0 0 
##$DE= 6
##$DECBNUC= <off>
##$DECIM= 32
##$DECNUC= <off>
##$DECSTAT= 4
##$DIGMOD= 1
##$DIGTYP= 9
##$DL= (0..7)
0 120 120 120 120 120 120 120 
##$DP= (0..7)
150 150 150 150 150 150 150 150 
##$DP07= 0
##$DPNAME0= <>
##$DPNAME1= <>
##$DPNAME2= <>
##$DPNAME3= <>
##$DPNAME4= <>
##$DPNAME5= <>
##$DPNAME6= <>
##$DPNAME7= <>
##$DPOAL= (0..7)
0.5 0.5 0.5 0.5 0.5 0.5 0.5 0.5 
##$DPOFFS= (0..7)
0 0 0 0 0 0 0 0 
##$DQDMODE= 0
##$DR= 18
##$DS= 0
##$DSLIST= <SSSSSSSSSSSSSSS>
$$ [...]
##$SUBNAM2= <"">
##$SUBNAM3= <"">
##$SUBNAM4= <"">
##$SUBNAM5= <"">
##$SUBNAM6= <"">
##$SUBNAM7= <"">
##$SUBNAM8= <"">
##$SUBNAM9= <"">
##$SW= 20.0188882624521
##$SWIBOX= (0..15)
0 0 2 0 0 0 0 0 0 0 0 0 0 0 0 0 
##$SW_h= 4006.41025641026
##$TD= 16384
##$TD0= 1
##$TE= 0
##$TE2= 300
##$TE3= 300
##$TEG= 300
##$TL= (0..7)
0 120 120 120 120 120 120 120 
##$TP= (0..7)
150 150 150 150 150 150 150 150 
##$TP07= 0
##$TPNAME0= <>
##$TPNAME1= <>
##$TPNAME2= <>
##$TPNAME3= <>
##$TPNAME4= <>
##$TPNAME5= <>
##$TPNAME6= <>
##$TPNAME7= <>
##$TPOAL= (0..7)
0.5 0.5 0.5 0.5 0.5 0.5 0.5 0.5 
##$TPOFFS= (0..7)
0 0 0 0 0 0 0 0 
##$TUNHIN= 0
##$TUNHOUT= 0
##$TUNXOUT= 0
##$USERA1= <user>
##$USERA2= <user>
##$USERA3= <user>
##$USERA4= <user>
##$USERA5= <user>
##$V9= 5
##$VALIST= <valist>
##$VCLIST= <CCCCCCCCCCCCCCC>
##$VD= 0
##$VDLIST= <DDDDDDDDDDDDDDD>
##$VPLIST= <PPPPPPPPPPPPPPP>
##$VTLIST= <TTTTTTTTTTTTTTT>
##$WBST= 1024
##$WBSW= 4
##$XGAIN= (0..3)
0 0 0 0 
##$XL= 0
##$YL= 0
##$YMAX_a= 18025
##$YMIN_a= -13732
##$ZGOPTNS= <>
##$ZL1= 120
##$ZL2= 120
##$ZL3= 120
##$ZL4= 120
##$ABSF1= 10
##$ABSF2= 0
##$ABSG= 5
##$ABSL= 3
##$ALPHA= 0
##$AQORDER= 0
##$ASSFAC= 0
##$ASSFACI= 0
##$ASSFACX= 0
##$ASSWID= 0
##$AUNMP= <proc_1d>
##$AZFE= 0.1
##$AZFW= 0.1
##$BCFW= 1
##$BC_mod= 2
##$BYTORDP= 1
##$COROFFS= 0
##$CY= 11.3945322036743
##$DATMOD= 1
##$DC= 2
##$DFILT= <>
##$DTYPP= 0
##$F1P= 15.9154993809931
##$F2P= -4.1035820241983
##$FCOR= 0.5
##$FTSIZE= 0
##$FT_mod= 4
##$GAMMA= 1
##$GB= 0.15
##$INTBC= 1
##$INTSCL= 1
##$ISEN= 128
##$LB= 0.24
##$LEV0= 0
##$LPBIN= 0
##$MAXI= 10000
##$MC2= 0
##$MEAN= 0
##$ME_mod= 0
##$MI= 1.114404
##$NCOEF= 0
##$NC_proc= 0
##$NLEV= 6
##$NOISF1= 3.799351
##$NOISF2= 2.8
##$NSP= 1
##$NTH_PI= 0
##$NZP= 0
##$OFFSET= 15.70392
##$PC= 1
##$PHC0= -11500.18
##$PHC1= 17.40101
##$PH_mod= 1
##$PKNL= yes
##$PPARMOD= 0
##$PSCAL= 0
##$PSIGN= 0
##$REVERSE= no
##$SF= 200.130013532006
##$SI= 16384
##$SIGF1= 3
##$SIGF2= 2
##$SINO= 400
##$SIOLD= 16384
##$SREGLST= <1H.CDCl3>
##$SSB= 0
##$STSI= 0
##$STSR= 0
##$SW_p= 3612.71676300578
##$SYMM= 0
##$S_DEV= 0
##$TDeff= 0
##$TDoff= 0
##$TI= <>
##$TILT= no
##$TM1= 0
##$TM2= 0
##$TOPLEV= 0
##$USERP1= <user>
##$USERP2= <user>
##$USERP3= <user>
##$USERP4= <user>
##$USERP5= <user>
##$WDW= 1
##$XDIM= 8192
##$YMAX_p= 0
##$YMIN_p= 0
$$ End of Bruker specific parameters
$$ ---------------------------------
##NTUPLES= NMR FID
##VAR_NAME=  TIME,          FID/REAL,        FID/IMAG
##SYMBOL=    X,             R,               I
##VAR_TYPE=  INDEPENDENT,   DEPENDENT,       DEPENDENT
##VAR_FORM=  AFFN,          ASDF,            ASDF
##VAR_DIM=   8192,          8192,            8192
##UNITS=     SECONDS,       ARBITRARY UNITS, ARBITRARY UNITS
##FACTOR=    0.0002496,     1,               1
##FIRST=     0,             0,               0
##LAST=      2.0444736,     0,               0
##MIN=       0,             -13732,          0
##MAX=       2.0444736,     18025,           0
$$ Real data points
##PAGE= N=1
##DATA TABLE= (X++(R..R)), XYDATA
0@%%%%%%%%%%%%%%%%kMmMmMoQqJ0j2J3j5J7j9K2k6L0l4L8m2M7n2N8o6P4q2R0r9
45e2J09j20J33j46J60j77J96k16K38k63K90l21L58m01M51n10N82o72P89r48J176
66F56j533K174l683J4790N621k6608k065J5255R205j0594r496K772R274o55n447
81c34j135K411l83K153O14n340j862Q487K857r988o879R904J0895q038j5574L714
97h498J7153J571j6781o290J3777Q685q944q254L507O674K36l539k150k11K145
112i19K999l10n785l128P671P030q943j0290Q132J2578m617j3622O04J3712L695
127H807j1896o179R134P864o118o836L228M681l66j970j268p64J440L812R9o167
143b499k968P918O686p027j0378M885J3320j774j3683j959J1569M934q577o460
$$ plain form
0 0 0 0 0 0 0 0 0 0 0 0 0 0 0 0 0 0 -2 2 -2 2 -2 2 -4 4 -4 6 -6 7 -8 9 -10 12 -14 16 -18 20 -22 25 -27 31 -35 39 -43 47 -52
45 -52 57 -63 70 -76 84 -93 103 -113 125 -138 152 -169 189 -212 239 -271 311 -361 428 -520 656
66 656 -877 1297 -2386 12404 18025 -8583 -10648 4607 13812 3218 -6278 -3506 5768 5113 -334
81 -334 -1469 942 559 2712 3326 -2014 -3876 4611 7468 -2520 -9399 505 11400 3362 -12212 -8498
97 -8498 8655 10226 -6555 -12845 932 9617 673 -7581 -4074 2600 2836 -703 -2853 -3064 -919
112 -919 2080 1770 -4015 -7143 528 7558 -1385 -11675 -3543 9035 4418 -9204 -8600 5112 8807
127 8807 -3089 -9268 -134 7730 1612 -5224 -1996 2685 2319 349 -919 -1683 -243 3569 3668 -2499
143 -2499 -5467 2451 9137 2110 -8268 -3383 9937 8163 -5520 -7479 4090 9024 447 -6013
157f013N023O092k717m757R71K830n67p53O03j457q59L824J441n567l252O182
173A024O237n842r559L286J1839J16j2383l805J0305O156o940o369K809N584l11
188B147l223o69Q20J92J201O91k495k106L335L650m330n218M497O687l511q222
204f554J525R654J313r154l839P528N866m937o101K473M825k09k418q91J40Q87
220A08J829K22l248j860L859L972l660n872K757P971j440q606m71Q053K498o787
236f75m151M842M753l112m232J047L282l46j671j06j44k18J966O94l214j974L658
253C99M014l473o261K275P336O1p915k389P160L745n246m479K801M334j094k999
269a731K0J827J1l01J47n86p60J477J730k514k513K930L901k675n307J623O601
$$ plain form
157 -6013 -990 5102 2385 -2372 -1401 1429 862 109 712 -745 -1604 2220 3661 -1906 -5158 1024
173 1024 7261 1419 -8140 -4854 6985 7101 -5282 -9087 1218 7374 434 -5935 -3126 2458 2147
188 2147 -1076 -1745 -925 -733 468 1159 -1336 -3442 -107 3543 -787 -6005 -1508 5179 1668 -6554
204 -6554 -5029 4625 5938 -3216 -7055 473 6339 1402 -4699 -2226 2599 2390 -28 -919 -779 108
220 108 1937 2159 -1089 -2949 910 4882 1222 -4650 -1893 6078 4638 -3968 -4439 3614 6112 -675
236 -675 -4826 16 4769 1657 -2575 -1528 1754 1408 -263 -369 -513 -731 1235 1929 -1285 -3259 399
253 399 4413 940 -5321 -3046 4290 4351 -3564 -5953 1207 4952 -294 -4773 -1972 2362 1268 -1731
269 -1731 -1711 116 127 -174 -27 -613 -1373 104 1834 -680 -3193 -263 3638 963 -4344 -2721 3880
286C880M19p079k403O042M390l852m939J889L961K0k298q12M77N88Q46L71j591
303i1j471J945K340j958l344J590M295j319m960M60N330R69n235k698M515L663
319D031l051m057J189L343K74k135o14L20M56J279k8k007j117K078K303j853l541
336c130J380M234j44m704j152M809K112l963k879K609L127j139k979K66K168K38
352H53r97m39J10l5Q78P15j524j485K037K300j716l451J172M407r8m557j486M205
370H89K764l147l360J711L050l59j999m53R49O29k43K4n62m18Q17R63r51j506
388a202J050K181r90l073P26L468K54l751j678L280K946k524l323J074K923L04
404A665j903q24N49O38P00j10j307q36J317J405r89k037Q06K262l38k588n11L290
$$ plain form
286 3880 4299 -2780 -5183 859 5249 1397 -3542 -1653 2308 2328 30 -782 -305 283 1129 1500 -91
303 -91 -1562 383 2723 765 -2579 -989 3306 1987 -2973 -2513 2817 3786 -1449 -4147 368 4031
319 4031 980 -3077 -1888 1455 1729 -406 -1020 -700 -244 1035 1007 -1000 -2117 -39 2264 411 -3130
336 -3130 -1750 2484 2340 -2364 -3516 1293 3405 -558 -3437 -828 2299 1160 -1819 -1553 615 853
352 853 -144 -583 -473 -508 370 1085 -439 -1924 113 2413 697 -2754 -1582 2825 2727 -1830 -3316 889
370 889 3653 506 -2854 -1143 1907 1548 -451 -904 45 674 431 455 -107 -525 292 1255 304 -1202
388 -1202 -152 2029 1039 -2034 -1308 2160 2414 -1337 -3015 265 3211 687 -2636 -1562 1361 1665
404 1665 -238 -1062 -513 125 825 715 -592 -1428 -111 1294 305 -1732 -926 1336 998 -1590 -2101 1189
422A189Q02l078j387K417K147j460k515L90K313O01j536r72M46P96L75j27j180
439g79m46J369J449j215j903N57K552J18k749o30K437J552k109k082J317K388
455A826n69j942k81J323O69o57o05q9L39N99J33q74m99Q36J050q07j811O35K226
474A502M5k618j033K391J694j691k209P20K059K31j593o06N51O94M03j97r40o8
492f65P16O72n17r89M82J044m58j331K50J896Q8k076q03J871J580j157j988J43
510a242K037N46j242j143O11R63K25l58r16l96J147O41p42j081M21J273J10j447
528e93k65J378O39j197r43J205J256q42j516K09J108N98r46r48J93Q93M04m92
546A41q14j26J041O35q46j178N31J459j38j206n60J108J067j049j150L25J431
$$ plain form
422 1189 1991 -1087 -2474 -57 2090 630 -1885 -1495 818 1419 -117 -1089 -643 153 528 401 -779
439 -779 -1225 144 1593 378 -1525 -968 1584 1702 -1047 -1677 760 2312 203 -1879 -562 1826
455 1826 1257 -685 -966 357 1026 369 -236 -325 14 613 746 -128 -627 209 1259 452 -1359 -724 1502
474 1502 1547 -1071 -2104 287 1981 290 -1919 -1199 860 1091 -502 -1108 -557 137 540 343 -597 -665
492 -665 51 723 206 -783 -301 743 285 -1046 -796 1100 1188 -888 -1691 180 1760 603 -1385 -1242
510 -1242 795 1341 99 -1044 -433 530 755 397 -519 -915 232 873 131 -950 -529 744 854 -593
528 -593 -858 520 1159 -38 -981 224 1480 638 -878 -669 439 1037 91 -857 -664 229 633 141
546 141 -673 -799 242 877 31 -1147 -616 843 705 -501 -1061 47 1114 65 -1085 -760 671
563F71N6j258m31Q80O45k81n08k41M08O57j19m44m48N04N41o10o84M59J081r9
583G79j323l85J269R34j055j236K72J369M50j023r18L72R71J85n01p21r1P77K96
602D21n29m39J86N67o1o34N9Q67K5r05l36J186O37p46j068L62R05N16q53j045
622h85L52R94K90p17p92K64R26L48p63o23L28P04R1p61j33M39N37o94l21L92O03
643E79l57p47q9P64L91m52o24J29P57K15m81m63K10N63L14p29o01L99P42Pr93
664d66o0N96L77m23p22k3J018J97o74m96L73P20n8n73j31L63K63j27l23o6L11
685G6K27l46l39K52M18j2o05q5P09M21n02o15K05O69K59n81q16L77Q49J2o66m30
707e23L29M53K14n86k57K73L79j65j59l9J62P7k01k69N04J16k61n58J83P69m5
$$ plain form
563 671 727 -531 -962 -82 563 282 -226 -467 -59 598 479 35 -413 91 632 22 -662 -203 878 779
583 779 -544 -929 340 1274 219 -1017 -745 624 1074 51 -867 -495 476 661 160 -561 -652 125 421
602 421 -108 -547 -361 206 145 -489 -430 437 462 -443 -779 407 1044 298 -770 -408 497 1013 160 -885
622 -885 -533 461 751 34 -758 -494 432 780 17 -606 -278 426 517 -244 -377 62 599 -95 -416 -24 579
643 579 222 -525 -614 150 541 89 -535 -406 351 566 85 -378 -168 395 709 -20 -621 -222 520 527 -466
664 -466 -526 70 447 24 -698 -721 297 494 -180 -676 -303 417 359 -214 -345 18 281 154 -169 -235 76
685 76 303 -43 -382 -130 288 276 -329 -414 295 716 214 -401 -196 473 732 151 -665 -288 561 573 -93 -523
707 -523 -194 259 473 -113 -370 -97 282 117 -42 -81 81 158 -43 -312 192 308 47 -511 -328 441 396
728C96m47m84J7P17M41p84m23J58O53K64n88m76K94O69k7n14j55L86L8j38j92
749a95J33L95k77l93K27K73J49l13l95K74N09p9k01m90K79L88o1l58k40J17N51
770B93k5m09q2L00K41j88m11M1M05L07l89l92K55L21N5m44o8J82Q1M0l00%J46
793d1L4K4j65K33j5%l09K8L77J44k54m36K88L80R8k62n47K44M77R1n83j62J58
816a98N01K23o35j93Q7L40J11k74q5R6J02Rj93J40pk09p1P4K66J13k67l22K94
839i8M69j30l37m22L41M48Q4m40l21K57L20J46j96l54J72J35l0j65R8K00j05j96
861a24p1L13J18j91p3KK32p2k98k07K63M02p6j77j76O6M87k82l22j0J44L19k18
884D9k14KK36O4j38j92Q3J18N4q9j59J86N2K8j77j0J15J24j56j62J41J44j4j16
$$ plain form
728 396 -51 -535 -518 199 640 -144 -567 -409 244 508 -80 -556 -262 407 380 -134 -289 97 135 -3 -195
749 -195 -62 333 56 -337 -110 163 312 -1 -396 -122 387 308 107 -383 -104 284 223 -135 -375 -258 293
770 293 268 -141 -223 77 318 130 -281 -240 165 472 83 -309 -54 267 322 -122 -190 -8 73 113 -187 -187 -41
793 -41 -7 17 -148 85 70 70 -239 -211 166 310 56 -380 -92 288 386 124 -423 -179 298 389 -194 -356 -198
816 -198 303 526 -109 -302 -215 125 236 -38 -123 -27 75 84 -109 31 24 -185 -256 -182 84 197 -70 -392 -98
839 -98 371 241 -96 -518 -177 271 355 -85 -406 -149 171 317 121 -233 -61 74 44 -121 -23 177 72 -124
861 -124 -195 118 236 45 -28 -26 206 134 -164 -371 -108 294 218 41 -135 -69 418 136 -186 -196 -52 267 49
884 49 -165 -163 73 137 -1 -193 -110 8 62 -27 -186 0 52 80 -97 -107 8 132 -24 -186 -45 99 85 -31
908c1m9J35J18j39l48J69M25j23l15j09K56L84m4m57k67K01L41p7j67j78J66K94
930A85Qj34k35J58R7N8j97Q8K2j71L2lK72n4l29o8K53J31q2j22l15L56L70j62
954A58k89M1J43K16lm17k50L54J58m8r3L9R7j35k3K18j02P7q9j16J23J13o8k26
978a22k2K03J28o1j26m36L77K36j20k12j06K07J56j29j34j0K48p7O6j93M6J53
1000G2j48M5p2J27k9Q7j58k25K04K00k7j58R0L2O4J6m4j3j2k32J29j2K36k0k89
1025a37k5J87K44j94k49n9K93l5J05j81j08J09J59J13k67o3K46j8K8j71L3P3j03
1048b0r0J38J74j35j68k5K15J12k52Qr5M5R1j5m4j71K23J52r2k17j24J94J80q1
1072Ck04J08O9Q6j72k2R5J9k6j14J36N6M6q2J41L7j48J34l15M6J30J86r3j86K3
$$ plain form
908 -31 -80 55 173 34 -314 -145 280 157 -158 -267 -11 373 329 -128 -395 -194 147 70 -97 -275 -109 185
930 185 193 59 -176 -18 79 137 -60 28 50 -121 -89 -92 180 126 -203 -271 -18 113 31 -91 -406 -50 320 158
954 158 -131 -90 53 269 266 -151 -401 -47 111 63 -30 9 106 -29 -52 166 64 141 52 -64 59 172 104 -122
978 -122 -144 59 187 126 0 -436 -59 177 57 -155 -261 -54 102 -27 -161 -171 77 0 66 -127 -81 72
1000 72 -76 -31 -103 24 -5 82 -76 -301 -97 103 76 -82 8 40 104 120 76 63 51 -181 -52 -64 172 152 -137
1025 -137 -162 25 269 75 -174 -233 60 25 130 -51 -159 -50 109 222 -45 -108 138 120 148 -23 10 83 -20
1048 -20 -110 28 202 67 -101 -126 89 201 -51 -43 -138 -93 -2 -17 -61 -232 -9 143 51 -166 -290 -96 84 3
1072 3 -201 -93 -24 62 -110 -132 -37 -18 -44 -158 -22 34 80 -2 139 176 28 162 -153 -107 23 209 116 -70 -47
1097d7Q2J75m6j71K7R5P1l43J35J24N2k35mJ52k03J77k7k46L4L7J72l0m5m3K01
1122I4r7P2j26J33Nm7k45J79J90j48j58NK73J4j50M5NqP9j04n1j44R9K44j57k63
1148b61K11J07J02q3k78J17M3J7m7M0qP8j46J75R8n6j49J05r6K70j57m7j10l5
1172a10J93Q6k19r6M8k3K37kk05jK35M1r8j20R4p4N5nN1l8k25oJ58K0N9j66J54
1199D3k0m9o6J51p7m6J03P0j5j82K9O9J7J6j45P3R3j41J6K4M8QN7k1j26P7Q9k01
1227a06j8J29j06P3MpJ3J1j00K5M7J03n1j36N8J30m4J8o5j9J10l6m9k6J14q9M5
1254B8J0o2j13K23R1j59K2j74J50J15j25o6L8K7q0jJ51L2k04J3M7J85l2q2k3J5
1280B6P8l4l9r1P0J09m1p4Pl2J65r2r3o3Q5l2O0p8J0J0k0P1l8l1k3J99k05j8N9
$$ plain form
1097 -47 35 210 164 -7 20 115 186 -157 -22 102 154 -81 -85 67 -136 41 14 -232 -198 -161 11 -19 -64 -107 94
1122 94 -3 69 -57 76 81 34 -211 -32 158 10 -148 -143 130 144 -6 39 44 36 115 11 -40 -184 -85 159 2 -261
1148 -261 -50 57 159 76 -202 -85 -42 -25 -72 -32 -40 38 -108 67 165 109 -40 65 -31 239 82 35 -75 -110
1172 -110 83 169 -50 -146 -98 -121 116 114 -91 -92 143 184 86 -34 60 -14 41 36 87 49 -176 -182 -24 -4 55 -111 43
1199 43 23 -26 -92 59 -18 -64 39 109 94 -88 -59 10 27 43 -102 -29 64 -77 -61 -37 11 19 76 55 -71 6 95 -106
1227 -106 -124 5 -101 -28 -24 -31 -18 -7 -107 -82 -35 68 17 -119 -61 69 25 43 -22 -41 69 33 -16 -42 72 -17 28
1254 28 38 -24 -137 86 177 18 40 -134 16 131 6 -60 -22 5 -75 -76 75 107 -97 -84 -37 148 116 34 11 26
1280 26 104 70 31 -60 10 119 78 4 11 -21 144 52 -41 -104 -19 -51 9 -69 -59 -49 -69 2 -36 -67 -90 109 -96 -114 -55
1309e5j6K13j20j78N0J39j1j50N5J3J09j6j30K15P6k33%MP6Q7j03p3J20j81J31
1334B2Qj5K4mJ58j38n2j3R4l4k9n3Q5m2q6L7P6j3r8J0LJ26j8r8o5J94m2J29j88
1363b2j20J01J60l2ok09RJ72Lj39Qq3R3R2Q3L3k30JR6M7m7l9l3m5J20n1J32k46
1391a52J9J51J54j12j20l5O4J24l4j3j49j1K35j47O1M8n5K4OK9m9o5K6p7Q9J12
1417A23k75J41J33r5O9n7j25K1n1P1L4J04j21P1J2q6L8q2L6Rp9P5J01Q0r4n4K6
1444B5MP6r4jq5l6J63n8M6p0R6m5p3J5L0o8O3L6M8r7P7q2K1J3N7R3k23l4J00j09
1474a12J59rq0l4k6K69k72J34q9J63K6j62n5O9j51K55k1L3n4j06J09n0P3P5j37
1499GLO4jj37k3L7j10K9J03l2j47J25J45q5N9P1q7J9o0q9J16rK9k4j12M6J14N
$$ plain form
1309 -55 -71 142 22 -156 -106 33 22 -128 -73 -60 49 33 -97 118 194 -39 -39 -35 41 128 25 -48 72 -109 22
1334 22 30 15 39 35 193 55 3 -10 84 50 21 -32 53 11 -75 -38 38 25 -73 -63 -60 66 48 -50 -115 79 37 166 -22
1363 -22 -142 -41 119 87 81 -128 -119 53 56 -83 -75 -158 -65 27 110 143 -87 -86 10 57 10 -29 -62 -107 13 -38 94 -152
1391 -152 -133 18 172 60 -60 -95 -31 93 59 46 -103 -114 121 -26 35 83 28 52 58 87 38 -27 -1 -78 11 123
1417 123 -152 -11 122 27 96 39 -86 -65 -116 -45 -11 93 -28 43 55 -31 7 -75 -39 -30 -109 -34 67 147 53 -1 25
1444 25 29 105 11 10 -75 -111 52 -6 40 -30 66 21 -52 -37 -7 -75 -12 24 72 -25 52 -30 -9 4 61 154 -69 -103 -3 -112
1474 -112 47 38 -42 -76 -102 167 -105 29 -60 103 129 -33 -88 -19 -170 85 64 97 43 -63 46 -4 69 144 7
1499 7 10 74 73 -64 -87 -50 -160 -131 -28 -60 -207 -82 63 -22 37 108 21 40 -20 -109 7 -2 27 3 -109 -63 51 56
1527E6r3j46J13R0j5o1J36j6r1L8r5N2j5K04k69J13KK4j66J09P8k44J95q7J32
1552D4k4j27J80n7L6p4m4J89n3k8M9q9K3K2Q4l2j61Q9N2n7p0N8l1P8P7j48O6l2
1580B0M2q0K1j25p0J89M3n8j22O6P1j41J26N2mo2N4%p4N8k09J05M2K3l3k9R0O3
1608E8j1N4l3j76J87n9J03n7l9j53J90Oj00K9n6MJ38o7QK0k1N3q0Q1n0o2N7N2
1636G6o2l4J62n4j84O9L2qj1o9%j1LJ13m3Q7k3R4q1N1j26j00J77p9lOK1Mj83J55
1666b1O5M5r7m6j1P9n4J40j43N5QL4p1N8j6n4J30j54P5j4Kq7P6O4k6j65O4O1J54
1695A51j19q7p8J24oP7r2p9J78Q9j93J12Qk48J55J53j11nr0P6N3L0j05K2jPL2
1722E3J24q6j74PJ92J4p1j22R6Mj44J65k2n1k0j8O6j30J6J06%j10N9n3J09o9l0
$$ plain form
1527 56 -37 -183 -70 20 5 -56 80 64 -27 11 -84 -32 -47 157 -112 1 3 27 -139 -30 48 -196 -1 -88 44
1552 44 20 -107 73 16 52 -22 -66 123 70 42 91 2 25 47 131 99 -62 27 79 22 -48 10 -21 57 134 -14 52 20
1580 20 62 -18 3 -122 -192 -3 40 -18 -140 -74 -3 -144 -18 34 30 -32 22 22 -52 6 -203 -98 -56 -33 -66 -95 -5 58
1608 58 47 101 68 -108 79 20 123 66 27 -126 64 70 -30 -1 -57 -53 85 18 26 46 25 78 -2 79 29 -33 24 76
1636 76 14 -20 142 88 -96 -27 5 -3 -14 -83 -83 -94 -91 22 -21 66 43 137 56 107 -19 -119 58 -21 -24 -18 3 7 -176 -21
1666 -21 44 89 -8 -54 -65 14 -40 100 -43 12 20 54 -17 41 25 -29 101 -53 22 8 10 -77 -1 63 37 -128 -64 -3 151
1695 151 32 -55 -133 -9 -15 62 -30 -109 69 158 -35 77 85 -163 -8 145 34 29 -61 15 68 98 -7 15 14 21 53
1722 53 177 91 -83 -76 116 130 59 -63 33 37 -107 58 36 -15 -35 -53 13 -117 -101 5 5 -105 -46 -99 10 -59 -89
1749h9O5J32Rj69M7K8R3j85rJ49p0K8j44J55M0r3r1J03m3R3P0p1m9P8j27J48o5
1776C3j32J45K2J8q5oN9n1k9Q5M1n7j08K38k21Q3j8j03J21j51j9R9Q3P3k5j10
1802a5Q3n2PJ8o3J53j68p3R2Q7j81J84J0M4o9j05R1R7k47K5Q8l1j60P2Q7J29j78
1829g5J59m1L5j44N0n2O0p3j19K48l0j9RJ3J19j65PJ02o2q0m1K51j18m2k7M5R5
1856A05k87P5M00k48j31O3K3N1o6j61L61q2o9r0J58l9j40R0R5j73L5o0O6N8j42
1881a08J50k2j0j33Q6J10p2j62J29J11J3k1j22K9M9p9l1J86j04j33Q1J57k5p2
1905Gj04J97j28K4k21K40Q3j74K6Q0oj45j6J03K4m2j15J19L0o0L0K6m1m2O6J36
1931I7j04o1k5J08N9k62Q0L31j45k61J69K20j39j52PJ10j0rj04J85j66J3l4K78
$$ plain form
1749 -89 -24 108 117 -52 -5 23 116 -69 -78 71 1 29 -115 40 80 -13 -104 -1 -44 49 119 48 -1 77 -50 98 33
1776 33 -99 46 68 86 1 -5 54 3 -26 59 100 43 -65 173 -48 35 17 -86 35 -116 -135 -36 47 120 95 -15
1802 -15 68 16 23 41 -22 131 -37 -110 -18 69 -112 72 82 126 57 -48 43 140 -107 -82 6 -25 -185 -113 -26 103 -75
1829 -75 84 43 78 -66 -16 -68 -8 -81 -200 48 18 -1 8 21 140 -25 -18 84 22 -58 -99 152 34 -8 -35 10 105
1856 105 -182 -107 293 45 -86 -23 0 51 -15 -176 185 103 34 -56 102 63 -77 13 108 -65 -30 -90 -24 34 -108
1881 -108 42 20 10 -123 -37 73 1 -161 -32 79 92 71 -51 -22 27 -52 -83 103 -1 -134 -53 104 79 7
1905 7 -97 100 -28 -4 -225 15 98 -76 -50 30 24 -121 -137 -34 -10 -52 -167 -48 -18 -78 -48 -22 -63 -105 -39 97
1931 97 -7 -68 -93 15 74 -188 -108 223 78 -183 -14 206 67 -85 -78 32 22 13 -91 94 -72 -59 -93 185
1955A85k65r3J23J15O7o2j55J57j50J3MJ96p4k51J85M9J96k07q8J11j4M3p8%J40
1980A47l26J03J79K0k59j7J13J43j41Lp1Q1q0o4K18J00j62p6O9Q0k08J47J68j44
2004B3q1J65K9l9k28P0J18P0j68M4K8Lp3j30K83n9j47l1J72R1l16J31oP9o3r4
2030a29J87o3P8j56K11l9k8k16L64J3k76l8J13J43k14N1J33j50k7m6J00o5j03
2053a57J5K47L3k04J6P9R6k67O0Q9L0j54P8O6j34n5J87k1r9L3j32K48k1j00Q8
2078B1O6M5k51J35M3O6j74oP2l6j4Lp9K15n6L2N3q5j43M6J98q5j44KO8O9Nq5P6
2107E7O5j79l5K07j53o1M0Q1p5J9j28L07J7k13l8Q6K46l95k0L13k2j78P2R7J5
2132A25k61J15j4J78k27n9J18M6j47P1J60J2k74P4K07j61j13K7K15o6r0J9J54
$$ plain form
1955 185 -80 -173 -50 65 132 70 -85 72 -78 -65 -61 135 61 -190 -5 44 240 33 -55 56 42 85 7 7 147
1980 147 -179 -76 103 123 -136 -153 -40 103 -38 -35 -106 -25 -105 -169 49 149 -13 -89 -20 60 -148 -1 167 23
2004 23 -58 107 136 97 -131 -61 57 127 -41 3 31 34 -39 -169 114 55 -92 -123 49 140 -176 -45 -51 28 -35 -129
2030 -129 58 -5 73 -83 128 89 61 -155 209 222 -54 -92 21 164 -50 1 134 -16 -43 -89 11 -54 -157
2053 -157 -142 105 138 -66 -50 29 125 -142 -82 7 37 -117 -39 27 -107 -162 25 4 -95 -62 -194 54 33 -67 21
2078 21 87 132 -119 16 59 125 -49 -55 17 -19 -33 -30 -109 106 50 82 135 50 -93 -47 151 66 -78 -76 -8 61 66 -19 57
2107 57 122 -57 -92 115 -38 -99 -59 22 -53 -34 -162 145 162 -51 -89 -3 243 -152 -172 141 119 -59 13 110 125
2132 125 -136 -21 -35 143 -84 -143 -25 21 -126 -55 105 117 -157 -83 124 -37 -150 -123 92 26 -64 -45 109
2155A09Ok11l8K27n6Mkn1rn6l9K26j7j8j30J37L5k00j06K41Q0j08L5J70j34j74
2181g9M2J35L4k40R1L7N5r6j31L11L8k81O9J44j05j93J08J94nj09m5n5K16r1j8
2206B6J18j3k03kK15P3k82K4J27n3K1PJ47l58P9O6K0m5R5k63N8K19j77Q8n9K43
2232A71j77m0M4M5k28J69J27j92R9k04J63l7n4O1l1J19l6m4J61q9r4n5J88k9p3
2257c6j96K67J76k09J7k0K5j70K13j00J5l1q5K64m4j20n6J54j0j79J54l7J42j17
2281A7RL6P2j83r7K24N1j71rJ42m3q3p8K18k8j82O8M2J8k3j15K60j77N1r8J38
2307E9L2k38M6J28m1Q4j42R7J61l48K10M8j04o3J17P3L5j93l0J97M9p8o6K6Ln1
2333A1KO8l5k54R6J00J62r4j38J08Q9j72j13K06J14k60k9K23j33QJ4OJ24r8j07
$$ plain form
2155 109 115 -96 -134 93 37 41 39 -12 -21 -77 -116 110 93 75 -55 82 117 -83 -189 52 132 24 59 229 95 -79
2181 -79 -37 98 132 -108 -17 20 75 -21 -152 159 197 -84 -15 129 24 -169 -61 133 128 19 -26 -81 135 44 26
2206 26 144 131 -72 -74 141 214 -68 -44 83 30 51 58 205 -153 -74 -8 12 -33 62 -201 -143 76 -101 -13 -72 171
2232 171 -6 -46 -2 43 -185 -16 111 -81 18 -186 -23 -60 -114 -53 -84 35 -1 -45 116 27 -67 -122 66 37 -36
2257 -36 -232 35 211 2 19 -1 24 -146 67 -33 -18 -49 -134 130 86 -34 -90 64 54 -125 29 -8 134 17
2281 17 26 62 134 -49 -146 78 129 -42 -51 91 48 -35 -113 105 77 -105 -37 5 23 0 -115 145 -32 19 -79 59
2307 59 91 -147 -101 27 -14 70 -72 25 186 -162 48 96 -8 -71 46 119 154 -39 -69 128 177 99 33 59 62 11
2333 11 13 81 46 -208 -112 -12 150 56 -82 26 115 -57 -170 36 150 -110 -139 84 -49 -41 -27 -21 103 5 -102
2358a02J36JN1k38R1J04q4o0J25P5j11j67J26J15j36K6L8p2J28p5jJ66k63j6J46
2383CL2q7lJ27j4n8l4M7l4j07L5J58j5r9O3N6R7k71J25N3oO8j17j27K18q5j63
2410a38J39K1q4J26J13k16O0k04J04J48k6L0K6p5m4pJ7J00j16L2l9K7j6n0K3K
2436d7mN4M4mj47J09M2nj24J4J41M9r1N3n6J2M1j33J26n2l3l6M8j28O8M2J17R1
2464A91j87n0N3n1K08k74R5N6q9J5M6O3p8j01J11N9j12K9K4n9m3j6Q0O5j11L6
2490d0k7P1q6l1J32Oj39L3J57j19J69k31P8J5M6r1J0K9R8j49J03N1k54K33n1m8
2516c5J14j01l6Q2l0%J6o4Q4M9j5m8Jo4K3mQ7n1p1J52n4j9L3j02pk4K6O8j13J01
2546bJ40j54J06n7j10J02R8p1r1Q2ro0J40m6k01J23J1rK3j0J3l0l9P6L5M8k05
$$ plain form
2358 -102 34 35 86 -152 -61 43 -41 -101 24 99 -12 -179 -53 62 -74 -48 -10 -82 46 -29 -30 136 -127 -143 3
2383 3 35 -52 -55 72 58 0 -34 13 -21 -128 -93 65 50 -49 14 70 167 -104 21 74 68 136 19 -108 110 25 -138
2410 -138 1 22 -62 64 177 -39 21 -183 -79 69 43 73 99 24 -20 -27 -10 90 -26 6 -33 -6 -22 -72 -49 -47
2436 -47 -51 3 47 43 -104 5 47 42 -82 -68 73 122 31 84 28 40 81 -52 74 22 -11 -47 1 -127 -59 -17 100 191
2464 191 4 -46 7 -44 164 -110 -15 41 -48 -33 13 76 -2 -103 8 67 -45 -16 8 -51 -94 -110 -30 35 -76 -40
2490 -40 -67 4 -82 -113 19 25 -114 -81 76 -43 126 -105 -27 -12 34 -57 -47 -18 80 -69 34 85 -169 64 13 -35
2516 -35 79 -22 -58 24 -6 -6 10 -54 30 79 64 16 17 -47 -24 -28 59 8 -63 89 35 16 49 -53 -60 -84 -58 10 -103 -2
2546 -2 138 -16 90 33 -77 25 123 52 -39 43 34 -26 114 68 -133 -10 1 -8 15 5 18 -12 -51 25 60 108 -97
2573i7j2Q6j1L6Q6r9k1n9q7Q8j2J06k8J31oj70Q1q6J88l2p4n1j7Q2J21r5K5m9
2601B4m4J48j27r0N4P9J1r5K6jL3j9j03J58rJ6l3o7Q2r8J05m0o2J8k0J09M1j13
2629a7J1K2l1J5L3O3j24K5J0M0p1J7K0L2k9RMk9L7j11N1K7mj18O1o4J86j25R7
2658C7kLj05J80j99J89o0L0R7k16j0Q7p9j1R8k7r9K9Q5J2L7j07P8L0o7rN9o1k7
2687b8k4J78k43K57p2j60P4Jk8O8o8O5k8N8p1O5K9N2q2q6N9j14J11L8p5k3n8J30
2715B5J3J5k7q9J09n3J03k6j32M1J07p2K2q6N9LL0J9K2j51p3K11j14l1PL6n0R1
2743Io6R5n7J6J22o6j63J31R4j45j2p4J40K4n7J9n4O7r1M8J27j04k4O0O2n7j42
2770i8n9K12k7q3R3P1j64qNK8J1kr7L4J0R5j1n3J4K0N4r8j2J22j3j43J44kl8J06
$$ plain form
2573 -97 -109 -23 -34 2 88 -11 -32 -91 -178 -90 -102 4 -24 107 101 -69 12 -74 114 82 8 -43 -60 22 143 48 73 24
2601 24 -20 128 1 -89 -35 44 55 -40 -14 -15 18 -1 -104 54 45 61 28 -39 43 -55 50 10 -52 -34 -54 55 96 -17
2629 -17 -6 16 -15 0 33 96 -28 -3 7 47 -24 -7 13 45 16 25 29 0 37 -74 -23 4 0 -118 -57 -121 65 -60 37
2658 37 35 38 -67 113 -86 103 43 73 170 -46 -56 31 -48 -59 39 12 -87 -58 27 39 76 -31 47 77 10 1 60 -1 -28
2687 -28 -52 126 -117 140 68 -92 -18 -17 -45 23 -45 20 -8 50 -21 44 73 125 43 -43 16 -98 13 51 -24 -47 -105 25
2715 25 38 53 26 -63 46 -7 96 70 -62 -21 86 14 36 -50 9 12 42 61 83 -68 -141 70 -44 -75 -68 -32 -82 9
2743 9 -57 38 -19 -3 119 53 -110 21 115 -30 -42 -116 24 48 -9 10 -44 23 -68 -20 107 3 -21 39 101 44 -98
2770 -98 -157 55 28 -55 38 109 -55 -63 -58 -30 -19 -21 -118 -84 -74 21 10 -43 -29 -9 45 -53 -65 57 44 -99 45 43 5 111
2800A11r2q9R4L3k5n3K3L1m0r1Q5j4J34j44Q7j74J53M7q3l3q5J76J6j61P0Qp7
2827i3K3OJ4J03L9j54j2m6J3J9N6RJ5k1N2q3P6O0q8j1P2k9M0k56Q9R4r0J19L0
2856D6%L9j42L5l0J23j90N0M9k9R8j8J3j0j14R7l7j11OK01r7m8L4J33q8K2Lk9
2884Fq8O4K3m1J09j72J02m8P1L3j13K8K1N4Ln3n8K3O2n1j0L0p0J69n2Pj61O9O8
2913B5p6L4O7j3j16R8l0N5J25q9o7nmQ3J1O5k6j35k0M7L8lr1L0P7k7J8o5l7O0
2943B9n0J24r2p9J1Q7K8q2n7P0k9o6R3QJ9n1J5J04r2M2n6o8J56j45M8r2K22j24
2971b7L9l9O8J7j49J74K4n6j2j21J33Mj53J21j0J04Lj05p4K7k1M6o0lJ56j06M1
2998B1n1l2R2q4k8J94j31J07j65K9K3m1K6N2o1J12j08J1N7J1jn8j4%R1p1Q2j42
$$ plain form
2800 111 19 -70 24 57 32 -21 2 33 -7 -98 -13 -27 107 -37 50 -124 29 76 -7 -40 -125 51 67 -94 -24 -16 -93
2827 -93 -70 -64 -50 53 92 -62 -74 -120 -107 -88 -32 -23 -8 -29 23 -60 16 76 -12 -23 49 20 60 -196 -107 -13 -103 16 46
2856 46 46 85 -57 -22 -52 71 -119 -69 -20 -49 49 31 44 34 -80 17 -20 -131 -125 76 -21 -69 -35 98 10 32 35 6
2884 6 -82 -18 5 -36 73 -99 3 -45 26 59 -54 -26 -5 49 52 -1 -59 -36 26 -25 -35 -5 -75 94 42 49 -112 -43 25
2913 25 -51 -17 50 37 -79 19 -11 44 169 80 13 8 4 87 98 163 137 2 -18 29 67 64 -27 3 80 53 71 6 -31 29
2943 29 -21 103 11 -68 -57 30 58 -24 -81 -11 -40 -106 -13 -5 14 -37 -22 82 -10 32 -24 -92 64 -81 -33 -125 97 -27
2971 -27 12 -27 41 58 -91 83 107 51 39 -82 51 55 -98 23 13 117 120 15 -59 -32 -53 -7 -67 -70 86 -20 21
2998 21 -30 -62 30 -54 -82 112 -19 88 -77 -48 -25 -66 -40 12 -49 63 -45 -34 23 34 33 -25 -39 -39 52 -19 63 -79
3026g9R5L4p7RM9p1K9MJ01j19j34J08Q9k1j5n3k5M2L7j59K68j24q2J14N5l6r4
3053e5N9m0o8Q4R5o9Q6k57K03o2J07o3m0O6j25R7n4M3m3P7R2q1q0n9n1J70m6o3
3081g7J29J1j21Q5j30Q7k7qm2Q3J48j21rK5j5j47Q8j0l9L1P2N2m6N7n3j32K22
3108A13r1R0j15K5j6m3P2m3m0N3p2K88j45k2p7L4O8j49M1q2P3N3N0o8M2p6J44
3135A07j17l7R5r4J13n5J59m1j71L3l6Q8Q4j23l8k7J43j17l5K0Q4m6o1J42j5j06
3161e1J49j16Q8k45K18j47m1J13j89L09l0j05l7Q6k1Q6j70J18J5k1L6l4O6j85
3185a08l3K46j69O8no9L1N6p9M3k9O5o7j20J89j12P0P9n4j01P5N2No5K2n9J26
3212E7K3r6K8o7J6J13k7l9j46k7J38R3n6L5r2o6N5l6J14j04KP9pJ9j06N2R4o6
$$ plain form
3026 -79 16 50 -27 -18 31 -40 -11 -7 94 -25 -159 -51 38 17 2 -51 -76 -34 3 -156 112 -12 -94 20 75 39 -55
3053 -55 4 -36 -104 -20 75 6 92 -165 38 -24 83 20 -20 46 -79 18 -36 7 -36 41 133 52 -28 -87 -138 32 -14 -77
3081 -77 52 63 -58 27 -103 -16 -43 -51 -93 -10 138 17 8 33 18 -129 -41 -51 -90 -59 13 65 19 76 23 -109 113
3108 113 22 112 -3 22 6 -37 35 -8 -48 5 -67 221 76 54 -23 11 79 -70 -29 -111 -38 15 65 -3 39 -37 107
3135 107 -10 -47 48 -46 67 12 171 130 -41 -8 -44 44 128 5 -33 -60 83 -34 -69 -49 35 -11 -72 70 55 -51
3161 -51 98 -18 70 -175 43 -104 -145 -32 -221 88 58 -47 -84 2 -19 67 -103 15 30 9 45 11 77 -108
3185 -108 -141 105 -64 4 -1 -70 -39 17 -62 -19 -48 17 -50 -170 19 -93 -23 56 2 -99 -24 28 33 -32 -10 -69 57
3212 57 80 -16 12 -55 -39 74 47 8 -138 -165 -27 66 10 45 -47 -113 -58 -94 20 -84 -82 -3 -10 9 -97 -45 49 -17
3240a7M7n9K5PJ9O4j31J08j03pJ01n0K5PP1r1J2L8j20J44j72kJ31j18P8j22M6
3267f9Mj7N6J6j81J99J90j01j62O5ln7Q6n7o3O9J12j03k5L4L7q3J18n0K8j08k5
3294i0J13j25J21j09J59l6q6n5J15Plm1M0l2l7J39j02N5k7r4J31q2K8J35k08m0
3320a24L0O8j36J10R2M2j43J10L7j56P7o6P2j24M7O7K2L9r1J76k86O5P4j7R7j94
3346a12O7j6J4J5K9K7K7j05J26j22%J26K7p6o9O4L8r7M6k4q8P9K8l0j09J21rn
3374b8q8M0P1K5L4j68R1O8j14K8M9lj7k6j6J34k8p5M0k1n6K1j0N4J3L0o9R5L1
3403A05k49J66j6OM3o6ML4J29j82O9rj97J42M6pj68Q1J03k39J98m2O8q7J34m3
3429B3M6n2l1P2j22N1K2n0L6j57P6n5J88m4L5M6l7K5m2NQ4k9j58M0Q6l5p5j4J02
$$ plain form
3240 -17 30 -29 -4 3 22 86 -45 63 -40 -47 54 4 29 36 107 16 28 66 -54 90 -82 -84 47 -71 7 -115 -69
3267 -69 -65 -82 -26 -10 -191 8 198 97 -65 0 -3 -60 26 -31 -94 -25 87 -16 -41 -7 30 -53 65 15 43 -65 -90
3294 -90 23 -102 19 -90 69 33 -53 -108 7 14 11 -30 10 -22 -59 80 -22 33 6 -88 43 -39 -11 124 -84 -124
3320 -124 -94 -26 -162 -52 40 82 -61 49 86 -70 7 -59 13 -111 -64 3 25 64 -27 149 -137 -72 2 -15 82 -112
3346 -112 -45 -61 -47 -32 -3 24 51 -54 72 -50 -50 76 103 27 -42 22 60 -37 9 -15 -103 -24 4 -26 -135 -14 -23 -28
3374 -28 -116 -76 -5 20 54 -114 -23 45 -69 -41 8 5 -12 -38 -54 80 52 -23 17 -4 -60 -39 -49 5 18 48 -21 74 105
3403 105 -144 22 6 12 55 -11 -7 27 156 -26 43 34 -163 -21 25 18 -150 -69 34 -205 -7 -49 19 -68 66 23
3429 23 69 17 -14 58 -64 -13 9 -41 -5 -162 -86 -141 47 3 38 84 47 72 30 35 119 90 -68 -28 58 23 -52 -66 36
3458C6j9r2J06j66K81j30j53J72n8J00j2k3j2o7P4%r1Q6N1q5q3J62m9l8k3o1J73
3485G9p7l9m5M5J40j04l9L7P1mj1j83J17J1PJ6j67J05kL8K9n9J10o2J25n3Lk2
3513F6M1l0j10O6p0r6J52n6K6ok0J00mo8l2M7P4q2N4m2m4J15o1J12l2o1m3j9k
3542b5m9K8J11q3j38K08Qk4K1l8P6k0n9j35J33m6o6K38j12p0q9J40q8O9o7J08
3568C1j06K79k49L5N4k23M2R1K1K3K8n6J35j72J7j9J14J5o6j2j8j19J47K7rP0
3594H0r9N6j2k2P2K7o5o5O0j44O5K8K7j8m1J10o2MLM0j09K37l09L1J67j17M4r9
3622a11J17j6M9p8m4J9j9OR6q0K15j96J38q5Lo5L2J31j48pP5J05o9r1Mp5m1J04
3650c1L0j01j8J56K2j22N4R2k58R3M1J36j54J19q6L3o1J48j30J16J0j37o1J25
$$ plain form
3458 36 17 -75 31 -135 146 16 -137 35 -23 77 65 42 30 -37 37 37 -54 32 83 -2 -85 77 28 -10 -33 -94 79
3485 79 2 -37 -82 -37 103 -1 -40 -3 68 64 53 -130 -13 -2 5 21 -146 -41 -43 -5 24 -35 75 13 138 85 88 66
3513 66 107 77 -33 33 -37 -133 19 -37 -11 -17 -37 63 59 -9 -41 6 80 -2 52 10 -34 81 20 132 100 39 -4 -23 -25
3542 -25 -74 -46 65 -18 -156 52 60 36 57 19 95 75 16 -119 14 -32 -98 140 28 -42 -131 9 -79 -10 -77 31
3568 31 -75 204 -45 -10 44 -179 -137 -46 -25 -2 26 -30 105 -67 -50 -69 45 60 -6 -18 -36 -155 -8 19 10 80
3594 80 -19 37 25 3 75 102 37 -28 32 -112 -47 -19 8 -10 -51 59 -3 1 4 44 -65 172 -137 -106 61 -56 -12 -111
3622 -111 6 -10 39 -39 -83 -64 -83 -77 19 -61 154 -42 96 11 14 -51 -19 112 -36 -43 32 137 68 -23 -19 -94 -135 -31
3650 -31 -1 -102 -120 36 58 -64 -10 82 -176 -83 -42 94 -60 59 -27 6 -55 93 -37 79 89 -48 -109 16
3674A6M7k66K80j14N7K3rk6O4j19J18j03J23r4J3P0j17L1o7O1Pm8lN3N8K6j09
3701b8J15l7o5MJ23j60P7J50j34O9k14M7N7Q8n7m1Q2Jj4k9K9K3p0M6j21M5Q3j23
3729e4kL6J4k9J1O5n5N9K9p6M7r2RJ49j69jj7J30N4j05O3r2R3K2p7j77J18j5P1
3758Ik3n8Q7o4P8J6j05R1knr0m1J53q0J5k5J11l5j25J79Rj43J21p9OLq8L0J33
3787G8M2j02k02J36J15q2PJ15j23J2O5L8l8m0O4j57K24j13lm7L5r3L9K5k6Q2L8
3814H9k1n8M1J20j05p5O9j20K67k48N1k0N8l8Ol9j9l3J70l3j6j7J0N2q5J01j73
3841f6J6J53j84N1L8m6J06p1m7J42q3k7mM6P7jq9m9N0l4k0M7M1l8L1jj4r8L8l
3871c9KL9N1j85R1P6J1j99K18q7J5L4NOq2J85j01j55Q5J44k8Mj81Q8j03J82k16
$$ plain form
3674 16 63 -203 77 -37 20 43 34 8 72 -47 71 -32 91 -3 10 80 -37 -6 -73 -12 -5 -53 -56 -3 55 81 -28
3701 -28 87 50 -15 -11 112 -48 29 179 45 114 -100 -53 4 92 35 -6 76 77 63 34 63 86 16 62 -59 -14 69 -54
3729 -54 -56 -20 -6 -35 -24 41 -14 45 74 -2 45 -47 -38 111 -58 -59 -76 54 108 3 66 -26 67 89 12 -165 -47 -62 9
3758 9 -14 -72 15 -49 29 45 -60 31 29 24 -66 -107 46 -34 -19 -44 67 32 -93 86 95 -48 73 -6 0 3 -85 -55 78
3787 78 120 18 -184 -48 67 -15 -8 107 -16 -4 61 99 61 21 85 -72 152 39 36 -11 24 -69 -30 -5 -31 51 89
3814 89 68 10 51 171 66 -9 60 -60 207 -41 10 -10 48 10 16 -23 -42 -75 95 62 46 29 39 91 6 107 -66
3841 -66 -50 103 -81 -30 8 -38 68 -3 -50 92 9 -18 -22 24 101 100 11 -38 12 -22 -42 5 46 8 39 38 24 -74 -36 -39
3871 -39 -37 2 53 -132 -41 35 46 -153 65 -22 -7 27 32 38 -44 141 40 -115 -30 114 86 90 -91 -3 -106 76 -140
3898a40J04p4Q5R2o5N8n6n0J49P8p1r1kq1M2J08m6K6j04%K8Q0q7j0J02p4L9q3
3926d3J10K4m7K1r8m3K20k18L2KJ10j46R9P0n5q3N1n5N1j48J52L1p9P9m8O4j87
3953a34J54j00R1o8R6m7m7J00P0p0Ko4rl2M3L3J6k7p5R2o7M3m3O8J2pp3L5p4J53
3983G1q6j42J83m8qQ4o2j22J41NJ2J8k0j19O1qP9rp6J02r4mJ07j3K9n8J6m9M0
4012C0j5k3J48k34J58J5l3o6J07j52J09j29Q6M0r2K6Q3o4l9K3J12r0j15J22Ll4
4038b4m7JJ0J21m9J5k6n2L9N0K4o6r0K24j36m1L6J31k40J94n1k6L5J4q5j37J31
4065d5R9o4mJ32p8m5M4q0J16r6L3J74j36p4K5j47L8R4nMp4J13j1q3J52L6o4Qo7
4094eML8r9m4Q7r8K17j64O6p5Q0P6k6j27N5J24j45k1J88j44L9p5m3lJ17P4j16
$$ plain form
3898 -140 -36 -110 -25 67 2 60 4 -46 103 181 110 19 17 -64 -22 86 40 66 -38 -38 -10 70 -17 -27 75 1 40 -43
3926 -43 67 91 44 65 -33 -76 144 -74 -42 -40 70 -76 23 93 38 -45 6 -49 2 -146 6 37 -42 37 -11 53 -134
3953 -134 20 -80 11 -57 39 -8 -55 45 115 45 47 -17 -26 -58 -15 18 34 7 -68 24 -43 0 -43 25 37 30 -43 -8 -82 71
3983 71 -15 -157 26 -22 -30 54 -8 -130 11 16 28 46 26 -93 -32 -40 39 30 -46 56 -38 -42 65 52 81 23 39 -10 30
4012 30 15 -8 140 -94 64 79 46 -20 87 -65 44 -85 1 41 -51 -25 58 -6 -45 -22 90 0 -115 7 10 -24
4038 -24 -71 -70 -60 61 12 27 1 -51 -12 38 62 -4 -94 130 -6 -47 -11 120 -120 74 23 -3 32 46 -39 -176 -45
4065 -45 54 -10 -14 118 40 -5 39 -41 75 -21 12 186 50 -24 1 -146 -108 -14 -19 -15 -89 24 13 -70 82 118 54 62 -5
4094 -5 -1 37 -62 -106 -19 -117 100 -64 2 -73 7 83 57 -70 -15 109 -36 -57 131 -13 26 -49 -92 -95 22 96 -20
4121b0Nm3M1M7L6j29j1j0K8J10L9k06R1J25j67L7Rj33N8J69J7q0j0Q2o4L0j67
4148a16J14N8Nr4K2J81j73J17k05R5j34J26P6j7k3j4O2j64J03%O5r1L7r0J4K9
4174a7M3n1J46p9m3L4on4q4J79j23M9K0l7R2p8J58k46J99j44J18j06j17J21O0
4199C4m2M2O5j39J39k6j53K10r0m7L9j70J01kJ02q3j34J71k5P3qj38J47O6k35
4224a03Q3J19n1n4K9j04J57j4p8j4j13K7J58o1mO6Lnq7p5J65m6m0q4K69n7j00
4251a4N6M8p9o9O2K9l3M8k5n2q7J27k8l5J00j27L5O8l2n7O2J15j25J8j17J14o4
4278f2J28j63J69j3P8q4k1m5K9k5rK30k89J16M8L3j21m2J28r5K0j2J4K1r9K23
4304A57j14j15P0L2m1P5Kk36J59l8o0L6O7j6M0K4kJ4p2K5OP3j34O1j88J43L7j3
$$ plain form
4121 -20 -15 -58 -17 30 66 -63 -74 -84 -56 54 93 -113 -22 103 -64 -27 -18 -151 -93 76 93 13 3 85 21 51 -116
4148 -116 -2 56 61 -33 -11 170 -3 114 -91 4 -130 -4 72 55 32 18 80 -84 19 19 84 -7 30 -60 -46 -17
4174 -17 26 -25 121 42 -1 33 27 -27 -111 68 -55 -6 14 -23 69 -9 149 -97 102 -42 76 -30 -147 -26 34
4199 34 -8 34 99 -40 99 73 -80 130 40 -7 32 -138 -37 -39 63 -20 -154 17 -8 65 57 -81 66 132 -103
4224 -103 -20 99 48 -6 23 -81 76 62 -16 -30 -143 -116 42 -19 -23 43 46 41 -46 -121 44 -2 -42 -126 143 86 -14
4251 -14 42 90 11 -58 4 33 0 48 23 -29 -116 11 -17 -52 48 -79 -44 24 -8 -65 -3 112 -13 5 -112 2 -62
4278 -62 66 -97 72 59 137 53 32 -13 16 -9 -18 212 -77 39 87 120 -1 -43 85 -10 10 -2 12 33 -66 157
4304 157 43 -72 -2 30 -11 64 66 -170 -11 -49 -109 -73 -6 -22 18 42 40 54 -18 7 13 86 -48 13 -175 -32 5 -8
4332hk2j5R1OL2j39L2j7m8R6R6k19J91j6j7P3j69RJ02j36L7Q1Mj00k3L9l3Ln2
4361a22J81k78K14M0mm1pQ6j14Q4J2OJ4r2j01k4J01J41q0k6K6o8L0m7R1l5Q7K8
4389A02M5r9j50P3m1rJ22j02l5J82j73Q1j26J64J4r5k6O6L4r0Q2P1j09M3p4lJ03
4416E0k0j37J05r8Q2J82k01OJ42m2j34P5J6N2j39J1J08Q1k41J42K9k36M9J68j04
4441e4K5k5K6L7n3R6o7K7l9L5Q0N7j48L2j82J50K8o9Q3l0rN2l2l8P2k6r1O8O5
4470G0j24R5j06J41j0j26J36M2j28J8L1o4P6J18j61o2K6J10m7L7m7m8l5J58j3
4495H7j40M7p2R7j10J36j06J18k06J54k2J29K4j69N8o8M6q3J96o3J6O4j24O9j8
4520F0M7m9j07J27j2j43%j6J98j32P6j27K0N3N6j3m5nN5o9j1J21q7l2Pk6J55r5
$$ plain form
4332 -8 -30 -45 46 52 84 -55 -23 -40 -88 8 104 -115 76 60 43 116 -53 -44 58 -78 -41 40 44 -56 -79 -40 -73 -70 -122
4361 -122 59 -219 -5 35 31 -10 -17 69 -45 39 51 57 71 -21 -122 -146 -45 96 16 -10 16 -52 -22 -69 22 -13 74 102
4389 102 147 48 -102 -29 -70 -79 43 -59 -94 88 -85 -4 -130 34 48 -47 -73 -7 27 -63 19 90 -19 24 -50 -53 50
4416 50 30 -107 -2 -100 -18 164 -37 -31 111 69 -65 10 26 78 -61 -50 58 139 -102 40 69 -167 -118 50 -54
4441 -54 -29 -54 -28 9 -44 52 -15 12 -27 8 88 145 -3 29 -153 -3 25 -44 39 9 0 52 20 -18 54 28 -63 5 70
4470 70 -54 41 -65 76 66 -60 76 118 -10 8 39 -25 51 169 8 -54 -28 82 35 72 25 -23 -58 100 87
4495 87 -53 -6 -78 19 -91 45 -61 57 -149 5 -17 112 136 -33 25 -43 3 -80 116 53 69 133 9 78 60
4520 60 107 58 -49 78 66 -77 -77 -93 105 -27 49 -78 -58 -5 51 38 -7 -12 43 -26 -37 84 -3 -35 -28 -54 101 6
4548Fj55J44r6J66j19J10j20J31r8q8J44O9q1l5J08m4j06J34j44J10j8j05J81
4571I4m8n8n3M3N7n0N0l1ok4J4R7l0l4j14J60j02N0j33J25j09Q5J6kn9N3L1Q2
4599A04m5J03j78N7n7O8o3j9K03j29J5r7Q5qL6j68J51j2m2j32pK26J2j76J04m9
4625a8j8O4QP0j63J47q4Q0j49R5j58K73p5o1m0j6Q8o3O1J05j36j03K4Q9O7j54
4651f7O2J8PK4P3j05n4M3p3K7k6M2K8j8L2j14J45n9Q0j14O0m6J21l7j56J01O0
4678E4Pq5jN2q7Q5J1J8j25R6O8j33m6J7N8j01J80j12J06Q1k61J51K2jo2p8M4k4
4706f6K16j40j7q1J53L5n7Q8r4pLj5n2N8jJ4p5M7r2J74r1j05j9J18nOj6M2o9o0
4736a08J16R9r4l3Q9l3o4J75p7o9k8P6o0J05j12j56K84j81J32P9k25J62j80P1
$$ plain form
4548 6 -149 -5 -101 65 -54 56 -64 67 -31 -119 25 94 13 -22 86 42 -64 70 -74 36 18 -87 94
4571 94 46 -12 -65 -22 35 -15 35 4 -2 -26 -12 85 55 21 -93 67 -35 15 -118 7 -102 -17 -1 -3 -62 -9 22 104
4599 104 59 162 -16 41 -16 52 -11 -30 173 44 59 -38 47 39 75 -93 58 46 4 -128 -135 91 103 -73 31 -18
4625 -18 -36 28 36 106 -57 90 6 86 -63 32 -126 147 72 11 -29 -45 43 -20 41 146 10 -93 -69 20 87 -67
4651 -67 -5 13 20 44 117 12 -42 1 -72 -45 -71 -29 -1 -19 13 -101 44 -15 65 -49 11 -35 86 49 -107 -6 54
4678 54 61 -24 -25 27 -60 25 36 54 -71 25 93 -40 -86 -69 -11 -112 68 -44 62 143 -118 33 55 54 -8 -86 -42 -66
4706 -66 150 10 -7 -88 65 100 43 131 37 30 33 18 -34 24 23 37 -38 9 -83 91 0 -105 -124 -6 -11 -5 -21 21 -48 -108
4736 -108 8 107 13 -20 69 36 -28 147 70 1 -27 49 -11 94 -18 -174 110 -71 61 140 -85 77 -103 -32
4760c2R0n6K1j83K90j38j65K59n7L1P6j12j57J24N2k8m3K3J08k19J24RM6l0o7
4785c4P8j12J13p7K6m3J26j22O8m3J66j30j10L8J14k07K14o0K8m4l6j4J5J95o1
4810H8n6o9J57j16j7N4p0lj17J01M7n8K3J03m7k2o7l9J31J9q7M8M1o3q6R2L0K6
4838D3j18QJ09q2J6j0pP5L8m8r9O4n6K6J33j91P6J8o1nM4m2O4J99k07L0R3o1Q
4867E7j99J90k5l4p1J53n7k9J29j83J2k1N2RJ26L9l07K49l2n3K2J18j57R7j58
4892g3J86j21K1m5k0R1mJ76k69J72j01j2m0M3M1m5O2j29J44k8m2J30j45O7QJN8
4919A26j38p7K10j76M9r1P8L2Q3m8j65K09k06O9J82n9q2J3M2nM8j24J15j17L3
4944Ap0k3PL5N5k9J23L5k87J56mL0J06k04k7R7N4j41P1l1Q6N5k7n0J09j33P6r2
$$ plain form
4760 -32 58 2 23 -160 130 -8 -173 86 29 60 136 24 -133 -9 43 15 -28 -5 103 -116 8 17 63 33 -34
4785 -34 44 -68 45 -32 -6 -49 77 -45 23 -20 146 16 -94 -56 58 -149 65 5 33 -11 -47 -61 -46 149 88
4810 88 32 -37 120 4 -13 41 -29 -32 -149 -48 -1 -59 -36 67 20 -2 -69 -108 23 42 -45 3 44 -19 -105 -13 17 43
4838 43 -75 -67 42 -40 -24 -34 -41 34 72 24 -75 -11 -67 -41 92 -99 -23 -5 -66 -71 -27 -69 -5 194 -13 17 110 49 57
4867 57 -142 48 23 -11 -82 71 14 -15 114 -69 -57 -78 -26 -17 109 148 -159 90 58 5 27 145 -12 85 -73
4892 -73 113 -8 13 -32 -52 39 35 211 -58 114 13 1 -39 4 45 0 62 -67 77 49 7 137 -8 59 67 68 126
4919 126 -12 -89 121 -55 -6 -97 -19 13 96 48 -117 92 -114 -45 137 78 -4 9 51 46 94 -30 85 -32 1
4944 1 -69 -92 -85 -50 5 -24 99 134 -153 3 -1 29 135 -69 -96 1 55 -86 -15 -46 40 95 68 18 127 -6 70 -22
4972b2J8M7q6J65j18p6Q7n6o7N9nJ30o8lj9JJ63j15q1J26o6lj19Q9N7p0Q4J6l4
5001C4L9k49J91k9p6J12o2J40m7no8o9J16j06J22Q2j17j4M2j10L2J32j60O3N2
5026D5j73K3J55M5j63R2k3q2J28p7K9J22j40k2Q8k6j33K50j67qO6MJK2j05M6j16
5053a19m0J92k05L15j96L4k2k5LP4kq2N1Q5k39J25J35rl7r5J28rp8N2L2PNrp5
5082dK4R4j51J27k0m0n9J48q1J3k7j20J44J8r0O4P8j24j51M08k53J11p0j16JR4
5108A8Q5J4j61R0l1N7p1K5n7Kj34K65k0j12n4Q8Q6j31J47j53J38j08N4q4J29M9
5134A31m5j2l5o5J68j10j14J05Nk8K2j01J17K0j1r2J11n1r9J92j15j5M0O2o2r5
5160g7PN8M1r5J11p5J22j97R0P7j67J02n3J37p3P6j16L2O5l3o7P2j05O3P5n4K4
$$ plain form
4972 -22 -4 43 -43 122 4 -72 15 -41 -108 -49 -54 76 8 5 -14 -13 150 35 -46 80 14 11 -108 -19 38 -32 52 68 34
5001 34 73 -176 15 -14 -90 22 -40 100 53 48 -20 -89 27 -79 43 125 8 -6 36 -74 -42 90 -70 -7 45
5026 45 -128 -105 50 95 -68 24 1 -81 47 -30 -1 121 -19 -41 47 21 -112 138 -29 -37 29 33 34 56 -49 -3 -119
5053 -119 -159 33 -172 143 -53 -19 -41 -66 -63 11 9 -73 -22 63 -176 -51 84 75 38 -57 71 62 -16 36 68 75 80 71 -4
5082 -4 20 114 -37 90 70 30 -29 119 38 51 24 -96 48 66 -24 40 118 -6 -157 251 -2 109 39 -77 -76 18
5108 18 103 117 -44 46 15 72 1 26 -31 -29 -163 102 82 -30 -84 4 90 -41 106 -47 91 -17 37 -47 82 131
5134 131 86 74 39 -26 142 32 -82 23 28 0 22 -79 38 58 47 -45 66 15 -84 108 -7 -22 18 80 18 -77
5160 -77 -70 -12 29 -66 45 -30 92 -105 -15 62 -105 -3 -56 81 8 84 -32 0 65 32 -35 37 -68 -5 70 16 40
5187D0j24M5J38j60L1O8K5m2J4j43K35n4j40m3J65o8j1m5pl3L4J06m7J7R3j35
5213d1N1o0l4N2j4M1J9l3K2Q3Nk5q4J16j52J73n1l5J2J6j43J35N6k10J19n3M3
5240HJ5Mj98P3J87r7k4qn1Q7j25J44M4j27J55k15J35L4p0N6q0N3P0j38J08p0Q7
5267E7j32J09k6k5L6jJ1l1O8j51J77n6m5K4K1or5L8N3nR9q8l2q9J17l0J0p6J3
5296e5J49j93N4M6M0M5j39J02rj73J36j02N9L5nR8q0k0n4l1J20L4k3r9O3m0O4
5323B2r2J44o9pQ5l3o8q2J44j9j8q6J92q2q6J24n7P0jm2j10K7O9k2OK1K9L0j67
5352g8J49k6q1M3Nm2J64r8N7o8o5JJ4j5L7kk2O6M6j82P2J03j22J08k0p9l5R8m4
5381a6J00j22ll3kJ2r7K51p0N9j43Q2Ro0p9J67j33K4J28j17J00l2L5p0M3j0l0
$$ plain form
5187 40 -84 -39 99 -61 -30 38 63 21 35 -108 127 73 -67 -110 55 -13 -24 -69 -76 -109 -75 31 -16 1 94 -41
5213 -41 10 -50 -84 -32 -46 -5 14 -19 3 86 91 66 -18 98 -54 119 68 33 45 61 -82 53 109 -101 18 -35 8
5240 8 23 27 -171 -98 89 -8 -32 -40 -91 -4 -129 15 59 -68 87 -128 7 41 -29 27 -53 0 70 -68 40 -30 57
5267 57 -75 34 8 -17 19 18 29 -2 66 -85 92 36 -9 15 36 30 -65 -27 26 21 120 32 0 -89 28 -2 8 -68 -55
5296 -55 94 -99 -45 1 41 86 -53 49 40 -133 3 -99 -40 -5 -10 88 8 -12 -66 -97 23 57 34 -65 -2 -42 22
5323 22 -70 74 5 -2 83 50 -18 -100 44 25 7 -79 113 31 -55 69 12 82 81 39 -71 -44 25 3 9 30 59 89 -78
5352 -78 71 45 -36 7 12 -30 134 36 93 25 -40 -39 -25 -40 -3 -5 -27 39 85 -97 -25 78 -44 64 44 -35 -70 28 -16
5381 -16 84 -38 -41 -74 -76 -64 -161 90 20 79 -64 18 27 -33 -112 55 -78 -54 74 -43 57 25 60 -10 33 23 -7
5408gj18J24k1K8J40r1L1j01Nk7n4K4J40p5K9j02K4K7j79K84j51J06K2k0J25k84
5434a21J33pn5K0%R7r3nL3M4L2j5m7n1ql4l4K08q9k0P3k0Rq1Q2m2j5N0j37J32
5464C9j5j15J68j54J36l6M7m2Km6lM2m8j6M7L5Qo4M3J02j10Kj09M4M3J49j85O7
5492C1p3l9Q2L4j13M2m5K4k6M6K3J0JM7n0k6J71j73j3K8J3K0%J7m4N8n2o7O6J3
5522EO6q2J46j57M8K3p1J09j91K15j29J05o9K1nm7L5q3o3J57m2O2J30k17j2P1
5548B5L1j35P6K4R5j24RM8l3rM1M3n2j37J60j30P1o2R0N6q6L4R7n1j3J10k01k1
5576d4n9J2J48J0N0j44j9J73j77L9J38p2j00K2r6J26j0%N8J2j53j0J55n0p7N6
5602a2m5J76j11Oj64Q9K2nO0L1j40j6K09o3j23P8Q6p7O1j06O2j8Q1o4k7p9J12
$$ plain form
5408 -7 -125 -1 -22 6 146 55 86 -15 -10 -37 -91 -67 73 -2 27 -75 -51 -24 -203 81 -70 36 58 38 163 -121
5434 -121 12 5 -50 -30 -30 67 -26 -31 2 46 78 63 16 -35 -43 -77 -111 97 8 -12 61 41 50 -31 51 9 -6 44 -93 39
5464 39 24 -91 77 -77 59 23 70 28 30 -16 -19 23 -25 -41 6 41 49 -15 28 130 20 22 -87 -43 0 149 -36 31
5492 31 -42 -81 1 35 -78 -36 -81 -57 -83 -37 -14 -4 -3 44 -6 -32 139 -34 -47 -19 -6 14 14 31 -13 45 -7 -74 -8 5
5522 5 71 -11 135 -22 26 49 -22 87 -104 111 -18 87 18 39 34 -13 22 -61 -124 33 -9 53 183 -34 -46 25
5548 25 56 -79 -3 21 116 -8 1 49 16 7 48 91 39 -98 62 -68 3 -59 31 87 1 35 132 81 68 178 -23 -44
5576 -44 -103 -91 57 67 117 -27 -46 127 -50 -11 127 55 -45 -23 -119 7 -3 -3 55 67 -86 -96 59 9 -68 -12
5602 -12 -57 119 8 14 -150 -61 -39 -44 16 47 -93 -109 100 37 -86 -8 78 1 62 -44 18 0 81 17 -10 -89 23
5629B3r8J28j14K06r8p7Pq4J20l4J1M8J16j32m7J62j81R1K4Oj32J28l0o0J03j48
5655f2J08N2l4j49J26L9j09o3R4LK6Mr5N1M6l9j03K00j17P0p7J9J15j66R9lj39
5682a04J4K24j13o6R0p7j8LJ49r5J2j25K44j36O8r4q0L8O1J53j87j32K1K10K1
5707H1j22K3m0J23q5q1J77n6j6j73K10or2j4J4J29j36Q0j0o0l0J14n3j8L6JP6
5734G2j02K6j45K38o9j07N1k6J07n2J01j12rn3J02kp4L6l0MP1m7j17J50Q2q8k6
5761a9j56J20k2O9M3m3Q4j22o7J54j45O6M4o2n5Q6J50j14M5p3Q7r4r7J15j44j4
5787a64N4Q4o9M6J38k20K53j37M0K2q9J10j83J2J01m7m3J4R7N5j84K08j72kJP4
5813aj21P0J78j69O7j33O4J16q9p4J26j14J19l7k7J5Kq5J63r0k9LN9m8K3l2P7
$$ plain form
5629 23 -75 53 -61 145 47 -30 -23 -107 13 -21 -10 38 154 22 -25 137 -44 47 71 77 -55 73 43 -17 86 -62
5655 -62 46 98 64 -85 41 80 -29 -92 2 5 31 35 -60 -9 37 -2 -105 95 -22 48 -29 -10 105 -61 38 35 -104
5682 -104 -90 134 21 -45 45 -32 -50 -47 102 7 19 -106 138 2 70 -24 -104 -66 -5 148 -39 -171 -150 60 81
5707 81 -41 -18 -58 65 -20 -101 76 20 4 -169 41 35 -57 -71 -57 72 -64 16 6 -54 -84 30 -23 -41 -5 -4 72
5734 72 -30 -4 -149 89 20 -87 -36 -62 45 -7 94 -18 -27 -80 22 20 -54 -18 -48 -44 27 -20 -137 13 95 7 -19
5761 -19 -175 -55 -77 -8 35 -8 76 -46 -113 41 -104 -38 6 -56 -111 -25 125 11 56 -17 70 -24 -121 -6 -150 -164
5787 -164 -110 -26 -95 -49 89 -131 122 -15 25 47 -42 68 -115 -103 -2 -49 -92 -78 19 74 -110 98 -74 -76 -75 -1
5813 -1 -122 -52 126 -43 24 -109 -45 71 -18 -92 34 -80 39 2 -25 -10 -8 -93 70 -20 -49 -46 13 -35 -12 -44 33
5840C3p6rK08p6o1L2r2N4k6O4q4J8n8J52L5n8M2j53J25q4J20l0Rj25Q2l3o6q0
5868a37N0J45J0l6M5j2j11J11k3k5N3oo2k0l0J65j42Q9p3M4r1MpP2R%j1o4l1M2
5898d2N1J9j1L1O1r0M9j43L5PQ2L6j06J1j41K41j45R0m6K0j14K17j25K5j35Q1
5924d2J30r8M4j01L5J20j44J10j1j16K24J9j41J6j00M1rO1j47K25r0O8k8r1J5
5949a0P0r5P2p4Q0l3m2k2R9l1j15J7O5k6Q7m5qN6p7J0kJ07lq0K3r3O9J20p0O0
5979A09L3p1r4M5o7J25j28KO0j17P3O4K6m1JK1k5p0L7Jj0o6N4L9N2j61O5j5k4
6008h2k8J76j10O5j4r5PK6n5J80k8j10K7Pk4l1Q8L9p6J84l1j24L9o0Q4j7l2K9
6036C4N4m1o8J2R2j12Q3k0k6j00J24j03J27k0k4jP5j81J04pP2j00M6l2J02n5R
$$ plain form
5840 33 -43 -52 156 80 19 51 -41 13 -13 51 -33 -15 -73 79 114 56 98 -55 70 -14 106 76 85 -40 42 9 -57 -137
5868 -137 -87 58 68 32 77 65 -46 65 42 17 70 64 2 -18 -48 117 -25 64 -9 35 -56 -52 -59 13 22 22 11 -53 -84 -42
5898 -42 9 28 17 48 109 19 68 -75 -40 -33 49 85 -21 -10 -151 90 -55 35 -11 9 -105 112 -13 12 -123 -42
5924 -42 88 -10 34 -67 -32 88 -56 54 43 -73 151 170 29 45 -55 -14 -23 38 -109 116 26 94 66 -25 -10
5949 -10 60 -35 37 -37 43 10 -32 -54 45 14 -101 -84 -19 -45 42 -3 -11 45 -32 -22 -24 83 80 0 23 -70 -1 119 49 109
5979 109 142 71 -23 22 -45 80 -48 -46 14 -103 -30 34 60 19 20 41 16 -54 -17 -16 -26 -92 -38 1 53 -108 -43 -58 -82
6008 -82 -110 66 -44 21 7 -88 -81 -55 -110 70 42 -68 -41 -34 -58 -89 -1 38 -38 146 115 -9 30 -30 54 37 5 34
6036 34 88 47 -21 -9 83 -29 54 34 8 -92 32 -71 56 36 12 11 86 -95 9 2 74 -26 20 -12 90 35 44
6063D4J2L2l5k1l2l2L7%o5O4m0p9J35pj6Kp4L5J22j04O6q0M5L6j53J86r4r3J36
6092B7k0P3o5m1qN3k0k8N6j36R6J05n3k0r9j6J85p8J0P4j30J25q7j02J94k36N5
6119h6P4rO2j03Q0k3N8J00j53q5M2P4M7rq4J69k33P3r2P3K6M1o6l8mJ03n9J43
6147A21p3m0j26J88j60Mk8J61j47J31m9J15k9j2o9n7J63k0q5O2L7j60L3J4J22
6172I6j43j04L4J44o8p3P6J27j02Lk9J11j69J89k3j93K8j4K21o1j21J07o8m9J1
6197g0R2l6J6M1l9L5m8M2o1%m4Q4Q4p4j01N2n4j1O5NN6nm6P9p9J31j25j3j4j49
6227a87J76P6o9OR4j59J23j04K7n2J45m6q5O8Q2j1k7k0J0j94J00R6j02Pn9P1J
6254c3oJ07r3M1q0R2j6o4N9j39J34Nl0qJ5j17P8kJ8J24j81R2%l9R3L6M0j46J2
$$ plain form
6063 44 56 88 53 32 0 -32 5 5 -60 4 -36 -115 20 13 -3 -1 -75 -40 82 -22 44 -36 9 45 -108 78 -16 -109 27
6092 27 7 80 15 -26 -34 19 -1 -29 27 -109 -13 92 39 19 -80 -96 89 11 21 95 -35 90 3 -99 95 -141 -86
6119 -86 -12 -21 41 -62 18 -5 53 153 0 -85 -43 31 78 69 -15 154 -79 -6 -98 -25 1 42 -24 -62 -66 37 -22 121
6147 121 48 8 -118 70 -90 -86 -114 47 -100 31 -18 97 68 56 -13 -70 93 73 -12 50 87 -73 -40 -26 96
6172 96 -47 -151 -117 27 -41 -114 -38 89 -13 -10 -39 72 -97 92 69 -124 -96 -110 111 50 -71 36 -32 -81 -70
6197 -70 22 -14 2 43 4 39 -9 33 -28 -28 -72 12 96 22 -79 -27 -81 -92 -27 -22 34 29 -17 62 -17 114 -11 -24 -38 -187
6227 -187 -11 65 -4 2 96 -63 60 -44 -17 -69 76 30 -55 13 95 84 57 37 47 -147 -47 49 -53 -46 -105 -34 -33
6254 -33 -39 68 -25 16 -64 28 12 -52 7 -132 2 7 -23 -31 -16 -133 -55 -57 -39 85 -96 -4 -4 -43 50 86 126 -20 -8
6283hL9K0m5r5J32j42O8j04L7J05j39J16o2J20J9Q0k24L4O5o3J8J8PK5p3R1Q7
6310A26j70l0j0Q0O9j90Q6Q7j24J72j37P8k3l1l4J84j08p4k0M7j5k3J19p0Q3j24
6336e2P0M1j31%N1k6J05j52P0o1N2O0m2m9M9l6J71k11J6L1j5L5J04j42K0j4J06
6363E0j18J81j69K6J4K6lk9J3nj4R0j41J55j39O1%Mp6O5j7J1l3J2q2N3J19p2p5
6392i3J53j53RJ58q1J04j16J27j54K9J18Q5j11n7j50K35k09L2Q7r9Q1J95j13L0
6416A07k3k2ppj04J26j67J20R4n2j74J65j72K6j3JJ25j48J19q6Q2k8J44p9pJ11
6442A31p7n7O4m9j2m6O9j03Q7N7j01J5J03j48R3o0R0M5k12P6n8N5K2J86k14m8
6468i2J16j09K8J36k03J17K6j0r5N7M0q8J19m5M8l5JK5kr0J11p0J3k4mN1po8P7
$$ plain form
6283 -8 31 51 6 -89 43 -99 -31 -135 -98 7 -132 -16 -78 42 61 141 -83 -49 16 -47 -29 -11 -4 21 -52 39 126
6310 126 -44 -74 -84 -4 65 -125 -39 48 -76 96 -41 37 14 -17 -51 133 25 -49 -69 -22 -37 -60 59 -11 72 -52
6336 -52 18 59 -72 -72 -21 -47 58 -94 -24 -85 -33 27 -15 -64 -15 -51 120 -91 -75 -44 -59 -24 80 -62 -42 -56 50
6363 50 -68 113 -56 -30 -16 10 7 -22 -9 -14 -28 62 -79 76 -63 -2 -2 2 -74 -9 -26 -15 -48 -36 -118 -65 54 -18 -93
6392 -93 60 -93 -84 74 -7 97 -19 108 -46 -17 101 186 75 18 -132 103 -106 -74 13 -86 -5 190 77 107
6416 107 84 62 55 48 -56 70 -97 23 117 65 -109 56 -116 -90 -103 -102 23 -125 -6 -92 -10 -38 106 27 20 131
6442 131 54 -3 61 12 0 -46 23 -80 7 64 -37 -22 81 -67 26 -34 56 101 -111 -35 -93 -38 -16 170 -44 -92
6468 -92 24 -85 -57 79 -124 -7 19 9 -86 -29 11 -77 42 -3 45 10 11 36 34 -56 55 -15 -2 -26 -30 21 14 -54 23
6497B3q2j8P1K0j1M9K0j48J02m0P2n4k9K42k16qj7J59n5J7j5j61K39j19m0j45
6523a44R7J41r8N1K3j25J7QP9m5j16J7J02P7j15J0L5L0j38K3M5k5K4J1J6k00J02
6550i8L8N5K3n5J13n4K2R0n8j44J15Mlj94J36K5P4l2m9j8N0N0K1m4j08P0k8K4
6578B5J0oM6q1K9K0o0p1R2k8l9l5K10l1m4j26J95k83J90p7P2K4o6M6j05J19K1
6605D7J28k06n2JK03o9r9o7L0O2K6n1K9M0Kj13QN3K5M6q6NM0j42J22J8n8R1K3
6634E6o0K3P3j08n7J27j2j36K6O9N0N8j41L0j1M8j44O4l8L6N5j1n8J14M9k18j2
6661a28J26rk2jm2Q8j6N9l7p7Q5o2K3J29j82N8Ll0L3m4N2N1j2K6q6P0k00R0N4
6690aqQ0j22J08k9Q9p1j1o3J19j43R7K0q5JN7m3OP7m3j36lM4l2K3P9o3L5Q2q4
$$ plain form
6497 23 -59 -77 -6 14 3 52 72 -76 26 -14 58 4 -25 217 1 -7 -24 135 80 97 82 -79 160 41 1 -144
6523 -144 -47 94 -4 47 70 -55 -38 -30 49 4 -112 -95 7 84 -31 -21 14 44 -94 -71 -26 -51 -27 -16 0 -200 -98
6550 -98 -60 -5 18 -37 76 22 44 134 76 -68 47 51 48 -146 -10 15 89 57 8 -10 40 90 111 67 -41 29 1 25
6578 25 35 29 75 -6 23 43 -17 -88 4 -24 -63 -98 112 81 37 -89 106 -177 13 -64 8 32 -34 12 -93 26 47
6605 47 175 -31 -83 -82 121 52 -47 -114 -84 -22 4 -47 -18 22 24 -89 -81 -28 -3 43 -43 -38 2 -140 -18 0 -58 33 56
6634 56 -4 19 92 -16 -73 54 42 -94 -68 1 51 109 -32 -2 -13 35 -109 -45 -83 -47 8 -3 -61 53 102 -116 -128
6661 -128 -2 -11 -33 -34 -76 12 -4 55 18 -59 26 -36 -13 116 -66 -8 -5 -35 -2 -46 6 57 45 71 -15 55 -145 -55 -1
6690 -1 -9 71 -51 57 28 117 46 35 -28 91 -52 45 65 -20 -19 38 -5 1 78 35 -101 -104 -60 -92 -69 10 -53 -18 64 -20
6720b0k1J34j41m2J15j7m6M5Jkk5KKj2k1J4OQ0j65K9J05j64J86n8O1q7L6O7l8
6749B4L0j11R0O7r1p8J28j46K6K06o6r3Pr3J48k9m8M0l3o9J24o5k9Q4j9K9j22
6776h9J04k1K7J03k08K38j39p4J09J46k75J43l7j26O1P0o4j13K41j34M0KN9N0
6800A13k25J94j46Q6p4J99j35M8j05L9n7l1o3J27NL5j1QJ1ML5O2p1j97J18l3o0
6827a24J99J20l05J24j03J15j56L6K8J12j09N4j5r6O7M4K1J42j34m9p9R5j9JR1
6852F0l9J55o8j4p0O4p7n5M6L4k3N0n9J2k8M7j0J49p1j23n1K1J5r5K14j29P6j01
6880g0J17m0j7k0jK7L6j7j09K7J9J15n3m0N2j03J24j25J29j13%J19L0j61K0J00
6906D6l4n1M1p2R7j8L1mo7k4k1N9k2J00j34p0J10K8J64l49J69l4J63r3j14J98
$$ plain form
6720 -20 -41 93 -48 -90 25 8 -38 7 8 6 -19 -17 -15 -27 -48 -34 -28 52 -113 -84 21 -143 43 -15 46 -41 -5 62 24
6749 24 54 -57 33 100 9 -69 59 -87 -61 145 79 -14 -7 -100 48 19 -29 11 -22 -91 33 -32 -61 23 4 33 -89
6776 -89 15 -6 21 124 -84 154 15 -59 50 196 -79 64 27 -99 -38 32 -32 -145 96 -38 2 4 63 113
6800 113 -112 82 -64 22 -52 147 12 60 -45 -6 -63 -94 -157 -30 -25 10 -1 7 18 22 57 119 48 -149 -31 -64 -124
6827 -124 75 195 -110 14 -89 26 -130 -94 -66 46 -63 -9 -24 -120 -53 -9 12 154 20 -29 -108 -13 -32 -31 60
6852 60 21 176 108 94 24 88 11 -44 2 36 13 63 4 16 -12 35 25 174 103 -20 -71 -50 -35 -130 84 -45 31 -70
6880 -70 47 7 -10 -30 -31 -4 32 15 -94 -67 -48 67 14 -26 26 -77 47 -78 51 -62 -62 57 87 -74 -54 46
6906 46 12 -39 2 -70 27 9 40 36 -31 -55 -76 -17 -39 61 -73 -143 -33 -5 159 -190 -21 -55 108 15 -99 99
6932I9r0l5O0Jq3O6J34j15j28R3l6j3P7K0ok8j25P4J4l9J72k9j59P6n2P8j51R4
6960c1N3O9q4m5N0M6q1J06j52K54k34J03o8r8J26k6j7OR1j64J53j4L0l0o9J6R6
6987H6q7m0J17j11J69n8j23O8J7ml1Oj62K07l0p4J32%j31pK7O0P2r8p0L6Q3j61
7015a07J8Q4K4P1J01k07J6J0J5o5J2J3p5KJ25o4L1O7n4M9o4K9O0k3k8j15L6J28
7043H9N8j93m5J29l3J5m3J43j54PO4p2Q1j13L2Jj6J13l5L7o0J18p1mk7nl3Q3j37
7072g1J33j35J8J52j93J08n0J27p2N8j55MqJ26j03lJ22j31J31m8j11R2l6O4J0
7097B9k8n2j3O8j62K37q8mmQ2k5N8r4Qmm7j4J02q3m0J90j39j03O6R9o8Q8J8j48
7126g1L9o3j5J11n0N0n9O9l1P4j45J43l6j4K3l7o7J31j01n2J28J9l3J11j00l5
$$ plain form
6932 99 9 -26 34 35 -48 18 152 37 -91 2 -34 -47 30 50 44 16 -109 -35 -21 -60 112 83 -76 0 -52 26 -125 -31
6960 -31 22 91 7 -38 12 58 -23 83 -69 185 -49 54 -14 -112 14 -12 -29 -23 68 -96 57 43 73 43 -26 -10 86
6987 86 -1 -41 76 -35 134 76 -47 21 38 34 3 9 -153 54 24 -50 82 82 -49 -56 -29 31 103 5 -65 -29 54 -107
7015 -107 -89 -5 19 90 191 -16 0 10 25 -40 -28 -15 -90 -88 37 -27 4 71 17 66 2 31 91 68 40 -75 -39 89
7043 89 147 -46 -91 38 5 20 -23 120 -34 -27 37 -35 46 -67 -35 -34 -50 63 28 65 5 123 52 48 21 16 -17 66 -71
7072 -71 62 -73 -55 97 -96 12 -38 89 17 75 -80 -76 -84 42 -61 -64 58 -73 58 10 -101 -9 -45 19 29
7097 29 1 -51 -64 4 -158 79 -9 -13 -17 65 40 98 4 12 8 -39 -53 49 -34 -74 116 -23 -126 -60 39 -29 59 77 -71
7126 -71 -32 -95 -110 1 -49 1 -58 11 -20 54 -91 52 16 2 25 -12 -79 52 -49 -101 27 46 13 124 24 -11
7152a1R1n3j28J87m1p1J12j40J20Jj70R1P2o6M6j16J53j37J6mN0o0J22m6O6j41
7178e7M1Pj3N7m0J2oJ7m4J13j31J43j46Rj1J16N2o3KN8j61N3Oj14P0N7J9j29L
7207h0nJ14lj2L5J5j30N9K6K3p7L8l4J06j24J01p0N3rK1M6j56M4L1JqJ0q0N2L9
7237B6Lq5Q3rM0Qj38P4m4J00j64J13J4k01K73j21k2j3J03j93J19M5j43O7R0j4
7263A1j47N8K2J27l4o9o9NJ49j53Q3Om5J49n5K7j46L1j5P2l6m4P3M4r3Kj26J41
7291c2N5j26J69o2K5p8J25J16j80Mm0K8q1J15J17j08J0pPK3j68J59n3k8L5j90
7317a65J99m2m7P5J17j32J15j32N3k8K5m5o5L3l0R1q9L2n9J95j55Q7J5Oj82K29
7343A01p6p5N3qjK6l6Rl4R4r7N2l3j5J4N2p5L7N3j6K1J26j53j16J53j06R3O9j8
$$ plain form
7152 -11 80 27 -101 86 45 -26 86 -54 66 67 -103 -12 60 -6 40 -76 77 -60 -44 -48 2 -58 64 18 84 -57
7178 -57 -16 -9 -22 35 -5 7 1 18 -26 87 -44 99 -47 -38 -49 67 119 56 58 116 -45 8 14 -100 -30 27 46 -83 -80
7207 -80 -85 29 26 14 49 64 -66 -7 19 42 -35 3 -31 75 -49 52 -18 35 26 47 93 -63 -19 12 13 5 15 -65 -13 26
7237 26 29 -56 27 18 58 66 -72 2 -42 58 -106 7 21 -180 93 -28 -50 -63 40 -153 -34 11 -132 -65 25 11
7263 11 -136 -78 -56 71 37 -32 -101 -96 53 -100 -17 -11 -56 93 38 65 -81 -50 -65 7 -29 -73 0 44 -49 -47 -173 -32
7291 -32 23 -103 66 4 29 -49 76 192 12 16 -24 4 -77 38 155 47 57 50 57 80 -88 71 18 -10 25 -165
7317 -165 34 -8 -55 20 137 5 120 -12 41 13 38 -7 -72 -39 -69 22 -67 -35 -94 101 -54 33 48 54 -128 101
7343 101 25 -50 3 -5 -6 20 -16 -7 -41 53 -44 8 -25 -40 -26 26 -49 -12 41 25 46 172 19 -97 56 -50 43 112 94
7372I4o7r1L5Q3j49O0J00o0j24Q8q6K20j67J13l0n5N4J8j7N7p5kJ5j09J20M7m0
7399C2M2n9Jm5J41k58J58M9j32Q7Q5%q8K16l13J33j7o7j34J55m3o1K03LRj19Q5
7426F3j4o4J25j76N8l3L5p8J61m4n1O0p9J69n5p7k2K9J21o7j04J5o0J06o6M9J4
7453A5j5J5j60J43J40rj24nl3Q9j62R6kj9N8qj01M8J15j39l3J21P9j74P1Q1k9
7480E8j08k8K9M7m3n1R3K1K1jM6M1j24J6Rp8J67r4j08J16l2n6k9Q3P4L4j68J71
7508A06m9m3N4l4J10j67n5N2l9l3R5rqJ2J47j78l9m0J72k5k5jJ52k58M3P1l4R9
7536G6L8j71J12r4n8N2O4k7n1K3J31n5j31J38K9j41P8p8Q4k14J44J09Nn6o7R1
7562C1n1N4J2k14K90j21o4J76j5r7N8l3n9J0j2jJ03j1q9k8K8J9K1O4l5l8N7Rq6
$$ plain form
7372 94 27 -64 -29 54 -95 -35 65 5 -119 -31 -117 103 -64 49 19 -36 18 36 19 76 1 -1 14 -95 25 72 32
7399 32 74 15 16 -29 112 -146 12 61 -71 16 101 101 13 229 -84 49 32 -35 -169 -14 -57 -118 85 88 97 -22 63
7426 63 49 -15 110 -66 -8 -41 -6 -84 77 33 -18 42 -37 132 77 0 -22 7 128 61 -43 -28 -88 18 -48 1 15
7453 15 0 15 -145 -2 138 129 5 0 -33 56 -106 -10 -12 -31 27 19 -82 -34 81 -58 -91 30 109 -65 6 87 58
7480 58 -50 -78 -49 -2 -45 -96 -3 18 39 38 84 125 1 17 26 -52 115 21 -87 29 -3 -59 -88 -5 69 103 -65 106
7508 106 57 14 68 34 144 -23 -78 -26 -65 -98 -3 -12 -20 -8 139 -39 -78 -118 54 29 4 3 155 -103 -60 11 -23 76
7536 76 114 -57 55 -39 -97 -45 19 -8 -59 -36 95 40 -91 47 76 -65 13 -65 19 -195 -51 58 63 7 -60 31
7562 31 -20 34 46 -168 122 1 -63 113 98 1 59 26 -33 -23 -35 -36 67 56 -33 -61 -33 -14 7 71 36 -2 55 64 -22
7591b2M6k3l3J78j97oJ34j61K0pO4QMr8N6R8J1p0j5O5j7n7m1L1O7p5J10m9j15
7620i4J60l3o5K7J9j20J62O5j32jm2oR4j2m5l2O6L8j27J73Jp1M9j40J63j16M1
7647B2O3j40N6k4N8L3q7N9j5M6j43P4j08K31r6j36J06QL7O7j39J55j34O3N7j69
7673e6j9N5PP2Rk1qn9L3M3qmqn9k0J09j0j82J74NK2M4j21j6j51K43p3o0j3%P1
7704aN1k3j39J7O0k2P8j6j05K13j56km7J92r4p0J07j17J04Rj03L6Q9r3J9RMqJ36
7733A28j20K9m6k0M3l0Nj48J89j26Q3O6n2p4J36k05P7N1j40J33J77j86n7J24K
7758C9p3j10J86q8O3o3P5m7O8p4J14p6J9r4R2r2K8O6p7J14j57P6l5R4j14J08o1
7785a9Jo4J70j5rlo2j25O3J39%l5p9P5l5j55K26q5J3N0%j39M2j14J88j26J55r7
$$ plain form
7591 -22 24 1 -32 146 -51 -57 77 -84 -64 -71 -7 1 5 -93 -37 61 72 2 -13 52 35 -22 -63 -32 35 -40 70 21 -94
7620 -94 66 33 -32 -5 14 -106 56 121 -11 -12 -54 -60 34 22 -23 -55 11 49 -78 95 96 25 74 -66 97 -19 22
7647 22 85 -55 1 -23 35 68 -19 40 25 71 -72 2 -106 125 29 -107 -1 7 44 111 -28 127 -7 56 113 -56
7673 -56 -75 -20 -13 59 68 47 39 -20 13 56 48 44 36 -23 -43 66 56 -126 48 53 75 119 -2 -18 -169 74 1 -59 -72 -72 -1
7704 -1 50 27 -112 -95 -35 -57 21 5 -100 113 -43 -45 -92 100 6 -64 43 -74 30 39 -64 -28 61 -32 -13 -4 0 -8 128
7733 128 8 37 -9 -29 14 -16 -11 -159 30 -96 -13 53 1 -73 63 -142 -65 -14 -154 -21 156 -30 -87 37 39
7758 39 -34 -144 42 -46 17 -46 29 -18 50 -24 90 14 33 -61 31 -61 -33 33 -44 70 -87 -11 -46 48 -66 42 -19
7785 -19 -18 -82 88 73 64 61 -1 -126 -63 76 76 41 -38 37 2 -153 73 -12 1 51 51 -88 -46 -160 28 -98 57 -40
7813d0M8m7l4J92j13M4Q8q6p6Q2q8J02m3m1l3J12j23J09j15J53j40R9mo9k5oJ46
7840I2m8r5n5J15m4Q5l5M0q1q2J88j88J27r1J19j12J68j35nP1N0o1p0Q8k2L1m
7867D6j64R6p9K31q5j50Q2K2KL4K2l1k7p3P3L8o7k4J4M0L5n1J14j13M3l1k1n8
7895h2o7Q9O5L7Oj1K2l1k7%Rj17J47m8J36m2k6mN4k9J2k0N9rk11R8l0N2q3J45
7925I4J8m9q2R9L2N7q5k6k57J02J07q0K7L1O1o9m5J26O6j05m9K1R3l9J17j74L7
7952B8p0L6M2J1k73K48K2O5p1q7J79l1j43J20j8mj05l6J36p2P9j55J28o3M3q6
7978g7J53j23P1j6rj8M0K4l7N3k11K47j02j1l7R2j47Q0m1K4LO5Q8k39K41k34K06
8005H5k5j8kn4L8q1J8j7K9J4O6o2oN6o5O9q6l5R9K0j38O9J2Ln6J77ko4j45J56
$$ plain form
7813 -40 8 -39 -73 119 6 50 138 52 -24 58 -30 72 29 -12 -45 67 -56 53 -62 91 -49 50 46 -23 -48 -54 92
7840 92 44 -51 -106 9 -35 50 15 55 -26 -108 80 -108 19 -72 47 -65 103 -32 -37 34 84 23 -47 41 19 50 46
7867 46 -118 -22 -101 130 45 -105 -23 -1 1 35 57 26 -1 -74 -1 37 -30 -54 -40 0 35 -16 98 -15 28 -3 -24 -82
7895 -82 -149 -60 5 42 48 37 59 28 1 1 10 -107 40 -8 128 86 60 56 110 81 93 73 132 123 -88 10 -20 32 -51 94
7925 94 112 63 -19 80 112 169 84 58 -199 -97 10 -70 -43 -12 49 -20 -65 61 127 22 -27 -6 87 48 165 -9 28
7952 28 -42 -6 36 47 -226 22 44 109 38 -49 130 99 -44 76 58 54 -51 -87 49 -23 56 -99 29 -34 9 -77
7978 -77 76 -47 24 8 -1 -19 21 45 8 61 -150 97 -5 -16 -53 39 -108 -28 -69 -45 -42 23 111 -128 113 -121 85
8005 85 60 42 40 -14 24 -57 -39 -56 -27 -13 53 -9 -15 41 -24 45 -41 -76 23 43 -95 -26 -14 -11 -67 110 108 44 -101 55
8035E5r6K4j2L1n2O4l5j09K00j48O0p4LJ91j63J23L1KJ5j23n4J08r3jJ4o0K30
8062A31k27J16ON1k2j73j4P3O4o3L3k4K5N5j56R0K2r3J03K9Q7j76J53q5o5J06
8088D6o2J62o1j74M5O4L7n1R8q9j61O5k2J44%m2M5m1l6J73j56j84J04Q9n7j9J51
8115F8q4J73j1j28m9Q0Q0k13M0L1N1q9K3Ll1J64j00N9K6j17LO6Pm5J2p5O5%Q4
8144I3j31J71l9r7L9J0Onl2n5J29j19Q0N3k00J25m4M0j5q5On5J83j99J55j22R2
8171a6M8l0k0J5M7j09O6%p9J08j60J92j31j7Q5L9L7q8r3J18
$$ plain form
8035 55 -41 -17 -29 2 -50 14 -21 -130 70 -78 -18 -92 -89 102 -61 62 93 95 110 -13 -67 41 -52 -53 -39 -99 131
8062 131 -96 20 26 77 55 -118 -132 -59 5 -58 -25 -49 -24 31 -125 -35 -13 -106 -3 26 113 -63 90 5 -60 46
8088 46 -16 146 85 -89 -44 20 57 6 104 15 -146 -81 -103 41 41 -1 44 3 -33 140 -16 -200 -96 -7 -64 -83 68
8115 68 -16 157 146 18 -31 49 129 -84 -44 -13 38 -51 -28 -25 -56 108 8 67 93 -24 -21 45 52 7 19 -56 9 9 93
8144 93 -38 133 94 -3 36 46 52 47 15 -40 89 -30 50 103 -97 28 -16 24 9 -76 -70 -125 58 -141 14 -108 -16
8171 -16 32 2 -18 -3 44 -65 1 1 -78 30 -130 62 -69 -86 -1 38 75 -13 -106 12
8191A2
$$ Imaginary data points
##PAGE= N=2
##DATA TABLE= (X++(I..I)), XYDATA
0@%%%%%%%%%%%%%%%%%%jLmMmMmOqQj0J2j3J5j7J9k2K5k7L0l4L8m3M8n3N9o6P3
46C8q0Q9r8J08j20J32j44J58j75J94k15K39k66K97l34L78m33N04n96P22r09J218
68G07j848N663j3690l875K1673N039j2334j0636O698R182j381q135l90L374O54
83G01n79L42l931j074O903K332r669m484J0050Q843r343j3402N976J6562j367
98G860j7223m369J5772P815j1513q764O307P773j381m798j238J982K667J959j499
113A350m184j195O922M952q353q772Q775J1587o623j3246K557J3985J792j2999
127c452m991J0797P111p515p319M858N836j809l295o13L05J596K298j114n284
142b591j388P171M536p758q373O083J2023l524j3691l7J2872L468j0204o009O746
$$ plain form
0 0 0 0 0 0 0 0 0 0 0 0 0 0 0 0 0 0 0 0 -1 2 -2 2 -2 2 -2 4 -4 4 -6 6 -7 8 -9 10 -12 13 -14 16 -18 20 -23 25 -28 31 -35 38
46 38 -42 47 -51 57 -63 69 -75 83 -92 102 -113 126 -140 157 -177 201 -232 272 -324 398 -511 707
68 707 -1141 4522 -9168 -13043 8630 13669 1335 -9301 -2603 6579 5198 -2937 -3327 47 701
83 701 122 464 -3467 -4541 2362 4694 -4975 -9459 591 9434 91 -13311 -7335 9227 7860
98 7860 -9363 -13732 2040 9855 -1658 -10422 -4115 3658 2277 -2521 -3759 -1777 890 2849 1350
113 1350 -2834 -4029 2893 7845 -508 -9280 -505 11082 4459 -8787 -6230 7755 9547 -3452
127 -3452 -8443 2354 9465 1950 -5369 -511 5325 3516 221 -392 -87 1509 3807 2693 -2591
142 -2591 -3979 3192 7728 -30 -8403 -2320 9703 6179 -7512 -7549 5323 8791 -1413 -7422 -676
157f76O137l610n741J282L613o08k061N55l83r86K894R82m693k146N982M674o099
174h84p762M924J0847j816j2214j779J1495N000q771o425M861O207j261m400k97
189b275K324N45M41J46j671j295L103K875l840m445M497O124m315p741K717R088
205F278l41r680k587Q647M930o372o066L670N545j316l523l29R93J052J005o84
221A222k580r76L530K830m018n108L317P142k308q434O76Q532J360p495l508N960
237A42M622m060m614K011L788o32k503k9P77l7R51N20k663j250L483K973l615
254a36n013K971P064j232p786j292P832L319o611m267M316M191j638l663M87K338
270H80J41r67J18k85n21J179J227j949j990K696L241k868m677K230O156n58p188
$$ plain form
157 -676 5461 1851 -3890 -2608 1005 397 -1664 -1109 -1492 -2478 416 1398 -3295 -5441 541 5215 -884
174 -884 -8646 -3722 7125 5309 -6905 -8684 2811 7811 -960 -7385 -2524 3683 2422 -1978 -2275
189 -2275 49 594 1035 1181 -490 -1785 1318 4193 353 -4092 405 6529 2214 -5527 -2810 6278
205 6278 5937 -3743 -6330 2317 7247 875 -5191 -1521 4024 2708 -815 -1144 -151 901 1906 1222
221 1222 -1358 -2334 1196 4026 8 -5100 -1783 5359 3051 -5383 -4707 3825 5185 -2310 -5818 142
237 142 4764 704 -3910 -1899 1889 1257 -1246 -1275 -498 -535 416 936 -1727 -2977 506 3479 -136
254 -136 -5149 -2178 4886 3654 -4132 -5424 2408 5727 -884 -5151 -835 3356 1718 -1945 -1458 880
270 880 1021 54 172 -113 -634 545 1772 -177 -2167 529 3770 902 -3775 -1545 4611 4053 -3135
287c135j568O770L506n078m878K981M658r65l352m51J353Q00K82k28j150j091
303a546J848J884j880k886J704L711j500m672R73N284J48n465j806M889L406l909
319A83l972K030L771m28k763n29J208O47N83k90j772m59K246J645j955l005J529
336a331M233j004m636k93M834J689m505k512L397L256k006l080P99K528P6j605
352a60l17O19J00M31K21j021j062J681J830j954k941J681L835n19m525j034M806
369A671K167l777l172K314L275r27k630j20J441N62m60n11k37k76P10P22p25j406
387a379R81K046j277k694J091L509n03l774q48L626K143l053l127J810L148j66
403A533k438q34J185J022K42m51j059j12J188J093j153j747J004K073n53k421
$$ plain form
287 -3135 -4703 2067 5573 495 -4383 -1402 3256 2291 -1061 -1512 -159 641 923 695 -455 -1546
303 -1546 302 2186 306 -2580 -876 2835 1335 -3337 -2364 2920 3068 -2397 -4203 686 4092 183
319 183 -3789 -1759 2012 1584 -1179 -1708 -500 147 730 440 -1332 -1791 455 2100 145 -2860 -1331
336 -1331 2902 1898 -2738 -3031 1803 3492 -1013 -3525 -128 3128 1122 -1958 -1159 1369 1445 -160
352 -160 -477 142 242 673 894 -127 -1189 492 2322 368 -2573 -892 2943 2424 -2101 -3135 1671
369 1671 3838 61 -3111 -797 2478 1551 -1079 -1199 242 804 344 -167 -404 -680 30 752 27 -1379
387 -1379 -398 1648 371 -2323 -1232 2277 1774 -2000 -2848 778 2921 -132 -3259 -1449 1699 1533
403 1533 -905 -1739 -554 468 710 259 -800 -912 276 1369 216 -1531 -527 1546 993 -1428
419a428J4K955L86l142j037K805J996k076k453J034K446J67j998o44R11P91K12
436I39o02q86l19J268J103j484j670Q55K247k12k650m69K794J164k382j799J734
453c69K225j006k028J62J402N94q07r21L94L59L94j19q39k49Q67J002q55j508
471a302P69K169m90k340l06K246J402k152k035J180K259j39k026p21J218P02n0
488C84n55n45J62P74K66m56p96M97J071l92j319M70J466J6k016m22K027J063j510
507A85j860P73K112M0j504q18P11J170J27p97p40L6J000O90r63j019M65J099o9
526F38j370j30J223N38j364p40J195J303j015j285N25J378J67j134p37N80R05
543F77O0q19o53J83R51L80p77j167Q61J268m57j281k81J349P87j046j155O95J345
$$ plain form
419 -1428 -1414 1541 1927 -1215 -2252 553 2549 473 -1980 -946 1500 1667 -331 -975 -64 727 939
436 939 337 -549 -868 400 1503 19 -1651 -796 1451 1239 -1411 -1880 914 2078 -304 -2103 -369
453 -369 1856 850 -1178 -1016 386 980 173 -748 -354 5 399 280 -559 -808 59 1061 206 -1302
471 -1302 -533 1636 1146 -1194 -1500 746 2148 -4 -2039 -859 1400 1261 -765 -1486 -268 434 384
488 384 -171 -716 -554 220 486 30 -766 -269 802 410 -909 -439 1027 1043 -973 -1395 632 1695 185
507 185 -1675 -902 1210 1250 -254 -1072 -361 809 936 139 -601 -565 435 1125 162 -857 -392 707 638
526 638 -732 -862 361 899 -465 -1205 -10 1293 278 -1007 -482 896 1063 -71 -808 -228 677
543 677 737 -82 -735 -552 399 779 2 -1165 -304 964 507 -774 -1055 294 1081 35 -1120 -425 920
562I20l48j367k81J137M24m83n91j28M89M87k03m25J6M73M30m30n46K65J055k59
582F35j181m6J241M31r66j198N64J482J0j299n44P10R31p2r08l42M01P03J36o89
602am04L96K96j12o18J72N75p0r46r4Q87P99r47q38M21J082K82j042r13P69J051
623G45j34o89p71M93P33K38q40n20L43Q69k86n20q4N30L86n55m39M84O28l95p83
644e67J19O94M05q16k67O3Q01P8o49n03L16O82K3n57l94P35M46r2j051K27N91
665B84M24n57o13J95P38K36j009l09N77M91k48m38l5L06L67k07n98R6N95l8l22
686f5n13L80M43j86n59J93M92K44n45n41K74P74J93p35m07N02N67N6p62k30L60
707f5N44J03p03k47K36M38k11l94K00K52j47j56j58N88K28m98n08L09P24L0q13
$$ plain form
562 920 572 -795 -1076 61 485 2 -589 -717 -228 259 56 -369 -353 120 550 120 -426 -161 894 635
582 635 -546 -592 649 1080 114 -1084 -520 962 972 -327 -871 -161 770 698 -210 -552 -151 552 688 -1
602 -1 -405 -9 287 175 -443 -271 304 234 -712 -806 81 880 -67 -905 -484 598 880 -162 -1075 -306 745
623 745 611 -78 -849 -356 377 615 -225 -745 -402 467 181 -339 -423 107 493 -62 -501 -17 611 216 -567
644 -567 -448 246 651 -165 -432 -369 432 510 -139 -642 -326 356 379 -178 -572 163 609 517 -534 -307 284
665 284 708 151 -462 -267 471 707 -302 -611 -34 457 209 -229 -264 42 409 202 -396 -300 295 257 -65
686 -65 -578 -198 245 59 -500 -307 185 429 -116 -657 -383 391 584 -151 -558 -56 511 567 -195 -425 -65
707 -65 479 582 -121 -368 -132 306 95 -299 -99 153 6 -150 -308 280 508 10 -498 -189 535 565 -248
728b48l13M10O85j2p93m20L71O85J74r12k47M13O26o3o04j04L64J92p1l56Q7L01
750A65L9m09N6K39K42m48l36L81L37J18m91k33K79M49q0m78k61M52L74j73m91
771b69J2L66K37l48l08R2M91j42m33o3L32L84j84k88j08L04J74j10l10K3J74K10
793B36j71l07O7L64j95j50k0L16K24n14j39J92L64K2o58R6J30M58Q3o71k64N23
815a4L17j03m01k52N38J51q5l42j1L21J03j19j73R3M3n2j60J27L89l04l57j26
837d17M62L32j30m46k16M21M03j60n57q0K74L85j40k58j48L21R3nk62Q2J94k74
859a26O4j0K85k39n4k0R0J46R1l23j81J89K52j2l25j13K73K53j93k88J17J38L12
882C26l12k87J27K49L9k60j19Q0K74j6j73j11K74J09p9l22J5K84l9j2k35K46j12
$$ plain form
728 -248 -561 -151 534 522 -271 -691 -320 365 539 -373 -620 -207 419 356 -248 -352 12 204 133 -223 -136 165
750 165 204 -205 -149 90 332 -116 -452 -71 266 384 -107 -340 -61 388 308 -170 -431 21 395 222 -269
771 -269 -257 109 346 -2 -310 -218 273 131 -302 -365 -33 351 167 -121 -229 75 249 139 -171 -148 26 236
793 236 65 -242 -175 189 -6 -156 -176 140 364 -150 -289 -97 267 289 -369 -273 -143 315 398 -273 -537 -14
815 -14 303 200 -201 -453 85 236 151 -191 -202 119 222 103 -70 23 66 14 -146 -19 370 66 -291 -417
837 -417 45 377 247 -199 -415 6 409 249 -308 -388 -114 271 131 -127 -275 46 139 134 -128 -46 148 -126
859 -126 -62 -72 213 -26 -80 -100 -10 136 227 -96 -277 -88 164 152 -173 -286 -13 240 47 -241 -124 14 326
882 326 14 -273 -146 103 142 -118 -237 -157 117 101 -72 -183 91 200 121 -201 -186 98 59 47 -188 58 -54
905e4Q5j61lK18J2l0j13Q7J94j52k33k8K75J18k3k11j99K29K29o6l95Q0J43J44
929A46P0k52k40K32J71J5j91J25kp8M5J72M1j75j94K2J30K78k96l32J61K80R6
952B24j98k71j31M01J71q0k14k25M40J10j46j44p9Q7J30j65K5k2jJ05j92J42K61
975B28k40j37J29O3J27q8j77J10M3K05j73k50J33Q2J05pm36J93J61K5l51J59N3
998d3K74j00j25%O3J13j99j08R9k0R5l8q5JL6J95k34L6N5R2p1j41P8O4l9j67j48
1025c17M07jJ16l58N8K07J00p5k81o3L08M2j66j78l9J79J69j29j13P7J65J17k70
1048d5Q4j26N4l3m9K05M1j92l8R8J15m3K5k39R1J46J3o4j67j5K16j9kj09j0N4
1074io1j2r9R6q0M9j46L66m6j11J9n0J9o2Q9j8m9K15n4J14j12r0R5K02j92k49
$$ plain form
905 -54 31 -130 -133 85 97 67 -46 41 235 83 -150 -178 97 215 192 -19 -218 11 240 174 -221 -141 2 146
929 146 216 -36 -276 -44 127 142 -49 76 74 -4 41 213 254 79 -115 -93 37 315 19 -313 -152 128 224
952 224 26 -245 -376 25 196 116 -98 -323 117 227 81 -63 -142 -55 75 -90 -65 -87 -88 17 -175 -33 228
975 228 -12 -149 -20 43 170 82 -95 15 58 263 90 -160 -27 55 160 153 -283 -90 71 96 -255 -96 -43
998 -43 231 131 6 6 69 182 -17 -125 -26 -46 49 11 -74 -73 -37 158 -76 -40 15 107 36 -105 -27 37 -2 -169 -317
1025 -317 90 89 205 -153 -95 112 212 137 -144 -207 101 143 -23 -201 -240 -61 108 -21 -134 -57 108 225 -45
1048 -45 39 -87 -33 -66 -115 90 131 -61 -99 -1 114 71 96 -143 -52 94 107 43 -124 -139 77 58 56 -53 -63 -9
1074 -9 -70 -82 -181 -85 -165 -116 -262 104 58 -53 -34 -84 -65 -127 -38 -56 -105 110 56 170 58 -32 63 265 73 -176
1100a76K11O7p7j62K7K30J81k22n7Q9j0r8O6o5j92K05L0j29M0j32K06O2q7j41
1124a34N6J23N7j87J37J28k60o2Q2J54q2j28j06Q5L10l2j35j45J03K4J14k2l01
1147b21O7Q3J91j24Jj01K50l8p5j69J37n8L9K5lJ36k59j6K12R9j5j60n6N2J55
1172A52o6Q0j23k7J50mr8j08o4K57L0j82r7K00o3J3O9l5l1o9p1J31m8k6j6j79
1198b25J88O8j82J60j67KK16Nj54O2k2kR9k7o3J33r4j1r4M7J21q6l8k0o5K02J1
1225F4q2j8q0K50k77J70q7o1J01K3m9l2P0o7r5J17Q4m0j4m2J63j9Q3k73j2Q8K60
1252B25j53J3k45J14J12M0r3p6J3m7L33j84j08n5J05lM6Oo0o7R5O2j15M9m8OK1
1279a4N5J77j38m7k0J43j48j33J34q9J25R9p6k21J20L4J2M8n5k5N6j20L0J29m9
$$ plain form
1100 -176 35 102 25 -137 -110 120 301 79 22 111 101 3 69 4 -188 17 47 -82 -42 -174 32 94 7 -134
1124 -134 -78 45 102 -85 52 180 -80 -142 -60 94 12 -116 -222 -137 173 141 6 -139 -36 -12 102 80 -221
1147 -221 -154 -71 120 -4 -3 -104 146 108 33 -136 1 -57 -18 7 4 140 -119 -135 77 176 161 1 -55 -3 152
1172 152 86 166 43 16 166 162 64 -44 -108 149 179 -3 -100 100 37 50 119 84 53 -16 -87 44 -4 -30 -46 -225
1198 -225 -37 31 -151 9 -158 -156 60 65 -89 -27 -49 -51 48 21 -42 91 -3 -14 -108 -61 60 -26 -64 -84 -149 53 64
1225 64 -18 -36 -116 134 -143 27 -60 -121 -20 3 -46 -78 -8 -75 -170 -53 31 -9 -23 -65 98 79 162 -111 -123 -35 225
1252 225 72 85 -160 -46 66 106 13 -63 -50 -97 236 52 -56 -111 -6 -9 37 43 -17 -84 11 73 -42 7 -41 -35 -14
1279 -14 41 218 80 33 13 156 8 -125 9 -80 45 144 68 -153 -33 1 13 61 6 -19 37 -83 -53 76 27
1304B7r2J5Q3L0j5O1j12j4J19l7j34J3O4O3lm2L7j14N7O2Qj68J72N0j76J13R7
1331A64j13q7J52j65O8L3q8L1q4K7J48J4q0q6J96j61j20J59Q2j89k9J55r8r6J00
1356f7k2Q5O9q5o4k0N5K2P1J1Rk99J44M9P8n8j55J38jj4J1j23j6M2J50%J05j85
1384g0k2J41q4p5J34r6L4J18l4J2j05j18J22K2K4n0l3R2J59j44o4J25j43J01o3
1409a7M2N7j18J11n7rKP1p7Jk5L7l4ko7P8Q0o3n4pK1K5jqP2n%j64M4L8P2j26L8
1442d5J8J06Jq2K5j19M3ok8J27r8o7J27p0J65j38R7j0J9j48J29k6q4K0J35o6J84
1469B09l82J39J38q8R7j13j01Q3J45kj87j6O4K0m7Q0j57j0K10oq2K4j25P8J10
1494H1k0Q1k88OR2J51M1j84ro2P9Q9n0J2n8Q8J34L5k49J5q9J23K0j19J22k6q4
$$ plain form
1304 27 -65 -50 33 63 48 109 -3 -17 102 65 -69 -56 8 71 68 26 63 -51 6 68 76 -92 80 130 -46 67 164
1331 164 51 -36 116 -49 19 52 -36 -5 -89 -62 86 100 20 -66 130 -31 -151 8 90 -99 -128 27 -71 -167 -67
1356 -67 -89 -4 65 -20 -84 -104 -49 -27 44 55 64 -235 -91 -42 36 -22 -177 -39 -40 -54 -43 -166 -182 -140 10 10 115 -70
1384 -70 -92 49 -35 -110 24 -72 -38 80 46 58 -47 -165 -43 -21 3 -47 -80 12 171 27 -37 88 -55 46 -17
1409 -17 25 82 -36 75 18 9 11 82 5 6 -19 18 -16 -18 -85 -7 73 10 -44 -51 -30 -5 -6 -14 58 53 53 -111 -67 -29 43 -83 -45
1442 -45 -27 79 80 -2 23 -96 -53 -59 -87 40 -58 -125 2 -68 97 -41 56 46 65 -83 46 20 -64 -44 91 25 209
1469 209 -173 -34 104 16 113 0 -101 -18 127 125 -62 -78 -14 6 -41 39 -118 -128 82 76 -6 18 -107 -29 81
1494 81 61 142 -146 -140 -48 103 144 -40 -49 -111 -32 57 7 19 -39 49 183 218 -31 -16 -105 18 38 -81 41 15 -69
1521f9K7%N4N5j11p8P9Q7n7PK8j01O6J43p4p9K5j1rp2J7Q2L0p7N6M7o2J11j54
1550d0J30J19k21J04j28k2Q7o3j6M0j15K4J70k6n8J20p4m7n8J09J4o8p9J19J02
1575A23n8j08O8m8O9Nn8q4LnR6N1k09J5O2R8l4L2n1k1p7J15l9R0l7K2K9Oj9n9
1605b3J7n4R0o1Q0j78J28N7K0k5r6j3Q4n0lo7K5L9R6l9L4r8J2J36j10K5k9jR0
1634H6o7m4j16J88L6j62J07k1J3j8Q0kjj51J44k1j5q6jk2l5K25j26m5mMQ5j21
1662i0J30j32k8K54l0p5n2L7L7n3q2M0Q3jop8N3n0J14L1m3n0m0jn7N8Q9j90Q3
1691d9oK01no6k97K07J14j4N6k67K24r7l5J91j59Nj65K04O2j15r8O0Q1L1j08Q1
1717C6L2q5k5J1J65k4j10N4%J3j09n5J15kq2k0L9K8rl8J60Jp5q9J28l0K1p8L0
$$ plain form
1521 -69 -42 -42 12 67 -44 -122 -43 44 -13 -6 22 -79 -13 130 56 -23 2 -9 -18 -90 -73 9 39 -38 18 65 3 114 -40
1550 -40 90 209 -12 92 -36 -58 29 -34 -50 -10 -125 -101 69 43 -15 105 31 -16 -74 35 49 -19 -98 21 123
1575 123 65 -43 25 -23 46 51 -7 -91 -88 -93 3 54 -155 -140 -78 20 -14 18 -33 -54 -131 -16 -55 35 -2 20 49 55 36 -23
1605 -23 -6 -60 30 -31 49 -129 -1 56 76 51 -45 -58 26 -24 -27 -94 -69 -30 66 27 61 -37 -25 111 1 26 -3 -4 86
1634 86 19 -25 -141 47 83 -79 28 7 20 2 82 80 79 -72 72 51 36 -50 -51 -73 -108 117 -9 -54 -58 -54 31 -90
1662 -90 40 -92 -120 134 104 29 -23 14 51 -2 -84 -44 39 38 32 -46 7 -43 71 102 59 9 -31 -32 -89 -31 58 -132 -49
1691 -49 -55 146 141 75 -222 -15 99 85 141 -126 98 1 -34 157 -2 3 -162 42 104 -11 -109 -49 32 63 -45 36
1717 36 68 -17 -42 -31 134 110 0 54 54 67 -42 -97 18 16 -66 -86 -47 -19 -28 -66 94 95 20 -69 59 29 50 -28 2
1746BL7K2L0j60N9o3l8J68KN0j65K8N9q3j23L29j35l2k1J31M7k63J57J0j3j04
1772f9J96j42mj61P0J68J4q6NJ21q6m1l3RN5j30OJ40l2nN2Q6j75Lj2pPk3K0J47
1802I3l0j94Q8J35Rj92O8M4M7p2L3N8lj42J0J89k22J8R6n4K3j2k1M8p5RM8P6K4
1831I9p9p8P3J41k47O1R0m8j05J07M2mj30M6K00j25q6JK02Pk58p9L01l4k12R4
1857b1L7P8j06j59J32J38k30J13k3O6n5k0PK04k74mJ45K1K4j26L2J14j30j9J54
1882I8j04k4k3J42k4j89%K92j17j10R9R7M9k03mJ73j33q7O4O8r3K1Ll0P5j73Q5
1909d8J18k8ln4J38m4k6r0J03J07j80N5m6L7q1O9Q9M4k19k3J77j22j63R3K09o8
1935D4q2n5K27k8k69J29J69k78J40k35K44J35j40j3J3J0r3R5N1J7k36J45O0Q0
$$ plain form
1746 2 39 61 91 -69 -10 -73 -111 57 59 109 -56 -28 31 -52 -175 154 19 -13 -34 97 144 -119 38 48 35 -69
1772 -69 127 -15 -19 -180 -110 58 72 -14 -9 112 26 -15 -48 -39 16 -114 -108 32 0 -5 47 133 -42 -39 -51 -58 -51 -74 -54 93
1802 93 63 -131 -43 92 101 -91 -23 21 68 -4 29 87 84 -58 -48 141 -81 -63 33 -21 2 -10 -31 17 -58 -49 -1 75 99
1831 99 20 -58 15 156 -91 -30 60 12 -93 14 56 52 -78 -32 168 43 -43 -42 160 167 -91 -170 131 97 -115 -21
1857 -21 16 94 -12 -171 -39 99 -131 -18 -41 25 -30 -50 -43 161 -113 -117 28 49 73 -53 -21 93 -37 -56 98
1882 98 -6 -30 -53 89 65 -124 -124 168 51 -59 40 137 186 -17 -21 152 19 -68 -4 64 -29 -8 -5 -35 40 -133 -48
1909 -48 70 42 39 -15 123 79 53 -37 66 173 -7 48 2 39 -42 27 116 160 -59 -82 95 -27 -190 -97 112 44
1935 44 -38 -93 134 106 -163 -34 135 -143 -3 -238 6 141 1 -12 1 11 -82 13 64 81 -155 -10 50 130
1959A30k99J16J57j54k4L5L7P6j82L3J60R2k74L1J70o5j48M1J87j2k04J03N5j8
1983D3l7r0J67n4r0j2K42l5k95R5J28K4j31o0J30P5j49P6N0m3p7j6K10Jj39j04
2009i1R6j43J88k72K59K8k05J03J31k6j52j7J70J12k83M4R3M6j98J09J41m0o8
2032B5l2O2K4j25J2J89k04k7K2L8J58l00J25J29n6j67k0K94k04Kj37K41M1l07
2056b17J91J7P1r7L0N6Nr7q3J94m7j29m3L37j05o2j6KJ30k59K0K21r0j31p2J72
2082bJ17k42J71J27q1k14L6R0N9q3j41J99M4j26J6P3L7p1l0P3m6k07Q6J56J48
2107A89l59J54N1r1j3L9Q3o1Lj29K96j12k49J25J52n4mq3K14L1j19n1J4r4L9J5
2133a4J92q0j97l7K44j64r4P3K7Q7j41J42N0q5p5m8K13J9k18Q8O7j69m9J51L7
$$ plain form
1959 130 -169 -53 104 -50 -74 -39 -2 74 -108 -75 85 177 -97 -66 104 39 -109 -68 119 107 -97 6 61 43
1983 43 6 -84 83 29 -61 -73 169 134 -161 -66 62 86 -45 -105 25 100 -49 27 77 34 -43 -59 151 152 13 -91
2009 -91 5 -138 50 -222 37 65 -140 -37 94 68 -84 -101 69 181 -102 -58 35 81 -117 -8 133 93 25
2032 25 -7 55 79 -46 -34 155 -49 -76 -54 -16 142 -158 -33 96 40 -127 -147 147 -57 -55 -192 49 90 -217
2056 -217 -26 -9 62 -35 -5 51 56 -41 -124 70 23 -106 -149 188 83 21 5 7 137 -122 -102 119 29 -102 -174 -2
2082 -2 115 -127 44 171 90 -124 -88 2 61 -22 -163 36 80 -46 -30 43 80 9 -21 52 6 -201 -115 41 189
2107 189 -170 -16 35 -56 -69 -30 53 -8 -5 -134 162 50 -199 -74 78 24 20 -63 151 182 63 12 26 -68 -29 -14
2133 -14 178 98 -99 -136 108 -56 -150 -77 -50 37 -104 38 88 3 -72 -120 93 112 -106 -18 49 -120 -169 -18 19
2158A9n4p3J15L3J9j05j96L06O4j64o3M7R2j64N4N7J71k90P8K22j37j24QJ55L1
2183A01j76o6J37J35j56k1M9j2j23M4J09m5K0m3J5J37k44pJ53qj35J42J32j56
2207a8n7K15j55J6p8o9J12J65j59k17K94Q2k76Q0J19j9j25J3J69l4j31qK23j52
2231a0p8R4L0m6j74J41Q6R6k17L9K0J4l1j25K28o5Oj21J3MJ42o5K9l0J9NJ12p7
2259C9r2j7J71L0j76j61J26R4j02k8J29J38k66J67m2J09j70J7R1r9k6j4J08J06
2283A32k91R7J83j6j77kK94p8k73M8R7J55l40J21K06j05j45mK22l2k19o4K36J00
2307A45j58K0K0J6p3j49L53r0l2Jj2K2j50K6J24q0ql7J07k5o7L3J23q1j4j05J85
2334I4o7k5o4J11L3j64j9J28P4j25k0J22l7j70m7L09q6j45k4J11J43m5j74J55
$$ plain form
2158 19 -35 -108 7 40 59 -46 -242 64 128 -36 -99 -52 40 -124 -70 -13 158 -132 -54 168 31 -93 -85 70 101
2183 101 -75 -141 -4 131 -25 -46 3 -9 -132 -88 21 -24 -4 -47 -32 105 -139 -146 7 -1 -136 6 138 -18
2207 -18 -75 140 -15 1 -77 -146 -34 131 -28 -245 49 131 -145 -65 54 35 -90 -77 92 58 -73 -81 142 -10
2231 -10 -88 6 36 -10 -184 -43 43 139 -78 -39 -19 -5 -36 -161 67 2 8 -113 -100 -96 46 -19 10 -20 -1 4 116 39
2259 39 -53 -70 101 131 -45 -206 -80 14 -88 -116 13 151 -115 52 10 119 -51 -34 57 -42 -68 -82 26 132
2283 132 -159 -62 121 105 -72 -74 220 142 -131 -83 14 169 -171 -50 156 51 -94 -98 124 92 -127 -191 45 145
2307 145 -13 7 27 43 -30 -179 174 84 52 53 41 63 -87 -61 63 -17 -25 -62 45 20 -47 -14 109 28 14 -91 94
2334 94 27 2 -62 49 82 -82 -101 27 101 -24 -44 78 41 -129 -176 133 47 -98 -122 -11 132 87 -87 68
2358F8j5O1j25OP8r5j5K8J26j10n4J87j23j0j38J78lm4O8l8r9k3J82k21K02p8
2384gm9J40k2j98L1J42m1j23J47J07o6m3J9L0j20J35j29L5J32j77j8N4l1L3JQ1
2410F3ko3n3O7k2j60J40j2rk3L8RJ00q0N5m8n3J14r7R0j20Oj4J06k4J19j14N4
2438F7j66J92r0L3j52J49j30J94M6k00LJ90l1r0k0M5j05N2p1L5p8l0J39nJ52j31
2464br8N4J24j15J04j05Q8j7K3L7M3r6j07K37p7j15nQ3j2j20J11Oo3M4o7Q2M9
2491H6j56m8O2l1J51k77K91q3N0Knk0n3J4M8K4l2j54K23Rq4q5M5j9J10j69j4J40
2519B5j80O9Q2O7k26Q5J41j8q1JL8M6q9L0P9nj7o8KJ06o1M4%q5n1L6m4K62k62
2548g4J12m4K2j5j4rj7N9OL6p2J22j91J66M9j79Q7O8j33K3nL9l7L6o5J30r9J33
$$ plain form
2358 68 53 114 -11 -5 73 -22 -37 -9 117 7 -47 140 17 7 -131 47 44 0 68 30 -69 -92 90 -131 71 -7
2384 -7 -56 84 62 -136 -105 37 -4 -127 20 127 61 18 37 67 -53 82 -47 -12 120 -57 -75 -21 -52 -19 -18 63
2410 63 61 -2 -55 12 -10 -170 -30 -42 -51 -74 -36 -27 73 -7 48 0 -53 61 -36 54 -66 -60 -74 32 8 127 13 67
2438 67 -99 93 3 36 -116 33 -97 97 143 -57 -54 136 105 15 -5 40 -65 -13 -84 -49 -127 -157 -18 -23 129 -2
2464 -2 -100 -46 78 -37 67 -38 50 33 56 93 136 40 -67 170 93 -22 -27 56 44 -76 35 41 -22 22 -45 37 86
2491 86 -70 -118 -56 -87 64 -213 78 -5 45 47 42 22 -31 -17 31 55 23 -131 92 101 17 -68 -23 -42 68 -101 -115 25
2519 25 -155 -86 -4 63 -163 -78 63 45 -36 -35 3 49 -40 -10 69 64 47 -21 -19 87 26 70 70 -15 -66 -30 -74 188 -74
2548 -74 38 -6 16 1 -13 -22 -39 20 26 62 -10 112 -79 87 136 -43 44 112 -21 2 -3 36 -1 35 -30 100 1 134
2576A34j14p2O4N2j36j1R2j3%o5Q4Q2j72M5J3j4jJ0Q0m8j2j06K04j83K5O1M4L5
2604G8j48J60J2j31j6N1J4Ko4j2l0J26j5J26j65P2k8o1L4N5q5k5N4n2N9k4L8Q0
2632A05m3J4j45K1J08j33J40m9J24r0r1J82j00J5m6K1j14J72k0o3q4J04PL2p4
2657gJ4m6k7N9Pn2l3O2p4J23n4j54K29J9j20nJ0O6q8L8M1r8k1R2Q4r3PJ9M4M0
2687H2j01N4q0P7m1j28J10J09k9j34O5r0M6l2oR2q3O7qJ9o9L1Q1q3N3M1mJ9J9
2716G7j18j4L5R8j10k8J29m1j24O7L6KJ09j14m6R9j21R2L5O6j54J38n2j44J14
2741C1o1P6j29R7L5m4R8j75j2J37j11K43k7j79J68j01k6J6j42l7R1P5M4o4m1R4
2767E6j23m4J39j01R9j71J33pj4K3j5n1K6P9j04J03l4O8pj35J55m1MQ2r9Nq2J24
$$ plain form
2576 134 20 -52 12 64 -72 -83 9 -4 -4 -69 15 97 -75 -30 -17 -31 -32 -22 58 10 -2 -108 96 -87 -62 -1 43 78
2604 78 -70 90 102 -29 -45 6 20 22 -42 -54 -84 42 27 153 -12 60 32 -29 5 60 -25 -50 4 -48 11 -13 25 105
2632 105 62 76 -69 -48 60 -73 67 18 142 52 -39 143 43 58 12 33 -81 91 71 8 -76 28 35 67 -7
2657 -7 7 -39 -66 -7 0 -52 -85 -23 -97 26 -28 -182 47 66 -54 -59 -49 17 -71 -33 8 -90 -111 -19 65 -28 -21 -2 42 82
2687 82 -19 35 -45 32 -9 -137 -27 82 53 -81 -16 -106 -60 -92 -98 -6 -89 -22 -30 -11 -80 -49 32 -51 2 43 39 58 77
2716 77 -41 -55 -20 78 -32 -60 69 28 -96 -29 7 9 118 4 -42 57 -64 28 63 129 -25 113 61 -83 31
2741 31 -30 46 -83 14 49 5 103 -72 -84 53 -58 185 158 -21 147 46 20 36 -106 -143 -52 23 67 3 -38 56
2767 56 -67 -111 28 -73 26 -145 -12 -19 -33 -10 -25 -76 -50 29 -75 28 -6 62 55 -80 75 34 38 120 21 26 -56 68
2795F8j61J64n0N8j24j1J26r8R5j16m4J66q6No4N2P5l3L5p0R9p9J2l1M2ln2k1
2823d6M8J9j19J7N8L8K1j8o3M5R2j40l9K18k01QQ7j0j4j02J43m4nj0M6p8J00J
2851E2r9J35j21n5J64K2j17K7Nj0n2l0k5J19j30R6rML3jQ5j22q4O2L0j8l1M2Q6
2880E8j23J47nj8qN8q1j18J9R8p1o5K40j9q2p7P6N0o3j23R6MN8O5q4q7r0N4K05
2909A14j20N2N3l9r9m7l2J17%J4J24j44P3k0J13j21m1j05J42j1n9J44r3N4j39
2934g0M0O9M3p4o6N0J6k3m4J59k06J8K38p4q4J55j01o3j3k2J01q9M2l5J1K0p8
2961h0J76j07j11R7J28n8%j29J54n9K9K5q5J62j08N5m6Q6j09j7j34J72r5M1K1
2986Hk5J53m9p8N1j3K5p3P1j17L5l4J25p8R3j80l9J34M5p6K6j66J38l1O1M5j28
$$ plain form
2795 68 -93 71 21 79 -45 -56 70 -28 67 -49 -93 73 -13 -8 -72 -20 55 22 57 -13 86 7 19 -12 30 27 -25 -46
2823 -46 2 21 -98 -81 -23 15 36 18 -45 0 92 -48 -87 131 -70 -62 25 15 1 -101 42 -2 -7 -17 29 -49 51 52
2851 52 -47 88 -33 -88 76 98 -19 8 13 3 -49 -79 -104 15 -115 -19 -28 -24 9 8 93 -29 -113 -51 -21 -39 -70 -28 58
2880 58 -65 82 77 59 51 109 28 -90 -71 27 -44 -109 131 112 30 -47 29 79 16 -107 -11 -7 51 116 32 -55 -145 -91 114
2909 114 -6 46 99 60 -39 -86 -118 -1 -1 13 137 -7 66 46 159 38 -3 -108 34 23 -36 108 15 69 -70
2934 -70 -30 39 82 8 -58 -8 8 -15 -59 100 -106 -88 150 76 -8 147 46 -17 -30 -52 49 -40 2 -33 -22 -2 -80
2961 -80 96 -11 -122 -25 103 45 45 -84 70 11 40 65 -20 142 34 89 43 129 20 3 -131 41 -54 -13 8
2986 8 -17 136 87 9 60 47 72 -1 70 -47 -12 -46 79 1 94 -86 -125 9 54 -22 4 -162 -24 -55 6 51 -77
3013g7J48q9J82j60J5R5r3m7J4k8m4J79o9Jo2n6j2R3N7j12J07j01J56j93J10O
3039B0N3l5NJ3j38M9n2J46jj25J8N7R9j14l4P7j00L0J46j24L0r4K6J92j22O1l9
3066D4l8NN3P7L1k10P3Nq4QK5KNpN4k1Q0j33l3q7J59l1J31j02m8R7j84J20J16
3095A07j68N1J28l4O0j13j02J17j68N5L4O9k9qR0j17J55j85j7L6p8J75j9p0j08
3120a39L10j88J5qLmM3Lq6K06r8r5J69j50R1m4m9j5QO9j22J55j48K17j68P9nq1
3148c2N3l9J58j13O6n7k3Jj6R4j06j7J40j36O2M4j09J33j5k8m0j21K40K0r3j40
3174g4K08j53M4oj6m0j9J66j74Q9n8L9j18J08nl0N2J5m5m0J60J1k45J53oj26J75
3201F5r3J50k34J64j56J77o0k0M6lK8j20L7L0o4k1J57p3M2j00R9M3j70m0J79q7
$$ plain form
3013 -77 71 -18 164 4 19 114 21 -26 -12 -40 -84 95 26 27 -35 -91 -103 -10 47 -65 42 -59 97 -96 14 20
3039 20 73 38 43 56 -82 -33 -85 61 60 -65 -47 10 109 -5 -39 38 -62 -32 114 -10 20 -74 -48 144 22 83 44
3066 44 6 11 64 141 172 -38 35 40 -44 -36 -11 -9 -4 -11 43 22 102 -31 -64 -151 8 -23 108 6 -42 55 -129 -9 107
3095 107 -61 -10 118 84 144 31 -71 46 -122 -67 -33 36 7 -1 89 -28 127 -58 -75 -39 -117 58 39 -31 -139
3120 -139 171 -17 -2 -10 -7 -11 32 35 -51 155 57 -38 131 -19 72 28 -21 -36 -28 41 -81 74 -74 143 -25 54 49 -32
3148 -32 21 -18 140 27 93 36 13 14 -2 92 -14 -31 109 -27 35 79 -30 103 88 60 20 -101 139 159 66 -74
3174 -74 134 -19 25 19 3 -37 -56 110 -64 25 -33 6 -112 -4 -9 -39 13 28 -17 -57 103 114 -131 22 16 -110 65
3201 65 -28 122 -112 52 -104 73 13 -7 39 36 64 -56 -19 11 -53 -74 83 10 52 -48 51 94 -76 -116 63 -24
3227b4M5N5j02O7M2r8Q2j20R3n0l3O8M1l4%Q1p2j33mR0K3j7L5J20j76J05p7J0
3255A7N2Lm6P2j47O7O6r4lJj6P4N4j10L0q0J08o8J8P4q3R9j30m8J22m3N4J2J26
3284A81j25j06J09n4M5J3l3n0O9o0NP1j98R7r2J49j5O5J5m0q2R8q0PmJ8J06j61
3312e2L4k9O3j3J00o0R3j72M1j2N4j02O7K0l1m4l2K06k2j01J6o8j7kN7J37r6K3
3340E8p5K1Q3o4J6r4K23k15j9N3J69j8j76L8k5k6O7M8P6k28M9oJ29p5o7r3nK15
3368E9j06J1Q9MK8r9oJ09j68QQ5L7p5n3J29J5m7j02J66j30l0k1J20j71J12R3j20
3395f3RM4O4qj32J37r2N9Lj1K2J6J09j16m7m3J23j07m5J25L5p1Q7j74J16k4K3
3422C9j2R5o5p1n8j23K24m4k4pQ0L4l9p4L0J30n7k7j48J74j52J40n1m1N0p3Q0
$$ plain form
3227 -24 21 76 -26 41 83 -15 67 -53 40 -10 -43 25 66 32 32 113 41 -92 -96 -6 17 0 35 155 -21 84 7 17
3255 17 69 72 26 98 -49 18 84 -10 -13 -12 -28 46 100 -10 20 -60 48 -20 -2 72 -11 88 -42 -90 32 -11 43 55 181
3284 181 56 -50 59 5 50 63 30 -20 49 -11 -6 65 -133 -36 -128 21 6 71 86 46 -36 62 -18 -11 -15 3 109 -52
3312 -52 -18 -47 16 3 103 43 136 -36 5 -7 47 -55 12 32 1 -43 -75 131 109 8 24 -44 -61 -63 -6 131 35 58
3340 58 -17 4 87 23 39 -55 168 -47 -66 -13 156 138 -38 0 -25 -51 16 64 140 -88 -39 -45 84 9 -58 -151 -156 59
3368 59 -47 -36 53 57 85 -14 -20 89 -79 -71 14 51 -24 -77 52 67 20 -82 84 -46 -76 -97 23 -148 -36 57 -63
3395 -63 -54 -10 54 46 -86 51 -41 18 21 10 32 48 157 41 -6 -49 74 -33 -78 47 82 11 98 -76 40 16 39
3422 39 27 122 57 -14 -72 -195 29 -15 -39 -46 34 68 29 -45 -15 115 58 31 -117 57 -95 45 -6 -47 3 -70 10
3449A0K1n2M3nL7j08Q8l8R5j4l9m1L3j4K5opL0j15J83j66K02k73K05j24K34l72
3476a68J43q3R4p0P7M3j0o6R3j0lL8j67J97p9p3O5r4N0L4o5J54j70O5q9J32j44
3503a06N4n9J45L9m7m1M9O0k90K65k9p6M0n1L0J3j03N4J79o9l9j0Q8k7r3P3j8
3530C1j09J08P6k2j17L1M5j8N7q1Q3m9n3n2oJ17PJ6M2j01n3R1j36N1J00l6L2j52
3558i8N9KO5K2k00R2J18o1K5R6j89N6O7p8l5P2l6K7Ol0N1J3J5p7m9J24K7r8l2
3587d6P4O5q5j7n2J60j42J02mp8J11r0Kj1k6m4J18j23Q4pl9M2p5Q6q9pL7m2K30
3616A34j34l8o7O9Q2l0J22j48k8J34n2k1K1j33K33j08L8m4KJ02n6r7j26J66Q0
3641A01j43N0j0J8l4N6m9M9N3n5j22j9J28j29J70O2k31r8J87k2QJ18l9j08jPJ37
$$ plain form
3449 10 31 -21 22 17 54 -54 34 -4 91 77 38 -3 30 16 41 35 28 58 -57 126 -40 162 -111 94 -30 204 -168
3476 -168 -25 -108 -14 -84 -7 36 26 -40 53 43 40 78 -89 108 29 -44 21 -73 -23 11 -54 100 -70 -5 -94 38 -106
3503 -106 -52 -111 34 73 26 -15 34 94 -196 69 40 -36 4 -47 -17 -4 -107 -53 126 57 18 8 96 69 -24 49 31
3530 31 -78 30 106 84 -33 -2 43 25 82 1 84 35 -18 -70 -76 41 48 64 106 5 -48 43 -93 -42 58 22 54 -98
3558 -98 -39 -37 28 50 -150 -58 60 -1 24 120 -69 -13 54 -24 -59 13 -23 4 10 -20 31 44 59 -18 -67 57 84 -14 -46
3587 -46 28 93 8 -9 -61 99 -43 59 55 -23 88 -2 0 -11 -37 -81 37 -86 -2 -9 -48 -6 -81 5 -84 -91 -54 -96 134
3616 134 0 -38 -105 -36 46 16 138 -10 -38 96 44 23 44 -89 144 36 74 30 32 134 78 -19 -145 21 101
3641 101 -42 8 -2 16 -18 38 -11 38 91 36 -86 -105 23 -106 64 126 -105 -203 -16 -38 -30 88 49 -59 -60 -53 84
3668H4j24k9LnJ40o2J4J0j5P2Jj65k8P9J21k18J09M6j31R9n2K15j63j9J00l4j51
3695a03J47n8N7p9R1j25J2J41r9Q5o7j2J8LJ6j05N8J27j26k0m3P1O0Jl8r8J77
3722I1j29J14Ll5o3m3O8J07j9r1Q3r6m3M4n4P5j21J29J8l5p0J20Q0k64M2J07m3
3749b5o2J39J0r9O6J55k34P0O0r3J39r8J8nr7o3M7J39m3JJ9r4m5O0n7N5O4m0K5
3778A2m8O5J36j22q4J55j18j1oj4P1n0K2qj43K72l02K02N8j4K0p2Pl0o7Ln3J60
3806D1m4k3N1l4m4J1m3J00k7K2J6q8j3l3J37q7J00M3m4j12J09l1j39J87k3j08
3832g6J95j32J39o7o7R0K8j44j7R6j02N4p8J24M0j09L4K0r6O0k1J63r9mk3nJ8
3859B1l3k5OL1L4P0j10J34k23P2k0O7k7n7K4O1j8o8J60j93L9J00P9K7j98L3jP
$$ plain form
3668 84 -40 -69 -66 -71 69 7 21 31 16 88 89 -76 -104 -25 96 -122 -13 33 -98 1 -51 164 1 -18 82 48 -103
3695 -103 44 -14 43 -36 55 -70 -58 83 -16 69 2 -10 8 11 27 -78 -20 107 -19 -39 -82 -11 49 50 12 -86 91
3722 91 -38 76 79 44 -19 -62 6 113 94 3 86 -10 -53 -9 -63 12 -109 20 38 3 -67 53 133 -131 -89 18 -25
3749 -25 -87 52 62 -37 29 184 -50 20 80 -13 126 28 46 41 -56 -119 -72 67 24 25 44 -50 -95 -35 -92 -37 27 -13 12
3778 12 -36 29 165 43 -41 114 -4 -15 -21 -35 36 -14 8 0 -143 129 -173 29 87 73 93 21 28 -2 -69 -66 -119 41
3806 41 -3 -26 25 -9 -53 -42 -85 15 -12 10 26 -62 -75 -108 29 -58 42 85 41 -71 38 7 -132 55 32 -76
3832 -76 119 -13 126 59 -8 82 110 -34 -51 45 -57 -3 -81 43 83 -26 8 28 -68 -8 -29 134 35 31 8 3 21
3859 21 -12 -37 -31 0 34 104 -6 128 -95 -23 -43 24 -3 -60 -36 25 7 -61 99 -94 -55 45 124 151 -47 -14 -15 -8
3887hN4k5nm3O0m6k7J18j42Qk3Q0Jk3j7N3j4m4J53r0PL0J8n8p2R0oKP8j46kM1
3919BJ05q3l1p8J18Kj81J04J10j52L5oK1lj4J43n9j57J00L4J1q4j5Q7p6oP7K1
3947B5K8N3j02j7k4Q4p9P9j15R4l4Q6q3R5j16K9K2O0K9k14Q5J5J1L3K4qJ1l9j33
3976a01M9N3k4n0R7Q5j99P3j6j0M4K2j26Q4o2J43j99J00K9m0n1R1P2k08K33j00
4002a1K9O5q7J78m6j60O5p6q6J31r1M8L9L8P0j22K6n6J16j02O1j4r2O7Kp0R9n3
4030c2j4R7o4j8o6J34p3K9j21L5L3O0r3K06j20M6q2o2j8J50q0P1j38O2l4J61o0
4057Ij11J59j49Q3j11J10Q9j14P9j28j7J82r6%KOM5Mkn5m2Q7L7p6m7mJ65l3m4
4086B8j16J56j58O2L8K3o5m5J22O6r7r2m1J24N5j0o3RQ1o2J08m4j17P7L8j58l6
$$ plain form
3887 -8 46 21 16 -27 33 -13 -40 78 -64 -56 -79 1 2 -21 -38 15 1 -43 110 20 27 57 75 17 -55 35 29 31 109 -37 -39 2
3919 2 107 24 -7 -85 33 35 -146 -42 68 -84 -49 -55 -34 -37 -51 92 33 -124 -24 10 21 -63 -78 9 -67 -73 4 25
3947 25 53 106 4 -13 -37 47 -32 47 -68 26 -8 78 -5 90 -26 3 25 85 114 -100 -15 0 11 44 68 60 71 32 -101
3976 -101 -52 1 -23 -73 24 109 -90 -17 -33 -43 1 23 -103 -19 -81 62 -137 -37 -8 -48 -99 -8 64 -144 89 -11
4002 -11 18 83 -4 174 128 -32 33 -43 -129 2 -89 -41 -2 36 106 -16 10 -46 70 -32 29 15 -77 -10 -8 -78 21 -32
4030 -32 -46 51 -13 -31 -97 37 -36 -7 -128 -93 -60 0 -93 113 -7 39 -43 -105 -123 27 -53 18 -120 -58 -92 69 9
4057 9 -102 57 -92 -9 -120 -10 79 -35 44 -84 -101 81 -15 -15 -13 -7 38 42 40 -15 -57 30 67 -9 -56 -60 105 72 28
4086 28 -88 68 -90 -28 10 33 -32 -77 45 111 14 -78 -119 5 60 50 -13 -4 77 15 123 79 -38 39 77 -81 -117
4113a17J32J7k2L2j85J56k7L2p1J50j10Rk8N2O4m6l1j9K5J01k8o0r4oJ08j14N4
4140b6L0n4P2n0L3J8J4k8PL8K8p6l0K2J6l7q1O3J10RO5j04j10P9o8L4j00O9N5
4169bj0m6O2l5j55J77j2K7J4l1K4p9Q4Q0n5n1nJ8q1Q8j7Q9j37Q1k8r2m2M9LJ18
4199C6p5Q3J6q0L7P7j04j48J60R5j25J10j49J18j47L6J49j95J67j56J53o2l8J2
4223c0J26r6l5J8j6J27m3r3j6J99j44o2L3M8k9Q3m6k1m9J07j04J04o7J6rl1R2
4250F2k0j35Q4JO6m8j2q9J33j5Jp4R1n2L0k5n4R8j16L9J44k9j41m5J19j6J11o5
4278D3j33J55q3Mk3J8O4j00Q1Q9j65N3m6P0N6l2o2P4j48J94p5l7J6K9j50J19k8
4305a7Q1m2r1Q4m7J5l5N2K0l5m6j0J40r2j49J76j77J30L8p5P4n7J19j61J48j15
$$ plain form
4113 -117 15 32 10 42 -143 13 -14 18 -53 97 -13 -4 -32 20 84 38 7 -12 13 114 86 26 -68 -74 34 -80 -26
4140 -26 4 -50 22 -28 5 23 37 9 16 54 82 6 -24 -2 14 -23 -104 -41 69 78 143 39 -71 8 -60 -26 -126 -57 -2
4169 -2 -12 -58 4 -31 -186 -9 -21 6 20 -11 13 -66 18 98 43 -8 -13 5 -76 12 -5 84 -53 28 0 -92 -134 -85 -82 36
4199 36 -39 44 60 -20 17 94 -10 -158 2 97 -28 82 -67 51 -96 -60 89 -106 61 -95 58 -4 -42 -30
4223 -30 96 0 -35 -17 -33 94 51 -42 -58 141 -3 -65 -32 16 -13 70 24 3 -46 61 -43 61 -6 10 1 -30 62
4250 62 42 -93 -9 -8 58 10 -2 -91 42 27 28 -46 45 -7 23 -2 -56 42 -74 -35 109 80 -61 -106 13 -3 108 43
4278 43 -90 65 -18 -14 -37 -19 45 -55 26 115 -50 3 -43 27 83 51 -11 63 -85 109 34 -3 13 42 -108 11 -17
4305 -17 64 22 -69 15 -32 -17 -52 0 20 -15 -61 -71 69 -23 -172 4 -173 -43 -5 -80 -6 -63 56 -105 43 -72
4331g2J11J9q5Kl5M9p4J75j68N4k9Q6k27K99m2k2m0l8NM7o4L8K8M7q1o8n2R0J15
4360F8j01kN5n7N9P9j66N7lQ2j16j3K05p8o6K9o7k9P8n8O5P4m8r7L0R3l6j5K6
4389D8q9L0R0%o8M4m0R8j8p1rm6K0q3N5K4J10q1LPK5l8J5j49O6n8J80j60P0J09
4419H4o3p6l6jR8N2L6m4n7L7q2J43L6q5n0k1n6R2K4j33J16R4J4Mq8J1o1MQ4j35
4449e9o7j1J31j8J0L3R8l5k01J73K6k6l3j00R4J01j53q6J06j2R0Lj82K1Q8K0r2
4476h1Q4J0r6J14o4n2J51n1Q5j29N2k0K7j01J5lR5q1O8k1o3J02n9O0j17P3o2Q1
4504A7R9j70O1K8q6J0K6o9M4J06l8j00J01q0O7J8j5j33M9pJ03K0m8jR3k7J6p6
4532Hj49J17J18j20L9r9pJ58n0p0P5j1P6j51J04p2Pj9J19j22m2J43n3k6P7m2p7
$$ plain form
4331 -72 39 58 -27 -25 -60 -11 -85 90 -78 -24 -53 33 -194 105 63 41 1 -37 -32 15 -49 -11 17 64 -17 -85 -137 -47 68
4360 68 -33 -35 20 -37 22 101 -65 -8 -11 71 -45 -58 147 69 3 32 -35 -64 14 -44 21 95 47 -50 -20 73 37 22 48
4389 48 -41 -11 79 79 11 55 15 113 95 24 15 -31 -11 -94 -39 -15 95 14 17 24 49 11 26 -123 -57 -115 65 -95 -25 84
4419 84 21 -55 -91 -92 6 58 94 50 -7 30 -52 91 127 42 -8 -29 -85 7 31 -102 14 108 122 126 38 49 -12 -8 76 -59
4449 -59 -126 -137 -6 -24 -14 19 117 82 -119 54 80 54 21 -79 15 116 -37 -123 -17 -29 61 64 -118 -97 -9 11 -81
4476 -81 3 13 -83 31 -33 -85 66 15 100 -29 23 3 30 -71 -56 -59 36 -45 23 2 -61 41 -18 42 -75 -2 -64 17
4504 17 116 -54 7 35 -51 -41 -15 -84 -40 66 28 -72 29 -51 16 34 19 -114 -65 -72 31 51 3 2 95 68 84 8
4532 8 -141 -24 94 -26 13 -86 -93 65 15 -55 20 9 85 -66 38 -34 -27 -46 73 -49 -91 52 -1 -27 50 8 -69
4559f9J78o4K6q7K1J04m3O3k21J52n8mn2P2J14j57J85m0l5m7p3K8M2J9k8N6j63
4586h1M1Pk7M2n6J3L0N7L0k7n6l0K6N5M8j29J11N9n6o9k7N1K19j71qp2J68k23
4614g5J29p0R1j5j33J71j63J57m0J1J1m6l6J8%j0k6N5l7P4j65K8O7k3L7pr0j1
4642i8n0R9N5k8K1J0lM7k02K01k56J59J90k21J95r7o2J02J1j36N0J32j98lK5K9
4668b8n9J17j7j49J23N6Jk1K6m3o8O3J2J7l7n9j8Q9Q5l1r5j4O2l7O0r7O2j10M9
4697f1J77mj34N0N6k9Q3m3o2j06j2K2mJ58j0p9J25j75NK0M7Q0k16J59k18R4nJ65
4725H3p2q5J4K42k18M3j6k9N9m0M6j62J85l3m9N7j5J0Nm8N2r3J4P2n3j9j9L2L4
4754cp7P8Q1j27J5J57j44j64J68m9K20j60P4n7L7O4j00J13k56J55Q5j25M4ol0
$$ plain form
4559 -69 109 45 71 -16 5 109 66 129 -92 60 2 -2 -54 18 132 -25 160 120 85 38 -35 -7 35 54 26 82 -81
4586 -81 -40 -33 -60 -18 -74 -61 -31 26 56 29 -27 -57 -31 24 72 -57 54 113 57 -12 -39 12 231 60 52 -20 148 -75
4614 -75 54 -16 75 60 -73 98 -65 92 52 63 74 28 -8 10 10 0 -26 29 -8 66 -99 -71 -4 -27 10 3 -87 -98
4642 -98 -148 -49 6 -22 -1 9 6 53 -149 52 -204 -45 145 -76 119 22 -40 62 73 -63 -13 119 -79 -82 -57 -28
4668 -28 -87 30 13 -136 -13 43 44 23 49 6 -62 1 13 30 -7 -66 -84 5 90 59 -36 -50 12 -25 35 -62 0 -110 -61
4697 -61 116 112 -22 28 84 55 138 95 33 -73 -85 -63 -67 91 81 2 127 -48 -43 -23 24 104 -112 47 -171 -77 -82 83
4725 83 11 -74 -60 182 -36 7 -9 -38 21 -19 27 -135 50 17 -32 25 10 20 25 -23 29 -64 -50 22 -31 -50 -69 -37 -3
4754 -3 -80 -2 79 -48 -33 124 -20 -184 -16 -65 155 -5 69 12 49 113 13 126 -130 25 110 -15 29 23 -7
4779gR1j07K6j0j12J56P6j58P2J10Jo1j52K7k2J15Kk8J20k01n0M2K35j29j8M6
4805F4j06M2j4k2n4Q1R9l2j55J5J0R3j09J18q1K59l15J37R8j28m3M4j04J94lp0
4831A8k7L4n8J25j27P9q1J2o1O5J2M1Oo2J04j12J84j86N3m9P3K6j97oJ56Ko7L1
4859a2k2j3j2Q1o3J72k17M2K8J20j19J1J24n7k0l9k4j6K6J21j33p7M8%J11Q4k43
4886i9k5K50P2m7j79K4K4l4R6r4j5P3j32J33q5N3m5O5m9K2jNo8J17Lj84L4kQ0
4915hK4N8j8M6l13J67k5L4L0Q9j27L7M2m1j4J20j95J36n4nK1J01o1j0N4r0j9P
4943a4L2K6l5Q2J4p1Ol3jj5m1K4Nl6N9o0M9J87k47P0K3l2N5j2J3J0J9j37J1J10
4973F1j32R7N3k8p7k9O1n7R7J4m5l5j5m0R5p2J25j6j19O7q8QJ13J3n1m1P1L4n6
$$ plain form
4779 -7 84 -23 3 -7 -119 37 113 -45 27 137 138 77 -75 -48 -70 45 47 19 139 -62 -112 -70 165 36 18 64
4805 64 -42 0 -14 -36 -90 -9 90 58 -97 -82 -72 21 -88 30 -51 208 -107 30 128 0 -43 1 -103 91 88 18
4831 18 -9 25 -33 92 -35 44 -37 -25 -86 -21 -9 32 38 -24 80 -32 152 -34 19 -30 43 69 -128 -134 22 24 -43 -12
4859 -12 -34 -47 -59 22 -41 131 -86 -44 -16 104 -15 -4 120 63 43 4 -20 -36 -10 111 -22 -99 -51 -51 60 144 -99
4886 -99 -124 126 198 151 -28 -4 20 -14 82 -12 -27 46 -86 47 -38 15 -30 35 -14 8 7 12 -56 61 64 -120 -86 -88 -8
4915 -8 16 74 56 102 -211 -44 -69 -35 -5 84 -43 -6 36 -5 -19 101 -94 42 -12 -17 4 105 44 34 88 -2 -21 -14
4943 -14 18 44 9 91 105 34 40 7 6 -9 -50 -26 -21 -57 2 -58 -9 178 -69 1 24 -8 47 35 48 58 77 -60 -49 61
4973 61 -71 26 79 51 -26 -55 6 -51 46 60 15 -20 -35 -75 20 -52 73 57 -62 5 -83 -75 38 51 0 -41 30 64 8
5002HJ7n3j0P4K0m2j3J18%j58R0pq5Pj7J6O1J9j20l6J78k9K1j08J15R1j27o3l3
5031f6N3Q2j01p7K27Lj57L8J59k15j4J34j73Q5M1J86l30J57K0m7j00J02p3R8k9
5056CM3p5L5k7OK0q6P1P4lJ4N5j31pM7j11p5J03q0JJ90j00K4K4M6OL5r6l0J4M3
5087C3j36R2J75j48po5P3M9j18J00K8j63n6J92n9nq8J00N8N1j21l0Q3j3p2j49
5113a96J30K0J69o8n0o5L6j5K0J4Q4r9l4l1K40j35m3J20mj09RJ04k70J08J33R
5139G7L8k01J16j9J4l0p1J60k22J78O8j80k7J25O9j38JO9q3J10rj4K7k5o2Q8j18
5166e9L7J53p1m2p6O5j0N1k72J67OoL1J33q3o4R8j11j15J01J20j92K9K93j99N3
5192C7J01r3o0p3R8J7J3%M3l9jm3n2N4M1l1L9k9n3n9M9P8k8k1mm4K4m8J25r1q
$$ plain form
5002 8 25 -28 -38 36 56 14 1 119 119 -39 51 44 -41 -34 -51 -35 26 45 -75 -111 67 38 59 -49 66 157 30 -33 -66
5031 -66 -13 69 -32 -109 118 121 -36 2 161 -54 -68 66 -107 -22 19 205 -125 32 52 5 -95 7 -66 32 3
5056 3 46 -29 6 -21 -15 5 -81 -10 64 61 75 130 -1 -8 39 -72 -147 -44 -124 -123 67 -33 -9 15 61 67 102 6 -24 -10 33
5087 33 -103 -11 164 16 9 -56 17 66 -52 48 76 -87 -143 49 -10 -15 -103 -3 55 106 -15 -45 38 25 -47 -196
5113 -196 -66 -46 123 55 5 -60 -24 -39 -19 -5 79 -20 -54 -85 155 20 -23 97 93 -16 -7 97 -173 -65 68 77
5139 77 115 -86 30 11 25 -5 -76 84 -138 40 108 -72 -99 26 95 -43 -42 27 -56 54 45 31 58 33 -29 59 -59
5166 -59 -22 131 60 18 -58 7 -3 48 -224 -57 -51 -57 -26 107 24 -40 58 -53 -168 -67 53 -139 -110 183 -16 37
5192 37 138 45 -15 -88 10 27 40 40 83 44 43 0 -52 2 43 12 51 22 -31 -90 -41 37 9 -12 -16 -60 -36 -84 41 -50 -58
5223e8M5L9N3K5j20M5J7o2qK4J23k53N4R0j35J05oK3o9J37j96J04J0Q7j16M6q0
5250g6J66Nj29j4L7K5M6j22L6P4j06K9j7JO0N5j41J10j38N7p0J15k9l6K1RJ08
5277G6j01L7m4J3Q1j09j3R0J69k03j6K9m2K1o2J13j6m8M0N2q7n9Q9N6j72L7J40
5304G1o8q0k3O1O6q0J47j5m8k8k9L0Q2j5j12K7P0N9n1m3o6L5j28J58n4oJ17j03
5332b6R6j03P3Q5j36P4p2O3pp6Q2K5j60N5Q1r2J7%K3k0j8Q2j30q5J20j00P5J02
5360B8r6j04J57N3o4J44o0j76N1J3K17j00m6j11P5Q8k1l2N5j65R8j14j5J20J18
5385A13l4o7Q4n7M0j24N4j1M3j55N4M7LK0j39J70Q2k31m3J63k9J75k05N2M5j46
5411i6J36M3L2j37n6J46j3N8j02l4L9Q1r9j10J87j31LN2n3J26o3M2ql5M9n7M9
$$ plain form
5223 -58 -13 26 79 104 -16 29 46 -16 -24 0 123 -130 -76 14 -121 -16 -22 1 -68 69 -127 -23 -13 74 -42 4 -76
5250 -76 90 95 -34 -48 -11 14 60 -62 -26 48 -58 -29 -46 -45 15 70 -71 39 -99 -42 -112 3 -26 -62 -41 -32 76
5277 76 -25 12 -32 -19 62 -47 -60 30 199 -4 -20 9 -33 -12 -74 39 23 -25 15 67 -20 -79 10 66 -106 -69 71
5304 71 3 -77 -100 -39 27 -53 94 79 31 3 -26 4 86 71 -41 -14 56 115 64 21 -45 -10 -138 20 -34 -40 77 -26
5332 -26 70 -33 40 125 -11 63 -9 54 47 -29 53 78 -82 -27 54 -38 -21 -21 2 -18 -36 46 -84 -169 -49 -149 -74 28
5360 28 -68 -172 -15 38 -26 118 58 -118 -67 -54 163 63 17 -94 -19 69 48 16 71 -94 4 -110 -125 -5 113
5385 113 79 12 96 39 79 -45 9 -2 41 -114 -60 -13 -10 10 -129 41 123 -108 -151 12 -17 158 -47 5 50 -96
5411 -96 40 83 115 -22 -78 68 55 113 11 -23 16 97 -2 -112 75 -56 -53 -1 -54 72 9 51 43 8 57 0 49
5438D9q2j7J11j35j3Q6J3j28J16J5M2j37R7J09j77JK2k1J98j13Mp7N0m7K0Q1j71
5465a04J32j16P8J5lJ9L8j41J01O0k68K51n5o8M4k3kO2m6q0j0k1L97m53J58J5
5491b0qM0J69k52l7K22q1J0n9NJn2J5J6J34n4Q5k49K25j17J36l0o3Q5l50K61m1
5518ir0J90p9m3Lj0N6L8mn8k9L7j4j33Q9l2P2Q7jm5k0m1J04j18P5j4mN6j39p4
5548a50J56J00j01K5l2j75K34j5q0j8n5J29O0k7m3j2k0J12n8j1j30J91j11o8M7
5573e2r5J03J11p3J6r6J18oJn5J23qj72J50j27M3PpJ8J0J84m0k43p2R6J14j65
5600a17J32j9L0j02J17J9k5m5K6L3k6K3k6n5k9J90j64Q6p6J03j11K2O7Q7j12M
5626C2M8jp8k6J06j9m3m0N9j59J39R2k0O7j44M1j54Q4JM4n6m0J04QK6l3J1k4M7
$$ plain form
5438 49 -33 -50 61 -74 -87 -1 12 -116 0 15 57 -80 17 126 -51 -50 -28 -49 149 36 40 -37 13 -34 -14 67 -104
5465 -104 28 -88 -10 5 2 21 59 -82 19 79 -189 62 7 -61 -17 -40 -42 20 -26 -106 -116 -137 260 -193 -35 -20
5491 -20 -28 12 181 -71 -108 114 33 43 -16 -11 -10 -62 -47 -31 103 49 134 -115 110 -7 129 99 36 121 -229 32 -9
5518 -9 -99 91 12 -31 -28 -38 18 56 52 -6 -35 2 -12 -145 -56 -88 -16 71 70 25 5 -36 68 -50 25 11 7 63 -76 -150
5548 -150 6 106 5 30 -2 -177 57 42 -38 -56 -111 18 78 51 8 -4 -24 88 30 19 -111 80 -31 -99 -52
5573 -52 -147 -44 67 -6 10 -86 32 26 27 -28 95 87 -85 65 -62 -19 -12 -19 -1 9 193 153 -90 -162 -66 48 -117
5600 -117 15 -4 26 -76 41 60 35 -10 16 49 23 46 20 -35 -64 126 -38 48 -28 75 -36 -14 53 140 28 32
5626 32 80 79 1 -25 81 62 19 -21 38 -121 18 110 90 157 13 54 -100 -16 -15 29 -27 -67 37 45 71 38 49 25 72
5655G2J%p7R3r4M6lL0j76K34j54l0J29J1O0n1j99J23M4L2j00J27n1n3m4P8k02
5682a54J86K5j45P3k0O6m6j9J05m0P9j15Qkj1pJ8m6l4R7j01J28O4p8j20J11P3
5709I5j18j6K9M8o1K4M4K1r6J50j27P5q1r2P1J20Jo3o4R5k6J2j7L7k01K07L4j06
5737eK6j50R4M8O3p9Q5j43KJ14r3K2l7J14j32M5n8J10K06k48J0j53J41k4J12j19
5763d9P6j11KR7j39J07L2OlN5n5qn2l4J24j27J16J5j70L1M2J21M6l4J8o0j07M3
5791a8Q6n0m5R6j4r4M2K4p3L0p7kJ41p0o8l1Q1m9M4q4J95j36J6J77O1k08k4P3
5819B3P2j15j4J9l6P5l1j9L9k0J26j17o5M8M8O2k17Q7k1Q1L3n7M6j5p1k7Q4m5
5847b7Jk2k0j5O3P4l7P8k1r3J10r7o4j9K6P4m0Q5n6N7o6j06M5J35mq4p3Q9J02
$$ plain form
5655 72 73 73 -4 89 -5 41 38 68 -108 126 -28 -58 71 82 142 91 -108 15 59 91 -9 118 67 14 -30 48 -154
5682 -154 32 57 -88 -15 -35 31 -15 -34 71 31 110 -5 3 1 -10 -17 1 -45 -79 18 -83 45 109 31 -89 22 95
5709 95 -23 -39 -10 38 -23 1 45 66 -30 120 -7 68 -13 -105 -34 86 87 24 -40 55 29 41 24 61 -140 67 101 -5
5737 -5 21 -129 -35 13 76 -3 82 -61 -59 55 -38 -16 -53 61 -71 -26 -84 26 232 -16 -6 -159 -18 -42 70 -49
5763 -49 27 -84 -82 15 -124 -17 15 21 18 73 18 10 -42 -76 48 -79 37 52 -118 -87 -45 76 122 88 106 46 -61 -18
5791 -18 68 18 -27 69 55 -39 3 27 -46 -16 -93 -95 46 -24 -92 -123 -42 -91 -47 -131 64 -72 -56 121 182 -26 -50 23
5819 23 95 -20 -34 -15 -51 24 -7 -26 13 -7 119 2 -63 -15 33 95 -122 -35 -56 25 58 1 47 32 -39 -66 18 -27
5847 -27 -26 -48 -68 -83 -20 54 17 95 74 -19 91 -6 -70 -89 -63 11 -29 56 0 57 -9 -115 -70 65 61 -23 -96 -7 95
$$ [...]
8191C4
##END NTUPLES=NMR FID
##END=
