##TITLE=1H_SA_62.238.1
 DMSO, 108 sc, 
 24.12.2020
##JCAMPDX= 6.0         $$ Bruker NMR JCAMP-DX V2.0
##DATA TYPE= NMR FID
##DATA CLASS= NTUPLES
##ORIGIN= UXNMR, Bruker Analytische Messtechnik GmbH
##OWNER= root
$$ XWIN-NMR		Version 3.5
$$ Thu Dec 24 12:00:36 2020 Russian Standard Time (UT+4h)  she@DPX200
##.OBSERVE FREQUENCY= 200.1315066352
##.OBSERVE NUCLEUS= ^1H
##.DELAY= (6, 6)
##.ACQUISITION MODE= SIMULTANEOUS
##.ACQUISITION SCHEME= undefined
##.AVERAGES= 108
##.DIGITISER RES= 18
##SPECTROMETER/DATA SYSTEM= spect
##.PULSE SEQUENCE= zg30
##.SOLVENT NAME= DMSO
##.SHIFT REFERENCE= (INTERNAL, DMSO, 0, 15.7039)
##AUDIT TRAIL= $$ (NUMBER, WHEN, WHO, WHERE, WHAT)
$$ ##TITLE= Audit trail, XWIN-NMR		Version 3.5
$$ ##JCAMPDX= 5.01
$$ ##ORIGIN= Bruker BioSpin GmbH
$$ ##OWNER= she
$$ F:/spectra/data/she/nmr/H-F/1/audita.txt
$$ ##AUDIT TRAIL=  $$ (NUMBER, WHEN, WHO, WHERE, WHAT)
(   1,<2020-12-24 11:59:01.00 +0400>,<she>,<DPX200>,
      <continue with go, POWCHK disabled, PULCHK disabled
       configuration hash MD5:
       00 E9 B6 7A A2 85 ED C7 34 08 36 98 17 FE 4E 26
       data hash MD5: 16K
       B8 F1 5D C6 71 66 E0 C3 86 91 20 C7 68 46 C1 84>)
$$ ##END=
$$ 
$$ hash MD5
$$ 3C D1 47 7E 1C D0 13 58 35 47 37 89 ED B6 09 C2
##$RELAX= 
##$RELAX= 
##$RELAX= 
##$RELAX= 
##$RELAX= 
##$RELAX= 
$$ Bruker specific parameters
$$ --------------------------
##$DU= <F:/spectra>
##$EXPNO= 1
##$NAME= <H-F>
##$PROCNO= 1
##$TYPE= <nmr>
##$USER= <she>
##$AMP= (0..31)
100 100 100 100 100 100 100 100 100 100 100 100 100 100 100 100 100 100 
100 100 100 100 100 100 100 100 100 100 100 100 100 100 
##$AQSEQ= 0
##$AQ_mod= 1
##$AUNM= <au_zg>
##$AUTOPOS= <>
##$BF1= 200.13
##$BF2= 200.13
##$BF3= 200.13
##$BF4= 200.13
##$BF5= 200.13
##$BF6= 200.13
##$BF7= 200.13
##$BF8= 200.13
##$BYTORDA= 1
##$CFDGTYP= 0
##$CFRGTYP= 5
##$CHEMSTR= <none>
##$CNST= (0..31)
1 1 145 1 1 1 1 1 1 1 1 1 1 1 1 1 1 1 1 1 1 1 1 1 1 1 1 1 1 1 1 1 
##$CPDPRG= <>
##$CPDPRG1= <>
##$CPDPRG2= <>
##$CPDPRG3= <>
##$CPDPRG4= <mlev>
##$CPDPRG5= <mlev>
##$CPDPRG6= <mlev>
##$CPDPRG7= <mlev>
##$CPDPRG8= <mlev>
##$CPDPRGB= <>
##$CPDPRGT= <>
##$D= (0..31)
0 1.2 0 0 0 0 0 0 0 0.06 0 0.03 0 0 0 0 0.0002 0 0 0 0 0 0 0 0 0 0 0 0 
0 0 0 
##$DATE= 1608796316
##$DBL= (0..7)
120 120 120 120 120 120 120 120 
##$DBP= (0..7)
150 150 150 150 150 150 150 150 
##$DBP07= 0
##$DBPNAM0= <>
##$DBPNAM1= <>
##$DBPNAM2= <>
##$DBPNAM3= <>
##$DBPNAM4= <>
##$DBPNAM5= <>
##$DBPNAM6= <>
##$DBPNAM7= <>
##$DBPOAL= (0..7)
0.5 0.5 0.5 0.5 0.5 0.5 0.5 0.5 
##$DBPOFFS= (0..7)
0 0 0 0 0 0 0 0 
##$DE= 6
##$DECBNUC= <off>
##$DECIM= 32
##$DECNUC= <off>
##$DECSTAT= 4
##$DIGMOD= 1
##$DIGTYP= 9
##$DL= (0..7)
0 120 120 120 120 120 120 120 
##$DP= (0..7)
150 150 150 150 150 150 150 150 
##$DP07= 0
##$DPNAME0= <>
##$DPNAME1= <>
##$DPNAME2= <>
##$DPNAME3= <>
##$DPNAME4= <>
##$DPNAME5= <>
##$DPNAME6= <>
##$DPNAME7= <>
##$DPOAL= (0..7)
0.5 0.5 0.5 0.5 0.5 0.5 0.5 0.5 
##$DPOFFS= (0..7)
0 0 0 0 0 0 0 0 
##$DQDMODE= 0
##$DR= 18
##$DS= 0
$$ [...]
##$SUBNAM2= <"">
##$SUBNAM3= <"">
##$SUBNAM4= <"">
##$SUBNAM5= <"">
##$SUBNAM6= <"">
##$SUBNAM7= <"">
##$SUBNAM8= <"">
##$SUBNAM9= <"">
##$SW= 16.9725356469052
##$SWIBOX= (0..15)
0 0 2 0 0 0 0 0 0 0 0 0 0 0 0 0 
##$SW_h= 3396.73913043478
##$TD= 16384
##$TD0= 1
##$TE= 0
##$TE2= 300
##$TE3= 300
##$TEG= 300
##$TL= (0..7)
0 120 120 120 120 120 120 120 
##$TP= (0..7)
150 150 150 150 150 150 150 150 
##$TP07= 0
##$TPNAME0= <>
##$TPNAME1= <>
##$TPNAME2= <>
##$TPNAME3= <>
##$TPNAME4= <>
##$TPNAME5= <>
##$TPNAME6= <>
##$TPNAME7= <>
##$TPOAL= (0..7)
0.5 0.5 0.5 0.5 0.5 0.5 0.5 0.5 
##$TPOFFS= (0..7)
0 0 0 0 0 0 0 0 
##$TUNHIN= 0
##$TUNHOUT= 0
##$TUNXOUT= 0
##$USERA1= <user>
##$USERA2= <user>
##$USERA3= <user>
##$USERA4= <user>
##$USERA5= <user>
##$V9= 5
##$VALIST= <valist>
##$VCLIST= <CCCCCCCCCCCCCCC>
##$VD= 0
##$VDLIST= <DDDDDDDDDDDDDDD>
##$VPLIST= <PPPPPPPPPPPPPPP>
##$VTLIST= <TTTTTTTTTTTTTTT>
##$WBST= 1024
##$WBSW= 4
##$XGAIN= (0..3)
0 0 0 0 
##$XL= 0
##$YL= 0
##$YMAX_a= 1492066
##$YMIN_a= -977562
##$ZGOPTNS= <>
##$ZL1= 120
##$ZL2= 120
##$ZL3= 120
##$ZL4= 120
##$ABSF1= 10
##$ABSF2= 0
##$ABSG= 5
##$ABSL= 3
##$ALPHA= 0
##$AQORDER= 0
##$ASSFAC= 0
##$ASSFACI= 0
##$ASSFACX= 0
##$ASSWID= 0
##$AUNMP= <proc_1d>
##$AZFE= 0.1
##$AZFW= 0.1
##$BCFW= 1
##$BC_mod= 2
##$BYTORDP= 1
##$COROFFS= 0
##$CY= 11.3945322036743
##$DATMOD= 1
##$DC= 2
##$DFILT= <>
##$DTYPP= 0
##$F1P= 15.9154993809931
##$F2P= -4.1035820241983
##$FCOR= 0.5
##$FTSIZE= 0
##$FT_mod= 4
##$GAMMA= 1
##$GB= 0.15
##$INTBC= 1
##$INTSCL= 1
##$ISEN= 128
##$LB= 0.24
##$LEV0= 0
##$LPBIN= 0
##$MAXI= 10000
##$MC2= 0
##$MEAN= 0
##$ME_mod= 0
##$MI= 1.114404
##$NCOEF= 0
##$NC_proc= 0
##$NLEV= 6
##$NOISF1= 3.799351
##$NOISF2= 2.8
##$NSP= 1
##$NTH_PI= 0
##$NZP= 0
##$OFFSET= 15.70392
##$PC= 1
##$PHC0= -10764.21
##$PHC1= 11.40095
##$PH_mod= 1
##$PKNL= yes
##$PPARMOD= 0
##$PSCAL= 0
##$PSIGN= 0
##$REVERSE= no
##$SF= 200.130013532006
##$SI= 16384
##$SIGF1= 3
##$SIGF2= 2
##$SINO= 400
##$SIOLD= 16384
##$SREGLST= <1H.CDCl3>
##$SSB= 0
##$STSI= 0
##$STSR= 0
##$SW_p= 3612.71676300578
##$SYMM= 0
##$S_DEV= 0
##$TDeff= 0
##$TDoff= 0
##$TI= <>
##$TILT= no
##$TM1= 0
##$TM2= 0
##$TOPLEV= 0
##$USERP1= <user>
##$USERP2= <user>
##$USERP3= <user>
##$USERP4= <user>
##$USERP5= <user>
##$WDW= 1
##$XDIM= 8192
##$YMAX_p= 0
##$YMIN_p= 0
$$ End of Bruker specific parameters
$$ ---------------------------------
##NTUPLES= NMR FID
##VAR_NAME=  TIME,          FID/REAL,        FID/IMAG
##SYMBOL=    X,             R,               I
##VAR_TYPE=  INDEPENDENT,   DEPENDENT,       DEPENDENT
##VAR_FORM=  AFFN,          ASDF,            ASDF
##VAR_DIM=   8192,          8192,            8192
##UNITS=     SECONDS,       ARBITRARY UNITS, ARBITRARY UNITS
##FACTOR=    0.0002944,     1,               1
##FIRST=     0,             0,               0
##LAST=      2.4114304,     0,               0
##MIN=       0,             -977562,         0
##MAX=       2.4114304,     1492066,         0
$$ Real data points
##PAGE= N=1
##DATA TABLE= (X++(R..R)), XYDATA
0@%%%%%%%%%%%%%%j08K16k16K16k16K16l24M32m38N46o48P56r39J047j188J404
30G56j620J836k054K327k649K985l343L738m185M669n198N784o416P101p849Q668
46D550r579J0559j1628J2814j4122J5568j7153J8912k0896K3130k5664K8584l1975
59a6900L5962m0730M6559n3888O3418p6349R4961j24219J76923l00617J114643
70I19763N72303k469628L99013J443591q8540j197583L7845P70977J01329m27075
80F1995k75084k8115Q08293l8797j109072K38295J131780m73459r96055N00390
90a79829Q17566o19453n64933N68967K30167m36214Q5856N8758j65537L15275
100A10623M4336n07735J61766N60938l21610n68560N16698M30278p23593j07937
$$ plain form
0 0 0 0 0 0 0 0 0 0 0 0 0 0 0 0 -108 108 -108 108 -108 108 -216 216 -222 324 -324 432 -507 540 -648 756
30 756 -864 972 -1082 1245 -1404 1581 -1762 1976 -2209 2460 -2738 3046 -3370 3731 -4118 4550
46 4550 -5029 5530 -6098 6716 -7406 8162 -8991 9921 -10975 12155 -13509 15075 -16900
59 -16900 19062 -21668 24891 -28997 34421 -41928 53033 -71186 105737 -194880 919763
70 919763 1492066 -977562 -578549 865042 776502 -421081 -383236 387741 489070 61995
80 61995 -213089 -241204 567089 528292 -580780 -342485 789295 315836 -680219 -179829
90 -179829 637737 18284 -546649 22318 252485 -183729 -97873 -39115 -204652 110623
100 110623 154959 -352776 -191010 369928 48318 -520242 -3544 426734 -296859 -404796
110d04796O79551k65479l67506L74989O9482l03094J52659K50359l34168n4891
120b02894N07144k47194m21342N32572J37708n76410J31029M51734k91742l05744
130b85139M04743R7233m28152J66549L14838l52613n6935M09576k09823k76184
140b15907L71892P0011m22234J05844L65252l03232k58919M20644K4826m49733
150b91556K34386K73041l75044q808L41333j68210k30651L02956Q9760l88854
160b21647J24934L54964l49690j61669M34100q9184l38050K52186J91584l08406
170a10878j0954L39277j65740k30430L35607N3850l68999J72673K72046l21215
180c4763r2810L37992q2966k96963K16652J78348l18386j0402L29104j91498k17700
$$ plain form
110 -404796 274755 9276 -358230 16759 86241 -216853 -64194 186165 -148003 -202894
120 -202894 304250 57056 -364286 168286 305994 -270416 -139387 312347 20605 -285139
130 -285139 119604 216837 -211315 -44766 270072 -82541 -139476 270100 60277 -215907
140 -215907 155985 225996 -196238 -90394 274858 -28374 -287293 133351 158177 -291556
150 -291556 -57170 215871 -159173 -167981 173352 5142 -225509 77447 167207 -221647
160 -221647 -96713 258251 -91439 -253108 180992 91808 -246242 5944 197528 -110878
170 -110878 -121832 217445 51705 -178725 156882 210732 -158267 14406 286452 -34763
180 -34763 -127573 210419 127453 -169510 47142 225490 -92896 -103298 225806 34308 -183392
191a83392L26767J891l16915J67198J98807k66185q7703K98769q0465k89298K35088
202D562J42724l38573O8272K79423k29417j22455K77015p236k62913J41218K09610
213A62230k62640o3623L11570j21003k35702K59648P1885k76556Q2087K21064
223A48960j73403j31696K60227O442k67489J60025J87567k70902j4247K69195
233A74679j43143j65012K04549N6604k31920N0666K17578j85974j18677K68130
243A27480n0298k32397J91953J01047k24479J6913J98594j09499j58832K00427
253F0909M9450k50753J01612J86608k18743m8409K29935p8384j68501J50819J00893
264A15436k02702N93K22315j33643j44877K24352P475k16638J22342J30082j74815
$$ plain form
191 -183392 143375 145266 -171649 -4451 194356 -71829 -159532 139237 58772 -230526 4562
202 4562 147286 -191287 -123015 156408 -73009 -195464 81551 74315 -188598 -47380 162230
213 162230 -100410 -164033 147537 26534 -209168 50480 122365 -154191 -72104 148960
223 148960 -24443 -156139 104088 110530 -156959 3066 190633 -80269 -94516 174679
233 174679 31536 -133476 71073 127677 -104243 -53577 164001 -21973 -140650 127480
243 127480 77182 -155215 36738 137785 -86694 -69781 128813 19314 -139518 60909
253 60909 110359 -140394 -38782 147826 -70917 -119326 110609 32225 -136276 14543 115436
264 115436 -87266 -86673 135642 1999 -142878 81474 88949 -127689 -5347 124735 -50080
275e0080l6008J86910m6710j76909J52772R9068k18400L8319J91280j49868q8048
286i7674J85680j8334j59676Q7061J21745j55640m8402J96552p6670j53680J66051
297D7013M1271j81346N8629J30920j21539p1352J54323k612j68540J01188J13433
308A01388j76146j930J68971r7658j01473J41866K2648j47709M4931J30280j18056
319c2888p2234J71139l2460j43713J21262P0016j47905J9264J34088p8060q7335
330g8826J23817L1000j46957N4859J20597j32224l7090J45994m4523j08955J00766
341B8458N4503j19477P073J21890p1241q8229J32418O781j36426O9319Q2835j16582
353b8678k2287J12555m1827r4734Q3997N1533j22918J7617J16849r0982n6937
$$ plain form
275 -50080 -86088 100822 54112 -122797 29975 129043 -89357 -51038 140242 -9626 -97674
286 -97674 88006 69672 -90004 -2943 118802 -36838 -85240 111312 34642 -119038 47013
297 47013 88284 -93062 -34433 96487 -25052 -96404 57919 55307 -113233 -12045 101388
308 101388 -74758 -76688 92283 -5375 -106848 35018 57666 -90043 -45112 85168 -32888
319 -32888 -105122 66017 33557 -110156 11106 81122 -66783 -47519 86569 8509 -78826
330 -78826 44991 75991 -70966 -16107 104490 -27734 -64824 81170 36647 -72308 28458
341 28458 82961 -36516 -29443 92447 21206 -67023 65395 72176 -64250 5069 87904 -28678
353 -28678 -50965 61590 19763 -74971 9026 60559 -62359 -44742 72107 -18875 -75812
364g5812J16578j2337j04086O4797O0215r5920j7600J00999l7939r2146R4989
375A738L4064j12771L9456Q9634q0186l1445R7088j1102q0252N1984O4960r2605
387b9437j3735J04942n4323o9191R1847R502q7919L9052O4416o1406l1674Q6327
399D8401m542q7770O7143M7377r4757J3215P4621n6687m3418O5714O546p0213
411c4370K2556O6635o3211k9433R0557k5423o3219O6008K2830o8721J1474N5068
423E0751l7597m7202N7096J4597q2894L6192N4070p4121j496O2992k8502l9717
435c5831M3795K3603n6272L59O2972m5097m2288P0200j7378n6876L9353K2944
447I484m5990k366M7229j3379m2518M6590K9270o2612K2145M8821m6609j0804
$$ plain form
364 -75812 40766 28429 -75657 -10860 49355 -46565 -64165 36834 -1105 -93251 1738
375 1738 35802 -76969 -37513 52121 -28065 -59510 37578 26476 -53776 -1792 63168 -29437
387 -29437 -43172 61770 7447 -61744 30103 39605 -48314 -9262 55154 -6252 -37926 48401
399 48401 43859 -43911 23232 70609 -24148 -10933 63688 7001 -36417 29297 35843 -34370
411 -34370 -11814 54821 -8390 -37823 52734 27311 -35908 30100 52930 -15791 -4317 50751
423 50751 13154 -34048 23048 37645 -45249 -9057 45013 -29108 -30604 32388 3886 -35831
435 -35831 7964 31567 -24705 -24346 38626 -6471 -48759 21441 4063 -52813 -13460 9484
447 9484 -36506 -38872 8357 -5022 -47540 -950 28320 -34292 -12147 36674 -9935 -20739
459b0739M2305r848l8280K2527K8669m2867j2544N6228k1224m0822N4796M073
471B2274m2250K2660K6545k7929j5415L5023m067m5065K5849K6449n2951O590
483b2287L9570l0657j2516K8941O662k3985R901L2737k4943j3775M3393j2907
495B0134l2792L4503N696l0514O638K1909j2289k0325K7180Q998l1703J7684K7139
508D2258l2609j168L1465k0216j7520J5610P105k7779n610K2477j8704k0428K4794
521c25l545k7444K2359R183k1300L325J5614l298j8979J2830J0212k3713J785
534b3296J8144j7369o508J9350n991j0020J2584J3088j2277k112K4429l912j5442
547i332J7822R363k1955R629P642j5537J485R154m436j1913J1678J0424j7067
$$ plain form
459 -20739 21566 11718 -26562 -4035 24634 -18233 -30777 25451 4227 -36595 18201 22274
471 22274 -19976 2684 29229 1300 -14115 20908 16841 -28224 -2375 24074 -28877 -22287
483 -22287 17283 -13374 -25890 3051 9713 -14272 -4371 28366 3423 -10352 33041 20134
495 20134 -12658 21845 27541 -2973 3665 25574 13285 -7040 20140 29138 -2565 15119 42258
508 42258 9649 8481 39946 19730 2210 17820 24925 -2854 -8464 14013 -4691 -25119 -325
521 -325 -3870 -31314 -8955 228 -21072 -17747 -2133 -5431 -24410 -11580 -1368 -25081 -23296
534 -23296 -5152 -22521 -29029 -9679 -15670 -25690 -13106 -18 -12295 -14407 10022 6110 -9332
547 -9332 8490 17853 -4102 5527 13169 -2368 -883 8271 3835 -8078 3600 14024 -3043
560c043J351K0341j0520p874J5453m207n067K330M74m737o598Q908l270j3289
574i748P288R486j3099L543O712j07j397O35N173m802kQ088j0148p884J3651o806
590E83j1145R092p94l348O13J944L674m949O040K321r429Q901N442j5802P839
605I82L795q645L263n554M546m4l469N263k853Q82J0202q630M55P978n123K327
621E375k405q18O536j0654M70M669o994J128J788o576N427K785n703L595r95N678
637C306m236o265J0679n699n372P684n459p19R393j0397O58M859j380M325o461
652e084P419L574p049O093j64l412Q444o472k603P915n525L768m058k542P516
667G820l968k408L095j467K556j973k975M245j819k373J834o232L645J924q229
$$ plain form
560 -3043 -1692 18649 8129 255 15708 11501 6434 8764 9238 4501 -2097 6811 3541 -9748
574 -9748 -2460 7026 -6073 -2530 4182 4075 2678 3313 8486 3684 3682 11770 1622 -6262 7389 583
590 583 -10562 -1470 -2264 -5612 -4999 -3055 619 -4330 1710 4031 -5398 3503 8945 -6857 982
605 982 4777 -3868 -605 -6159 -1613 -1657 -5126 137 -2716 -1834 8368 -262 193 8171 3048 5375
621 5375 2970 2152 8688 -1966 -1496 3173 -3821 -2693 -905 -7481 -2054 731 -4972 -1377 -2372 3306
637 3306 -930 -7195 3484 -2215 -7587 97 -5362 -6081 3312 -7085 -6427 -1568 -2948 1377 -5084
652 -5084 2335 5909 -1140 4953 4789 1377 9821 3349 746 8661 3136 6904 2846 304 7820
667 7820 3852 1444 4539 3072 5628 3655 680 4925 3106 733 2567 -3665 -20 1904 -6325
682f325K694K071m457K491p69k559N651l106J47j035P25N591q718K785O029n278
698d063L52K808l937N182j121l071N216k694J869K41k375N315J20j790n27J434
714B959K676N44n657M270J735n108K064n04J82N27j444j621J163j160L49n52n22
731i9L180l575M47m15r34L851l613m347O097J59o170K291J9l86R22k295K697j119
749c290J712R13k069K176K019j122P88m89r00L799m158k193O123k700k674J940
765a25N60j438L403j489N74n1K594M61m966N008j99n290L210n12l237K171k368
782a694M39K283l857L413q85J17L229m509K372J205j799R21l567j559M796o252
798e347K46M939o867L540k91j172K688J233j793J860M66J191j781k822O671n111
$$ plain form
682 -6325 -3631 -1560 -6017 -3526 -4295 -6854 -1203 -4309 -4162 -5197 -4472 1119 -7599 -4814 1215 -4063
698 -4063 -3711 -903 -4840 342 -779 -3850 1366 -1328 541 782 -1593 3722 3842 2052 1525 2959
714 2959 5635 6179 522 4792 6527 1419 3483 2979 3161 3688 2244 623 1786 626 975 423 -99
731 -99 3081 -494 -47 -462 -1396 2455 -1158 -5505 592 751 -5419 -3128 -3109 -3495 -2573 -4868 -2171 -3290
749 -3290 -1578 -665 -2734 -558 1461 339 1127 638 -262 3537 -621 -2814 3309 609 -2065 -125
765 -125 435 -1003 2400 911 1485 1434 4028 4489 -477 4531 4332 -958 2252 1740 -1497 674 -1694
782 -1694 -1255 1028 -2829 584 -301 -184 3045 -1464 908 2113 314 1235 -2332 -3891 905 -5347
798 -5347 -5101 -162 -7029 -3489 -3780 -4952 -2264 -1031 -2824 -964 -498 693 -1088 -3910 2761 -2350
814b350j519M649m520Q28J749p98P34K470J519P14j863M106K776q486P524r55
830F578m278L637l511o85N63k503L677k260l105P437m693k211P194k767k52m06
846B415J101r65l223R12J681p492L306K823p895L841L424k953K08K633K114k097
862a67k86M573l356k497N430m081k863M804n302P84j326J386m77l184M846R51
878g65k189K820J494m143J900J3j942j332P54K064o060O01M813l437k466O507
894a368N09k585N888J368j118j729N146m74n718N334P55o683J083N250p152J20
910a374N311k027j640K689L450l407J58M308k644m806N003j145o575K926N15l597
926b855j692K289J249m412K419L804j036j077M926j629j041K173l94j585l07J975
$$ plain form
814 -2350 -3869 780 -3740 -2912 -1163 -1961 -1227 1243 2762 3476 1613 5719 8495 9 7533 6578
830 6578 2300 5937 2426 1741 2304 -199 3478 1218 -1887 5550 857 -1354 5840 3073 2821 2415
846 2415 3516 2551 -672 240 1921 -5571 -2265 558 -7337 -3496 -72 -3025 -2817 -184 1930 -167
862 -167 -453 4120 764 -1733 3697 -384 -3247 1557 -3745 -2961 -4287 -2901 -3378 -6562 -1716 -765
878 -765 -2954 -134 1360 -2783 -883 -870 -2812 -4144 -3390 -1326 -7386 -6785 -1972 -5409 -7875 -1368
894 -1368 -859 -3444 2444 3812 2694 965 6111 5637 -81 5253 6008 -675 408 5658 -1494 -1374
910 -1374 3937 1910 270 2959 6409 3002 3160 7468 4824 18 5021 3876 -2699 227 742 -2855
926 -2855 -4547 -2258 -1009 -5421 -3002 802 -234 -1311 3615 1986 945 3118 2724 1139 832 2807
942B807m044j967L407L91m390L218L066n589L625L635l155r27K652J22n787N60
958b376M205o623k005M756m438k861N150k491l47P45M538j655k879N289P34n105
974e363N030K198o850K002J949j098n56O41L764l091L61O317k080k903P270j296
990F295k632L183R97j721l061L039j354n529M888j04n105L133K872o498L013K972
1006D388l189j67K89L479n176K1M155m420k773M748m078j038J260N17j66k636
1022d786M840J389n882M632L185n797J591L026l489k033K002M17m345J160O167
1037B077p314k17P471l761k878M311J603k320K22J025N72l214L476L32n771M621
1053B35R96l639Q84K822l16j003J288J978k292j219N819m505L23J289j221j101
$$ plain form
942 2807 -1237 -3204 203 594 -3796 -578 2488 -3101 524 4159 1004 77 2729 2851 -2936 -2376
958 -2376 1829 -4794 -6799 -2043 -6481 -9342 -4192 -6683 -7030 -6285 -1747 -3402 -6281 -992 -258 -5363
974 -5363 -333 1865 -4985 -2983 -1034 -2132 -2688 -2047 1717 -1374 -1013 5304 3224 321 7591 6295
990 6295 3663 6846 7843 6122 3061 6100 4746 -783 4105 4001 -1104 2029 4901 -1597 1416 4388
1006 4388 1199 1032 1321 4800 -376 -355 3800 -620 -3393 1355 -2723 -3761 -2501 -1984 -2150 -4786
1022 -4786 54 1443 -4439 193 3378 -2419 -828 2198 -1291 -3324 -1322 -905 -5250 -4090 2077
1037 2077 -5237 -5454 2017 -1744 -4622 -311 1292 -1028 -806 219 791 -2423 1053 1385 -4386 235
1053 235 1231 -2408 -1524 1298 982 -21 1267 3245 953 -266 5553 1048 1371 2660 1439 338
1069C38J279O13k771n50K364J678n841L950K338m379J240K339j075k061K031p98
1085F95j618Q47J220k391q96M334l618j633K428Q53p85q09K969j534q70K366r06
1102F52k085J457J506l488R31J770q92k057J584J186j195l06N80J04j305K220
1118F62j015j891J644J183j238j715K582j724j2M4J422j457o69L335k621O17J320
1135D67j129p8r2K174l73n81Q40j328j021L066q54j062J539j631L50o60K148n53
1153A222j462J97J952j015j278M065l561L25J284q32j286P20K43K76j633J146
1169C63J224m318J619J823k444J033O38J41j024j32J172M78j943J935l65j977
1185a777J992j482R7M76o13N36k48j20K441r99j16J146j087n8N42j169J760j956
$$ plain form
1069 338 1617 2230 -541 -1091 1273 2951 -2890 1060 3398 -981 259 2598 1523 -538 1493 695
1085 695 -923 -76 1144 -1247 -2143 2191 -1427 -3060 -632 221 -564 -1373 1596 62 -808 1558 652
1102 652 -1433 24 1530 -1958 -1027 743 -149 -2206 -622 564 -631 -937 -357 -253 -1558 662
1118 662 -353 -2244 -600 583 -655 -2370 212 -1512 -1524 -1480 -58 -1515 -2184 1151 -1470 -853 467
1135 467 -662 -740 -832 1342 969 388 1228 -100 -1121 1945 1091 29 1568 -63 287 -373 1775 1222
1153 1222 -240 -43 1909 894 -384 3681 120 445 1729 897 -389 331 574 850 -783 363
1169 363 1587 -2731 -1112 711 -1733 -700 -62 79 -945 -1077 95 573 -1370 565 200 -1777
1185 -1777 215 -1267 -1170 -694 -1307 -771 -1019 -1139 1302 303 187 1333 246 188 730 -439 1321 -635
1203f35J192k7j711J507l58o86J643k035L08J748j012N96k14m10K040j804j99
1220e7P42p16R3k39n63M31l14p65J999j242J370J281j692J464m71j69J05j157
1238A00J75q18o65P32K43k276J946j065K8N68o88J239N53J0P81n25q96Q94m66
1257a30p21q0m35J290j379L07P63R35q54J827k75J35k61O57l92l06Q49j065m76
1276C89o0L68m35m42m88O51k2j186J209J041j765J105O05j86o83l32l56l95N03
1295d79o24K38j448J062m5M81j294J750P61P65j437J780L22j6p03K1m10N26o21
1314F29j955J229K72r00O36j51l30O77n93K126j660J446q38m19J80K76j836K60
1332i51r1q08J892j554k20K442n21q2Q14J047m84m83N95Q58q17o31J79p50P50
$$ plain form
1203 -635 557 530 -1181 326 -32 -718 925 -1110 -802 946 -66 530 316 -94 1946 142 -57
1220 -57 685 -31 62 -177 -740 -309 -623 -1388 611 -631 739 2020 328 1792 1321 1152 1257 100
1238 100 275 -543 -1208 -476 -233 -2509 -563 -1628 -1600 -1032 -1720 -481 72 82 863 338 -558 336 -130
1257 -130 -851 -931 -1366 -76 -1455 -1148 -385 550 -304 1523 1248 1383 1122 1779 1387 1081 1930 865 389
1276 389 329 697 262 -180 -668 -17 -39 -1225 -16 1025 -740 365 970 784 101 -231 -587 -982 -479
1295 -479 -1103 -865 -2313 -1251 -1296 -815 -2109 -359 402 1167 -270 1510 1832 1816 1113 1134 724 1250 629
1314 629 -1326 -97 175 -725 -89 -240 -570 107 -486 1640 -20 1426 588 169 349 625 -1211 -951
1332 -951 -1042 -1850 42 -1512 -1732 710 189 107 921 1968 1484 1001 1596 2454 1637 1006 1185 435 1185
1351A185j622O95l46k37J300k096K2L241j151n61Q79j016J153j067j237J420k741
1368b179J546p49j045L80O5j493J474J786j166L63L58J183q14j17J973k391J47
1385f79J315r94o25K091j285q06J027N38O37r65K430j229j575J650O4k643J040
1402iO10j004r83O6J500k529M21K928k273N37J937q13k93N70o7M8o0K255j566
1421A275k542L936r57l244J896J419l77k049K917j249j098J081K747l333k60L390
1437C552l254O06M31n30k628J927J205l980M53K106p84k056M037j509l14J209
1453D71J56k428o86K125R23m624L188J265l292n34L989j903j213K500J423k705
1469a345J076L007l942j326M572o11m259L280J016l679J828L586l059k799N643
$$ plain form
1351 1185 -437 258 -88 -325 975 -1121 -1099 2142 991 430 1309 293 1446 379 -858 562 -2179
1368 -2179 -633 -1382 -2427 -2047 -1982 -3475 -2001 -215 -1381 -1018 -660 523 -291 -408 1565 -826 -679
1385 -679 636 -358 -983 1108 -177 -983 44 582 1219 254 2684 1455 -120 1530 1594 -1049 -9
1402 -9 601 -403 -1386 -1320 180 -2349 -1928 1000 -1273 -736 1201 388 95 665 598 646 586 2841 1275
1421 1275 -1267 2669 1712 -1532 364 1783 1406 -643 2274 1025 -73 1008 3755 422 162 3552
1437 3552 298 904 1335 805 -1823 104 1309 -2671 -2218 -112 -896 -2952 1085 -424 -738 471
1453 471 627 -1801 -2487 -362 561 -4063 -875 390 -2902 -3436 553 -1350 -2563 -63 1360 -1345
1469 -1345 -269 2738 -1204 -2530 2042 1431 -2828 452 1468 -2211 -383 3203 144 -2655 2988
1484B988p26m423K408L355m379l46M100r31l397K471J238m573K485L353m261j725
1500b363N139K4n845M695K919m819j359O275l104l468M585J109o698K792M267
1515D149m927k463P070j981m876L522L664n633j027O001m533j166M130M39o772
1530d403L266M782o258j159O389j836n945M312L585o052J22N739l177m512O453
1545A306J87o392L524M507n858j579P524k224o208M536M287o834lQ183o639k685
1561d368P181l44o733M434N293q211l71Q217l866n693O661J244p630K753O257
1576D824o019k634P386n62o950M763M676p998q65Q897m859n502O540K642p786
1591c447J813P644p481m223R413j088q768Q225L168r107J322P798l449p794R309
$$ plain form
1484 2988 2262 -2161 247 3602 -777 -1123 2977 2046 -1351 1120 2358 -2215 270 3623 -638 -2363
1500 -2363 2776 2800 -3045 1650 4569 -250 -1609 4666 1562 -1906 2679 3788 -2910 -118 4149
1515 4149 -778 -3241 3829 1848 -3028 494 4158 -1475 -2502 3499 -1034 -2200 1930 2369 -4403
1530 -4403 -1137 3645 -2613 -3772 2617 781 -5164 -852 2733 -3319 -3197 2542 -635 -5147 1306
1545 1306 1493 -4899 -1375 3132 -2726 -4305 3219 995 -5213 -677 3610 -3224 -3227 4956 -1683 -4368
1561 -4368 2813 2469 -4264 170 5463 -2748 -3119 5098 1232 -4461 2200 3444 -4186 -1433 4824
1576 4824 -1195 -3829 3557 2995 -3955 808 5484 -2514 -3379 5518 659 -4843 1697 4339 -3447
1591 -3447 -1634 6010 -1471 -5694 3719 2631 -6137 2088 5256 -3851 -2529 5269 1820 -5974 3335
1606C335J421r933M157O727q385j731Q998l625o361P549K669q911J356Q286n639
1621h7o553J0829P7j0435N554P138r120k189R699k406q976Q320L287j0474K588
1636b748R148p462n713J1485m52r606N468P268j0627k356J3058o342r301R455
1650A275K896j0069M470Q709j0167m066J0486k21j1527Q632O718j0915J326R731
1664G278n814q619J0368J601j0545L590R177q899l677J1044j985r674P148N554
1678F547j0555l41J2439p497q357J1405J650j2495N502R190j1686l066J3298l598
1692B436j1043J0750M086j1839J702J1297p363p733J2683k46j1811O320Q790j2218
1706d189j061J2366m710r083R896M359j2212K862J0914q302p169J2394Q35j4601
$$ plain form
1606 3335 4756 -5177 -1020 5707 -2678 -4409 4589 964 -5397 2152 4821 -4090 -2734 5552 -87
1621 -87 -6640 4189 4266 -6169 -615 6523 -2597 -4786 4913 2507 -6469 1851 5138 -5336 -2748
1636 -2748 6400 -1062 -6775 4710 4258 -5348 120 7388 -3239 -5595 7463 1121 -8180 1275
1650 1275 4171 -5898 -1428 7281 -2886 -6952 3534 3313 -8214 418 7136 -3779 -2453 7278
1664 7278 1464 -7155 3213 4814 -5731 -2141 7036 -1863 -5540 5504 3519 -6155 993 6547
1678 6547 -4008 -4349 8090 593 -7764 3641 5291 -7204 -1702 7488 -4198 -7264 6034 2436
1692 2436 -8607 2143 6229 -5610 -3908 7389 26 -7707 4976 4730 -7081 -761 8029 -4189
1706 -4189 -5250 7116 2406 -6677 3219 7578 -4634 -1772 9142 840 -6329 6065 6900 -7701
1720g701Q106O839j1574o32J1551n536j0362J2250M073j4034M623J2239j1487
1733a645n339J3344k637j2153Q200P910j3563o63J4248p306r730J3187K943j5681
1747h885P278R544r913m738J3389k639j1884R865N774j3191M94J3013q057r579
1761i529J4011P59j3247N144J2238j3149l276J4033m198j0824R402N745j3602
1774f493J764J2628p732r653J3367K357j5001O839J0537j2005k825J3696m446
1787C033j1289J2165M041j3333J983J2480j0126q371J6208j928j3419R899P110
1800H453j1943j644J3597n595j1742J2916L528j5044N047J1355j1526m753J3381
1813F030j555j3988R074Q032j3074p80J4644p299r683J3531J423j3041M290J1751
$$ plain form
1720 -7701 405 7244 -4330 -4962 6589 1053 -9309 2941 7014 -7020 -2397 9842 -1645
1733 -1645 -6984 6360 3723 -8430 -230 7680 -5883 -6546 7702 396 -9334 3853 6796 -8885
1747 -8885 -1607 7937 -1976 -6714 6675 4036 -7848 2017 7791 -5400 -4906 8107 50 -9529
1761 -9529 4482 5241 -8006 -2862 9376 -3773 -7049 6984 2786 -8038 1364 7109 -6493
1774 -6493 -4729 7899 167 -9486 3881 6238 -8763 -1924 8613 -3392 -6217 7479 3033
1787 3033 -8256 3909 7950 -5383 -3400 9080 -1046 -9417 6791 4863 -8556 1343 8453
1800 8453 -3490 -5134 8463 2868 -8874 4042 7570 -7474 -2427 8928 -2598 -7351 6030
1813 6030 4475 -9513 -439 7593 -5481 -6261 8383 1084 -8599 4932 6355 -6686 -2396 9355
1827I355r513o860J3137j235j4272J0364O755j3120J412J3148q391p994J3300
1840F086J267j4872O167J1730j3440l506J3634m936j1282J1524L967j2627J671
1853d617J2726q944q297J4376K07j3378P083R770j2269l596J5087n946j0896J1069
1867B375M441j3437K327J3216j0331o215J3538q78j2010O892Q888j2579r65J2647
1881G909o905q782J1672K410j3265L815J1403j0963o036J5186k432j3497R756
1894B71P809j2898j01J3464q455p994J1283K567j3550N395J0416j1433l861J3167
1908F080l425j2136J0835O131j2273O41J2472p997p593J2054Q98j2774N796R882
1922H591j1217l485J3510n266j0110J0139N703j3157K177J1553r209o413J2529
$$ plain form
1827 9355 -158 -7018 6119 4884 -9388 976 7731 -5389 -3977 9171 780 -7214 6086
1840 6086 7353 -7519 -1352 10378 -3062 -6568 7066 2130 -9152 2372 6339 -6288 -4617
1853 -4617 8109 -835 -9132 5244 5451 -7927 -844 8926 -3343 -6939 8148 2202 -8694 2375
1867 2375 6816 -6621 -4294 8922 -1409 -7624 5914 5036 -6974 -82 8806 -3773 -4738 7909
1881 7909 1004 -7778 3894 6304 -6961 -3146 8257 -2706 -8742 6444 4012 -9485 271
1894 271 8080 -4818 -4919 8545 90 -7904 3379 5946 -7604 -2209 8207 -3226 -7087 6080
1908 6080 2655 -9481 1354 7485 -4788 -4147 8325 328 -7265 4789 5687 -7087 -1291 8591
1922 8591 -2626 -6111 7399 2133 -7977 2162 7865 -5292 -3115 8438 -771 -7184 5345
1935E345p18j1476P022Q190j2211j910J2925m550j0630J0753L850j2481L310R707
1949G126r300m412J2136j995j0840P451P160j2322j013J2803n659q634R842L754
1963F097j2773M171R856r603m246J1346j412j0802Q596M549j0352M51J0657n533
1977A002q164R477L190j1437L396R022j0005l825J2179l262p976O888N591j0748
1991d672K2J0646o040o539J0802J077j1737N240P655q556l473J1654m427r255
2005g603R319M225j1388K977R037p100n041R247K75j0336M524P803q058k293J0506
2020F094o080o385O950N080j1179K870R753p333n044R464j56j0004O590M815q388
2035b953J08Q826m554p538Q143K357r378L167P400p101m445R896j155q428O470
$$ plain form
1935 5345 4627 -6849 173 8363 -3848 -5758 7167 2617 -8013 2740 6590 -5891 -2581 7126
1949 7126 -2174 -6586 5550 3555 -7285 166 7326 -4996 -6009 6794 1135 -7499 2343 6097
1963 6097 -6676 -2505 7351 -2252 -6498 4848 3436 -7366 1230 5779 -4573 -4122 6535 1002
1977 1002 -7162 2315 5505 -5932 -2536 6486 -3519 -7344 4835 1573 -6403 485 6076 -4672
1991 -4672 -4650 5996 -44 -6583 4219 5296 -6441 -1201 6454 -2102 -5575 6079 1652 -7603
2005 -7603 1716 5941 -5447 -2470 6567 -533 -5574 3673 3948 -6388 -1864 5939 -2119 -4412 6094
2020 6094 14 -6371 579 5659 -5520 -2650 7103 -230 -5274 4190 4034 -5970 620 5435 -2953
2035 -2953 -2845 5981 1427 -6111 2032 4389 -4989 -1822 5578 -1523 -5968 3928 2773 -5655 815
2050H15N495r035K4P771n316n864Q576J176q811L936O298q041o10P585j615p945
2066e561P142K627p716R12P051m425n032P674J611q982K764P166p644j221O930
2081C296k441o165N551L257o139J63P497m677n212P711n02o921L671N271o738
2096b378o9O083k411o287O995J919q167J837O845o272k358P517j371n138L239
2111a6N181q186q6P492k809n987O796N61n911K318M896m559l499O968k73o246
2127c360M178L186o682k26O742m473k843N305M90m948J214N786n917j702O868
2142C618k121n690M964J093m386J842M375l542m124O400P23p005L873L470m650
2157a160j017N502j700m432L653J920m860Q39M537l260k552N080k192l884K296
$$ plain form
2050 815 6310 -2725 -2701 5070 -246 -6110 2466 3642 -5169 -1233 5065 -2976 -3586 3999 2384 -5561
2066 -5561 1581 4208 -3508 -2596 4455 30 -5002 2672 4283 -4699 -1935 5231 -2413 -3634 3296
2081 3296 855 -5310 241 3498 -2641 -2478 5019 342 -4870 2841 2339 -4582 -911 4360 -2378
2096 -2378 -2447 3636 1225 -5062 1933 3852 -4315 -2478 4367 -1905 -4263 3254 1883 -3255 -16
2111 -16 5165 -3021 -3107 4385 1576 -4411 2385 2946 -2965 -647 4249 -310 -3809 3159 2886 -3360
2127 -3360 818 4004 -2678 -2904 3838 -635 -3478 1827 2317 -2631 -1417 4369 -1548 -3250 3618
2142 3618 1497 -4193 771 1864 -2522 -680 3695 153 -3971 2429 3152 -3853 20 3490 -1160
2157 -1160 -2177 3325 1625 -2807 846 2766 -2094 -1255 3282 22 -2530 2550 358 -3526 -1230
2172a230L834n214L00N069l159l458M559J779o343K828K682k550j192K618J229
2187A752m731L032K088l085j041L424q99k520L863J58l802J851K739l164j663
2202a998L732l49m895M617J236l967J008L805k410l092L957O63m926K282L180
2217B843l737r04M216j484k180K227M72k900P69L441l218j249L468o08k275J274
2233A55J991l411K28J983K70l072L134J003m668K146K271j990r59K214q04l004
2249b513K366K264l472m12L873k774k142L656L39l128J001K555j905j042J471
2264A37J51k615K251J446k077m96K227m6j280P57M68j925L44J239q65j306K194
2281F04j450M84J186M27j807j444L884j885j558J608J772l147M69J830k252K5
$$ plain form
2172 -1230 2604 -2610 -2310 2759 -400 -3858 701 2480 -3863 -1035 1647 -903 -2095 523 1752
2187 1752 -2979 53 2141 -944 -1985 1439 540 -1980 1883 2041 -1761 90 2829 -335 -1998
2202 -1998 1734 1385 -3510 1107 2343 -1624 -616 3189 779 -2313 1644 2307 -2619 -337 2843
2217 2843 -894 -1798 2418 934 -1246 981 1453 -1447 -678 2763 -455 -1704 1764 1156 -1119 155
2233 155 2146 -1265 -1037 946 1216 -1856 1278 2281 -2387 -241 2030 40 -919 1295 491 -2513
2249 -2513 -147 2117 -1355 -1767 2106 -668 -2810 846 1185 -1943 -942 1613 -292 -1334 137
2264 137 288 -2327 -76 1370 -707 -1203 1024 978 -302 455 923 -1002 -658 581 -284 -1590 604
2281 604 -846 -362 824 1251 -556 -2000 1884 -1 -1559 49 1821 -1326 -857 973 -1279 -1254
2297a254J962o93o90N05J945m008J677J835j794q58K116O0j356M29J324j967J35
2314f32K120j216q71J064L0j156K92J519j158j15P21l23j415P25K732l863n98
2331b144K627Q6j372J222n89j415R85J373j412p83J875K01k360J910M65n28j179
2348a038J650n34j056P71K66m54K95M31r19M71J556q60j445J336J17j379J133
2365C41J96q76M24K85N1p96l8O97q02r7J72n77O53J579j675Q57p41Q71m66Q4N57
2386F99o77j743R99J671q05M00q84l90J764q14j351J030K97J066j275q91J646
2403G42M62j309L21m37M68j143J120mm4L80n83%L15k46Q62j238Q26m92k43N29
2423B86L35m95K02n91L66j334J701m52m78J60o7N51r09N78j4j17Q79j21r93k27
$$ plain form
2297 -1254 708 15 -675 -170 1775 -2233 -556 1279 -515 -1373 743 803 -553 -124 1200 -767 -632
2314 -632 1488 272 -599 465 495 -661 -369 1150 -8 -123 598 275 -1140 -415 2317 -1546 -2144
2331 -2144 483 569 -803 419 -170 -1585 -600 773 -639 -1422 453 654 -1706 204 669 141 -1038
2348 -1038 612 78 -978 -207 59 -395 -100 331 -588 -117 1439 579 -866 470 587 -792 341
2365 341 537 -339 85 370 421 -375 -413 284 -518 -615 -443 -1020 -367 1212 -463 394 -347 524 58 142 699
2386 699 22 -1721 -722 949 144 544 -340 -730 1034 220 -1131 -101 196 1262 -13 -904 742
2403 742 1204 -105 216 -221 247 -896 224 220 176 556 -27 -27 288 42 904 -334 492 0 -243 286
2423 286 621 126 328 -263 103 -1231 470 18 -460 -300 -367 184 -725 -147 -161 -278 601 480 -513 -740
2443g40R90l35k4N86l73N1q98J221j214J064K02p41M10m13M06k9O06j030j26N81
2463A94k18l26K07P15j295P20M24N24j828L93l83P27Q33q18M33l65J5j61r49L25
2483h33R08o97n21R05M73O73l92n73k76j32R28q02k91R86m10o5k18J585j500Q74
2503F22m39m26J33N57m90N97o72O88J88j572Q80O85j041J72P07m32L05r1k07p8
2523H6j05J26J40j81K08j055O41n72K19L28K24o84J34l13K17J316j332K52K3m67
2543g95P0M09L95k29J332q69N57j634J002R99j840J220l55K42l61m98p87J400
2561B58K68j840J983j099O99O07m53q71rk6K8O08M89p85P25j008o99K181j300
2580b44o83J127l87L32P1P2m47J48Q27p96J059j193P89l08N80m80l33l42R1M52
$$ plain form
2443 -740 250 -85 -109 477 104 155 -743 478 -736 328 530 -211 199 -214 192 163 769 -261 -387 194
2463 194 -24 -350 -143 572 -723 -3 421 945 -883 -490 -873 -146 687 -131 302 -63 -48 -209 -1158 -833
2483 -833 75 -622 -1143 -238 235 908 516 -57 -333 -465 463 -339 -630 356 -54 -119 -337 1248 -252 622
2503 622 183 -243 -110 447 -43 554 -118 570 758 -814 66 751 -290 -118 589 157 462 371 164 86
2523 86 -19 107 247 66 274 -781 -140 -712 -493 -165 59 -625 -491 -804 -587 729 -603 -351 -328 -795
2543 -795 -725 -316 79 -150 1182 313 870 -764 238 1237 -603 617 262 504 143 -355 -1142 258
2561 258 526 -1314 669 -430 269 876 423 -448 -457 -483 -455 153 642 -143 582 -426 -1125 1056 -244
2580 -244 -927 200 -187 145 216 288 -159 -11 816 20 1079 -114 675 367 947 467 134 -208 -117 335
2600C35M77k38k038J949l85q73J362j171J72N72j182N47J698j411j61r6R92n80
2618c1J551o98q25K74n53N99m42R26j051o00R81j433N62J153K61n60q83P51J301
2637A283k484J189K63k78l95J14J30J013J36o56j403J314k52L00q90O07Q04p35
2655F0q11J006Q4r7k24J00j048P80j30j02P3j4P00n95J56m09M39k51L40m84j82
2676f09L47L61l71J87J304n37j110P08O5j92m90O70k45n80K3M02L05M4j14r5m82
2697d09K2M99n61L1Q48j613M45J211q54l91P03m93p51R11J69r5O55o85L96N83
2717F21k96m55P87o23P21j520Q79K46J72q72J60O96J22L11p27K10n11K33N71j407
2737f82Q03M33N98j305L07n30Q49k06j27N91j346L39N42M28j859J852q22O91j032
$$ plain form
2600 335 812 574 -1464 485 100 -773 589 -582 -410 162 -1020 -473 1225 -186 -347 -443 549 -31
2618 -31 1520 822 -3 271 -282 317 -125 801 -250 -850 131 -1302 -740 413 674 114 -769 -18 1283
2637 1283 -1201 -12 251 -27 -422 -308 -178 835 971 315 -1088 226 -26 274 -616 -9 795 60
2655 60 -751 255 339 242 18 118 -930 -150 -280 -382 -309 -323 377 -218 -62 -471 -32 -283 57 -427 -609
2676 -609 -262 99 -272 -85 1219 682 -428 280 345 153 -337 333 88 -492 -469 -67 238 282 168 73 -409
2697 -409 -387 112 -449 -418 430 -1183 -738 473 -381 -772 -69 -562 -1313 -402 -233 -328 327 -358 38 621
2717 621 325 -130 657 34 755 -765 114 360 532 -340 -180 516 638 949 222 432 -79 154 725 -682
2737 -682 121 554 1152 -153 154 -376 473 267 140 731 -615 -276 266 694 -1165 687 -135 556 -476
2756d76N73k15n67J000n8m42N93o82N93L89j624P28K41n95J183p64K35j8o57J469
2776I06k96j146R86J38m44L9m81J159p95Q2o66L75m22O70oQ09p07l61K53K96k93
2797I6m23P19N6l32K76m74M45p85K42N25j394M63R14K23m16l57J13K07N84m25
2817B57k52O06n58N3k83L42k54j57O92o10K04r25J101O7Q05q16q21J085r06R04
2837E34p67Q92q51L47j065O4J091M43n51k90j54m70J2L08P62M12o31o05j094J510
2857a03o52L63m7J64R07m79j61k21J16m22Q52l84K71p05Q2m80J577r85p12P31
2877b88K73p5L80j50O09p38K77j63l2q06Q29J53j55O91k17n68l34N42j00L4j078
2898i16P19J00K86n80N36j44o6q6L09M8m56l98K05L98K94j014lK78J54K80P24
$$ plain form
2756 -476 97 -118 -685 315 257 -185 408 -274 319 708 -916 -188 53 -542 641 -123 112 94 -563 906
2776 906 610 -536 450 588 144 183 -298 861 66 148 -518 -143 -565 105 99 908 201 -160 93 389 96
2797 96 -327 392 448 116 392 -82 363 -422 -180 345 -1049 -586 328 551 135 -222 -109 98 682 257
2817 257 5 611 53 106 -177 165 -89 -246 446 -164 40 -885 216 283 1088 272 -549 536 -370 534
2837 534 -233 659 -192 155 -910 -846 245 688 137 -153 -307 -777 -765 -457 305 717 86 -519 -1613 -103
2857 -103 -755 -392 -439 -275 632 153 -8 -229 -113 -535 317 -67 204 -501 -419 -899 678 -307 -1019 -288
2877 -288 -15 -90 290 140 749 11 288 125 93 -713 116 269 114 805 588 20 -314 228 128 162 -916
2898 -916 -197 -97 189 -391 145 1 -65 -151 158 206 -250 -648 -443 -45 249 -765 -768 -490 -336 -56 668
2919F68n76K0n99J41k7J124k98j055O54m72O29q65K89L97L10n23O31J10l32O8
2939B94o29N3O92p38M56J056k394J111J20J88L8L25l95m23O62m8L28o16j084J084
2959H0Q7k96J084j127R02j114L20l42l02K23J146j396Q51N05n59j85r71J870o26
2978A50Rq50R25k73m50P59M18n65M22o01J15N12r98J754l09j211L07m52j76l25
2998h39L63P29k29k46K41l90J401j328l47O39l83J565o47j289J769l51l77j505
3016a224M18J175r61K49J38M70J5p78L70L0M40k55l95M60O0l0N25L5q86MN0L61
3038B71l03R26p89k00n85L69P70l34j8o33J130O3m3j216O96n36l9j56L91O33j020
3059f23P1M24M7r5j06K02j52m32J347n32p55R3m8L59k18M13O10J67K22j156o2
$$ plain form
2919 668 92 112 -487 -346 -373 751 453 -602 52 -420 209 -656 -367 30 340 -183 448 558 226 294
2939 294 -335 -282 410 -328 128 1184 -1210 -99 21 209 247 572 177 -246 416 368 696 80 -1004 80
2959 80 167 -129 955 -172 730 -384 -64 -406 -708 -485 661 -735 116 621 62 -123 -1094 776 150
2978 150 159 -691 234 -39 -489 270 688 123 545 -56 59 571 -427 1327 1018 -193 114 -338 -514 -839
2998 -839 -476 253 24 -222 19 -371 1030 -298 -645 -6 -389 1176 529 -760 1009 658 281 -1224
3016 -1224 -806 369 -592 -343 -205 265 280 -498 -128 -98 342 87 -308 152 212 182 707 742 -144 -140 -90 271
3038 271 -32 894 105 -95 -680 -311 459 125 107 -526 604 667 624 -592 104 -432 -471 -627 -236 397 -623
3059 -623 -552 -128 -81 -176 -282 -80 -232 -664 683 151 -604 -511 -559 -200 -418 -5 605 772 994 -162 -224
3080b24j03J363m31o86n84P27j66j80M87n41P39l37O07l38O27q16l39P67m65J02
3100B09j140N71R3k26J435j28q07K19k98k48L76j06l85P81j85k20Q20j420J388
3119G29q72l85J109o18J09k0l81J23N03o31J009m45q7N47j252N62J187k172K92
3138f93M78J21l82J29L47N82j338J080p87j60J272j087P90l83O86O82m66j062
3156a91j93K90Q47K47q89j26L80o86R99r27N29k61k93N28j44l90P98m97K65k52
3176C4k82J36j51O25j018j03J328j172N77K13j98n93M50P4N69O55j305l49J44
3195c66L28Q81j543mR57k72m29K49M74M41p22K14k42p25J345J83j409n48M29K69
3215d90J042o91O49k08J239j462j456J674n38L26o21K281k430P84J30M96m65o20
$$ plain form
3080 -224 -327 1036 605 -81 -665 62 -104 -284 203 -338 401 64 671 333 960 144 -195 572 107 209
3100 209 -931 -360 -267 -493 942 814 7 226 -72 -320 56 -50 -435 346 161 -59 761 -659 729
3119 729 -143 -528 581 -37 72 52 -329 -206 297 -334 675 230 143 690 -562 0 1187 -985 -693
3138 -693 -215 -94 -476 -347 0 582 -756 324 -463 -623 649 -438 352 -31 655 1337 871 -191
3156 -191 -384 -94 753 1000 111 -15 365 -321 678 -249 280 19 -274 254 110 -280 518 21 286 34
3176 34 -248 -112 -263 362 -656 -759 569 -603 -26 187 -11 -604 -154 -80 489 1144 -161 -510 -366
3195 -366 -38 843 -700 -704 253 -19 -448 -199 275 716 -6 208 -34 -759 586 769 -640 -1188 -759 -490
3215 -490 552 -139 510 302 1541 79 -1377 297 -241 85 -536 1745 -685 99 229 725 260 -360
3233c60J371q07k57Q65r0J36O52j704L00p85O67O57p47p12J604j095J4J121j374
3252e44R8P20q15l64J129n62P07pP22m98j117N7J533p59j98J15n36Q35L41J99
3272A056j728J48J529q36o40J314q87N33l42p4m70K82N77L71j057L12K09r23N78
3291d8l60Q21o77K80M65p28J221p18J94k76L00o78m72J533j061J07p1O07m03l72
3311c36J054j142M11M65p42K01P81l78j05k56J77M6q54J099p13L63l60L66L09
3330C86k049J340J459j950J490k1p99M2j7L09l59L66J28r3j68n9J07p59M71N43
3350C67r66R65N3m44o87L47O8J16K19L18j414J502n5j131l5M68K87j099J767j050
3370d04j56J01J308j528Q23M73m77j21p6J122j005L15M55m85k63K94J055j329
$$ plain form
3233 -360 1011 204 -53 812 722 858 1510 -194 106 -679 -12 645 -102 -814 790 -305 -291 830 -544
3252 -544 -446 274 -541 -905 224 -338 369 362 1084 586 -531 -474 1059 300 102 217 -319 516 857 1056
3272 1056 -672 -524 1005 169 -471 843 -44 489 147 73 -397 -115 462 833 -224 88 297 -626 -48
3291 -48 -408 413 -264 16 481 -247 974 256 450 174 474 -204 -676 857 -204 -97 -168 439 36 -336
3311 -336 718 -424 -13 452 -290 -89 692 314 209 -47 130 176 -678 421 -292 71 -289 77 386
3330 386 -1663 -323 1136 -814 676 655 -144 -102 -119 190 -169 197 325 232 64 5 112 -647 -176 367
3350 367 -599 366 419 -25 -712 -365 -297 -181 38 356 -1058 444 389 -742 -777 -309 -22 -1121 646 -404
3370 -404 -560 -459 849 -679 144 617 140 19 -57 1065 60 375 830 345 82 376 1431 102
3388A02m08J469j350J14L30q14j77N48P80q45N30p7K82r35J025m4j703K52J332
3407D11j145J128j101N48n59N55J319j310m47M05O08p16P57J02r09n17J653l24
3425D58j50K58q67j38L62P36k44L25l46m90j129J262J50m41Q86P43j270j578K246
3444G73n65l47L80M27j73l74Q38j540m09O82O18j99o01J559j647l19J113K97k68
3463B45k03O04j631O43L72p63K27J887j124p35L97Q82j132q76K594j318o36M83
3481h4P69p79n74N67j2q71N68O07o93M0M95n54l79N96J49j48P09K36j476J011
3501A77L08n37j62J321r87q31R18K35j145N85J507o36k91J34M48j531J42J364
3519A019r48J88n65K10J94J04J283k456Q0J177K74q81Q34l41n32k00J223j57j000
$$ plain form
3388 102 -306 1163 -187 -73 257 -557 -734 -186 594 -251 279 202 484 -451 574 530 -1173 -921 411
3407 411 -734 394 -707 -159 -718 -163 1156 -154 -601 -196 412 -304 453 555 -354 -871 782 458
3425 458 308 566 -301 -439 -77 659 415 740 394 -96 -1225 37 187 -254 632 1375 105 -1473 773
3444 773 208 -139 241 668 495 121 959 -581 -990 -308 310 111 -490 1069 -578 -897 216 513 245
3463 245 42 646 -985 -342 30 -733 -506 1381 257 -478 -81 801 -331 -1207 1387 69 -567 -84
3481 -84 685 -94 -668 -101 -113 -984 -416 191 -502 -462 33 -521 -900 -304 -155 -303 406 642 -834 177
3501 177 485 -52 -214 1107 120 -711 207 442 -703 -118 1389 753 462 596 1044 -487 -345 1019
3519 1019 71 259 -306 -96 98 202 1485 -971 -891 286 560 -321 513 172 -360 -560 663 506 -494
3538d94n64J07M71J462L05k893Q60J596q61o70j52K150j969N89Q45j194p70R67
3556b15L76n90M13m38M10o46Q92n48p46K553q78j710K071m47j36l75J10k84q76
3575a064J939q34j082L39J316j159n7J833j472p12K11J990j053m62J155K09j570
3592d73J469j48k063J085J759j403n04P50J26j005O56j077j8J081J241j011j175
3609g10K055p66j437J285nk702J768J340k50j939J560J323k243J10J101j125o12
3626a247J473m87q16J494N66J27j695n1J105p7p13R78j378J88Q01j631Q59L67
3644a37N89j149J211j31m06o27J078p48p39J455M94j049n70K338j529q60P43r10
3662i47R39j29M86j73p84J474j475l10J527k18p33j9J588j442r4J384q99p90J65
$$ plain form
3538 -494 -1058 -951 -480 982 1287 -1606 -746 850 -11 -681 -833 1317 -652 -63 782 -412 -1182 -215
3556 -215 161 -429 -16 -454 -44 -690 202 -346 -1092 1461 583 -1127 944 497 361 -14 96 -188 -1064
3575 -1064 875 41 -1041 -702 614 -545 -602 1231 -241 -953 -742 1248 195 -267 888 1097 -473
3592 -473 996 848 -1215 -130 1629 226 -278 472 598 -407 249 -828 -846 235 1476 465 -710
3609 -710 1345 579 -858 427 422 -2280 -512 828 578 -1361 199 1522 -721 -611 490 -635 -1247
3626 -1247 226 -261 -1077 417 983 1110 -585 -636 469 392 -321 657 -721 -533 268 -1363 -504 -137
3644 -137 452 -697 514 383 -23 -650 428 -320 -1059 396 890 -159 -729 1609 80 -780 -37 -947
3662 -947 -8 -137 349 176 -608 866 -609 -919 608 390 -343 -362 1226 -216 -310 1074 175 -615 -450
3681d50J465k054j98J596M87j260P19J97j521J036O24m47o00P91m1m81M35o87
3699c89k97M95N80l45q50O04M17j605J379N38j414J94J928k59k049J057L20j120
3717h16P85k89N27j033J082p74n77O1J444r77q90J829m70j05J403k00j690O54
3735c6j47k1j173K121j021n51K050j84j988J907l07p22p35J809k93j880J537n95
3753b29P2m03J730j649O36l59J75k12r27K313j065p37J006L28p23k68J102n63
3771B27k87J749j693r50J220n16j248O50K419j585m30R95n62p64P38l45j49N40
3789IQ19j493J27J175J85R9l46K24j092k88J967j831N98o23L04ko99K302j623
3808a88j66Q46m15r06K91Q62j088M74p0J68k23O72K57r58j024J726o7r95J330
$$ plain form
3681 -450 1015 -1039 -1237 359 846 -414 305 502 -1019 17 641 194 -406 385 344 -137 298 -389
3699 -389 -686 -191 389 44 -806 -202 215 -1390 -11 527 -887 -693 1235 976 -1073 -16 304 -816
3717 -816 -31 -320 207 -826 256 -518 -1095 -1034 410 -567 -1457 372 -98 -203 1200 1000 -690 -36
3735 -36 -183 -204 -1377 744 -277 -828 1222 1038 -950 957 650 -72 -807 1002 709 -1171 366 -229
3753 -229 -157 -560 1170 -479 157 -202 -27 -239 -1166 1147 82 -655 351 679 -44 -312 790 227
3771 227 -60 1689 -4 -954 266 -250 -1498 -848 1571 -14 -444 551 -11 -775 -37 -382 -531 9
3789 9 828 -665 -538 637 822 921 575 799 -293 -581 1386 -445 153 -470 -166 -168 -867 1435 -188
3808 -188 -354 492 77 -829 -538 324 -764 -290 -360 -192 -415 257 514 -444 -1468 258 191 -804 526
3827E26k19j724O09J251J8n08J027q02j51P04o74m11K9P85r2q35O28N07o22K89
3847C35k5l33l52J116m62q31K97L69p05K94O71M94l31j039N77l50P18j45n83J405
3867A120o16o42J429n83j211N7Q01j32N00q58q44K194k069J307m54m52N00J42
3885A89L84q28J87P0q42J163N8o82K2R8J050j737J369n6p62k21P81m9k5n8K7l98
3907b60J10j04l21M0qO78j354J364j48q85P31N6O92j427Q54N55r07j13N12l69
3927c04R01m95Q75k231K131o84o01N35J64l24l08L45J01m24M61O0P0j094J231
3946D09n39k85K43J97o48N18O40j263J018m66l54P39J6l37k81J6M35J49r73n4
3966h20J363l19K7L51j020J82J361p92J07r91J034j178O97J074j069l81K67J069
$$ plain form
3827 526 307 -1417 -808 443 461 -47 980 178 27 731 57 -354 -325 460 368 -467 161 668 46 335
3847 335 310 -23 -375 741 279 -552 -255 114 -591 -297 374 868 537 -502 75 -275 443 298 -285 1120
3867 1120 504 -138 1291 708 -503 -446 355 223 723 -135 -979 1215 -854 453 -1 -453 47 189
3885 189 573 -255 -68 2 -840 323 381 -301 -279 -181 869 -868 501 445 -317 -538 243 194 169 111 138 -260
3907 -260 -150 -254 -575 -535 -543 135 -1219 145 -3 -888 -157 -101 591 -836 18 573 -334 -447 65 -304
3927 -304 597 102 977 -1254 877 193 -408 127 291 -33 -341 4 105 -319 142 202 272 -822 409
3946 409 -130 -415 -172 25 -623 -105 535 -728 290 -176 -530 209 225 -112 -393 -377 58 207 -766 -820
3966 -820 543 224 251 602 -418 -236 1125 333 440 -551 483 -695 2 1076 7 -374 -107 962
3984I62j687J229j165P6M16J72M33j58P54o64j68L66N89m70m23M31K47j048O41
4003E33J26N47j744R63Q15n84p60N72j16l04J75m68L92l03P57j439L30J215m44
4022B63m12L39k13J18P25j35j105n9R45j358K66J147k23K07m04M50j75p77J277
4041H76r19M38P9r04P1Q2n38J304o27K36K32m56M70J1n51jK02K19m29K8J267j219
4063a29m45J355j422L47N86K6n41L74L33j131L50N55n8O8l87J051j557J261m63
4082A73k14K5O98k93n25j62Q18p09M65O18j586P23N43J34j82K84k22j8l40L62
4102E92p41r7P21K33n04J99l66J49J26K05m25j83P40j126J04k1l51N98j3p73J772
4123H39J25j676L18o76J055j208N29N53O86k61Q47n97o78N48J66j458R76o94m52
$$ plain form
3984 962 -725 504 -661 -585 -169 3 436 278 1032 368 200 566 1155 685 262 693 940 -108 533
4003 533 659 1206 -538 425 1240 656 -104 468 352 48 223 -245 147 -156 601 -838 -508 707 263
4022 263 -149 190 -23 95 820 685 -420 -479 466 -892 -626 521 298 505 101 551 376 -401 876
4041 876 -43 395 474 -430 -359 -277 -815 489 -138 98 330 -126 344 355 -196 -197 5 224 -205 -177 1090 -129
4063 -129 -574 781 -641 -294 292 318 -223 151 484 -647 -297 258 200 268 -119 932 -625 636 173
4082 173 -41 -16 682 389 -136 -298 520 -189 276 894 -692 31 574 708 526 810 588 570 230 592
4102 592 -149 -246 475 708 204 403 37 186 312 517 92 -91 649 -477 -373 -394 -745 -147 -160 -933 839
4123 839 964 -712 -394 -1070 -15 -1223 -694 -141 545 284 1131 534 -144 404 570 -888 88 -606 -1058
4142a058J548l58p87o75O22L18n79J122p35J446n26K08l06k91qP31p98L33r07
4161g00J65N43o34l6J688o05q55p62L51L54J634k111Q89j27K89K46q30n66K207
4180A140p19j023k37J967l95o34L74q11Q26n95p90n3J127p20J15p72J935n50j16
4199F9M85n29L85j280J50J243k23k88N49r14N25n20J92L72L81j025M03Q87n42
4218C20k31m81l25Q96M02j537J58J550n02O08q88M33K14o2j051l03J139o99k12
4237e71n5J187r74O12j464K040n45J6m60J041m88J87p67O18q28L88p42R44K41
4256C80k27O16m69L49j285m05k38R39K45r13N46J47L60q34M63j52P14r6l74M76
4276B42k32J524k038L63N31o25j30n80J487p97j56R01p61o40P29K34j23N28j28
$$ plain form
4142 -1058 490 132 -655 -1330 -708 -390 -969 153 -582 864 338 546 240 -51 -59 672 -126 207 -700
4161 -700 -535 8 -626 -662 1026 421 -434 -1196 -845 -491 1143 -968 -79 -206 83 329 -501 -1067 1140
4180 1140 421 -602 -839 1128 733 99 473 -338 488 -107 -897 -950 177 -543 -428 -1200 735 185 69
4199 69 554 25 410 -870 -720 523 300 12 561 -353 172 -348 -156 216 597 -428 -25 862 320
4218 320 89 -392 -717 179 581 -956 -798 752 250 858 -30 403 617 555 -496 -799 340 -359 -571
4237 -571 -626 561 -413 199 -1265 775 230 246 -214 827 339 526 -241 377 -451 -63 -805 139 380
4256 380 153 769 300 649 -636 -1041 -1279 -340 -95 -1008 -462 -315 45 -789 -326 -478 236 140 -234 242
4276 242 10 1534 -504 -141 390 -235 -365 -945 542 -255 -411 490 -271 -911 -182 52 -71 457 329
4295C29j97O00k92k94o01N73n8O17o10j108O96k19J03P26j72o68N76p01K45J297
4315H42k94p38L38K32J5n85P64o36k73P8J112j283Q14n7O20o62J38q12R46m55
4335A04p56J123N44j063p0M46r67O15J08p02m66J169j182P18L2K35r99J137J91
4354B17m0l46N51j177R95k38n48J001l41m51J77K65P06q16r2j08J150n84J0l64
4374c3p4j13J868j593O52l9q02M31n80r05R35N25l48K22j17N3N19p70l71J06L11
4395a23m01O09L15q91R80n64J37l28O26n62J5P24n5n58J22m22J28J83Q75m69n23
4416a82L23J013p70j065R02L31j262M14N97j079J094q92P19o20K74R24j693P43
4434b29J37k81k81P08K8j00L92k88L91l48J79r35R27l41p00R21n94J074j245J245
$$ plain form
4295 329 132 732 440 146 -455 118 60 677 67 -1041 -345 -564 -461 265 93 -575 1 -700 -455 842
4315 842 548 -190 148 380 395 -190 574 -62 -335 -257 855 -428 386 329 949 287 425 -387 559 104
4335 104 -652 471 1015 -48 -118 328 -639 -24 84 -618 -1084 85 -1097 -379 -347 -112 -1111 26 217
4354 217 177 -169 382 -795 200 -38 -586 415 74 -377 -200 65 771 -45 -137 -245 905 321 331 -33
4374 -33 -107 -220 1648 55 707 668 -134 297 -283 -1188 -253 272 -76 146 29 82 601 -169 -540 -434 -123
4395 -123 -524 85 400 -491 489 -75 62 -266 360 -202 -187 537 482 -76 46 -376 -248 -65 810 341 -182
4416 -182 141 1154 384 -681 221 552 -710 -296 301 -778 316 -576 143 -477 -203 721 -972 -229
4434 -229 -92 -373 -654 54 82 -18 374 86 477 129 308 -627 300 -41 -741 180 -414 660 -585 660
4454F60m24j76o73l56L16P5j39P09Q88r75L32r07J003n29jJ225l06n82J46j519
4474a233J307k1r27J230j403P63j34J406j078o01J537l41m8n92j22l69L32k08
4492e02M49N17j154Q48r8%m41P99q40J037p39K10Ol09j92N69m9K70p02J006k84
4513D01m20j55O39l77N7Ql86L34n00M07P9o93L90J92L89o00l36k05k04K140j673
4534e13N62L69j140P09o51J717j210N31j197J04P53n14L50j51Q17l39L03j689
4552a189K020o69l50J179l04j79p27J610j970R22p12J32O71K14o41K30l67R64
4570H34m18m38P72n81m82Q0o53R47m58j79J354l21p76p10K030l72j379R12P59
4589I21p69n49L97j9M14p8k99k88j59J014m27j39P76m60l15J42l41j082J745L21
$$ plain form
4454 660 236 60 -613 -969 -653 -578 -717 -8 880 -95 237 -670 333 -196 -197 1028 722 140 286 -1233
4474 -1233 74 53 -874 356 -1047 -284 -418 988 -90 -691 846 505 457 -135 -257 -626 -294 -502
4492 -502 -53 464 -690 158 60 60 -381 418 -422 615 -124 86 92 -217 -409 160 111 381 -321 685 401
4513 401 -19 -174 465 88 145 153 -233 101 -399 8 87 -606 -216 -24 365 -235 -571 -776 -980 1160 -513
4534 -513 49 418 -722 -13 -664 1053 -157 374 -823 -719 34 -480 -130 -281 536 197 500 -1189
4552 -1189 831 162 -188 991 687 508 -219 1391 -579 343 -369 -237 434 648 7 237 -130 834
4570 834 416 -22 750 169 -313 -233 -886 61 -397 -576 778 457 -319 -1029 1001 629 -750 162 921
4589 921 152 -397 0 -19 395 317 18 -270 -429 585 158 19 795 335 20 162 -179 -1261 484 805
4609H05j090r04J239L51q68J063l32k28m25k35M08K85L52k93l04L9N43L93o12
4628A87p11m5M80j09O71m64KN44po73p50R20n72N22l41R65p39N04M43r14m16M10
4650i3nN44J81o73o93P70K92o1k35p29N73O3J54l84P78M06j374L22k56P4M19L61
4672D34n54l51O76J20j046L88Q72R98j203n61J061p88m95O3N48j93Q65r67L31
4691A98Q1N41j248O29q05J284o47k16P73j346J513p61K20o17J116J81j980J462
4709C78p58J97q1J30J093j223Q00K05n72K88m99N94j307J099l41m0k64N95l58
4728f4j92k18p1j06M50J080p73N69o80O22r0r38K19J40M85j223k84J203Q8l13
4748i6L20K85L17j576O99l08N64m07O6O99r18O65k41l36P03j20k82j46K21j25
$$ plain form
4609 805 -285 -1189 50 401 -467 596 264 36 -389 -624 -216 69 421 128 -176 -137 406 799 187
4628 187 -524 -569 -89 -198 473 9 11 555 548 -125 -875 45 -527 -5 -346 619 -120 384 827 -87 -503 -93
4650 -93 -98 446 627 -46 -739 31 323 262 27 -702 -129 -66 88 -296 482 888 -486 -164 -420 -346 73 434
4672 434 -120 -471 205 325 -721 -333 539 1537 334 -227 834 46 -449 -386 162 -31 834 -133 198
4691 198 279 820 -428 201 -604 680 33 -183 590 -756 757 -4 216 -401 715 896 -1084 378
4709 378 -380 -183 -264 -134 959 -264 536 741 169 457 -42 552 -755 344 3 -37 -301 294 -64
4728 -64 -256 -474 -545 -651 -201 879 106 675 -5 617 527 -411 -192 -52 433 -790 -1074 129 217 -96
4748 -96 224 509 826 -750 -51 -359 205 -202 -136 563 -355 310 69 -267 436 316 34 -112 109 -16
4768a6r4j23R22o79M74n83m47J432q51l20n32N91J088j141J096n64q8j64l58m10
4788g67J243n41N15m87m36R75o09m11L5j16J021j084J165J05n44K43m60q1L56
4807A22K41n53k12L99o24N95j32K72M18l19L87q83l93O17O72n68J11m17L91K1
4827A45q74J96L14N78j565Q41O39o02M06K11q79M96n59P09R62j239L97j09R07
4846I74m75j37N05j030L45j97k41O13j181J023p10N36k33M07P90j442l8P30j072
4865h33L86R67o4j194J062r01O03p74P76K99M52j77o93N45l61K72p24j14L08N29
4885C64n92O02p23O61j295J654k26l66M35j571Q72R43k013J169J61l50k15P04
4903B14l16K27j9L3J15q9M3o12k8O94M38n25k56m60p06J236J24q69J118l63L8
$$ plain form
4768 -16 -110 -233 689 10 484 -99 -546 886 35 -285 -817 -226 862 -279 817 253 165 1 -357 -767
4788 -767 476 -65 450 -37 -473 502 -107 -518 -483 -599 422 -662 503 608 64 307 -153 -234 122
4807 122 363 -190 -402 -3 -627 -32 -164 108 526 207 594 -289 -682 -65 607 39 150 -267 124 145
4827 145 -729 -533 -219 359 -1206 -365 274 -328 78 289 -590 -94 -653 56 1018 -221 176 67 974
4846 974 499 362 867 -163 182 -15 -256 357 -824 199 -511 25 -208 199 989 -453 -491 239 -833
4865 -833 -447 520 456 -738 324 -577 26 -748 28 327 779 602 -91 454 93 365 -359 -473 -165 364
4885 364 -228 374 -349 312 -983 671 445 79 514 -1057 -185 758 -1255 -86 75 -275 -490 214
4903 214 -102 125 106 139 254 165 208 -404 -432 262 700 175 -81 -541 -1247 -11 113 -756 362 -1 37
4924C7LN28o23Q5m59L02m05L60L27k05j83L49J88j149M86J091j39K14j97n55K72
4945C27j078Q2J120n20J97M14K99l29m57l57Q9J056n04m42p91M63N37m37K66L75
4965C10O91J49j607M26m4j42O99o99m77M94N70j787J765M36r86l8L01M11M3r58
4985d43L97l94P2R10o29Q73m61k81j311J326J61j440J832j217O18O29om09k49
5004b2N96L85L27o93j219N34j33o18J573r14O13n60m20L3Q8N27P44j133J17l82
5024e57Q65j126R14K60j41j053M72j85M74n48O47k82l86n5R53j191J223k7j013
5043g56P07l12l1l14J048p74N56p97J479j201J728j059L13j231N43P34R7j149
5061d19J38m0O85k30l50n04l48M69O21O69j020j47O72L07o6p56P80q61J045r87
$$ plain form
4924 37 40 568 -55 30 -429 -127 -532 -172 155 -50 -233 116 304 -845 -359 732 593 807 610 55 327
4945 327 -751 -669 451 -69 128 542 841 512 55 -302 -213 843 339 -103 -894 -431 106 -331 -65 310
4965 310 1001 1150 -457 -31 -75 -217 482 -217 -694 -200 370 -1417 348 784 -202 -240 61 472 515 -443
4985 -443 -46 -440 -368 542 -87 786 325 44 -1267 59 220 -1220 612 -605 13 642 636 227 -22
5004 -22 574 959 1286 593 -626 -92 -225 -843 730 -184 429 -131 -551 -518 -430 97 841 -292 -175 -557
5024 -557 308 -818 96 356 215 -838 -366 -551 -77 -625 22 -260 -646 -701 252 -939 284 257 -756
5043 -756 -49 -361 -392 -706 342 -432 124 -673 806 -395 1333 274 587 -644 -101 633 730 -419
5061 -419 -281 -321 364 134 -216 -720 -1068 -599 22 691 -329 -476 196 503 437 -319 461 -400 645 -342
5081c42J126K37o57r60K685j754n36K213j467j702J696p08p01Q03k51L85k3m56
5099d12k15J203m00M31p30n36l04J250p22J11O2J54N59q81K59M56k48l43K52M10
5119C56K94q5j079N77j59N65k23J2M37o88k20J45M50j035J210j228K92M77k11
5138a13L40j82r22K8J168j023Q49k38k87K48l23L13N3K53j8k17o74L07M40o94
5158f92O39P19m94K53p77J024o50N36p67P44J87q63k59Q20j29m47N38o3l74O35
5178E80n75j085J498Q4j21J26m41p45P62P8k52O38r55m76K6J041k98q49J273j61
5198A48R3j171J310m57Q55m29N91q80K69o72N21o65K26K81k2J47L97r30J111j495
5218g72Q39r5k28Q10j189L38m64n00J689l63j17O72p07j52K87o82O62l49L69l09
$$ plain form
5081 -342 784 1021 364 -596 2089 335 -201 2012 545 -1157 539 -169 -870 -67 -318 67 44 -412
5099 -412 -627 576 176 607 -123 -659 -963 287 -435 -324 -262 -108 451 -430 -171 285 37 -306 -54 356
5119 356 650 565 -514 63 -96 469 246 258 695 7 -213 -68 382 -653 557 -671 -379 98 -113
5138 -113 227 45 -877 -849 319 -704 145 -93 -380 -132 -455 -142 -89 164 146 -71 -745 -438 2 -692
5158 -692 -53 666 172 425 -352 672 22 558 -209 535 722 -141 -400 420 291 -156 382 319 -55 580
5178 580 5 -1080 418 502 381 507 66 -679 83 161 -91 547 -408 -884 -858 183 -115 -964 309 148
5198 148 241 -930 380 -77 778 349 940 60 329 -343 178 -487 -261 20 -2 145 542 -388 723 -772
5218 -772 67 -28 -256 554 -635 -297 -761 -1261 428 65 -52 620 -87 -239 48 -634 28 -321 48 -261
5238b61K79O30j467N17Q33r01J036j487J042L2j48o82Q88M84r52L12M6j27R86
5257A060o00j206R50l92Q14k36n32Q8N0j08P48j102L0m82N98N95j92M94l19j31
5277A27l50O37q29N83Rp35P96p42J180j382O85j88j71J30M39M54p30N61j94j86
5297I4n2l15J05P77K46j352k45O28O17m87O1l35P52r61o01O26j71N93j91P13p46
5318b44p0j97N62k52RL21M10j304L62N90K16K72J49k62N06p29l24L6r44J888q09
5339A86o38k48k65P04K22j77J313j166j25N5J09N35q72l97n2O07N93q15J270r67
5359a28N91L64j45k01Q4j227L48J064q51l57Q67k35m09kJ026n42q72J035l50J097
5379A157r51M28j192L00Q02m87L45j422P17Q04ll75l52M72l49J6O61p46K39j73
$$ plain form
5238 -261 18 648 -819 -302 531 -370 666 -821 221 253 105 -577 311 795 -157 155 201 74 1060
5257 1060 460 -746 204 -188 626 390 -142 -54 -4 -112 636 -466 -436 -918 -320 275 83 577 258 127
5277 127 -223 414 -415 168 177 -558 238 -504 676 -706 -21 -209 -380 -250 189 643 -87 474 280 94
5297 94 42 -273 -168 609 855 -497 -742 -114 503 16 77 -258 494 -467 -1068 -442 -613 -20 -211 502 -244
5318 -244 -314 -511 51 -201 -192 129 539 -765 -403 187 403 675 824 562 1068 339 15 51 -893 995 186
5339 186 -452 -700 -965 -261 -39 -216 1097 -69 -194 -139 -30 505 -367 -764 -816 -209 384 -431 839 -128
5359 -128 463 827 682 481 565 -662 -314 750 -101 -458 409 174 -235 -237 789 247 -625 410 60 1157
5379 1157 206 634 -558 -258 544 57 402 -1020 -303 501 498 123 -229 243 -106 -90 571 -175 64 -109
5399a09M59l96k87l59R86J50r15n13J103j209J601l51q81N28k40P20L74m06m4
5418B11O56k99j491R36L67N06m4j131N54j20O27n02k58K16n23K21K89q50rO42
5438bk05m66P04l94O09j182J421n97N09M5K01o58J083p96O1r83J479q17p28M78
5458b38J83O78r56l46P34J41m15L19j83P5j50l82O06j260J461N15j258N29r53
5477i00o3P97j67k79R53j265J000K71M45o88n84L53K15J26P3q53Q11j144J13J038
5497B52j83N3RR29n84j468P19L53k17J007j091N06o48p38l92J58J124M86j03m59
5517b87N49m91K72p12R67n59K39j2K78K4j028J233n1j614J506j057Q13N43q39
5536b26Q31o43N9L68m48O0M44pj280R21r17Q67o23L12K39L4J78j61K0n01N88k76
$$ plain form
5399 -109 350 -46 -333 -692 294 444 -471 -984 119 -1090 511 160 -721 -193 -433 287 661 255 211
5418 211 867 568 -923 13 380 886 842 -289 265 145 772 270 12 228 -295 -74 215 -635 -644 -2
5438 -2 -207 -673 31 -363 246 -936 485 -112 397 442 643 -15 1068 272 333 -650 829 12 -716 -238
5458 -238 -55 623 -333 -679 55 196 -219 100 -83 -8 -158 -540 66 -1194 267 782 -476 53 -900
5477 -900 -963 -166 -333 -612 341 -924 76 347 792 104 -480 -127 88 214 287 -566 245 -899 -786 252
5497 252 69 122 131 1060 476 -992 -273 80 -137 870 -221 285 -363 -1101 -1493 -1335 -211 275 172 -287
5517 -287 262 -229 43 -669 298 -261 -22 -34 244 268 -760 473 422 -1192 314 -743 70 613 -226
5536 -226 605 -38 21 389 -59 1 445 438 -842 79 -838 29 -594 -282 -43 -9 169 8 28 -473 115 -161
5558a61R53j496K48j74J068N60j740J373p83J077r65k07M11r18J314j14j175K09
5576e20P59n92K72K69ol2Q23j058M07n87lj123J416k97oR23R7n84j49j12K32j67
5598c8k40M71n43L63o02L88O7o34Q29j8p47N68K16N3j453J618J127j436j99R45
5618G35m53q37J192n56j076J759l62j102K6R80j20K7L4m43K81q43J467o55M79
5637E33r45N48l27O7L25n58L18R51j213J093n44Q1q30L77O9p04k29J356L02q38
5657a68r93O23Q16p46K04n97J748q31O63K53n53o4L72r37m15J52J33L09P80j685
5677i36J778p12l8K09R4l51R93n55j497J357O02p87N30j40m02N6n54J52m51K51
5697d01J93K46n42k4Q64l78j06N39q4m22l33N22K16M29p80oL07m34o51P99m57
$$ plain form
5558 -161 792 -704 -456 -630 438 998 -742 631 -152 925 -40 -247 164 -754 560 446 -729 -520
5576 -520 239 -353 -81 188 182 150 973 -85 322 -265 -268 -1391 25 -272 -278 645 742 158 9 -103 129 -38
5598 -38 -278 193 -350 13 -589 -201 -134 -768 61 43 -704 -136 80 133 -1320 298 1425 -11 -210 735
5618 735 282 -555 637 81 -995 764 402 -700 -674 306 186 213 247 -196 85 -758 709 54 533
5637 533 -412 136 -191 -124 201 -357 -39 912 -301 792 248 329 -501 -124 -55 -759 -988 368 670 -168
5657 -168 -1161 -538 278 -468 -264 -861 887 56 719 972 419 355 727 -210 -625 -473 -340 -31 749 -936
5677 -936 842 130 92 301 395 44 1037 482 -1015 342 944 157 687 547 145 201 -353 -201 -652 -401
5697 -401 -208 38 -504 -528 336 -42 -148 391 307 -115 -448 74 290 719 -61 -67 240 -194 -845 -46 -503
5718e03l08Q57N9r91J320j19m23M26j24k82N95m62j09l77k29M61J051k698J373
5737d83K84n96L62L66L08r00J378n55L79m31r83O02Q15r3p52L99k93K21N14q50
5757c08J090o14k67m08J268j424Q89o72P6l68N70P38m13k66P48q68j67J143m3
5776G04m14M2M56J13M66j765J234j600O49M98K38p00N6J040O36j420m21o0J33
5795a15n08K69M41r79J664j598P99j09R01o57n70P61R86j302J622j798j34J630
5813A303j247O8J36q48M12P36p31M36j45n92J03J72k14n95J533mp89P57n90r39
5833a038O87K27j146P72K25N27n69M64N12p60P96m73J43P13r88M64L35q85N35
5852E41l1l19R2o95M1K09K07J62k0l34J911j844o46Q30q05N78j88l19M0n6L80
$$ plain form
5718 -503 -811 46 105 -886 434 315 -108 318 194 -88 507 45 -64 -441 -670 -209 842 -1856 -483
5737 -483 -199 -795 -433 -67 241 -659 719 164 543 112 -871 -269 546 453 -299 100 -193 28 542 -308
5757 -308 782 168 -99 -507 761 -663 226 -446 -370 -738 -168 570 157 -109 639 -229 -396 747 704
5776 704 290 332 788 901 1367 -398 836 -764 -115 383 621 -79 -23 1017 1653 233 -188 -248 -115
5795 -115 -623 -354 87 -892 772 -826 -27 -136 765 108 -462 299 1285 -17 1605 -193 -327 1303
5813 1303 56 124 260 -588 -176 560 -171 265 120 -472 -369 -197 -411 -1006 527 523 -266 491 -99 -1038
5833 -1038 -351 -124 -1270 -498 -273 254 -315 149 661 -99 697 224 367 1080 92 556 891 6 541
5852 541 510 191 283 -412 -371 -162 45 207 187 -147 1764 -80 -726 104 -701 -123 -311 -630 -590 -646 -266
5873b66J039J47j438N94l91L36l27J6o07k82Q56M06J193r26K8m52K22p73J193
5892E68k046J803r59P50P0k08R93m76j296M72J236r61J161q71N98o71q9K17N96
5911H87j090N79j43n4j14m6N07m23k23O10L6l5m09K61j163L47J5j00N74r71J161
5932B06l41o36O37p9Q0L00k57J555j120M90p71O28j394Q55j649J460J21j113L80
5951f48M65k74K42J137l35j488J700k115K030n81m43k20p95J153j78R27j218J011
5969C70k37N12k56L16q58P31p31M88p58l28L03N04L92P49j450j031K012j462Q43
5988A09O48m51n76K09k17m53J230q22k83Q09J22r02j42J102j31mJ30j113R60r50
6008g25Q84n33O81N69j208n5J127k12l78l51j53r3J43P69r55P6L57K37K6n47L30
$$ plain form
5873 -266 773 920 -518 76 -315 21 -306 -290 -897 -1179 -323 83 1276 350 378 -74 148 -625 568
5892 568 -1478 325 -634 116 186 -22 971 495 -801 -329 907 -54 1107 236 834 163 74 291 887
5911 887 -203 376 233 179 65 19 526 103 -120 490 526 491 82 343 -820 -473 -458 -558 16 -955 206
5932 206 -135 -771 -134 -213 -133 167 -90 1465 345 835 64 692 -702 153 -1496 -36 85 -1028 -648
5951 -648 -183 -457 -215 922 587 -901 799 -1316 714 133 -310 -530 -1325 -172 -350 577 -641 370
5969 370 133 645 389 705 -153 578 -153 335 -423 -751 -448 56 448 1197 -253 -1284 728 -734 109
5988 109 757 306 -270 -61 -278 -731 499 -323 -606 203 325 -577 -719 383 252 248 378 -735 225 -725
6008 -725 159 -374 307 876 -332 -387 740 528 150 -201 -354 -447 -304 465 -490 -414 -57 180 206 -341 -11
6029a1k09M25k15J18l87Q3l13O0R82k98M0K2K93j215R60m07J34K92M73r42J50
6050C5J1N93j29l26o43K70r5K37N86l54L38o38k37N41o10Q01m36L75n97k2pJ91
6072a16L14k47n3Q04j035r0L0Q83l79m92Q12J18n50J18j66M80m57n33N83L4M50
6093E08K21l66j10l4o29K74Q32r63m33L4L47K54P53o66k03M01j149J161l06M70
6113C96r89J057k87q98m0M61p5O39n11J6J125r19L60l14J99m24M65K56l99q29
6133g11j37Q08J458r50j28p4q1M07r21OO61L99K66j302M19L0J74j092L45K43l35
6154e15O98n49K85l48L05J9K15k02L27l30p74J299r11M82J07N39k41j129P16O2
6174E5p8q37P14n60Q00N26p34L41k76Q39m44r10R64J61o7k533K286L41m44O41
$$ plain form
6029 -11 -220 205 -10 108 -279 -196 -509 -449 533 235 275 297 590 -625 335 -72 62 354 827 -115 35
6050 35 46 639 510 184 -459 -189 -284 -47 539 185 523 -115 -352 189 -421 380 -56 319 -278 -300 -307 -116
6072 -116 198 -49 -102 702 -333 -423 -393 490 111 -381 431 549 -1 117 -49 431 -26 -559 24 58 508
6093 508 729 363 253 219 -410 -136 696 -267 -700 -666 -319 -65 688 22 -181 220 -929 232 -74 396
6113 396 -593 464 177 -721 -761 -300 -375 264 -247 -231 894 -25 335 21 220 -204 261 517 118 -711
6133 -711 -848 -40 1418 468 340 266 185 592 -329 -323 338 737 1003 -299 120 150 324 -768 -423 -180 -515
6154 -515 183 -366 -81 -429 -124 -105 110 -92 235 -95 -869 430 -481 1 108 647 406 -723 -7 55
6174 55 -23 -860 -146 -706 94 620 -114 227 -49 790 346 -564 400 561 494 -2039 247 588 144 785
6194G85q71j305J275N8r1K89j18M36j26n21m60j9K2J70n8J144j16j125L29M70
6214A68k03Q58j767J042M22m65k94K16N5q8k86R76n35K74r64J222r41J78j260
6233a392J335j001J319K58j726J751J28o31o73L06R10m8j452q8J737k64K32p55
6251e4O4l94R94l84o28J82n92O48L59P33n93n71P84j28l08j23L46l85k04m1j89
6272d84M90k6m56R58K4l88P20j154q64J610K45p58j01j87M02j062J808p23J66
6291B20p3J66p00m9O40k29k9Q8J76j02Pr54J035k48M22Q8j605P73Q01k36n77n44
6313i30N89l3j6R41l2M65j017J41J09j384M80K75L23k82K36K15l93j4R08K22m69
6334C34L66j6o13M5J60p75P34O83p28n95N59l97M05J79J5p74l07J86Q3O84k73
$$ plain form
6194 785 -86 -1391 -116 -58 -149 140 22 458 332 -189 -649 -668 -646 -476 -534 610 494 -631 -302 168
6214 168 -35 823 -944 98 520 55 -239 -23 32 -56 -342 634 99 373 -591 631 -310 -132 -1392
6233 -1392 -57 -1058 261 519 -1207 544 672 41 -632 -326 584 536 -916 -1004 733 469 701 -54
6251 -54 10 -384 610 226 -402 -220 -812 -164 195 928 335 -236 548 420 112 -11 335 -50 -254 -295 -484
6272 -484 6 -20 -476 482 506 118 838 -316 -1180 430 675 -83 -184 -371 31 -1031 777 54 220
6291 220 147 313 -387 -436 204 -25 -54 34 210 108 115 -839 196 -52 370 458 -1147 -374 427 191 -386 -930
6313 -930 -341 -374 -390 551 519 984 -33 108 217 -1167 -687 -412 -89 -371 -135 80 -313 -327 581 803 334
6334 334 700 684 71 116 276 -499 235 918 190 -405 154 -243 162 341 356 -418 -725 -539 -456 228 -45
6355d5o68J541j601L31j064K249j295j78J349j53k72r1O56q42j000J128K28l72
6373i9L44q05O63m13r7P12K56l34j401Q68k76m95J089K94O2j87q6k03N98o21L34
6394B03P69o11o74O77p92l38K61N36K79m65O66j230Q11n58n20N41L48J06N87j421
6414h25J508j098n20J172p70Q37P5j153J743o42l10M77l83q88J426l39l49L53
6432C14n40L90n79m1P53m06M69m67k43N93O35j61n79o23M65j28L22n24R38Q83
6452A471k865J327L61l53Q17j345K74P78n75j621J642n35q8J116j020L06P00K53
6470F43r19j93k01O88k23j63O55j415J508j0l18L47R8K9l64o23O50J01Q8l3n79
6491b34K89j03O46m39m68K09N79p9l14l14K03m8J27j152J194p75M74k31L2J051
$$ plain form
6355 -45 -713 828 -773 -442 -1506 743 -552 -730 619 466 194 103 759 -83 -1083 45 273 -99
6373 -99 245 -560 103 -310 -407 305 561 227 -1174 -306 -582 -1077 12 306 368 181 95 -108 490 -131 203
6394 203 972 361 -313 364 -428 -766 -505 31 310 -155 511 -719 92 -466 -986 -445 -97 9 596 -825
6414 -825 683 -415 -935 237 -533 304 379 -774 969 327 17 494 111 -777 649 310 -39 314
6432 314 -226 164 -415 -456 297 -109 360 -107 -350 243 878 717 138 -485 -20 -148 174 -350 588 1471
6452 1471 -1394 -67 294 -59 758 -587 -313 465 -110 -1731 -89 -624 -712 404 -616 -310 390 643
6470 643 -276 -469 -670 18 -205 -368 287 -1128 380 370 52 399 497 526 162 -461 189 290 378 345 -234
6491 -234 55 -48 598 159 -309 -100 479 400 86 -228 -25 -73 54 -1098 96 -679 -205 -436 -404 647
6511F47l54k39p52O43l57M63K19J83m41R60o56l52k75n82O52L67j50k81M64M64
6531F23r7j546P91k43O24M46o32J24p8l45N66p38Q44k12n95N2Q01j3l99O58k04
6552D27K55r10J68m76P97Q51r85P14j453K41J043p2J11L64j284M13k67N19k78
6571A78m76N76p69l56j43Q03J132j829N44K37R15m11j134J261r6j346L38J581
6589A005j437O62p32O85m54J94K27o62O12m06L7L17o55j80P79m7n9P32j095M31
6609d6L69j39J16p00J02K86k89L28N39p03N66P3j366R10k78L50j25J83M64j123
6629d83J072j353K469j201n33n17M30o35P92l7K96o33O52p87J686p15J42j95p65
6648c15J06M02p35O83n27R9L4M58m40M95l52M57m82p6Q19r22k43J57J08j10k41
$$ plain form
6511 647 293 54 -698 -55 -412 51 270 453 12 972 316 -36 -311 -893 -241 126 -24 -305 159 623
6531 623 526 -1020 -229 -472 152 598 -34 90 12 -333 233 -505 339 127 -468 -416 385 372 -27 631 427
6552 427 682 -228 -60 -536 261 1112 127 841 -612 -371 672 600 711 1075 -209 204 -63 456 178
6571 178 -298 278 -491 -847 -990 -187 945 -884 -340 -103 812 401 -733 528 432 -914 -576 1005
6589 1005 -432 230 -502 183 -271 -77 150 -512 100 -306 -269 48 -607 -787 -8 -55 -114 618 -477 -46
6609 -46 323 184 300 -400 -298 -12 -301 27 566 -137 429 502 -864 46 -232 118 -7 176 640 -483
6629 -483 589 -764 1705 504 -29 -546 -116 -751 41 4 300 -333 319 -468 1218 503 645 450 -315
6648 -315 -209 193 -542 141 -386 -287 -253 205 -235 260 -92 365 -117 -193 626 -296 -539 -382 -274 -384 -625
6669f25O23m91j31R93j26L68m59R0l85K7j14N96l10l50Q6j63l72P23q9mL58L19
6691E64p00J44M59q97J3n64O92J71O13o49L06O06o51K8o93J56j0M75J12Q26j600
6712e99J496j791J046M0k52M82l17n54O15nl84J576j560K21p36J077k157K237
6730D35K83p34L86j455Q61L81J029j283n56J112o42K08j073N14J174j148O63n46
6748c91R4J068j413K42J259n24J26r6q09O50j85o33O48J09n38J257o93j18k74
6767b21M74j53l8O75m98l59J93J380J83k147J547j343P3Q33q93Q48L29p9j426
6786f22M17m50L39K35m47O71j283J673l92k41K83j53r50Q61Q60j18j473J050q52
6805e92J831j272p97Q60p97M12m08J285o30N08L29j765Q01j294J253J568j570
$$ plain form
6669 -625 -2 -493 -624 369 243 611 152 242 -143 -116 -230 366 56 -294 -208 -371 -743 -20 -109 -113 245 564
6691 564 -136 8 467 -430 -417 -981 -289 -118 495 -154 152 758 107 135 -558 -402 -412 63 175 1001 -599
6712 -599 897 -894 152 192 -60 422 105 -449 166 161 -223 1353 -207 14 -722 355 -1802 435
6730 435 718 -16 370 -1085 -224 157 1186 -97 -653 459 -183 25 -1048 -534 640 -508 155 -391
6748 -391 -297 771 -642 -400 859 335 461 365 -444 206 21 -612 36 145 -393 864 171 53 -221
6767 -221 253 100 62 737 239 -120 73 1453 1636 -511 1036 -307 -234 599 -294 554 883 804 -622
6786 -622 -205 -655 -316 -81 -528 143 -1140 533 141 -100 183 30 -920 -59 801 683 -790 260 -592
6805 -592 1239 -33 -830 30 -767 -355 -763 522 -108 400 729 -1036 -235 -1529 -276 1292 -278
6822b78Q60j322P00J86O05l02j673J816M15Q7p49N31n83O58M11j227j108J688
6840G15r58P58L14j208O53j09K69o16R43l6r35o5K8r57J902m44Q28l67m83l45
6860a13j293J610j63j424P37N25J060j281R12o05k09J367j416J93M3l85J67o6
6878c41K69j77n94O52L38R14j738Q63J52j272J580o74l71L99j44K51j002O30N79
6897C14M15n7k78p99K79J83J74q38J115r68O01m66N75o92p04J132L63l68P1n5
6917cM56l73J47O95j289N09k63L21n19J79M75n74n47J312O5l76l00J94q3M02l43
6938H5K11N03j398m64O91R02j283J98J000r5l04j020L25P84J646k195N57J20p96
6957e33J558j339L91j585J367N57r65J152j259L88l11J136m03k06J64K78N54j992
$$ plain form
6822 -278 582 -740 -40 146 751 449 -1224 592 1007 1094 345 876 293 951 1362 135 -973 715
6840 715 -243 515 829 -379 274 165 434 -182 761 725 -210 -275 -247 -1204 698 254 1082 715 232 -113
6860 -113 -1406 204 41 -1383 -646 -121 939 -342 570 -35 -244 1123 -293 -100 -57 -442 -275 -341
6878 -341 -72 -249 -843 -191 147 1061 -677 186 338 -934 646 -28 -399 0 -144 107 -895 -265 314
6897 314 729 672 394 -405 -126 57 231 -607 508 -460 141 -325 250 -442 -1146 -14 349 -19 52 -3
6917 -3 453 80 227 922 -367 142 -121 200 -319 -140 335 -239 -786 526 591 215 -85 109 26 428 85
6938 85 296 799 -599 -1063 -372 530 -753 -555 445 350 46 -974 -649 135 1781 -414 143 263 -533
6957 -533 1025 -314 77 -1508 -141 416 -549 603 -656 -268 -579 557 154 -52 112 390 944 -1048
6975a048J203k24M47J8l90l8l34N53j01l55O27o9M48k67o49O3k70J63L41m55m31
6996g68j70P62M13o03J38M0J43j28M64j38o51M29l35R39k105K560j144J80k84
7015b58O67m71K9N7n4P07j64m53J57K43J83l21N43j934J408M0m43m06J965r78
7035E17q45L83k53l17J580p78k04M89o34K19J62l95K67J37Q5m33KO34o21M75q48
7056c78L90l54r2P33j92k25r0j144J780k71O76k29p70J031j344K50J65j2O9M84
7076D77r21N55P7L98n93P3o88J300r00K00L30j28P3j120N85j21j21N64q40K73
7096e27J139P8r46J68O88j240J402j150Q22L63r61O2n81J145k014J680q38J002
7114B92k40p8K26p9q82J329m0m88p83L23O49m23O98p27K62j38J353j392N8n77
$$ plain form
6975 -1048 155 -69 378 396 6 -32 -366 187 86 -269 358 289 737 470 -179 -116 -386 -223 118 -337 -768
6996 -768 -938 -176 237 -366 -228 -188 -45 -173 291 153 -498 -69 -404 535 -1570 990 -154 26 -258
7015 -258 409 -62 -33 24 -30 677 513 60 217 460 643 322 865 -1069 339 379 -64 -470 1495 517
7035 517 -328 55 -198 -515 1065 287 83 572 -62 157 319 -76 191 328 413 -20 -18 616 -5 470 -378
7056 -378 12 -342 -434 299 107 -118 -208 -1352 428 157 833 604 -166 865 -479 -229 -64 -76 -7 477
7076 477 -444 111 188 586 -7 66 -622 678 -222 -22 308 180 253 -867 -282 -403 -524 40 -800 -527
7096 -527 612 690 -256 -88 600 -640 762 -388 434 797 -164 -102 -683 462 -1552 128 -710 292
7114 292 52 -26 200 121 -761 568 528 40 -743 -420 229 -194 504 -223 39 -99 1254 -138 -80 -657
7134f57J051p47o46M85P58j32r71J143Q6j222R21k67J41m33P56q22K66M53l01
7153a38l08N43q06J237r84J6J38o70P30n78L05R84l18p5l05J400j069O78j133
7172c53L1O92m11j96O59k60m47N39L3Mk71k42O29n31P72K56j623O42M67r15K46
7193b79M22l66M3m95k7O1M95k89J036m27l67P26m78M11n90l80O98k69M43l41J51
7214A78O89j085L74n26O1P91N55j158K35j2k08J55n12K67j00o9L80q53M65N19
7234A46n57K78o47J003k06j71L37L32r62L72K86k77n18R93j949J072L67o29R03
7253A73p15J096l67N57j68O23p59k16p13l95J058j388J691p64M69n71R3L25q93
7272h64R85n05P32o20J81J28p89L92n60M30o28J123m43J014po88L13K90j324j43
$$ plain form
7134 -657 394 -353 -999 -514 244 112 -859 284 370 -852 69 -198 -57 -490 266 -556 -290 163 -138
7153 -138 -446 97 -709 528 -456 -440 -302 -972 -242 -820 -515 469 151 76 -229 1171 102 780 -353
7172 -353 -322 370 -41 -237 422 162 -285 254 287 291 20 -222 407 -124 648 904 -719 -77 390 -525 -279
7193 -279 143 -223 -180 -675 -702 -641 -146 -435 601 174 -193 533 55 466 -124 -504 194 -75 368 27 178
7214 178 867 -218 156 -370 -309 482 1037 -121 114 102 -106 49 -463 -196 -296 -365 15 -838 -373 146
7234 146 -411 -133 -780 223 17 -154 183 515 -447 -75 211 -66 -584 409 -1540 -468 -101 -730 173
7253 173 -542 554 187 744 576 1199 440 224 -489 -884 174 -1214 477 -287 182 -389 -296 29 -864
7272 -864 121 -384 348 -272 -91 37 -752 -360 -920 -490 -1118 5 -438 576 569 -119 194 484 -840 -983
7292i83K1R90l1j116J883k21k173N20M77N47R26j218J025P71j597l29N89J30l4
7311A77o17J00K66j74j50J037n61q94J351j47m63o4j09L77l13J381j548J281j064
7330a34n71M3r0j25Q97Q60j460r6P40l40N35n79P1O73j001N91j36O5K47o4o78
7351e52J960j363o33L00J93p49J62J165j082J364J62j176K5J77m16p63J436M13
7369F23l32p3K03r89P28o36M6Q11L97n09q04O5O60l17O35m63M04j45k32j22N44
7390D94p33M77R5m13l6n92Q45J06J14p14M2P76j17n20Q64n84k91n87J009k29K2
7411B8O30r92k6J010m28r85n35Q88P21j36q31R91q08o18J114L56q55O24kQ6j116
7432h84R52j84N66K19ll88j244O95O9k33K62J024j187R35r31p4l04Q63j87mO15
$$ plain form
7292 -983 -962 28 -3 -1119 764 543 -1630 -1110 -633 -86 840 -378 647 1418 -179 -508 81 211 177
7311 177 -440 -340 -74 -248 -398 639 78 -816 535 388 -75 -139 -248 129 -184 1197 -351 930 -134
7330 -134 -705 -662 -752 -877 20 880 -580 -676 64 -276 259 -320 -249 424 -577 14 -122 -57 190 126 -552
7351 -552 1408 45 -588 -288 -95 -844 -682 483 -599 765 927 -249 -224 -47 -463 -1226 210 623
7369 623 291 218 421 -568 160 -476 -430 381 778 269 -535 -470 190 -127 508 45 449 304 72 -50 494
7390 494 -239 238 333 -80 -116 -708 137 243 357 -357 -315 461 344 -176 688 104 -187 -774 235 6 28
7411 28 658 -334 -360 650 222 -763 -1298 -410 311 175 -656 335 -473 -1091 23 379 -476 148 146 232 -884
7432 -884 68 -116 450 669 666 278 -966 -271 -202 -435 -173 851 -336 599 -332 -406 -710 153 -34 -38 577
7453E77q80J159o53N89o54K8R56n76q86J375r02k8qo55k28M27J124N77n45k042
7473a245l36J838n3j50Q38n76k45P24j429k24J210K60j217R50M85o20Q5n02Q12
7492F05k97l78J023n81j120N88L7R2L91P24o15j120R32n46M42m74J627q75j768
7511a313J646K01m99Q36q69q31J332j028l22R01n39m05l3M0R09m57Q61m48M69
7530D51j47p81J44P96j562J259N3k30j61j32J178n99P57j289L51M35m66Q1N90
7549G28o71J69j067P76o91J616q57j12k54Lr6j71M09N13j91k97N48k70m03n31
7569h49Q18K18k0p82J090p28P26j064Q39K19m21o17M57j06M98r5j046Q42n79M49
7589a51k3o11J082j15L05q74O08k95K51J2p54K14n3L49J823j641j93j65L6K15
$$ plain form
7453 577 -303 856 203 792 138 166 1122 546 -340 1035 133 105 97 -558 -786 -359 765 1342 797 -1245
7473 -1245 -1581 257 204 54 892 316 71 795 -634 -858 352 612 -605 345 830 210 295 -207 605
7492 605 308 -70 953 372 -748 -160 -123 -31 360 1084 469 -651 281 -265 177 -297 1330 455 -1313
7511 -1313 333 534 35 871 2 -829 503 -525 -847 54 -485 -890 -923 -883 26 -431 430 -18 451
7530 451 304 -477 -333 463 -1099 160 213 -17 -178 -310 868 269 1026 -263 88 523 57 138 728
7549 728 57 226 -841 -65 -756 860 3 -109 -363 -360 -456 -627 -218 295 104 -193 355 85 -318 -849
7569 -849 -31 187 167 -615 475 -253 473 -591 248 467 46 -571 -114 -220 278 183 -863 -21 -600 -151
7589 -151 -174 -785 297 182 487 -387 221 -74 177 189 -565 -351 -404 -55 1768 127 -66 -231 -195 20
7609B0M39l31j95K80p68K7L93Q65j677N50M54n91M99M09J0l35P08j480J009k84
7629BJ81p74J027R9m62j184P04L05j72N04n98J072n16q22o5J022r84q3l04J254
7649B06p57O01M71L92n93q76J260l02j3l72n43O25N11L18p32J056L44q84M0m25
7669C27j315J022j04M50j272J054j62q9p98J111J27J77q06j28l92Q16J95j99r40
7688i26J842j746J995j635K57N2L49M46m4j11q22M71n94L68J261q49R45m95j047
7707b83P83j020J11K62J092j122m6j93k56O92m8L72J71L44j230J54R28l55j45
7726B11o1l34q8o00J492r60l29M45P29l19k78Q05q1r06N83j76l93O6L93M10p91
7747a82M03m38kM50k2n86j25R22n65J05p5L19Q3l36P23l02l75n75KK23p0N39K6
$$ plain form
7609 20 459 128 -67 213 -555 -528 -135 730 -947 -397 57 -534 -35 374 384 49 757 -723 286 2
7629 2 183 -591 436 535 73 -1111 -407 -102 -274 230 -368 704 188 -634 -699 323 -661 -744 -1048 206
7649 206 -551 50 521 913 320 -556 704 402 389 17 -526 99 610 928 196 1252 1596 712 752 327
7669 327 -988 34 -70 380 -892 162 0 -89 -887 224 351 528 -278 -406 -798 18 213 14 -926
7688 -926 916 -830 1165 -470 -213 -161 188 634 590 479 -343 128 -466 -98 1163 314 1259 764 -283
7707 -283 500 -520 -409 -147 945 -177 -223 -416 -672 20 -28 344 515 859 -371 -217 711 356 211
7726 211 150 -184 -272 -872 620 -340 -669 -224 505 186 -92 713 632 -274 309 133 -260 -194 199 609 -182
7747 -182 221 -217 -219 231 209 -377 -502 420 -145 -40 -115 204 287 -49 674 372 -3 -578 -576 -353 -423 116 142
7770A42L82k92o54K96P49j083N91M17l29O86n43l45o46K92J156j087L09k88M0
7789b07Q92q04L30r07J409j402J54J670k92q92m28Q79l26K8m07J77K14R83p46
7808C25J09o93k32rM33l92J368r10M85l78p0K45k17P6n5j23P56o43p7L68J94p66
7830b06Q10k81j078J031q49R67p31k21J304p06m39K62q7j090K127q27l80Q73m35
7849D4N0j50j33k6j13l48Q55J095j315R18j051n44R84R6q49O93M16j492Q4Q45
7869E9k11K71j009J664p84Rj7L32r78K22M70m34J194m84q85K38K0k38R41k70k68
7890a58M00N19p67N26Q0k36P2k39k72j89j61J58j77O99l30j90P18l87J54L26m56
7911I0J68o28O34N19j434J05M92o70O16k13O11p41K81N03q97K34O02R74j720K93
$$ plain form
7770 142 524 232 -422 -126 623 -460 131 548 219 905 362 17 -629 -337 819 -268 41 -247 -207
7789 -207 685 -119 211 -696 713 -689 -535 1135 843 -49 -477 402 76 104 -303 -126 88 1071 325
7808 325 434 -259 -491 -500 -67 -459 909 -1 484 106 36 281 64 140 85 -38 718 75 -2 366 560 -206
7830 -206 604 323 -755 276 -573 394 -337 -558 746 40 -399 -137 -224 -1314 813 -14 -394 479 44
7849 44 94 -56 -189 -215 -328 -676 179 1274 -41 877 -174 -718 266 362 -487 206 622 -870 -786 59
7869 59 -152 119 -890 774 -10 -1 -18 314 -664 -442 28 -406 788 304 -581 -343 -323 -561 380 110 -158
7890 -158 242 761 -6 520 600 364 436 197 -75 -264 -425 -267 -444 255 -75 -265 453 66 220 546 90
7911 90 258 -370 264 783 -651 -546 -54 -724 -108 -321 290 -451 -170 333 -564 -330 272 1246 -474 -181
7931a81l0P36q4l87O38J21n25n43k89J427j029R64j275M66N95q32k58P51j002
7950g37O02k65L84j436J076o6J1K85N78r31l81J167L43j506J607n12m26N21k08
7969A06j096J340n64Q31j252Q92o18J37M00N88m11K68j128J33J071k91r3n17q54
7988a058J308k56M70o65j47l7J35j68pM74L85j38n45K04j9r4o87J654n52r96N38
8009b01P41J94m67n03Q5l6K43l43J256j518l52J220Q5P97j372K31r72N43q02R98
8029a73n06J88J073j021J811k188N81l81N20M47L95o50m9q4l92L04K03m92L42
8048g2r64J654m93nO29q21R77o86j172Q51K95J066j076r6J53m08K12j025J558
8067E77l76K43j14j253R40n54N11l66K06J31n27M68j129J43O64j37L68O49L32
$$ plain form
7931 -181 -211 525 441 54 692 813 288 -255 -544 883 -146 818 -457 9 604 -228 -486 265 -737
7950 -737 -135 -400 -16 -1452 -376 -442 -431 -146 432 -499 -880 287 630 -876 731 219 -207 314 106
7969 106 -990 350 -214 617 -635 257 -361 -224 176 764 353 621 -507 -374 697 406 313 -204 -1058
7988 -1058 250 -6 464 -201 -348 -385 -250 -418 -425 49 434 296 -249 -45 -64 -158 -845 809 257 -739 -201
8009 -201 540 734 267 -236 -151 -187 56 -287 969 -549 -901 319 404 1201 -171 60 -912 -369 -1171 -173
8029 -173 -679 -491 582 -439 1372 -816 -235 -616 -96 351 746 96 47 -37 -429 -125 78 -414 -72
8048 -72 -1036 618 125 120 749 -72 905 219 -953 -102 193 1259 183 87 240 -168 44 -981 577
8067 577 201 444 330 -923 17 -537 -26 -392 -186 -55 -582 -114 -1243 -1100 -436 -573 -205 444 776
8086G76j048N70l38q02J342Q9j030O30k74l67P67l75J93M83n41k56l75J273j201
8105d84N1N51L3k98k90j14M03P53l36N7r36O33l20M25q65R14o78K98Q1j81P80
8126D77m35P09l94j80L84l52k25Q0j7k82Q6m13J257p32j92K02O22l74n70K48j86
8147b87N62M84j52q47R85p22R17k60l43n84p98J262n75K40M62k67r3N34o06J11
8167B3O07j312J664r75O14j47J68J68j182M36o16k12J439r04K99l68O38L44j396
8186g12J64L2J77J06M38
$$ plain form
8086 776 -272 298 -40 -842 500 589 -441 189 -85 -452 315 -60 133 616 75 -181 -556 717 -484
8105 -484 -433 118 151 -147 -437 -551 -148 605 269 326 -610 23 -297 128 -737 177 -501 -203 -122 -303 477
8126 477 42 751 357 177 561 209 -16 64 47 -235 -149 -562 695 -37 -229 -27 595 221 -349 -101 -287
8147 -287 275 759 607 -240 745 23 940 680 337 -247 -1045 217 -358 -118 344 77 -16 518 -88 23
8167 23 630 -682 982 7 621 474 642 810 -372 64 -552 -764 675 -229 70 -298 340 684 -712
8186 -712 -548 -516 -339 -233 205
8191B05
$$ Imaginary data points
##PAGE= N=2
##DATA TABLE= (X++(I..I)), XYDATA
0@%%%%%%%%%%%%%%%J08k16K16k16K16l24M32m32N40o48P56q91R99j188J404j620
31h64J836k056K344k665L009l392L798m259M753n299N903o560P275q043Q891r834
47e163J0853j1959J3175j4521J5997j7619J9427k1443K3698k6244K9143l2472
59a7128L6355m0938M6458n3262O1855p3143Q8744j11896J50226k29137P21724
70E79858j294045j89083K103210m12286j219467n6990J023178n5878n99473k15586
80c36562J81791M84289O4191j034067J49344J124504l59644j089072N01589Q98536
90E84899n58364p21385O10749L85018n26751p1218K68618j70143J51525J24726
100G7674m19086P4800N68464k23031n46802M30571N43866o21278k82829P46606
$$ plain form
0 0 0 0 0 0 0 0 0 0 0 0 0 0 0 0 0 108 -108 108 -108 108 -216 216 -216 324 -324 432 -459 540 -648 756 -864
31 -864 972 -1084 1260 -1405 1604 -1788 2010 -2249 2504 -2795 3108 -3452 3823 -4220 4671 -5163
47 -5163 5690 -6269 6906 -7615 8382 -9237 10190 -11253 12445 -13799 15344 -17128
59 -17128 19227 -21711 24747 -28515 33340 -39803 48941 -62955 87271 -141866 579858
70 579858 -714187 -903270 1199940 787654 -431813 -488803 534375 478497 -120976 -336562
80 -336562 -154771 329518 393709 -640358 -491014 633490 273846 -815226 -313637 584899
90 584899 26535 -694850 -84101 300917 -225834 -297052 -28434 -198577 -47052 77674
100 77674 -341412 -266612 301852 78821 -467981 -37410 506456 -114822 -397651 348955
110C48955r9287n50002L48108J94997l51315L9129K79439k43504j70765M40839
120B36594q0255m93390M15128K94920n84744Q876N17508k28732l92777L42161
130C5289K00569m43082K3819L83796k76815j98832M07946p6621l50861L19439
140B4647J85183l95338L0884M12877j99699l18149L70860J55003m58560J05505
150h6787L83168l29392j38290L78849q5407k81373K46012J78023l48360J6911
160f6646L97741k44634k77200M13260K4667m10480J77910K54485k98846j14363
170a44106L26589q3190l04595K58119J50754l68255O1160L38695k63206j86697
180b14732L39889n451l30917J46985K37582k84781j07480L32117r5800k94059
$$ plain form
110 348955 249668 -300334 47774 242771 -108544 -69415 210024 -33480 -204245 236594
120 236594 156339 -337051 78077 372997 -211747 -202871 314637 85905 -306872 35289
130 35289 235858 -207224 -183405 200391 -76424 -275256 132690 56069 -294792 24647
140 24647 209830 -185508 -154624 258253 58554 -259595 111265 266268 -192292 -86787
150 -86787 296381 -33011 -171301 207548 122141 -159232 86780 264803 -83557 -66646
160 -66646 331095 86461 -190739 222521 247188 -163292 14618 269103 -29743 -144106
170 -144106 182483 99293 -205302 52817 203571 -164684 -103524 235171 -28035 -214732
180 -214732 125157 119706 -211211 -64226 173356 -111425 -218905 113212 17412 -276647
190b76647K75401J15412l37620R7645K66875k19244j39848K91286J1025l04600
200b20315J60820K29801l04497m0250L27645j64436k02463K67846N7423k68453
210a56879P8432K53170j99342j39707L08492k3945k87005K06935J60537k82713
220h2025J1497K51504j32338j81240K19190P4795k74898P7196K43329k26197j04506
231a23693K89144p4014k22023J82435J06084k22203j1072K28334j21405j86971
241a55384K36705L4420k70145J29402J72921k22896l5078K13272o3266j81525
251a41574J55158J15867k40102K6571K32189j71468j24087K38962k3060k03050
261a34594J20228J34337j74860n5495K23761o5266j95373J92673Q0411k32424
$$ plain form
190 -276647 -1246 114166 -223454 -125809 141066 -78178 -218026 73260 84285 -220315
200 -220315 -59495 170306 -134191 -174441 153204 -11232 -213695 54151 111574 -156879
210 -156879 -78447 174723 -24619 -164326 144166 120221 -166784 40151 200688 -82025
220 -82025 -70528 180976 48638 -132602 86588 161383 -113515 -36319 207010 -19187 -123693
231 -123693 165451 91437 -130586 51849 157933 -64270 -75342 152992 31587 -155384
241 -155384 81321 115741 -154404 -25002 147919 -74977 -110055 103217 39951 -141574
251 -141574 13584 129451 -110651 -84080 148109 -23359 -147446 91516 68456 -134594
261 -134594 -14366 119971 -54889 -110384 113377 48111 -147262 45411 125822 -106602
271a06602O4239J80254j57303q0778J82991l478j87873R8905J48809j99439l2163
282i2438K16912j02806j45395J77864L1053j77127N3202J41817j20083r3981J84981
293G3999j1999j88245J28167J01155j84662J2747J61507r7431j01199J36833L7912
304F8784j65307M8600J52330j47200n7728J82478n1205j38027J28145O4388j47056
315f1798J2239J42343q1275j08184J50563K2849j69824Q3754J10924j42678k4208
326f5295J46441n0938j09570J03335O2129j37213J0165J43049j00170q2617J44434
337F3750q095j34509P5362Q0187j14441k3359J21288l7185j11596J08221N2483
348G2106j40226L6648J15075r7325n1915J17795j3673j07496O2738P3754j08405
$$ plain form
271 -106602 -42363 137891 -19412 -100190 82801 79323 -108550 -9645 139164 -60275 -92438
282 -92438 124474 21668 -123727 54137 85190 -91937 -38735 103082 -17001 -110982 73999
293 73999 62000 -126245 1922 103077 -81585 -68838 92669 -4762 -105961 30872 68784
304 68784 -96523 -47923 104407 -42793 -100521 81957 30752 -107275 20870 85258 -61798
315 -61798 -49559 92784 11509 -96675 53888 76737 -93087 -9333 101591 -41087 -65295
326 -65295 81146 30208 -79362 23973 86102 -51111 -40946 102103 1933 -80684 63750
337 63750 55655 -78854 -3492 76695 -37746 -61105 60183 22998 -88598 19623 72106
348 72106 -68120 -31472 83603 -13722 -65637 52158 38485 -69011 -6273 67481 -40924
359d0924k2536J27686n8333r0464J10574K3691j12241M3662Q6112q1802l7240
370e1815R9586p368j03181O5279O5739j13277J590J05085o3338o1897R2994R628
382C9025q7479L5233P8646o8811m3019J06454k0013r3129P7932L6666r6682J5257
394a9920P3854n3580n1062P1880J8064r2089L7294P5519q5163j6254R1484l7969
406A2058o2282O3692K3015p3535K950O7261m5123n6173Q0433J319q1877N2549
418a5713M5595o6644k25O6078k1528m6811M7348L7343p4080R466P3500o2915k8548
431c7134P1289j6012n3190L9140L4215m7529j0934O5829j8442n7754O4766J2988
443D7232o9639L1841L5389m8323j7559M0790o577n0432K4952L8042n7086m571
$$ plain form
359 -40924 -63460 64226 5893 -84571 26003 49694 -62547 -18885 67227 -14575 -51815
370 -51815 47771 40403 -62778 2501 68240 -45037 -43447 61638 -1700 -63597 29397 39025
382 39025 -48454 -13221 65425 -3386 -46405 60049 40036 -53093 24839 61505 -35177 -19920
394 -19920 53934 354 -50708 21172 39236 -52853 -15559 59960 -25203 -41457 50027 12058
406 12058 -50224 13468 36483 -37052 -34102 33159 -11964 -68137 12296 13615 -68262 -15713
418 -15713 29882 -36762 -36987 29091 7563 -39248 8100 45443 -28637 -19171 54329 -8586 -37134
431 -37134 34155 18143 -35047 4093 38308 -9221 -20155 45674 27232 -30522 34244 47232
443 47232 -22407 9434 44823 -3500 -21059 19731 13154 -37278 -12326 25716 -31370 -35941
455c5941O3443l9369k5793M9009K94l8905J4954L4239l3647k4280M7715n056n5665
468d9002M1860K2870n1747J5895L5208k0778j6392L3740J2311l7923J4701L9904
480D0647m0962j3729M9669k6175k8551K8708N221k7336q13L0122j5027k3400L8155
493A6529N684l9615K6641K2289l4307J568K2485j0417k3044J7332J1777l1086
505a4164K445L0781k5284j3441L8545j0422k0619K2446J1585j9029o700K4567
517B0710q446k5405J8939N053l1521J2920J5167k5674j903J8237k136j6894J1848
530i105J7308k0282k941K2518j0156j5174J8887k728j6649P839Q497j1983p024
543b0993K0355N63j7860J5866J5898j8561M409J7673j1841j938J1932m206j2659
$$ plain form
455 -35941 27502 -11867 -37660 11349 11643 -27262 -12308 21931 -11716 -35996 11719 6663 -49002
468 -49002 -7142 15728 -36019 -20124 15084 -5694 -22086 11654 23965 -13958 743 40647
480 40647 -315 -14044 35625 9450 -19101 9607 14828 -12508 -13321 16801 1774 -21626 16529
493 16529 22213 -17402 9239 31528 -2779 -1211 21274 10857 -12187 5145 16922 -14164
505 -14164 -11719 19062 -6222 -19663 18882 8460 -12159 10287 21872 2843 -3857 20710
517 20710 12264 -13141 5798 10851 -20670 -7750 7417 -18257 -20160 -1923 -4059 -20953 -9105
530 -9105 8203 -12079 -15020 7498 -2658 -17832 1055 -1673 -18322 -10483 -1986 -13969 -20993
543 -20993 -638 -75 -17935 -2069 13829 -4732 -323 17350 5509 3571 15503 11297 -1362
556a362M548J1446j7432q980K0691n519j5869J5357P79r242Q234O05j520m130
570b394O853J982j5044L559J0033j4031m926J0692m146j731K219L933P62j328
584c567J1041j909n761J2440L098j5300R782L990r751L023o62J771m299L22M958
599I176p995M693Q647j3226L514J0541j1427J456r73l489L422q397k0j473n031
614a0582M730n639n157J0217m710k707M835l044Q074n754k959Q983m724j656M110
629e983n176J142N940p560K397K579K935J971o468J0974J831p829Q698N69m705
644A315J0113p662k441P268m598K115m156N16P208q758K129N950o150O367j233
659G983o916Q935l150k148J739p798P055j776p163K944L63l3j448l263K753J689
$$ plain form
556 -1362 3186 14632 -2800 -11780 8911 3392 -12477 2880 3659 -5583 2651 3256 1736 -2394
570 -2394 4459 6441 -8603 -5044 4989 -9042 -13968 -3276 -7422 -9153 -6934 -3001 -2239 -3567
584 -3567 7474 5565 -196 12244 15342 42 9824 13814 4063 7086 6424 8195 3896 4218 9176
599 9176 1181 5874 14521 1295 4809 15350 3923 5379 4406 917 4339 -4058 -4078 -5551 -10582
614 -10582 -5852 -11491 -16648 -6431 -11141 -13848 -9013 -12057 -3983 -9737 -12696 -3713 -8437 -10093 -5983
629 -5983 -11159 -10017 -4077 -11637 -9240 -6661 -3726 -1755 -8223 2751 4582 -3247 5451 6020 1315
644 1315 11428 3766 1325 8593 3995 6110 1954 2470 9678 920 3049 8999 2849 9216 7983
659 7983 1067 10002 6852 4704 6443 -1355 5700 3924 -3239 -295 68 35 -1413 -4676 -1923 -234
675b34n161M716k157J17M437p731K792L337m996J318R76l853M545o54k051K745
691a854p42M794m479j618J0231m743l248N206k533J532J435m240M606j22k320
706A905K838m852M380R9l777Q91r55L875j390n362K743M985o233K34K026j705
722b98M55O00l129L09K184l612P12K40J336j726j907L335k011K520J45m140L242
739a745M427n913J508K493l004K133j368J91m06l87J548k221J119L373j840k169
755b261M444j523K361j279j603N393k579l965J331J637l737K092l55j559O84N5
771h64J849m207L237L761o789M414K865m109P84N10l452L323l476J616J318l199
787b419M041k580m2M308k063J171J569m78L218j068m391O046m566j694L345n488
$$ plain form
675 -234 -5395 -679 -2836 -2719 1718 -6013 -3221 116 -4880 -3562 -2586 -6439 -1894 -2548 -4599 -1854
691 -1854 -2596 2198 -2281 -3899 6332 1589 -1659 3547 1014 2546 3981 -259 4347 4225 1905
706 1905 4743 -109 4271 4370 593 1484 529 4404 3014 -2348 395 5380 -853 -619 1407 -298
722 -298 157 757 -2372 -2063 121 -3491 -2779 -2539 -1203 -2929 -4836 -1501 -3512 -992 -847 -4987 -1745
739 -1745 2682 -3231 -1723 770 -2234 -101 -1469 -1278 -1684 -2071 -523 -2744 -1625 1748 -92 -2261
755 -2261 2183 660 3021 1742 139 5532 2953 -1012 319 1956 -1781 311 -44 -1603 -919 -864
771 -864 985 -3222 15 3776 -3013 1401 4266 157 941 1451 -2001 1322 -2154 -538 780 -2419
787 -2419 1622 -958 -1000 3308 1245 2416 3985 3507 6725 5657 1266 7312 2746 1052 4397 -1091
803a091K023k43j196m27P56K096n43k891M795J25n267O354l540n060N530l920
819b499k247K456j760M60l550K406N535p307K667N980n715M264O64k704K491l09
835H32m58j009l146L574q52p217P434j037j767J785L75K218j550O87M304m522
851c49k83M095o103q22N063o028O27M08P78p1j403M320L12k706O490M91m703P569
869G685j579l421L458j224m21k326K29K172l181K16M278m156J658L629k523J83
885D677J51R26k832j906L124k761o605L213J35n970K642J554m073l08M179R62
901b892n265N302M068n524L24N046m211l559M986j131l172J850K902k822j666
916e764O736m28k565M500K601m071K810K501k576j447N10P81n035R57K721m036
$$ plain form
803 -1091 932 689 -507 -934 -178 1918 1375 -1516 3279 3404 -1863 4491 951 -4109 1421 -2499
819 -2499 -4746 -2290 -4050 -3590 -7140 -4734 801 -6506 -3839 2141 -3574 690 1354 -1350 1141 832
835 832 374 -635 -3781 -207 -1059 -8276 -842 -1879 -3646 -1861 -1486 732 -818 -131 4173 -349
851 -349 -632 3463 -2640 -3462 1601 -4427 -3800 -3392 -2614 -2685 -4088 232 544 -2162 4328 4819 116 7685
869 7685 6106 2685 6143 4919 4498 2172 2401 4573 1392 1608 5886 1730 3388 7017 4494 4677
885 4677 4828 5754 2922 1016 4140 1379 -5226 -2013 -1878 -7848 -5206 -3652 -7725 -8033 -3854 -2892
901 -2892 -8157 -2855 1213 -4311 -3987 1059 -3152 -6711 -1725 -2856 -6028 -4178 -1276 -4098 -5764
916 -5764 972 544 -2021 2479 5080 1009 3819 6320 3744 2297 2807 3588 -1447 -490 2231 -1805
932a805j011K899J78k083L561J41p41j04M042k045k860L305Q98n936N74M054n429
949b362j419N217l150l06M311O74k192O42N093m138k382N790l58p675M838j855
965G28k739J91K98jm492M067J327m152K322N229m233j580M608l120m97K96K174
982D26l181l086N430l097l081M918P97l396M030K619j611j098L228J856n648L563
998B669J839n125l78M079n233j057M554k952j197J542L556l674j165N969j867
1013A560l245L032o42k266J832m08r55k453K000L072p014L291N034m575L78N102
1029C743q46j443P64K367k157k480N034k817m636O956k556n227M638J228l641
1044a073L33L555j568k272K502L134o715K487J973m952P5K887k234k430J519J412
$$ plain form
932 -1805 -2816 83 261 -1822 1739 1880 1139 1035 5077 3032 172 3477 4375 -1561 -987 3067 -2362
949 -2362 -3781 1436 -1714 -2020 2291 2965 773 1415 6508 2370 -12 5778 5420 -2255 2583 728
965 728 -2011 -1820 -1522 -1523 -6015 -1948 -621 -4773 -2451 2778 -1455 -3035 1573 -1547 -2044 -1748 426
982 426 -2755 -5841 -411 -3508 -6589 -1671 -874 -4270 -240 2379 768 -330 2898 4754 -894 2669
998 2669 4508 -617 -995 3084 -2149 -3206 1348 -1604 -2801 -1259 2297 -1377 -2542 3427 1560
1013 1560 -1685 1347 705 -1561 271 -137 -1092 -3545 -1545 1527 -5487 -2196 2838 -1737 -1359 3743
1029 3743 2897 1454 2218 4585 2428 -52 4982 2165 -2471 4485 1929 -3298 1340 2568 -1073
1044 -1073 -740 2815 1247 -1025 1477 4611 -2104 383 2356 -2596 -2521 366 -1868 -4298 -2779 -1367
1060a367j134k695M956O7m348N719j349k333K274J109j553j072J776O89l689J652
1076a298K865l225P78L020j690k142L067J284l428K674K302l600j220M070j399
1091B058l995K886M01j312p44R71o34j43J165Q57k351M22K793j500k076L505j541
1108G62j174J95M71k882P55J302J56k473K495J771k746J076k37J57j687K881J95
1125A017k235K330K70j425l98K926k779j417K066J217j379O25J959k343O35j28
1141I41N65j683L29K792k598L35N25j723N50M37j28n94J41J135m26k637J995J070
1159A026l481J567J168j195k66J169N34j135j15J688l446m07L540k333k59P56
1175a189n52J443j460J136P10j525J824r2p74J046m18m52J13p15R93j11j619J602
$$ plain form
1060 -1367 -2501 -5196 -240 -173 -4521 1198 -151 -2484 -210 899 -654 -1726 50 739 -2950 -1298
1076 -1298 1567 -1658 -880 2140 450 -1692 1375 2659 -769 1905 4207 607 -613 3457 2058
1091 2058 -1937 949 1350 38 -706 265 -369 -512 653 1510 -841 -419 2374 874 -1202 2303 762
1108 762 -412 -217 254 -2628 -1873 -571 -415 -2888 -393 1378 -1368 -292 -529 -372 -2059 822 1017
1125 1017 -1218 1112 1382 -43 -441 2485 -294 -1711 355 1572 193 818 2777 434 1069 941
1141 941 1506 -177 152 2944 346 681 1206 -517 33 470 342 -252 -111 1024 598 -2039 -44 1026
1159 1026 -2455 -888 280 -915 -1181 -12 522 -613 -728 960 -2486 -2893 647 -1686 -1945 -1189
1175 -1189 -1741 -298 -1758 -622 88 -1437 387 295 -479 567 149 -303 -190 -905 88 -23 -1642 -40
1193d0R10k707K971q11j464K628j078R03J14k89O70j892J833j47j242P12m85j198
1211f12J584n14j111J927k067J641q65J088Q51j098J45m41J170q71P83j000l1
1228E79j465J31N74j456J684P01m43M21l68n00J774j289J199n77o76l13n43j085
1246a652J460k168j64J479q99o44J731j104Q29M52j95P49j500L57j296K023j183
1263a725n94R16p34K75k91J491k233K473J7L74K076p64P3O82m24k76K13p71J118
1282A896j565L73M06j394O23O06L38Q03r7K03m09rK2L02m11R6j073j107o42O70
1302c69N25j393J126q57J914o77n89J929l5O34k22O98q33k75q29k6p02m53l13
1321g47l41K39O2p3M70l7P44m6j253O99R74k354J145j565l28j031m62l07M23N08
$$ plain form
1193 -40 870 -1837 1134 323 -1141 1487 409 1312 1426 1137 1807 -85 1748 1601 359 1071 586 -612
1211 -612 972 458 -653 1274 -793 848 -17 1071 1922 824 969 528 1698 827 1610 610 579
1228 579 -886 -755 -181 -1637 47 748 305 726 358 -142 1632 343 1542 965 289 -24 -567 -1652
1246 -1652 -192 -2360 -2524 -1045 -1944 -2588 -857 -1961 -1132 -680 -875 -126 -1626 -1269 -2565 -542 -1725
1263 -1725 -2319 -1403 -2137 -1862 -2153 -662 -2895 -422 -405 -31 2045 1281 1354 2036 1612 1336 1549 778 1896
1282 1896 331 704 1110 -284 339 945 1283 2086 1989 2192 1783 1774 1796 2098 1687 1783 710 -397 -1039 -369
1302 -369 156 -1237 -111 -968 946 269 -320 1609 1574 2208 1986 2684 1851 1576 747 721 19 -434 -747
1321 -747 -1088 -849 -787 -860 -390 -427 317 271 -982 -283 691 -1663 -518 -2083 -2411 -3442 -3904 -4211 -3788 -3280
1341c280L37k09O21J756k77r17J715l52J391k84j331O80l01P17p78m03J586k32
1359D39n52J993J98l74J329n69k14k15K31R02l81l58o52q24L78J124j793o58O68
1378F72p26O25j480K809l93q40J579j111m53J189j83j971K25P33l03j627J127
1395a28Q26j760J856P0m35n01K139j122r43J488m9k024p43J318j338q30J002R3
1413a081j316M16Q50j046J015Q93K41k902J854J857l603J079L042l301r09J312
1429a599L48j745J488K360l131l57N312k165j853L170p66j667K21K190j443o16
1445b53R01N09l184K142K263m437J912J953n76k345L224J285l067q4L271l110
1461D04j701L826k602j599K267M50j892J54L762k198l693N351P28m311K321K344
$$ plain form
1341 -3280 -2943 -3152 -2531 -775 -1052 -1969 -254 -606 785 501 -830 -150 -451 266 -512 -915 671 439
1359 439 -113 1880 2078 1704 3033 2464 2250 2035 2266 3168 2787 2429 1777 953 1331 2455 662 4 672
1378 672 -54 571 -909 1900 1507 667 2246 1135 682 1871 1688 -283 -58 675 372 -1255 -128
1395 -128 698 -1062 794 864 429 -72 2067 945 2 1490 1441 -583 -1326 -8 -1346 -2176 -1174 -1081
1413 -1081 -2397 -1981 -1131 -2177 -1162 -269 -28 -2930 -1076 781 -2822 -1743 1299 -2002 -2911 -1599
1429 -1599 -1251 -2996 -1508 852 -2279 -2636 2676 511 -1342 1828 1062 -605 -384 1806 363 -253
1445 -253 648 1157 -2027 115 2378 -2059 -147 1806 1230 -1115 2109 3394 327 243 3514 404
1461 404 -1297 2529 -73 -1672 595 1045 -847 -693 3069 871 -2822 2529 3257 -1054 1267 3611
1477C611l773k087M773k002l089L304K691m797P1L937m232m97L808j036k510K481
1493F53K012l330J32K554l108k171L377J980m894J149M840m502k526N333%n086
1509c587L848K568m993k33N210l446l644N681J192o992K912N259n785q95N897
1524B992j505n597M318K959n986J071M635l378l573O807q08n912L506M397o277
1539b351r81N515m56n697L837M320p050J297O859m789m244P262r10o164L451N038
1555D937o622j720Q949m334o660Q301K239q261J863P235o217l684O485J03o909
1570d295M844M566q358P78P137m131m062N037J780o324J300O552o522k637Q830
1585D495k573p570P708L079r004k1Q626l559p390Q899J300j0984N689O560q063
$$ plain form
1477 3611 -162 -2249 2524 522 -2567 737 3428 -1369 -1298 2639 -1593 -2090 1718 682 -1828 653
1493 653 2665 -665 -533 2021 -1087 -3258 119 2099 -2795 -1646 3194 -1308 -3834 1499 1499 -3587
1509 -3587 261 2829 -2164 -2397 2813 -633 -4277 1404 2596 -4396 -1484 3775 -2010 -2905 2992
1524 2992 1487 -4110 208 3167 -2819 -1748 2887 -491 -4064 2743 1935 -3977 -471 3926 -2351
1539 -2351 -3332 2183 1727 -3970 -133 4187 -2863 -1566 5293 504 -3740 3522 2612 -3552 -101 4937
1555 4937 -1685 -3405 5544 1210 -5450 2851 5090 -3171 -1308 5927 -290 -3974 2511 2614 -4295
1570 -4295 549 5115 -3243 -2465 4672 541 -3521 1516 3296 -3028 -1728 4824 -1698 -4335 4495
1585 4495 1922 -5648 2060 5139 -3865 -3886 4740 1181 -6209 2690 3990 -6994 -1305 5255 -2808
1600b808j561Q814j915p698O695M119j0846K563R120o797m322R245j493r304O164
1615b4N251q086j797R058l989p317P888L454r750K125Q491o695m482R236J270
1630D633j0882M853Q450j1046k53J0114n032p063Q566L232j1321M292Q073q045
1644a429m807J2969k953j0593Q596N940j2954J717J0673o068q313J0728N84j1267
1658g177N720Q876j0939j617J2205m316q745P129N416j1181O11J0370o885p607
1672h140J1921J052j1486M837P998r151l088J1576l552r146Q723O108j2136O31
1686c853J1549q708o366J1458J77j2805P337R083j2701r23J2408n305j0235J2438
1700C554L835j3913M034J0363r530n507J3210k600j1342P915O629j0460j540J2562
$$ plain form
1600 -2808 -4369 4445 2530 -5168 1527 5646 -5200 -2637 6483 -314 -4636 4609 3116 -6188 -24
1615 -24 5227 -2859 -4656 4402 413 -6904 984 4438 -5312 -3187 5304 -1391 -5873 3363 4633
1630 4633 -6249 -1396 7054 -3992 -4245 5869 837 -6226 2340 5572 -5749 -1457 6616 -1429
1644 -1429 -6236 6733 3780 -6813 1783 7723 -5231 -3514 7159 1091 -7222 3506 4090 -7177
1658 -7177 -1457 7419 -3520 -5137 7068 2752 -5993 1136 6552 -4629 -4018 6352 -533 -8140
1672 -8140 3781 4833 -6653 -1816 6182 -2969 -6057 5519 1967 -7179 1544 7652 -4484 -3853
1686 -3853 7696 -1012 -7378 4080 4257 -8548 -1211 7872 -4829 -5752 6656 1351 -8884 3554
1700 3554 7389 -6524 -2490 7873 -1657 -7164 6046 3446 -7896 19 6648 -3812 -5352 7210
1714G210n372r414J1511K937j2464M168J0834j0561m733J1664j262j2136Q338
1727G20P342j2488q12J2980o372j0341J3126K879j4662O091R373r966m204J2416
1741F082l813j0594Q675O771j3622P50J3847j0416o641J1865K050j2289O127R999
$$ plain form
1714 7210 1838 -7576 3935 6872 -5592 -1424 9410 -1151 -5884 5780 4518 -7618 720
1727 720 8062 -4426 -5238 7742 1370 -8971 4155 7034 -7628 -1537 7836 -2130 -6334 6082
1741 6082 2269 -8325 350 7121 -6501 -5751 8096 -2320 -8961 2904 4954 -7335 -1208 8791
$$ [...]
8191D46
##END NTUPLES=NMR FID
##END=
