##TITLE=1H_SA_62.238
 DMSO-d6, 108 sc, 
 23.12.2020
##JCAMPDX= 6.0         $$ Bruker NMR JCAMP-DX V2.0
##DATA TYPE= NMR FID
##DATA CLASS= NTUPLES
##ORIGIN= UXNMR, Bruker Analytische Messtechnik GmbH
##OWNER= root
$$ XWIN-NMR		Version 3.5
$$ Wed Dec 23 12:36:10 2020 Russian Standard Time (UT+4h)  she@DPX200
##.OBSERVE FREQUENCY= 200.1315066352
##.OBSERVE NUCLEUS= ^1H
##.DELAY= (6, 6)
##.ACQUISITION MODE= SIMULTANEOUS
##.ACQUISITION SCHEME= undefined
##.AVERAGES= 108
##.DIGITISER RES= 18
##SPECTROMETER/DATA SYSTEM= spect
##.PULSE SEQUENCE= zg30
##.SOLVENT NAME= DMSO
##.SHIFT REFERENCE= (INTERNAL, DMSO, 0, 15.7039)
##AUDIT TRAIL= $$ (NUMBER, WHEN, WHO, WHERE, WHAT)
$$ ##TITLE= Audit trail, XWIN-NMR		Version 3.5
$$ ##JCAMPDX= 5.01
$$ ##ORIGIN= Bruker BioSpin GmbH
$$ ##OWNER= she
$$ F:/spectra/data/she/nmr/H-F/1/audita.txt
$$ ##AUDIT TRAIL=  $$ (NUMBER, WHEN, WHO, WHERE, WHAT)
(   1,<2020-12-23 12:33:55.84 +0400>,<she>,<DPX200>,
      <continue with go, POWCHK disabled, PULCHK disabled
       configuration hash MD5:
       00 E9 B6 7A A2 85 ED C7 34 08 36 98 17 FE 4E 26
       data hash MD5: 16K
       F8 21 42 E8 9B ED 5F 01 88 5D E1 FD C0 EE CD 5A>)
$$ ##END=
$$ 
$$ hash MD5
$$ FD 89 5B 54 1A B4 90 C7 7A 38 13 9B 97 3E 4C A6
##$RELAX= 
##$RELAX= 
##$RELAX= 
##$RELAX= 
##$RELAX= 
##$RELAX= 
$$ Bruker specific parameters
$$ --------------------------
##$DU= <F:/spectra>
##$EXPNO= 1
##$NAME= <H-F>
##$PROCNO= 1
##$TYPE= <nmr>
##$USER= <she>
##$AMP= (0..31)
100 100 100 100 100 100 100 100 100 100 100 100 100 100 100 100 100 100 
100 100 100 100 100 100 100 100 100 100 100 100 100 100 
##$AQSEQ= 0
##$AQ_mod= 1
##$AUNM= <au_zg>
##$AUTOPOS= <>
##$BF1= 200.13
##$BF2= 200.13
##$BF3= 200.13
##$BF4= 200.13
##$BF5= 200.13
##$BF6= 200.13
##$BF7= 200.13
##$BF8= 200.13
##$BYTORDA= 1
##$CFDGTYP= 0
##$CFRGTYP= 5
##$CHEMSTR= <none>
##$CNST= (0..31)
1 1 145 1 1 1 1 1 1 1 1 1 1 1 1 1 1 1 1 1 1 1 1 1 1 1 1 1 1 1 1 1 
##$CPDPRG= <>
##$CPDPRG1= <>
##$CPDPRG2= <>
##$CPDPRG3= <>
##$CPDPRG4= <mlev>
##$CPDPRG5= <mlev>
##$CPDPRG6= <mlev>
##$CPDPRG7= <mlev>
##$CPDPRG8= <mlev>
##$CPDPRGB= <>
##$CPDPRGT= <>
##$D= (0..31)
0 1.2 0 0 0 0 0 0 0 0.06 0 0.03 0 0 0 0 0.0002 0 0 0 0 0 0 0 0 0 0 0 0 
0 0 0 
##$DATE= 1608712054
##$DBL= (0..7)
120 120 120 120 120 120 120 120 
##$DBP= (0..7)
150 150 150 150 150 150 150 150 
##$DBP07= 0
##$DBPNAM0= <>
##$DBPNAM1= <>
##$DBPNAM2= <>
##$DBPNAM3= <>
##$DBPNAM4= <>
##$DBPNAM5= <>
##$DBPNAM6= <>
##$DBPNAM7= <>
##$DBPOAL= (0..7)
0.5 0.5 0.5 0.5 0.5 0.5 0.5 0.5 
##$DBPOFFS= (0..7)
0 0 0 0 0 0 0 0 
##$DE= 6
##$DECBNUC= <off>
##$DECIM= 32
##$DECNUC= <off>
##$DECSTAT= 4
##$DIGMOD= 1
##$DIGTYP= 9
##$DL= (0..7)
0 120 120 120 120 120 120 120 
##$DP= (0..7)
150 150 150 150 150 150 150 150 
##$DP07= 0
##$DPNAME0= <>
##$DPNAME1= <>
##$DPNAME2= <>
##$DPNAME3= <>
##$DPNAME4= <>
##$DPNAME5= <>
##$DPNAME6= <>
##$DPNAME7= <>
##$DPOAL= (0..7)
0.5 0.5 0.5 0.5 0.5 0.5 0.5 0.5 
##$DPOFFS= (0..7)
0 0 0 0 0 0 0 0 
##$DQDMODE= 0
##$DR= 18
##$DS= 0
$$ [...]
##$SUBNAM2= <"">
##$SUBNAM3= <"">
##$SUBNAM4= <"">
##$SUBNAM5= <"">
##$SUBNAM6= <"">
##$SUBNAM7= <"">
##$SUBNAM8= <"">
##$SUBNAM9= <"">
##$SW= 16.9725356469052
##$SWIBOX= (0..15)
0 0 2 0 0 0 0 0 0 0 0 0 0 0 0 0 
##$SW_h= 3396.73913043478
##$TD= 16384
##$TD0= 1
##$TE= 0
##$TE2= 300
##$TE3= 300
##$TEG= 300
##$TL= (0..7)
0 120 120 120 120 120 120 120 
##$TP= (0..7)
150 150 150 150 150 150 150 150 
##$TP07= 0
##$TPNAME0= <>
##$TPNAME1= <>
##$TPNAME2= <>
##$TPNAME3= <>
##$TPNAME4= <>
##$TPNAME5= <>
##$TPNAME6= <>
##$TPNAME7= <>
##$TPOAL= (0..7)
0.5 0.5 0.5 0.5 0.5 0.5 0.5 0.5 
##$TPOFFS= (0..7)
0 0 0 0 0 0 0 0 
##$TUNHIN= 0
##$TUNHOUT= 0
##$TUNXOUT= 0
##$USERA1= <user>
##$USERA2= <user>
##$USERA3= <user>
##$USERA4= <user>
##$USERA5= <user>
##$V9= 5
##$VALIST= <valist>
##$VCLIST= <CCCCCCCCCCCCCCC>
##$VD= 0
##$VDLIST= <DDDDDDDDDDDDDDD>
##$VPLIST= <PPPPPPPPPPPPPPP>
##$VTLIST= <TTTTTTTTTTTTTTT>
##$WBST= 1024
##$WBSW= 4
##$XGAIN= (0..3)
0 0 0 0 
##$XL= 0
##$YL= 0
##$YMAX_a= 1363213
##$YMIN_a= -972326
##$ZGOPTNS= <>
##$ZL1= 120
##$ZL2= 120
##$ZL3= 120
##$ZL4= 120
##$ABSF1= 10
##$ABSF2= 0
##$ABSG= 5
##$ABSL= 3
##$ALPHA= 0
##$AQORDER= 0
##$ASSFAC= 0
##$ASSFACI= 0
##$ASSFACX= 0
##$ASSWID= 0
##$AUNMP= <proc_1d>
##$AZFE= 0.1
##$AZFW= 0.1
##$BCFW= 1
##$BC_mod= 2
##$BYTORDP= 1
##$COROFFS= 0
##$CY= 11.3945322036743
##$DATMOD= 1
##$DC= 2
##$DFILT= <>
##$DTYPP= 0
##$F1P= 15.9154993809931
##$F2P= -4.1035820241983
##$FCOR= 0.5
##$FTSIZE= 0
##$FT_mod= 4
##$GAMMA= 1
##$GB= 0.15
##$INTBC= 1
##$INTSCL= 1
##$ISEN= 128
##$LB= 0.24
##$LEV0= 0
##$LPBIN= 0
##$MAXI= 10000
##$MC2= 0
##$MEAN= 0
##$ME_mod= 0
##$MI= 1.114404
##$NCOEF= 0
##$NC_proc= 0
##$NLEV= 6
##$NOISF1= 3.799351
##$NOISF2= 2.8
##$NSP= 1
##$NTH_PI= 0
##$NZP= 0
##$OFFSET= 15.70392
##$PC= 1
##$PHC0= -10773.11
##$PHC1= 24.80095
##$PH_mod= 1
##$PKNL= yes
##$PPARMOD= 0
##$PSCAL= 0
##$PSIGN= 0
##$REVERSE= no
##$SF= 200.130013532006
##$SI= 16384
##$SIGF1= 3
##$SIGF2= 2
##$SINO= 400
##$SIOLD= 16384
##$SREGLST= <1H.CDCl3>
##$SSB= 0
##$STSI= 0
##$STSR= 0
##$SW_p= 3612.71676300578
##$SYMM= 0
##$S_DEV= 0
##$TDeff= 0
##$TDoff= 0
##$TI= <>
##$TILT= no
##$TM1= 0
##$TM2= 0
##$TOPLEV= 0
##$USERP1= <user>
##$USERP2= <user>
##$USERP3= <user>
##$USERP4= <user>
##$USERP5= <user>
##$WDW= 1
##$XDIM= 8192
##$YMAX_p= 0
##$YMIN_p= 0
$$ End of Bruker specific parameters
$$ ---------------------------------
##NTUPLES= NMR FID
##VAR_NAME=  TIME,          FID/REAL,        FID/IMAG
##SYMBOL=    X,             R,               I
##VAR_TYPE=  INDEPENDENT,   DEPENDENT,       DEPENDENT
##VAR_FORM=  AFFN,          ASDF,            ASDF
##VAR_DIM=   8192,          8192,            8192
##UNITS=     SECONDS,       ARBITRARY UNITS, ARBITRARY UNITS
##FACTOR=    0.0002944,     1,               1
##FIRST=     0,             0,               0
##LAST=      2.4114304,     0,               0
##MIN=       0,             -972326,         0
##MAX=       2.4114304,     1363213,         0
$$ Real data points
##PAGE= N=1
##DATA TABLE= (X++(R..R)), XYDATA
0@%%%%%%%%%%%%%%j3J21k16K16k16K16l24M32m32N40o48P56q64R72j168J293j430
31g65J638j876K179k473K754l089L474l895M338m821N359n953O596p294Q059q896
47d665R799j0800J1896j3100J4434j5909J7558j9402K1474k3820K6521k9667L3360
60A7679l7785M3205n0004N8836p0823Q8085j15210J64088k78718J032601N11259
71A363213k335539L79159J422197r1739j213242O2022Q05946R7691m87329k91327
81b88948Q5512Q02794j50396j101443L40049J147622n56174j041983O03328Q83024
91G23385p10983o29429O45345L24488m95161l5094J23502l3207K41998q1917m48188
102c75261K73763N28720m45573n37447O32197M11081q07657j25640P62003k05110
$$ plain form
0 0 0 0 0 0 0 0 0 0 0 0 0 0 0 0 -13 108 -108 108 -108 108 -216 216 -216 324 -324 432 -432 540 -628 665 -765
31 -765 873 -1003 1176 -1297 1457 -1632 1842 -2053 2285 -2536 2823 -3130 3466 -3828 4231 -4665
47 -4665 5134 -5666 6230 -6870 7564 -8345 9213 -10189 11285 -12535 13986 -15681 17679
60 17679 -20106 23099 -26905 31931 -38892 49193 -66017 98071 -180647 851954 1363213
71 1363213 -972326 -593167 829030 737291 -475951 -413929 392017 489708 2379 -288948
81 -288948 -203436 599358 448962 -652481 -312432 835190 279016 -762967 -159639 723385
91 723385 12402 -617027 28318 352806 -142355 -177449 -53947 -87154 154844 72927 -375261
102 -375261 -101498 427222 -18351 -555798 76399 487480 -320177 -445817 316186 111076
112A11076m71915L03394J88385k52851M9884J82488k45913K2226L97691k99988
122a5523l37409N65832R4527o22850J54367N14644l06460l71840M12578J59246
132B47112m15952Q7761K97929k64038n7016L27601k05109k10024L66760K3321
142A98345m26158J50414L77386l35999k62613M32203N2730m52494J84454K89013
152B07281l22724m0215K97883j39841j98557K81192N2745l58776J50706L21443
162B51137l48401j54430M33857p7529l51836K37531K11307k97405l4456L19169
172A88944j41564k09366K91347M6194l28134J63938K46649l11000p6850L33449
182B03607q8825k93989K20214J77431l09377j5273L08538j62943k09794K92892
$$ plain form
112 111076 -360839 -57445 130940 -121911 -72027 110461 -135452 -113226 284465 -15523
122 -15523 -352932 212900 307427 -315423 -161056 353588 47128 -324712 87866 247112
132 247112 -168840 -81079 216850 -47188 -104204 223397 18288 -191736 175024 198345
142 198345 -227813 -77399 299987 -36012 -298625 133578 186308 -266186 -81732 207281
152 207281 -115443 -155658 142225 2384 -196173 85019 137764 -221012 -70306 251137
162 251137 -97264 -251694 182163 104634 -247202 -9671 201636 -95769 -130225 188944
172 188944 47380 -161986 129361 175555 -152579 11359 258008 -52992 -129842 203607
182 203607 114782 -179207 41007 218438 -90939 -106212 202326 39383 -170411 122481
192A22481J0319k87986J53091J81738k50915p0705K85315q9314k64567K26891
202A6348J35240l18768N2787K72084k08658j28312K58194k150k46555J33078J87632
213A50920k43139n0752K82519j13901k19555K45940O9052k66883P7628K13089
223A44918j69017j25760K44322R32k42060J45871J67736k44357j4059K47847j34378
234B1995j52218J96775M7449k18746N6640J99448j75320j05474K43835m1486k16075
245a43177J72928R8601k11576J8437J84840j04355j42820J87573M0389k26769
255a25929R3879J70777j97741n1969K17896p3819j59519J44455Q8825j88434N184
266g6395K00887j25045j26449K01337P360j99427J11937J22819j68110k8804J73834
$$ plain form
192 122481 132800 -155186 -2095 179643 -71272 -141977 143338 54024 -210543 16348
202 16348 151588 -167180 -114393 157691 -50967 -179279 78915 76765 -169790 -36712 150920
213 150920 -92219 -142971 139548 25647 -193908 52032 121084 -145799 -68171 144918
223 144918 -24099 -149859 94463 95395 -146665 -794 166942 -77415 -91474 156373 21995
234 21995 -130223 66552 114001 -104745 -48105 151343 -23977 -129451 114384 72898 -143177
245 -143177 29751 128352 -83224 -64787 120053 15698 -127122 60451 100840 -125929
255 -125929 -32050 138727 -59014 -110983 106913 33094 -126425 18030 106855 -81579 -76395
266 -76395 124492 -553 -127002 74335 81695 -117732 -5795 117024 -51086 -79890 93944
277I3944m9698j59254J43527Q4406j97017L6571J70687j32588q5131J74299j8995
288F0751j48749Q6845J06790j43416l8867J77735p2603j35389J48668M1870j69071
299h5436N3174J25603j16621o1941J41044n711j51248R4114R8763j57659M54J51870
311H6406q5317r8558J34958J8867j38913M8680J14362j10460o1075J54759l2741
322C0968j29063J08706O5410j36793J6452J25320p7705p5372J14093K3909j32712
333f6787N3047J04494j16682l2518J29587l9399j02113R4689M6235j10492J3414
344b6525J05982o5425p7454J17435N319j20115O0840P6736j05434j9653J05192
355E6898m3142q0971P7072M2588j09341J8077J02114q1181m9915J05818j0784
$$ plain form
277 93944 44246 -115008 28519 112925 -84092 -47521 123166 -9422 -94553 79746 60751
288 60751 -87998 -1153 105637 -37779 -76646 101089 28486 -106903 41765 83635 -85436
299 -85436 -32262 93341 -23280 -85221 55823 50112 -101136 -7022 91741 -65918 -65464 86406
311 86406 1089 -97469 37489 56356 -82557 -33877 80485 -29975 -91050 63709 30968
322 30968 -98095 10611 76021 -60772 -44320 81000 3295 -72077 42016 65925 -66787
333 -66787 -13740 90754 -25928 -58446 71141 31742 -70371 24318 70553 -39939 -26525
344 -26525 79457 14032 -63422 54013 59332 -60783 57 76793 -28641 -48294 56898
355 56898 13756 -67215 9857 52445 -56896 -38819 63295 -17886 -67801 38017 27233
366B7233r5757O2463N3657q8334j0174Q9065l5802p9638Q5026K8748r9765L3647
378b9631Q0455p3274k9929R0175j4661p1786N0285N3172p9428j0854R2519n1930
390E113n8058Q1121Q951q0551L6201N8075o1242k2911P3485n330p4729N8432M0897
403E9454q2732J0997O8208m8994m2113O4796J753o3233K4845N3042n4236k5252
415c3465P7947k3041n6335N8747K0993o4256J2860N1007l8580l6208M9140J0254
427B9063o9658L0986M6047o3903m211N6931k5094l8833M3458J7403m9709M280
439b3240N2373l6606l5216N9602j0918n1088L5821K2275m2075j972M4205j6186
451c025l2746L8889K2366n1897J8280M3469m1924r055M0682j0211l4820K3123
$$ plain form
366 27233 -68524 -6061 47596 -40738 -50912 38153 2351 -77287 7739 36487 -63278 -29631
378 -29631 50824 -22450 -52379 37796 23135 -48651 1634 54806 -24622 -35476 57043 5113
390 5113 -52945 28176 37127 -43424 -7223 50852 -10390 -33301 40184 34854 -39875 18557 59454
403 59454 -23278 -12281 55927 6933 -35180 29616 31369 -31864 -7019 46023 -8213 -33465
415 -33465 44482 21441 -34894 23853 44846 -19410 -6550 44457 5877 -30331 18809 29063
427 29063 -40595 -9609 36438 -27465 -31676 25255 161 -38672 4786 22189 -27520 -23240
439 -23240 29133 -7473 -42689 16913 5995 -45093 -9272 13003 -29072 -31044 13161 -3025
451 -3025 -35771 3118 25484 -26413 -8133 35336 -6588 -15643 25039 14828 -19992 3131
463C131K1622l6732p293M4349j8461l5592M5334M939l8680J9796K3726k5435j3236
476a2532L2779p582l3707K0418K2606m3971K781L7185k8859j0981K7641K625k4114
489a5711J2239K4243k1074r802L4539q393k9985K9699O641k8195O300J8505j3413
502E593j5166K2951K803k3178J1897K2570k6116k999K9029j8007j5049J6082N756
515A6166k3438n00J7548j6672j3135J9302j303k3179J8313R828j9621M156J6176
528C641n816j4532J3824O372j8270J884J6246j3054q986J9220o702j0210J1759
541d624P976j0656K73J8214n292j2111J4279P531j7798N956R795j4177o08R023
555G781n930q950R956O538j3066l7J6659p709r239J5525m234o364N167J436n494
$$ plain form
463 3131 24753 -11979 -19272 25077 6616 -28976 16358 21297 -17383 2413 26139 704 -12532
476 -12532 20247 12665 -21042 -624 21982 -21989 -19208 17977 -10882 -21863 5778 8403 -15711
489 -15711 -3472 20771 -303 -10105 24434 16041 -13944 15755 22396 -5799 501 19006 5593
502 5593 -9573 13378 16181 -6997 4900 27470 1354 -1645 27384 9377 -5672 10410 16166
515 16166 -7272 -7772 9776 -6896 -20031 -729 -2032 -25211 -6898 2930 -16691 -12535 3641
528 3641 -2175 -16707 -2883 3489 -14781 -12897 3349 -9705 -18691 529 -6173 -16383 -4624
541 -4624 3352 -7304 -7031 11183 5891 -6220 8059 15590 -2208 3748 13543 -634 -1242 7781
555 7781 1851 -7099 2857 9395 -3671 -3708 12951 5242 -3997 11528 7294 930 6097 7533 2039
570B039l903P607j937j1036N727P986j2713K228Q865m818j7K825K083m676n56
585b96O616o523n149R038m247j0684J0387k489m727K242J053J151k390M156J385
600d77m783N375N413j0803N171M798p862L171k294K059k49j635N572l593l46O839
616F356k747l027R074m217j156J700j576M450o934J37K024k950j626K105n209
631c596K147L703n985L041L92K425k198l949N721l105k854K640j104m177O690
646b09o112K31M483j890K302l868N576J710m781K563K641k762L700j395l340O891
662E740n558J915K82l898N715k146j604Q65R94o93J152k301K571o37k261J883
678B019l039K214J505n301J129K845l878j91L046m006L332j383o18j23O10L501
$$ plain form
570 2039 -1864 5743 3806 -7230 -1503 6483 -6230 -4002 4863 45 28 2853 4936 260 -296
585 -296 6320 -203 -5352 3686 -561 -11245 -858 -3347 -8074 -5832 -4779 -3628 -6018 -1862 -477
600 -477 -5260 115 5528 -5275 -104 4694 -3168 3 -2291 -232 -481 -2116 3456 -137 -483 6356
616 6356 3609 582 9656 5439 4283 5983 4407 8857 1923 2060 4084 1134 -492 1613 -3596
631 -3596 -1449 2254 -3731 -690 -298 2127 -71 -4020 1701 -1404 -4258 -1618 -2722 -6899 -209
646 -209 -6321 -6090 -1607 -3497 -1195 -5063 513 2223 -2558 5 2646 -116 3584 2189 -1151 5740
662 5740 182 2097 2379 -1519 4196 2050 446 1311 2305 1612 2764 463 3034 2397 136 2019
678 2019 -1020 1194 2699 -2602 -1473 1372 -2506 -2697 349 -3657 -325 -1708 -2326 -2449 -1839 1662
694A662n285J180L556l067o99J911p61Q75R04k730L190j119K80k68p55K392P51
711B017r50j602J988J426L83m369L920J012l140J590O69j109R0J39k764K577M55
728B332j407N61j841K519j872R69M37k521J656m78k495J668L059n195J338J324
744E4k437J911j667P29q4n1J71J112k42J402j216j334K684j886K078r16k718L992
762A582j681k711K009J437k080K682l33j892J189L77L299m860L227J425m088J478
778A060K56k853j11J705j489O16j927K084m98j286L809j852n54K089k127l61Q93
795e46k229J980j834k626N522m588J678J569l427L877K83r03P09J005J443p86
811A127j320L294r49m720O059l318o84K525k713L95J574J866k14j46j6L276m788
$$ plain form
694 1662 -3623 -2443 1113 -1954 -2653 -742 -1503 -628 276 -2454 736 -383 -103 -371 -1126 1266 2017
711 2017 1067 -535 1453 2879 3262 -1107 2813 3825 685 2275 2944 1835 1925 2064 -700 1877 2332
728 2332 925 1486 -355 2164 292 1261 1698 -823 833 355 -2140 -472 2587 -2608 -1270 54
744 54 -2383 -472 -2139 -1410 -1494 -1545 -1374 -262 -504 898 -318 -1652 1032 -854 1224 308 -2410 1582
762 1582 -99 -2810 -801 636 -1444 1238 905 -987 202 579 3878 -982 2245 3670 -418 1060
778 1060 1316 -1537 -1648 57 -1432 -816 -2743 -659 -1157 -2443 1366 -486 -1040 1049 -1078 -1439 -546
795 -546 -2775 -795 -2629 -5255 267 -4321 -2643 -1074 -4501 -624 -341 -1244 -535 470 1913 1127
811 1127 -193 3101 2152 -2568 3491 173 -511 2014 -699 -304 1270 3136 2922 2776 2760 6036 1248
828A248K741K521n181J683p35n73j348J09m8r88j735L622j172l223N327j903J16
845D61L02J274q30j390j53J425l407K83L169n489R02L910l219P51J648L01j549
862a611J019K315j557j577L501k282l551L422k158k673J398J185j849n99K032
877b985K42n23J045L695l174P08K818k917P21L11J405l350J133K015k398j054
893b308L701J510m022M967J213j004j57K811p87l114K770p1k399j635L702l621
909A556k806M368k444j275J206J745k586m6L269j825k633J612J603o013L445L61
925d63l267P4J302m40j737J656K027p06k062N695n22m207N387j536j397N38j37
942B05j349r98K908r04k033L48M051n305K888K911k811j42J530M91k797R12J293
$$ plain form
828 1248 3989 6510 1329 3012 2277 1704 356 465 417 -571 -2306 1316 144 -3079 2248 345 461
845 461 763 2037 1207 -183 -336 1089 -2318 -2035 1134 -4355 -3453 457 -2762 -2011 -363 -62 -1611
862 -1611 -592 1723 166 -1411 2090 -192 -3743 -321 -2479 -5152 -3754 -2569 -4418 -5017 -2985
877 -2985 -2743 -3266 -2221 1474 -1700 -992 1826 -1091 -370 -59 1346 -2004 -871 1144 -1254 -2308
893 -2308 1393 2903 -1119 3848 5061 4057 3900 6711 5924 2810 5580 5509 3110 1475 5177 1556
909 1556 -1250 3118 674 -601 605 2350 -236 -282 2987 1162 -1471 141 1744 -4269 -824 -463
925 -463 -3730 -3656 -2354 -2794 -4531 -2875 -848 -1554 -3616 2079 1557 -2650 2737 1201 -196 342 205
942 205 -1144 -2142 766 -138 -2171 -1823 2228 -3077 -189 2722 -89 -231 1299 1790 -1007 -95 1198
959A198k801k276N473m083k960M595p76j023O86K710j921p79L663N40k498J691
975A439K471l761K96K465m02k025n84K160k862J760J205j038j176M284Q1m240
991G3L824N3l207K84K326q37m605K130J156m267L42M946m177L50L395k378r55
1008a547J131K071k390M8K081k452q09K020p97k832K197Q53j102j211J972J024
1024B57l063K939K721m610J34K945k844j018K611j082j828J231K493l480j263
1039c857N578j494l652L755K05j143K43J758o35j274J982J150l081J313J393j767
1055D74J9J889j716q86K633l28p86j156K660j399j746L618j434k224J540j90j546
1072e78k039L880p61k431P93L449l487K02K061j623L8J023Q6j978P56P47j165
$$ plain form
959 1198 -1603 -3879 1594 -2489 -5449 -854 -1630 -2653 -1967 743 -1178 -1957 1706 2246 -252 1439
975 1439 3910 149 445 2910 2508 483 -101 2059 -803 957 2162 1124 -52 4232 4313 73
991 73 3897 3950 743 1027 3353 2516 -2089 41 1197 -3070 -2728 2218 -1959 -1609 1786 -592 -1547
1008 -1547 -416 1655 -735 -687 1394 -1058 -1867 153 -644 -3476 -1279 -426 -1528 -2739 -767 257
1024 257 -2806 133 2854 -1756 -1622 1323 -1521 -2539 72 -1010 -2838 -1607 886 -2594 -3857
1039 -3857 1721 227 -3425 330 535 -608 -365 1393 758 -516 1466 2616 -465 848 2241 474
1055 474 493 2382 666 -220 2413 2085 1299 143 2803 1404 -342 3276 1842 -382 1158 968 -578
1072 -578 -2617 1263 502 -1929 -1136 2313 -1174 -972 1089 -534 -496 527 613 -1365 -609 138 -1027
1089a027k07J572j892q6J247j6q98P04K089k423L87J601p32p46q3J441j694P03
1107f0K81j92l71K74Q59k149J958j381K007j860J000M06k542K221P38j840O4K253
1125A666k073p98J663l86j134m91J673k28j000J889j084q28J389M19j547J199
1141C29Q07o51m96M06P31k109J451K55q2n7K33j007j52P0J352L72k148K528j036
1160G96l97K84r61l5N39J051j080m33K78J727k312L89N16j585Q99L47j00Q37J54
1179I14n35K76o48L52k19r79J359k12j699Q15M42q74n70J037q92O88o36N29J128
1198B76J74M99k617J199o78J220r71O6R24j313L64J208L50k058J428q0o51J052
1216C92Q53L35p85j982J037M40n81J265p83k73l75o58K342l362J402J463k10O1
$$ plain form
1089 -1027 -1234 338 -1554 -1640 -393 -409 -1307 -603 1486 -937 -550 1051 319 -427 -510 931 -763 -60
1107 -60 221 29 -342 -68 791 -1358 600 -781 1226 -634 366 772 -1770 451 1189 -651 -587 1666
1125 1666 -407 -1205 458 72 -1062 -1553 120 -108 -1108 781 -303 -1131 258 677 -870 329
1141 329 1136 485 -11 395 1126 -983 468 723 641 584 817 -190 -342 -272 1080 1452 -696 1832 796
1160 796 399 683 -278 -313 226 1277 197 -236 42 1769 -543 -154 362 -1223 -324 23 -77 760 914
1179 914 379 655 7 359 140 -839 520 308 -1391 -576 -134 -1008 -1578 -541 -1433 -745 -1381 -852 276
1198 276 450 949 -1668 -469 -1147 73 -898 -832 92 -1221 -857 351 701 -1357 71 -9 -660 392
1216 392 1245 1580 795 -1187 -150 290 -291 974 191 -82 -457 -1115 1227 -2135 -733 730 520 581
1234E81N63r78J74P05j044Q31n11O19j067p62J028p94O64p08O36Q50k69M92m5
1253I65K22j121J637j887J72L82K75j486O17l46k14R75r95Q03m8R83j038j032
1271a136K043L37j944Q05q82n7r46R34k74M04m19o93N48p68R82J65p4N94N30K92
1291D41m02M63m57n25n50R23r24L51K46K56L85j53j8Q39n45J086o38Q53L38j59
1311A810j435M98k98p40n1QK00o25Q41j411J569r57J453j247J392m15K65J39k07
1330G89l0j93M35k87j55J9r77J243j031k88J624O87k81q88M29N1q33R6O53k453
1350a390J779j254K37o97Q50r86n05O04O65l89j004J526j01n21Q14j514O85n11
1368a712J356l04j452R50k05p56J581J023n93M65j037J050J93N26N23k072J136
$$ plain form
1234 581 1144 166 340 1045 1 832 321 940 -127 -889 139 -655 9 -699 -63 787 518 1010 965
1253 965 1187 66 1703 -184 -12 370 645 -841 -224 -570 -784 191 -804 -1 -49 934 -104 -1136
1271 -1136 907 1244 -700 105 -777 -834 -1780 -846 -1120 -716 -1135 -1828 -1280 -2048 -1066 -901 -975 -381 149 441
1291 441 39 502 45 -480 -1030 -107 -1031 -680 -434 -178 207 54 36 875 330 1416 778 1631 1969 1810
1311 1810 375 873 575 -165 -216 -208 -8 -633 208 -1203 366 -591 862 -385 1007 592 857 996 789
1330 789 759 566 1001 714 559 578 -399 844 -187 -475 1149 1836 1555 667 1096 1147 314 410 1063 -1390
1350 -1390 389 -865 -628 -1325 -475 -1461 -1966 -1362 -697 -1086 -2090 -564 -665 -1186 -372 -1886 -1201 -1712
1368 -1712 -356 -660 -2112 -1162 -1367 -2123 -542 481 -112 353 -684 366 559 1085 1608 -464 672
1385F72Q00r91m09M46m77j139K047m1q9j200J456j182l98J795l60o73l88K086
1403A955j910O56q48Q26q93O1J542k138K01K092o23j220Q92J882k698M15m29K159
1421A922j969J119P1j895o3O98P19j503J832r59o53Q55J272j360l68J842j420
1438A40j993K390k31k285Q39K000k409P09P38m42j543K377m51k899J585K436j457
1455d96j300L438k075j078K300n6j820p12L448j402j151P64J352k267L04K834
1471B083k667K33K365r63j804O83Q45j478O03K593k696j316L051j290k261K613
1487E94J931l418M20K025o22j242J292J162k486Q18J838k023m98J679o75k109
1503a314J380K350k661q85K456N97m025L512J59l631K092J425j919j121L160j259
$$ plain form
1385 672 1472 481 72 518 41 -1098 949 908 819 -381 1075 -107 -505 1290 930 257 -131 1955
1403 1955 45 701 -147 679 -214 -153 1389 -749 -548 1544 921 -299 593 2475 -223 192 -237 1922
1421 1922 -47 1072 1143 -752 -815 -117 602 -901 931 -28 -681 174 1446 86 -282 1560 140
1438 140 -1853 537 306 -1979 -1140 860 -1549 -840 -102 -544 -2087 290 -161 -3060 -1475 961 -496
1455 -496 -1796 1642 -433 -1511 789 733 -1087 -1799 1649 247 -904 -140 1212 -1055 -751 2083
1471 2083 -584 -351 2014 1051 -753 -70 775 -703 -100 2493 -203 -1519 1532 242 -2019 594
1487 594 2525 -893 -473 1552 930 -312 980 2142 -344 474 2312 289 -209 1470 795 -1314
1503 -1314 66 2416 -245 -1130 1326 1923 -2102 1410 1569 -2062 30 1455 -464 -1585 1575 316
1519C16k442K663J540m344R71L101j316l515M694l0l938J839K247l512n43M906
1535B637k328k607K840R07l490O97K731k049k312M117L89m263L062K285l479j759
1551b622L561o46k674M121J43l187p84M401l056j440L218N97l790K637J479k565
1567f07P2K570j004m179M669Q94n064J212L981k449k063L382L75l789J984K744
1583B728l578j410N138l033k465M132R9m719L061L277l886k009M796n10n876M500
1599B45K877o002J168L411k276j331M149J4n254L120M129o036j207N696j352m914
1615c563M767J232n328J907M679l925k871N689j020l609J704L540m997k72M109
1630B042p99n384M627K051n271J153M276l596k769O446o14o506M197L856n692
$$ plain form
1519 316 -2126 537 2077 -2267 -1296 1805 489 -3026 1668 1638 -2300 -461 1786 -1726 -2269 2637
1535 2637 309 -2298 542 1449 -2041 -1344 1387 -662 -2974 1143 1532 -2731 331 2616 -863 -2622
1551 -2622 939 293 -2381 1740 1883 -1304 -2088 2313 -743 -2183 1035 1632 -2158 479 1958 -607
1567 -607 -535 2035 1031 -3148 1521 2415 -2649 -1437 2544 95 -1968 1414 1789 -2000 -16 2728
1583 2728 -850 -2260 2878 -155 -2620 1512 1611 -3108 -47 3230 -656 -2665 2131 1621 -4255 245
1599 245 3122 -2880 -1712 1699 -577 -1908 2241 2255 -2999 121 4250 -1786 -2993 2703 1351 -3563
1615 -3563 1204 2436 -2892 -985 3694 -231 -3102 2587 1567 -2042 -338 3202 -1795 -2067 2042
1630 2042 1243 -4141 486 2537 -2734 -1581 2695 -901 -3670 2776 2162 -4344 -147 3709 -1983
1645a983r38N746l094l614O057L77o615K100N856n610j918O644l69p320O646J783
1661C748o428J864M657l252n141O715J222p606L371N552o045k154O355j445m174
1676b761L368L422o864O35P510n184m267O132Q8n508K940L760n917j692P118j485
1692A295n995O428J360o013R11O145n581k377O126o38m818K688M337o191o09P694
1708D762m167n225P168J67o725K808N655n205k446N951M6o440L927L880o770O23
1724a991N169k762o177Q223L57o315K234O171n356m179Q149j530n996N191K479
1739C667o627P58O606l884m263O145O94o615K774N811o555j378P888k132o845
1754c956O418J357p190K279N393m689l517O356q07n827L490M739n385k120P750
$$ plain form
1645 -1983 -2921 2825 -269 -3883 2174 2551 -4064 -1964 3892 -1718 -3636 3008 2639 -4681 1965 3748
1661 3748 -2680 -816 3841 589 -4552 2163 3385 -4221 -850 4702 -1343 -3497 2858 1413 -2761
1676 -2761 607 4029 -2835 -2200 5310 126 -4141 1991 2079 -3429 -489 3271 -2646 -4338 2780 1295
1692 1295 -4700 1728 3088 -2925 -2014 4131 -1450 -3827 2299 1661 -3157 -469 3868 -2323 -2932 4762
1708 4762 595 -4630 2538 2705 -4020 -1212 4443 -762 -3208 2743 2789 -3651 276 4156 -2614 -1991
1724 -1991 3178 416 -5761 2462 2819 -3496 -1262 4909 -447 -4626 3523 1993 -4003 1188 3667
1739 3667 -2960 -2202 4404 520 -3743 2402 3096 -3519 -745 5066 -1489 -2867 5021 2889 -3956
1754 -3956 2462 3819 -3371 -1092 4301 -388 -3905 2451 1644 -4183 -693 4046 -1339 -3459 4291
1769D291l006o593O573K334o810J833N810m914l110O981n36p842M851M610p471
1784b999j032P955k852n555O005K041o426K075M569n136l023P123m08p002O094
1799A429K854p973P33P292m757l453O344J327q032L411N615o114k289P400k790
1814I97m285M230K551n794M44N753l477n122Q750o02o498L218N060o517j472P754
1830D990l569n303N563K231n869K12O918n829l535P041l90o562M273L694m998
1845a133j537O681l092n549O351J537q539L617N817m430l933O669J14q630N801
1860b56N134p988M16O016k518n409O850K95o417J763O125n708KL319M18o700N711
1877A053L296q082O41P953m618n244P125O61o426K479M581o066K29N853l270n555
$$ plain form
1769 4291 1285 -5308 1265 3599 -3211 -1378 4432 -482 -3592 3389 2853 -4989 -138 4472 -2999
1784 -2999 -4031 3924 1072 -4483 1522 3563 -2863 -788 3781 -1355 -4378 2745 2337 -4665 1429
1799 1429 4283 -3690 -2957 4335 -422 -3875 2469 3796 -4236 -825 4790 -1324 -3613 3787 997
1814 997 -3288 942 3493 -2301 -1857 3896 419 -4703 4047 3445 -3053 165 5225 -1292 -2764 4990
1830 4990 1421 -3882 1681 3912 -1957 -1745 5173 -656 -4191 2850 2460 -4102 171 3865 -1133
1845 -1133 -2670 4011 919 -4630 1721 3258 -5281 -1664 4153 -277 -4210 2459 2573 -6057 -256
1860 -256 4878 -3110 -2694 3322 804 -4605 2245 2540 -3877 -2114 4011 -1697 -1695 1624 2042 -4658 1053
1877 1053 4349 -3733 -3092 4861 243 -5001 2124 2785 -3641 -1162 3419 -2647 -2418 3435 165 -5390
1893e390P501K086o727J172O139m261l754N737J188p446M031L868o186p76P160
1908D342m170l817N371J919o928K107N756m393l732N725P24o572L458M576o469
1923b103l42O209l357l891N069J525o563K852M042m575k429O617r98o630N128
1938E54L277o627Q74M945l000l807N986m2n028K289L270m446k215O680q90n323
1954c503L854L138n526p52O366l896l225N511o27m617K593M033n114n45N541k371
1970H60n173O030R22m093J19M447l214l692N912m39m772K259L858m567m20N986
1986D023l355k941K746K607m383o13N253m575j454M325q49l122L227J196l504
2001a419n82L706j334k728L011K144n744K395L233m342o66N031j704l461K929
$$ plain form
1893 -5390 2111 4197 -2530 -1358 4781 520 -3234 2503 3691 -3755 276 4144 -2042 -2818 4342
1908 4342 172 -3645 1726 3645 -3283 -1176 4580 187 -3545 2180 2904 -3668 -210 4366 -2103
1923 -2103 -2445 3764 407 -3484 1585 3110 -3453 -601 3441 -1134 -3563 3054 2056 -4574 554
1938 554 3831 -2796 -1922 3023 23 -3784 2202 2160 -2868 -579 2691 -1755 -3970 2710 1820 -3503
1954 -3503 351 3489 -2037 -2789 3577 -319 -3544 1967 1340 -3277 -684 3349 -1765 -2310 3231 860
1970 860 -4313 1717 2639 -1454 -1335 3112 -102 -3794 2118 1679 -3093 -834 3024 -1543 -1963 4023
1986 4023 668 -2273 473 3080 -1303 -1916 3337 -1238 -2692 1633 784 -2338 889 2085 -1419
2001 -1419 -2001 1705 371 -2357 654 2798 -2946 -551 2682 -1660 -2326 2705 1001 -2460 469
2016D69L191o013L50N050k317l273K851J865m533K372L122m119j004M134r04l847
2032b606L561J818m892J696K705j443l687M325L04m646L822K098m875K13L661
2047B054j811l004L158J300l859J074L531k882j302L997m98m335L174R88l004
2062a419Q70L228j569l743L536J081l628Q55K521k415j763M581j083l666K613
2077aK137l600L03K968k830k039M063j19l129K085K396k995j228L791l82m215
2093b795K665K100l550L01L318j824k309L489j01k634P35K791l468k20L672j336
2109H34j781J524J697m227J318K475k472j592L393l01j771K98J690j273j405K779
2125A186j429j983L589k13k077N5K305j852j464K587N62l243K049J025j782n3
$$ plain form
2016 469 3660 -2353 -2003 3047 730 -2543 308 2173 -2360 12 3134 -985 -1989 2145 1241 -2606
2032 -2606 955 2773 -2119 -423 2282 839 -2848 1477 1781 -2865 957 3055 -1820 -1607 2054
2047 2054 243 -2761 397 1697 -2162 -1088 2443 -439 -1741 2256 1758 -2577 597 1585 -1419
2062 -1419 -549 2679 1110 -2633 903 1984 -1644 -789 1732 -683 -2446 2135 1052 -2614 -1
2077 -1 2136 -1464 -1161 1807 -1023 -3062 1001 882 -2247 -162 2234 -761 -1989 1802 1420 -2795
2093 -2795 -130 1970 -1580 -1279 2039 215 -2094 1395 1294 -1340 -605 2186 -1282 -1502 2170 834
2109 834 -947 577 2274 -1953 -635 1840 -632 -2224 1169 868 -903 -605 1085 -188 -1593 1186
2125 1186 -243 -2226 1363 1150 -927 -872 1433 -419 -1883 704 1266 -1977 72 1097 -685 -738
2141g38K879k050j222J437J087k806Q55K089k053p08K038K46k407J856k17j837
2157a551P32K421j869j043K375q9k686J021K294k035j181L491j985j415J434J386
2173A300l393J117K804k376j18O20N58j687J140N92k253K099R73m87j703J623
2189H09J90k104J524J162k133p28K268K23k257J376O57j212j50O69l94j001J823
2206G22M91j734Q09M65j166r00K521l98j260J467l07j72o31M41j207K27J563j955
2224a024O57P3J018j165N7J13J080j916J681J9k516J703Q14m61r63K282j616p26
2242h90N11R98k14p72J547j527r16K545n63r61m13J906n90m25N99n91p89N51M21
2261D27q21O2Q74j428m6J866p72j171Q55J338j060q01J555r75l97J37M85r64K20
$$ plain form
2141 -738 2141 91 -1131 306 1393 -1413 -558 1531 -522 -1230 808 1054 -1353 503 286 -1551
2157 -1551 -819 1602 -267 -1310 1065 976 -1710 -689 1605 -430 -1611 1880 -105 -1520 -86 1300
2173 1300 -2093 -976 1828 -548 -666 -46 512 -1175 -35 557 -1696 403 1376 889 -814 809
2189 809 999 -1105 419 1581 -552 -1280 988 1211 -1046 330 987 -225 -375 294 -100 -1101 722
2206 722 1213 -521 288 753 -413 -1313 1208 810 -450 1017 710 538 -93 348 -859 -632 931 -1024
2224 -1024 -367 -294 724 -441 -384 -271 809 -1107 574 593 -1923 -220 594 133 -830 1452 -164 -890
2242 -890 -379 619 405 -367 1180 -347 -1263 1282 719 -242 -655 1251 661 236 835 244 -545 6 427
2261 427 -394 -332 542 -886 -932 934 162 -1009 -154 1184 124 -677 878 -97 -494 -357 128 -836 -616
2280f16j25J705k058J151j220l87J524M8M92k259K049j263J14Q46J028j909M60
2297d20P12q48L18m88P51j37K47K52R3j425J039j1r89J503l22k40m83J342q27
2316F7q42J112L81m82m76J17m98N77L72m20k59N76Jj33p12L92N08n54N47O8r73
2337f31M45J81l55M06J013o55o71R9l53O49k12J466j029k83L59n38m31K17Q34
2356E11n91j76J69o12O66K5N91j4n09R40o59r36N68J54l25N99m8q66J101r51J81
2377a82R3K60m33L3k14J086j924J311q08J112j81k58K14p0l21J27P31n9p76L23
2397F4k09K49k93K05j91J79L07q82R09l25j71N14N68Q1l01m30J40n57J183q82
2417A58m13J61M92J40k5J54l20r9R7R6o88m69J557n44l68J351j594M16P1l07J092
$$ plain form
2280 -616 -741 964 -1094 57 -1163 -1550 -26 22 514 -1745 304 -959 -845 1 1029 -880 -420
2297 -420 292 -556 -238 -726 25 -112 135 387 480 -945 94 83 -906 597 275 35 -448 894 67
2316 67 -775 337 718 236 -240 -123 -621 -44 328 -92 -351 225 226 93 -619 -227 281 -273 274 342 -631
2337 -631 -186 -5 -360 46 1059 404 -267 -168 -521 128 -84 1382 353 70 429 -109 -540 -323 511
2356 511 -80 -256 -87 -699 -33 -8 583 569 60 1000 341 -595 -27 127 -198 401 353 -513 588 -363 -182
2377 -182 -89 171 -262 -229 -443 643 -1281 30 -778 334 153 -105 109 39 -282 -155 576 517 -259 64
2397 64 -145 104 -189 16 -175 4 311 -571 338 13 -158 356 924 1005 704 274 414 -143 1040 158
2417 158 -255 -94 398 538 513 667 347 248 345 441 -247 -716 841 297 -71 1280 -314 102 173 -134 958
2438I58j230Q65j021k56Q44n45J384j589J136m68m32L70k98L33r01J77J823p38
2456D12m44m33P95l6n28Q39m93k60l2J243q18K59r86k94N44l47N21M14j553O52
2476e45M83m49Q08j2o54Q00n56Q52m90l20l43J064j102M51R9j108Q37k70L1R47
2496E23n90L92P3K29p73l15O56m38k74q77J341m5N89q83J56n11O84o16M19j0l8
2517c08N8J67l93N44k50m03N32J06M71j90j35L9q80M79M16j72j08j77j09P33o02
2538a82L90l56J6n01J119q0o74J54J116j819J286J67m85k82J31j90K94q4K40m05
2558a45J25r95L23l76O15K75j14K72n6k74J85J96M6k31K66j12q9m03R57r81R81
2579D65J6R7k67J38k05j113K55J014p20J37k48j00R80n87l95k25J029j65J39j243
$$ plain form
2438 958 -272 593 -428 -684 160 -385 999 -590 546 78 -354 16 -282 51 -850 -673 1150 412
2456 412 -32 -465 330 294 -234 605 112 -148 -180 1063 245 504 -482 -776 -232 -579 -58 356 -1197 -545
2476 -545 -62 -511 297 285 -369 431 -125 727 237 -83 -426 638 -464 -13 86 -1022 -185 -455 -424 523
2496 523 -67 325 398 627 -146 -461 195 -243 -517 -1394 -53 -98 491 -392 -236 -747 -63 -679 -260 -270 -308
2517 -308 -250 -83 -476 68 -182 -585 -53 53 524 334 199 238 -642 -163 253 81 -27 -204 -313 420 -182
2538 -182 208 -148 -132 -633 486 406 -268 -114 1002 -817 469 636 151 -131 0 -190 104 20 260 -145
2558 -145 -20 -1015 -692 -1068 -453 -178 -292 -20 -76 -350 -165 31 77 -154 112 0 -89 -492 465 -516 465
2579 465 481 578 311 449 244 -869 -614 400 -320 -183 -431 -531 449 -138 -533 -758 271 106 245 -998
2599i98k8J049K10n41o57Q66M14p03L71m30M17R5l36L14P92j72l01L10p1m80J67
2620B88l11k63M58O91j044N84j05j19m11j17M38kj31o56R78K75n80P36q01k93
2640c85L76J205j477L74J68N25p99o45Q81o69L65K11R2k41j5r22J126N50n37k50
2660f7J089j310k86N47J73R8m30L31l17Q94k19o90J26N88m66n32N23k72J161p06
2680B35l02N6o71J621l39o89j82l2K43P4j9N35L49q96n40N51N20q25j19L3J431
2701A034j066j124R78MM69p66P28L84k80M58p60k84K53n98Q5J37Q13j43l2q00
2721e10j68O23n71P22L66j4n07O8K85J17j102J123p81L11J18J73m43P07p23M12
2741B06n98J219m53q49L05K32O00r58R89l11o80O94q40J211p32l34M08m36Q10
$$ plain form
2599 -998 -1026 23 233 -308 -965 -99 315 -388 -17 -447 -30 65 -271 43 835 663 362 672 601 121 288
2620 288 -23 -286 172 863 -181 403 298 179 -232 -349 89 87 -44 -700 278 553 -27 709 -92 -385
2640 -385 -9 1196 -281 93 261 786 -13 -658 223 -446 -81 130 222 -19 -34 -956 170 720 183 -67
2660 -67 1022 -288 -574 -27 146 244 -186 145 -172 722 503 -187 -61 527 61 -471 52 -220 941 235
2680 235 -67 -11 -682 939 600 -89 -271 -303 -60 14 -5 530 879 -17 -557 -6 514 -311 -430 -397 1034
2701 1034 -32 -1156 -178 -174 295 -471 257 641 361 819 59 -225 28 -570 -485 -348 465 322 290 -510
2721 -510 -678 -55 -626 96 462 448 -59 9 294 411 -691 432 -349 -38 80 253 -190 517 -206 206
2741 206 -392 827 374 -475 -170 62 662 -296 693 382 -298 396 -444 767 35 -299 109 -327 483
2760D83r4k31l19l12p45J380M81j54j508L22K8P94p5n0p64O65L75J59r79K79j02
2781c67K36O69j007O26O35k86n15K20K91m53R80j207N89Q99j588M44k89o26N42
2800b07M78J43k18P25p37L03j176K1P71n14K87L2k83K71J85J41p40J60L69K25
2820B36l78M86j261j99J641q38J70L1J11l58J523j664M57p52O31J12J51m60J445
2839A084j721R51J038j588P13n3l90J90J014j412k16M52q23P94J276k414J162
2856E7n30P91j94l31q0m27Q73r09L88l1N89L05l32j167J177O2l05M2J03k33R26
2877G74l18k27L02q77mK1N19L51n57r2j05O13J8L64n01p65J03O13J18n79K04P82
2899G57j234N2o59J416j151J007k40K44n26N99l76J29l18r45J042q8P18n15q72
$$ plain form
2760 483 389 158 -161 -473 -1218 162 643 489 -1019 -697 -669 125 50 0 -764 -99 276 435 -544 -265 -367
2781 -367 -131 538 -469 157 792 506 -9 211 502 49 1029 -178 411 1310 -278 166 -123 -749 -207
2800 -207 271 414 196 921 184 487 -689 -668 103 -411 -124 -92 -375 -104 81 222 -518 -358 11 236
2820 236 -142 344 -917 -1116 525 -313 -143 -112 -1 -359 1164 -500 -43 -795 -164 -52 99 -361 1084
2839 1084 -637 314 1352 -236 477 424 34 224 1238 -174 -390 62 -761 33 1309 -1105 57
2856 57 -473 318 124 -207 -287 -714 159 -750 -362 -393 196 501 169 -998 179 241 -64 -22 81 -152 774
2877 774 456 229 531 -346 -350 -329 190 541 -16 -108 -213 400 418 782 281 -484 -381 232 350 -229 -25 757
2899 757 -477 -425 -1084 332 -819 188 -52 192 -334 265 -111 18 -300 -1245 -203 -291 427 -88 -960
2918i60Q61m13Q81m53J91l63P60r33J07J19K91m99J286lJ39q83n82j66P42J57
2938B79l8o89Q45k76j525J144K24J179p57O6j065J202k3o83N65o87o18P64j57
2957b50K92n60q3j78R82j562J354O35L8j236N12N38p17K06p31Q71j111P36l89
2976f53L4O05L81n84L06P06K35n66m1m25J306k193J029n37L43n37R50o47m0j21
2996d49P3M10j24n11P29J83o6J20j061n3N96j112J374J16q71j13O2J051O51j243
3016b38K48K74N81p46K82O00m49p78Q18j591K503j491l54Q87j051O94l48J94l3
3035BL47o98M47n88J96l9M14p92L69J787k093M73J019j926Q44L35Q7j80p96K19
3055e73N44j04N41K48j162J326j173k69O53N93n85m0p4N29q33N93o00L47l9M67
$$ plain form
2918 -960 -99 -512 369 -84 107 -256 504 -429 -322 -203 88 -411 875 872 1011 128 -454 -620 122 279
2938 279 241 -448 397 121 -1404 -260 -36 1143 386 452 -613 589 566 -117 448 -239 -857 -93 -250
2957 -250 42 -518 -601 -779 203 -1359 -5 630 668 -568 -56 482 -235 -29 -760 111 -1000 -264 -653
2976 -653 -619 -14 367 -217 89 795 1030 464 423 -2 1304 -889 140 -397 -54 -591 359 -288 -328 -449
2996 -449 -376 34 -90 -601 128 311 245 365 -696 -749 -153 -1265 109 225 -646 -759 -697 354 1005 -238
3016 -238 10 284 865 119 401 1001 552 -226 592 -999 1504 13 -341 546 -505 189 -159 35 2
3035 2 349 -349 98 -490 -294 -333 81 -711 -342 1445 -648 -175 844 -1082 -238 97 184 4 -792 -573
3055 -573 -29 -133 408 656 -506 820 -353 -622 31 624 39 -1 -75 454 -379 214 -386 -39 -78 389
3075C89K27j325J65L44j18N57m32l80n61J382P89q4j731J169j01n40l69K70L90
3094D1j02M81l62J09o58Q63p65j166P35M20M84r00J356l17l27J13n3n42Q84j58
3114A36o42J5L05Q82r33O14l79o1L95J23K88n86k08j45k63J94O39p87J0M19m67
3135d51n08Q57L80o96K00j68Q37j604J027R3M05j73N81K7j283O82k06L18o85N30
3155A63K81p44J117p85m13m77R83K12j219L91P67j26l25o30N67l18J116r27J130
3174G63m34K86j235o3P65RL3r39J101m52K33k3R42o50J17r84n78J095R80j661
3194f95l23Q26M24l37m45N79o97J068k72J13l2m44P72n43P13O22p95j121J412
3213H25n75Q32j140J39M61n7p97R68n43J84K73n0m92M43N23j662J020l42J30r3
$$ plain form
3075 389 616 -709 -544 -200 -318 239 -193 -573 -1134 248 1037 953 -778 391 290 -250 -619 -349 41
3094 41 -61 420 58 167 -491 372 -393 -1559 -824 -404 80 -820 536 219 -108 5 -48 -590 294 136
3114 136 -506 -491 -186 696 -237 377 -2 -63 332 455 743 157 -51 -196 -459 -265 374 -413 -403 16 -451
3135 -451 -959 -102 278 -418 -218 -386 451 -1153 -126 -33 372 199 780 807 -476 206 0 318 -367 163
3155 163 444 -300 817 32 -381 -858 125 337 -882 -491 276 150 -175 -805 -238 -556 560 -367 763
3174 763 329 615 -620 -683 82 91 124 -815 286 -166 67 44 986 336 453 -531 -1109 -14 966 -695
3194 -695 -1018 -192 232 -105 -550 29 -668 400 128 241 209 -235 537 -6 707 1329 534 -587 825
3213 825 250 1082 -58 81 542 485 -312 656 113 297 570 520 28 471 994 -668 352 10 140 47
3233D7q81Q70j020J134l09Q65l74o99J034n84Q44J45m87m18k12j41O00k08r6j076
3253i66J390l19k32Q28j1p57J43O46j136j20M0J23N24n90N49m56M12J25k07m82
3273d96J058q01Q54r23K32K93o09M47Q5N3J72o89R0k79R57q65L06n46k41P02k33
3294d33j43J0L13L92k46l20J457n24o51j55J36J00m36M68k28N01k33R6K72j44
3314B32P0m19M2P15o36j78J79j98J94N58k48p0j92M79r24R6J206j34l77j96k2
3335A77l38J282j039J039j408J020q00Q8J33k72O93j551J258k40k99j93N23R35
3353A008j866J217o08L48P08j188k03l88J163k8p98J101N40j092J66RQ32m75l76
3372G0M42j154N85%o59J239j41j10M54m19j095J150r38J113o81j5J524j693l7
$$ plain form
3233 47 -834 36 -984 150 -159 706 332 -367 667 83 927 1072 585 167 -45 -186 414 206 110 -966
3253 -966 424 105 -127 701 690 -67 76 722 -414 -534 -494 -371 153 -437 112 -344 68 193 -14 -496
3273 -496 562 -239 615 -308 -76 217 -392 55 140 193 365 -324 -234 -513 444 -421 -115 -661 -902 -200 -433
3294 -433 -576 -566 -253 139 -107 -427 1030 506 -145 -300 -164 -64 -500 -32 -260 241 8 104 376 232
3314 232 302 -117 -75 640 4 -174 5 -193 1 559 311 241 49 528 -396 -300 906 772 395 199 177
3335 177 -161 1121 82 1121 -287 733 -67 21 154 -118 575 -976 282 42 -257 -450 73 1008
3353 1008 -858 359 -249 99 807 -381 -584 -972 191 163 -635 466 1006 -86 80 89 921 446 70
3372 70 512 -642 -57 -57 -716 523 382 272 726 307 -788 362 -576 537 -144 -159 1365 -328 -365
3391c65M29k82J42N9M33r01p8k95J243j002M82J3L15M34OJ44j325m49R03j26j55
3412c75R8L21p4k34j60p9L65K05J83L91j44M57j826J332k26o17j80J069J89n54
3432A41M65J14m92n94R06r24O32p39O29j98r21J05N44l67K37M76l90j55R02k69
3452A02J18j65N08k72p41O26P2p66J452r38o55J441k59n09l39J008j114k47N64
3471a14M99q24R82o01mN41j24m07p48J291m81l28J218M31j226k85R70o01J62k30
3491A21j60l51P02j39p3m48J337q03k32L23q0o66p03J049j7O05j76l94J83k14
3511a36j9K21j71j71K13j56k2J50M6O70j422J429J91j156J53oP15K50j194K72
3531a43M64r55k1k00O62O08p75n10Q59j22l08J441j108O22k24J47l83p96R03m12
$$ plain form
3391 -365 64 -218 -76 -17 416 -485 -563 -858 385 -617 -135 -122 193 627 633 777 -548 -997 -94 -220 -375
3412 -375 -277 44 -30 -264 -424 -503 -138 67 250 641 497 954 -872 460 234 -383 -563 506 695 141
3432 141 606 720 228 -366 540 -384 248 -491 138 -60 -981 -876 -332 -699 -462 14 -376 -531 371 102
3452 102 220 55 563 291 -450 176 248 -518 934 -4 -659 782 523 14 -325 683 -431 -678 -114
3471 -114 385 -439 543 -58 -62 479 355 -52 -800 491 10 -318 900 1331 105 -180 790 189 351 121
3491 121 -39 -390 312 173 100 -348 989 186 -46 277 197 -469 -1172 -123 -140 465 289 -105 78 -136
3511 -136 -155 66 -105 -276 -63 -219 -241 -91 -45 625 -797 632 823 -333 -180 -186 529 779 -415 -143
3531 -143 321 -634 -655 -855 -193 415 -360 -870 -11 -133 -441 1000 -108 514 290 437 54 -742 161 -251
3551b51M26o8k65J39J85l61l0j99J291N92j494J53L0Q17j071P11j178m18P13L80
3571A02n12O31l89P58m17j68m11O49M88j191J9J87l4J03J15N03p02J147j041P78
3591F15J40o66n32P00n42K84L6mL3L61l47M41o63k39L53N10o77Q44j518J62P16
3612GM64J07o84O22O13j764J132K06j216M93j00K12r57P34j94J95n99N18q82J015
3632g8r26K217p44n90j44n95R23l69R57m74k71P56j017K52R74o64q91O13M9J40
3652A18j75R1m69R23q33R72j343M88J136j461J202q08K57m30J204n03m70m64J506
3671I41j154k78O39J86q12o46J002j241Q55P13p1N8O0N97k32m33o01R12n11m94
3691e10R09k28l18j37M50l47P70o55M79K09l64o62O02M99o64k29m53J285r30m13
$$ plain form
3551 -251 175 107 -158 -19 166 -195 -225 -424 867 1459 -35 118 148 965 -106 605 -573 -991 -278 102
3571 102 -410 221 -168 590 173 5 -406 243 731 -460 -441 -254 -288 -185 -70 433 -269 878 -163 615
3591 615 755 89 -443 257 -285 -1 35 31 64 425 78 519 -144 -383 -30 480 -197 647 -871 -709 7
3612 7 471 578 -106 516 1129 -635 497 703 -513 -20 -120 92 -865 -131 -325 -130 -729 -211 -1093 -78
3632 -78 -1004 1213 469 -121 -265 -860 63 -306 651 177 -94 662 -355 -103 871 207 -684 -71 -22 118
3652 118 -57 34 -435 488 -345 627 -716 -228 908 -553 649 -159 98 -332 872 369 -101 -565 941
3671 941 -213 -491 148 334 -478 -1124 -122 -1363 -508 205 134 192 252 849 617 184 -417 495 -16 -510
3691 -510 399 171 -147 -284 166 -181 589 -66 413 622 258 -404 198 697 33 -196 -649 636 -294 -707
3711g07R55j061M57J71L61J39m77J91o27k02J785j051K05M66q76J020L18j596
3729e29P6J301o68n20O87j510Q45j92J221Q64j825L93m89R35p73P76K80p33M97
3748F36P1m98l19L50m97K56m33K67L61l68J54l24l62Q39n42Q5M66J59j18j89j249
3769a255Q78k40R11m01l77J232N04j431k97J015l26k16L20r02J031j08o58R02
3787E82m55p04K34J204j048o91N98R51q08N68p51N56M08N0r86L05J94Q1j054J154
3807C88j90j382J414j063Q95P0K72j051J288o18L5l6n59M94o22O03J12Q76r06
3826B0L58O36p94J55k41r7P9l32J186j013N88j91n36N10O44j795J423n81P3O48
3846G40j140r4Q56j55K26k29m64Q70m52n94N88o46Q0J046m00j55n65Q09p51L18
$$ plain form
3711 -707 248 -813 -356 -185 176 315 -162 29 -598 -800 985 -66 139 605 -271 749 1067 -529
3729 -529 -453 848 180 -340 347 -1163 -318 -510 711 1575 -250 143 -346 589 -184 592 872 139 636
3748 636 707 209 -110 240 -257 -1 -434 -167 194 -174 -20 -344 -706 133 -409 -324 142 301 183 -6 -1255
3769 -1255 -377 -617 294 -107 -484 748 1252 -179 -476 539 213 -3 317 -585 446 338 -320 582
3787 582 127 -577 -343 861 -187 -878 -280 671 -137 431 -320 236 644 694 -292 13 207 288 -766 388
3807 388 198 -1184 230 -833 62 132 404 -647 641 23 58 22 -537 -43 -665 -62 50 926 20
3826 20 378 1014 220 375 134 37 116 -216 970 -43 545 354 -182 328 972 -823 600 19 92 740
3846 740 -400 -494 362 207 433 204 -260 610 158 -436 152 -494 -414 632 232 77 -488 321 -430 -112
3866a12m37J102q90k5O98r99J18J30k20J72K38N24j5l18o20J216j191P33j0L65
3886D59m96m12L09PL18J95m75N72K34j94N1q00M96k47l7k47n95L70Q96k35J94
3907C63k07l40j50J22j20R24r02K70p75J079O36l75n59n68J527j181R45m72n5
3926A62M07o69P83j279P02R6j21n11R97r02J07O0r3J01M67j5J39m33j31l95N4
3947d74J387p32m70J62P19j237K69O35M63j238L68J38J73J48q71Q90n17j129J462
3966A46o84o40J004P2J12N2q4J0k73M21O99j766N06L30m98k97J689q68P02j148
3986e15N15j4N97k22j405J553J51p92q40M3J759k31j579N95k16J003j752J598
4004B48J38o10R7K0r66J013M20k93N72j261J214j346J067K96j87p06J74N30M05
$$ plain form
3866 -112 -549 553 -337 -362 336 -663 -545 -415 -635 -463 -225 299 284 -34 -654 562 -629 104 94 459
3886 459 -37 -449 -140 -133 185 380 -95 477 711 517 568 -232 264 17 -20 -267 -862 -492 404 169 363
3907 363 156 -184 -334 -212 -332 592 -310 -40 -815 264 900 525 -34 -602 925 -256 689 217 162
3926 162 569 -100 683 -596 106 202 81 -430 567 -335 -228 -168 -261 -160 307 292 431 -2 -133 -528 -474
3947 -474 913 181 -289 -127 592 -645 -376 259 722 -516 -148 -10 163 311 -560 330 -187 -1316 146
3966 146 -538 -1178 -174 -102 10 62 -22 -12 -285 136 835 -931 -425 -95 -593 -890 799 -69 633 -515
3986 -515 0 -14 583 361 -1044 509 660 -132 -972 -929 830 599 -980 -385 -601 402 -1350 248
4004 248 386 -224 -127 -107 -1073 -60 360 67 639 -622 592 -754 313 609 422 -284 -110 420 825
4023H25j272j4J032o53j00O85r03J291j50m46j49M72o1J8j99m51N06j105M80Q07
4043F13L97j298P82J6r46n6N54n00M47j051J862j180M67k16P11K33p30o85Q29
4062B49j330J453o09J04j100l89J181J296j220N36o27l04J336p88K27J29o11k5
4080d92NN87J87n32Q7R83r86m02O53J1k99L7J40M2N08q18J131j360N42J98j076
4101h54J592o0j195M26J550j782J97Q65o18l80k57J247q51n44N39N65q10j96p52
4120a318P59P74mn12M48K31o68L8J086j530N44n6oP61k49p8J95n76K0M91n80K12
4142a8J84q0m77O58m94K50K93K18l28k46j67K82J18J09r67J382r99k83m19Q58
4162a26Q57j080m4N51M69n68l09m4L31M38q23M8J191n96Q87p41O74q06p9m5o41
$$ plain form
4023 825 -447 -461 571 -82 -182 503 -400 891 741 295 146 618 557 575 376 -75 431 -674 -194 613
4043 613 1010 -288 494 510 -436 -492 62 -438 9 -1042 820 -360 107 -109 602 835 105 -580 249
4062 249 -1081 372 -237 -133 -1233 -1622 -441 855 -365 171 -456 -760 576 -212 15 144 -467 -492
4080 -492 -487 100 287 -245 -158 825 -161 -563 90 101 -198 -161 -21 21 529 -289 842 -518 24 222 -854
4101 -854 738 678 -517 -91 1459 -323 -126 739 121 -259 -516 731 -120 -664 -125 440 -370 -566 -1318
4120 -1318 -559 215 211 -301 147 378 -290 -252 834 -696 -152 -208 -214 547 298 220 415 -161 -141 350 -230 -18
4142 -18 166 86 -391 267 -227 23 316 534 206 -40 -207 75 193 302 -665 717 -282 -565 -984 -126
4162 -126 731 -349 -393 158 627 59 -250 -294 37 475 -348 -300 891 295 1182 441 1115 309 230 185 -456
4183d56O17k67M47j36Q3k44p02J346j036N3N58Q9n90J04l91K69P94k95k69o16
4203f42N46J50k15R73p31M05J08k85k57o1M3J66k18O06j210j21J137K94N2m28
4223C12N77j189N35p74N31OK55j85R1l69Q76k60K04j0l99k94m93K10L96l36j44
4244d60Q29n42N54n72j84K23J2J13j46R16N5j324M68m50J233N5p50Q65n22l14
4264E9p14K030r02n0k55J46K02o72P04o2%j238J182k68K5P96m13j15N35j049M94
4285D35m85j043J369l46L61P64q19J70K89j306O55K30o86M53j25L16j350J807
4303F89J69j389O81L91m0j0n95R99j069l74O08m60N64N29m46l13n69M71O86J156
4323A678k858J479q52O77k82m03M06mP71j413L59J099j236k18O41j07j013J903
$$ plain form
4183 -456 161 -106 341 205 288 44 -658 688 -348 -295 263 352 -238 -134 -525 -256 538 243 -26 -642
4203 -642 -96 54 -161 812 81 486 594 309 52 -9 34 200 -18 588 -622 -743 394 688 740 312
4223 312 889 -300 235 -539 -8 -2 253 68 159 -210 666 406 610 600 201 -93 -586 -376 20 -316 -460
4244 -460 369 -173 381 -191 -375 -152 -140 -27 -173 743 798 -526 -58 -508 725 780 30 895 373 59
4264 59 -655 1375 473 423 168 314 516 -156 548 486 486 -752 430 162 187 983 570 455 990 -59 435
4285 435 -50 -1093 276 -70 291 1055 236 406 695 -611 44 274 -412 41 -84 232 -1118 689
4303 689 858 -531 150 541 501 491 -104 895 -174 -548 60 -400 164 693 247 -66 -635 -164 522 1678
4323 1678 -1180 299 -553 124 -158 -561 -155 -159 612 -801 -442 657 -579 -797 -156 -263 -1276 627
4341F27m16k10r1l61O84m30m92J381k53P17j586N0K86l97k34J299j289N70M68
4360C23j055J580j090O79q30K29k13k4O56m9r02P29q1L66L69r55N35L92p31j8
4380i0R11p99R2J07r8K17J64j053J79m97J207o5j363J524m73m90R16o67N27j275
4400a026R72j23M3j14Q51M6J08p67p53k92P69O93n4k7K45n11N7j99L69L16n65
4421C8m51O67j04p74R95j040K182j522p75J543p05R12n76m63j71J371j041n23
4439d37n44J600j412l84J344j27L78q11M74l43q5J58J584p13j677J164m34J425
4457A160m62n36k78n54jQ14n95J18k8j50J343m03m05M21l29o38M06J26K60J35
4477D04l85k9O3p96O11J28l55J022q78j83R45l26K05j73p53j39P08P51j109M57
$$ plain form
4341 627 211 1 -90 -451 233 -197 -689 692 439 1156 -430 -380 -94 -491 -725 574 -715 -145 323
4360 323 -732 848 -242 437 -393 -164 -377 -401 255 206 -696 33 -48 318 687 -268 267 659 -72 -90
4380 -90 821 22 114 221 123 340 504 -549 -370 -867 340 275 -1088 436 -37 -527 389 -278 249 -1026
4400 -1026 -54 -177 -134 -248 603 649 757 -10 -763 -1055 -286 407 353 326 571 60 117 -82 287 603 38
4421 38 -413 254 150 -624 371 -669 1513 -9 -784 759 54 966 390 -73 -244 1127 86 -437
4439 -437 -981 619 -793 -1177 167 40 418 -393 81 -262 -347 -189 1395 682 -995 169 -265 1160
4457 1160 698 162 -116 -670 -671 143 -452 -334 -362 -512 831 428 23 444 115 -523 -117 9 269 404
4477 404 19 -10 53 -743 -132 -4 -359 663 -215 -398 547 221 426 253 -500 -639 69 820 -289 168
4497A68M90r38N97q91K00J719p22l95j404J268m46j00J54Q1K1K75N17J36r00O27
4517D57m40j536J693n25N06M0n19N62l42q17Q06K61n07n66P20K34n31J585j227
4536a46O21q93j65l2J208j406J4J039p48J5nJ48K47K58j016J361r80O32J3l98
4556b33J199q65O5l84M06j29k39J21m22l43J003m83j28O4J479K64k149J456r10
4575b28O04j39j07r21M08N96l46n22M53Q5L65o7p62O59j113J55k24Q45L97O92
4595H30j528Q15Q54p25j61j074J618j018L39l17R19o45N39o89J063j046L30p00
4613e96J172q99P28p80l51J459q14k17J154j412J127n77r10J060l13m8O76N05
4631I64j663J586j296R13K8m31q92L81J053j196M16J86p50J447Jo14M1m70o87
$$ plain form
4497 168 658 -280 317 -574 -374 1345 623 228 -1176 92 -354 -454 -300 -219 -198 77 594 730 -170 457
4517 457 17 -1519 174 -351 155 195 -324 238 -104 -921 -115 146 -361 -927 -207 27 -504 1081 -146
4536 -146 475 -418 -583 -615 593 -813 -799 240 -508 -493 -498 -350 -103 155 -861 500 -480 152 165 -233
4556 -233 966 101 166 -218 188 59 -180 -59 -481 -824 179 -304 -432 -368 1111 1375 -774 682 -228
4575 -228 376 237 130 -791 -383 213 -133 -655 -202 -117 248 181 -581 78 -1035 -880 -1104 -259 138 830
4595 830 -698 117 971 246 85 -989 629 -389 -50 -367 552 -93 446 -243 820 -226 104 -596
4613 -596 576 -323 405 -375 -726 733 -81 -298 856 -556 571 -6 -916 144 -169 -217 459 964
4631 964 -699 887 -409 504 532 101 -791 -410 643 -553 -137 49 -701 746 747 133 174 -296 -983
4650i83R51N52l53j195O44R87j067J118j445J82M14M2m54L52N76j92n04N49l54
4669a80k68O2J61K9N34o37M26n34j24n22J225J93J11j090O90J0J80j34o94M52
4689a10N69Jn55q99J128M32k84N15j202O42r97R83J431j714l57n4O89q0m08J283
4709A013q61L94j10l3p9k23k22N51n14K35j90K36l90K80L84m66l70Q77j25m71
4729h4r22J227k10o18K99O07P7q39P06j082K20M49n25J059o66M54j59K99m78N54
4749C68O7j279Q57n16O30k61k62J130j156O96l54o75K08Q81Q9p43o51J744m11
4768C62o04N12J74j006R49j97M76j010O23n13O20L08n18j78R66r31K67n38P74
4787E36j62n6q46P29K33n1m7k54J78p09q93J423r52R85L7l13L09N80p84O49n55
$$ plain form
4650 -983 -32 520 167 -1028 -384 603 -464 654 -791 -609 -195 -153 -607 -255 321 129 -375 174 -180
4669 -180 -448 -386 -225 -196 338 -299 127 -407 -531 -1053 172 365 476 -614 76 86 266 132 -562 -110
4689 -110 459 460 -95 -994 134 566 282 797 -405 237 -760 223 1654 -60 -417 -471 218 138 -270 1013
4709 1013 152 546 436 403 324 101 -121 430 -84 151 -39 197 -193 87 471 5 -365 512 387 -84
4729 -84 -1006 221 11 -607 -308 299 376 -463 243 -839 -619 -170 -695 364 -302 152 -7 292 -186 368
4749 368 435 -844 13 -503 127 -134 -396 734 -422 274 -80 -755 -547 334 423 -320 -971 773 362
4768 362 -242 270 444 -562 387 190 666 -344 279 -234 386 694 176 -2 964 33 300 -238 536
4787 536 374 318 -528 201 434 383 336 82 260 -449 -1342 81 -871 114 151 -162 147 727 -57 592 37
4808C7p43P36l91R00j084Q65m08l85k66Q45j28p99O89L61o33j43J009o79o4Q74
4828E93n59j34k32L49Q49o45J83n24n43J103l47O3o93R66q58j25M49R46q44O86
4848F83k66j297J862j159O16l37O6N4k38j80M24o21J150j438J516n15R1l67J2
4867E6n5L28j51l14j96l04P37m29J74m72J187m61k28l39j47j15o2Q34k65O54o54
4888b22J44R25L30j350k35J028q97R56L78j130K59j59P27l63R0l90j077P36O21
4907C71K67j097P97Q31j894L27Q21o58m98J041J2q61R06Q5o07J452k181p4J519
4926E59n58o19J99Q23j072J154j254O11m7Q51l39m73N09k37o51N60K55J12j34
4945B49k5O99p33q34P46k28m42J291J14k94p06N44p56J1L67R12j125M14j29m21
$$ plain form
4808 37 -706 30 -361 539 -545 320 -88 -473 -739 106 -22 -821 -132 229 -404 -547 462 -217 -281 593
4828 593 34 -100 -332 17 866 221 404 -120 -663 440 93 156 -537 429 -429 -554 -105 841 -3 683
4848 683 417 -880 982 -177 439 102 168 222 -16 -196 228 -393 757 -681 835 320 411 44 56
4867 56 1 329 178 -136 -332 -636 101 -328 -154 -626 561 100 -128 -467 -614 -729 -791 43 -222 432 -222
4888 -222 -78 847 1177 -173 -408 620 -277 679 1057 -73 186 27 754 391 481 91 -986 -250 371
4907 371 638 -459 338 1169 -725 -398 423 -235 -733 308 320 -541 365 450 -157 1295 -886 -960 559
4926 559 1 -618 -419 404 -668 486 -768 -157 -204 647 308 -165 344 107 -544 16 271 383 249
4945 249 224 923 190 -644 102 -126 -568 723 837 543 -163 381 -375 -364 3 915 -210 204 75 -346
4965c46J001j563J317J1k55j075N06Q63L57j811R37m0k33L00N09j141M81N34o86
4984c34o8L15P3O27j536L09K92N81k80l54L96J65p73N55N96n48j20L81j110L01
5004e32K01L57k8k17r8L92o44J72M71N17k63j71K23K88j154M26L85M05n05N0N21
5025G96j029O31q27R66k41o02L35m08J040r45L40l13L90n48k18P80k80j63P51
5044D55Q68n71j009q0R18O9j598K70Q10L29o3r29J191M12j374L76o1l95K22K25
5064F5P86r56N11l48K31j264J111o20j08J53O55q81Q49r24L16j57k55M68M08P43
5084G83k6j57o42L26j145j11P28N25j07p12J528j229J055j504J187k08q40Q38
5102B89o44j38M19P01k07l15J02P46l67k85m48N06j98J5k28P89n15o08L10J65
$$ plain form
4965 -346 655 -908 409 420 165 -910 -404 459 816 -995 -58 -98 -331 -31 478 -663 -182 352 -334
4984 -334 -402 -87 -14 613 -923 -614 -322 259 -21 -375 21 186 -587 -32 564 16 -104 277 -833 -532
5004 -532 -331 26 -2 -219 -317 75 -569 -397 74 591 328 157 380 668 -486 -60 325 730 225 275 796
5025 796 -233 398 -429 537 296 -306 29 -379 661 -284 56 -257 133 -415 -633 147 -133 -296 455
5044 455 1323 752 -257 -337 581 650 -948 -678 132 461 398 -531 660 1072 -302 74 13 -382 -160 65
5064 65 851 -105 406 58 289 -975 136 -484 -592 -439 216 -665 184 -740 -424 -581 -836 -368 40 783
5084 783 757 600 -42 284 -861 -972 -244 281 174 -538 990 -239 816 -688 499 291 -549 289
5102 289 -355 -493 -74 627 420 105 207 953 586 301 -147 359 161 176 -52 737 222 -386 -76 89
5122H9j97n23K08J119n13j31K6l78k02K62n36J653j546Q17M17Q6r34R07p16M89
5142C97o03Q72n74k22l25R7r5K71J76j02nj72k85m26J834j784O52K50N86o32O15
5163E25o24M05k26K84q16J531j313K38J4k37J27K07K71O1m90M33p46M33K33M60
5183G70j181L46l06l07M0J066p02L87n5m24P27l08o79N52l99M37K64q40O94M8
5203A30L03j315J579j081L90L17k01Q73j280q12O42M52n52P11J48n26n2j29k24
5222f27J184q34k49J003j257J212K14p51o5j40o64J239k32m2J22m29L51j47J9
5241i3q92J626m47o21N67n75J78J231j153m36n4L21N29k15K84p04m22R17m97j89
5261f45M9O51O66j001R79m19p18Q43j482P56Q10L43n26j183K49R51k80K9K18j52
$$ plain form
5122 89 -108 -631 -423 696 183 52 78 -300 -502 -240 -776 877 -669 148 565 651 -283 624 -92 397
5142 397 -206 666 92 -130 -455 -358 -453 -182 -6 -108 -113 -285 -570 -996 838 -946 -294 -44 542 -90 525
5163 525 -99 306 80 364 -452 1079 -234 4 18 -219 -92 115 386 447 -43 390 -356 77 310 770
5183 770 -411 -65 -371 -678 -638 428 -274 113 58 -366 361 53 -626 -74 -473 -36 228 -612 82 130
5203 130 433 -882 697 -384 6 323 122 995 -285 -1097 -455 -3 -555 156 304 -222 -274 -403 -627
5222 -627 557 -277 -526 477 -780 432 646 -105 -170 -310 -974 265 33 -9 113 -316 35 -112 -93
5241 -93 -985 641 194 -427 140 -435 -257 974 -179 -615 -669 -348 181 -34 250 -454 -876 41 -456 -645
5261 -645 -596 55 721 -280 699 280 -438 405 -1077 -321 489 832 306 -877 -628 323 43 72 290 138
5281A38n06O55l25M16j18l81K75j075Q34J23q41R01j487J066P22l6r97P17o64
5300e83J41N13K31j30K98o77m45P78k42P06j149N57R0l89Q95m40M93o68K31N78
5320G88n1o17J45m90l26O98K46j81n23J034j90p42m67K77L86M30j153J19N10K80
5340A73Q6m68K97K7l07M7o04O98J96l70L46N50Lj577M07N22m69P83l71Q38r07
5361a00N51l99L34j94n43O68L21j07P6o17Q47j119n6l37Q28K37p34P13j063O27
5381f7M24p01o7P99j22l83K97j64O78Kj279R88o11K97n91J98M44j94R26o35J1
5402B50k05p7l6O24j461J684m31R6r35K66O70N51j067J64J94M17k08j065P25J2
5422A68L54r31O30p03P25L14n23k36Q83j271J22L60j6K07L77q8j091N49q5L40
$$ plain form
5281 138 -368 287 -38 378 260 -121 154 -921 -87 36 -805 96 -1391 -325 397 361 -636 81 -583
5300 -583 -442 71 302 172 470 -207 -652 126 -116 590 -559 -2 88 -301 594 154 647 -21 210 788
5320 788 737 120 265 -225 -551 147 393 212 -311 723 533 -209 -676 -399 -13 417 -736 -617 -107 173
5340 173 259 -209 88 115 -192 -145 -749 -51 145 -225 121 671 674 -903 -496 26 -443 340 -31 807 -100
5361 -100 451 52 386 192 -351 317 638 531 607 -10 837 -282 -338 -675 153 390 -344 369 -694 -67
5381 -67 357 -344 -411 388 266 -117 180 16 694 696 -583 405 -206 91 -500 -302 142 -52 874 239 250
5402 250 45 -32 -68 556 -905 779 348 444 -491 -225 445 996 -71 93 287 704 496 -569 156 168
5422 168 522 -409 221 -482 243 557 34 -202 681 -590 -468 -108 -124 83 460 372 -719 -170 -255 85
5442H5qq83R45J0o50j1Q88p91L47R12p33J34K46q79K64p30J065l73o66K53P10
5463A35K9j063P4J499q03K61k12j26J076j662J512q87m9O16j25m95J241m00j594
5482i73k44J902p07L36j67J025q60Kj870J771P00j651k83J243n47N64j151Q33
5500g7J228j406k49mO56j642J873k35m02j16R4k38J515o19m52R77j033K65n5M57
5520E37j330M16N17j581J289O16L15r92p3L2J229k336J463m6J72m30l90m1Q39
5539B06P64n01n36l24O39n15L90m70j34L57k03k66L09K8J47M03M90j427K87K35
5559a21J033r48J26p26J343P6n79O7j370J095J58p53N44J1l9J30M37p31O09m54
5579i2M42l98k09N08m57N13L37j56j85k31l51R36p59J44N36k78j92o6n13l62P53
$$ plain form
5442 85 77 -806 139 149 -501 -512 376 -415 -68 844 111 245 491 -388 -124 -854 211 -162 -828 -575 135
5463 135 164 -899 -825 674 -129 132 -80 -206 870 -792 720 -167 -216 400 275 -220 1021 621 -973
5482 -973 -1217 685 -22 314 147 1172 312 314 -1556 215 915 -736 -1019 224 -323 241 -910 -77
5500 -77 1151 -255 -504 -508 148 -1494 379 144 -258 -374 -280 -518 997 378 -74 903 -130 135 80 537
5520 537 -793 -377 140 -1441 -152 464 779 -213 -286 -254 975 -1361 102 56 228 -202 -592 -633 206
5539 206 970 469 -67 -391 248 -267 123 -347 -481 -124 -327 -593 -284 -256 -109 294 784 -643 -356 -121
5559 -121 912 -36 90 -636 707 783 204 271 -1099 -4 154 -599 -55 -44 -83 47 484 -247 362 -92
5579 -92 350 -48 -257 251 -206 307 644 488 303 72 -279 657 -102 42 578 300 108 42 -471 -833 -80
5600h0j1J1n4J038r18N99j93j228J030k63o48J102l32M61k1j09j90r09M87N72
5620C44o92L57m4n61K47M8J14o20R11j59o13M12K8M79p53R38M92j984R44m07R71
5641D52r27J386j329k65K99P96n86J302j153K40k08q78J690j325K80N47n73O26
5659C74j138P62m94N9L93J23m88J96n90O57M49l41k27M2j031J091M76p65Q03q10
5679d59J040o46l27k44N03n60K47M62mO0PO3l85j32j18J00m01Q99J47o5N14r45
5701b44k8P00o51R6M55r02O37j88j74j06j19J066r92P6J351j308l26J50O71q75
5721g11R43j179O73P22O10m72j018O20j001J469r53M78M7n25O3q77P65L69P10
5740G33j090j02P28o28K179j368l10l37l16J923j417k55m60J014l14n06k6L24
$$ plain form
5600 -80 -91 -80 -134 904 -14 585 392 -836 194 -69 -717 385 53 514 493 384 194 -715 -228 344
5620 344 -348 9 -35 -596 -349 -301 -187 -807 104 -55 -668 -256 -228 251 -502 436 928 -1056 -112 -519 452
5641 452 -475 911 -418 -683 -384 412 -174 1128 -25 215 7 -871 819 -506 -226 321 -252 374
5659 374 -764 -2 -496 -437 -44 79 -409 -213 -803 -146 303 -38 -265 -223 -1254 -163 313 -452 351 -459
5679 -459 581 -65 -392 -636 -133 -693 -446 16 12 72 79 142 -243 -375 -493 -393 -794 105 252 187 701 -244
5701 -244 -272 428 -223 -127 328 -574 63 -125 -299 -405 -524 542 -450 -374 977 -331 -657 -507 164 -711
5721 -711 232 -947 -274 448 1058 586 -432 188 -813 656 -297 181 228 -297 -234 -1111 -346 23 733
5740 733 -357 -459 269 -359 1820 452 142 -195 -511 1412 -5 -260 -720 294 -20 -526 -552 -228
5758b28M65q05n98M50J523j461J351m44j644J814M72r62O6k47n50J201R52j921
5776e66R34o5m13J76j345L47L67j72O54j0j71Q1o98J393j20n10o71J084m28K82
5796A49k67l1Q60j144R16j06m96M63r03n21J749n5k50n45j56j011J095M83j076
5815h46J463K02k13n61L55k61L45L49r43M49K46j857N49O02m79M05L43J11l63
5834a04N4L83k77p38J693j479J030r54Q40n63L56R37j391o9Q48o77o31J548p43
5853F3k09M59p25J37J145j027K3k96L77Q39j262R82m0p2o70R85r70L35M70n29
5873A5J42K19l1m22N1K5l68k41K29J28n0O34l88k72L18M08r32K18K71o0K09L11
5895D14l75r66O90l16N62m99j23K98j41Q11m60r49J524j69m87m52K87j61K78n29
$$ plain form
5758 -228 237 -568 -1166 -716 807 -654 697 253 -1391 423 895 -67 -1 -248 -798 403 1355 -566
5776 -566 368 303 -110 66 -1279 -932 -565 -737 -83 -93 -264 -183 -881 512 392 -118 -789 295 -133 149
5796 149 -118 -149 711 -433 483 377 -119 344 -559 -1080 669 614 364 -181 -337 -1348 -253 230 -846
5815 -846 617 819 606 45 400 139 484 833 -110 339 585 -1272 -723 -121 -600 -195 148 259 -104
5834 -104 -50 333 56 -682 1011 -468 562 -392 448 -115 241 1178 -213 -282 566 -111 -742 806 63
5853 63 -146 313 -412 -275 870 -157 -134 -430 -53 786 -476 506 466 394 -276 709 -261 74 544 15
5873 15 157 376 345 -77 -26 -1 -369 -610 -381 -253 -303 331 -57 -329 -11 397 -535 -317 -46 -106 103 414
5895 414 39 -927 -237 -553 9 -490 -613 -315 -456 355 -105 -1054 470 301 -186 -638 -351 -512 -234 -763
5915g63J618j103P5l39N92m78R36j627J078K18j53m50j4P00r02J131k77K37l09
5934A70L66n21l99J246p24p03Q05l45k05N54K34j031j3Q9P14K86J54k81n24O32
5954E04m66J10m13O19M63L4j476J412j006R6r7n8J46K18O38l67k86l78L02N49
5974E44k47N58j579J171p83O96k28N04K98j163P40k11K9p10r31J320K79L19m69
5993A37J87j048J242j949K270r54o28K168j285O30M73r83n34L00p12M71M58j52
6011I1p04J131o44N30j024Q79o79J365j418M32l59K15L18n32J70M33m36M25l06
6030a13K75L12j499R15L10o99O55L69o04o06lJ138r65J395q95L97o31O56j254
6049h47J319o91N86j369J207N89l68l95p41R02n6O33j666R64m3L18P80j283O40
$$ plain form
5915 -763 855 -248 -173 -512 80 -398 538 -1089 -11 207 54 -396 -410 290 -612 519 242 479 170
5934 170 536 15 -384 862 138 -565 240 -105 -310 244 478 -553 -566 -477 237 523 677 396 -128 504
5954 504 38 148 -265 354 817 851 -625 787 -219 -123 -220 -278 -132 86 724 357 71 -307 -5 544
5974 544 297 855 -724 447 -336 360 132 636 934 -229 511 300 329 -381 -1312 8 287 606 137
5993 137 324 -724 518 -1431 839 -115 -743 1425 140 770 1243 260 -274 26 -686 -215 243 91
6011 91 -613 518 -126 404 -620 259 -420 945 -473 -41 -400 -185 133 -399 -229 204 -232 193 -113
6030 -113 162 474 -1025 -110 200 -499 156 525 -79 -685 -688 450 -515 880 -15 382 -249 407 -847
6049 -847 472 -219 367 -1002 205 794 426 31 -710 192 136 769 -897 67 24 342 1122 -161 479
6068D79j27n38L2l70O3m45P65k55P65K69j72j301J285o05m20L21J208j158m29
6087f33J444j442O44L99o0O30j043j50M34N77l23o68L21m36O69q40J743l60p74
6106A32M98p13L10K30o47N38k67N78L3k93j17j230J245j43o48L96N11n25J024
6125I12r74R64k78j289J082r84J301j347K36l47L19N37N36p00K87l27Q03p89R15
6144H57j378J177q88l26L89Q19j084Q65j83l92J029j769M68l85K399k536J868
6161I30p48l07P40j16j194N32N67j00o35L18j94O91J8k47q5O20J7j003L06l24
6181b14N98r93P69q78J931o89r80O46J24O53j538N02m1k87L7J271L1p04K98o64
6201a28o54P96K65Q83j299L77k97N95r60P29K9J40j22q04J420o04O82q00J12j53
$$ plain form
6068 479 352 -186 -154 -524 -461 -906 -141 -396 369 638 466 -835 450 -155 -575 -254 954 -204 -633
6087 -633 811 -631 13 412 352 982 -61 -211 223 800 477 -191 130 -306 363 -477 1266 906 132
6106 132 630 -83 227 457 -190 348 81 659 692 399 282 -948 297 154 -494 -98 413 -112 912
6125 912 -62 902 624 -665 417 -567 734 -613 -377 -724 -405 132 668 -32 255 -72 731 -58 857
6144 857 -521 656 -232 -558 -169 650 -434 431 248 -144 885 -884 -416 -801 1598 -938 930
6161 930 182 -125 615 499 -695 -163 404 304 -331 -13 -207 484 502 255 170 790 807 -196 110 -214
6181 -214 384 -609 160 -718 1213 524 -456 190 314 967 -571 -69 -110 -397 -360 911 942 238 536 -128
6201 -128 -782 14 279 1162 -137 240 -57 538 -422 307 336 476 354 -450 970 366 1048 248 360 207
6221B07o79P33j012O87M70O40k099R65O99j202O07m71M30j94N1O55o4j326J260
6240C57p18J428r56r47N73N9Q32MO38q26m69p8m11l7R25Q5n16m79J047m30J247
6261A328k426P15m1rK71Q21K95j090K66P3O86j161n01J036M6o00NP79Q69k011
6281f49J86P31q38K49jL96N31n94M61o58l85J56M64J96l05L83l48j9O72l79L37
6302E86m60K99o78J223n42n7o24l0K49o2n45O01J21L6mj39R09j069M35j045L3
6323g63J177r93L11O94n89L22n32K52k0P40p87k6l8j91R07P19j951k93J204p75
6343f32P33j53k80n35j81O83oP84L70k53j69l6N00j020J66q07J225L32j116j64
6363e59J62P51j319J295n72L53k56P42p04o21J532o68J46Q6M04r67l68O77q21
$$ plain form
6221 207 -472 261 -751 -64 406 1046 -1053 -88 611 -591 16 -455 -25 -219 -168 487 423 -903 357
6240 357 -361 1067 111 -836 -263 -204 628 632 1270 444 -25 -103 -514 -551 374 459 -57 -536 511 81 1328
6261 1328 -1098 -383 -424 -433 -162 659 954 -136 130 203 889 -272 -773 263 309 -291 -286 493 1362 -649
6281 -649 -463 268 -570 -321 -322 74 605 11 472 -186 -571 -415 49 245 -60 323 -25 -44 628 249 586
6302 586 126 425 -253 970 428 371 -253 -283 -34 -96 -641 -40 81 117 113 -26 883 -186 249 -796 -763
6323 -763 414 -579 -268 426 -163 159 -373 -121 -141 599 -188 -214 -252 -443 464 1183 -768 -1061 143 -632
6343 -632 101 -52 -332 -867 -1048 -365 -371 413 783 530 361 325 825 -195 -29 -836 389 721 -395 -559
6363 -559 -397 354 -965 330 -242 111 -145 597 -107 -728 804 136 282 368 772 -195 -563 114 -707
6382g07R06l40L29M79J92j228k7O24j71M16k26L31j591M03L82k19P01r13O58o82
6402f83J74J314l42m20J114j347J72j73J7N37L46r83R65l03N5o92O10j74j292
6421a105M77M95k56O11m37K17m66N91L47M4o00k95L47K35N24j227M87K34m21K41
6441D3J4J2j67l99J407r93r76J076k50p5P47o18r4J87n86R59k97k29R62p55Q93
6462H61j121j51J2n05Q69M62P3o63J192q74R6N30k74p22l05R01j048J473N94q21
6482E79j583J241o84O69K32m50O65n1L69j625R2J017j189O22O00q06j31P83P77
6501A127j225P03j71NM22o79O62r63o12M63N80l54O85o59j95J030R39j170p67
6520a79K32M03m96j113Q35P70m40L79n09l30J060k89J18k55K75M91p94j42q67
$$ plain form
6382 -707 199 -141 188 667 859 -369 -396 228 57 473 247 578 -1013 -610 -228 -447 254 -659 -1 -683
6402 -683 -509 805 463 43 1157 -190 -18 -191 -174 363 709 -274 691 388 443 -249 361 187 -1105
6421 -1105 -628 -133 -389 222 -215 2 -464 127 474 518 -82 -377 -30 205 729 -498 -11 223 -198 43
6441 43 57 69 -98 -497 910 -83 -1059 17 -233 -308 439 -179 -273 -86 -672 287 -10 -239 723 -32 861
6462 861 -260 -411 -399 -904 -35 427 500 -163 1029 155 251 781 507 -215 -520 381 -667 806 1400 579
6482 579 -1004 237 -447 222 454 4 669 618 987 -638 -546 471 -718 -96 504 -302 -433 350 1127
6501 1127 -98 605 434 439 861 182 844 -119 -731 -268 312 -42 643 -16 -211 819 1758 588 -179
6520 -179 53 456 -40 -1153 -318 452 12 391 -118 -448 612 323 441 186 461 952 158 16 -851
6539h51J128J59m24q46J025m50P31L6n46l04N71N7r7l2q99L95Q32j019J262r69
6559b41J60l54J035q91j3O55L22l83j531M43L27J341j666M85o3Q09n10k02k75
6578e52M57M22J08j505K264o24k52m08m85Q27m83L02M13K87j384j48R17K45k31
6597A70o59K67N39o21O51P96j598J545j721K44M36l93Q41j02r62P51N99j442P33
6616G4L45q36L56M21o54R49m38p01Q90n26K18O32m66j70p47J888j360j75M53J17
6636B70l71q9l61P99J07l58mp99J24Q28j28n4J44n44j28J363n29l76m7J45m45
6657d53O70n41J172m47o46k46N68k20K06nj29l15J72M56j05K64K01r17k42P10
6677A53k00N4o5R28q44L09j29J133j542O4m95P59J72n58lk58J067k40m25L7j88
$$ plain form
6539 -851 277 436 12 -834 191 -259 472 508 -38 -342 229 286 189 157 -742 -347 485 -534 728 -241
6559 -241 -81 -435 600 -291 -304 351 673 290 -1241 -798 -471 870 -796 -311 -374 435 -75 -277 -552
6578 -552 -95 327 435 -1070 1194 570 318 -90 -575 252 -231 71 484 771 -613 -761 156 401 170
6597 170 -489 -222 317 -304 347 1143 -455 1090 -631 -387 49 -344 497 395 -567 184 783 -659 74
6616 74 419 -417 -61 360 -294 655 217 -484 406 -120 98 730 264 94 -653 1235 -125 -300 153 270
6636 270 -101 -190 -551 248 355 -3 -7 -806 -682 146 18 -36 108 -436 -564 799 270 -106 -153 -8 -453
6657 -453 217 -324 848 401 -245 -491 77 -143 63 58 -71 -386 -214 242 137 401 602 -315 -557 153
6677 153 -47 7 -58 870 26 335 206 1339 -203 -139 -634 125 297 -261 -264 -522 545 305 -120 -83 -271
6698b71k39J192j083J732j027l49J29l94R92j135j44R3P20J85o85L70r19J727
6716H94r63R8o90Q81n46J400o31l88M15p17J222p90P1l10o8o55R24n55J089m54
6736B27k70N66o72K54j84l02N28k55M69r7L44l92j258J905k044R08N32K7p60j5
6756d89n64L64J67N11o21R20m54M22m23m22O90M54j148k1K44L19O86l40j15k23
6776d3M85q18r2R04rk92K81N56j303L77j6j99N06j11q63M11M90m31J42O22N06
6797A103j937P18p26P89k51O74p56N80K71p8n06k72k23L59O08p02k0Q58p58m52
6817g21M80L40q79J61L91P07j094j28J772m47n43J006j347O56l98k1K15J08l50
6836i2L69j56p80J99K72k0l17P32m34P13n77Q61j474l6J136N3M58j098O86j611
$$ plain form
6698 -271 -510 682 -401 1331 304 -45 84 -310 682 -453 -597 -504 216 401 -284 86 -833 894
6716 894 -69 29 -661 220 -326 1074 443 55 470 -247 975 185 256 -54 -122 -777 147 -408 681 227
6736 227 -43 523 -149 105 -79 -381 147 -108 361 264 608 216 -1042 863 -1181 -273 259 286 -474 -489
6756 -489 -1053 -689 -522 -11 -632 288 -166 256 -167 -589 101 555 -593 -614 -370 -51 635 295 180 -43
6776 -43 442 -376 -468 436 427 135 416 972 -331 46 30 -169 337 226 -637 -226 264 -167 -25 597 1103
6797 1103 -834 -116 -842 -53 -304 370 -386 194 465 387 -119 -391 -614 -255 353 -349 -369 489 -269 -721
6817 -721 -241 99 -780 -619 -228 479 -615 -743 1029 582 39 1045 -302 354 -44 -65 150 258 -92
6836 -92 277 121 -659 -460 -188 -208 -525 207 -227 486 -91 770 -704 -740 396 449 907 -191 495 -1116
6856a116J218k86L26l60q0J38m16N03N27o12l26J344l95o57m70J72O61N30N34
6875A235j592n16N79P61M70r64J241j160m12M94m10K32K59k37L94l01j169J898
6893H02o26K63m17P4j11l84k88l02J154j8n38M93J87J75N54j369l16P66j60M4
6913a7q4K63K27n12m40P37N51r57N18m38m15P69P36j077P70j49j94N3n42J043
6933H42j122L8L48J56J35q73J036o86k00J069r58P96j034M41J57j30P01m03q65
6952e52J46N87k01k09K78m19L07m18m85n10K616k156N25j71Q23n8n22J272p99
6971E4Q2m85O5K85l41K20J15k85J320o82K76l73r97K67N86p39M08Q7q3k64j99
6992f83R71k03m84P44l78Q5m89P35L06J6p68L31p6m46N59j76m56L21m6K36p07
$$ plain form
6856 -1116 102 -184 142 -218 -298 -160 -576 -73 454 -158 -484 860 465 -192 -662 -490 171 701 1235
6875 1235 -357 -873 -294 467 937 -27 1214 54 -358 136 -274 -42 217 -20 374 73 -1096 802
6893 802 176 439 22 96 -15 -399 -687 -989 165 147 -391 102 289 464 1018 -351 -667 99 -61 -17
6913 -17 -101 162 389 -123 -563 174 725 -232 286 -152 -567 202 938 -139 631 482 288 341 -201 842
6933 842 -280 -242 106 262 397 -476 560 -126 -326 743 -215 581 -453 -12 145 15 716 313 -552
6952 -552 -406 181 -20 -229 49 -370 -63 -481 -966 -1476 1140 -1016 -491 -662 161 103 -419 853 54
6971 54 136 -349 -284 1 -340 -120 -5 -290 1030 348 624 251 -746 -479 107 -632 -224 -137 -220 -484 -683
6992 -683 288 85 -399 345 -33 52 -437 298 604 620 -148 183 107 -339 220 44 -412 -91 -137 99 -608
7013f08L89J60R12k64r64P24l57n11P46r93P21l99P38O5n48J12j66K77n79O15
7033G0L87k33r02M95R04p89M29J66j161K25N78k87q5O0M01j068R69M91m99J93
7053C44K7l07j00L98L09r7j13j578P78qP58o91P24L23m20J83p50j32K0K40k64
7074c56r07J521m46r3L44R28l28o83k1L35m91n27J58J263n77q7O8m76J8L97L78
7095D18j772J053m58p10J947q80M14k87J65K37l3q34N49P3m18J018k39o29Q04
7114D18l36j80k37O53l82j13N4l69M93o9J019k54o17j86J466j373J22l51M72o89
7134d59R10K35r01L14R4N60p75k03N63n27k41O71l81p62J093K11j094L57J260
7153I25l05o22q01O79K4N06M69r07J70q46J122j48r04o8K01N00k32j35k23O19
$$ plain form
7013 -608 -219 -59 853 589 -375 349 -8 -519 227 -766 -45 -444 294 359 -189 -77 -243 34 -545 70
7033 70 457 224 -678 -183 721 -68 361 527 -634 -409 169 -118 -203 -143 258 -810 159 650 151 344
7053 344 371 64 -36 362 671 574 461 -1117 -339 -347 411 -280 444 767 347 530 -220 -352 -332 -92 -356
7074 -356 -1263 258 -188 -281 63 991 663 -20 -41 294 -197 -724 -566 697 120 33 101 -375 -357 40 418
7095 418 -1354 -301 -759 -1469 478 -402 12 -275 -110 127 94 -740 -191 -118 -536 482 243 -386 418
7114 418 82 -98 -335 318 -64 -177 -123 -492 1 -68 951 697 80 -106 1360 -13 109 -242 230 -459
7134 -459 451 686 -215 99 193 753 -22 -225 338 -189 -430 241 -140 -902 191 402 -692 -335 925
7153 925 620 -2 -803 -124 -100 406 875 -32 138 -708 414 266 -638 -706 -505 -5 -237 -372 -595 24
7173B4L11m87J82J99j154N65R51o04O55n05o18M62K67q00O71j59o06L55M99p39
7193e31P26L14r93N94k8m34M93o38J057j385J258Jj28m70R40r67k76n3J382j576
7213g14LO84K27Q5OJ05k68L9J92L7J34l2rQ0l83N22j065R44j146O00o68P79J37
7236B89k82J24l24P7k7L10p82N54J35l20L82K77j294J098J12j261P26j17J216
7255H93j003m64J63J567r47j047J374m78M7q33O54K04m97j58P87p42j16J50j65
7274f11J199r64J061j255M39o1K62L6m30o18Q60M43k73K03J73m28R49k093R79
7293a29o40J202r74J99J345j295N16j36q01K63L94o4r2J83q77J214o83R55r40
7312c60J90k1Q4K83l08K42n13L50K30j74K1L57r63M61l91P38j89L29q22J14L83
$$ plain form
7173 24 335 -152 30 229 -925 -360 591 -13 642 137 -481 -19 248 -552 119 -40 -646 -291 208 -531
7193 -531 195 509 -484 110 82 -352 141 -497 560 -825 433 434 306 -164 776 -191 -467 -520 862 -714
7213 -714 -711 -27 200 285 291 396 128 167 359 396 530 498 489 569 186 708 -357 587 -559 41 -627 152 289
7236 289 7 131 -193 -116 -143 167 -615 -61 74 -246 136 413 -881 217 329 -932 -206 -323 893
7255 893 -110 -574 -411 1156 209 -838 536 58 105 -728 -74 130 -367 -525 262 -480 -596 -446 -611
7274 -611 588 -376 685 -570 -131 -192 70 106 -324 -942 -82 361 88 291 464 36 985 -1108 -129
7293 -129 -769 433 -541 -342 1003 -292 224 88 -713 -450 -56 -120 -212 -29 -906 308 -375 580 -360
7312 -360 -170 -191 -107 176 -132 110 -403 -53 177 3 24 381 -582 -121 -512 226 37 366 -456 -342 41
7333D1J87m32O55l30q4L66o23J40m24Q57r27J125K06k81o56M06j68K67m77O08
7353D56n95J146j059n9L76j035K28L92Nj32k34M43M93M31j17p01r5m34J78j60
7373d73Q00o03J10o29J265o79o21J287j648R48K40L82k35q41j65R40n31J055m02
7392B00M86m12k69n74K32L2M93j04k73P05p98l08L26n36K4M90P63j236M79K7J44
7413a09N75K6q6j190J230o53J226j041L20r2k14n2N09m91n7j1K20P0K10o95k39
7434e44J115j246K1P13n93p34J295P02o73j016R64J05k37N37N26m87m99jR8n03
7454d57O08k02j82J68o01J206k51j439J102J19o57L23M45l52n79N41L52j141J228
7473B31j07j17q68J073m21M41j413J325m64J15M29O72r78q39J078L64o26j65k73
$$ plain form
7333 41 228 -204 451 121 37 403 -220 -80 -504 353 -574 551 757 476 -180 226 58 325 -152 456
7353 456 -139 1007 -52 -111 265 -770 -542 -150 -145 -277 -511 -68 425 856 739 38 -57 -491 -313 -473
7373 -473 327 -276 -166 -795 470 -209 -830 457 -1191 -243 -3 379 144 -697 -862 78 -453 602 200
7392 200 686 274 5 -569 -337 -305 188 84 -189 516 -282 -590 -264 -800 -776 -286 477 -759 -280 -253 -109
7413 -109 466 492 406 -784 446 -207 1019 -22 298 206 -8 -60 449 -42 -99 -110 110 180 390 -305 -544
7434 -544 571 -675 -654 59 -534 -1268 27 729 56 -960 4 109 -128 409 935 448 -51 -52 46 -457
7454 -457 151 -51 -233 -65 -666 540 289 -1150 -48 71 -586 -263 182 -170 -749 -208 144 -997 231
7473 231 124 7 -861 212 -209 232 -1181 144 -320 -205 224 896 -82 -921 157 521 -105 -270 -543
7492e43m30J898j263K0k67J064j288J011p9M25j457L24L32K71j018P04O39m90
7510a47n85M98N47q93J418n30k95Rj01k29P33j60n20j22N78k32p20J498q05k93
7530c51O43r37R41m74J65L48m90M71J94j068N98K19p8K94p3j24N92j503K70J351
7550I88o30k43M29K06j140Q6l04nM61o57J29R48l03M74j81n98l9J087j715J149
7570A42M86l86p18Q69j8j06J38r56M57k33M17J82j084J349m17j94L06o3J89q04
7590d44M34J44l40J2M34n13q31Q86k18M57l9O19r32J121j143L09o0Q8p4k10j53
7611d53N69l93P04q88L19R68j482O34p80L01k49N70M96K94p72K41o16M49N91j89
7631C14k83q0L45p10n59R74O13q54p43J837j100J42K39m38P75j071Q04L58j84
$$ plain form
7492 -543 -973 925 -338 -318 -585 479 -809 202 123 548 -909 -585 -253 18 -1000 -296 343 -147
7510 -147 -732 -234 313 -580 838 308 13 22 -79 -308 425 265 -255 -377 201 -31 -751 747 -58 -351
7530 -351 292 -645 296 -178 -13 335 -155 316 510 -558 40 259 181 475 402 278 870 -633 -363 988
7550 988 358 115 544 750 -390 -304 -608 -613 -152 -809 -680 268 -35 439 258 -340 -379 708 -1007 142
7570 142 628 242 -476 393 375 269 407 -549 -92 -325 92 274 -810 539 122 -72 234 171 360 -444
7590 -444 -10 134 -206 -194 240 -273 -1104 -218 -436 21 -18 601 -331 790 -353 -44 -104 -16 -90 -300 -453
7611 -453 116 -277 427 -461 -142 826 -656 -22 -802 -501 -750 -180 316 610 -162 79 -537 -88 503 314
7631 314 31 -49 296 -414 -973 1 614 -240 -983 854 -246 -104 135 -303 472 -599 205 563 379
7650C79l38k00J32q3l20P70m50K53q4J56j06j10K38O6p56p90J663l96J67M0J114
7671A345k148Q12j31O99M40j286R04k36j11Nk54J57p43R25l10m46J893j760l81
7690f26O63m14m81J424n50P55r70L52l8r30M79J20K59P69r20J46L15J50j37m86
7710a20J03j025J664n23K91K51M79j110j44l46P14K10J22j67m78M70l08o18P79
7729B44j73k06j7L40n66J159j058K96L63n99N64pK3m96N1j16jK99q13J071q38
7750d80K03N16K67n36n45n16N94O87m60M45n39K01j05R76q33J24J03p75J030j578
7770a221J319O4j50p58N60l24P05k13o57M03j10J04o82J816q27L43oJ676k454
7789d12K452j875n22J59m68K97P22o36M76J40j065n4M72J99o51P22n22J320j101
$$ plain form
7650 379 41 -159 -27 -110 -430 340 -110 143 59 215 109 -1 237 303 -453 -1243 420 24 191 231 1345
7671 1345 -803 9 -122 577 1017 -269 635 399 288 293 39 196 -547 378 68 -378 1515 -245 -626
7690 -626 37 -377 -858 566 16 771 -199 153 115 -815 -336 -216 43 812 -108 38 353 503 366 -120
7710 -120 -17 -1042 622 99 390 641 1120 10 -134 -480 234 444 566 399 -79 391 83 -535 244
7729 244 71 -135 -152 188 -378 781 -277 19 382 -217 347 340 363 -133 -82 -198 -199 100 -713 358 -480
7750 -480 -277 239 506 -30 -575 -1091 -497 190 -270 175 -364 -163 -268 708 -125 -1 102 -673 357 -1221
7770 -1221 98 162 12 -746 -186 -510 195 -18 -675 -272 -382 -278 -960 856 29 372 366 2042 -412
7789 -412 2040 165 -357 -198 -666 -369 353 -283 193 333 -732 -786 -314 -115 -766 -44 -566 754 -347
7808c47P7j71N93j45l55R32r09P44k16m41K73n96Q53l14o51J369r90N26L77j236
7828f27R1L65M38q52l72oP99M77o61m44J614j580N37j88M00J97k89p46Q86r39
7848i00J269J26j903J312L48j45o21j02O46k02m83J062j56m16K7p7m38K65n20
7867i08K54J095L0r16R32j239P41O94j20j098J00J388n23k86K77M2j008N02q86
7886i29M67P17N93k011J088K16p18R68J25n55P16o18o70L62m3J38q58J030l45
7905c27K06q20k4R00o08N09l1J29j00n31R74k74r51P36O98j19r66J444l85o30
7925a70K92m66J67m27O83k16m66R39P8l03o26L87N60L79o10P37j29j850J804N33
7945A296j181J50O2j054R67k68n87L5n09K322k115J104k24j29K45k05k56N82m47
$$ plain form
7808 -347 -270 -441 152 7 -348 584 -325 419 203 -238 35 -561 292 -22 -673 696 -294 232 609 -627
7828 -627 -536 -171 267 -585 -957 -963 -164 313 -348 -792 822 -758 -221 -409 -9 188 -101 -847 39 -900
7848 -900 369 495 -1408 -96 252 107 -514 -616 30 -172 -655 407 251 -165 -138 -215 -653 -388 -908
7867 -908 -654 441 471 -445 487 -752 -11 683 563 -535 -435 953 430 144 421 463 -545 -43 -929
7886 -929 -462 255 848 -1163 -75 141 -577 391 516 -39 677 59 -611 -249 -292 -154 -1012 18 -327
7905 -327 -121 -941 -965 -65 -673 -164 -195 -66 -166 -697 277 3 -948 -212 486 367 -599 845 460 -170
7925 -170 122 -344 -177 -604 79 -137 -603 336 414 111 -515 -128 432 811 201 938 809 -1041 763 1296
7945 1296 115 265 327 -727 240 -28 -615 -580 -1089 1233 -882 222 -2 -131 114 -91 -347 235 -212
7964b12N62J49l44J24j272J341j37k54k66P16K71q17k81L28J113j038m07O05j17
7983F4j58k91J428j311n44J111K27q7j8j382M64J182n47R4M82k74M47q29m52M36
8003D2J39k19R7m91K41K46n26M9K76J002r66M9l59Q7P83m79l02J06K88J02p54
8024e89J697k204J046j104R95N71k90k00J041j267L08O73l09j85o85J54K5J09
8042b14J95m01L67N34j99p4m60N92k20k91K82k64M56m34J24M0K47j3m58J50J43
8063A02K28j163O90J75l24K00j72rQ2o61Q97l40O17n62L26NL70o8k36j90l79M03
8085iP7J18o10K73k68L81M8m59K69N84L09o76j321MP51P46l35P9k64K70J72N3
8107A92K14k51l15N80j01k47J074j056m42k70M28k8j00J028k37o91K22Q43l48
$$ plain form
7964 -212 350 499 155 279 -993 348 211 -43 -309 407 678 -139 -420 -92 1021 -17 -424 181 64
7983 64 -94 -385 1043 -268 -812 299 526 439 421 -961 -497 685 138 232 714 440 887 58 -394 42
8003 42 181 -38 59 -432 -191 55 -471 -422 -146 856 -110 -61 -420 -333 450 -29 -331 -225 63 165 -589
8024 -589 1108 -1096 -50 -1154 -159 412 122 -78 963 -304 4 677 368 183 -502 -348 -323 -214
8042 -214 -19 -420 -53 481 282 208 -252 340 120 -171 111 -153 303 -131 -7 33 280 267 -191 -41 102
8063 102 330 -833 -143 32 -292 -92 -264 -273 -191 -852 45 -295 322 -240 86 91 461 393 157 -33 -412 -9
8085 -9 68 186 -424 -151 -419 -38 10 -449 -180 404 713 37 -1284 -1280 -529 217 -118 -39 -303 -33 139 192
8107 192 406 155 -160 420 319 72 1146 90 -352 -622 -194 -222 -322 706 469 -222 0 843 495
8126D95k52o04P20l30l98K97r1K49p9m25r5L50k75J487q8k45j039L66q82P20K24
8147A05j5m18R07o63N32p63L48k7l26m7k47M63j77P24l01o56N06p44J2J95L67
8168b25O72p48l65M9N75j61M15p05N74l19K54q43J141k73j28J76l15OK7k65N46
8189H8l04J27
$$ plain form
8126 495 243 -361 359 29 -369 -72 -163 86 7 -418 -513 -163 -438 1049 961 716 -323 43 -839 -119 105
8147 105 90 -328 579 -84 448 -315 33 6 -320 -367 -614 -151 -328 396 95 -561 -55 -799 -787 -592 -225
8168 -225 447 -301 -666 -617 -42 -203 212 -493 81 -238 16 -827 314 41 -87 89 -226 -220 -193 -458 88
8189 88 -216 -89
8191h9
$$ Imaginary data points
##PAGE= N=2
##DATA TABLE= (X++(I..I)), XYDATA
0@%%%%%%%%%%%%%%%J08k16K16k16K16k78L86m32N38o46P07q15R72j126J238j410
31g58J626j864K165k466K773l112L483l913M371m882N442o045O707p426Q207r074
47d766J0017j1036J2160j3396J4758j6262J7922j9777K1864k4208K6885k9965
59a5804L3532l7752M2837m9100N7010o7394Q1725j02946J38023k09958O63974
70E34147j261852j62877K013060l85585j225179k5392J050789o1611o35315k19190
80c79005K75455M96432n1415j020986K57011J129346m49081j118891N91285R60870
90F91021o59874p82765O96707M65832n91841j76976L30858m3078Q1423o115l52040
101c46848J83384N20163l44907n24631N49321N10613p23862k80352Q23534n6288
$$ plain form
0 0 0 0 0 0 0 0 0 0 0 0 0 0 0 0 0 108 -108 108 -108 108 -170 216 -216 322 -324 383 -432 540 -586 652 -758
31 -758 868 -996 1169 -1297 1476 -1636 1847 -2066 2305 -2577 2865 -3180 3527 -3899 4308 -4766
47 -4766 5251 -5785 6375 -7021 7737 -8525 9397 -10380 11484 -12724 14161 -15804
59 -15804 17728 -20024 22813 -26287 30723 -36671 45054 -57892 80131 -129827 534147
70 534147 -727705 -890582 1122478 736893 -488286 -513678 537111 475500 -159815 -379005
80 -379005 -103550 392882 341467 -679519 -422508 706838 257757 -861134 -269849 691021
90 691021 31147 -751618 -54911 410921 -180920 -357896 -27038 -70116 11307 5192 -346848
101 -346848 -163464 356699 11792 -512839 36482 547095 -176767 -457119 366415 310127
111C10127o39960K80779L09153k87621p0423K22771j49975r5895L40065j49620
121F9401l91120M52883K31990o22892M0911N72790k43727m56740L56907K68263
131B78666m39657l9756L66308j89848j88628L20199p4606k79728L11129J26863
141A90942l98547P2910M20825k44039l26125L95440J64808m60760O5806L91211
151B72471k77539j62357L27842n4880k48518K20180J40146l25845N0639L58044
161C00183k53361k54819M09733L2099m17639J65684K75020k81484j33453L13325
171A55288n7766k81122K25269J33728l23304N9624L03938k51014j66547L32122
181A30216j1943l24524J51894K38095k80403j04478L15578p8248k73899K40072
$$ plain form
111 310127 -329833 -49054 260099 -27522 -97945 124826 -25149 -121044 219021 69401
121 69401 -321719 131164 363154 -259738 -218827 353963 110236 -346504 10403 278666
131 278666 -160991 -200747 165561 -24287 -212915 107284 32678 -247050 64079 190942
141 190942 -207605 -134695 286130 42091 -284034 111406 276214 -184546 -118740 272471
151 272471 -5068 -167425 160417 105537 -142981 77199 217345 -108500 -57861 300183
161 300183 46822 -207997 201736 233835 -183804 -18120 256900 -24584 -158037 155288
171 155288 97522 -183600 41669 175397 -147907 -88283 215655 -35359 -201906 130216
181 130216 118273 -206251 -54357 183738 -96665 -201143 114435 36187 -237712 2360
191B360J16348l08482Q6113K42815k05676j26622K78131m365k85229J63218K08135
202A66746k84633m4772L12641j44314k04150K48238O1633k52987P0486K32756
212A61644j88015j22629K79214k7798k61673J92544J51411k71515J2193K42711
222A68087j26436j74238K09500O9758k56241P4091K17403k02819r6981K63698
232A45822o7591k06219J74052R5228k11666l38K14326j22062j64129K17579L1566
243A06568k45067J12923J63522k05882l5775K01911o3119j67430J48267J00246
253A16164k18300K8181K08220j54790j15376K19476j7489j94164J16347J25204
263A13473j66299m7728K04191o4105j71306J72798P0868k10342N7259J69336j48487
$$ plain form
191 2360 118708 -189774 -103661 139154 -66522 -193144 84987 80622 -204607 -41389 166746
202 166746 -117887 -162659 149982 5668 -198482 49756 111389 -141598 -71112 161644
212 161644 -26371 -149000 130214 102416 -159257 33287 184698 -86817 -74624 168087
222 168087 41651 -132587 76913 146671 -109570 -35479 181924 -20895 -117876 145822
232 145822 78231 -127988 46064 141292 -70374 -70712 143614 21552 -142577 75002 106568
243 106568 -138499 -25576 137946 -67936 -103711 98200 35081 -132349 15918 116164
253 116164 -102136 -73955 134265 -20525 -135901 83575 66086 -128078 -11731 113473
263 113473 -52826 -100554 103637 39532 -131774 41024 111892 -98450 -41191 128145 -20342
274b0342p4286J73913r503j71853R6263J29978j80391k4665J92197r0839j33149
285a12677J61915L0687j66567N6413J27599j15341p9227J67460j6062j66370J17100
296D930Q9782j65994P854J53129r3479r3253J31774K7753j49700M8178J33758
307I4732j33839n1041J64575m5663j27558J17357O0542j41962J7833J28229p6780
318F425r4710J36204J8801j50912P5146R9257j27651k4705J37405n0688j00077
329g5505J00239N1072j24715J3473J27200r1956p0682J28584n295j22328O9048
340h65P4918j08788j5509J07529l6529r6270R5688M5207j25259L4158J00927q6903
352a1696m9487J11557j6203r7118O1103O0795r5910j7280J11478n2836p9606R8137
$$ plain form
274 -20342 -94628 79285 69782 -102071 -5808 124170 -56221 -80886 111311 20472 -112677
285 -112677 49238 79925 -86642 -30229 97370 -17971 -97198 70262 54200 -112170 4930
296 4930 94712 -71282 -63428 89701 -3778 -97031 34743 62496 -87204 -39026 94732
307 94732 -39107 -90148 74427 28764 -98794 18563 79105 -62857 -45024 83205 6425
318 6425 -88285 47919 66720 -84192 -9046 90211 -37440 -62145 75260 24572 -75505
329 -75505 24734 75806 -48909 -35436 91764 -192 -70874 57710 52415 -69913 -865
340 -865 74053 -34735 -50244 57285 20756 -75514 20174 65381 -59878 -25720 75207 -11696
352 -11696 -61183 50374 34171 -62947 -1844 58951 -36959 -54239 57239 4403 -75203 22934
364B2934K0919j03680L9077P9865p7939k9493R0241j1490q8539N9643N6455r9142
376d1149K699R2556n6956n7294Q6829P033q0816L5990O4934o1828l3848R2214
388E0364j8824p9880P0203L1850q4383J2131O8894n3033m0405O5845J0391p6347
400d3194L1661O5647p6422j3165P9436l1474n5689N9151J9169o7207J0943N5496
412C4352m0579m5959O9509k58p1133M5778L9168o0068j128O1955k5654l8877M4714
425A1820K5581o1040Q575O2578n4170k5387O2740j4426n0067L6922K8745m6376
437a4505m447N2584j8092m6294N3710J2313o1428K6739L3622m2259j5996M2578
449A8525j1470m1628K4830K8770m7626k164N3838l2408k4611M4606N76l7119J7621
$$ plain form
364 22934 43853 -59827 -20750 59115 -18824 -48317 41924 30434 -58105 1538 57993 -41149
376 -41149 -38450 54106 -2850 -60144 26685 33718 -47098 -11108 53826 -8002 -41850 50364
388 50364 31540 -48340 21863 53713 -30670 -18539 50355 -2678 -43083 22762 33153 -43194
400 -43194 -11533 54114 -22308 -35473 43963 12489 -43200 15951 35120 -32087 -21144 34352
412 34352 -6227 -52186 17323 17065 -54068 -8290 30878 -29190 -30318 31637 5983 -32894 11820
425 11820 37401 -23639 -15064 47514 -6656 -32043 30697 16271 -33796 3126 31871 -14505
437 -14505 -18952 33632 15540 -30754 22956 35269 -26159 580 34202 -8057 -24053 18525
449 18525 7055 -34573 -9743 19027 -28599 -30763 23075 -9333 -33944 10662 11238 -25881 -8260
462h260K9291l1628j5426L9579m835m4151L2001K1844m5835J2404L2272k1961
474d705j4793L2531N932l2417J5307L0637l3222j2219M2802k0740k6413K7261
486I961M396k5805K345K5633j6452j6348L0128M167l2083K1295K1258l1547L320
499B68K2604j2010j8735J6522Q847k6996M033K2680j8717j3988L1489p471k1195
512a2669K0094R860j9306k952K0334j0341j7035J4671M631k5796P411J5836k3146
525a8408k444J7032l525j4476J0118J3089j5019k072J7568m774j4318J7064M7
538a18j5744Q458Q256j1312n518J7872j602j3713J1807J3599j4927J367J8866
551A7291j1998k470J1470k253j1280O029O336j2765m554J2185k352j5227J3669
$$ plain form
462 -8260 21031 -10597 -26023 13556 8721 -35430 -3429 18415 -27420 -15016 17256 -4705
474 -4705 -19498 13033 18965 -13452 1855 32492 -730 -12949 29853 9113 -17300 9961
486 9961 14357 -11448 -9103 16530 78 -16270 13858 18025 -14058 7237 28495 -3052 268
499 268 22872 10862 -7873 8649 17496 -9500 -5467 17213 -1504 -15492 15997 8526 -12669
512 -12669 7425 17285 -2021 -4973 15361 5020 -12015 2656 7287 -18509 -11098 4738 -18408
525 -18408 -20852 -3820 -7345 -21821 -11703 1386 -13633 -15705 1863 -2911 -17229 -165 -118
538 -118 -15862 -7404 852 -10460 -15978 1894 292 -13421 -1614 11985 -2942 -1575 17291
551 17291 5293 2823 14293 12040 760 6789 13125 360 -4194 7991 5639 -9588 4081
564D081K570j1216Q497K031l890m315P164Q38j0213K182Q508j0633m215J0874
578B263o325k462L128K423o95q83P033k515l537Q206K969j1912Q170N079j0143
593G99K255J406r88m019K407K076n609J917O641q412n40J0704p850r37K831k096
609E85J088o116K160p34m701M725k660o827P649q54m148N147j525L077k280k123
625g537P431k715k833L710j957j908O085n950K1L173J388J45m148P411J344l566
641I4L183K101n022O158k116n564P713k202l41k318O96M496n414J289L945l588
657C110R56J922m535N034r30l940L353m187K807j317m630J678J085j250j244j081
673c169K95L571m447K257j522o24L715m431O48L126j548k510K960j528J136Q71
$$ plain form
564 4081 6651 -4565 3932 5963 2073 -2242 4922 5760 -4453 -2271 6237 -4396 -8611 2263
578 2263 -4062 -6524 -3396 -973 -1668 -2551 4482 1967 -1570 6636 9605 -2307 5863 10942 799
593 799 3054 4460 3472 -547 1860 3936 -1673 244 6885 -1527 -2067 8637 787 -150 2681 585
609 585 1673 -4443 -2283 -3017 -7718 -2993 -5653 -12480 -4831 -5685 -9833 -4686 -6211 -3134 -5414 -7537
625 -7537 -106 -2821 -5654 -1944 -3901 -5809 276 -5674 -5653 -2480 -1092 -947 -5095 2316 3660 94
641 94 3277 5378 356 6514 4398 -1166 6547 4345 4004 1686 2382 6878 1464 2753 6698 3110
657 3110 4066 5988 1453 6487 5557 1617 4970 783 3590 2273 -2357 -679 406 -844 -2088 -3169
673 -3169 -2874 697 -3750 -1493 -3015 -3639 76 -4355 -3707 -581 -2129 -4639 -1679 -3207 -2071 -1200
689a200l127J496j374L812p00j298N249j464l271L805l79j865L335l315L154P80
705C638k800K675k286K216o44q50j006O01R71n94j041j488M539n149R82K923k502
722A85Q2N2j891J032J243m046K738n78n69n42m56O54k93Q65J13j469J301L280
740A701m045m19M095k170L3k42m37P01r92J729q71k41K53J621k307K664P81j99
758A655J540m171L474M80k948J706K09k019N18J256j895P62j842J385l85l94L350
775B681m034K056K645l513r3K024j756J553j649j116K346l478K564n06j391K362
791F95m43j089K087k59R52M76l094M617l679j608L437m744J264Q59j575j40J516
808g28o50L68j87J000J689m454L824k20l135L434r42k161P69J796k074m66J623
$$ plain form
689 -1200 -4327 -2831 -4205 -393 -1093 -2391 2858 1394 -1877 1928 1549 -316 3019 -296 2858 3638
705 3638 838 3513 1227 3443 2799 1949 943 1544 2515 1921 880 -608 3931 -1218 -236 2687 185
722 185 267 319 -1572 -540 703 -3343 -605 -1183 -1752 -2294 -2750 -2096 -2389 -1524 -1411 -2880 -1579 1701
740 1701 -2344 -2763 1332 -838 -805 -1047 -1484 -783 -1775 -46 -917 -1158 -905 716 -1591 1073 1854 1655
758 1655 3195 -976 2498 2978 30 1736 1945 -74 444 1700 -195 567 -1275 110 -275 -669 2681
775 2681 -1353 703 3348 -165 -258 1766 10 1563 -86 -1202 1144 -2334 230 -276 -1667 695
791 695 252 -837 1250 991 1943 2419 -675 3942 263 -1345 2092 -2652 -1388 -529 -2104 -2244 -728
808 -728 -1378 -1010 -1197 -197 1492 -2962 862 642 -2493 941 -1 -2162 -1393 403 -1671 -2137 -514
825e14Q66k072q09O285l501J160K243k680J858j25k56r28k710K629O01n748L977
842B76K16l630J953J540P0j239J057K159k401l64L553m016k013M810l697k083
858c809J772M81j203n67L482l65p48J634K439k796K676N35l900L567j12l37l148
875c99O06J478l218J4L052j577k281L282j636O95N87O23R3l114K972j995j951
892b769L69K472m266J138K845l401o62L500R9k949M224J366j813l21L272m30l727
909a053L533q98j894k95K165k223p67L547j104j615K037L010l424J08L683k470
925B340j613O55J45l094P29J363k616j916L338P38k679L078J995k736O78J797
941B202k97k078L548k127j914n78L820n030m10M283k409p86J937Q05k892J929
$$ plain form
825 -514 352 -1720 -2529 3756 255 1415 3658 978 2836 2711 2455 1527 -1183 1446 2047 -3701 276
842 276 492 -3138 -1185 355 425 -814 243 2402 1 -363 3190 -826 -2839 1971 -1726 -3809
858 -3809 -2037 -1556 -2759 -3326 156 -209 -957 677 3116 320 2996 3531 -369 3198 3086 2749 -399
875 -399 207 1685 -1533 -1519 1533 -44 -2325 957 -679 16 603 1226 1319 -1795 1177 -818 -2769
892 -2769 -2400 72 -4194 -3056 -211 -3612 -4274 -774 -675 -3624 600 1966 153 -168 3104 2674 -1053
909 -1053 2480 1582 -312 -607 1558 -665 -1432 2115 1011 -604 1433 4443 1019 1127 4810 2340
925 2340 727 1382 1527 -1567 -838 525 -2091 -4007 -669 69 -2610 468 2463 -273 405 2202
941 2202 1905 -173 3375 1248 -666 -1244 2576 -2454 -2864 1419 -990 -1776 161 966 -1926 3
957CK347j863k418K898L77m301L050k85l144J384l31o65j609L101k77j800Q17
974b716M728l771o84M730k012J74L32J312k198k577M354j027k120J745K544m396
990a582L250K180k681J064O82L85k864K383K204k701k472L861m513j886N418l785
1006a057j689J252J759k260j172M169q88k869L257R18l872J686J24j628L17K46
1022a707J376l336K181J886k508p14M137m89k231J779P07j116O7J886q50m248
1038c180M789l5m529K409K859m223L57K599j242j596K333J486k858L27K786l421
1054a139r23L351O48l153R01J479j428j473K461P44k807J543L13q86M41K686l358
1071f00L83N23Q71k362O29L306n457R39K658j553J90M65J859l096K309Q22j766
$$ plain form
957 3 2350 487 -1931 967 1344 -2957 93 -192 -3336 -1952 -2283 -2948 -4557 -1456 -1733 -3533 -2716
974 -2716 2012 -1759 -2443 2287 275 449 781 2093 -105 -2682 1672 645 -1475 270 2814 -1582
990 -1582 1668 3848 1167 2231 2913 3298 434 2817 5021 2320 -152 3709 -804 -2690 2728 -1057
1006 -1057 -2746 -1494 265 -1995 -3167 1002 114 -2755 502 1420 -2452 -766 -642 -2270 -1953 -1707
1022 -1707 -331 -3667 -1486 400 -2108 -2822 1315 826 -1405 374 1081 -35 32 1918 1068 -3180
1038 -3180 1609 1574 -2955 -546 2313 -1910 -1553 1046 -196 -1792 541 2027 -831 -504 2282 -1139
1054 -1139 -2062 1289 1937 -1216 -315 1164 -264 -1737 724 1468 -1339 204 517 -369 72 2758 -600
1071 -600 -217 306 1177 -1185 -556 2750 -2707 -1768 890 -663 -473 -8 1851 -1245 1064 1886 120
1088A20r18K153k36l420L442l3k288o91K315o62j143J902j47n26k89K476l023
1105i68o38K610k314J072pO50j969J033R57Rj611K46R08k340K453Q37j926K9J399
1124D30M39k725K092L67q89L11K144j430j383J954k06k85m94K266k798Q12p06
1141a01L31l8K11Q93o13M14j88j402R75p01K13m97N89K6M74k060J600J155k634
1160a353J065Q48m78j032J378r82J256j824Q06m59m23J724k169R54J081j790r2
1177a490k07J296n66J024j43l44j52K62J066j437K220j626l62j58P72P13j338
1194d70Q57l82j40r13L297k016P3J245j098l07K94R02q63L14q98J668j989j620
1212b046K471j593L60J216j927K312r34l8m42J546K18j51p31L51j499J134j77
$$ plain form
1088 120 -798 1355 1119 -2301 1141 1108 -1180 -1871 444 -218 -1361 541 394 -132 -421 2055 -968
1105 -968 -1606 1004 -1310 -238 -245 405 -1564 -531 426 435 -1176 -930 -22 -2362 91 928 -998 -969 430
1124 430 869 -1856 236 603 -286 25 2169 739 -644 1310 1104 819 325 2591 -207 605 -101
1141 -101 230 192 403 1296 683 1097 909 -493 482 -219 -6 -503 86 112 586 -1474 126 1281 -1353
1160 -1353 -288 560 82 -950 428 -554 702 -1122 -316 -775 -1198 526 -1643 -689 392 -1398 -1490
1177 -1490 -1697 -401 -967 57 -86 -430 -582 -320 746 -691 1529 -97 -459 -617 155 868 -470
1194 -470 387 5 -135 -1048 2249 233 306 1551 453 146 440 1342 479 793 -105 1563 -426 -2046
1212 -2046 425 -1168 -808 408 -1519 793 -141 -179 -621 925 1143 992 261 612 -887 247 70
1229G0j928K397p42n88R58J17l6m02J200r08M12n0J05j104J577j487j150Q77j397
1248b079J157j77j98N15N56p16K30O3o52J775o35L60O41l80o99l33Q83l83j73
1267b45J28L94q12P28M72j243K221o55k42k47K296j673r44J114p48l40K34Q06
1285A244j604K05k33o94K66J381L01j379P44q78J416N29j486n45N55o5j199J231
1303b11j060Q91J81P00o78m56J558J08J35n84k57M39n96P2p06J630k438J151j027
1322a148P49N5j329J412L63O2p06Q25l73P35j096L0R30j654N41q81L59Q81m74
1341g19j2k78Q87M40N37p92J704r63O99m90j019J239l14j19j664L57J607j536
1359d36k6Q51J20o47J334r63J049l56k5p3k18J86L0k003P35J394j611o46J126
$$ plain form
1229 70 -1858 539 -203 -791 167 284 248 -154 1046 138 550 500 605 -499 1078 -409 -1559 -682 -2079
1248 -2079 -922 -1099 -1297 -782 -226 -942 -712 -649 -1301 474 -161 199 840 460 -239 -572 311 -72 -245
1267 -245 -117 277 -535 193 665 -578 1643 988 746 499 2795 1122 178 1292 544 204 438 1244
1285 1244 -360 -155 -388 -1082 -816 565 866 -513 231 -647 769 1298 -188 -733 -178 -243 -1442 -211
1303 -211 -1271 -380 -199 501 -177 -633 925 1033 1168 584 327 766 170 242 -464 1166 -1272 -121 -1148
1322 -1148 -399 -344 -1673 -261 102 164 -542 283 -90 645 -451 -421 509 -1145 -604 -1485 -1126 -245 -719
1341 -719 -731 -1009 -122 318 855 63 1767 804 1503 1013 -6 1233 919 800 -864 -507 1100 -436
1359 -436 -462 389 509 -138 1196 233 1282 926 901 828 610 796 826 -1177 -442 952 -659 -1305 -179
1378a79J32O37r49N8Q9m2J067J29j464Q22J647k450J030N79j409j25J010n06j828
1397a752K148m83M6J21O71r03O23M70k54r37m5J875j061k367J052O3j859K146
1415d46J026j786P35J658r50j139R24J312k155K80K896k194j89L23q12n03O29
1432c91Q01j53j140J828j76j139J074Q88j858p31K114j046j635K280o69j926R45
1449i34J422k852K170N21j338o41K247R33l372J715J449j878P41Q85q21j207K860
1466A900j330j307Q4J277p12j915L887Q6l005M51K727j910j19J906j05l633K906
1483A188J721m035J154K111k076k228M346m91l172J871J046k219M73J970j248
1498D11q36K076j26j430j063K610k271j375K796K29k727J025K254l565O39K527
$$ plain form
1378 -179 -47 590 -359 -301 -212 -254 813 942 -522 300 1947 -503 527 1106 -303 -428 582 76 -1752
1397 -1752 396 -87 -41 80 751 -152 471 941 687 -250 -295 1580 519 -1848 -796 -733 -2592 -446
1415 -446 580 -1206 -471 1187 237 -902 22 1334 -821 -541 2355 161 -28 295 -517 -1020 -391
1432 -391 410 257 -883 945 769 -370 704 1592 -266 -997 1117 71 -1564 716 47 -1879 -934
1449 -934 488 -2364 -194 327 -1011 -1652 595 1528 -1844 -129 1320 -558 183 1068 247 -960 1900
1466 1900 570 -737 -653 624 -88 -2003 1884 1970 -1035 -584 2143 233 114 2020 1915 -1718 1188
1483 1188 2909 -1126 28 2139 63 -2165 2181 1690 -1482 389 1435 -784 -311 1659 411
1498 411 -425 1651 1525 95 -968 1642 -629 -2004 792 1021 -1706 -681 1573 -1992 -1353 1174
1514A174j222k087L419R2m084J757L348l433j295M512j569l656L805O43k803l91
1530a790K923k028j655L836o07k933J620K077k717j320L570r74j772J957J767
1545A954m083J545K216k860j260L964M74m572K935J741l266o95M292k048k552
1560b215L891K88l372R83L242k975j671L033J5m403L184L558n721Q40M332k351
1576F58l031L934L36m701K365K911l360k234N038j793l472L795K011m674Q13N567
1592D163m623k878N207k97m052J877M148n356o93N804l219l891M592K155n308
1607b371J269M074l414k184N063l49o125M638K684m849p01N506l092l817M961
1622A293J782m983P32M765m331k009M818n76m989L310L422n913o17P008l634k426
$$ plain form
1514 1174 -48 -2135 1284 1376 -2708 -951 2397 -1036 -2331 2181 612 -3044 761 1404 -1399 -1790
1530 -1790 1133 -895 -2550 1286 679 -2254 -634 1443 -1274 -2594 976 2 -1770 187 1954
1545 1954 -2129 -584 1632 -1228 -2488 1476 1950 -2622 313 2054 -1212 -1907 2385 337 -2215
1560 -2215 1676 1964 -1408 -425 2817 -158 -1829 1204 1219 -3184 0 3558 -2163 -1323 3009 658
1576 658 -2373 1561 1897 -2804 -439 2472 -888 -3122 1916 123 -3349 446 2457 -2217 -1404 4163
1592 4163 -460 -3338 1869 1572 -2480 -603 3545 -1811 -2504 3300 81 -3810 782 2937 -2371
1607 -2371 -1102 2972 -442 -2626 2437 2088 -4037 601 3285 -1564 -2265 3241 149 -3668 1293
1622 1293 3075 -1908 -1176 3589 -742 -2751 2067 1491 -3498 -188 3234 -2679 -3296 3712 78 -2348
1638b348L813P55n717K750M548o130r33O173j400o250N062L469n695O38N075m026
1654b16l858N986k24n025K428M609n235j106P219k759m849L432M492q775K879
1669a002L923l879l174O941j319n325K760N179n092k805Q389l044n634N783J376
1684C077n909R03N843m647k457O557p42o867M496M100p355O51N279k995m141O203
1700A996J397p809L619M860m168l397Q047k251p543O189K494o129n80O876k554
1715A047n296O057J110p483L485N827o675k074P639k298n867N267L307p186N13
1730b627O216l786m885P295L95q497N462M036o023j779Q686k931n614M828L026
1745C802q222J662P146n953k972O899l06o075M356M273p417J185O284k670o391
$$ plain form
1638 -2348 1465 2220 -3497 -747 3801 -2329 -3262 2911 1511 -4739 323 3792 -1903 -1265 3810 -216
1654 -216 -4074 1912 1688 -3337 -909 3700 -1535 -2641 4578 1819 -3030 402 4894 -3881 -1002
1669 -1002 2921 -958 -4132 2809 1490 -3835 -1075 4104 -988 -3793 4596 1552 -4082 1701 3077
1684 3077 -2832 -1929 3914 -733 -3190 3367 2625 -4242 254 4354 -3001 -2350 2929 -66 -4207 1996
1700 1996 3393 -4416 -797 4063 -105 -3502 4545 2294 -5249 940 3434 -2695 -3275 3601 1047
1715 1047 -4249 1808 2918 -4565 -1080 4747 -1928 -4002 3637 1339 -4528 739 4046 -3140 -2627
1730 -2627 3589 -197 -5082 2213 2608 -5889 -427 3609 -2414 -4193 4493 1562 -4052 776 3802
1745 3802 -4420 -2758 4388 -1565 -4537 2362 2056 -4019 337 4610 -2807 -1622 4662 1992 -4399
1760d399O507K293q469K721O633o392l071P875j915o483N655K845o052o77O684
1775C755k977m465N968Q15o928K464N947o521j231O706j640o805N097M251o776
1790b340Q70N598k638n158P373j126p858M177N714n396k792P664l062n591M805
1805B40M101p932R87P392n789l075P237q43n426J905M675m854j992N894q53o786
1821e119O597J632o904J882O693n163k860P140j532o392M609L220n951j884Q133
1836D101l863l956M758K446o848J173O483o538j565O222k01o746L588N232o570
1851b284o61P152m045m910O840k0o761L246N068n005k149P489j442o750N370L021
1867D159p142J104O675m343m604O424L62o421L198N926o443k039O605k720n355
$$ plain form
1760 -4399 2108 4401 -4068 -1347 5286 -1106 -4177 3698 1783 -4700 955 3800 -2252 -2929 3755
1775 3755 778 -3687 2281 3096 -3832 -1368 4579 -1942 -3173 3533 1893 -4912 185 4436 -2340
1790 -2340 -1470 4128 1490 -3668 3705 2579 -5279 -1102 4612 -784 -3576 4088 1026 -4565 240
1805 240 4341 -3591 -2604 4788 -1001 -4076 3161 2318 -3108 -1203 3472 -1382 -3374 2520 1667 -5119
1821 -5119 1478 3110 -3794 -1912 4781 -382 -3242 3898 2366 -4026 583 3803 -2148 -4032 4101
1836 4101 238 -3718 1040 3486 -3362 -2189 4294 -2244 -3809 2413 2212 -4534 -946 4286 -2284
1851 -2284 -2945 4207 162 -4748 2092 2072 -4689 -1443 3625 -1380 -3529 3960 2518 -4232 1138 4159
1867 4159 -2983 -1879 4796 453 -4151 2273 2635 -3786 -588 5338 -1105 -3144 3461 741 -4614
1882d614N486L115o249J158M189k442m682O874L60q168N051L710n257q31O317
1897D017l332m907N164K408o429J992N688o305j352N749m39o074M832K778n832
1912b042L26N055l395l155M875J178o283L343M189n737j173O156o40o124L988
$$ plain form
1882 -4614 872 3987 -2262 -1104 3085 643 -4039 2835 3195 -4973 78 3788 -1469 -2300 4017
1897 4017 685 -4222 942 3350 -3079 -1087 4601 -1704 -3056 2693 2254 -3820 1012 3790 -2042
1912 -2042 -1716 3339 -56 -3211 1664 2842 -3441 -98 4091 -1646 -2819 3337 2697 -3427 561
$$ [...]
8191H7
##END NTUPLES=NMR FID
##END=
