##TITLE=1H_SA_61_TFA
 CDCl3, 8 sc, 
 23.08.2021
##JCAMPDX= 6.0         $$ Bruker NMR JCAMP-DX V2.0
##DATA TYPE= NMR FID
##DATA CLASS= NTUPLES
##ORIGIN= UXNMR, Bruker Analytische Messtechnik GmbH
##OWNER= root
$$ XWIN-NMR		Version 3.5
$$ Mon Aug 23 13:15:52 2021 Russian Standard Time (UT+4h)  she@DPX200
##.OBSERVE FREQUENCY= 200.131506
##.OBSERVE NUCLEUS= ^1H
##.DELAY= (6, 6)
##.ACQUISITION MODE= SIMULTANEOUS
##.ACQUISITION SCHEME= undefined
##.AVERAGES= 8
##.DIGITISER RES= 18
##SPECTROMETER/DATA SYSTEM= spect
##.PULSE SEQUENCE= zg30
##.SOLVENT NAME= CDCl3
##.SHIFT REFERENCE= (INTERNAL, CDCl3, 0, 15.7039)
##AUDIT TRAIL= $$ (NUMBER, WHEN, WHO, WHERE, WHAT)
$$ ##TITLE= Audit trail, XWIN-NMR		Version 3.5
$$ ##JCAMPDX= 5.01
$$ ##ORIGIN= Bruker BioSpin GmbH
$$ ##OWNER= she
$$ F:/spectra/data/she/nmr/H-F/1/audita.txt
$$ ##AUDIT TRAIL=  $$ (NUMBER, WHEN, WHO, WHERE, WHAT)
(   1,<2021-08-23 13:14:14.09 +0400>,<she>,<DPX200>,
      <created by zg, POWCHK disabled, PULCHK disabled
       configuration hash MD5:
       00 E9 B6 7A A2 85 ED C7 34 08 36 98 17 FE 4E 26
       data hash MD5: 16K
       98 71 E5 05 19 D6 88 31 B1 C5 01 A2 5E 72 AB 44>)
$$ ##END=
$$ 
$$ hash MD5
$$ 00 81 0D 31 86 2C 3F C0 95 9D 4E 04 A6 1D A0 72
##$RELAX= 
##$RELAX= 
##$RELAX= 
##$RELAX= 
##$RELAX= 
##$RELAX= 
$$ Bruker specific parameters
$$ --------------------------
##$DU= <F:/spectra>
##$EXPNO= 1
##$NAME= <H-F>
##$PROCNO= 1
##$TYPE= <nmr>
##$USER= <she>
##$AMP= (0..31)
100 100 100 100 100 100 100 100 100 100 100 100 100 100 100 100 100 100 
100 100 100 100 100 100 100 100 100 100 100 100 100 100 
##$AQSEQ= 0
##$AQ_mod= 1
##$AUNM= <au_zg>
##$AUTOPOS= <>
##$BF1= 200.13
##$BF2= 200.13
##$BF3= 200.13
##$BF4= 200.13
##$BF5= 200.13
##$BF6= 200.13
##$BF7= 200.13
##$BF8= 200.13
##$BYTORDA= 1
##$CFDGTYP= 0
##$CFRGTYP= 5
##$CHEMSTR= <none>
##$CNST= (0..31)
1 1 145 1 1 1 1 1 1 1 1 1 1 1 1 1 1 1 1 1 1 1 1 1 1 1 1 1 1 1 1 1 
##$CPDPRG= <>
##$CPDPRG1= <>
##$CPDPRG2= <>
##$CPDPRG3= <>
##$CPDPRG4= <mlev>
##$CPDPRG5= <mlev>
##$CPDPRG6= <mlev>
##$CPDPRG7= <mlev>
##$CPDPRG8= <mlev>
##$CPDPRGB= <>
##$CPDPRGT= <>
##$D= (0..31)
0 1.2 0 0 0 0 0 0 0 0.06 0 0.03 0 0 0 0 0.0002 0 0 0 0 0 0 0 0 0 0 0 0 
0 0 0 
##$DATE= 1629710053
##$DBL= (0..7)
120 120 120 120 120 120 120 120 
##$DBP= (0..7)
150 150 150 150 150 150 150 150 
##$DBP07= 0
##$DBPNAM0= <>
##$DBPNAM1= <>
##$DBPNAM2= <>
##$DBPNAM3= <>
##$DBPNAM4= <>
##$DBPNAM5= <>
##$DBPNAM6= <>
##$DBPNAM7= <>
##$DBPOAL= (0..7)
0.5 0.5 0.5 0.5 0.5 0.5 0.5 0.5 
##$DBPOFFS= (0..7)
0 0 0 0 0 0 0 0 
##$DE= 6
##$DECBNUC= <off>
##$DECIM= 32
##$DECNUC= <off>
##$DECSTAT= 4
##$DIGMOD= 1
##$DIGTYP= 9
##$DL= (0..7)
0 120 120 120 120 120 120 120 
##$DP= (0..7)
150 150 150 150 150 150 150 150 
##$DP07= 0
##$DPNAME0= <>
##$DPNAME1= <>
##$DPNAME2= <>
##$DPNAME3= <>
##$DPNAME4= <>
##$DPNAME5= <>
##$DPNAME6= <>
##$DPNAME7= <>
##$DPOAL= (0..7)
0.5 0.5 0.5 0.5 0.5 0.5 0.5 0.5 
##$DPOFFS= (0..7)
0 0 0 0 0 0 0 0 
##$DQDMODE= 0
##$DR= 18
##$DS= 0
##$DSLIST= <SSSSSSSSSSSSSSS>
$$ [...]
##$SUBNAM2= <"">
##$SUBNAM3= <"">
##$SUBNAM4= <"">
##$SUBNAM5= <"">
##$SUBNAM6= <"">
##$SUBNAM7= <"">
##$SUBNAM8= <"">
##$SUBNAM9= <"">
##$SW= 20.0188882624521
##$SWIBOX= (0..15)
0 0 2 0 0 0 0 0 0 0 0 0 0 0 0 0 
##$SW_h= 4006.41025641026
##$TD= 16384
##$TD0= 1
##$TE= 0
##$TE2= 300
##$TE3= 300
##$TEG= 300
##$TL= (0..7)
0 120 120 120 120 120 120 120 
##$TP= (0..7)
150 150 150 150 150 150 150 150 
##$TP07= 0
##$TPNAME0= <>
##$TPNAME1= <>
##$TPNAME2= <>
##$TPNAME3= <>
##$TPNAME4= <>
##$TPNAME5= <>
##$TPNAME6= <>
##$TPNAME7= <>
##$TPOAL= (0..7)
0.5 0.5 0.5 0.5 0.5 0.5 0.5 0.5 
##$TPOFFS= (0..7)
0 0 0 0 0 0 0 0 
##$TUNHIN= 0
##$TUNHOUT= 0
##$TUNXOUT= 0
##$USERA1= <user>
##$USERA2= <user>
##$USERA3= <user>
##$USERA4= <user>
##$USERA5= <user>
##$V9= 5
##$VALIST= <valist>
##$VCLIST= <CCCCCCCCCCCCCCC>
##$VD= 0
##$VDLIST= <DDDDDDDDDDDDDDD>
##$VPLIST= <PPPPPPPPPPPPPPP>
##$VTLIST= <TTTTTTTTTTTTTTT>
##$WBST= 1024
##$WBSW= 4
##$XGAIN= (0..3)
0 0 0 0 
##$XL= 0
##$YL= 0
##$YMAX_a= 655244
##$YMIN_a= -666855
##$ZGOPTNS= <>
##$ZL1= 120
##$ZL2= 120
##$ZL3= 120
##$ZL4= 120
##$ABSF1= 10
##$ABSF2= 0
##$ABSG= 5
##$ABSL= 3
##$ALPHA= 0
##$AQORDER= 0
##$ASSFAC= 0
##$ASSFACI= 0
##$ASSFACX= 0
##$ASSWID= 0
##$AUNMP= <proc_1d>
##$AZFE= 0.1
##$AZFW= 0.1
##$BCFW= 1
##$BC_mod= 2
##$BYTORDP= 1
##$COROFFS= 0
##$CY= 11.3945322036743
##$DATMOD= 1
##$DC= 2
##$DFILT= <>
##$DTYPP= 0
##$F1P= 2.36226072786647
##$F2P= -0.459571619588291
##$FCOR= 0.5
##$FTSIZE= 0
##$FT_mod= 4
##$GAMMA= 1
##$GB= 0.15
##$INTBC= 1
##$INTSCL= 1
##$ISEN= 128
##$LB= 0.24
##$LEV0= 0
##$LPBIN= 0
##$MAXI= 10000
##$MC2= 0
##$MEAN= 0
##$ME_mod= 0
##$MI= 1.114404
##$NCOEF= 0
##$NC_proc= 0
##$NLEV= 6
##$NOISF1= 3.799351
##$NOISF2= 2.8
##$NSP= 1
##$NTH_PI= 0
##$NZP= 0
##$OFFSET= 15.70392
##$PC= 1
##$PHC0= -13354.12
##$PHC1= 11.201
##$PH_mod= 1
##$PKNL= yes
##$PPARMOD= 0
##$PSCAL= 0
##$PSIGN= 0
##$REVERSE= no
##$SF= 200.130013532006
##$SI= 16384
##$SIGF1= 3
##$SIGF2= 2
##$SINO= 400
##$SIOLD= 16384
##$SREGLST= <1H.CDCl3>
##$SSB= 0
##$STSI= 0
##$STSR= 0
##$SW_p= 3612.71676300578
##$SYMM= 0
##$S_DEV= 0
##$TDeff= 0
##$TDoff= 0
##$TI= <>
##$TILT= no
##$TM1= 0
##$TM2= 0
##$TOPLEV= 0
##$USERP1= <user>
##$USERP2= <user>
##$USERP3= <user>
##$USERP4= <user>
##$USERP5= <user>
##$WDW= 1
##$XDIM= 8192
##$YMAX_p= 0
##$YMIN_p= 0
$$ End of Bruker specific parameters
$$ ---------------------------------
##NTUPLES= NMR FID
##VAR_NAME=  TIME,          FID/REAL,        FID/IMAG
##SYMBOL=    X,             R,               I
##VAR_TYPE=  INDEPENDENT,   DEPENDENT,       DEPENDENT
##VAR_FORM=  AFFN,          ASDF,            ASDF
##VAR_DIM=   8192,          8192,            8192
##UNITS=     SECONDS,       ARBITRARY UNITS, ARBITRARY UNITS
##FACTOR=    0.0002496,     1,               1
##FIRST=     0,             0,               0
##LAST=      2.0444736,     0,               0
##MIN=       0,             -666855,         0
##MAX=       2.0444736,     655244,          0
$$ Real data points
##PAGE= N=1
##DATA TABLE= (X++(R..R)), XYDATA
0 0 0 0 0 0 0 0 0 0 0 8 -8 8 -8 16 -16 24 -32 40 -41 56 -65 78 -89 112 -128 145 -174 201 -226 263 -303 343
32 343 -387 439 -496 557 -625 704 -784 874 -974 1080 -1197 1328 -1467 1618 -1788 1974
48 1974 -2172 2390 -2638 2905 -3200 3535 -3908 4325 -4805 5361 -6002 6762 -7679 8811
62 8811 -10241 12128 -14728 18560 -24792 36650 -67253 316906 542414 -357144 -634038
73 -634038 -65373 650567 408434 -386393 -643567 52601 648491 328732 -466580 -573550
83 -573550 127803 655244 230070 -516142 -522065 228898 636393 134087 -562404 -445386
93 -445386 302085 613799 37953 -589025 -372698 377243 573056 -55451 -602081 -284312
103 -284312 432506 524898 -139576 -602646 -199979 485665 463789 -222746 -585360 -112767
113 -112767 513866 400499 -291363 -563677 -26223 538927 322867 -352077 -519892 54590
123 54590 546987 250829 -405642 -474579 138679 546478 168509 -445577 -418121 208451
133 208451 534830 92991 -477723 -357503 274571 509092 14514 -493753 -288568 328912
143 328912 472576 -60802 -500833 -215646 378841 425151 -137105 -496329 -139854 415849
153 415849 373591 -204681 -486007 -65092 447650 314366 -266142 -459990 5532 462726
163 462726 255545 -317278 -429981 76106 468246 186921 -357896 -386404 138021 461801
173 461801 120336 -392309 -336928 200297 443760 49601 -412502 -280905 252765 419493
183 419493 -18489 -427773 -220141 301700 385739 -84784 -431227 -158551 340105 347840
193 347840 -145049 -427897 -95312 371301 301812 -199747 -412141 -33983 390520 252781
203 252781 -248182 -389889 29414 401345 193963 -288993 -355498 87993 402889 136309
213 136309 -325547 -316628 147072 395462 75354 -350623 -272402 196860 382384 17069
223 17069 -370723 -223151 242724 357737 -40044 -377768 -171655 280266 328028 -95113
233 -95113 -378307 -115520 311368 289290 -146524 -369279 -60895 334599 247928 -194210
243 -194210 -354816 -4504 350654 201146 -235141 -332254 47422 359067 154943 -270837
253 -270837 -305117 98865 358806 104491 -297378 -271736 143850 351720 54454 -319404
263 -319404 -232038 186762 334287 2442 -330885 -188242 223954 312239 -49687 -338167
273 -338167 -139208 258173 282005 -99582 -337327 -90194 285927 249562 -146581 -330847
283 -330847 -39613 306298 211282 -187021 -316568 7755 319418 171294 -222881 -295581
293 -295581 55900 323933 125695 -251230 -267194 100108 321834 79254 -276051 -232827
303 -232827 143972 311501 30958 -292795 -195436 182314 297383 -16014 -304991 -154403
313 -154403 216756 275277 -60781 -308774 -112596 244925 249797 -103593 -306121 -67888
323 -67888 266692 217318 -142400 -296106 -23598 282545 181485 -179311 -279827 22191
333 22191 291337 141457 -210479 -258708 65430 295328 100245 -238147 -232487 106901 291909
344 291909 58172 -258122 -203219 143660 283336 16045 -272613 -168353 176545 266217
354 266217 -25649 -279423 -131453 204731 244973 -67252 -280890 -90168 228783 216764
364 216764 -106674 -276050 -48252 248422 186453 -143981 -266315 -5854 261473 152707
374 152707 -175393 -251816 33405 269612 117533 -203061 -231468 71374 269856 80502
384 80502 -223829 -206548 106579 265092 41960 -239803 -176223 139060 253037 3343
394 3343 -250107 -143674 168891 237207 -35876 -256207 -107247 194769 216120 -72790 -256757
405 -256757 -71239 216420 192062 -107812 -251539 -33398 231775 163892 -138417 -240891
415 -240891 3059 242250 132492 -166569 -224125 40274 246028 98180 -189652 -203545
425 -203545 75663 245702 62109 -209456 -178626 108833 239178 26455 -223816 -151776
435 -151776 138770 229064 -9869 -233394 -121073 164367 213059 -44040 -236843 -89076
445 -89076 186003 192266 -77865 -234583 -54037 202742 167279 -108852 -227379 -18596 216139
456 216139 138351 -138364 -215133 17634 223852 107761 -163648 -199725 51551 227763
466 227763 75775 -185001 -179926 82706 225245 44002 -200580 -156878 111520 218308
476 218308 10870 -211196 -129680 136747 205407 -21230 -216706 -100044 159631 188386
486 188386 -53799 -217718 -67867 178633 167620 -84382 -214565 -35796 194139 144220
496 144220 -112923 -207042 -3555 204682 118762 -137378 -195304 27429 210652 90866
506 90866 -158358 -178783 57161 210449 61938 -174939 -159160 85466 206789 31203
516 31203 -187717 -135870 111325 198200 811 -197107 -110938 134747 186337 -29497 -202020
527 -202020 -84085 154287 170818 -57664 -202602 -56448 170201 151759 -84145 -198451
537 -198451 -27781 181611 129854 -108454 -190095 1398 189888 104411 -130640 -176934 30955
548 30955 193657 77326 -150092 -161759 59368 194156 48907 -166130 -142555 85475
558 85475 190061 21102 -178428 -121542 109083 182045 -6959 -185321 -97765 129003 169596
569 169596 -33717 -188128 -71859 146722 152928 -60320 -186103 -44168 160560 133372
579 133372 -85401 -180671 -15689 171455 111278 -108569 -171594 12456 178375 87748 -128794
590 -128794 -159484 39241 181480 62885 -145410 -143842 64051 179593 37530 -158013
600 -158013 -125561 87100 173992 11123 -166358 -103868 107615 164179 -14824 -171767 -80544
611 -80544 126354 151003 -41072 -173072 -55783 141366 135403 -65223 -171311 -30646 153670
622 153670 116917 -87705 -165291 -5436 161807 96282 -107184 -155781 19919 165946 72967
633 72967 -124327 -142035 44401 166083 48602 -138432 -125956 67534 163122 23407 -149413
644 -149413 -107294 88818 156825 -1082 -157298 -87083 107640 147100 -25180 -160895 -65703
655 -65703 123155 134489 -47512 -160879 -42775 135576 118003 -68637 -156127 -19220 144409
666 144409 99674 -88172 -148512 5018 150738 79258 -105672 -138102 28140 153744 58450
677 58450 -121025 -125474 50185 153734 36607 -132519 -110729 70141 149942 14624 -141066
688 -141066 -93724 88355 142956 -7428 -146023 -74556 104007 132517 -28987 -148027 -53523
699 -53523 117505 119193 -49885 -146176 -31723 128206 103761 -69595 -142149 -9933 136464
710 136464 86642 -87322 -135229 11179 141216 68330 -102612 -125788 31551 142581 48803
721 48803 -114817 -113120 50972 140961 28255 -124712 -97842 69352 136160 6784 -131941
732 -131941 -80784 86037 128674 -14231 -136576 -62379 100745 118352 -34300 -137712 -43605
743 -43605 112746 106647 -52677 -136087 -24062 121813 92034 -69700 -130945 -4229 127878
754 127878 75614 -85185 -122729 15688 130865 57177 -98212 -111988 35356 131702 38097
765 38097 -109878 -99107 54241 129549 18343 -118952 -84817 71220 124901 -930 -124907
776 -124907 -69167 86057 117381 -19380 -127584 -52166 98015 107376 -37403 -127387 -33921
787 -33921 107691 94237 -54191 -124033 -15193 115268 79769 -70137 -118353 4110 120134
798 120134 63601 -84231 -110685 22405 123070 46689 -96578 -100513 39661 122686 29222
809 29222 -105814 -88608 55520 119856 11587 -112640 -74804 70125 113606 -6264 -116648
820 -116648 -59265 82689 105309 -23889 -118513 -42582 93973 94721 -40722 -117720 -25746
831 -25746 102982 82917 -56308 -114710 -8605 109265 69624 -69932 -109071 8210 113107
842 113107 55126 -81785 -100624 24710 114019 39096 -91810 -90210 40854 112579 22171
853 22171 -100029 -77547 56296 108703 4927 -105850 -63891 70162 103227 -11978 -109869
864 -109869 -49272 81982 95385 -27838 -110733 -34180 91369 85479 -42884 -108871 -18243
875 -18243 98590 73708 -56353 -104584 -2338 102823 59998 -68630 -97966 13787 105398
886 105398 45351 -79418 -89708 29181 106005 30393 -88776 -79740 43885 104390 15079
897 15079 -95626 -68891 56609 100832 -176 -100367 -56484 67984 94407 -14968 -102648
908 -102648 -42852 78136 86010 -29525 -102497 -28020 86212 76043 -43288 -100510 -13123
919 -13123 92776 64634 -56435 -96394 2074 97159 52280 -67614 -90421 16502 99577
930 99577 39193 -77338 -82661 30413 99072 25432 -84893 -73006 43502 96962 10962
941 10962 -90437 -61421 55535 92319 -3726 -94158 -49040 66773 86156 -18237 -96093
952 -96093 -35653 76193 78395 -31851 -96001 -22049 83778 69422 -44348 -93801 -8675
963 -8675 88844 58674 -55178 -89460 4776 91819 46972 -64938 -82945 18507 92744 33875
975 33875 -73447 -74746 31564 92129 20383 -80560 -65212 43817 89988 6362 -85989
986 -85989 -54723 54948 85832 -6794 -89467 -43517 64522 79671 -19659 -90603 -31483 72393
998 72393 71791 -31853 -89830 -18704 78451 62506 -43186 -86716 -5482 83129 51775 -54098
1010 -54098 -81970 7915 86180 40142 -63505 -75866 20614 87150 28353 -71338 -68458 32689
1022 32689 86361 16308 -77285 -59477 43642 83652 3748 -81262 -49495 53330 78889
1033 78889 -8453 -83311 -38070 61805 72669 -20779 -84092 -26611 69218 65473 -32388 -83081
1045 -83081 -14261 75159 56782 -42881 -80658 -2792 79167 47772 -52050 -76579 8914 81297
1057 81297 37252 -59938 -70674 20308 81742 25953 -66641 -63102 31124 80302 13841 -72090
1069 -72090 -54183 41595 77408 1949 -76269 -44711 50843 73245 -9777 -78851 -34427 58927
1081 58927 67825 -20769 -79502 -23904 65806 60862 -31272 -78294 -12919 70754 52427 -41094
1093 -41094 -75371 -1526 73969 42793 -49781 -70543 9983 75743 32473 -57568 -64989 21175
1105 21175 76383 21531 -64309 -57810 31410 75298 10767 -69088 -49713 40983 72328 131
1117 131 -72258 -40832 49121 68281 -10703 -74065 -30961 56249 62401 -21006 -73947 -20541
1129 -20541 62362 55473 -31195 -72438 -9316 67175 47330 -40581 -69863 1293 70556 38449
1141 38449 -48651 -65694 11656 72114 29046 -55491 -60132 21695 72237 19352 -61001 -53191
1153 -53191 31017 70379 8844 -64934 -45336 39449 67311 -1805 -67912 -36235 47456 62803
1165 62803 -11956 -69627 -26936 54456 57457 -22248 -69754 -17233 59856 50958 -31088 -68562
1177 -68562 -7717 63945 43393 -39382 -65613 2141 66403 34938 -46789 -61077 11827 67650
1189 67650 25688 -52979 -55408 21743 67308 15963 -58378 -48622 30817 65727 6045 -62390
1201 -62390 -41136 39230 62734 -3665 -64778 -33060 46235 58828 -13047 -66036 -24234 52273
1213 52273 53400 -22010 -65503 -15020 56833 46986 -30397 -63591 -5133 60553 39371 -38333
1225 -38333 -60494 4400 62974 31219 -45147 -56398 13756 64349 22692 -51046 -51223 22307
1237 22307 63838 13664 -55810 -44954 30421 62075 4703 -59051 -37767 37681 58850 -4593
1249 -4593 -60893 -29761 44134 54395 -13835 -61902 -21038 49945 48884 -22372 -61432 -12219
1261 -12219 54644 42714 -30429 -59979 -3311 57953 35753 -37830 -57017 5385 59866 28372
1273 28372 -43969 -52650 13780 60243 19935 -48861 -47209 22222 59301 10957 -53133 -40971
1285 -40971 29848 57385 2138 -55999 -33537 37084 54144 -6657 -57964 -25893 43387 50217
1297 50217 -15216 -58509 -17778 48450 44950 -22946 -57696 -9640 52095 38963 -30154 -55383
1309 -55383 -1263 54673 31979 -36406 -52189 6963 56102 24426 -42188 -47974 15507 56593
1321 56593 16469 -46896 -42811 23009 55810 8536 -50990 -36986 29989 53873 715 -53482
1333 -53482 -30368 36154 50673 -7303 -54743 -23204 41340 46410 -15342 -54922 -15421 45921
1345 45921 41096 -22574 -53973 -7503 49469 35127 -29720 -52024 515 52107 28740 -35940
1357 -35940 -49024 8140 53478 21924 -41272 -45221 15586 53551 14373 -45323 -40165 22664
1369 22664 52554 6938 -48380 -34296 29335 50311 -913 -50746 -27716 35236 47026 -8844
1381 -8844 -51930 -20490 40087 42992 -16398 -52135 -13007 44819 38364 -22998 -51337 -5807
1393 -5807 47883 32696 -29381 -49263 1676 49944 26754 -34786 -45885 8928 50687 19708
1405 19708 -39458 -41702 16068 50765 12406 -43535 -36661 22822 49541 4952 -46579 -31234
1417 -31234 29088 47666 -2256 -48572 -24902 34577 44585 -9353 -49734 -18328 39051 40347
1429 40347 -16029 -49366 -11420 42733 35427 -22921 -48058 -4414 45510 29595 -28915 -45720
1441 -45720 3089 47468 23456 -34283 -42637 10080 48352 16824 -38769 -38721 16733 48235 10171
1454 10171 -42424 -34135 22973 46821 3478 -44872 -28638 28432 44494 -3598 -46195 -22571
1466 -22571 33364 41055 -10514 -46769 -15893 37815 36970 -16956 -46611 -9266 41247 32346 -23424
1479 -23424 -45353 -2374 43923 27155 -28791 -43093 4588 45628 21265 -33505 -39838 11018
1491 11018 45921 14996 -37386 -35924 17276 45430 8449 -40348 -30748 23145 44028 1767
1503 1767 -42720 -25631 28347 41558 -4824 -44182 -19867 32927 38373 -10934 -44749 -14084
1515 -14084 36625 34851 -16929 -44286 -7918 39608 30185 -22352 -42758 -1661 41696 25053
1527 25053 -27617 -40436 4792 43075 19226 -32154 -37302 11105 43442 13210 -36242 -33563
1539 -33563 16962 43018 7128 -39148 -29045 22519 41557 687 -41065 -23838 27407 39303
1551 39303 -5342 -42137 -18317 31695 35930 -11525 -42176 -12482 35162 31960 -17103 -41605
1563 -41605 -6092 38081 27404 -22759 -40236 85 40132 22495 -27416 -37912 6304 41264
1575 41264 17116 -31544 -34840 11972 41584 11521 -34979 -30894 17399 40732 5665 -37241
1587 -37241 -26344 22499 39110 -520 -38988 -21038 27035 36430 -6592 -40061 -15608 31209
1599 31209 33414 -12269 -40175 -10013 34423 29528 -17917 -39491 -4342 37124 25343 -22636
1611 -22636 -37731 1385 38560 20315 -27045 -35360 7070 39252 15218 -30705 -32130 12489
1623 12489 38963 9453 -33801 -28412 17644 38305 3672 -36203 -24036 22477 36708 -1731
1635 -1731 -37890 -19560 26654 34368 -7338 -38416 -14507 29990 31449 -12288 -38192 -8985
1647 -8985 33209 27475 -17396 -37279 -3523 35138 23092 -22262 -35518 2234 36814 18313
1659 18313 -26200 -33094 7824 37505 13316 -29874 -30147 12877 37551 8297 -32597 -26443 17594
1672 17594 36531 3101 -34719 -22216 21951 34684 -2400 -35943 -17373 25879 31934 -7887
1684 -7887 -36247 -12208 29585 28862 -13050 -35890 -7103 31931 25051 -17971 -34930 -1649 33966
1697 33966 21080 -22225 -33544 3362 35300 16460 -25785 -30933 8438 35456 11562 -28946
1709 -28946 -27790 13257 35279 6390 -31394 -23870 17935 33814 1015 -33112 -19732 22101
1721 22101 32062 -4045 -34328 -15390 25387 29547 -8958 -34687 -10734 28303 26492 -13527
1733 -13527 -34249 -5855 30790 23052 -17817 -33097 -748 32486 18920 -21808 -30943 4339
1745 4339 33436 14123 -25241 -28317 9424 33609 9299 -28181 -25143 13889 33260 4442
1757 4442 -30339 -21370 18333 31865 -293 -32046 -17408 22117 29773 -5111 -32632 -13114
1769 -13114 25132 27290 -9805 -32501 -8274 27998 23763 -14248 -31711 -3346 29915 20123
1781 20123 -18637 -30500 1445 31331 15937 -22411 -28413 6366 32084 11705 -25240 -25931
1793 -25931 10923 31758 7117 -27688 -22818 14552 30890 2460 -29493 -18937 18519 29256
1805 29256 -2124 -30533 -15038 22065 27169 -6854 -31012 -10621 24969 24590 -11135 -30897
1817 -30897 -6196 27265 21402 -15205 -30023 -1890 28871 17975 -18732 -28582 2549 29943
1829 29943 14129 -21946 -26245 6902 30170 9846 -24553 -23661 11333 29959 5474 -26749
1841 -26749 -20512 15253 29046 1229 -28383 -16951 18758 27584 -3398 -29329 -13274 21946
1853 21946 25512 -7438 -29761 -9168 24425 22697 -11442 -29251 -4921 26500 19611 -15332
1865 -15332 -27894 -413 27907 15838 -18711 -26466 3701 28563 12135 -21758 -24270 8153
1877 8153 28997 8210 -24365 -21859 12146 28591 4097 -26260 -18539 15639 27282 -445
1889 -445 -27564 -14982 18788 25504 -4655 -28077 -11191 21690 23190 -8623 -28005 -7191 23919
1902 23919 20301 -12377 -27528 -3139 25812 17250 -16012 -26503 1064 27035 13888 -19066
1914 -19066 -24707 4924 27464 10243 -21584 -22563 8913 27353 6386 -23676 -19674 12467 26669
1927 26669 2325 -25117 -16533 15909 25232 -1710 -26318 -13083 19282 23848 -5807 -26783
1939 -26783 -9032 21591 21550 -9467 -26606 -5591 23540 18721 -13051 -25975 -1719 24832 15556
1952 15556 -15881 -24559 2338 25796 12317 -18791 -22591 6284 26105 8554 -21247 -20017
1964 -20017 9836 25798 4504 -23223 -17594 13292 24981 901 -24423 -14612 16119 23640
1976 23640 -2851 -25384 -11452 18579 22019 -6256 -25390 -7813 20909 19715 -9793 -25069
1988 -25069 -4242 22443 16614 -13145 -24149 -549 23803 13616 -16106 -22943 3283 24383
2000 24383 10481 -18756 -21118 6858 24667 7149 -20625 -18722 9866 24235 3662 -22202
2012 -22202 -16183 13116 23389 104 -23372 -13008 15764 21981 -3549 -23826 -9794 18225
2024 18225 20138 -6957 -23972 -6234 20335 17874 -10305 -23702 -2866 21947 15321 -13332
2036 -13332 -22553 658 23017 12410 -15707 -21020 3769 23354 9320 -17971 -19172 7169
2048 7169 23248 6150 -19807 -17014 10263 22800 2512 -21320 -14285 13158 21757 -979 -22324
2061 -22324 -11695 15744 20335 -4262 -22837 -8579 17819 18617 -7518 -22863 -5440 19723
2073 19723 16281 -10378 -22224 -2172 20824 13877 -13129 -21130 1201 21527 10749 -15491
2085 -15491 -19665 4518 22098 7756 -17790 -17721 7558 21996 4797 -19301 -15569 10531 21420
2098 21420 1491 -20698 -13109 13165 20353 -1655 -21205 -10341 15341 18938 -4947 -21302
2110 -21302 -7289 17357 17002 -7772 -21292 -4069 19008 14697 -10727 -20678 -942 20293 12119
2123 12119 -13120 -19612 2256 20666 9658 -15484 -18132 5132 21004 6777 -17185 -16126
2135 -16126 8076 20601 3610 -18614 -13873 10770 19750 538 -19415 -11236 13325 18815 -2660
2148 -2660 -20228 -8656 15316 17331 -5681 -20236 -5775 16802 15301 -8524 -19968 -2893
2160 -2893 18543 13283 -10857 -19270 -68 19107 10820 -13055 -18151 2920 19552 7980 -14937
2173 -14937 -16435 5763 19706 5327 -16611 -14708 8354 19109 2277 -17893 -12285 10657
2185 10657 18675 -472 -18936 -10054 12978 17467 -3165 -19418 -7823 14938 15892 -5732 -18982
2198 -18982 -4832 16259 14115 -8288 -18720 -2320 17569 11888 -10721 -17807 666 18345
2210 18345 9380 -12820 -16644 3603 18639 7042 -14493 -14894 6176 18530 4419 -16105 -13214
2223 -13214 8699 17992 1697 -17131 -11150 10898 17272 -1129 -17711 -8658 12830 15930 -3739
2236 -3739 -17802 -6215 14339 14329 -6521 -17864 -3601 15610 12426 -8843 -17351 -991 16699
2249 16699 10391 -10968 -16579 1630 17134 8099 -12771 -15220 4192 17639 5577 -14234 -13538
2262 -13538 6418 17272 2877 -15355 -11721 8931 16666 450 -16432 -9621 10774 15856 -2086
2275 -2086 -16899 -7503 12629 14406 -4447 -16879 -5133 14045 12930 -6917 -16750 -2640 14993
2288 14993 11219 -8852 -16050 -305 15867 9081 -10697 -15163 2300 16429 6994 -12376 -13814
2301 -13814 4616 16560 4537 -13985 -12222 6956 16137 2287 -14891 -10600 8985 15564 -193
2314 -193 -15638 -8315 10607 14689 -2352 -15734 -6406 12394 13231 -4601 -15915 -4230 13312
2327 13312 11830 -6940 -15513 -1913 14450 10008 -8743 -14867 482 15014 8166 -10786 -14164
2340 -14164 2807 15542 5893 -12213 -12751 4915 15433 3789 -13333 -11337 6925 15074 1418
2353 1418 -14133 -9490 8737 14482 -872 -14759 -7503 10211 13307 -3036 -15124 -5597 11878
2366 11878 12048 -5367 -14932 -3306 13116 10699 -6867 -14529 -1188 13773 9032 -8841 -14011
2379 -14011 766 14473 7323 -10232 -13199 3038 14584 5238 -11503 -11722 4965 14434 3087
2392 3087 -12718 -10218 6939 14212 1092 -13476 -8612 8687 13625 -984 -14058 -6889 10298
2405 10298 12531 -3185 -14112 -4874 11359 11279 -4936 -14085 -2988 12412 9776 -6866 -13397
2418 -13397 -868 13068 8248 -8357 -12952 1314 13745 6383 -9881 -12024 3097 13708 4488
2431 4488 -11289 -10941 4972 13848 2783 -12221 -9809 6602 13260 712 -12728 -8009 8271
2444 8271 12516 -1091 -13261 -6266 9711 11582 -3205 -13373 -4472 10920 10373 -5133 -13391
2457 -13391 -2303 11842 9092 -6832 -12773 -529 12463 7545 -8371 -12041 1275 12723 5889
2470 5889 -9578 -11251 3226 12997 4206 -10661 -9906 5110 12780 2256 -11527 -8674 6709
2483 6709 12380 158 -12161 -7055 8123 11657 -1683 -12624 -5289 9554 10748 -3471 -12902
2496 -12902 -3655 10614 9786 -5130 -12448 -1863 11321 8181 -6724 -12181 42 11825 6883
2509 6883 -8172 -11349 1713 12280 5175 -9407 -10222 3562 12180 3417 -10404 -9194 5306
2522 5306 12164 1655 -11058 -7985 6653 11673 -33 -11748 -6386 8093 10961 -2029 -12028
2535 -12028 -4807 9216 9918 -3530 -12100 -3308 10142 8772 -5252 -11639 -1594 10846 7542
2548 7542 -6791 -11358 323 11348 6180 -7873 -10585 2035 11750 4664 -9187 -9819 3552
2561 3552 11770 2932 -10004 -8588 5217 11586 1280 -10605 -7391 6668 10882 -456 -11148
2574 -11148 -5751 7746 10115 -2313 -11397 -4170 8968 9259 -3899 -11287 -2742 9883 7995 -5261
2588 -5261 -11144 -1058 10564 7055 -6383 -10749 521 11033 5615 -7742 -9899 2329 11036
2601 11036 4166 -8726 -8877 3672 11035 2371 -9554 -7775 5269 10797 561 -10374 -6470
2614 -6470 6694 10314 -1084 -10632 -5188 7797 9554 -2448 -10834 -3850 8663 8631 -3923 -10772
2628 -10772 -2216 9266 7420 -5104 -10442 -665 9913 6071 -6477 -9812 942 10286 4787
2641 4787 -7665 -9183 2464 10424 3522 -8536 -8261 3927 10420 2018 -9362 -7186 5208 10025
2655 10025 666 -9704 -6037 6464 9659 -1032 -10204 -4560 7518 8940 -2713 -10083 -3205
2668 -3205 8508 7626 -4024 -9602 -1711 9404 6858 -5381 -9912 -188 9741 5609 -6344 -9322
2682 -9322 1275 10037 4272 -7456 -8288 2617 9863 2833 -8217 -7585 4249 9821 1297 -8991
2696 -8991 -6489 5457 9285 -23 -9426 -5107 6562 8881 -1779 -9603 -3869 7503 8078 -3008
2710 -3008 -9756 -2534 8223 7158 -4368 -9631 -1141 8817 5961 -5490 -9274 212 9006 4924
2724 4924 -6450 -8807 1725 9305 3867 -7677 -7311 3244 8991 2246 -8344 -6696 4690 9191
2738 9191 1064 -8938 -5687 5455 8800 -535 -8995 -4520 6499 8169 -1992 -9212 -3350 7483
2752 7483 7316 -3174 -9186 -1859 7939 6451 -4497 -8874 -567 8493 5426 -5563 -8449 684
2766 684 8780 4360 -6480 -7789 2090 8883 3144 -7279 -7131 3307 9041 1896 -7874 -6307 4494
2781 4494 8652 444 -8474 -5129 5428 8100 -827 -8610 -4040 6276 7538 -2162 -8821 -2836
2795 -2836 7098 6769 -3336 -8716 -1557 7783 5939 -4400 -8326 -173 8130 4900 -5439 -7860
2809 -7860 829 8393 3703 -6225 -7343 2286 8256 2543 -7168 -6590 3298 8460 1259 -7401 -5494
2824 -5494 4522 7880 -425 -8043 -4758 5468 7722 -1108 -8154 -3254 6289 6937 -2308 -8249 -2420
2839 -2420 7020 6112 -3475 -8119 -1094 7541 5479 -4385 -7833 46 8004 4113 -4985 -7070 1551
2854 1551 7798 2819 -6203 -6519 2878 8364 2271 -6990 -5575 3901 7646 1329 -7365 -4995 4674
2869 4674 7657 -36 -7703 -4029 5468 7425 -1706 -7904 -3010 6064 6316 -2514 -7932 -1799 6607
2884 6607 5452 -3704 -7665 -734 7357 4505 -4452 -7232 633 7648 3678 -5421 -6630 1482 7819
2899 7819 2547 -6335 -6420 2417 7804 1865 -6745 -5684 3919 7564 454 -7182 -4391 4505 6952
2914 6952 -793 -7464 -3475 5397 6611 -1844 -7446 -2505 6116 6010 -2839 -7386 -1390 6744 5232
2929 5232 -3787 -7248 -408 6952 4322 -4597 -6865 660 7358 3459 -5349 -6344 1854 7446 2185
2944 2185 -6059 -5525 3056 7291 1029 -6419 -4861 3753 7080 14 -7039 -3960 4740 6549 -990
2959 -990 -7112 -3115 5404 6084 -1802 -7242 -2014 5982 5372 -2900 -7082 -911 6289 4551 -3826 -6833
2975 -6833 122 6608 3650 -4621 -6099 1310 6900 2687 -5989 -5326 1994 6890 1835 -5883 -5074
2990 -5074 3084 6719 918 -6404 -4557 3953 6088 -575 -6944 -3240 4610 5948 -1293 -6853 -2609
3005 -2609 5276 5448 -2057 -6641 -1501 5814 4735 -3067 -6480 -556 6309 4062 -3832 -6343 382
3020 382 6623 3431 -4566 -5908 1282 6535 2281 -5011 -5365 2366 6589 1481 -5660 -4587 3022
3035 3022 6574 551 -6089 -3896 3907 6009 -637 -6198 -3084 4566 5733 -1286 -6508 -2206 5133
3050 5133 5350 -2342 -6352 -1208 5598 4519 -3037 -6324 -234 5969 3739 -3984 -6064 691 6265
3065 6265 2780 -4783 -5208 1519 6297 1792 -5096 -5094 2619 6231 1135 -5614 -4128 3206 5894 145
3081 145 -6067 -3585 3984 5937 -698 -6026 -2774 4536 5335 -1573 -5994 -1894 5094 4655 -2530 -5945
3097 -5945 -887 5536 4066 -3063 -5674 -84 5926 3390 -4027 -5546 908 6050 2555 -4516 -4904
3112 -4904 1810 5960 1573 -4983 -4460 2531 5979 688 -5426 -3884 3147 5622 -115 -5847 -3161
3127 -3161 3960 5150 -1003 -5769 -2265 4417 4942 -1815 -5763 -1529 4930 4087 -2749 -5750 -640
3142 -640 5252 3467 -3241 -5457 138 5559 2956 -3875 -5045 1075 5664 2173 -4415 -4769 1796
3157 1796 5478 1338 -4756 -4086 2671 5527 506 -5177 -3463 3259 5274 -320 -5591 -2905 3983
3172 3983 4974 -1156 -5660 -1985 4343 4450 -2108 -5584 -1176 4743 3896 -2608 -5375 -364 4992 3057
3188 3057 -3407 -5065 392 5418 2440 -4005 -4496 1256 5474 1629 -4414 -4102 2151 5611 881
3203 881 -4738 -3695 2808 5181 165 -4994 -2784 3371 4887 -544 -5045 -2305 3918 4460 -1588
3218 -1588 -5164 -1491 4481 3927 -2259 -5199 -867 4777 3425 -2998 -4932 36 5068 2741 -3472
3233 -3472 -4809 716 5000 2016 -4033 -4517 1522 5116 1457 -4505 -3874 2277 5096 551 -4545
3248 -4545 -3216 2781 4871 -141 -4892 -2639 3620 4485 -779 -5037 -1955 3795 4238 -1849 -4894
3263 -4894 -1092 4209 3564 -2403 -4883 -535 4568 3224 -2978 -4788 118 4905 2475 -3453 -4449
3278 -4449 965 4932 1765 -3859 -3742 1799 4920 915 -4328 -3492 2509 4822 248 -4593 -2630
3293 -2630 2916 4640 -501 -4867 -2214 3504 4293 -1219 -4875 -1411 3950 3773 -1822 -4824 -723
3308 -723 4388 3152 -2478 -4567 -157 4515 2470 -3109 -4457 574 4630 2015 -3502 -3848 1376
3323 1376 4676 1391 -4066 -3638 1916 4528 675 -4213 -3067 2572 4436 55 -4517 -2317 3130
3338 3130 4063 -591 -4561 -1780 3485 3739 -1352 -4461 -1141 3813 3297 -2041 -4392 -556 4213 2728
3354 2728 -2639 -4203 202 4330 2336 -3079 -4015 747 4496 1587 -3468 -3719 1398 4523 1076
3369 1076 -3814 -3203 1945 4237 318 -4151 -2604 2691 4112 -271 -4168 -2123 3097 3805 -894
3384 -894 -4215 -1465 3430 3419 -1362 -4213 -870 3847 2998 -1832 -4125 -368 4131 2531 -2492 -3987
3400 -3987 389 4320 2005 -3125 -3773 733 4222 1395 -3615 -3400 1619 4235 845 -3844 -2618
3415 -2618 2126 4068 214 -3874 -2333 2295 3770 -579 -4134 -1792 3110 3423 -1011 -4068 -1174
3430 -1174 3512 3291 -1611 -4048 -579 3680 2636 -2411 -3848 65 3828 2129 -2670 -3732 555
3445 555 3971 1704 -3159 -3363 1298 4106 1018 -3385 -2972 1725 3918 569 -3535 -2548 2258 3680
3461 3680 0 -3926 -2070 2777 3418 -786 -4024 -1559 3030 3288 -1329 -3856 -961 3420 2771 -1752
3477 -1752 -3907 -362 3459 2566 -2109 -3740 328 3761 2087 -2723 -3400 967 3891 1267 -2882
3492 -2882 -2905 1391 3724 760 -3349 -2544 1692 3728 327 -3431 -2153 2252 3646 -236 -3608 -1840
3508 -1840 2714 3399 -676 -3755 -1362 3066 3083 -1343 -3620 -792 3135 2610 -1981 -3839 -189 3433
3524 3433 2101 -2358 -3308 323 3591 1599 -2593 -3034 745 3626 1336 -3060 -2975 1377 3607 742
3540 742 -3411 -2346 1790 3646 142 -3291 -2071 2201 3323 -441 -3307 -1531 2618 3063 -1090
3555 -1090 -3582 -1020 2994 2569 -1482 -3535 -576 3074 2336 -1898 -3443 44 3227 1874 -2238
3570 -2238 -3379 467 3460 1693 -2475 -2874 982 3472 1092 -2900 -2480 1367 3284 465 -3279
3585 -3279 -2168 1811 3155 -138 -3274 -1896 2384 2755 -606 -3152 -1196 2595 2623 -1305 -3542 -874
3601 -874 2847 2374 -1446 -3448 -481 3156 1879 -1907 -3105 123 3207 1617 -2305 -2856 666 3188
3617 3188 1194 -2628 -2593 1120 3284 696 -2744 -2241 1421 3029 98 -3070 -1822 1793 3044 -352
3633 -352 -3175 -1363 2238 2833 -823 -3158 -1171 2642 2237 -1105 -3146 -695 2808 2211 -1467 -3103
3649 -3103 -67 3040 1788 -1781 -2806 240 3173 1282 -2241 -2693 1088 3131 743 -2527 -2313
3664 -2313 1248 3171 578 -2705 -1840 1755 2771 74 -2967 -1430 2168 2685 -488 -2920 -1280
3679 -1280 2176 2584 -752 -2935 -816 2619 2230 -1349 -3140 -348 2771 1959 -1533 -2815 -29 2908
3695 2908 1474 -2014 -2911 535 3040 1263 -2223 -2324 762 2912 819 -2449 -2247 1283 2899 206
3711 206 -2659 -1822 1729 2862 -216 -2809 -1408 1994 2639 -549 -2900 -1367 2177 2278 -749 -2672
3727 -2672 -691 2532 2145 -1179 -2586 -319 2630 1836 -1624 -2501 205 2691 1382 -1898 -2513 719
3743 719 2907 999 -2221 -2418 896 2848 414 -2355 -2108 1384 2714 92 -2717 -1763 1666 2574
3759 2574 -12 -2646 -1372 2079 2535 -715 -2918 -764 2162 2233 -1135 -2703 -493 2503 1929 -1445
3775 -1445 -2590 -80 2540 1497 -1600 -2427 318 2623 1248 -2205 -2477 733 2649 706 -2329
3790 -2329 -2023 1019 2658 354 -2397 -1684 1441 2784 -86 -2518 -1414 1797 2416 -340 -2600 -1003
3806 -1003 1961 2305 -823 -2490 -612 2189 2065 -863 -2424 -331 2307 1547 -1440 -2590 -145 2579
3822 2579 1239 -1619 -2395 393 2653 1020 -1901 -1888 770 2571 509 -2130 -1784 997 2497 209
3838 209 -2290 -1652 1570 2386 -189 -2461 -1275 1723 2314 -421 -2444 -875 1774 1815 -664 -2354
3854 -2354 -639 2651 1520 -1458 -2526 -244 2325 1706 -1412 -2446 191 2414 1278 -1669 -1940
3869 -1940 568 2571 951 -1906 -1799 926 2492 672 -2100 -1718 1153 2394 11 -2172 -1442 1341
3885 1341 2195 -239 -2392 -1227 1711 2155 -651 -2483 -667 1906 1925 -984 -2579 -524 2326 1647
3901 1647 -1316 -2354 -121 2337 1303 -1457 -2264 382 2265 1020 -1771 -1983 690 2322 722
3916 722 -1931 -1843 840 2338 279 -2005 -1510 1164 2227 -85 -2121 -1312 1500 2225 -469 -2251
3932 -2251 -1079 1811 2020 -492 -2423 -338 2086 1586 -1266 -2342 -313 2192 1355 -1131 -2121 67
3948 67 2218 1169 -1388 -1877 423 2506 962 -1513 -1669 682 2302 492 -1970 -1485 980 2096
3964 2096 275 -2179 -1326 1244 1978 -25 -2230 -1283 1579 1925 -461 -2290 -934 1721 1780 -671
3980 -671 -2011 -463 2035 1607 -1087 -2337 -141 2007 1212 -1296 -1992 245 2199 949 -1606 -1957
3996 -1957 495 2183 669 -1885 -1693 692 2147 247 -1775 -1448 1260 1955 164 -2185 -1183 1390
4012 1390 1991 -356 -2201 -1006 1621 1890 -569 -1965 -622 1862 1660 -758 -2039 -300 1960 1220
4028 1220 -1084 -2142 -27 2040 1045 -1478 -1968 120 1911 833 -1416 -1818 434 2159 662 -1639
4044 -1639 -1616 838 1945 270 -1770 -1316 1213 1854 23 -1780 -1016 1236 1753 -489 -2086 -853
4060 -853 1625 1626 -603 -2030 -595 1782 1384 -880 -2026 -342 1870 1246 -1241 -1943 -75 2005 931
4077 931 -1475 -1813 387 1950 886 -1558 -1636 652 1922 544 -1818 -1416 802 1982 48 -1687
4093 -1687 -1105 1216 1693 -59 -1892 -1082 1441 1705 -429 -1792 -641 1539 1672 -670 -1998 -428
4109 -428 1854 1340 -922 -1799 -131 1688 1184 -1342 -1922 225 1860 1015 -1417 -1692 423 1999 592
4126 592 -1802 -1418 741 1769 319 -1672 -1410 1099 1718 58 -1826 -1156 1208 1802 -375 -1698
4142 -1698 -822 1325 1741 -514 -1792 -503 1618 1302 -843 -1741 -163 1728 1313 -950 -1741 7
4158 7 1797 947 -1198 -1623 334 1819 738 -1186 -1637 441 1888 545 -1419 -1343 739 1808 282
4175 282 -1662 -1149 1029 1754 -172 -1769 -896 1230 1697 -339 -1784 -803 1528 1293 -515 -1803 -658
4192 -658 1568 1335 -1037 -1838 -173 1741 1198 -1174 -1796 128 1793 849 -1187 -1530 415 1712 692
4209 692 -1501 -1350 614 1811 476 -1677 -1295 739 1892 252 -1690 -1236 1118 1663 -198 -1705
4225 -1705 -725 1294 1375 -405 -1711 -578 1410 1361 -757 -1739 -432 1741 1158 -943 -1663 -17 1668
4242 1668 958 -1149 -1622 119 1612 820 -1388 -1457 371 1653 431 -1432 -1374 782 1656 222 -1610
4259 -1610 -1296 940 1658 -100 -1588 -888 1154 1595 -292 -1812 -844 1135 1235 -523 -1692 -450
4275 -450 1379 1172 -859 -1736 -260 1636 1210 -933 -1589 19 1675 732 -1149 -1466 482 1595 770
4292 770 -1417 -1431 505 1738 338 -1541 -1069 783 1680 122 -1399 -1058 1045 1581 115 -1496 -843
4309 -843 1036 1514 -288 -1591 -625 1058 1162 -563 -1626 -293 1544 1126 -846 -1760 -28 1475
4325 1475 935 -875 -1458 70 1588 755 -1131 -1375 370 1675 438 -1183 -1174 607 1536 479 -1263
4342 -1263 -1162 796 1594 101 -1428 -866 1077 1573 -271 -1669 -694 1205 1304 -360 -1665 -463 1510
4359 1510 1261 -791 -1554 -290 1461 1037 -930 -1673 49 1468 885 -1023 -1531 172 1437 626 -1243
4376 -1243 -1394 549 1508 369 -1498 -1235 1039 1637 108 -1427 -979 800 1543 80 -1486 -733 1231
4393 1231 1355 -161 -1517 -519 1183 1315 -416 -1608 -380 1477 1045 -738 -1611 -177 1390 917
4409 917 -955 -1477 173 1540 919 -1125 -1521 356 1596 675 -1205 -1301 470 1509 310 -1449 -1230
4426 -1230 742 1506 -122 -1546 -891 779 1387 -103 -1515 -570 951 1332 -451 -1559 -539 1072
4442 1072 1217 -566 -1538 -201 1368 1035 -661 -1392 -27 1431 878 -982 -1369 234 1462 871 -1177
4459 -1177 -1405 353 1659 579 -1182 -1199 610 1455 205 -1456 -1106 826 1540 -123 -1404 -742 986
4476 986 1349 -208 -1489 -534 1182 1323 -512 -1522 -449 1281 1129 -585 -1479 -242 1289 916 -919
4493 -919 -1487 -11 1521 694 -952 -1200 365 1422 439 -1116 -1308 363 1447 386 -1157 -1108 562
4510 562 1412 177 -1331 -930 750 1325 67 -1602 -685 947 1231 -344 -1508 -557 975 1039 -390
4527 -390 -1538 -271 1091 982 -764 -1470 -84 1462 803 -729 -1429 5 1567 572 -1133 -1246 432
4544 432 1567 393 -1126 -1134 499 1370 148 -1235 -1056 711 1431 -47 -1421 -1052 835 1546 -47
4561 -47 -1325 -579 1097 1232 -362 -1418 -435 1175 1149 -391 -1331 -412 1201 897 -773 -1337 7 1166
4579 1166 916 -1250 -1335 521 980 492 -1224 -1101 376 1731 137 -1220 -1102 466 1325 310 -1238
4596 -1238 -996 826 1265 79 -1257 -654 882 1385 -241 -1427 -699 950 1161 -367 -1277 -438 1257
4613 1257 1020 -671 -1245 -146 1215 768 -640 -1414 -110 1189 668 -834 -1385 206 1291 431 -1109
4630 -1109 -1181 475 1498 265 -1280 -1032 604 1425 241 -1221 -882 900 1315 -166 -1221 -599 903
4647 903 1094 -188 -1362 -389 1186 873 -615 -1400 -229 1153 910 -646 -1329 -9 1323 711 -804
4664 -804 -1338 121 1262 755 -713 -898 -12 1738 123 -750 -1091 679 1804 -351 -912 -1420 589
4681 589 1380 -115 -1175 -741 843 1131 -360 -1264 -544 1158 1015 -463 -1318 -424 1142 1057 -485 -1387
4699 -1387 -295 1201 825 -769 -1144 3 1340 742 -890 -1204 237 1171 657 -921 -988 357 1168
4716 1168 348 -1032 -1040 500 1295 -20 -1289 -695 820 1329 10 -1193 -752 742 1247 -285 -1280
4733 -1280 -435 1081 1074 -469 -1331 -450 1249 977 -571 -1274 -90 1123 845 -878 -1351 32 1200
4750 1200 578 -871 -1204 322 1381 119 -1006 -952 341 1249 269 -1115 -964 547 1378 -6 -964
4767 -964 -839 791 1019 14 -1349 -822 965 1289 -139 -1068 -517 789 905 -512 -1328 -294 1188
4784 1188 749 -640 -1373 -199 991 815 -683 -1187 243 1302 722 -895 -1236 287 1165 492 -936
4801 -936 -936 432 1303 324 -1177 -829 646 1328 112 -1029 -787 943 960 -209 -1265 -185 1104 868
4819 868 -266 -1373 -427 739 1308 -513 -1449 -314 874 595 -687 -1133 66 1092 785 -826 -1092
4836 -1092 165 1393 504 -1008 -1084 178 1192 398 -1181 -821 477 1121 176 -1070 -741 704 1215
4853 1215 179 -1162 -647 825 1072 -183 -1182 -279 1123 1101 -230 -1300 -281 985 840 -521 -1215
4870 -1215 -270 1244 682 -800 -1100 -28 1228 620 -1031 -989 203 1191 288 -946 -1079 340 1306
4887 1306 277 -1068 -858 521 1225 287 -1211 -799 673 1368 45 -1166 -447 958 1054 -170 -1178
4904 -1178 -307 871 899 -455 -1226 -374 1124 803 -822 -1214 20 1194 623 -641 -1062 209 1194
4921 1194 487 -885 -1163 263 1282 490 -861 -878 446 1163 392 -1084 -952 543 1233 -27 -1083
4938 -1083 -613 701 1204 -169 -1296 -494 886 1085 -182 -1269 -517 958 1074 -446 -1134 -187 1094
4955 1094 961 -442 -1079 6 1056 785 -861 -1159 -64 1164 539 -886 -1062 320 1048 364 -984
4972 -984 -951 294 1134 163 -1164 -858 550 1134 235 -1037 -744 667 1137 -228 -1132 -334 1032 1095
4990 1095 -453 -1380 -255 884 870 -406 -1023 -164 1079 816 -673 -1157 -156 1121 672 -644 -1107
5007 -1107 213 1155 471 -990 -988 223 1077 406 -872 -1048 596 1304 67 -1222 -752 695 1024 25
5025 25 -1113 -513 787 1077 -181 -1220 -459 825 950 -211 -1161 -222 1057 963 -530 -1069 -40 914
5043 914 797 -652 -1134 -1 1134 506 -647 -954 157 1104 389 -815 -1040 443 1210 254 -1015
5060 -1015 -769 439 1136 231 -975 -664 737 1118 -232 -1003 -652 778 873 -192 -1025 -386 825 876
5078 876 -440 -1113 -205 1031 732 -441 -1040 -123 1060 627 -729 -866 211 1235 477 -924 -973 143
5096 143 1213 526 -885 -992 351 1227 474 -830 -764 627 1200 311 -1021 -714 695 1003 -112 -971
5114 -971 -541 866 822 -309 -999 -391 721 874 -284 -1186 -129 957 747 -550 -1079 -72 953
5131 953 544 -656 -1000 114 999 369 -875 -865 289 937 267 -870 -785 285 949 84 -879 -754 428
5150 428 1099 57 -1066 -484 619 1080 -116 -1080 -556 715 927 -240 -1210 -363 985 818 -549
5167 -549 -1253 -137 971 666 -453 -1009 -16 945 568 -602 -910 13 1006 531 -842 -909 156 1138
5185 1138 301 -746 -863 536 1154 109 -928 -659 709 925 1 -1057 -489 686 917 37 -1028
5202 -1028 -446 930 822 -222 -1081 -244 1057 692 -474 -1065 -149 882 893 -475 -1119 42 1028 522
5220 522 -867 -831 171 1117 267 -749 -879 169 1066 264 -942 -646 478 964 149 -1001 -684 791
5238 791 845 -66 -951 -539 723 979 -106 -1017 -567 644 851 -318 -1142 -284 782 541 -592 -923
5256 -923 -17 994 464 -677 -810 71 962 507 -771 -753 159 1180 452 -745 -790 340 882 316 -895
5275 -895 -852 397 969 206 -1047 -479 667 957 -74 -975 -551 770 852 40 -950 -444 1000 797 -334
5294 -334 -1057 -303 874 706 -489 -960 -16 877 489 -823 -941 105 943 450 -970 -764 252 892
5312 892 235 -787 -833 457 1006 48 -944 -636 576 1003 -34 -922 -571 674 757 -270 -913 -456 736
5331 736 783 -214 -1150 -274 642 724 -431 -953 -174 993 783 -563 -894 62 1054 416 -585 -951 151
5350 151 1018 372 -850 -806 299 926 294 -805 -869 389 1014 119 -845 -701 484 905 -87 -823 -614
5369 -614 618 832 -355 -1002 -341 735 782 -431 -959 -33 871 806 -445 -925 -151 901 719 -701
5387 -701 -948 -169 1001 386 -536 -828 309 896 346 -638 -972 301 895 118 -919 -579 353 836 138
5406 138 -836 -598 479 893 -76 -841 -500 662 878 -203 -842 -473 705 842 -325 -971 -238 692
5424 692 624 -484 -903 -4 996 468 -565 -900 -101 828 372 -616 -862 255 936 357 -730 -943 233
5443 233 1036 131 -910 -746 458 759 39 -932 -444 501 661 -161 -945 -287 707 714 -149 -920 -318 781
5463 781 725 -220 -910 -103 904 609 -332 -827 -16 873 537 -738 -786 187 977 393 -734 -768 94 998
5483 998 304 -709 -813 324 853 80 -931 -632 232 807 -204 -833 -317 557 780 -136 -815 -278 623
5502 623 834 -166 -848 -314 586 664 -305 -928 -391 869 551 -554 -873 -110 918 483 -649 -878 146
5521 146 885 328 -675 -952 333 1063 310 -698 -653 345 915 190 -821 -663 491 905 -79 -1023 -586
5540 -586 524 835 -135 -825 -340 543 926 -250 -873 -216 734 549 -405 -1050 -124 821 511 -613 -833
5559 -833 -106 746 423 -646 -828 125 866 375 -734 -651 307 694 205 -684 -558 494 801 111 -799
5578 -799 -647 644 893 95 -722 -680 562 770 -133 -993 -489 646 779 -261 -888 -202 775 522 -338
5597 -338 -748 57 751 381 -469 -743 -44 863 614 -653 -757 187 925 265 -586 -612 399 900 137 -610
5617 -610 -590 409 820 174 -640 -549 527 808 -141 -862 -508 911 682 -217 -989 -354 686 606 -352 -852
5637 -852 -312 771 610 -254 -849 -215 756 427 -481 -742 105 821 436 -605 -747 236 835 206 -448
5656 -448 -659 430 941 265 -857 -632 353 838 -40 -715 -472 405 885 -114 -937 -274 653 689 -105 -942
5676 -942 -252 613 629 -555 -894 -131 858 469 -595 -782 90 863 639 -452 -661 76 821 364 -492
5695 -492 -639 196 771 179 -623 -564 234 831 157 -657 -433 539 657 -81 -878 -530 757 726 -112 -852
5715 -852 -265 503 693 -183 -681 -167 711 628 -289 -806 -214 705 295 -434 -674 122 845 427 -560 -675
5735 -675 178 878 200 -744 -487 307 680 122 -819 -458 333 776 105 -710 -388 626 870 124 -824 -221
5755 -221 532 671 -199 -931 -329 539 554 -305 -734 -163 720 531 -404 -746 100 625 494 -476 -826 4
5775 4 813 358 -522 -827 273 758 277 -545 -624 272 858 91 -643 -564 267 771 54 -624 -501 414 842
5796 842 -83 -779 -370 555 475 -43 -811 -163 567 823 -203 -736 -111 637 534 -304 -671 19 679 377
5816 377 -562 -821 93 686 373 -701 -587 154 890 487 -573 -750 153 753 206 -522 -634 373 672
5835 672 3 -822 -507 314 632 -118 -723 -162 625 772 -182 -756 -260 784 512 -146 -580 -180 651 514
5855 514 -251 -671 -82 641 517 -396 -657 34 779 320 -632 -714 186 813 216 -823 -583 320 741 45
5875 45 -652 -549 377 679 -53 -859 -309 559 572 -30 -821 -260 594 567 -303 -704 -17 678 504 -278 -678
5896 -678 -103 610 545 -393 -680 2 645 369 -389 -640 178 752 277 -535 -609 382 626 307 -599 -591 375
5917 375 593 161 -731 -448 449 691 55 -638 -438 554 655 -128 -776 -287 493 630 -246 -619 -130 688
5937 688 500 -211 -747 -64 746 447 -528 -522 156 717 490 -514 -536 147 685 267 -596 -682 287 569 55
5958 55 -770 -291 459 719 53 -636 -460 462 612 -237 -733 -363 557 692 -157 -687 -289 476 558 -169 -762
5979 -762 -99 491 465 -230 -651 -33 801 373 -188 -597 -158 694 279 -586 -723 217 699 304 -531 -671
5999 -671 344 728 146 -591 -499 242 699 201 -830 -495 289 662 -112 -702 -255 725 576 -165 -656 -173
6019 -173 745 580 -271 -672 -230 575 424 -455 -559 -144 823 518 -345 -667 -121 577 130 -441 -555 295
6039 295 867 244 -539 -513 151 738 243 -756 -545 271 605 -42 -738 -303 564 791 -69 -646 -314 412
6059 412 653 -80 -667 -367 521 736 -299 -571 -152 664 393 -480 -521 -167 730 516 -415 -615 -17 686
6079 686 445 -391 -693 235 699 162 -668 -490 50 619 194 -636 -494 493 550 124 -634 -380 297 566
6099 566 -9 -664 -315 549 663 -235 -713 -128 647 476 -310 -645 -159 652 393 -356 -637 18 784 359
6119 359 -588 -665 218 645 360 -543 -712 118 568 130 -508 -421 240 661 163 -661 -549 422 869 -160
6139 -160 -649 -383 420 592 -130 -786 -267 575 795 -216 -530 -246 633 375 -374 -729 -172 686 520 -429
6159 -429 -675 73 745 307 -518 -739 288 776 314 -686 -526 195 696 373 -617 -552 291 768 143 -541
6179 -541 -396 382 516 -171 -575 -396 382 583 -142 -670 -308 398 595 -234 -699 -64 736 493 -205 -623
6199 -623 2 530 420 -349 -543 105 434 391 -430 -666 124 703 168 -550 -683 285 685 210 -580 -618 175
6220 175 701 36 -541 -323 460 523 45 -657 -333 587 668 -269 -671 -105 532 418 -91 -685 -249 620 620
6241 620 -182 -649 -231 669 362 -166 -675 109 726 187 -527 -545 139 711 305 -529 -587 160 623 275 -564
6262 -564 -575 342 706 149 -489 -392 256 609 34 -652 -172 553 596 -87 -738 -293 548 604 -309 -663 -308
6283 -308 478 668 -188 -533 -96 620 537 -398 -647 80 744 301 -577 -559 49 641 213 -477 -653 159 670
6304 670 207 -593 -345 167 660 103 -851 -237 512 646 -20 -650 -190 435 682 -137 -714 -111 542 483
6324 483 -215 -585 -151 659 311 -252 -463 -100 559 365 -460 -699 -16 692 156 -448 -575 94 576 210
6344 210 -435 -478 205 529 295 -428 -558 285 541 25 -656 -359 494 619 -57 -729 -390 463 614 -203
6364 -203 -757 -58 508 359 -397 -531 -181 644 336 -230 -451 152 593 511 -468 -648 -62 553 308 -638
6384 -638 -391 137 623 240 -546 -485 215 614 153 -574 -356 167 552 -188 -504 -497 496 573 -69 -514 -440 580
6406 580 529 -229 -651 -161 546 594 -345 -493 22 625 515 -52 -614 -19 528 390 -417 -499 236 659 308
6427 308 -389 -684 240 607 -43 -449 -392 388 579 -172 -597 -335 366 669 9 -762 -257 445 486 -114 -667
6448 -667 25 543 563 -329 -771 -90 499 384 -198 -688 -146 639 425 -417 -414 -88 725 453 -565 -596 76
6469 76 733 113 -505 -627 92 654 49 -568 -363 231 597 118 -681 -431 437 594 162 -464 -185 547
6489 547 536 -234 -726 -285 394 570 -222 -586 -45 436 489 -259 -590 -131 464 311 -416 -373 -75 507 226
6510 226 -346 -769 192 424 207 -414 -450 177 677 176 -656 -389 247 436 89 -597 -449 174 683 -5
6530 -5 -808 -356 394 414 -64 -539 -399 495 312 -163 -730 -107 539 493 -438 -494 -27 607 409 -485 -468 30
6552 30 720 354 -661 -486 137 477 188 -642 -528 311 674 -29 -546 -417 351 622 76 -509 -374 384
6572 384 452 -116 -604 -334 327 621 -159 -594 -170 390 525 -152 -701 -115 695 265 -366 -458 -80 474 303
6593 303 -236 -536 198 391 388 -478 -628 201 590 28 -397 -429 372 742 303 -432 -398 315 724 25 -579
6614 -579 -336 233 458 -116 -577 -360 290 468 -255 -471 -156 563 515 -153 -502 324 255 617 -193 -219 -94
6635 -94 967 -9 -547 -405 -320 960 367 -544 -556 136 435 233 -463 -566 218 395 -154 -639 -363 97
6655 97 597 256 -713 293 368 362 -233 -805 -464 381 546 57 -241 224 428 321 -328 -622 -172 573 358
6676 358 -432 -658 -15 436 232 -178 -495 146 400 411 -502 -438 193 705 180 -481 -589 47 830 -148 -602
6697 -602 -555 408 808 -386 -274 -258 58 551 80 -94 -52 608 215 -441 -494 -329 489 140 -112 -364 -121
6718 -121 584 669 -498 -527 60 573 265 -341 -563 344 148 116 -702 -994 -33 704 527 -718 -437 262
6738 262 429 68 -611 -349 332 468 -64 -545 -209 407 427 -95 -508 -39 379 376 -489 -635 -233 446 474
6759 474 -143 -908 180 748 318 -68 -289 -128 -252 108 -170 -443 387 601 34 -549 -403 441 568 56
6779 56 -533 -530 273 512 9 -551 -123 390 475 24 -590 -175 433 543 -52 -553 -80 544 330 -94 -421
6800 -421 11 463 318 -346 -667 -265 476 252 -517 -624 17 428 321 -262 -351 162 702 175 -363 -438 282
6821 282 620 180 -561 -330 82 414 48 -493 -383 418 572 -196 -654 -364 251 464 -92 -532 -204 496
6841 496 525 -435 -585 -73 605 355 -420 -572 -4 456 209 -389 -703 36 322 152 -306 -560 228 436
6861 436 224 -412 -474 51 600 24 -435 -406 298 462 -24 -485 -189 499 493 37 -769 -30 455 535 -145 -555
6883 -555 -160 500 537 -338 -414 92 605 468 -376 -658 42 447 322 -322 -347 -9 691 268 -553 -323 195
6904 195 627 268 -433 -418 250 574 236 -532 -181 249 490 30 -536 -417 345 513 -7 -455 -225 677
6924 677 513 -99 -569 -63 474 436 -133 -526 -370 753 685 -560 -733 35 492 157 -427 -561 211 644
6944 644 38 -414 -542 275 418 203 -480 -320 294 530 70 -542 -324 312 385 14 -542 -337 376 336 -112
6965 -112 -619 -161 530 480 -168 -453 -267 629 497 -293 -524 -44 422 317 -340 -501 30 433 333 -361
6985 -361 -426 59 464 269 -462 -327 162 515 113 -525 -472 331 415 63 -587 -193 389 410 -25 -542 -221
7006 -221 436 467 -113 -505 -167 418 510 -149 -640 -179 460 309 -265 -472 -89 448 298 -412 -525 -42 475
7027 475 237 -359 -474 170 556 19 -204 -421 171 347 183 -429 -272 115 503 161 -426 -422 276 412 13
7048 13 -484 -348 359 497 -187 -626 -186 505 273 -185 -592 44 427 409 -147 -290 -235 365 356 -344 -139 -84
7070 -84 564 534 -660 -544 -16 813 350 -312 -297 330 -63 -216 -149 -224 -70 539 2 -743 -155 254 632
7091 632 -126 -408 -328 420 496 -69 -654 -256 407 384 -249 -586 -234 491 285 -389 -503 53 627 215 -344
7112 -344 -486 99 353 283 -284 -402 203 591 131 -401 -628 247 445 65 -465 -429 315 419 48 -329 -343
7133 -343 373 317 55 -599 -192 314 244 57 -633 -59 374 495 -237 -663 15 462 229 -243 -571 -69 416
7154 416 284 -398 -442 91 561 127 -359 -426 81 541 265 -341 -440 197 734 34 -397 -371 279 639 87
7175 87 -617 -366 320 276 -207 -497 -126 436 505 -147 -571 -205 460 330 -207 -570 61 522 393 -298 -653
7196 -653 49 476 330 -440 -453 101 344 153 -532 -244 233 534 72 -515 -458 269 496 118 -542 -138 425
7217 425 513 161 -198 -241 378 371 -79 -448 -202 356 365 31 -438 -176 338 313 -351 -547 -168 565 296 -216
7239 -216 -350 -101 336 292 -324 -522 70 465 366 -614 -306 -314 338 122 -355 -181 95 299 267 -209 341 632
7261 632 644 62 -666 -43 302 510 -180 -456 -270 290 165 -247 -350 -162 330 495 -424 -597 -151 702
7281 702 327 -575 -240 -13 541 267 -180 -417 -63 540 414 -395 -833 599 399 -334 -757 -329 189 832
7301 832 -229 -616 -412 345 261 -49 -667 -91 510 95 -25 -235 -64 282 420 -348 -146 -332 653 472
7321 472 -415 -141 -175 494 84 -466 -694 -179 1153 337 -231 -593 -169 320 133 -129 -572 475 280 252
7341 252 -162 -440 172 907 93 -313 27 398 433 -124 -542 -211 335 192 -10 -410 -17 470 420 -205 -445
7362 -445 -72 525 280 -194 -587 -100 474 341 -322 -381 151 470 201 -461 -327 -21 594 60 -597 -378
7382 -378 7 467 -148 -493 -338 288 353 241 -53 -346 222 128 28 -334 -168 268 362 -240 -363 -164 537
7403 537 280 -171 -532 12 470 244 -192 -367 133 507 271 -239 -556 -30 543 310 199 -198 174 470
7423 470 85 -399 -338 306 717 313 -525 -377 317 600 -15 -475 -192 357 514 -141 -554 -38 310 260 -36
7444 -36 -545 -115 451 316 -161 -446 34 464 385 -411 -414 23 369 74 -265 -403 23 412 244 -404 -312 165
7466 165 514 25 -485 -343 144 309 57 -378 -361 244 234 55 -393 -243 256 213 -121 -519 -316 370 394
7487 394 -190 -476 -15 260 307 -257 -332 -69 355 351 -281 -448 6 436 31 -221 -472 147 603 139 -318
7508 -318 -247 150 431 211 -299 -180 223 285 -159 -544 -268 429 437 -244 -413 -120 381 413 -176 -458 -78 346
7530 346 275 -132 -532 -126 356 223 -288 -339 15 339 239 -312 -254 150 431 168 -269 -571 201 423 167
7551 167 -206 -322 41 392 -65 -274 -180 154 468 59 -369 -297 213 321 -178 -325 -106 255 452 -103 -492
7572 -492 -67 258 483 -159 -328 54 357 300 -238 -380 -35 515 292 -367 -515 -9 311 141 -248 -501
7592 -501 112 419 3 -202 -316 225 449 124 -352 -170 403 329 78 -408 -319 338 280 -38 -410 -130 258
7613 258 462 -276 -353 19 242 433 -158 -189 34 258 308 -391 -275 -135 431 278 -355 -386 70 405 153
7634 153 -320 -310 65 497 -46 -431 -135 262 444 -53 -353 -351 361 342 -82 -356 -314 246 334 -219 -374 -239
7656 -239 344 223 -147 -472 8 446 228 -191 -359 2 300 242 -121 -220 134 461 300 -219 -344 63 523
7677 523 314 -307 -278 253 413 91 -482 -305 78 479 138 -400 -137 170 361 -188 -541 -198 270 432
7697 432 -48 -358 -320 402 381 -87 -572 4 524 162 -176 -494 120 454 257 -352 -358 46 517 55 -354
7718 -354 -387 61 434 73 -218 -343 126 388 94 -354 -178 157 266 -50 -299 -54 287 587 -130 -428
7738 -428 -129 188 291 -103 -509 -78 275 315 -250 -340 53 300 107 -257 -390 -150 380 143 -130 -184 10
7759 10 321 113 -318 -198 129 285 309 -445 -219 123 308 30 -439 -156 378 339 -43 -279 -302 284 342 59
7781 59 -434 -163 223 401 -179 -411 -177 172 374 -119 -418 -74 129 181 -425 -453 -38 388 170 -270 -289
7802 -289 226 541 252 -157 -219 22 555 67 -477 -297 170 372 93 -324 -421 323 310 236 -270 -97 310
7823 310 96 -43 -239 -155 217 178 -100 -410 -39 410 345 -60 -384 13 313 298 -274 -559 77 493 101
7844 101 -286 -325 166 246 -23 -484 -316 65 386 17 -439 -263 216 482 202 -471 -493 209 363 50 -371
7865 -371 -33 303 329 -2 -296 -69 241 292 -94 -378 56 271 238 -265 -271 -94 375 280 -191 -625 -32 331
7887 331 68 -317 -505 -19 462 82 -163 -210 21 219 194 -351 -382 293 382 2 -591 -183 337 354 -184 -404
7909 -404 -14 291 307 -195 -440 -8 322 368 -136 -403 52 228 114 -161 -339 -178 361 391 -270 -466 -119
7930 -119 383 120 -208 -369 -33 464 161 -220 -347 264 394 -102 -289 -170 122 354 -47 -313 -166 284
7950 284 346 58 -491 -201 148 179 -113 -335 -144 189 310 -100 -332 -199 353 390 -50 -450 -17 508 166
7971 166 -172 -278 174 361 195 -99 -377 153 397 138 -286 -343 144 410 -151 -238 -155 182 329 -193 -272
7992 -272 -240 300 107 -183 -416 -123 309 172 -93 -290 62 232 273 -183 -372 24 354 60 -124 -162 -5
8013 -5 140 363 -68 -381 -25 392 4 -205 -331 -6 352 15 -364 -405 258 433 -91 -542 -253 213 433
8034 433 8 -233 -286 218 146 -102 -318 -53 226 270 -154 -370 -185 365 291 -256 -379 63 367 100 -232
8055 -232 -336 156 495 319 -165 -347 182 514 -75 -342 -382 216 397 78 -233 -296 129 387 2 -364 -181
8076 -181 271 312 35 -404 -301 150 287 -180 -375 -91 289 395 14 -181 -63 444 323 -326 -370 92 478
8097 478 125 -122 -266 29 353 226 -313 -334 15 402 150 -311 -74 156 458 -54 -274 -185 111 399 13
8118 13 -358 -163 193 305 -92 -378 -200 332 252 -200 -284 -96 183 215 -211 -291 -90 303 297 -251 -332 -137 338
8141 338 235 -106 -135 116 282 176 -339 -233 -50 395 177 -281 -225 117 352 -33 -415 -188 201 342 43
8162 43 -309 -113 116 251 -24 -403 -208 144 333 -165 -387 -210 284 292 -177 -365 -117 341 90 -166 -398
8183 -398 90 528 61 -293 -248 -16 371 338
8191C38
$$ Imaginary data points
##PAGE= N=2
##DATA TABLE= (X++(I..I)), XYDATA
0 0 0 0 0 0 0 0 0 0 0 0 8 -8 0 -8 8 -8 16 -18 24 -24 32 -40 45 -56 64 -74 86 -104 117 -133 155 -179 198 -227
34 -227 259 -289 326 -368 409 -456 509 -568 629 -696 773 -854 941 -1039 1147 -1260 1390
51 1390 -1533 1687 -1859 2055 -2273 2516 -2798 3126 -3504 3955 -4505 5183 -6046 7201 -8814
66 -8814 11232 -15286 23576 -73162 414207 621640 -153667 -664630 -244386 541797 522141
77 522141 -228235 -666855 -141621 576790 471227 -325591 -645785 -47683 613325 384264
87 384264 -389788 -611203 44147 626012 306362 -456296 -558205 135579 627631 211658
97 211658 -502567 -495874 219022 612827 124445 -542880 -425485 298392 585692 31736
107 31736 -559881 -346981 362018 550001 -52611 -574722 -262675 422759 496433 -136522
117 -136522 -568055 -184060 465361 444868 -213974 -558151 -98014 497373 377319 -277990
127 -277990 -530072 -20441 518079 309869 -339833 -492804 63104 524305 232653 -388627
137 -388627 -447315 137882 523332 156592 -431952 -395230 209804 510320 79407 -460390
147 -460390 -336889 269282 487075 5967 -479794 -272424 323090 449005 -68147 -482433
157 -482433 -204402 364387 406169 -138243 -479684 -129468 400560 350784 -201716 -462733
167 -462733 -59078 427513 295546 -262534 -439510 14695 442719 233084 -310121 -408297
177 -408297 79787 450437 170405 -353062 -367192 143409 443865 106420 -381573 -320787
187 -320787 198418 429710 42527 -402934 -266936 249478 403298 -21532 -412489 -209071
197 -209071 293590 371812 -85155 -416053 -145805 331978 330416 -143392 -409050 -85860
207 -85860 361605 287860 -199157 -395172 -22346 380216 236336 -244248 -371999 35732
217 35732 391463 183073 -285815 -339402 94198 389828 126226 -316660 -302568 147809
227 147809 384034 67539 -343432 -258205 197395 367675 10231 -359945 -212332 240449
237 240449 346213 -45607 -369114 -161766 275385 315374 -96285 -367945 -111827 303387
247 303387 280903 -145458 -360171 -57312 324173 238388 -188819 -344061 -4992 339667
257 339667 193286 -230351 -321290 48795 346111 145539 -264065 -294609 98226 348779
267 348779 95997 -293682 -260415 145171 340883 46972 -313626 -223364 186777 326791
277 326791 -3288 -326159 -179754 222635 303218 -50974 -330904 -134200 254144 274882
287 274882 -99511 -328651 -84174 279555 240303 -143462 -320067 -35892 300080 203092
297 203092 -185124 -305103 13678 311785 162331 -219399 -284709 59638 317828 118816
307 118816 -249008 -256718 103421 313940 74399 -270787 -225375 144413 305250 27231
317 27231 -287552 -187655 181245 288955 -18087 -297737 -148584 214190 268056 -63469
327 -63469 -301651 -106127 240650 241444 -104362 -299161 -63764 262187 210395 -143445 -289146
338 -289146 -19605 276106 174525 -176992 -273299 23227 284612 135141 -208114 -250878
348 -250878 66032 286452 94030 -233500 -225490 106800 284116 51557 -254666 -194590
358 -194590 143677 274379 10780 -268557 -161880 176858 259740 -30506 -275534 -124606
368 -124606 203501 238210 -68890 -276235 -86230 226445 211657 -106488 -269834 -45262
378 -45262 242993 180994 -140581 -258954 -4556 255704 147250 -171978 -242723 35452
388 35452 262238 112483 -198689 -223457 73306 263957 75466 -219992 -198315 107671
398 107671 258608 39011 -235548 -170662 139713 248142 448 -245646 -137780 167525
408 167525 231409 -36924 -250822 -103068 192550 210416 -74186 -250500 -66212 212341
418 212341 185788 -107700 -245796 -29871 227913 157411 -138671 -234569 6322 237177
428 237177 126690 -165260 -219062 41819 240959 92921 -187592 -197682 75567 239069
438 239069 58037 -206508 -173146 108773 233006 21192 -220478 -144738 138041 221691
448 221691 -13866 -229849 -114859 164396 206356 -48585 -233188 -82825 185224 186414
458 186414 -80217 -230905 -49661 201986 161694 -110168 -222391 -15292 212765 134027
468 134027 -136883 -209906 19455 219724 103293 -161122 -192842 52733 221898 71900
478 71900 -181771 -172825 84594 220069 39125 -197348 -149555 112905 213011 7292 -208193
489 -208193 -124065 138250 201186 -24349 -213364 -95346 159191 184596 -54847 -213905
499 -213905 -64572 177197 163788 -84516 -209760 -33247 190589 140080 -111730 -202606
509 -202606 -1502 200796 113984 -136287 -190315 28804 205888 87008 -156472 -174891
519 -174891 57476 206396 58377 -172582 -155522 84161 202114 29089 -185305 -133058
529 -133058 109564 193366 -1085 -193686 -108077 132035 181405 -30465 -198565 -81205
539 -81205 151936 165850 -58744 -198947 -53786 167891 147626 -84948 -195147 -25149
549 -25149 180170 125768 -108736 -186119 3216 187051 101716 -129674 -173380 31939 190214
560 190214 74391 -147661 -156626 59554 189462 46616 -163019 -137381 85940 185096 17909
571 17909 -174423 -116067 109506 177370 -9603 -182195 -92481 130054 165261 -36294 -184778
582 -184778 -67372 146287 149662 -61714 -183094 -40447 159495 130062 -85619 -176829 -13360
593 -13360 168724 108030 -107719 -167703 14037 174583 83772 -127181 -154882 40140 176935
604 176935 59184 -143807 -139598 64622 175154 33418 -155713 -121177 86708 169714 8166
615 8166 -164614 -100365 107148 159535 -17475 -168966 -77493 124710 146530 -42820 -170401
626 -170401 -52720 139888 130165 -66830 -167502 -27471 151501 111799 -88900 -161577 -2252
637 -2252 159425 91341 -107910 -151563 22040 163213 69652 -123848 -138406 45796 162934
648 162934 45946 -136621 -121851 67909 159451 21374 -146745 -102866 89011 152066 -3403
659 -3403 -153381 -82377 107484 142718 -27309 -157323 -60734 122867 130107 -49208 -157046
670 -157046 -39060 134795 115026 -69362 -153199 -16424 143160 97436 -87353 -145701 5706
681 5706 148175 77479 -103939 -135395 28311 150400 55845 -118101 -122005 49895 149666
692 149666 34043 -130189 -106743 70083 145774 11788 -138832 -90069 87871 138898 -9797
703 -9797 -144060 -71217 103138 128715 -30709 -145620 -51437 115930 115889 -50640 -143894 -30385
715 -30385 126079 100556 -69321 -139467 -9159 133866 83748 -86764 -132231 12269 138361
726 138361 65370 -101812 -122347 32546 140108 46095 -114163 -109642 51822 138232 25974
737 25974 -123156 -94997 69410 133233 5608 -129544 -77864 85515 125501 -14731 -133235
748 -133235 -59681 99794 115381 -34897 -134299 -40263 111779 103029 -53518 -132678 -20997
759 -20997 120727 88987 -70109 -127932 -1517 126842 72901 -84866 -120213 17414 129401
770 129401 55130 -97580 -109345 36300 129325 36170 -108518 -96349 54324 126444 16531
781 16531 -116976 -81549 70706 121079 -2659 -122610 -66119 85199 113773 -21518 -125619
792 -125619 -49222 97284 103625 -38673 -125441 -32034 106932 91386 -55210 -122011 -13769
803 -13769 113721 77102 -70160 -116316 4838 118230 61297 -83960 -107986 22767 120232
814 120232 44322 -95415 -98003 39945 119971 27120 -104528 -85887 55872 116927 9962
825 9962 -110946 -72386 69948 111225 -7196 -114817 -57176 82301 102707 -24272 -115744
836 -115744 -40687 92754 92634 -40713 -114722 -23560 101468 80423 -55958 -111590 -6562
847 -6562 108025 66963 -69800 -105950 10411 111649 52696 -81422 -98330 26528 112794
858 112794 37091 -91142 -87625 41879 110857 20569 -98777 -75411 56019 106607 3343
869 3343 -104151 -61432 69188 100360 -13175 -107374 -46871 80885 92153 -29205 -108412
880 -108412 -31792 90122 82332 -43729 -106830 -16717 97294 70936 -56988 -102738 -1451
891 -1451 101593 58295 -68423 -96589 13815 103743 43941 -78519 -88091 28989 103732
902 103732 29014 -87314 -78052 43313 101946 13781 -94169 -66880 56491 98181 -1131
913 -1131 -98770 -54530 67904 92305 -15851 -101046 -41075 77533 84411 -30003 -100792 -26542
925 -26542 85435 74460 -43498 -98346 -11845 91587 63251 -55948 -94302 3339 95925
936 95925 50866 -66952 -88111 17768 98236 37730 -76577 -80557 31382 98263 24074
947 24074 -83993 -70860 43982 95611 9925 -89550 -59998 55552 90999 -4211 -92630
958 -92630 -47503 65723 84171 -18334 -94258 -34556 74881 76339 -31953 -93977 -21182
969 -21182 82057 66990 -44243 -91977 -7616 87451 56564 -55294 -87853 5475 90587
980 90587 45432 -64832 -81677 18716 91733 32698 -73055 -73558 31253 90549 19396 -79512
992 -79512 -63923 43431 87816 5864 -84365 -53220 54337 83591 -7432 -87663 -41934 64034
1004 64034 77535 -20309 -88742 -29849 71825 70321 -32340 -87940 -17111 77993 60973 -43485
1016 -43485 -85008 -4304 82351 50695 -53549 -80291 8628 84751 39490 -62456 -74134
1027 -74134 20944 85847 27534 -70087 -66610 32713 85059 15502 -75985 -58036 43201 82257
1039 82257 3182 -79953 -48306 52598 77860 -8830 -82198 -37496 60801 71353 -20207 -82732
1051 -82732 -26092 67696 63987 -31618 -81513 -14481 73328 55451 -42245 -79125 -2381 77645
1063 77645 46051 -51731 -75123 9205 80079 35868 -59850 -69562 20404 80444 24949 -66450
1075 -66450 -62313 30943 79156 13543 -71366 -53691 40795 76227 1552 -74918 -44043 49800
1087 49800 71662 -9939 -77260 -33489 58225 65885 -21116 -77670 -22625 64713 59126 -31509
1099 -31509 -76767 -11741 69921 50826 -41067 -73800 -517 73265 41718 -49272 -69321 10265
1111 10265 75081 31963 -56709 -63405 21136 75167 21303 -62924 -56244 31430 74034 10420
1123 10420 -67851 -48344 40659 71328 -393 -71386 -39487 48942 67070 -10808 -72879 -30104
1135 -30104 55867 61437 -21146 -73099 -19773 61683 54248 -30921 -71355 -9100 66069 46034
1147 46034 -40224 -68336 1594 69047 36918 -48181 -64325 11961 70893 27655 -55269 -58984
1159 -58984 21783 71065 18214 -60641 -52559 30661 69401 8087 -64685 -44891 39119 66166
1171 66166 -1956 -67142 -35962 46794 61853 -12093 -68381 -26293 53570 56252 -22062 -68327
1183 -68327 -16589 58896 49580 -31263 -67125 -6294 63253 42118 -39263 -64372 3162 65970
1195 65970 34192 -46480 -59955 12453 66894 25240 -52332 -54581 21827 66442 15604 -57231
1207 -57231 -47596 30589 64687 5895 -61313 -39930 38635 61872 -3873 -63871 -31671 45838
1219 45838 57678 -13150 -65045 -23313 51832 52487 -21870 -64582 -14467 56487 45946 -30334
1231 -30334 -62741 -5211 59412 38494 -38054 -59644 4312 61865 30329 -44970 -55428 13476
1243 13476 62801 21576 -50680 -50205 22291 62617 12979 -55456 -43987 30404 60929 3899
1255 3899 -58512 -37165 37396 57992 -4965 -60564 -29251 43634 53616 -13619 -61037 -20781
1267 -20781 49019 48109 -22126 -60224 -11545 53408 41638 -30247 -58661 -2670 56854 34626
1279 34626 -37403 -55513 6170 59025 26957 -43631 -51416 14645 59663 18961 -48450 -46125
1291 -46125 22745 58870 10717 -52287 -39856 29981 56509 1882 -55150 -32493 36830 53321
1303 53321 -6844 -56854 -24882 42848 49012 -14976 -57536 -17052 48016 43824 -22936 -56725
1315 -56725 -9155 51655 38059 -29816 -54634 -1114 54150 31131 -36347 -51517 7229 55258
1327 55258 23662 -41809 -47363 15153 55507 15841 -46670 -41997 22752 54678 7764 -50261
1339 -50261 -36255 29853 52917 -157 -53036 -29890 35936 49890 -7954 -54179 -22783 41132
1351 41132 45741 -15450 -54298 -15246 45404 40714 -22622 -53257 -7355 48697 34664 -29481
1363 -29481 -50921 750 51251 27928 -35686 -47951 8581 52761 20892 -40890 -44059 15973
1375 15973 53142 13844 -45200 -39227 22952 52150 6456 -48208 -33317 29116 49794 -991
1387 -991 -50163 -27104 34870 46327 -8705 -51173 -19857 40118 42412 -16052 -51143 -12583
1399 -12583 44090 37430 -23090 -50165 -5291 47351 31911 -29088 -48429 2131 49367 25866
1411 25866 -34734 -44996 9208 50041 19239 -39275 -41115 15882 49883 11944 -43247 -35992
1423 -35992 22661 48559 4582 -45995 -30512 28924 46566 -2897 -48081 -24278 34335 43440
1435 43440 -9805 -49118 -17719 38974 39582 -16582 -48792 -11012 42276 34635 -22879 -47452
1447 -47452 -3786 45030 28975 -28523 -45100 3294 46740 22874 -33885 -41822 10618 47633
1459 47633 16202 -38113 -37717 17166 47323 9702 -42084 -33211 23031 46194 2927 -44518
1471 -44518 -27899 28651 43969 -3704 -45752 -21708 33544 40614 -10369 -46043 -15469 37566
1483 37566 36244 -16902 -45645 -8574 41052 31551 -23200 -44377 -1856 43508 26186 -28742
1495 -28742 -41992 4961 45016 20389 -33282 -39267 11235 45486 14471 -37175 -35509 17035
1507 17035 44756 8369 -40001 -30698 22635 43287 1505 -42148 -25609 27745 40886 -4832
1519 -4832 -43591 -19648 32414 37772 -11159 -44098 -13807 36231 34146 -17182 -43665 -7543
1531 -7543 39362 29678 -22583 -42347 -1319 41440 24507 -27441 -39969 4937 42509 18814
1543 18814 -31742 -36567 11199 42833 12789 -35562 -32652 17256 42505 6588 -38552 -28046
1555 -28046 22748 40971 433 -40748 -23335 27523 38769 -5575 -41636 -17868 31805 35418
1567 35418 -11515 -41759 -12001 34983 31728 -17174 -40969 -5731 37808 26966 -22384 -39424
1579 -39424 468 39647 21756 -27262 -36937 6511 40717 16502 -31343 -33981 12240 41037
1591 41037 10695 -34632 -30241 17609 40005 4999 -37298 -25887 22506 38258 -1032 -38826
1603 -38826 -20805 27063 35867 -6959 -39623 -15463 30837 32445 -12548 -39551 -9972 34167
1615 34167 28715 -17955 -39033 -4126 36445 24652 -22638 -37550 1668 38095 19993 -26687
1627 -26687 -35003 6966 38808 14647 -30378 -31741 12465 38561 9333 -33181 -27863 17409
1639 17409 37530 3562 -35524 -23642 22332 36152 -1856 -37266 -19005 26545 33903 -7383
1651 -7383 -37938 -13879 30136 30879 -12579 -37705 -8572 32848 27318 -17490 -36816 -3306 34817
1664 34817 22875 -21955 -34683 2443 36249 18060 -25768 -32492 7868 36685 12790 -29519
1676 -29519 -29415 13057 36819 7608 -32465 -25740 17964 35694 2172 -34538 -21796 22233
1688 22233 33908 -3012 -35517 -17068 25870 31457 -8319 -36026 -12033 29099 28175 -13294
1700 -13294 -35528 -6828 31609 24281 -18042 -34488 -1406 33456 20107 -22191 -32781 3817
1712 3817 34689 15837 -25733 -30372 8774 35122 10991 -29044 -27260 13335 34660 6107
1724 6107 -31224 -23461 17824 33268 962 -32718 -19287 21727 31484 -4171 -33769 -14816
1736 -14816 25506 29054 -9013 -33993 -9917 28340 25932 -13620 -33572 -5243 30714 22657
1748 22657 -18006 -32304 -434 32308 18318 -21732 -30273 4837 32890 13715 -25055 -27623
1760 -27623 9617 32830 9113 -27872 -24553 14210 32376 3887 -30184 -20775 18513 31219
1772 31219 -1008 -31710 -16829 22375 29055 -5754 -32351 -12311 25311 26663 -10244 -32174
1784 -32174 -7821 27665 23415 -14598 -31379 -2833 29493 19663 -18558 -29810 1945 30760
1796 30760 15309 -22121 -27709 6605 31536 11075 -25327 -25044 11035 31293 6503 -27676
1808 -27676 -22123 14852 30378 2044 -29160 -18506 18647 29018 -2469 -30160 -14518 21829
1820 21829 26734 -6954 -30448 -10146 24680 23959 -11147 -30354 -5555 27037 20890 -15389 -29336
1833 -29336 -1344 28788 17640 -18952 -27980 3067 29813 13814 -21841 -25893 7288 29857
1845 29857 9671 -24435 -23155 11217 29549 5225 -26291 -19957 15134 28422 647 -28082
1857 -28082 -16264 18902 26903 -3746 -29006 -12555 21692 24955 -7912 -29348 -8441 24531
1869 24531 22287 -11759 -28910 -4365 26393 19065 -15445 -27809 -445 27423 15591 -18697
1881 -18697 -26202 4104 28246 11583 -21725 -23729 8423 28273 7491 -24201 -20952 12347
1893 12347 27685 3434 -26240 -18019 15946 26853 -891 -27181 -14537 18929 25122 -4761
1905 -4761 -27628 -10695 21697 22776 -8723 -27686 -6628 23850 20059 -12467 -26899 -2561
1917 -2561 25460 16908 -16040 -25906 1489 26631 13460 -18944 -23997 5461 27220 9988 -21396
1930 -21396 -21906 9164 27003 5898 -23272 -19115 12756 26068 2104 -24861 -15918 16100 24852
1943 24852 -1952 -25818 -12651 19023 23066 -5799 -26467 -8761 21463 20832 -9713 -26181
1955 -26181 -5080 23380 18239 -13231 -25513 -1431 24768 15184 -16244 -24067 2578 25606
1967 25606 11827 -18815 -22278 6338 25762 8021 -20937 -19959 9734 25286 4214 -22922
1979 -22922 -17282 13158 24547 658 -24311 -14336 16167 23317 -2947 -24975 -10838 18701
1991 18701 21382 -6739 -25054 -7445 20780 19145 -9866 -24773 -3994 22324 16457 -12865
2003 -12865 -23735 -454 23504 13408 -15810 -22203 3481 24138 10304 -18367 -20409 6853
2015 6853 24383 6646 -20342 -18193 10177 23974 3327 -21978 -15582 13169 23034 -97 -23073
2028 -23073 -12579 15930 21483 -3615 -23497 -9505 18178 19694 -7080 -23510 -6073 20176
2040 20176 17435 -10380 -23167 -2532 21437 14782 -13233 -22295 706 22664 11878 -15935
2052 -15935 -20877 3902 22946 8893 -17885 -18967 7061 22935 5741 -19620 -16685 10281
2064 10281 22505 2341 -21111 -14129 13025 21370 -1171 -21904 -11173 15594 19943 -4428
2076 -4428 -22547 -8314 17875 17952 -7566 -22635 -4916 19404 16118 -10346 -21839 -1856 20742
2089 20742 13419 -13195 -20762 1333 21441 10562 -15477 -19230 4739 21738 7601 -17334
2101 -17334 -17207 7793 21676 4426 -18988 -15009 10713 21024 1305 -20212 -12681 13104 19846
2114 19846 -1767 -21010 -9825 15303 18558 -4821 -21107 -6883 17260 16630 -8065 -21037
2126 -21037 -3906 18598 14304 -10639 -20279 -642 19769 11696 -13127 -19138 2349 20569 9022
2139 9022 -15430 -17614 5365 20729 6220 -17094 -15839 8038 20591 3241 -18448 -13781 10909
2152 10909 19668 290 -19476 -11266 13067 18276 -2744 -19864 -8329 15138 16767 -5697 -19997
2165 -19997 -5311 16732 14962 -8466 -19470 -2607 18168 12807 -11131 -18807 148 19129
2177 19129 10542 -12973 -17796 3057 19251 7927 -14854 -16079 5900 19454 5012 -16429
2189 -16429 -14251 8462 19054 2434 -17613 -12009 10857 18138 -679 -18319 -9842 13023 17179
2202 17179 -3397 -18944 -7115 14615 15510 -5918 -18829 -4567 16095 13726 -8592 -18355 -1848
2215 -1848 17132 11551 -10551 -17416 1007 17931 9083 -12776 -16119 3642 18341 6332 -14401
2228 -14401 -14661 6234 18162 3834 -15836 -13045 8728 17626 1244 -17082 -10759 10813 16787
2241 16787 -1255 -17655 -8409 12555 15471 -3975 -17551 -6087 14310 13719 -6332 -17615 -3297
2254 -3297 15531 11950 -8824 -16946 -869 16612 10064 -11033 -16056 1754 17073 7752 -12792
2267 -12792 -14763 4398 17269 5425 -14167 -13235 6596 17141 2908 -15156 -11350 8709 16322
2280 16322 334 -16131 -9340 10911 15416 -2235 -16599 -7013 12542 14231 -4701 -16673 -4669
2293 -4669 14267 12512 -6993 -16291 -2229 15158 10957 -8948 -15914 124 15886 8727 -10777
2306 -10777 -14669 2341 16219 6545 -12173 -13478 4817 16310 4463 -13741 -11985 6649 15910
2319 15910 2059 -14814 -10181 8828 15109 -350 -15504 -8397 10592 14405 -2505 -15811 -6223
2332 -6223 12211 13072 -4738 -15720 -4206 13209 11404 -6948 -15211 -1643 14151 9618 -8832
2345 -8832 -14566 631 14936 7752 -10744 -13701 2945 15091 5704 -11972 -12352 4708 15266
2358 15266 3580 -13110 -10999 6922 14909 1451 -14088 -9329 8796 14171 -735 -14595 -7481
2371 -7481 10475 13101 -2838 -14794 -5252 11709 11832 -4903 -14605 -3142 12910 10487 -7166
2384 -7166 -14455 -1032 13874 8894 -8527 -13633 1078 14261 7099 -10070 -12896 3051 14359
2397 14359 5138 -11521 -11447 4957 14465 3064 -12398 -10143 6908 13922 833 -13246 -8304
2410 -8304 8590 13120 -1222 -13867 -6599 10036 12178 -3371 -14074 -4773 11363 11119 -4865
2423 -4865 -13839 -2900 12282 9757 -6744 -13380 -783 12988 8278 -8306 -12852 1101 13348
2436 13348 6154 -9919 -11871 3127 13479 4575 -10997 -10655 4975 13539 2494 -11960 -9288
2449 -9288 6818 13159 713 -12661 -7766 8404 12384 -1088 -12905 -5928 9667 11417 -3174
2462 -3174 -13131 -4049 10710 10112 -5035 -12918 -2262 11514 8784 -6999 -12499 -199 12223
2475 12223 7180 -8249 -11869 1331 12824 5579 -9645 -10945 3353 12822 3863 -10604 -9772
2488 -9772 5157 12705 2133 -11378 -8445 6776 12263 202 -12026 -6762 8271 11455 -1763
2501 -1763 -12521 -5271 9408 10482 -3448 -12572 -3520 10451 9425 -5364 -12370 -1703 11252
2514 11252 7839 -6727 -11933 -12 11808 6439 -8179 -11254 1778 11969 5049 -9314 -10214
2527 -10214 3500 12057 3307 -10354 -8975 5183 12009 1474 -11149 -7756 6771 11504 -418
2540 -418 -11509 -6235 8101 10779 -1918 -11870 -4704 9114 10011 -3595 -11684 -2981 10033 8654
2554 8654 -5087 -11668 -1339 10747 7402 -6588 -11102 424 11420 6053 -7976 -10438 2079
2567 2079 11704 4506 -9056 -9539 3573 11578 2932 -9994 -8449 5140 11300 1140 -10441 -7180
2581 -7180 6631 10919 -440 -10923 -5817 7633 9985 -2314 -11292 -4228 8929 9033 -3698
2594 -3698 -11273 -2550 9644 7942 -5059 -10953 -997 10406 6831 -6507 -10481 629 10832
2607 10832 5363 -7601 -9716 2151 11000 3929 -8787 -8592 3826 10755 2172 -9553 -7665 5239
2621 5239 10305 716 -10160 -6255 6600 10127 -683 -10460 -4926 7686 9502 -2417 -10633 -3587
2635 -3587 8567 8408 -3738 -10794 -1993 9496 7340 -5184 -10270 -469 9775 6061 -6436 -9695
2649 -9695 1002 10251 4739 -7606 -8990 2591 10168 3218 -8568 -8052 3949 10352 1893 -9178
2663 -9178 -6953 5390 10112 350 -9895 -5852 6468 8914 -1049 -10148 -4480 7579 8573 -2666
2677 -2666 -9890 -3065 8439 7571 -4003 -9904 -1371 9086 6491 -5431 -9680 -70 9440 5261
2691 5261 -6402 -9024 1559 9652 3864 -7581 -8334 2643 9923 2533 -8458 -7380 4210 9613
2705 9613 1207 -8913 -6211 5414 9092 -229 -9097 -4988 6531 8779 -1582 -9761 -3754 7474
2719 7474 7963 -2997 -9856 -2295 8683 6916 -4147 -9184 -1252 8263 6039 -5564 -8738 271
2733 271 8670 4667 -6659 -8252 1708 9406 3448 -7356 -7502 3120 9371 2167 -8189 -6631
2747 -6631 4293 9086 678 -8749 -5614 5550 8483 -668 -9030 -4412 6430 8042 -1967 -9075
2761 -9075 -3257 7436 7286 -3153 -8977 -1971 8037 6242 -4358 -8756 -261 8418 5365 -5572
2775 -5572 -8363 822 8559 4023 -6483 -7810 2007 8675 2868 -7275 -6924 3280 8772 1641
2789 1641 -7852 -6162 4398 8568 286 -8277 -5151 5402 7979 -788 -8517 -3892 6159 7558
2803 7558 -2046 -8522 -2491 6969 6664 -3276 -8375 -1389 7738 5681 -4408 -8349 -235 8094 4495
2818 4495 -5565 -7901 1269 8367 3897 -6321 -7164 2155 7572 2449 -6865 -6153 3518 8131 1190
2833 1190 -7516 -5440 4379 7909 -76 -8039 -4541 5466 7414 -1187 -8181 -3396 6083 6923 -2439
2848 -2439 -8124 -2280 7028 5933 -3750 -8022 -1013 7606 5579 -4909 -7466 658 7689 4396 -5603
2863 -5603 -7161 1315 7867 2959 -6223 -6898 2971 7796 2031 -6897 -5802 3606 7726 522 -7507
2878 -7507 -4892 4495 7491 -323 -7709 -4053 5451 6914 -1552 -7852 -2784 6076 6265 -2657 -7601
2893 -7601 -1558 6611 5397 -3987 -7307 -466 7047 4436 -4646 -7098 817 7629 3535 -5443 -6266
2908 -6266 1790 7726 2593 -6114 -6060 2779 7652 1587 -6642 -5341 3808 7258 417 -7022 -4373
2923 -4373 4475 7066 -691 -7373 -3370 5424 6259 -1694 -7296 -2195 6053 5662 -2890 -7125 -1261
2938 -1261 6462 4992 -3848 -7111 -399 6949 4151 -4774 -6922 906 7224 3046 -5496 -6283 1865
2953 1865 7142 2114 -6021 -5400 2982 6972 1053 -6566 -4702 3799 6710 -25 -6914 -3814 4623
2968 4623 6128 -1230 -7125 -2833 5407 5961 -2149 -7215 -2060 5872 4974 -2971 -7120 -986 6284
2983 6284 4668 -3655 -6790 104 6658 3660 -4623 -6242 1222 6444 2755 -5669 -5696 2429 7433
2998 7433 1589 -5760 -4665 3118 6740 558 -6053 -4359 3686 6309 -235 -6667 -3530 4742 5849
3013 5849 -1213 -6655 -2381 5215 5277 -2353 -6738 -1593 5616 4586 -3167 -6475 -563 6167 3834
3028 3834 -3956 -6235 259 6457 3227 -4652 -5890 1454 6651 2473 -5145 -5235 2295 6379 1542
3043 1542 -5806 -4546 2973 6237 382 -6023 -3735 3998 6075 -646 -6295 -2981 4715 5514 -1517
3058 -1517 -6519 -2210 5208 4986 -2426 -6462 -1078 5387 4214 -3366 -6120 38 5871 3081 -3938
3073 -3938 -5930 646 6326 2645 -4529 -5199 1510 6341 1947 -5112 -4930 2464 6185 1062 -5466
3088 -5466 -4201 3354 6009 154 -5890 -3444 3922 5601 -698 -6009 -2661 4581 5265 -1596 -6196
3103 -6196 -1877 5126 4700 -2350 -5832 -824 5604 3883 -3266 -5890 122 5819 3158 -3897 -5351
3118 -5351 899 6047 2490 -4633 -5029 1780 5829 1619 -4935 -4383 2572 5852 783 -5422 -3716
3133 -3716 3248 5497 -151 -5738 -3107 3882 5285 -1116 -5753 -2247 4275 4753 -1742 -5797 -1434
3148 -1434 4945 4009 -2506 -5568 -548 5399 3477 -3513 -5415 264 5600 2806 -3811 -4982 979
3163 979 5666 2094 -4285 -4407 1784 5662 1336 -4980 -4034 2539 5486 301 -5168 -3342 3279 5015
3179 5015 -492 -5377 -2628 3922 4924 -1265 -5507 -1888 4338 4275 -2021 -5523 -1158 4968 3773
3194 3773 -2815 -5200 -237 5113 3088 -3304 -4914 358 5354 2215 -3878 -4628 1326 5265 1634
3209 1634 -4368 -4170 2089 5287 850 -4863 -3560 2717 5111 -62 -4996 -2827 3328 4935 -727
3224 -727 -5201 -2252 3921 4271 -1453 -5021 -1397 4429 3930 -2032 -5137 -769 4830 3352 -2863 -5009
3240 -5009 141 5073 2813 -3377 -4565 880 5142 2074 -3758 -4316 1628 5112 1173 -4444 -3665
3255 -3665 2157 4935 497 -4685 -3075 2862 4742 -259 -4746 -2512 3222 4630 -981 -5026 -1631
3270 -1631 3910 4105 -1711 -5047 -1075 4199 3667 -2371 -4812 -349 4798 2942 -3039 -4469 409
3285 409 4781 2498 -3423 -4242 1179 4916 1616 -3729 -3725 1844 4912 960 -4268 -3231 2471 4568
3301 4568 193 -4648 -2836 2980 4446 -735 -4735 -2131 3594 4080 -1225 -4747 -1491 3984 3565
3316 3565 -1851 -4768 -945 4178 3220 -2304 -4403 -31 4611 2518 -3050 -4303 666 4532 1883
3331 1883 -3539 -3828 1353 4497 1320 -3919 -3284 1960 4459 597 -4092 -2904 2644 4405 -27
3346 -27 -4427 -2354 3123 3960 -658 -4431 -1748 3517 3571 -1361 -4530 -1079 3806 3314 -1949 -4295
3362 -4295 -424 4116 2854 -2653 -4229 58 4203 2290 -3105 -3953 831 4354 1726 -3531 -3477 1472
3378 1472 4288 1112 -3787 -3037 2091 4460 378 -4008 -2532 2732 3956 -385 -4146 -2022 3058
3393 3058 3657 -886 -4300 -1498 3561 3368 -1484 -4276 -843 3769 2896 -1942 -4112 -229 3965 2505
3409 2505 -2605 -3841 427 4240 1956 -3129 -3544 952 4204 961 -3387 -3277 1580 4151 655
3424 655 -3765 -2724 2285 4011 119 -4029 -2256 2816 3859 -467 -3901 -1516 3242 3308 -1022 -4140
3440 -4140 -1125 3512 3064 -1742 -4024 -503 3590 2771 -2307 -3836 63 3904 2121 -2711 -3556 572
3456 572 3982 1432 -3191 -3160 1345 3960 947 -3310 -2811 1786 3945 603 -3586 -2441 2360 3555
3472 3555 -22 -3871 -1849 2689 3409 -1002 -3847 -1262 2989 3138 -1347 -3797 -799 3331 2691 -1726
3488 -1726 -3787 -371 3471 2232 -2285 -3616 297 3581 1753 -2788 -3339 852 3737 1264 -3051
3503 -3051 -3140 1367 3648 751 -3328 -2530 1844 3575 208 -3575 -2213 2326 3443 -281 -3588 -1684
3519 -1684 2752 3327 -931 -3685 -1002 3153 2867 -1263 -3701 -696 3203 2502 -1850 -3488 -251 3274
3535 3274 2034 -2225 -3145 349 3615 1632 -2747 -3242 947 3405 1070 -2872 -2738 1415 3590 564
3551 564 -3048 -2352 1849 3572 146 -3371 -1900 2307 3192 -524 -3604 -1615 2596 2882 -742 -3379
3567 -3379 -946 2820 2553 -1369 -3408 -595 2986 2239 -1848 -3320 152 3333 1858 -2406 -2848 535
3583 535 3345 1357 -2576 -2947 942 3265 667 -3017 -2634 1192 3306 654 -3189 -2187 1468 3320
3599 3320 -332 -3024 -1786 2101 2938 -752 -3083 -1222 2603 2645 -1055 -3220 -696 2932 2640 -1456
3615 -1456 -3178 -190 3216 2125 -1920 -3027 216 3244 1573 -2147 -2781 776 3385 1077 -2692
3630 -2692 -2693 1145 3088 627 -2818 -2284 1576 3170 141 -3095 -2004 1939 2970 41 -3205 -1417
3646 -1417 2197 2790 -509 -3126 -997 2463 2354 -1220 -3122 -461 2746 2193 -1519 -2937 -175 2961
3662 2961 2334 -1673 -2813 336 3080 1365 -2549 -2296 578 2789 1149 -2392 -1959 1479 3081 519
3678 519 -2829 -2144 1641 2919 3 -2843 -1473 1903 2507 -360 -3014 -1234 2263 2488 -849 -2850
3694 -2850 -930 2377 2105 -1405 -2849 -425 2842 1883 -1657 -2958 -135 2739 1499 -2013 -2717 551
3710 551 2997 1239 -2266 -2354 854 2789 835 -2556 -2131 1316 2845 345 -2729 -1611 1899 2389
3726 2389 -207 -2804 -1531 1775 2447 -715 -2631 -917 2284 2417 -993 -2765 -657 2437 1961 -1397
3742 -1397 -2777 -207 2512 1700 -1762 -2618 460 2796 1309 -1949 -2563 604 2978 1104 -2247 -2229
3758 -2229 1119 2619 608 -2508 -1971 1393 2681 44 -2674 -1692 1725 2510 -309 -2733 -1231 1779
3774 1779 2284 -686 -2755 -882 2191 2090 -1028 -2577 -425 2524 1754 -1391 -2514 -4 2604 1483
3790 1483 -1566 -2453 341 2652 1094 -2058 -2132 666 2657 700 -2066 -2113 1156 2851 302 -2372
3806 -2372 -1649 1333 2487 -108 -2093 -1056 1416 2710 -510 -2449 -1061 2190 2161 -682 -2525 -617
3822 -617 2272 1926 -1166 -2626 -309 2258 1658 -1608 -2495 45 2564 1327 -1807 -2372 482 2516
3838 2516 951 -1835 -2095 790 2507 638 -2093 -1965 1247 2409 167 -2405 -1639 1795 2432 -48
3854 -48 -2321 -1288 1663 1966 -333 -2584 -912 1753 2217 -843 -2555 -525 2177 1693 -1443 -2501
3870 -2501 -91 2443 1335 -1281 -2412 30 2326 973 -1963 -2333 540 2623 813 -1994 -1975 888
3886 888 2353 411 -2218 -1626 1193 2353 270 -2324 -1294 1578 2154 -216 -2327 -1158 1815 2024
3902 2024 -405 -2263 -638 1944 1803 -976 -2335 -337 2097 1634 -1309 -2437 -197 2243 1296 -1506
3918 -1506 -2209 323 2187 1015 -1623 -1967 617 2406 530 -1845 -1740 927 2321 353 -2166 -1419
3934 -1419 1166 2104 -1 -2118 -1200 1631 2189 -476 -2278 -1117 1584 1853 -933 -2732 -693 1623
3950 1623 1659 -1207 -2619 -228 2433 1351 -1409 -2013 28 2171 1147 -1467 -2086 270 2146 1024
3966 1024 -1772 -1760 665 2255 380 -1970 -1557 1020 2041 157 -2069 -1272 1302 2100 -71 -2162
3982 -2162 -1094 1402 1898 -532 -2103 -742 1806 1723 -678 -2223 -387 1833 1606 -1118 -2169 -165
3998 -165 2004 1517 -1331 -1939 238 2117 1134 -1650 -1923 494 2103 607 -1560 -1670 964 2064
4014 2064 442 -2008 -1470 1152 2047 125 -1999 -1271 1207 1984 -367 -2028 -848 1588 1930 -615
4030 -615 -2151 -518 1803 1618 -1015 -2091 -294 2023 1585 -1053 -2127 35 1990 1096 -1303 -1919
4046 -1919 241 2121 803 -1570 -1694 781 2029 577 -1695 -1573 731 1917 300 -1923 -1265 1029
4062 1029 2077 -69 -1931 -1115 1302 1822 -291 -1942 -972 1612 1658 -705 -2005 -659 1851 1452
4078 1452 -933 -1970 -279 1680 1119 -1212 -1860 161 1911 1196 -1378 -1593 487 1921 681 -1671
4094 -1671 -1564 625 2172 483 -1643 -1517 774 1740 80 -1877 -1195 1267 1875 -103 -1940 -1000
4110 -1000 1528 1775 -485 -1817 -722 1646 1573 -685 -1791 -350 1706 1186 -957 -2033 -163 1814
4126 1814 1145 -1309 -1806 211 1855 931 -1456 -1642 374 1993 565 -1497 -1373 644 1823 276
4142 276 -1604 -1152 937 1792 -39 -1896 -1093 1208 1692 -155 -1767 -739 1415 1501 -545 -1810 -551
4159 -551 1678 1254 -895 -1715 -348 1655 1190 -1082 -1952 7 1674 1042 -1132 -1692 338 1805 762
4176 762 -1405 -1632 617 1724 486 -1500 -1300 849 1862 185 -1614 -1133 1149 1775 12 -1763
4192 -1763 -1031 1305 1718 -347 -2027 -724 1373 1371 -545 -1960 -366 1733 1304 -907 -1894 -347 1605
4209 1605 1038 -1116 -1827 144 1723 790 -1205 -1470 441 1588 742 -1499 -1393 636 1868 296
4225 296 -1525 -1318 756 1736 36 -1704 -1064 1140 1624 -211 -1895 -811 1134 1491 -272 -1616
4241 -1616 -443 1385 1306 -921 -1759 -237 1559 1049 -1028 -1743 -4 1732 1053 -1103 -1611 239 1855
4258 1855 734 -1458 -1412 463 1708 504 -1440 -1210 869 1682 143 -1543 -1035 938 1673 -28
4274 -28 -1659 -801 1192 1487 -374 -1564 -586 1339 1334 -561 -1616 -465 1408 1143 -642 -1618 -53
4291 -53 1595 1007 -904 -1719 157 1652 934 -1225 -1675 218 1716 588 -1466 -1202 455 1621 284
4308 284 -1538 -1313 808 1593 46 -1417 -1018 1051 1604 -193 -1671 -697 1223 1496 -323 -1439 -399
4325 -399 1235 1211 -669 -1733 -342 1415 1169 -822 -1753 -69 1673 813 -1091 -1570 139 1629 814
4342 814 -1170 -1300 325 1561 508 -1379 -1184 584 1787 328 -1479 -1073 898 1501 -28 -1593
4358 -1593 -919 1109 1417 -282 -1584 -592 1284 1257 -591 -1494 -527 1387 1227 -590 -1610 -34 1548
4375 1548 804 -854 -1464 -19 1591 891 -1145 -1470 324 1445 610 -1338 -1436 477 1635 400 -1386
4392 -1386 -1040 854 1629 115 -1471 -969 898 1458 -147 -1556 -860 1212 1265 -105 -1564 -627 1171
4409 1171 1081 -646 -1592 -298 1358 1169 -803 -1451 -64 1548 828 -1013 -1515 105 1453 900 -1238
4426 -1238 -1582 486 1320 354 -1236 -1104 519 1621 191 -1344 -941 645 1492 79 -1544 -935 910
4443 910 1510 -137 -1553 -752 1209 1232 -374 -1551 -646 1068 1145 -358 -1551 -379 1240 1002 -693
4460 -693 -1419 -8 1409 836 -931 -1296 49 1496 509 -1051 -1281 485 1639 468 -1208 -1131 714
4477 714 1490 281 -1477 -874 619 1305 -12 -1636 -803 882 1359 -223 -1380 -597 1106 1318 -542
4494 -542 -1430 -494 1237 1077 -671 -1345 -327 1343 796 -877 -1307 77 1412 821 -930 -1277 293
4511 293 1402 575 -1209 -1098 427 1497 284 -1163 -969 650 1351 177 -1369 -1060 770 1326 37
4528 37 -1399 -566 982 1407 -373 -1374 -446 1197 1118 -673 -1333 -88 1194 957 -692 -1397 -142
4545 -142 1414 615 -1010 -1542 81 1257 681 -1090 -1260 341 1409 364 -1195 -1144 684 1499 229
4562 229 -1258 -900 623 1397 81 -1423 -847 901 1094 -225 -1383 -464 796 954 -480 -1481 -795
4579 -795 921 557 -531 -1307 -514 1097 543 -748 -1114 -65 1057 657 -882 -1140 80 1257 694
4596 694 -895 -1183 357 1392 409 -1296 -1117 560 1531 42 -1148 -951 744 1247 22 -1298 -558
4613 -558 833 1374 -178 -1297 -402 988 1225 -444 -1221 -190 1052 999 -678 -1377 -272 1347 720
4630 720 -640 -1445 65 1417 688 -1026 -1263 230 1231 556 -930 -1217 495 1458 378 -1200 -962
4647 -962 672 1394 87 -1191 -1009 909 1341 -68 -1433 -679 920 1303 -237 -1397 -391 1034
4663 1034 924 -277 -1392 -239 1358 1302 -715 -1069 -318 1505 1133 -377 -1055 184 1185 792 -746
4680 -746 -1329 353 1428 484 -1388 -911 553 1213 176 -1275 -942 935 1251 -145 -1251 -821 773
4697 773 1227 -206 -1261 -588 1048 1112 -443 -1456 -127 1081 1086 -466 -1321 -297 1239 956 -586
4714 -586 -1208 -28 1324 867 -760 -1085 219 1380 487 -954 -1186 114 1387 258 -1107 -893 724
4731 724 1301 196 -1018 -901 840 1201 -166 -1268 -772 896 1129 -242 -1117 -555 763 1092 -468
4748 -468 -1233 -300 1084 863 -556 -1135 -336 1153 720 -714 -1118 133 1192 677 -820 -1006 251
4765 251 1311 518 -968 -926 416 1217 271 -1241 -947 364 1231 198 -1370 -580 771 1303 -60
4782 -60 -1358 -654 977 1025 -237 -1349 -530 1013 1082 -509 -1131 -116 1259 799 -574 -1371 -74 1193
4800 1193 780 -787 -1067 22 1246 599 -1046 -1092 290 1197 345 -900 -993 448 971 53 -1473 -1187
4818 -1187 837 1479 -130 -1208 -1239 533 1105 -243 -939 -502 773 1013 -508 -1198 -343 1069 929
4835 929 -426 -1081 -69 1262 712 -818 -1262 99 1278 609 -765 -1192 231 1418 552 -1048 -951
4852 -951 397 1368 274 -1189 -964 518 1153 98 -892 -708 747 1191 13 -1155 -670 911 953
4869 953 -210 -1205 -610 849 929 -428 -1341 -176 967 801 -540 -1351 -267 1168 709 -695 -1093
4886 -1093 -59 1153 698 -863 -994 115 1159 386 -1092 -961 368 1284 374 -974 -888 591 1241
4903 1241 155 -1049 -860 711 1045 -31 -1127 -356 770 1167 -200 -1183 -373 984 872 -196 -1160
4920 -1160 -198 1054 707 -757 -1151 -24 1184 781 -713 -1197 49 1257 522 -682 -961 324 1254
4937 1254 353 -884 -874 372 1117 243 -1151 -871 496 1155 -153 -956 -738 671 1250 -59 -1129
4954 -1129 -478 767 1124 -404 -1256 -320 820 811 -415 -1274 -316 963 753 -437 -1122 -77 1051 698
4972 698 -774 -1014 172 1168 365 -949 -926 335 1260 322 -1060 -957 410 1292 139 -886 -800 642
4990 642 1223 237 -1020 -666 642 941 25 -1100 -584 876 962 -299 -1243 -228 1007 870 -470 -1064
5008 -1064 -126 1029 759 -475 -1095 67 1000 508 -799 -1043 102 1062 526 -922 -847 343 1147 235
5026 235 -936 -784 518 1210 126 -1065 -914 548 1002 -280 -1116 -360 841 1046 -185 -1093 -390
5043 -390 809 909 -472 -1090 -258 916 842 -335 -1086 -13 960 742 -697 -1159 49 1141 505 -734
5061 -734 -940 162 1154 470 -950 -948 365 1067 432 -926 -1015 337 1204 56 -972 -700 761 1004
5079 1004 -195 -1130 -597 717 897 -303 -1012 -404 864 965 -450 -1126 -168 821 781 -559 -1292 0
5097 0 939 735 -692 -905 -12 1019 434 -829 -957 306 1143 445 -790 -899 486 1047 128 -1108
5115 -1108 -871 369 1030 -51 -905 -674 671 947 -219 -1073 -649 805 857 -305 -916 -247 971 874
5133 874 -379 -949 -295 1005 646 -457 -1095 -97 1028 550 -744 -1003 222 943 423 -727 -933 342
5151 342 1164 251 -965 -859 372 1160 175 -946 -676 582 1182 0 -925 -609 781 1024 -50 -926
5169 -926 -324 836 902 -137 -969 -364 756 912 -359 -1075 -248 833 660 -655 -959 -110 1060 551
5187 551 -494 -989 18 1115 549 -791 -853 120 915 354 -921 -941 541 1326 91 -996 -687 627
5205 627 841 -132 -1069 -478 728 957 -174 -1025 -484 822 841 -235 -985 -385 867 590 -413 -1131
5223 -1131 -77 929 674 -427 -924 35 955 354 -708 -989 113 1003 439 -694 -776 348 1038 294
5241 294 -765 -731 568 955 7 -1131 -602 594 950 -78 -1174 -455 779 873 -492 -1108 -292 834
5259 834 842 -179 -949 -271 1073 677 -567 -826 -78 1104 622 -640 -1025 132 920 339 -658 -844 294
5278 294 1078 236 -1074 -656 302 961 79 -869 -750 423 1033 -32 -1027 -625 583 980 -59 -1116
5296 -1116 -514 905 895 -288 -996 -453 752 802 -283 -1182 -127 942 772 -512 -921 101 891 513
5314 513 -762 -979 191 1148 378 -706 -746 309 980 342 -840 -721 377 872 109 -1030 -774 457
5332 457 1154 162 -1064 -397 715 775 -54 -919 -490 679 897 -305 -931 -364 898 654 -354 -888
5350 -888 -26 971 742 -554 -1100 51 815 509 -535 -979 20 843 331 -616 -959 336 997 268 -889
5369 -889 -637 463 842 87 -882 -637 560 963 -25 -791 -458 685 815 -285 -1059 -190 785 618 -347
5388 -347 -1014 -158 847 659 -401 -868 -153 794 577 -385 -705 112 981 462 -679 -765 227 1019 348
5407 348 -747 -793 391 1031 172 -707 -579 395 971 222 -907 -414 587 782 -56 -891 -347 721 998
5426 998 -195 -980 -454 679 730 -346 -1018 -412 733 651 -553 -755 -242 785 443 -537 -934 -66 814
5445 814 612 -625 -788 241 816 652 -663 -672 293 1000 169 -954 -778 499 867 48 -883 -566 257
5464 257 866 -153 -1064 -419 651 666 -118 -819 -270 610 794 -411 -997 -329 847 672 -410 -922 134
5483 134 885 564 -511 -835 169 947 221 -744 -767 257 993 388 -644 -849 412 735 190 -849
5501 -849 -555 574 979 18 -864 -511 533 798 -72 -860 -402 715 674 -255 -765 -242 762 818 -331
5520 -331 -857 -110 966 701 -478 -1038 -70 860 458 -511 -695 159 913 664 -617 -833 301 827 186
5539 186 -666 -570 327 795 53 -809 -590 455 806 65 -780 -491 712 798 -257 -788 -278 491 706 -321
5559 -321 -849 -35 808 696 -479 -943 14 788 631 -419 -695 -56 874 506 -450 -933 216 1001 321
5578 321 -718 -772 110 889 229 -724 -678 402 623 -67 -968 -635 547 682 -88 -797 -476 443 806 -279
5598 -279 -917 -370 716 839 -290 -1028 -191 665 711 -413 -941 -118 822 511 -522 -858 14 830 420
5617 420 -501 -782 197 883 180 -727 -830 368 803 162 -770 -669 342 689 36 -836 -500 347 869
5636 869 17 -694 -334 488 721 -148 -860 -237 647 675 -211 -630 -182 922 572 -426 -702 -90 867 591
5656 591 -542 -903 -37 747 389 -588 -723 163 792 274 -463 -706 314 868 103 -820 -550 289 741
5675 741 -116 -870 -428 583 869 -188 -729 -361 684 630 -268 -905 -304 653 689 -250 -795 -194 666 668
5695 668 -443 -810 59 744 442 -463 -752 -22 745 422 -504 -692 366 920 236 -776 -519 431 749
5714 749 266 -875 -537 373 731 -166 -820 -399 509 744 28 -802 -281 743 715 -303 -763 -176 706
5733 706 560 -304 -849 -146 725 665 -408 -736 71 794 403 -591 -748 172 750 320 -617 -824 150 674
5753 674 249 -714 -747 311 859 52 -661 -531 445 722 -180 -822 -348 611 812 -76 -785 -355 598 728
5773 728 -163 -721 -254 689 600 -472 -862 -126 784 384 -297 -731 172 605 311 -655 -620 -23 822 219
5793 219 -655 -506 263 731 137 -506 -475 487 897 9 -746 -476 314 744 -52 -693 -394 539 752 -162
5813 -162 -731 -382 612 589 -302 -749 -66 621 636 -330 -780 -216 592 384 -590 -771 65 736 304 -361 -691
5834 -691 140 772 205 -578 -526 429 737 152 -654 -522 321 748 123 -803 -441 669 504 -371 -925 -405
5854 -405 534 659 -256 -754 -320 640 654 -301 -625 -52 756 527 -455 -597 93 732 354 -426 -584 -36
5874 -36 823 278 -587 -689 116 791 284 -553 -574 335 788 164 -736 -626 400 577 -152 -674 -414 574
5894 574 634 59 -723 -253 555 676 -153 -681 -224 676 592 -227 -703 -64 503 588 -486 -839 30 730 332
5915 332 -454 -578 247 773 251 -502 -606 219 575 255 -722 -550 488 674 108 -488 -484 391 653 35
5935 35 -691 -208 555 585 21 -821 -178 547 578 -187 -804 -256 572 586 -332 -872 -44 684 357 -326 -494
5956 -494 -8 614 324 -533 -597 140 611 334 -631 -762 203 599 100 -463 -592 538 667 102 -707 -396
5976 -396 349 741 60 -585 -456 633 606 -218 -646 -439 721 567 -260 -890 -364 459 524 -373 -693 -53
5996 -53 671 389 -384 -717 51 732 440 -540 -593 21 565 220 -409 -628 254 664 62 -636 -580 297 781
6017 781 147 -650 -613 449 702 -40 -836 -511 510 609 -156 -736 -241 453 694 -132 -737 -13 470 544
6037 544 -300 -784 -2 636 405 -398 -646 4 838 300 -448 -547 166 695 121 -598 -522 124 710 164 -835
6058 -835 -653 419 641 14 -547 -267 390 636 140 -621 -295 534 736 -45 -697 -193 638 626 -147 -680
6078 -680 -168 609 508 -441 -816 -225 688 397 -590 -645 128 436 294 -555 -550 314 867 66 -661 -399 168
6099 168 749 164 -553 -499 337 670 22 -790 -320 382 747 -48 -567 -497 578 476 -212 -833 -279 632
6119 632 566 -147 -611 -270 684 405 -428 -609 -44 591 244 -404 -695 187 555 338 -580 -645 338 719 279
6140 279 -626 -589 257 631 -2 -644 -288 233 640 -5 -725 -439 568 838 -222 -607 -230 626 694 -161
6160 -161 -728 -158 456 582 -244 -566 -155 669 451 -544 -650 58 740 425 -397 -603 251 682 483 -536
6180 -536 -778 336 760 183 -553 -623 340 808 117 -709 -379 196 574 148 -704 -396 427 711 -82 -538
6200 -538 -307 439 637 -309 -647 -258 401 546 -240 -661 -51 740 406 -221 -802 -90 699 286 -485 -603
6220 -603 69 635 194 -510 -387 233 597 312 -551 -323 312 807 -43 -569 -455 404 557 -178 -583 -460
6240 -460 407 544 -17 -772 -290 509 686 -159 -654 -109 582 344 -406 -597 35 489 434 -398 -674 31
6260 31 709 373 -541 -599 99 567 282 -477 -427 173 539 261 -516 -349 444 609 148 -775 -388 598 489
6281 489 51 -672 -410 243 657 -209 -632 -204 630 580 -185 -549 -130 684 481 -472 -630 -81 610 290
6301 290 -444 -469 -38 472 358 -409 -571 100 531 333 -471 -576 165 696 135 -592 -406 400 638 -103
6321 -103 -718 -462 451 530 -156 -661 -340 460 511 -253 -637 -96 504 485 -217 -704 -206 488 443 -199 -635
6342 -635 14 576 197 -538 -476 -3 658 320 -499 -444 134 817 137 -456 -641 320 680 85 -695 -358 499
6363 499 456 -173 -707 -398 465 398 -162 -617 -294 570 649 -310 -591 -269 605 439 -236 -528 -112 635 394
6384 394 -327 -701 -29 758 302 -542 -541 85 640 286 -459 -430 219 757 375 -337 -579 410 518 126 -597
6405 -597 -537 377 564 96 -595 -426 494 716 -117 -615 -126 442 516 -273 -751 -309 575 512 -210 -535 -117
6426 -117 502 299 -289 -593 55 569 336 -353 -637 -36 558 238 -494 -575 225 636 128 -707 -439 271
6446 271 482 156 -650 -306 313 604 -52 -713 -359 239 596 -187 -490 -250 582 408 -375 -710 -170 565
6466 565 545 -277 -611 -45 624 566 -298 -680 36 696 189 -527 -555 59 555 179 -602 -544 253 780 312
6487 312 -603 -529 363 621 -15 -616 -277 448 516 -67 -675 -314 477 585 -16 -652 -346 425 380 -202 -754
6508 -754 4 672 323 -367 -652 34 639 258 -348 -521 -163 752 287 -438 -669 214 467 131 -570 -443
6528 -443 430 717 128 -403 -528 336 452 -54 -579 -343 371 355 -6 -708 -210 425 593 -183 -374 -342 588
6549 588 499 -311 -551 -19 595 546 -309 -572 -133 601 348 -205 -636 37 680 298 -318 -516 170 636 237
6570 237 -492 -456 288 662 28 -688 -446 322 600 -145 -578 -571 335 586 -82 -696 -251 423 568 -226 -584
6591 -584 -154 546 500 -229 -516 -212 625 360 -378 -582 73 527 278 -373 -539 -33 742 212 -378 -721
6611 -721 243 550 157 -590 -317 258 485 120 -759 -481 430 636 -113 -479 -336 413 561 -8 -393 165
6631 165 663 653 -249 -564 -275 436 143 -471 -463 -246 404 403 -455 -477 -33 503 460 -258 -681 -30 887 55
6653 55 -352 -322 406 129 759 -495 -328 224 459 -234 -428 -262 468 411 91 -394 -352 452 432 -103 -604
6674 -604 -154 456 503 -278 -667 -48 458 338 -202 -594 -120 471 516 -406 -439 -173 808 67 -323 -699 188
6695 188 359 370 -326 -653 46 856 321 -815 -626 -125 464 -182 -72 -337 480 298 -236 -472 -123 305
6715 305 597 -281 -869 -123 448 524 -122 -613 -45 601 455 -67 -247 -469 473 -69 -181 -573 6 713
6735 713 134 -367 -682 55 549 89 -470 -556 262 615 318 -523 -486 243 585 170 -586 -373 215 371 -187
6756 -187 -662 -204 -140 719 1 -605 -291 514 323 -98 -839 57 478 341 -499 -709 -141 611 453 -261
6776 -261 -405 162 734 295 -287 -376 161 711 430 -498 -429 236 599 117 -621 -334 363 527 -46 -449 -138
6797 -138 264 607 -180 -516 -98 429 615 -214 -471 -213 606 521 -45 -373 -68 490 484 -329 -524 8 575
6818 575 242 -296 -440 117 663 251 -391 -554 177 457 340 -443 -467 234 631 44 -458 -327 267 664
6838 664 -45 -731 -360 404 510 -33 -531 -374 465 687 -292 -550 -46 592 297 -227 -537 -97 427 442
6858 442 -278 -603 -131 704 312 -348 -465 49 609 154 -355 -376 115 590 251 -519 -311 263 610 -54
6878 -54 -356 -459 427 439 -111 -373 -452 206 446 -109 -607 -266 440 547 22 -628 -126 573 485 -208 -329
6899 -329 191 577 398 -402 -494 -19 551 225 -367 -449 46 538 78 -490 -345 179 510 175 -482 -496 451
6920 451 492 -9 -651 -326 340 526 38 -635 -357 324 480 43 -567 -138 318 619 -58 -400 -173 239
6940 239 443 -143 -441 -144 531 264 -292 -624 -86 621 341 -154 -453 196 473 151 -457 -719 124 618
6960 618 -179 -568 -316 99 413 31 -569 -367 340 484 27 -561 -327 282 668 54 -484 -282 275 551
6980 551 -170 -310 -235 438 316 -62 -450 -140 466 273 -527 -424 -82 483 199 -305 -343 129 411 80 -449
7001 -449 -355 51 650 260 -527 -468 362 632 -60 -503 -320 179 525 69 -509 -244 271 518 -282 -611 -128
7022 -128 503 526 -136 -568 -172 451 459 -375 -500 -36 497 414 -239 -422 -13 485 73 -301 -370 95 474 373
7044 373 -475 -461 181 531 239 -439 -349 420 514 16 -636 -136 261 529 -114 -470 -28 247 345 52 -480
7065 -480 -297 388 313 -519 -702 -234 412 123 -330 -743 205 582 252 3 -214 355 441 146 -17 58 -84
7086 -84 413 430 -365 -483 234 488 3 -648 -350 559 516 20 -516 -278 95 461 -46 -658 -209 254 368
7107 368 -114 -454 -109 414 386 -96 -443 -125 320 281 -349 -588 -216 476 476 -380 -375 -11 537 299 -552 -477
7129 -477 93 583 42 -340 -318 243 345 -55 -448 -218 290 594 -30 -435 -209 287 415 -55 -377 -202
7149 -202 355 547 -141 -487 -286 372 477 -134 -516 -118 307 374 -298 -623 -69 612 332 -340 -421 6 558
7170 558 -33 -417 -374 163 596 243 -311 -499 245 532 132 -462 -307 297 613 -129 -611 -202 386 540
7190 540 -116 -543 -270 536 534 -133 -493 -123 408 429 -24 -451 156 534 422 -312 -579 235 565 379 -381
7211 -381 -435 65 560 145 -498 -369 205 443 136 -486 -454 296 568 39 -476 -262 103 436 120 -371 -404
7232 -404 293 478 -1 -556 -104 524 462 -144 -511 -241 467 134 -202 -495 -15 443 431 -357 -510 2 518
7253 518 388 -650 -542 107 761 83 -355 -728 351 692 232 -565 -500 49 498 -48 -412 -239 367 402
7273 402 72 -356 -268 324 313 22 -580 -44 280 445 -183 -597 267 454 590 -202 -336 94 200 707 42
7294 42 -251 -12 32 43 -556 -396 -328 264 -64 -262 -205 302 308 107 -444 -294 209 592 -97 -459 -304 34
7316 34 428 136 -447 -183 209 219 -8 -758 -346 860 1046 253 -512 -230 667 -110 -512 -445 -25 412 199
7337 199 -323 -671 222 442 312 -38 -157 338 418 -357 -347 -275 267 300 33 -355 -267 215 354 -36 -367 -162
7359 -162 161 444 -101 -514 -254 367 323 -217 -519 -221 353 497 -80 -598 -77 484 433 -288 -531 10 476
7380 476 384 -141 -491 142 318 333 -289 -415 155 442 195 -82 -466 354 1030 -230 -46 101 315 536
7400 536 -170 -530 -257 67 295 -35 -334 -238 335 308 -214 -431 -31 352 482 -355 -513 -149 794 416 -418
$$ [...]
8191B33
##END NTUPLES=NMR FID
##END=
