##TITLE=1H_SA_61_DTFA
 CDCl3, 8 sc, 
 24.08.2021
##JCAMPDX= 6.0         $$ Bruker NMR JCAMP-DX V2.0
##DATA TYPE= NMR FID
##DATA CLASS= NTUPLES
##ORIGIN= UXNMR, Bruker Analytische Messtechnik GmbH
##OWNER= root
$$ XWIN-NMR		Version 3.5
$$ Tue Aug 24 12:48:38 2021 Russian Standard Time (UT+4h)  she@DPX200
##.OBSERVE FREQUENCY= 200.131506
##.OBSERVE NUCLEUS= ^1H
##.DELAY= (6, 6)
##.ACQUISITION MODE= SIMULTANEOUS
##.ACQUISITION SCHEME= undefined
##.AVERAGES= 8
##.DIGITISER RES= 18
##SPECTROMETER/DATA SYSTEM= spect
##.PULSE SEQUENCE= zg30
##.SOLVENT NAME= D2O
##.SHIFT REFERENCE= (INTERNAL, D2O, 0, 15.7039)
##AUDIT TRAIL= $$ (NUMBER, WHEN, WHO, WHERE, WHAT)
$$ ##TITLE= Audit trail, XWIN-NMR		Version 3.5
$$ ##JCAMPDX= 5.01
$$ ##ORIGIN= Bruker BioSpin GmbH
$$ ##OWNER= she
$$ F:/spectra/data/she/nmr/H-F/1/audita.txt
$$ ##AUDIT TRAIL=  $$ (NUMBER, WHEN, WHO, WHERE, WHAT)
(   1,<2021-08-24 12:47:19.28 +0400>,<she>,<DPX200>,
      <created by zg, POWCHK disabled, PULCHK disabled
       configuration hash MD5:
       00 E9 B6 7A A2 85 ED C7 34 08 36 98 17 FE 4E 26
       data hash MD5: 16K
       58 42 E2 E8 17 B8 CE C0 72 B3 33 50 7B DC 62 C4>)
$$ ##END=
$$ 
$$ hash MD5
$$ 1C 05 47 80 92 31 88 66 97 77 68 49 15 AE 3E 50
##$RELAX= 
##$RELAX= 
##$RELAX= 
##$RELAX= 
##$RELAX= 
##$RELAX= 
$$ Bruker specific parameters
$$ --------------------------
##$DU= <F:/spectra>
##$EXPNO= 1
##$NAME= <H-F>
##$PROCNO= 1
##$TYPE= <nmr>
##$USER= <she>
##$AMP= (0..31)
100 100 100 100 100 100 100 100 100 100 100 100 100 100 100 100 100 100 
100 100 100 100 100 100 100 100 100 100 100 100 100 100 
##$AQSEQ= 0
##$AQ_mod= 1
##$AUNM= <au_zg>
##$AUTOPOS= <>
##$BF1= 200.13
##$BF2= 200.13
##$BF3= 200.13
##$BF4= 200.13
##$BF5= 200.13
##$BF6= 200.13
##$BF7= 200.13
##$BF8= 200.13
##$BYTORDA= 1
##$CFDGTYP= 0
##$CFRGTYP= 5
##$CHEMSTR= <none>
##$CNST= (0..31)
1 1 145 1 1 1 1 1 1 1 1 1 1 1 1 1 1 1 1 1 1 1 1 1 1 1 1 1 1 1 1 1 
##$CPDPRG= <>
##$CPDPRG1= <>
##$CPDPRG2= <>
##$CPDPRG3= <>
##$CPDPRG4= <mlev>
##$CPDPRG5= <mlev>
##$CPDPRG6= <mlev>
##$CPDPRG7= <mlev>
##$CPDPRG8= <mlev>
##$CPDPRGB= <>
##$CPDPRGT= <>
##$D= (0..31)
0 1.2 0 0 0 0 0 0 0 0.06 0 0.03 0 0 0 0 0.0002 0 0 0 0 0 0 0 0 0 0 0 0 
0 0 0 
##$DATE= 1629794838
##$DBL= (0..7)
120 120 120 120 120 120 120 120 
##$DBP= (0..7)
150 150 150 150 150 150 150 150 
##$DBP07= 0
##$DBPNAM0= <>
##$DBPNAM1= <>
##$DBPNAM2= <>
##$DBPNAM3= <>
##$DBPNAM4= <>
##$DBPNAM5= <>
##$DBPNAM6= <>
##$DBPNAM7= <>
##$DBPOAL= (0..7)
0.5 0.5 0.5 0.5 0.5 0.5 0.5 0.5 
##$DBPOFFS= (0..7)
0 0 0 0 0 0 0 0 
##$DE= 6
##$DECBNUC= <off>
##$DECIM= 32
##$DECNUC= <off>
##$DECSTAT= 4
##$DIGMOD= 1
##$DIGTYP= 9
##$DL= (0..7)
0 120 120 120 120 120 120 120 
##$DP= (0..7)
150 150 150 150 150 150 150 150 
##$DP07= 0
##$DPNAME0= <>
##$DPNAME1= <>
##$DPNAME2= <>
##$DPNAME3= <>
##$DPNAME4= <>
##$DPNAME5= <>
##$DPNAME6= <>
##$DPNAME7= <>
##$DPOAL= (0..7)
0.5 0.5 0.5 0.5 0.5 0.5 0.5 0.5 
##$DPOFFS= (0..7)
0 0 0 0 0 0 0 0 
##$DQDMODE= 0
##$DR= 18
##$DS= 0
##$DSLIST= <SSSSSSSSSSSSSSS>
$$ [...]
##$SUBNAM2= <"">
##$SUBNAM3= <"">
##$SUBNAM4= <"">
##$SUBNAM5= <"">
##$SUBNAM6= <"">
##$SUBNAM7= <"">
##$SUBNAM8= <"">
##$SUBNAM9= <"">
##$SW= 20.0188882624521
##$SWIBOX= (0..15)
0 0 2 0 0 0 0 0 0 0 0 0 0 0 0 0 
##$SW_h= 4006.41025641026
##$TD= 16384
##$TD0= 1
##$TE= 0
##$TE2= 300
##$TE3= 300
##$TEG= 300
##$TL= (0..7)
0 120 120 120 120 120 120 120 
##$TP= (0..7)
150 150 150 150 150 150 150 150 
##$TP07= 0
##$TPNAME0= <>
##$TPNAME1= <>
##$TPNAME2= <>
##$TPNAME3= <>
##$TPNAME4= <>
##$TPNAME5= <>
##$TPNAME6= <>
##$TPNAME7= <>
##$TPOAL= (0..7)
0.5 0.5 0.5 0.5 0.5 0.5 0.5 0.5 
##$TPOFFS= (0..7)
0 0 0 0 0 0 0 0 
##$TUNHIN= 0
##$TUNHOUT= 0
##$TUNXOUT= 0
##$USERA1= <user>
##$USERA2= <user>
##$USERA3= <user>
##$USERA4= <user>
##$USERA5= <user>
##$V9= 5
##$VALIST= <valist>
##$VCLIST= <CCCCCCCCCCCCCCC>
##$VD= 0
##$VDLIST= <DDDDDDDDDDDDDDD>
##$VPLIST= <PPPPPPPPPPPPPPP>
##$VTLIST= <TTTTTTTTTTTTTTT>
##$WBST= 1024
##$WBSW= 4
##$XGAIN= (0..3)
0 0 0 0 
##$XL= 0
##$YL= 0
##$YMAX_a= 28188
##$YMIN_a= -18519
##$ZGOPTNS= <>
##$ZL1= 120
##$ZL2= 120
##$ZL3= 120
##$ZL4= 120
##$ABSF1= 10
##$ABSF2= 0
##$ABSG= 5
##$ABSL= 3
##$ALPHA= 0
##$AQORDER= 0
##$ASSFAC= 0
##$ASSFACI= 0
##$ASSFACX= 0
##$ASSWID= 0
##$AUNMP= <proc_1d>
##$AZFE= 0.1
##$AZFW= 0.1
##$BCFW= 1
##$BC_mod= 2
##$BYTORDP= 1
##$COROFFS= 0
##$CY= 11.3945322036743
##$DATMOD= 1
##$DC= 2
##$DFILT= <>
##$DTYPP= 0
##$F1P= 2.36226072786647
##$F2P= -0.459571619588291
##$FCOR= 0.5
##$FTSIZE= 0
##$FT_mod= 4
##$GAMMA= 1
##$GB= 0.15
##$INTBC= 1
##$INTSCL= 1
##$ISEN= 128
##$LB= 0.24
##$LEV0= 0
##$LPBIN= 0
##$MAXI= 10000
##$MC2= 0
##$MEAN= 0
##$ME_mod= 0
##$MI= 1.114404
##$NCOEF= 0
##$NC_proc= 0
##$NLEV= 6
##$NOISF1= 3.799351
##$NOISF2= 2.8
##$NSP= 1
##$NTH_PI= 0
##$NZP= 0
##$OFFSET= 15.70392
##$PC= 1
##$PHC0= -13356.49
##$PHC1= 17.601
##$PH_mod= 1
##$PKNL= yes
##$PPARMOD= 0
##$PSCAL= 0
##$PSIGN= 0
##$REVERSE= no
##$SF= 200.130013532006
##$SI= 16384
##$SIGF1= 3
##$SIGF2= 2
##$SINO= 400
##$SIOLD= 16384
##$SREGLST= <1H.CDCl3>
##$SSB= 0
##$STSI= 0
##$STSR= 0
##$SW_p= 3612.71676300578
##$SYMM= 0
##$S_DEV= 0
##$TDeff= 0
##$TDoff= 0
##$TI= <>
##$TILT= no
##$TM1= 0
##$TM2= 0
##$TOPLEV= 0
##$USERP1= <user>
##$USERP2= <user>
##$USERP3= <user>
##$USERP4= <user>
##$USERP5= <user>
##$WDW= 1
##$XDIM= 8192
##$YMAX_p= 0
##$YMIN_p= 0
$$ End of Bruker specific parameters
$$ ---------------------------------
##NTUPLES= NMR FID
##VAR_NAME=  TIME,          FID/REAL,        FID/IMAG
##SYMBOL=    X,             R,               I
##VAR_TYPE=  INDEPENDENT,   DEPENDENT,       DEPENDENT
##VAR_FORM=  AFFN,          ASDF,            ASDF
##VAR_DIM=   8192,          8192,            8192
##UNITS=     SECONDS,       ARBITRARY UNITS, ARBITRARY UNITS
##FACTOR=    0.0002496,     1,               1
##FIRST=     0,             0,               0
##LAST=      2.0444736,     0,               0
##MIN=       0,             -18519,          0
##MAX=       2.0444736,     28188,           0
$$ Real data points
##PAGE= N=1
##DATA TABLE= (X++(R..R)), XYDATA
0 0 0 0 0 0 0 0 0 0 0 0 0 0 0 0 0 0 0 0 0 8 -8 8 -8 8 -8 15 -16 16 -17 24 -24 30 -32 38 -41 48 -54 62 -69 77
40 77 -85 94 -103 116 -127 142 -156 172 -189 208 -229 253 -279 307 -339 377 -417 463 -519 583 -659
61 -659 756 -875 1028 -1236 1543 -2022 2911 -5135 28188 17034 -9334 3581 560 17379
75 17379 25518 1411 -18316 564 14455 11679 3560 -8376 -15187 5149 16086 -401 -12052
88 -12052 -7838 -1870 6747 2536 -10497 -13706 -2715 5472 -2428 -14031 -11972 -5983 981 666 -13897
103 -13897 -18519 -3572 5127 -1215 -9636 -12879 -8596 5153 9430 -7556 -14531 -1967 3087 4877
117 4877 3671 -10260 -10212 6591 7610 -1484 -3326 -2520 537 7150 5411 -4013 -1120 9108 6125
132 6125 867 1178 610 6701 10715 1079 -5762 -211 8485 9844 1459 -5702 -4971 4860 13392 5186
148 5186 -7779 -6131 3377 10323 8083 -3297 -9562 -1129 10720 7241 -4649 -7332 -3381 3096
162 3096 7860 -2312 -11800 -3181 4722 2581 -1610 -7838 -6739 3796 7536 -3196 -10482 -4267
176 -4267 3134 4887 1086 -10209 -10975 3048 7686 -434 -8241 -10328 -2352 7500 5088 -5671 -10663
191 -10663 -1962 6477 5123 -219 -6549 -4705 5069 6914 -424 -4218 -1525 3002 4000 1204 -2444
206 -2444 -2324 4704 5084 -2069 -1935 1735 3599 5978 938 -5470 -173 7484 6155 -677 -4272 -2483
222 -2483 3438 7883 1865 -7432 -3916 3399 4902 2769 -3942 -6469 1299 6504 2221 -4278 -4250 888
238 888 3907 2840 -3126 -6736 370 5836 915 -4376 -5507 -1008 5723 4000 -4137 -7943 -1171
253 -1171 7298 5453 -1828 -6739 -4845 5749 9086 -317 -7272 -4568 2861 7858 3686 -5118 -6736
268 -6736 999 7753 3187 -2781 -4159 -1564 5100 5605 -2323 -4220 439 3086 2994 -1202 -3582 -1527
284 -1527 3242 3228 -3200 -4729 -153 2655 2324 -1580 -6293 -2399 3784 2946 -2491 -5898 -3242 1667
300 1667 3357 -102 -6310 -4714 2169 2620 -876 -3492 -4509 -330 3028 -423 -4251 -2877 1504
315 1504 2092 -641 -3216 -3350 1600 5082 -266 -4807 -2192 2712 5399 2569 -4347 -4683 2358 7784
331 7784 3981 -3317 -4543 99 6663 7586 -1133 -5885 -223 5843 6629 1968 -4022 -2606 4466 7488
347 7488 2401 -3430 -1484 3031 5043 3442 -2797 -3252 2849 4824 1275 -2565 -3265 873 4429 2163
363 2163 -3871 -5537 1024 3983 1210 -2811 -5829 -2471 3886 2527 -3541 -5890 -3232 1237 2078
378 2078 -1294 -5550 -4977 900 1475 -2605 -3604 -3344 -1214 1504 -1243 -3796 -1746 912 1002 -1805 -3138
395 -3138 -1248 1212 2714 -1658 -5001 -1376 3205 3264 473 -3901 -2946 3171 5846 2077 -3290 -2523
411 -2523 2883 5880 4421 -1207 -3699 1944 6309 3845 -262 -2298 389 4860 4700 79 -2855
426 -2855 669 4885 3538 642 -1997 -969 4349 5044 -768 -3503 -1155 3132 4596 414 -4390
441 -4390 -3569 2062 4908 387 -4205 -4159 -825 4407 2540 -3721 -4698 -1113 2204 1808 -1663 -4776
457 -4776 -3013 951 1696 -2224 -4124 -2167 -730 131 -1800 -4239 -1921 1078 232 -2456 -3443 -1028
473 -1028 1054 1172 -1531 -4537 -1487 2923 1521 -1535 -3466 -2467 1610 3424 -362 -3610 -1951 2235
489 2235 3339 1294 -1369 -2252 1893 4751 1404 -1097 -317 1443 3848 2460 -1461 -1955 1802 4533
505 4533 2004 -1825 -1531 1246 4601 3677 -2036 -3285 989 4542 3966 -877 -3847 -1485 3737 4668
521 4668 -275 -4754 -2550 1736 3472 1198 -4058 -3704 979 3358 1393 -1982 -2744 -307 2685 2053
537 2053 -1575 -3106 444 1831 632 -998 -2791 -691 2414 987 -1915 -2626 -295 2366 1752 -1350
553 -1350 -3149 -884 2981 1944 -1201 -2312 -1756 1481 2551 -422 -2980 -2131 1030 1598 -602 -2208
569 -2208 -1856 95 1973 95 -2701 -651 1095 1563 188 -2330 -1380 1553 2517 -295 -3289 -1683
585 -1683 1272 2241 741 -3211 -3348 1558 3748 1175 -2020 -3357 32 3859 3024 -1118 -3639 -626
601 -626 3180 3104 8 -3308 -2385 2501 3034 -497 -2474 -1964 1682 2886 749 -1763 -1888 1515 2960
618 2960 327 -1698 -1555 618 3472 1287 -2676 -2313 788 2817 1373 -1368 -2515 -160 2852 2296
634 2296 -1378 -2246 -281 1780 2569 5 -2527 -748 1502 1488 -86 -1939 -1344 224 913 -731 -2347
651 -2347 -587 809 66 -819 -2001 -1174 1351 1145 -1540 -2736 -1277 1426 1525 -845 -2982 -2635 1093
668 1093 2597 -492 -2851 -2808 437 2562 1078 -2119 -2566 462 2779 1558 -1207 -1603 -64 2562
684 2562 2467 -895 -1615 499 2385 2366 47 -1595 -117 2920 3100 -394 -2011 104 2324 3477 1061
701 1061 -2210 -1078 2495 3545 1269 -2015 -2056 956 3027 1974 -1966 -2418 213 2147 1529 -436
717 -436 -2636 -541 1468 1378 -565 -2016 -991 511 441 -903 -2265 -901 984 2 -1913 -2090 -1204
734 -1204 503 512 -1757 -2745 -1413 841 746 -1453 -2655 -1673 358 1575 -1037 -2945 -1611 60 1066
751 1066 145 -2072 -2056 301 1598 -54 -1501 -1125 326 1470 1088 -1512 -1452 1300 1958 883 -868
768 -868 -1225 869 2944 1894 -1120 -1657 1091 3133 2435 -39 -2221 -229 3107 3371 312 -1558
784 -1558 -1151 2096 3312 1324 -1664 -1444 1467 2701 958 -498 -1028 -63 2375 1048 -1092 -1414
800 -1414 218 1426 720 -1164 -1420 -584 1751 712 -1602 -1589 -460 798 896 -1387 -2594 -773 1161
817 1161 719 -1419 -2168 -1512 608 850 -804 -2484 -1049 58 630 -147 -1600 -1247 597 823 -387
834 -387 -1784 -849 1051 527 -106 -1307 -1041 1033 1794 -429 -1389 -885 992 2120 588 -1421 -1773
851 -1773 1262 2330 940 -1147 -1656 187 2868 2142 -883 -1505 86 2145 2075 -501 -1418 -668 1666
868 1666 2051 44 -1292 -614 908 1843 761 -1650 -621 1220 1775 347 -1333 -837 953 1657 811
885 811 -1841 -1402 610 1593 1090 -1048 -1918 129 1908 931 -991 -1722 -348 1004 1112 -241 -1651
902 -1651 -897 935 724 -451 -1168 -1044 240 602 -751 -1167 -649 690 480 -810 -970 -453 791 900
920 900 -1144 -1314 -459 671 1197 -584 -2036 -1160 750 1411 -66 -1886 -1108 69 1508 863 -1500
937 -1500 -1609 411 1211 763 -885 -1352 8 1159 887 -1121 -1407 42 1160 922 -559 -1671 107
954 107 1864 1224 -593 -999 -294 1624 1858 400 -1400 -765 1858 2115 671 -884 -1570 826 2378
971 2378 1010 -685 -1249 197 2134 1565 123 -1042 -226 1619 1271 -214 -693 -237 972 1303 -564
988 -564 -818 -279 624 580 -735 -1085 -119 572 850 -839 -1339 -259 611 671 -496 -1756 -941 271 632
1007 632 -316 -1698 -1078 95 384 -244 -1584 -1569 313 698 -226 -960 -1076 124 966 -50 -1111 -1095
1025 -1095 403 1219 -149 -1169 -1113 -173 1632 577 -1468 -1366 134 1698 1198 -661 -1552 -420 1529
1042 1529 1907 -249 -1450 -418 1103 1983 508 -1215 -820 704 1656 702 -671 -744 450 1374 1015
1059 1015 -384 -326 670 1265 1039 -431 -688 580 1303 627 -754 -960 319 999 838 -589 -1253 -250
1077 -250 1479 819 -343 -1268 -829 523 909 -261 -1078 -770 256 360 -371 -801 -1137 -140 145 -851
1095 -851 -1170 -923 67 329 -602 -1129 -388 441 546 -550 -1471 -601 484 1294 -144 -1513 -1095 303
1113 303 1091 596 -1178 -1209 140 1448 1277 -489 -982 -16 1304 1356 80 -1151 -167 1406 1459 242
1131 242 -786 -259 1252 1239 375 -546 -161 1176 1304 478 -481 -790 958 1873 437 -525 -740 460
1149 460 1379 380 -488 -1069 -41 1194 904 -678 -834 -335 1104 894 -223 -845 -521 774 753 -7
1167 -7 -717 -835 111 593 -409 -916 162 210 264 -387 -1004 -307 225 279 -506 -1120 -318 188 221 -354 -1490
1188 -1490 -756 391 773 62 -1106 -1329 320 319 217 -1074 -1242 -73 811 320 -530 -912 -365 1139
1206 1139 434 -507 -757 71 738 858 -340 -705 -78 1027 900 -376 -873 -206 953 1395 -166 -981
1224 -981 -313 1056 1620 238 -733 -604 356 1672 1021 -517 -508 219 1254 983 -506 -836 63 802 1042
1243 1042 -73 -351 -32 550 767 -31 -786 321 680 459 -151 -664 -153 849 587 -309 -694 -449 835
1262 835 454 -461 -929 -468 476 532 -251 -680 -751 49 660 -70 -936 -810 216 501 -367 -752 -508 -341
1282 -341 523 106 -895 -649 -261 458 42 -836 -736 29 521 111 -838 -1221 9 768 434 -504 -1305
1301 -1305 -55 866 909 -297 -976 -356 695 1136 555 -516 -607 785 951 496 -339 -384 385 857 694
1320 694 -64 -461 465 922 682 -288 -811 244 1041 653 -263 -271 280 1162 928 -147 -333 3 904 778
1340 778 -106 -615 -374 753 998 -18 -568 -446 149 325 -317 -680 -317 -59 336 -146 -857 -405 292
1359 292 39 -1 -1081 -416 241 178 -168 -909 -822 152 366 -191 -1091 -1068 340 221 146 -568 -1145 -49 1019
1380 1019 212 -685 -1081 -388 833 681 -644 -858 -484 679 895 -420 -654 -73 817 594 -79 -400
1398 -400 -32 645 995 463 -209 -431 418 1100 471 -546 -286 437 859 812 -283 -395 353 1028 1097 -70
1418 -70 -510 17 644 1053 -89 -466 233 443 660 198 -459 -485 313 398 -56 -306 -373 255 65 -145 -339
1439 -339 -183 398 298 -239 -691 -569 54 501 -46 -796 -514 177 213 -309 -731 -910 -11 262 -73 -976
1459 -976 -760 -182 363 -187 -556 -708 -273 273 318 -557 -479 -242 418 428 -508 -676 100 338 297 -288 -965
1480 -965 -242 727 923 -199 -558 -253 803 825 422 -505 -456 470 714 249 -425 -380 234 815 546 -49
1500 -49 -536 202 786 464 122 -465 -169 672 530 -42 -241 -5 375 191 -18 -220 -281 334 381 -512 -751
1521 -751 -380 320 696 -158 -673 -202 214 256 -222 -697 -560 49 356 128 -595 -352 -92 285 41 -632
1541 -632 -515 -138 179 -30 -602 -417 173 226 338 -517 -742 -42 255 -278 -859 -887 75 421 204 -516 -934
1562 -934 -284 730 309 -110 -538 -382 407 649 124 -183 -477 402 663 302 -175 -441 16 744 141 -375
1582 -375 175 -8 628 478 -92 -81 259 833 517 -33 -234 128 508 499 -108 -401 143 757 695 -60 -482
1603 -482 -197 231 613 624 -391 -207 227 606 87 -451 -394 117 52 52 -192 -465 -21 436 -483 -567 -662 304
1625 304 88 -474 -466 -516 159 233 -254 -461 -438 -86 530 -173 -660 -735 -109 466 19 -453 -815 -227 483 159
1647 159 -438 -711 -74 383 367 -339 -666 -374 337 433 -187 -708 -320 260 564 74 -535 -488 322 704 213
1668 213 -234 -400 505 526 590 -171 -250 374 778 362 -37 -319 92 578 529 501 -456 75 366 342 141 -285
1690 -285 17 338 300 24 138 66 75 522 6 21 61 196 332 -187 -288 -34 251 204 -246 -400 -90 198
1712 198 410 87 -442 -651 40 328 18 -548 -510 -212 164 -76 -577 -528 -264 2 -152 -273 -683 -143 201
1733 201 333 -255 -741 -260 153 242 -301 -790 -496 333 104 -131 -239 -364 474 491 5 -415 -410 273 418
1754 418 396 -371 -478 194 614 340 -193 -334 31 413 452 -56 -124 -280 374 435 175 -147 183 401 355 100
1776 100 110 237 127 590 100 -223 287 209 530 -13 -620 -256 344 283 265 -371 -517 168 397 58 -345
1797 -345 -301 69 483 -31 -269 -518 96 434 -242 -368 -467 -33 -145 -202 -231 -651 -48 231 -191 -402 -445 -324
1819 -324 276 6 -567 -681 -64 361 233 -286 -486 -424 217 243 -76 -426 -319 101 458 99 -455 -316 86
1840 86 295 196 -302 -188 96 438 218 -310 -245 544 447 24 78 -196 40 562 536 29 -316 310 249 402
1862 402 200 -277 -87 561 350 29 -182 -117 205 398 135 -268 -175 216 275 -279 76 269 364 70 145 -387
1884 -387 -91 7 165 -155 -402 -304 67 355 -164 -527 -431 -45 383 229 -487 -646 176 437 64 -339 -539
1905 -539 -72 52 125 -264 -417 -299 -61 80 -153 -466 -189 98 376 -236 -239 -281 362 149 -12 -279 -195 269
1927 269 515 187 -327 -220 41 582 454 -177 -372 93 455 188 -397 -133 -112 403 321 -94 -68 184 344
1948 344 116 374 281 132 337 712 -215 81 108 -44 432 139 -159 193 119 79 -321 -376 224 353 62 -35
1970 -35 -270 -214 271 303 16 -217 -418 81 332 -287 -310 -192 207 258 -220 -274 -375 -236 208 -176 -236 -306 4
1993 4 33 82 -379 -452 -243 239 67 -414 -410 -225 338 288 -269 -648 -228 -80 301 -132 -555 -265 152 240 68
2016 68 -218 -469 165 288 397 -52 -283 170 23 164 -64 -319 137 375 97 80 -229 163 423 330 -164
2037 -164 158 72 389 363 -83 -137 -35 234 276 169 -223 298 298 480 68 30 -7 602 541 200 -69 -82 -59 249
2061 249 -168 -161 -53 -145 189 -128 -420 -150 17 277 -3 -312 -145 126 48 -182 -257 -440 -110 -224 -7 -83
2083 -83 -658 -248 -55 -25 0 -514 -315 109 179 -264 -492 -391 26 321 4 -548 -249 254 204 -109 -248 -313
2105 -313 -15 439 442 -50 -13 152 190 348 -158 187 281 99 63 68 -248 51 606 290 96 -70 -206 277 445
2128 445 136 31 -212 235 195 211 -252 14 223 184 55 -99 42 143 406 182 144 111 148 -94 171 -137
2150 -137 242 225 173 -53 -266 -60 -62 139 -203 -257 -269 8 325 -14 -449 -559 5 186 32 -292 -408 -17
2172 -17 181 105 -95 -120 -348 175 -194 2 -6 -217 -285 513 -94 -444 -218 -121 337 -172 -347 -192 230 247 221
2195 221 -324 -287 -247 63 288 -115 -88 120 247 204 4 15 30 176 373 5 2 121 -104 359 132 -244 93
2218 93 351 -137 265 -53 89 158 -18 -170 -146 -31 362 148 -10 45 -63 463 220 37 -280 -183 95 287
2240 287 206 -26 -153 -61 309 -93 -119 -110 -117 70 -115 -439 -82 -3 -215 216 -460 -420 130 212 25 -108 -372
2263 -372 -114 -267 249 -77 -406 -347 161 -26 -22 -376 -339 253 69 -272 -171 -353 168 -8 -18 -139 -113 -82
2285 -82 -61 -249 -170 -128 -68 251 152 8 -88 -19 72 225 -183 -88 84 222 103 112 -153 -34 157 270 224 100
2309 100 -18 183 232 253 9 341 186 201 182 -46 84 90 233 172 62 58 17 194 -117 -166 117 138 164 64
2333 64 -224 -29 119 124 135 -65 -277 -264 422 -50 -124 -360 -26 288 -31 -108 -100 -166 99 191 -154 -587 -223 30
2357 30 196 -109 -265 -236 354 -14 -83 150 -187 -4 180 78 -454 -165 -50 -8 496 -226 -128 189 151 -89
2379 -89 -122 -107 126 17 374 0 -296 67 240 337 35 -21 -157 190 175 -69 47 265 223 367 207 -84
2401 -84 323 154 23 55 -87 332 282 21 -171 48 -27 -101 85 -97 -11 -204 -43 -150 18 -3 -252 90
2423 90 82 -137 -315 -129 -502 -86 83 -304 -238 -122 -152 27 -153 -98 329 -127 58 -53 -246 -305 163 117 11
2446 11 -268 -149 196 -85 23 -383 -132 214 126 42 -187 -128 -407 182 203 -283 -486 36 150 144 7 -27 -88
2469 -88 115 84 -259 -120 -273 218 99 191 72 19 232 328 -78 294 141 277 340 10 -59 212 441 144
2491 144 169 -107 25 120 539 304 -276 9 244 -115 328 -103 -162 -204 54 457 -176 68 69 104 -168 -165 -340
2514 -340 144 49 -137 -150 -143 -85 -164 123 -155 -217 -261 107 -15 -270 -106 -53 -115 196 -297 -207 -296 -35 151 -182
2538 -182 -63 -302 45 207 -174 -24 -222 -233 230 177 -289 -34 -320 -163 -40 134 -91 50 48 174 -61
2559 -61 70 30 147 39 -126 79 147 152 -300 48 -251 3 300 313 65 213 -163 85 40 138 -106 19 299
2582 299 198 239 -158 -30 269 117 -1 142 -25 259 306 -95 -71 52 119 242 100 -42 -66 239 125 27
2604 27 42 -169 252 141 35 -99 -134 -103 -97 -136 -45 -262 -227 -207 16 -114 -69 -8 -214 -12 -157 -436 -366 19
2628 19 -205 -141 -219 -271 50 11 30 -66 63 14 -44 14 9 -66 14 218 110 -40 -377 11 108 -250 43 -134 -85
2653 -85 134 125 108 -86 81 69 437 88 -36 65 37 405 -148 -15 115 348 17 134 196 150 188 148 118 -43
2677 -43 -74 -92 234 -163 71 -429 128 229 -11 -112 -190 -20 -77 246 -202 -95 137 21 -101 64 -44 -207
2699 -207 114 58 -170 -329 46 126 36 -264 -389 -451 34 141 -129 -59 -66 -46 369 -186 -228 -19 -50 281 251 27
2723 27 -115 -121 69 54 -260 -238 -282 154 129 -230 -196 190 -89 179 -67 -218 -26 62 102 -27 153 -62 245
2746 245 43 318 60 30 219 164 -85 93 -197 -77 146 31 8 23 213 201 183 130 302 -51 -160 309
2768 309 276 -92 164 155 99 234 92 216 60 -69 -36 -39 -58 19 -197 -58 -3 -204 304 2 -207 13 86 -164
2792 -164 28 -27 -194 52 110 143 -247 -265 -414 -86 77 -134 -190 -191 114 -122 -101 48 -118 -124 37 14 -423 -173
2816 -173 8 71 48 -70 -515 -93 126 180 -117 -60 -164 147 6 -2 -124 302 45 285 47 71 83 -171 348
2839 348 34 -25 -103 95 114 -158 85 193 258 126 -53 57 140 -38 198 28 78 38 171 93 241 106 -216
2862 -216 58 186 130 -422 140 -13 60 -188 -26 -138 84 177 53 3 -42 -169 210 235 -261 -230 -120 -51 -101
2885 -101 -187 273 23 74 132 -361 5 -213 -88 -83 36 -183 -310 -127 90 278 63 -214 -290 48 133 -229
2907 -229 -133 -138 61 191 83 -12 -179 155 128 54 -83 -170 42 97 43 -272 -137 125 118 170 -117 233 139 330
2931 330 115 52 48 189 -3 -9 -175 63 205 126 129 254 135 260 170 171 -73 -105 34 0 53 -43 -139 -23 105
2956 105 15 178 115 -128 -87 3 -98 5 -71 -33 75 -8 -300 -12 104 192 -65 -47 329 -173 -114 -132 -259 -341
2980 -341 -186 -64 145 -41 -262 123 -110 -49 3 -81 -204 -180 31 -202 -221 119 238 111 8 132 -159 223
3002 223 -16 133 -58 45 -60 -66 -127 29 -13 -106 261 -64 35 -199 29 76 -251 -229 -28 157 -96 53 -150
3025 -150 78 72 87 298 -150 16 143 -49 132 -47 59 -20 -45 201 -97 259 69 70 308 131 -115 -5
3047 -5 63 206 132 -212 40 -6 327 -109 -12 140 100 -57 -41 -181 -229 155 103 145 28 -69 -137 31 -57 -101 -56
3072 -56 -242 -34 -170 148 -43 144 54 229 -151 -490 -355 -58 -11 -129 -369 -152 96 52 -115 -92 33 -272
3094 -272 268 -249 -24 -94 -78 130 -51 -216 133 187 35 158 -37 118 52 168 -177 38 -111 33 288
3115 288 64 -43 55 113 185 -56 191 -57 -129 277 -97 139 30 130 246 85 -166 -218 -179 215 112 -90
3137 -90 91 -10 125 195 -149 186 -5 87 206 106 -96 6 74 163 -8 -297 -118 225 -13 -148 -193 -114
3159 -114 222 -56 -347 -298 -344 -228 -121 20 109 -279 15 -98 -121 -2 -41 -121 -211 -145 51 42 10 -220 -306 -80
3183 -80 -48 104 24 162 -10 244 63 -146 -68 -68 -260 -23 7 93 -240 -4 -56 -23 191 -148 42 -1 93 97 -222
3208 -222 4 13 -173 252 -55 -52 5 78 169 14 -144 -184 54 295 111 -10 95 232 380 226 231 20 -315
3231 -315 138 -24 -5 104 -186 382 23 180 11 -96 148 -136 -53 -371 -184 -134 309 -93 -214 -124 -58 -135
3253 -135 -57 -207 -168 -186 -113 126 -101 -289 -66 67 38 -90 -168 -16 174 -178 -84 159 138 75 114 166 -168 -54
3277 -54 207 88 27 -46 -200 41 -42 -45 82 -116 167 36 -177 143 177 145 133 34 -57 137 158 209 -55 91
3301 91 127 130 -10 40 284 176 -91 198 165 -139 156 -206 180 -34 -70 -145 -67 165 44 -124 -172 -57 -202
3324 -202 142 -8 -39 -133 -32 -85 -140 101 56 -123 -74 53 -131 -125 97 96 22 -308 -314 -90 -228 -163 -202 -318 -162
3349 -162 -125 91 -128 -143 146 -187 138 -369 100 211 81 122 93 27 -45 107 -51 -244 0 112 169 241 -183
3372 -183 167 -145 11 -70 -281 -139 127 125 2 -167 -80 44 28 -14 14 -13 141 24 90 -92 -71 -143 265 63
3396 63 280 -78 -230 -51 235 -260 24 259 31 61 273 63 207 74 97 121 -225 -22 -80 167 -7 28
3418 28 -294 -227 -48 229 -32 -94 -56 -67 27 -85 -237 90 -149 -221 165 -122 -104 -163 -22 -42 201 -376 -176
3441 -176 -78 239 -112 -171 20 -93 260 81 -165 -119 -76 -95 182 10 -200 -66 133 -314 97 -53 139 -33
3463 -33 97 -9 153 192 261 -55 -168 -44 22 380 -43 -99 111 -5 248 56 -51 210 101 -39 -46 -155
3485 -155 109 -70 234 -84 113 118 -200 69 279 227 -74 -169 -25 -57 -129 164 -230 -105 251 5 137 126
3507 126 -30 257 -94 -72 -170 -64 -38 142 0 -79 -43 41 -68 -334 158 -106 140 132 111 -82 15 -91 -59 -183
3531 -183 -285 -174 28 -26 -171 -10 -186 35 68 -28 -24 -8 156 -102 46 -52 84 78 82 -48 -226 109 -71 70
3555 70 223 21 138 48 372 171 -146 32 350 31 169 231 -102 80 171 90 203 30 -157 8 78 -38
3577 -38 -48 -92 -144 265 36 -205 3 296 322 174 -21 -161 -313 61 485 47 40 33 -397 23 -125 -128 163 107
3601 107 232 -185 9 234 -190 -65 -136 -166 156 52 -59 -18 -332 68 183 77 -140 148 -34 -193 -63
3622 -63 9 -223 -209 100 49 -77 -264 -146 87 15 42 -195 40 -22 78 84 -200 -156 220 185 -186 28 -273 13
3646 13 121 124 1 20 -82 117 -64 123 163 57 54 34 98 69 -11 157 15 46 75 47 176 85 -195 -126 114
3671 114 96 19 35 101 236 429 208 -143 233 211 19 193 103 34 -73 50 -61 -100 -228 114 173 36 -15
3694 -15 -73 -135 -15 -47 -5 187 -254 82 -30 -317 -85 -159 90 -315 -246 -122 -148 37 -3 -28 -90 11 -221 -28
3718 -28 67 -134 19 34 -4 -166 -28 82 162 17 84 -203 -67 -139 80 151 -175 113 -10 25 252 28 33 297
3742 297 153 257 314 246 88 8 49 214 -143 -21 210 118 179 47 107 88 -15 -138 59 28 -71 120 -128
3765 -128 -83 23 29 -203 63 312 229 -81 41 -24 -164 -233 1 172 -127 -145 26 24 -115 -87 168 56 37 -86
3789 -86 -74 -170 209 17 -206 40 -118 164 -25 125 -127 -230 -164 14 -157 -23 -151 214 -24 -91 -141 4
3811 4 -37 -48 54 -160 189 101 98 -29 198 -14 -8 87 7 60 -97 89 -92 -72 155 21 180 -42 -107 91 253
3836 253 -65 243 -26 -16 287 -166 -234 49 -47 228 143 143 31 8 138 1 -258 94 195 -124 -38 -52 -66
3859 -66 -37 88 30 154 45 -217 -308 68 231 -161 -26 -32 -192 91 -147 48 -37 124 168 5 -159 -33 -179
3882 -179 114 40 -106 -21 -145 22 -83 -123 -192 30 -56 -91 90 -292 80 -160 -322 -201 -291 153 -64 36
3904 36 -3 -387 -95 -139 -207 -111 126 -142 68 -85 322 -66 -39 -51 197 -44 -56 86 8 31 -129 105 53 45
3928 45 152 103 62 -67 87 -35 193 -14 -172 -44 -101 104 46 52 111 63 -6 122 87 61 -290 188 87 163
3952 163 -5 -116 -113 -120 -5 132 389 68 -242 -70 -106 -78 -355 22 -86 -24 -54 33 288 95 24 148 -184
3975 -184 -141 -86 103 -36 -101 25 -53 -56 -143 -115 32 -170 -61 -146 -210 -45 -12 -156 170 16 97 2 49 -279 -49
4000 -49 -30 159 -100 192 318 2 44 -285 99 -59 -63 -94 71 72 309 94 -88 262 -107 -26 -45 21 249 67
4024 67 81 136 155 54 -107 292 143 280 -111 53 118 -208 -18 124 164 -167 88 190 -177 -49 175 -21
4046 -21 352 -231 -30 -41 342 -11 47 -110 -149 35 -116 -244 -194 -73 -274 -55 -280 4 -67 19 97 22 16 -76
4070 -76 31 -14 -13 -314 -170 -176 42 -90 140 -120 221 323 153 -528 -247 -74 235 -177 -46 -103 -88 195 -36
4093 -36 -253 297 51 -77 -33 -239 -167 -157 8 122 -180 -218 316 -70 248 161 -58 5 -379 301 191 -229
4115 -229 116 73 18 228 -67 -258 -34 240 156 139 -108 63 148 -74 54 -2 87 22 -47 -41 41 -218 209 -25
4139 -25 -238 12 102 -18 88 -111 59 -161 -81 -44 -141 -113 -22 -31 -234 -204 229 -95 45 170 -315 198 36
4162 36 15 -258 84 -49 -95 -151 49 -1 9 -33 58 -168 42 -97 -8 56 40 -76 135 31 -54 -64 -70 -20 -252
4187 -252 128 84 138 168 -263 -151 244 156 -13 0 -80 -104 13 30 -37 51 12 90 99 -6 -336 -60 220 264 246
4212 246 126 -38 -44 -62 -36 44 -76 115 381 52 -242 150 6 134 -266 -22 -73 98 12 -183 66 66 131
4235 131 -203 23 -37 37 221 118 -9 -80 -36 -109 -263 153 -178 -19 136 64 -77 25 -41 -77 46 97 -162
4258 -162 118 -182 -117 -223 -199 142 56 47 -242 13 26 164 44 -12 -54 -56 -40 8 51 37 19 165 11 306 56
4283 56 -166 95 -2 93 -75 376 26 57 75 -20 -36 8 193 123 113 237 -79 217 35 -197 -104 -2 -117 168
4307 168 72 -126 73 400 -238 74 -151 31 31 148 -150 -110 74 -104 -156 -35 -191 125 162 -262 178 -74
4329 -74 -340 -92 -160 198 -70 241 -4 -223 61 -189 10 -48 23 4 -313 -242 -376 -95 -109 78 -149 38
4351 38 261 35 46 -302 -255 3 -139 41 -145 -212 -162 -53 44 28 145 230 208 160 133 -54 2 -40 233 -254
4375 -254 -129 196 -130 -17 58 293 -195 75 146 237 -8 47 81 -255 -216 -49 160 89 54 -20 136 -174 122
4398 122 -1 248 121 -124 -2 61 153 -169 -152 76 98 33 -225 -114 27 -1 -113 -87 131 -14 -116 152
4420 152 -329 -41 -278 159 -171 -57 64 -66 190 -324 -7 -189 -83 130 -28 58 126 103 -96 156 -299
4441 -299 -60 -79 189 -96 -343 -89 -107 131 -54 -10 -198 -42 445 351 160 -65 13 -206 24 33 -166 133
4463 133 178 131 -12 182 -1 187 112 265 32 242 227 -401 -20 179 48 46 -108 -4 137 4 86 -269
4485 -269 -34 -102 44 273 140 -88 144 85 -76 385 91 36 -43 77 -161 -157 194 -151 -285 -60 353 -189
4507 -189 -206 -1 70 124 -84 25 -60 36 -50 240 -14 12 -55 161 -166 -90 -235 31 -45 -139 72 -59 77 38
4531 38 97 161 236 57 28 -185 -45 111 99 -156 27 -1 -7 -157 126 298 -121 -67 -77 167 135 -7 -308 69
4555 69 112 53 68 -95 -17 65 27 -91 77 -134 -98 11 -2 34 11 -210 -17 43 -14 28 -429 59 5 -85 -8 -47
4581 -47 -182 -245 -189 -51 -90 -232 -95 12 62 54 267 36 -154 -44 -65 56 -98 7 215 0 -54 -14 -60 -195
4605 -195 -323 -281 -295 -103 -36 -170 19 -262 -62 -56 60 -45 -76 149 -99 77 -144 163 -50 49 -202 150
4627 150 142 38 31 88 26 -69 310 -46 32 -136 14 52 17 -205 -179 54 16 -96 -218 74 212 -52 -77 129
4651 129 -101 72 146 132 203 26 -199 -52 -8 4 230 2 -38 -8 -172 56 142 -108 -12 293 -50 -55 18 232
4675 232 194 -102 214 54 85 71 108 91 134 -200 207 -233 151 31 -17 231 21 145 34 -422 -13 71 -253
4698 -253 -312 198 -28 163 150 152 84 76 202 -2 -37 -77 100 -150 20 -59 -57 106 126 99 -87 214 -91 -102 -178
4723 -178 -236 63 -100 13 -217 -119 -27 -60 94 28 263 7 64 293 -17 -13 176 -153 74 214 216 109 145 176
4747 176 174 237 -293 -52 -138 91 160 41 20 -10 -46 38 -4 52 150 290 -149 -46 109 65 70 -29 269 -88 -194
4772 -194 -7 -179 29 -60 -164 184 37 -132 -24 -190 215 20 -60 -86 -198 -3 0 213 -301 78 -180 -102
4794 -102 -132 -339 -183 -14 -134 -6 -55 -32 -145 -58 -161 15 254 164 152 -9 -151 -17 -163 25 150 64
4816 64 283 43 -36 -200 -152 -43 103 260 10 -133 -58 226 -81 106 172 -56 158 -64 234 -160 -207 112
4838 112 -395 89 31 -65 123 48 58 140 -41 -280 68 -280 161 -100 242 -235 -49 -111 67 -233 -128 -78
4860 -78 151 16 -131 -219 -174 -61 -70 -316 47 1 -102 -111 21 286 -298 -220 -216 -78 -88 -167 -107 -331 -212 -45 -325
4885 -325 -167 33 -182 95 -127 -84 -84 1 23 -91 137 -181 36 41 -117 -141 -74 -119 20 -66 25 63 45 -140 203
4910 203 -173 275 -114 -36 49 49 159 -234 19 -18 175 -161 -146 359 21 107 55 -121 -2 34 89 261 94
4933 94 -43 66 52 -135 104 -173 150 30 326 -43 -70 20 -146 -97 74 100 42 -241 -251 193 -76 12 -15
4956 -15 -70 -58 -15 -166 303 -360 -446 -218 -244 -36 -58 192 -293 235 62 109 -63 -24 164 11 94 25 -99 -16
4980 -16 -253 66 48 10 -179 125 -24 -48 244 -277 -28 -89 212 -214 63 14 84 292 207 241 69 -173 93
5003 93 -82 52 -27 23 -38 205 78 -177 138 248 100 5 -160 -90 -227 -323 -245 20 91 -7 34 -41 -20 -168
5027 -168 -79 40 -107 -63 49 -89 85 47 43 -32 -12 74 -70 66 61 -543 -54 71 134 79 70 -9 114 99 40 263
5053 263 70 -30 -185 28 -14 42 36 -162 -127 -303 -98 159 -107 -78 43 -104 -81 -239 -1 36 25 -47 -229
5076 -229 -61 58 156 -24 48 -82 -36 197 13 41 -177 -117 -34 64 -90 -159 243 -81 92 132 32 3 77 -98
5100 -98 20 51 51 -79 -261 -44 -18 140 -19 -146 73 -26 97 180 27 -147 250 -50 62 -6 -149 39 -337
5123 -337 122 8 8 -14 71 158 49 -21 139 120 -84 80 42 -186 -12 -79 59 -35 78 -77 52 -8 -149 -136
5147 -136 -44 371 -218 -215 -181 -135 165 18 234 -233 -83 -161 107 42 105 173 378 -70 -160 88 -16 116 -248
5170 -248 105 -140 -110 -150 72 -20 -25 -84 75 -88 226 62 176 125 -4 31 -2 -177 -90 -201 91 225 205 38
5194 38 300 -45 32 7 126 118 28 365 -64 66 -62 143 99 -60 7 179 -247 236 29 110 -12 -63 174
5217 174 105 -208 143 -107 -122 -7 -128 113 96 -124 168 78 61 -211 -252 -110 273 -56 -284 -44 -178 -1
5239 -1 -46 188 268 -214 -176 -305 -108 56 -53 -140 25 -195 155 -86 -235 -7 -20 -33 274 125 153 -114 -188
5262 -188 23 -199 157 -77 121 -107 -27 122 -156 59 15 -84 308 259 95 167 -71 -54 34 -158 -68 -76 101
5285 101 -261 56 -120 -121 -32 -234 -49 247 -30 -50 154 -13 -132 -28 -213 -75 96 -21 -183 305 237 -43
5307 -43 -13 -57 -19 -76 -13 -12 -241 -53 136 131 16 256 -153 85 -134 -178 -154 -90 61 -205 -339 -76 -7 45 163
5332 163 124 -156 -64 -292 -176 -197 -214 19 -40 -200 -64 161 177 189 103 80 143 -137 -155 4 133 32 -261 -142
5356 -142 49 9 211 -48 312 250 240 121 -305 210 259 209 -195 -80 -138 125 -96 -77 90 -332 23 -65 -93
5379 -93 -102 98 14 126 -153 415 138 166 -98 -136 -81 -85 -16 -31 -157 108 -86 -138 -134 -21 50 -117 -11 113 -10
5404 -10 -78 -189 -74 186 -200 -309 -34 68 170 -176 167 116 -121 102 256 97 -135 -74 -45 -28 -102 -41 -127
5427 -127 14 -38 39 160 -106 224 173 206 8 -45 -55 78 112 79 7 -89 -51 -87 -51 -84 268 394 -163 181 348
5452 348 -71 -266 171 21 22 81 -13 -60 136 -17 236 91 -209 -52 -105 -111 -156 34 -181 21 157 51 39
5475 39 242 39 -61 101 158 140 -56 -73 -124 -69 7 -200 74 -63 -21 4 -259 64 20 -54 134 -30 141 135
5499 135 -228 3 -252 -67 46 149 -115 -252 -95 216 84 -2 -275 125 74 -129 61 144 -105 113 -210
5520 -210 8 94 195 -147 89 14 -33 -27 -94 -35 40 129 -51 -9 202 4 36 35 -83 86 -14 -25 -358 -151 -137
5545 -137 -10 -280 104 154 164 162 165 98 64 88 83 351 156 -32 -145 187 32 52 63 -145 124 204 -150 90 153
5570 153 70 -78 -142 83 167 36 75 -24 -235 -56 4 66 -142 -308 -30 -186 99 -60 -229 2 -125 316
5592 316 106 112 -68 -68 53 -28 -123 84 -54 -309 10 -222 -86 -16 81 14 290 47 -89 -277 85 -48 -202
5615 -202 13 38 -341 -243 -279 -56 -64 16 41 39 -9 22 19 64 -64 -76 -9 85 -54 179 -205 16 66 28 -70 77 -119
5642 -119 -78 -195 -27 -65 -197 -7 -22 -32 273 80 185 -31 10 -27 54 -129 -57 -77 -148 148 -26 313 -60
5665 -60 -164 -3 182 294 -90 -131 -6 -111 -6 86 164 -25 131 -1 42 251 89 -99 60 -132 -55 -205
5687 -205 -63 77 -211 -235 -154 182 52 -176 -15 -261 -192 -57 -105 -98 -145 -69 -8 105 -264 -20 -184 -142 351
5710 351 36 179 128 -56 191 87 -197 102 26 -68 208 -189 -103 -21 57 197 -158 117 52 196 -356 -8
5732 -8 170 -70 -71 -121 293 -26 0 -310 -71 21 111 6 -8 -74 65 -161 -42 -3 310 -17 23 228 89 87 98
5757 98 -228 -127 38 184 -119 -171 -198 -37 236 -41 63 138 -399 109 -125 -167 -62 8 -339 84 -86 -78 235
5780 235 -69 72 -80 -194 -17 -101 31 77 36 112 178 -188 70 115 67 -18 88 36 140 82 -194 -93 158
5803 158 -33 -132 330 -199 -40 32 -77 5 -179 86 -48 157 -40 15 32 19 -59 -333 -157 28 34 129 69 111
5827 111 -20 65 150 -56 68 -25 120 -178 -42 -69 78 50 -4 80 2 -204 -135 -68 6 -46 -232 148 -52 -261
5851 -261 -54 54 -38 -10 -148 192 -11 18 -199 57 129 -150 -14 -104 -90 3 -111 12 113 -186 -329 353
5873 353 -2 -172 -35 168 -221 -355 37 39 -3 -295 73 -14 65 74 -30 -213 23 -72 -100 -112 173 136 -322 103
5897 103 42 -230 -31 151 -276 239 -159 -128 166 41 280 9 -17 -18 -3 111 -22 22 -157 262 37 -124
5919 -124 -24 -11 18 136 -144 -61 -202 63 -44 52 25 131 233 -155 72 183 -43 272 40 -60 -268 -43
5941 -43 -48 119 124 80 81 -23 101 -135 146 -291 7 -55 -96 -96 -138 -116 -251 -62 170 232 -115 48 25 208 147 140
5967 140 51 81 -81 47 42 -298 133 172 -23 -77 245 -111 -130 8 90 41 58 -105 -94 225 166 69 253 123
5991 123 -167 207 141 -181 92 340 138 92 -125 68 48 -111 -40 469 -35 256 -211 -173 56 -1 13 65 18
6014 18 -22 234 -137 -317 24 148 9 83 66 -86 -83 53 -97 135 -211 222 -11 117 -258 82 144 202 -95
6037 -95 -77 116 -164 175 -23 58 -63 -9 -11 186 -50 -101 -76 -32 265 -231 77 -40 199 -252 63 -297 159
6060 159 -147 74 -35 -24 303 103 -143 118 58 -52 91 92 66 152 -4 -245 -98 14 -35 -121 52 8 19
6083 19 -17 500 193 217 269 102 -92 194 2 64 -6 -297 21 26 -69 294 69 330 8 -34 159 0 -159
6106 -159 71 106 15 145 141 -79 -237 128 -186 -154 164 -162 -90 -196 89 87 -38 221 -248 67 95 -103 117
6129 117 -116 -119 91 112 -64 9 -42 -125 -92 -121 70 -41 5 46 -260 -17 185 112 -81 171 -15 -157 -20 -157
6153 -157 -37 -190 221 73 -7 -286 112 55 148 34 -159 -257 -111 -7 -140 360 111 62 162 -31 169 -30
6175 -30 -132 -52 149 20 154 -113 101 -35 20 126 154 93 64 -24 -57 55 -115 -100 84 82 -81 -54 11 374
6199 374 177 -167 -214 63 38 -5 -45 92 -323 -91 -120 -254 166 64 12 119 -182 46 160 -7 187 -72
6221 -72 -28 143 -40 -200 -202 175 116 -191 -130 -148 -106 66 -42 -290 63 -209 38 138 205 179 30 -158 150
6244 150 -66 73 -56 -90 -34 -202 38 -33 -181 171 109 125 315 2 -168 -88 106 75 239 53 180 150 -131
6267 -131 162 -40 -50 -112 101 23 11 165 125 -2 -161 -28 215 -149 -144 89 -254 42 130 -154 123 -85 -79
6290 -79 173 -320 -7 -110 122 -21 -1 -186 148 -55 9 258 87 -36 -239 -49 -215 5 -59 -325 -81
6311 -81 57 101 147 181 -40 203 -130 86 -68 -106 -168 -18 -61 -420 181 13 134 -173 6 61 -52 -228 57
6334 57 -53 63 -174 16 105 81 -64 60 -134 145 116 85 -209 -38 -52 -90 17 -105 -28 -11 -48 123 132 -31
6358 -31 175 55 185 184 -231 -88 -113 -47 -141 132 128 208 84 -4 -300 145 -109 -92 77 -277 -93 94 66 228
6382 228 106 -82 30 -114 -39 -27 -137 -136 143 172 -135 19 45 -120 157 -206 29 -190 168 -51 -606 -112
6404 -112 -47 -82 -55 -105 -96 107 -120 -35 117 158 65 131 113 -218 -256 -188 -121 16 0 -258 140 286 123 31 53 187
6430 187 28 168 -24 111 -173 -228 -3 -24 -45 87 109 -208 -153 40 326 -106 -192 103 172 84 -225 108 256
6453 256 105 18 -12 -82 -229 -126 -161 99 -244 15 183 -125 277 97 -43 -38 -19 -225 -5 -25 -10 364 173
6476 173 -26 -150 257 33 28 191 36 17 112 172 -162 -168 -131 1 130 -18 -14 79 -188 81 -111 24 168 192
6500 192 8 37 -34 55 56 52 57 86 191 -44 -350 -146 -290 7 95 -64 -159 20 19 80 50 -65 104 -128 -37 -88
6526 -88 59 -59 166 170 15 35 52 341 -50 -28 -51 22 103 8 205 -124 -101 -152 107 -80 -12 98 -21 -21 95
6551 95 15 22 259 -9 -30 -97 -67 1 -114 42 49 160 101 -269 -44 77 90 -238 131 -127 -62 27 38 83 -142
6576 -142 203 -136 -170 -4 13 22 -94 -128 50 -253 32 -198 69 -83 -190 95 -170 154 90 -122 -49 26 -3
6599 -3 130 288 -188 -92 36 -84 -108 160 90 123 -144 -81 -22 -200 296 51 -66 -54 -66 50 -12 43 126 -164
6623 -164 134 274 -131 96 37 -35 -101 -148 -43 41 -15 125 26 -142 14 188 205 293 -74 218 -82 -26 -100 121
6647 121 274 371 186 -220 187 -115 -144 -44 -204 -91 169 -190 212 135 133 70 -71 15 -83 -195 -142 -314 72
6670 72 11 -293 18 -82 32 -172 -61 91 197 -18 -123 15 4 -14 -64 67 263 116 62 12 -39 18 264
6693 264 36 15 146 52 -9 -49 -20 67 -99 -24 -20 -118 238 132 33 155 131 30 -99 -147 -40 38 -80 0 -173
6718 -173 82 -17 -160 -40 -109 -59 5 -34 -67 -72 -15 298 137 43 159 116 -94 16 31 -64 -268 20 54 208 63
6743 63 143 -64 -33 -18 -57 -118 28 -5 -6 -97 -134 145 -132 4 -81 102 23 172 -84 -82 98 15 -47 -4 92 -154
6769 -154 15 2 112 95 -136 -199 -17 -183 254 -355 -96 -101 -3 117 22 135 -95 -26 204 -249 299 -169 -20
6792 -20 204 -163 150 362 -192 -81 93 -53 49 95 -224 57 -56 -274 276 -60 -1 -121 356 -167 77
6813 77 -195 170 -105 -103 138 -210 -5 22 -110 -118 68 -114 25 177 -4 18 52 35 -230 161 -281 -242 158
6836 158 -334 -144 117 -128 -214 184 71 81 -54 -103 68 -82 -189 141 47 25 6 -208 -80 70 -205 230
6858 230 -139 -172 55 195 133 -141 -121 146 -218 130 33 -59 -78 167 57 54 -36 -305 329 168 -96 -204 107
6881 107 14 -140 328 -69 73 -36 45 21 116 -174 -38 -189 196 -72 -36 70 -96 83 13 19 -144 36 45
6904 45 36 -137 104 210 61 -199 97 125 26 180 1 -68 234 156 -243 -157 254 12 -168 -4 -318 126 147
6927 147 7 40 -132 -373 62 54 57 -94 183 -28 -290 60 159 -41 -40 -20 235 51 186 -155 69 -134 100
6950 100 223 -104 265 27 85 -76 -90 -89 10 -75 -272 -117 57 -89 -179 65 147 -30 81 164 -38 -29 153 -187
6974 -187 -145 -9 52 282 1 -146 52 171 -14 36 -34 118 195 26 9 -118 -27 9 86 -28 -80 21 6 76
6998 76 304 184 -264 81 -154 -148 -122 -380 -142 -167 -60 47 -155 -51 78 -193 80 52 137 132 25 37 134 119
7022 119 65 104 74 -317 50 -44 -76 134 -228 -182 -59 -232 -36 -73 -12 148 76 -171 48 126 -63 19 -3 -229
7046 -229 47 -17 117 -237 -61 -282 -2 77 -202 53 134 287 181 -136 -167 18 -154 -56 -67 -5 82 -47 178
7069 178 -33 -49 75 -132 213 -282 104 45 35 131 -234 -39 92 -52 -240 27 1 -40 -113 -37 202 -181 23
7092 23 176 69 299 121 -54 -163 59 -226 70 -156 298 -83 -115 203 -76 -128 -242 60 139 174 189 -92
7114 -92 -49 -39 80 97 104 -87 -92 -282 74 37 -101 -116 34 82 -61 -94 -30 29 -117 -116 -62 -55 -11 32 -97 105 76
7141 76 242 -87 14 -156 -221 393 -17 224 254 66 26 17 -244 19 -20 37 25 155 -152 -27 -119 246 166 -75
7165 -75 -77 -189 -83 67 158 -33 -28 40 -8 -244 -69 243 84 -161 -106 3 29 259 88 -100 -291 -74 45
7188 45 81 -134 -368 131 -69 -73 -9 35 -56 127 -227 50 48 -263 -132 54 163 218 22 -80 -76 -113 -5 -181
7212 -181 75 1 -57 16 -63 61 217 -131 104 -4 10 4 -151 43 -30 -199 -112 145 -218 -110 122 118 150 56
7236 56 198 -212 179 -82 179 154 -158 -132 2 5 15 -101 -136 255 34 -61 -55 91 -286 -207 -45 177 -164 40
7260 40 10 46 163 297 159 30 -42 113 222 -56 -59 119 206 98 -10 106 18 66 52 -93 303 347 -2 -231
7284 -231 20 64 51 -22 120 -171 -97 361 -125 68 15 -84 -129 162 60 30 100 -63 175 -31 -76 -65 -1 80
7308 80 -43 115 -27 -402 -237 -129 -30 68 -175 57 77 77 -29 38 -143 201 -290 -171 55 -112 -3 6 -206
7331 -206 33 154 235 -103 -56 20 157 -121 21 -84 198 -13 -263 -54 306 102 -52 100 96 -112 144 -159
7353 -159 159 82 -189 -202 -264 -190 -44 79 -103 -271 -219 -255 -267 70 174 17 127 44 -43 74 -107 -178 113
7376 113 -14 -133 -105 158 6 -213 23 42 101 195 -264 68 -128 -57 -264 -40 51 -162 -195 -87 -51 148 -5
7399 -5 -297 -130 -130 62 115 -76 -73 60 30 -185 -87 -160 -53 176 1 42 53 27 61 -80 106 -203 334 -171 -255
7424 -255 67 169 -59 -100 37 -74 146 -318 -243 -41 76 -129 -100 -191 68 50 1 -179 40 -243 17 -96
7446 -96 90 -46 3 -1 -31 83 34 43 129 271 -35 -53 267 -115 -234 -33 -153 -94 72 -20 163 138 98 -73 40
7471 40 -77 192 18 14 233 -237 204 -220 104 -65 -46 -55 128 -155 67 104 -41 141 91 -237 31 44 82
7494 82 -7 49 -27 -103 66 -30 -104 -46 -66 9 266 -76 364 94 -5 -63 49 121 37 -253 -79 108 265 59 -229
7519 -229 309 -22 207 -119 -32 102 -33 168 138 51 -116 -237 76 -3 29 -109 -75 5 39 -18 174 -15 77
7542 77 28 -108 -174 -110 8 -185 67 -110 121 56 -64 -31 37 -80 -131 92 -170 -138 -152 -197 101 159 -2 -178
7566 -178 -226 -275 144 -181 44 52 32 -126 147 -62 -198 86 -22 -66 -119 -134 -152 172 -165 11 -56 74 -93
7589 -93 71 -256 123 109 263 -95 -207 -120 -337 -67 -86 74 -125 64 -35 -8 -77 95 230 0 43 80 161
7612 161 73 276 -4 132 -208 114 -150 -180 11 -202 215 -204 -198 255 0 47 10 -85 -38 99 78 -182 -121
7635 -121 -106 48 -158 -20 -114 -156 4 193 -56 -15 -34 -68 67 52 9 -99 209 179 122 -36 -75 -221 279 16
7659 16 -231 87 117 -138 -164 63 -46 -172 -224 -157 63 115 261 150 -60 -26 64 141 93 250 -86 52 -86
7682 -86 98 354 -21 -13 95 322 -3 -11 212 85 23 225 114 -193 -60 -184 -169 -58 -4 266 74 -15 -88
7705 -88 193 -82 55 174 -20 -200 -59 70 213 76 305 299 143 262 -32 -112 -66 -83 -67 -9 -20 11 -13 -58
7729 -58 171 5 -152 260 -15 11 -114 52 2 10 -79 -155 93 -233 -81 140 22 -211 -6 224 -20 85
7751 85 6 -89 283 -23 36 14 -147 129 206 -80 33 42 -101 -119 -64 -178 -180 -95 46 -25 209 -30 -248 40 14
7776 14 -199 -189 179 -75 15 162 -137 6 148 -71 -5 -95 189 63 13 64 -128 14 163 -49 16 25 165
7799 165 -90 111 -62 -142 -260 -103 -262 -14 137 -142 -95 119 123 -71 -77 44 -145 110 56 -34 81 121 -17
7822 -17 22 -145 121 -55 107 -135 -212 -75 78 -175 -70 7 -72 77 52 -216 -44 153 60 80 -356 220 -56
7845 -56 218 -133 38 134 -59 217 56 130 -170 -68 -14 -391 45 -78 78 155 -70 17 -223 22 126 128 -127
7868 -127 -27 388 91 13 30 -79 117 163 90 87 -226 203 258 -214 36 196 -79 -6 29 280 -86 90 18
7891 18 -143 152 -91 -76 68 -181 -112 -65 12 -128 -110 150 -39 -227 -115 -155 101 -81 50 245 141 61 -45
7914 -45 24 164 323 -77 13 140 -112 -137 -339 282 -8 176 -59 82 -128 -91 -49 251 35 -11 -128 30
7936 30 -283 204 -201 -174 214 -69 -38 164 4 99 -69 88 -256 67 -52 27 127 -214 -19 -1 34 33 -79
7959 -79 70 -52 -26 75 91 57 -327 29 166 -186 -35 -119 74 302 208 228 61 -302 80 192 -275 -228 23
7982 23 12 -67 -83 42 128 59 -381 127 142 -111 43 -7 191 205 255 -62 -79 115 -139 106 -48 -114 190 67
8006 67 121 -50 -119 -26 54 36 130 39 46 15 -31 -37 99 -104 5 -186 -375 -18 -33 -389 -246 -2 -170 24 -226
8031 -226 111 87 203 -91 -62 209 1 -107 -107 -235 -36 -249 59 173 -43 -65 64 -120 3 -94 -97 -134 31
8054 31 -168 64 138 52 -42 137 -99 227 4 -203 -60 -51 163 36 -96 -25 203 -78 -384 -188 -195 -81 -181
8077 -181 184 11 55 268 -40 -24 -107 101 -16 226 173 -99 -20 63 -93 124 -88 35 122 98 223 147 41
8100 41 -79 -135 -98 -169 -170 -230 24 32 -115 -84 -142 -14 177 160 -80 63 -80 -271 21 33 252 -277 -290 -14 283
8125 283 8 206 25 -120 22 156 -54 2 -2 -76 113 -57 91 -124 -131 -77 -84 -49 192 -2 -59 164 -173 129
8149 129 41 60 -12 215 60 104 -5 120 140 -65 113 10 -3 -83 164 158 -43 209 4 26 180 124 -52 106
8173 106 -89 7 108 178 -19 229 106 57 -111 -151 -58 169 -160 -45 219 -95 89 -86
8191h6
$$ Imaginary data points
##PAGE= N=2
##DATA TABLE= (X++(I..I)), XYDATA
0 0 0 0 0 0 0 0 0 0 0 0 0 0 0 0 0 0 0 0 0 0 0 0 2 -7 8 -8 8 -8 8 -8 13 -15 16 -16 21 -23 25 -30 31 -37 39 -45 48 -54
44 -54 60 -66 73 -81 88 -98 108 -120 131 -146 159 -177 197 -220 246 -278 315 -361 422 -498 606
65 606 -765 1023 -1508 2753 -12317 -16437 13230 -1827 -16356 -4185 216 -6342 -1271 -6343
79 -6343 -13365 -1653 6094 -10490 -15882 -5721 -2872 483 -847 -15711 -15091 1639 8087 -718
93 -718 -10869 -11053 -753 8084 7923 -6148 -12880 661 9771 4359 -1683 -6925 -4071 8699 10957
108 10957 -2864 -7623 4230 10154 7541 5068 -3892 -1255 17371 15193 -1094 -2425 2882 9948
122 9948 17836 7166 -9261 -4235 13225 15967 5780 -3622 -8032 2712 18702 10890 -6097
135 -6097 -7367 795 10059 11269 -699 -9539 -4467 6392 7580 -3095 -8694 -5678 -706 3937
149 3937 -2291 -11173 -6784 1421 645 -4927 -8080 -5857 -656 3712 -3032 -12665 -5936 2827 1120
164 1120 -2247 -8606 -10797 141 6469 -1931 -8751 -6841 -1049 3864 3767 -3930 -8071 1258 6690
179 6690 1182 -1703 -2457 -905 5909 3950 -3848 -3904 2942 6012 2198 -3357 -3791 806 8387 5751
195 5751 -5479 -6110 2385 8657 7437 -1418 -8330 -2577 8829 10113 -1088 -8327 -4044 3309 9086
210 9086 4202 -9015 -7407 3385 6893 3181 -3523 -6987 -560 7538 4913 -4530 -5268 1481 4075
225 4075 3684 -1686 -7246 -756 6543 2550 -3470 -5386 -1913 4923 5670 -1691 -7519 -2278 6511 5618
241 5618 -492 -4810 -4785 3108 7722 1328 -5097 -3820 1679 4756 2386 -2083 -4338 517 5122 1278
257 1278 -2640 -645 640 2688 2098 -3161 -2589 2880 4187 -671 -4336 -2535 1526 4657 1876 -6469
273 -6469 -6235 2374 4980 1509 -3855 -7515 -1762 6145 4437 -4064 -7575 -2338 3574 4176 -849 -7382
289 -7382 -5081 3350 3866 -1660 -5311 -4152 1493 4466 -284 -5592 -4095 3110 4755 -262 -3828
304 -3828 -4106 1770 7580 2196 -5209 -4058 1918 6610 4711 -2639 -5518 122 7800 5902 -1564
319 -1564 -3872 -1355 4670 7969 1650 -4542 -1374 3918 5476 2502 -1753 -1847 2030 5120 1851 -2243
335 -2243 -76 2148 2178 1166 -2172 -1958 2771 3207 -1084 -3925 -2091 1764 2464 -231 -4611 -5097 1642
352 1642 4460 -973 -4553 -5238 -1432 3495 1187 -4722 -6308 -1588 2052 217 -3573 -5400 -3073
367 -3073 2700 1531 -4126 -4739 -1454 1977 2105 -2804 -5167 -1463 3850 3289 -2862 -5167 -1751 2892
383 2892 5263 284 -6372 -2949 4353 5897 2084 -3708 -4219 2080 7265 4690 -2525 -3404 1578 5455
399 5455 5788 680 -3960 239 5469 4325 433 -1797 35 3423 4438 1124 -2312 444 4259
414 4259 2949 -8 -1372 -920 3236 3749 -1003 -3358 -1164 2358 3053 -317 -3980 -3577 971 3668
430 3668 -935 -3946 -2905 -637 2332 735 -3598 -3994 -170 1482 -617 -3450 -2963 -1423 817 -90
446 -90 -4316 -3634 547 1148 -463 -3324 -3967 352 3501 1763 -3629 -4216 564 4295 2889 -1598 -4850
463 -4850 -1475 4872 4287 -939 -3874 -2633 2888 5299 1428 -3451 -2822 2998 4796 2159 -1088 -2538
479 -2538 1281 5313 2420 -1660 -1834 1074 3436 2380 -1335 -2809 576 4422 2019 -2068 -2256 -192
495 -192 3106 3943 -1358 -3769 -401 2937 3325 -190 -3330 -2279 1127 3188 -172 -3712 -2112 99
511 99 1711 653 -2842 -2759 494 1741 -390 -2233 -1446 352 630 -553 -2752 -2435 1148 1500 -1732
528 -1732 -3046 -2968 278 2430 -364 -4079 -3455 1109 2989 623 -2251 -3256 -654 4115 2537 -2451
544 -2451 -3439 -765 2677 3245 -569 -3218 -1381 2748 3116 -485 -2284 -1122 1896 3803 853 -2628
560 -2628 -564 3073 3738 724 -2193 -1423 2021 3963 1338 -3124 -2337 1530 3185 2439 -1999 -3890
576 -3890 264 4015 2842 -1228 -3218 -988 2533 3269 199 -3147 -1261 1975 2185 279 -1672 -2132
592 -2132 1261 2047 -242 -1450 -632 1601 1515 272 -1032 -985 2097 2704 -526 -1682 -554 1401 2467
609 2467 13 -2784 -2013 1220 2752 36 -2224 -2059 -22 2510 1288 -2725 -2655 207 1212 1050
625 1050 -1497 -2873 -483 1163 559 -2322 -3297 -489 724 425 -1927 -3778 -882 2307 741 -2123
641 -2123 -3316 -1786 2211 2670 -635 -3855 -2271 2151 3005 150 -2890 -3304 914 3536 803 -2344
657 -2344 -2787 109 2840 2331 -441 -2478 -30 3034 2274 -278 -1046 -155 2342 2353 -76 -1264 485
674 485 2255 2129 -41 -1306 104 2462 3120 28 -1491 342 2447 2714 1113 -1409 -870 2038
690 2038 3013 743 -1350 -1222 878 1895 1349 -1123 -1606 1061 1226 181 -747 -1471 178 1185 -72
707 -72 -1873 -1812 472 1406 -678 -2118 -2502 -339 1807 -486 -2939 -2905 -790 1754 985 -2263 -3562
724 -3562 -1877 1755 1688 -1695 -2900 -2032 584 2194 -392 -3258 -1943 709 1888 552 -2077 -1941
740 -1941 584 2399 967 -1672 -1021 889 1842 1884 -1014 -1387 1369 2987 1631 -725 -1333 635 2682
757 2682 2595 -472 -2151 723 2540 2345 393 -1484 -706 2313 2891 951 -1248 -879 1279 1770 797
774 797 -988 -1186 649 1505 214 -735 -966 455 1258 -221 -1525 -917 591 1007 -787 -2037 -1067
791 -1067 217 1268 -415 -2998 -1903 209 1246 240 -2408 -2700 -385 1367 657 -2080 -2714 -626
807 -626 833 1261 -1058 -2830 -558 1195 1006 -976 -1934 -1148 1094 1181 -346 -2280 -962 1654 1593
824 1593 112 -1422 -1360 1474 2376 405 -1395 -1584 1177 2810 1573 -967 -1883 195 2934 1853
840 1853 -813 -1608 -484 2019 2128 30 -1523 -261 1435 1937 565 -622 -742 1053 1630 -239
856 -239 -857 383 611 1174 8 -1124 -478 1374 1338 -182 -1556 -522 778 1368 393 -1935 -1159 783
874 783 1161 98 -1761 -1674 54 1379 641 -1054 -1720 254 1074 491 -818 -1756 -307 1114 70
891 70 -1071 -1373 -328 1123 635 -1265 -1613 143 1467 909 -1268 -1887 -702 1444 1958 -1004 -2229
908 -2229 -1158 1160 1865 -88 -1979 -1686 554 2231 623 -1719 -1229 0 1810 1284 -1245 -1483
924 -1483 -117 1358 1103 -568 -1081 -156 1142 1225 -501 -1374 189 1404 792 -188 -1067 -107 1562 1385
942 1385 -4 -1118 -358 1105 1541 457 -829 -718 1198 1266 272 -609 -1007 486 1575 499 -529
959 -529 -814 440 905 116 -401 -726 85 1161 -12 -1260 -683 547 969 -37 -1648 -1088 154 1250
977 1250 148 -1656 -1668 -155 1122 936 -1281 -2101 -279 1211 983 -669 -2343 -942 797 1307 -116
994 -116 -2145 -1276 455 1181 -130 -1780 -1564 461 890 372 -1206 -1282 562 932 558 -1168 -1545 -42
1012 -42 1618 489 -900 -1328 34 1756 1051 -779 -1058 -19 1833 1690 566 -373 -314 1568 2171
1029 2171 312 -515 -62 826 1478 620 -214 -209 723 1205 736 -113 350 658 1460 563 -373 119 817 825 372
1050 372 -868 -772 494 925 61 -1253 -1147 218 795 95 -1143 -1685 -134 1028 366 -1118 -1641 -583
1068 -583 853 442 -856 -1374 -1046 504 156 -1050 -1397 -1181 122 270 -784 -1535 -905 579 774 -475
1086 -475 -1222 -1013 670 1418 -142 -1430 -932 331 1349 438 -1199 -1722 84 1438 973 -1070 -1371
1103 -1371 -180 1014 1475 -145 -899 47 913 1259 448 -765 -150 1090 1102 346 -189 32 981 918 254
1122 254 -256 94 1345 869 212 -526 9 1011 1331 318 -404 -582 934 1133 236 -618 -760 -18 1261
1141 1261 424 -791 -595 -275 761 243 -805 -827 -475 443 242 -1168 -986 -112 319 476 -882 -1150
1159 -1150 -2 563 327 -1033 -1595 -601 701 917 -690 -1562 -803 761 942 32 -1571 -1049 565
1176 565 1070 369 -1133 -1081 143 1104 429 -654 -1355 128 1069 208 -150 -612 -37 1225 714 -182 -654
1195 -654 -156 958 588 -100 -697 -71 855 967 -414 -919 -156 825 1226 318 -789 -265 761 1281 312
1214 312 -729 -496 407 1033 410 -433 -85 424 378 586 -156 -299 185 387 273 -739 -279 313 594 -18
1234 -18 -763 -1008 217 881 109 -719 -989 -57 1070 220 -853 -1533 -115 756 401 -569 -1281 -634 554
1253 554 659 -465 -1038 -806 283 899 -214 -826 -1076 52 703 -252 -782 -893 -117 924 241 -926
1271 -926 -757 -101 856 322 -722 -1041 -136 883 1074 -578 -801 -161 358 1264 -35 -790 -130 606 1028
1290 1028 230 -605 -293 585 883 432 -478 -321 467 767 436 160 -14 389 646 364 21 -83 687 897
1310 897 101 -97 -332 438 994 304 -872 -435 384 717 304 -351 -505 81 923 733 -729 -614 -265
1329 -265 343 605 -775 -1175 -154 37 456 -616 -904 -140 -165 303 -530 -1158 -422 173 492 -232 -1110
1348 -1110 -749 35 609 4 -1080 -957 -144 716 207 -890 -969 318 803 495 -740 -1032 -208 862
1366 862 914 -143 -708 -460 411 582 214 -811 -99 496 395 -4 -156 -145 419 881 259 -295 -24 634
1386 634 791 194 -308 105 514 1071 370 -201 -42 409 1005 664 -248 6 376 832 533 -391 -381 29
1406 29 599 477 -173 -735 258 353 286 -434 -556 319 343 457 -485 -1127 -144 442 216 -490 -1059 -700 556
1427 556 239 -666 -806 -830 255 698 -140 -947 -1269 198 638 -259 -805 -1106 -138 480 347 -629 -717 -215
1447 -215 704 490 -350 -787 -131 467 301 -280 -541 -85 523 482 -128 -573 -103 675 708 21 -218 150 818
1468 818 779 429 -299 22 569 581 616 -5 -354 377 668 376 -45 -357 597 300 512 226 -187 558 464
1489 464 205 -8 213 282 372 -64 -153 -261 262 989 238 -353 -661 -88 518 492 -848 -825 191 520 688
1510 688 -499 -874 -585 5 546 -390 -653 -574 149 454 -202 -1076 -375 -15 273 -112 -662 -600 -38 249
1530 249 8 -919 -718 147 478 251 -605 -742 44 633 96 -459 -933 43 621 419 -236 -514 -219 780
1550 780 682 49 -341 -488 368 791 227 -173 -125 346 456 15 78 -15 159 648 67 -214 107 406 699
1571 699 193 -193 44 428 612 402 -285 -328 156 289 391 -325 -471 134 452 552 4 -525 99 511
1591 511 196 -270 -621 -8 438 264 -189 -606 -227 476 362 -278 -516 -264 433 162 -234 -612 -423 358
1611 358 836 -269 -620 -724 246 524 106 -894 -839 137 490 -50 -758 -924 -454 568 234 -542 -606 -247
1631 -247 65 359 -36 -483 -106 123 394 -71 -440 138 -13 673 160 -120 -126 325 288 204 -373 -162 490
1652 490 247 238 -177 -176 424 416 556 -132 -493 385 388 357 -78 -229 408 295 263 -64 -241 -68 198 53 -122
1675 -122 -174 -63 367 46 -276 -249 24 412 75 -213 -353 -345 178 229 -224 -602 -191 -120 649 -413 -970 -447
1697 -447 139 731 -227 -703 -783 -421 188 416 -808 -559 -99 51 225 -534 -686 -328 328 134 -251 -450
1717 -450 -225 294 408 -366 -401 -35 505 245 -90 -335 -60 363 351 156 -412 -282 91 427 311 -285 -262
1738 -262 383 761 116 -7 14 352 772 284 132 -53 259 411 268 -282 176 288 234 410 -228 48 209
1759 209 393 155 -297 -246 140 639 245 -366 -529 134 233 321 -101 -565 -176 137 518 254 -414 -172 136
1780 136 282 -68 -532 -613 281 350 44 -364 -688 -283 552 -103 -572 -695 -195 236 -45 -604 -527 -153 -4
1801 -4 227 -666 -471 -188 279 110 -63 -543 -390 224 206 -267 -397 -169 98 422 117 -358 -81 176 426
1822 426 116 -178 -342 592 481 159 -63 3 546 316 462 -148 92 298 502 10 -99 -188 366 708 549
1843 549 7 -462 76 402 376 -166 -253 306 242 93 -354 -199 -138 298 179 -6 -258 -22 390 364 -254 -216
1865 -216 -35 160 220 -508 -440 -376 130 410 -167 -676 -416 -8 651 280 -650 -613 -67 455 60 -642 -760
1886 -760 -271 60 137 -536 -302 -20 53 209 -223 -297 -106 146 38 60 -245 1 75 217 -144 -161 -201 223
1908 223 207 -19 -40 -44 409 461 -156 2 -234 153 542 346 -58 -208 303 455 300 -211 -350 -3 268 229
1930 229 -180 102 124 183 219 -123 80 255 292 220 -454 -141 206 412 2 -282 -216 46 202 354 -176 -534
1952 -534 -158 298 330 48 -672 -225 -79 351 -31 -610 -583 220 221 -18 -453 -553 119 236 -341 -305 -257 -361
1974 -361 337 -98 -349 -443 -135 176 213 -209 -287 -189 208 115 -207 -422 -209 88 467 -250 -691 -83 154 534
1996 534 -307 -453 -378 168 137 56 -215 -449 -62 241 172 164 -55 79 116 188 -23 -295 115 530 134 65 -3
2019 -3 366 513 -127 42 -81 145 460 227 -23 -227 200 333 34 -24 -311 253 483 148 71 -16 -391 389
2041 389 378 -121 -309 40 -54 300 0 -484 -236 90 317 -78 -559 -232 -75 -97 -194 -506 -309 146 124 81
2063 81 -446 -388 -487 -121 328 -208 -498 -224 127 77 191 -301 -249 0 361 86 -159 -128 203 73 252 -384
2085 -384 -182 -79 106 327 -205 -127 285 197 17 -30 -74 351 331 329 -135 -282 57 390 196 -1 -174 40
2107 40 363 346 -52 -132 16 262 117 21 -50 183 179 77 -412 7 31 115 238 -170 -490 -43 176 204 -91
2130 -91 -166 -202 299 391 0 -318 -381 14 -50 -120 -196 -408 263 244 184 -564 -744 -38 28 100 -329 -556 -407 23
2154 23 44 -160 -94 -68 -149 50 -100 -88 -385 136 179 -140 -403 9 51 407 -124 -473 87 96 14 -133 -209 -174
2178 -174 -25 117 18 53 43 213 182 96 -256 41 136 326 163 -146 -65 242 228 70 141 -59 54 326 246
2201 246 -141 -165 289 625 39 -177 -269 153 438 107 -5 -383 -259 143 266 -77 -264 -14 239 226 362
2222 362 -231 -459 1 297 102 -186 -44 -82 119 115 -98 -343 -32 31 102 -155 -420 -186 106 -85 -16 -233
2244 -233 -126 -178 151 -308 -608 -113 88 97 -124 -177 -378 113 -52 286 -142 -189 246 109 -201 16 -139 241
2266 241 -147 119 89 64 -34 273 141 -11 -254 195 219 118 231 111 167 191 166 -18 -57 163 34 341 -261
2289 -261 -189 -8 412 122 -166 287 -192 276 84 53 -229 -155 -170 16 37 -200 -17 80 143 69 -276 -195 292
2312 292 -112 -7 -137 -168 335 282 96 -155 -201 180 105 55 -444 -224 -76 -8 80 42 -163 -75 362 20 -280
2335 -280 -407 -78 -25 -59 -67 -506 -376 201 144 221 -349 -116 11 -55 1 -27 -300 -17 266 -45 -478 -88 218
2358 218 126 -145 -383 32 -50 254 53 -251 -32 220 181 291 -6 13 99 177 206 -3 -93 323 244 100 -115
2381 -115 238 -6 410 -134 -104 -75 2 90 353 -48 -105 -119 133 83 -91 26 -160 18 296 41 -216 55
2403 55 -153 373 86 -124 -233 -384 212 36 -289 -226 -288 157 129 -49 -213 -137 170 289 -126 -146 -192 -193 141
2426 141 -182 -327 -114 92 -143 -55 -287 -469 115 216 34 -99 -262 16 59 -106 -37 -70 36 -237 107
2447 107 -5 -46 -4 180 157 -287 -293 -15 482 -224 -20 99 114 202 37 91 42 170 340 258 -137 143 121 348
2471 348 91 -153 159 53 129 418 58 -15 -125 381 138 16 -53 108 116 181 186 -312 -180 40 60 -86 -151
2494 -151 -295 -118 -54 57 -153 -234 93 200 -143 -148 -121 -348 6 -131 -194 -214 -267 41 27 -128 -298 -98 -73
2517 -73 122 -57 -102 -190 110 62 -297 -305 -74 -90 -7 104 -323 -192 -180 84 290 -370 -146 145 139 178 -132 87
2541 87 386 210 133 -354 54 385 218 161 -159 230 281 306 8 -52 -23 -107 321 -45 64 3 -152 220 74
2564 74 146 138 216 102 12 -94 -101 82 154 215 -36 -6 23 70 263 -290 -17 -134 -31 410 64 -293 -230 -71 199
2589 199 -103 -146 -181 -59 -91 37 -289 -103 -8 -219 61 37 -300 -242 -26 -38 62 -183 -140 162 -21 77 -322
2612 -322 -62 -119 -114 -78 -90 39 34 392 -215 -185 -238 342 233 251 -73 -151 363 56 76 7 71 -50 405 51 91
2637 91 162 -22 1 -35 -61 -181 115 147 102 157 -256 46 94 92 -54 -54 35 91 153 216 -106 -141 271 62 27 -247
2663 -247 -13 -106 -44 275 -159 -119 182 167 88 41 -395 4 -14 80 -156 -80 -18 289 -190 91 42 -18 109 -192
2687 -192 -103 -194 -240 -33 231 -8 -143 -185 -186 93 -3 -256 -218 -70 27 -68 -272 -210 275 204 123 -145 -192 -26 78
2712 78 -15 -67 -51 -191 75 135 -122 17 43 208 21 -426 -150 148 260 46 -106 43 245 326 376 94 -249
2735 -249 -226 -97 20 -26 -126 -21 147 199 22 -234 84 163 144 -85 -137 -325 50 109 -40 -21 -43 -34 233 -164
2759 -164 71 43 202 -87 -115 -39 -132 -85 108 59 -157 -20 -99 -89 -160 117 -119 -197 -321 81 124 -84 17 -255
2783 -255 -26 1 -274 52 0 41 -119 -266 61 33 187 21 -51 31 -105 54 -74 -222 -199 72 97 -170 -234
2806 -234 -144 284 127 237 -195 7 -38 335 170 95 74 185 419 174 -101 -83 142 169 137 58 33 137 1
2829 1 245 117 -110 57 126 12 -85 -94 -86 67 15 -85 -115 -253 120 -81 144 13 -60 5 -32 73 -194 -153 223
2854 223 84 65 -179 -373 -126 -86 -124 13 112 -160 78 -115 -206 14 -51 -115 -107 -336 -154 -137 -251 -50 -132 -90
2878 -90 -371 -101 182 -51 179 -129 127 14 -230 81 -42 -78 -7 -59 -243 -107 -8 85 6 -176 17 51 191
2901 191 214 179 28 106 104 203 -49 -181 17 198 -36 141 -11 309 93 -61 7 -152 -114 378 -22 72 100
2924 100 214 -65 209 214 -232 -189 276 218 52 -4 -133 -215 183 114 -83 244 -139 160 182 -51 -154 -205 -142
2947 -142 94 -268 24 -73 -83 52 -38 -117 -14 -138 -194 31 -104 21 17 62 75 30 -204 92 62 -308 -349 -87
2971 -87 164 -128 -164 -139 154 102 -121 30 154 -45 -314 87 -47 77 159 -48 101 -139 -127 -14 -107 228
2993 228 200 -155 0 5 7 118 217 -151 -55 425 121 -39 275 274 -7 79 250 64 -59 6 102 30 118 -368 -180
3018 -180 22 217 164 -293 141 -70 -4 -62 -143 240 -247 48 227 -62 108 -18 113 -76 46 -39 130 -3
3040 -3 2 -202 -23 -93 33 52 -280 -152 -288 99 -123 -138 -329 -308 32 -220 129 -110 -133 -386 -130 -395 -150
3063 -150 124 53 -103 21 -44 -210 -24 -177 -7 -119 -68 -57 -36 -224 -118 44 8 -83 -220 -26 200 110 -20
3086 -20 -106 -292 -12 113 335 237 -61 0 155 220 -162 338 -252 66 149 -162 -106 -130 100 226 118 -107 -117
3109 -117 228 152 -83 85 146 -175 -150 54 -278 -26 306 -4 152 -282 -60 -54 -15 29 -216 -57 -205 216
3131 216 81 -301 -26 -233 -216 -125 -33 -44 -242 95 -101 -132 -132 86 154 34 211 -236 57 -250 318 -164 -12
3154 -12 -135 -256 -273 -42 78 -169 -363 237 162 134 24 -164 39 145 -17 -59 112 116 184 41 -98 -59 106
3177 106 30 36 35 135 32 73 95 -230 36 -49 -32 -52 -67 184 123 53 -33 23 274 193 39 17 16 199 18 -100
3203 -100 -5 44 -57 -90 163 149 145 -167 -5 -43 240 -168 -35 -83 33 185 267 -151 -152 251 157 -154 -338 -83
3227 -83 27 -124 -50 95 -63 108 11 26 -230 -194 -44 -95 83 -39 -270 -100 -34 -45 -264 123 -111 -26 -85
3250 -85 -132 -198 -173 -103 140 -7 -203 -55 61 332 -121 -124 11 51 -49 28 -248 55 332 72 102 -174 67
3273 67 -287 -211 -27 -324 -249 101 -100 104 -133 -1 285 29 -59 11 139 52 101 -55 -140 -148 -40 46 143 -6
3297 -6 85 143 263 51 -161 -358 -159 48 -39 -57 117 2 54 -205 -19 122 -84 117 -72 74 -80 -156 38
3320 38 -43 117 -247 -186 -238 -168 -63 38 -296 -292 -172 -49 33 -80 -62 27 -363 -44 86 17 212 -64 -157 -39
3344 -39 -11 11 86 88 33 -145 155 -103 -208 81 -98 -99 109 -47 -55 -192 151 122 78 -56 -116 -45 126 347 -261
3369 -261 -214 124 -66 17 53 -172 189 14 191 -19 -40 130 -251 116 119 -49 -157 107 -39 107 85 -251
3391 -251 53 -116 -201 -525 160 -184 -5 272 -134 -118 -36 -21 -169 -193 -136 11 -191 -278 -43 47 130 134 -76 68
3415 68 -259 -251 240 20 -309 -200 -138 176 203 -296 -178 107 410 222 28 41 418 291 98 173 107 159 254
3438 254 80 -30 4 132 -36 143 -32 -116 -86 146 182 -62 53 16 9 204 -56 101 0 115 87 181 32
3461 32 -196 -76 97 -85 -205 -85 -249 -150 -26 309 64 322 173 6 -228 -86 -41 -113 222 197 163 -21
3483 -21 -463 -194 118 -173 -178 52 207 128 100 -45 -395 -231 -80 4 -100 11 323 -107 -39 56 83 245 49
3506 49 -56 -144 -26 -134 -135 48 -152 -162 57 138 174 -170 141 145 -295 -204 -33 34 73 30 112 -141 -27 188 -48
3531 -48 146 -243 -30 148 311 49 -127 -23 101 146 0 150 109 146 204 0 -58 126 64 180 23 -51 169
3554 169 -92 199 96 162 181 -39 16 61 -66 -85 -31 -112 256 6 42 -22 -238 203 -330 -30 -76 110 131 -38
3578 -38 384 -214 13 -47 -65 -20 10 65 -177 -175 36 -191 117 166 -106 161 125 -27 126 -262 -46 30 -201 221
3602 221 300 -83 27 60 -305 149 -210 -92 13 -80 92 118 -30 -31 162 167 28 518 -45 -15 18 -14 -337 77
3626 77 147 72 106 -193 -48 7 -29 -89 40 -218 -2 216 50 -180 -20 -103 114 324 175 -22 146 64 -44
3649 -44 -107 67 34 42 342 -80 51 169 118 158 110 65 36 348 94 -153 -31 -251 81 -187 225 83 247
3672 247 -121 83 7 -154 -197 -193 -247 231 -65 121 -194 -201 -277 62 -68 -92 346 4 16 -95 285 60 -57
3695 -57 -86 -155 -214 171 22 41 -1 12 144 -31 -12 26 139 -129 -266 -71 -294 -69 -56 -91 -226 88 -111 -143
3719 -143 5 -161 -122 -62 315 83 75 -256 13 -80 92 47 -5 171 98 71 -157 -67 -176 -68 37 21 -36 -143
3743 -143 -181 -147 -67 -39 -239 52 -23 -5 -166 -86 -63 2 -30 -91 26 -215 -119 84 123 22 12 42 178 -46 174
3768 174 -57 62 -64 -78 -208 -188 -148 306 -240 -132 -208 -36 162 -180 52 -87 -89 205 -37 -302 -125 29
3790 29 13 -2 84 59 1 -45 42 -15 85 -24 67 162 124 113 285 412 90 -48 -102 92 192 103 -94 60 38
3815 38 -123 17 53 291 138 -215 -143 413 142 -182 -116 63 -4 -197 30 11 99 -49 -61 -38 73 134 -8
3838 -8 76 76 19 -105 142 -152 33 107 144 -39 -155 20 -222 124 -62 132 49 -249 -227 230 -102 -151 -63 84
3862 84 139 151 17 -14 147 -171 40 -95 -245 3 -105 -260 -4 68 25 -110 467 -39 -109 114 -289 6
3884 6 -63 72 -240 186 273 266 -269 -2 -114 39 373 -60 90 39 27 76 62 -144 -105 13 -113 287 77 69
3908 69 -15 216 -48 -49 85 -8 292 -2 250 -229 309 -22 30 45 -154 49 -58 121 74 57 -102 -196 114
3931 114 -44 193 -68 -68 -94 -72 -5 31 -175 -31 12 -13 13 115 21 45 -112 -228 26 -154 -24 266 47 269
3955 269 -65 -69 31 163 -18 178 96 -14 -38 -10 -18 107 84 22 -94 -180 298 -290 97 261 -66 -26 -198 -171
3979 -171 3 36 -51 -45 -51 135 21 2 231 -39 149 76 -48 -7 133 12 95 55 66 254 -108 81 138 145 -24
4004 -24 -25 340 20 -75 4 -169 14 -37 -183 -42 282 108 142 20 -96 -120 -119 -5 107 -86 139 330 -211
4027 -211 -291 -240 -102 -245 131 -7 -22 2 -32 -21 -63 -109 -206 119 22 -102 -18 -105 -66 -145 -31 -259 96 -230 84
4052 84 -132 30 143 51 66 53 -289 0 140 -109 142 -238 -194 -56 -134 -283 -84 134 246 -23 72 70 -344
4075 -344 -87 59 -3 15 222 -52 33 320 234 177 90 70 68 167 46 98 -86 52 18 32 81 53 -12 150 26
4100 26 -264 255 204 53 39 41 66 223 -99 67 -76 -40 21 163 -143 155 8 -277 64 -26 -16 -26 -65 -119
4124 -119 -45 -53 -221 96 -159 87 -57 -3 -30 -10 -15 -29 64 5 -281 134 -189 -326 174 286 -112 -78 90 -157
4148 -157 0 117 -23 40 -408 112 77 -30 95 -161 204 106 -63 188 19 -112 216 15 115 -97 279
4169 279 47 83 196 -93 15 -67 228 33 147 122 247 -3 -77 -188 194 182 -265 -203 -91 118 -160 91
4191 91 -80 155 -79 118 -46 99 -140 9 -69 -174 163 -158 -28 122 -3 23 -149 -10 38 93 -27 88
4213 88 -253 100 -138 -35 110 -207 -190 141 -140 -156 101 15 -99 201 86 -135 9 39 -113 117 -36 14
4235 14 27 -64 -92 426 -340 68 -75 258 -97 -83 464 80 -215 42 84 50 -8 97 67 -11 7 273 143 28
4259 28 -101 63 48 205 93 58 113 -206 23 -1 265 150 134 224 -112 -37 18 313 -103 186 77 3 161
4282 161 -8 290 -147 -353 -139 -68 -154 -116 243 60 168 75 -101 -176 -142 1 -83 -254 -193 -113 61 63 2 -203
4306 -203 -47 -88 111 -74 -247 -145 60 38 -110 -29 -80 -96 167 -238 -50 70 -209 2 28 -38 158 422
4328 422 84 -143 108 -3 93 215 -132 -137 129 44 45 -131 224 -62 -133 -101 114 -22 -26 -17 52 -5 -146 63 -205
4353 -205 240 -43 33 -28 -81 29 130 80 143 -29 94 152 21 166 108 281 -335 -23 55 128 123 61 -146 -81
4377 -81 196 -39 -34 -231 173 72 82 -36 116 -20 -355 -170 45 205 -27 120 -117 -236 -203 -24 -82 147
4399 147 -94 -43 -90 101 -212 -125 374 -35 18 -196 220 -120 107 -285 -79 24 100 35 -131 29 -13 85 120
4422 120 117 68 135 -36 -8 -172 26 55 41 -18 48 155 -201 165 199 97 163 114 295 -84 -359 -30 55 339
4446 339 117 -50 -14 71 -100 300 -88 -90 92 -19 -10 -101 25 66 331 -6 97 -6 -181 -36 -59 258 72
4469 72 70 -117 -1 -64 -134 54 296 24 -258 146 -71 -13 -79 27 -118 114 20 80 -103 -272 -136 124 -89
4492 -89 -120 235 -116 -210 -82 -122 -99 -49 -179 -132 -160 55 61 -99 -123 -317 39 -156 -106 100 66 63 -149 -173 4
4517 4 60 -132 -100 174 119 -85 -119 72 -10 -91 -105 239 -7 222 -51 -123 114 78 140 23 17 -37 -139 -37 -29 -27
4543 -27 134 -137 93 -42 229 -227 -3 100 302 91 133 -141 138 -3 -179 -189 207 -4 -63 -148 59 76
4565 76 -7 182 40 -62 -372 -16 -31 226 -166 -88 -209 108 -16 -40 -68 57 -49 212 -335 -321 -2 -129
4587 -129 -39 -121 -243 -21 -41 -195 -107 -209 -76 6 -198 20 -135 17 -80 -120 -49 -63 35 -77 143 48 114 -157
4611 -157 113 60 -235 96 -21 76 -258 54 252 177 30 96 -219 -234 102 33 63 125 364 37 264 80 -56
4634 -56 167 118 140 -179 265 -32 124 -75 47 -34 118 188 -50 -1 214 -24 106 147 -147 -143 -98 41 -295
4657 -295 -78 -24 -26 -146 -39 -41 -42 7 -32 -162 -224 -256 92 -78 -143 125 -46 61 -67 -66 65 -50 -3 32 -80
4682 -80 36 9 -78 5 -45 31 98 -173 35 88 257 105 62 -278 149 -167 -2 -193 191 95 -121 -41 164 363
4706 363 -124 102 29 -21 -265 180 -179 299 -64 111 215 210 219 -152 39 45 146 -29 192 -19 -44 63 393
4729 393 213 -143 129 175 301 106 1 -90 13 65 -126 -251 -174 266 -23 -151 -103 240 18 149 22 32
4751 32 -20 112 -134 -172 -6 -163 -132 -148 -8 -40 -227 -118 -20 -2 92 -268 30 -200 -102 -305 -89 -85 217 -139
4775 -139 -155 -452 278 140 168 -47 21 -67 -115 -34 -165 -19 -158 -29 32 106 41 14 0 13 100 83 189 77 9
4800 9 235 81 -41 314 260 24 247 80 -29 297 -76 156 179 35 51 21 157 -159 53 -83 28 219
4822 219 -187 48 174 -238 -88 -60 188 -41 -183 -41 -191 231 59 69 -7 49 76 -10 -135 57 -33 29 235
4845 235 -14 242 49 -119 35 97 -117 -29 -201 -70 162 -253 38 -133 -108 -109 -157 -215 -33 55 5 -38 -196
4868 -196 -69 -80 -59 -259 -301 61 131 -17 11 -9 -176 104 358 -235 -7 -16 88 -139 195 16 202 60 228
4891 228 190 123 198 -109 -44 -91 24 309 -127 148 -110 -36 -55 163 76 106 -26 209 24 -177 4 76 90 92
4915 92 2 -63 -163 -190 13 -214 -61 80 -83 69 -286 -36 302 115 -153 -4 -128 20 -8 -43 -153 -178
4937 -178 40 17 -299 -55 -283 -113 41 -126 -135 -80 -18 -153 85 100 -113 87 -167 20 132 57 25 10 -513
4960 -513 221 -63 45 -42 123 305 211 -263 23 121 -224 -88 -209 5 -78 -201 95 -17 -49 -112 -9 17
4982 17 306 174 -40 247 -127 57 -21 123 -4 -24 49 202 -36 135 -117 202 160 514 -216 130 11 -153
5004 -153 134 -90 94 180 -186 -59 -148 23 54 45 -56 -117 44 -95 -85 -107 -184 91 40 138 -119 -90 -114 -37 -25
5029 -25 38 -195 -38 143 -3 -90 -29 62 23 -53 181 -53 274 121 58 -69 -255 96 143 1 -160 -186 45
5052 45 303 -70 35 169 -154 166 -248 -212 -152 363 61 -188 11 100 -31 -35 -239 -26 18 -23 42 53 43 -118
5076 -118 49 13 -215 -150 152 -148 324 -116 44 -145 322 35 -163 21 -147 165 -60 -71 118 115 -178 -87
5098 -87 381 153 33 18 -274 -93 238 -183 -136 51 26 -261 0 -74 -187 -8 97 44 -285 -120 23 -86
5120 -86 235 -35 -104 -298 -111 34 -86 -188 -204 -11 3 231 70 256 200 59 -140 104 92 -121 6 -43
5142 -43 -12 105 -62 -12 112 134 -90 -233 -23 196 -116 156 25 -59 151 26 -144 13 159 -77 -181 136
5164 136 270 22 289 283 -235 -222 127 248 16 275 -184 28 -42 68 182 118 -234 28 131 -141 -60 72
5186 72 -113 -248 49 103 171 -75 -27 64 -18 -294 -114 203 -56 106 105 -33 -37 -115 -335 -174 -16 -3 -100 -55 -200
5211 -200 -244 116 27 238 -186 -116 -11 -24 -71 35 137 -48 -16 -13 -3 157 -122 -100 -79 -37 61 -284 79 -120
5235 -120 -87 19 -153 7 136 121 165 -63 233 -207 95 137 -20 -105 44 399 54 -469 -175 -227 99 171
5257 171 -69 -65 -119 168 75 -202 117 80 -256 -28 -75 148 -67 -92 7 -242 -13 178 62 -125 -194 -121 -107 26
5281 26 -68 -146 163 -6 -115 14 -287 11 -26 -49 12 60 125 -125 -122 137 -109 -2 163 -213 115 -8 0 257
5305 257 -36 -353 -213 -140 65 -200 122 91 -8 37 -43 176 269 24 90 -35 4 -170 66 77 68 107 226 20
5329 20 120 59 -70 56 297 -291 -68 134 99 25 -41 32 141 -55 76 6 -70 -81 -136 81 54 77 180 148
5353 148 -144 97 7 277 92 56 -99 120 256 -37 -331 167 -143 -145 44 -46 208 244 90 -266 255 -19
5375 -19 75 -107 -66 -82 -58 -103 70 -75 -53 -144 -7 -105 181 -81 78 -154 -176 92 -61 3 -38 283 -56 71
5399 71 201 -42 -97 -240 15 -129 -46 -56 -76 176 -106 359 51 164 -305 -68 -95 89 149 59 61 -162 31
5422 31 -14 -153 47 73 17 17 -67 206 156 210 -8 -62 -69 -40 206 -204 148 -117 233 229 35 -27 84 -54 -101 -141
5448 -141 50 -5 203 -6 127 102 124 164 -63 56 28 153 -67 35 35 -8 20 -24 -76 -4 -276 219 -90 95
5472 95 -146 123 -128 -389 -152 -229 -156 193 -3 59 224 -13 -91 354 -70 -11 92 30 195 -69 213 -284
5494 -284 307 210 87 -57 -51 -105 -44 98 -223 33 -110 202 120 -35 -100 -34 122 101 201 -16 -48 -17 -327 -123
5518 -123 197 180 143 131 38 97 -164 24 125 252 76 34 21 7 -169 73 -35 134 -60 213 315 -85 146
5541 146 211 -68 -120 45 -147 -81 -63 139 177 -139 -71 -107 -59 -180 -121 6 -67 55 12 17 -153 72 -472 -189
5565 -189 -138 -296 -35 -20 -31 145 79 120 -93 31 256 -78 -259 -14 39 -234 163 -134 -136 141 108 -134 278
5588 278 150 -22 69 -51 82 -49 -136 -104 21 37 74 100 -208 87 157 17 336 54 -4 -181 -135 78 23
5611 23 -83 -206 86 136 15 150 55 -151 107 82 200 90 79 -75 -8 90 -180 171 -73 113 -118 -93 187
5634 187 -43 -172 -193 124 11 133 217 62 168 234 141 -113 27 -158 -217 76 43 -127 -172 37 -180 -208 -93
5657 -93 63 16 -97 -72 -168 -208 -37 -47 -27 16 99 51 216 -81 -232 -29 124 230 -158 -67 -138 -19 -2 -129
5681 -129 33 -269 168 315 -100 18 146 -32 97 -75 -107 35 -87 42 23 166 82 -59 109 -25 -92
5702 -92 -180 138 -86 229 6 -229 425 -28 65 95 -15 251 72 -119 324 -146 171 232 200 246 -192 -145 -27
5725 -27 -146 -227 234 -194 -285 122 -60 11 -123 98 -221 -176 59 -97 -349 34 154 -12 -270 -221 16 -157
5747 -157 46 92 62 -13 -17 54 39 -101 -249 47 368 272 -154 28 43 -148 -109 -283 223 -137 66 -150 204
5770 204 -75 -66 -254 -331 -183 125 -9 -66 -238 -149 -66 258 79 93 -44 -118 -42 102 -1 95 -150 -44 197
5793 197 30 -80 12 -59 11 53 77 9 283 35 -112 -10 -87 -71 92 112 -204 49 -126 -10 37 -209 -102
5816 -102 -128 -81 19 -183 -262 -65 142 -26 -76 34 286 -12 77 -29 143 -221 -76 -96 177 -347 50 -28
5838 -28 -65 -123 -193 -256 -75 -22 64 294 -110 -95 -183 48 -295 189 -179 14 119 33 -145 -291 150 15 -15 24
5862 24 192 -27 -21 -214 268 -13 128 -20 142 227 121 -156 -100 236 -212 -210 29 77 -151 -56 -163 105 46
5885 46 -298 -93 -58 288 20 128 15 166 72 -139 205 26 121 110 111 4 -98 -109 -58 -105 216 -26 -181
5908 -181 63 -16 -10 54 -27 129 -59 128 263 -108 -22 65 -70 -373 -193 -361 -76 -122 48 227 -26 213 51
5931 51 -306 27 -9 96 53 33 145 168 137 27 -62 -63 -191 -131 -119 0 48 122 68 -91 27 72 8 162 -119
5956 -119 169 215 -176 183 86 -64 142 146 91 -73 52 9 141 -72 167 82 -24 72 -408 115 282 -237 34
5979 34 -41 4 171 -184 91 95 83 383 -315 210 376 30 46 -3 -41 129 115 64 158 79 -31 -92 138 29 -97
6004 -97 88 -230 181 76 200 2 -16 -97 -166 -136 1 -26 -30 -176 -131 73 165 -227 37 335 -117 187 -382
6027 -382 148 -175 27 -108 137 9 265 69 -103 -137 -101 -52 -136 4 -150 -136 27 -14 205 7 -98 187
6049 187 21 127 10 67 -57 -121 -229 -93 165 93 -13 -6 366 -86 -73 -27 109 37 -84 -31 110 11 31 195
6073 195 167 71 229 10 185 73 -133 131 -48 128 -188 -19 -213 -135 -11 134 -93 198 104 38 277 -52
6095 -52 42 -168 -75 30 88 13 101 -154 -38 -227 -201 25 85 -153 38 83 -20 -30 -62 51 -247 430 114 -83
6119 -83 -128 200 -6 28 310 42 47 -69 181 -7 105 113 -6 196 126 -26 171 -97 107 12 119 -42 103
6142 103 236 133 -151 300 -77 -218 -180 153 147 2 222 313 -10 -83 22 -62 -134 122 136 -4 46 4 16 -137
6166 -137 -147 -61 -54 76 82 132 91 94 13 -325 -62 -377 51 65 135 -10 75 -116 177 72 226 -9 49 -61 -121
6191 -121 142 163 -104 45 -68 197 141 70 -125 0 -73 106 -26 -6 60 8 91 135 20 -96 -25 -81 96 -173
6215 -173 328 -169 -13 -56 377 186 64 118 -41 -28 167 265 240 84 164 201 -169 347 190 243 440 -115 91
6238 91 155 64 81 -38 244 29 185 -89 120 -182 -60 58 144 -58 107 198 58 -21 69 -39 150 57 8
6261 8 40 -275 -42 220 -1 454 -108 -107 -12 6 119 -97 127 123 -19 -300 124 183 230 -125 -149 -115 282 -12
6285 -12 16 -168 -82 147 264 -142 296 -236 -181 -30 -78 85 -146 76 -178 -63 -86 142 -44 89 74 32 28
6308 28 -181 111 -9 151 363 314 -114 -14 -212 33 -166 145 -41 -173 61 -35 179 57 -75 73 -229
6329 -229 -45 -236 130 75 276 205 60 109 84 75 173 -95 -107 -94 113 394 -139 -25 16 62 -189 126 76 -20
6353 -20 -35 -144 94 -113 -26 -148 -2 198 28 -36 -154 38 -162 -272 -125 -99 -86 -34 -52 296 -52 -65 19
6376 19 -159 -81 -327 -212 -33 -144 -174 120 118 288 -18 -276 45 263 -73 162 98 -259 -55 126 -119 355
6398 355 72 -352 203 -114 102 -85 -29 -79 -57 -185 101 168 344 51 -143 -155 149 87 -21 139 150 -29
6420 -29 -8 108 -79 -204 -95 287 -22 173 50 -184 -37 -151 -25 -55 -54 -69 -117 -7 162 -119 42 -46 -105
6443 -105 78 -287 103 34 -3 -23 -62 -39 152 -376 -262 11 -134 13 50 140 -132 -89 84 112 -12 -12 182 76
6467 76 -46 26 40 -176 -88 29 49 -53 135 474 133 214 1 -124 -229 -69 25 -150 -319 69 87 -126 -68
6490 -68 61 -96 -91 3 100 -140 -313 -131 -132 54 17 -39 -89 29 149 45 146 -31 45 -141 285 40 -122 -195
6514 -195 -84 15 61 -35 216 -106 1 47 -114 153 171 -4 138 -114 -85 101 60 82 116 -241 -43 -34 175 55
6538 55 10 55 232 -45 197 21 24 -46 -162 18 -115 -6 89 -102 -28 65 -5 286 -105 -81 35 -1 -64 -45 7
6563 7 -39 12 55 -149 -275 56 31 -78 9 -23 -54 -47 -78 -233 101 138 104 18 96 -162 241 119 -73 -18 180 237
6589 237 83 -96 -61 125 25 -26 213 185 170 218 -97 15 -46 21 -13 -84 -189 -117 63 39 96 173 108 14 33
6614 33 -135 -251 351 62 152 104 119 -104 -67 102 344 -149 -1 -116 -133 -120 -36 218 43 215 35 188 -80
6637 -80 -241 -66 90 158 -261 -187 165 45 -121 212 -8 213 -219 -191 -48 -170 103 -211 93 91 115 0
6659 0 -30 -96 -90 -98 -82 -166 -34 2 142 -124 116 180 -72 -30 -50 372 234 16 31 -19 -112 49 87 62 -208 -27
6685 -27 153 93 55 135 46 112 -1 11 79 -24 29 -119 -99 11 83 309 4 80 45 -147 78 18 -18 -81 -54 -83
6711 -83 16 23 130 33 -217 -63 -138 -218 118 -31 -73 -20 -173 -108 181 55 25 -139 -226 53 -270 -12 191 -162
6735 -162 40 -69 136 -13 42 17 -134 -42 -37 -91 -105 19 43 -59 -145 -115 -312 -116 89 243 42 -211 -266 212
6759 212 -104 17 -2 -158 224 152 -201 -21 44 186 -71 -108 207 -9 -115 -31 -149 98 48 65 40 -288 140
6782 140 -93 79 -22 -38 5 143 66 -4 422 147 119 -7 252 263 75 -75 398 180 -145 82 -75 78
6804 78 29 -67 -294 -105 13 -45 12 146 33 -198 -72 144 46 151 157 -279 24 -160 -414 163 -115 211 90
6827 90 79 -23 -116 41 -111 -109 -44 1 -70 -148 -42 -38 92 -234 96 -37 16 92 -40 -165 -153 301 153 -101 -92
6852 -92 -57 -92 -130 185 192 -164 -31 107 77 -60 127 146 300 67 237 207 -135 -12 83 -86 213 -185 247
6875 247 -31 299 95 36 4 -39 124 -14 221 -73 -19 188 76 168 140 4 -29 160 -73 -117 137 377 -115
6898 -115 -194 -217 -5 -158 -38 10 -59 116 93 -253 -24 -129 -68 -113 56 163 -46 27 78 7 -81 -199 128 5
6922 5 64 -143 10 -206 -6 -125 -19 -77 44 32 123 -44 -111 229 269 -44 -48 -84 -26 -85 -46 20 12 182 -110 181
6948 181 -54 -48 -286 23 -137 -137 46 73 61 404 64 63 -128 71 126 211 46 115 108 -60 13 124 -79 -96 16
6973 16 203 -105 -62 55 59 -233 176 71 67 -137 13 -18 -259 155 96 -55 -89 -124 67 14 96 -35 -103 -194 -146
6998 -146 196 119 -150 -29 -155 51 138 64 35 -286 -219 166 124 96 -155 -122 31 202 -38 134 -49 18 174
7021 174 -34 58 -57 34 -67 15 -104 -65 -41 -21 4 18 -263 79 -342 250 124 176 75 141 0 -164 248
7044 248 -12 0 61 -114 23 37 46 -15 -115 -50 -29 90 137 230 71 348 -63 234 106 44 -130 115 25 -79
7068 -79 184 -114 -10 -17 -137 190 157 335 -26 53 44 251 177 -74 151 -94 123 -143 105 -54 -50 -67 -15 -75
7092 -75 28 -251 8 -164 -120 -156 132 -154 -253 22 32 129 -139 -282 -137 -218 -117 -90 249 -266 61 8 -69
7115 -69 -35 39 32 155 -262 -35 40 33 -72 -248 -21 61 88 -200 97 63 34 113 -90 90 148 -94 -29 -146 194
7140 194 -149 100 2 252 -167 153 -146 56 256 -229 77 176 56 -79 -59 -41 10 30 128 -61 64 158 74
7163 74 -108 -37 145 270 -125 86 24 -48 -160 -197 124 -51 -288 284 66 50 167 33 98 -128 203 -111
7185 -111 94 -32 174 -82 -98 -247 -172 -180 -151 38 -119 323 113 -117 -174 -44 165 -2 77 -125 181 3
7207 3 168 -95 89 -17 -65 109 -178 -118 -179 -207 -188 -184 -241 166 -189 -59 113 190 74 -144 173 -46 -115 -12
7231 -12 -186 107 -5 -61 107 -40 89 -212 161 -41 57 -105 -2 64 155 -34 -191 -96 40 97 9 29 -98
7254 -98 -5 15 83 -237 298 83 -106 -276 -205 4 -5 115 142 69 -168 -301 -132 -186 63 68 131 231 -77 -170 -168
7279 -168 50 -69 277 31 -162 213 100 -38 274 -194 -125 -72 -35 -222 -195 98 69 -156 -47 16 78 72 22
7302 22 124 62 -262 -123 101 239 77 6 16 -74 218 236 -41 -74 -137 -329 106 70 -182 -174 -6 -373 53 50
7326 50 -88 -165 9 -22 24 359 -210 176 -189 112 17 28 76 -332 176 -180 62 -126 151 -55 -115 -102 15
7349 15 95 -78 145 42 -97 56 -63 -219 98 -209 61 183 -25 -176 2 -110 -301 -62 90 339 8
7370 8 -21 -209 -110 204 19 4 149 43 112 -154 1 24 326 46 90 -39 2 21 -66 175 -11 45 100 -112
7394 -112 -10 49 116 58 -41 139 -230 124 107 -33 90 -141 -5 -251 -93 161 -67 -125 254 14 217 -198
7416 -198 -91 4 -197 -52 -37 -157 -160 -224 -64 -65 228 -314 -147 -12 -52 69 -88 239 40 -43 38 -11 111 13
7440 13 -42 -45 68 -31 -25 89 -187 121 -191 -21 -380 -26 49 60 -122 100 163 -30 104 -80 -253 -23 29 84
7464 84 -69 44 169 -57 142 191 -110 -29 137 -112 -108 135 51 -31 -23 240 30 -42 126 -36 196 -61 -35 -54
7488 -54 -8 176 -46 54 166 105 61 108 265 -16 -3 144 175 51 -50 314 23 -33 48 38 130 48 -148 49
7512 49 43 75 -115 -36 232 117 186 252 -224 -129 64 122 73 -20 -1 -21 371 -46 -88 201 8 -12 123 -104 212
7537 212 -16 -27 -248 55 -215 -166 -129 -20 -31 -23 -26 140 -264 59 94 -301 50 -69 -28 -107 195 95 71 95
7561 95 -219 -276 -371 -241 31 -179 177 -72 139 -170 137 -184 163 129 -72 114 53 62 90 8 288 -134 -327
7584 -327 233 -150 37 -35 -54 -21 96 274 -61 353 269 57 111 -331 -195 50 394 207 -76 100 -101 236
7606 236 -100 -168 66 -246 395 106 112 -104 118 -175 189 -198 240 89 -71 -37 26 -27 -85 2 -1 37 -66 -45
7630 -45 -78 0 67 -110 -28 111 -43 -167 -70 -20 17 82 -5 2 245 -30 -217 -113 87 35 18 48 -132 -55 -120 93
7656 93 77 59 250 -207 60 37 -78 120 35 415 137 33 191 58 34 -66 -11 168 -1 59 -19 21 17 196
7680 196 208 62 153 20 223 -122 -1 -175 -24 18 -138 -125 283 -108 467 -111 -46 172 -25 -90 -301 -45
7702 -45 41 -63 -79 -17 93 -28 233 193 98 282 -128 -53 -54 -32 55 58 130 -261 -89 24 27 103 -92 -125 10 -75
7728 -75 216 145 -162 135 -155 135 -83 3 -118 8 57 105 209 293 -171 123 -18 -38 -66 50 53 -330 -147
7751 -147 178 106 -13 238 -39 248 14 -10 44 -28 205 141 109 112 -201 37 -188 -37 63 19 -69 216 235 110
7775 110 90 -87 43 104 -212 308 -75 116 -107 -120 188 -277 28 -5 92 -157 62 125 113 91 -103 113 194
7798 194 150 -208 23 -138 261 -62 30 121 -147 76 86 -53 -132 -9 -347 121 106 122 -42 -7 -68 -127 -12
7821 -12 -33 119 119 244 152 -9 -209 -46 -131 -137 65 121 -58 -100 77 -77 -150 -4 131 -151 -87 283 73 131
7845 131 -10 -193 42 -59 112 -114 -14 98 -87 -200 -137 10 6 144 -56 175 60 153 -181 -218 -283 -144
7867 -144 -64 -82 166 36 -99 -157 139 -123 -90 46 -312 -105 -11 -34 117 -142 -71 102 -14 87 21 -106 45
7890 45 -4 74 199 156 -192 -187 263 194 210 -97 -55 84 200 37 -164 108 1 237 110 -149 101 -457 -44
7913 -44 -109 -157 -111 258 58 98 -40 213 -171 -26 9 -39 142 -29 75 57 68 88 -8 52 180 48 169 156
7937 156 50 -106 148 -1 14 117 26 -16 -52 38 -24 89 124 -195 -38 -49 -48 -47 -49 -69 -94 149 -184 -130 150 34
7963 34 41 316 200 -258 -182 -39 96 127 141 64 18 262 153 21 -10 45 146 -175 -25 -15 99 -243 121 152
7987 152 -250 53 26 48 210 -26 -84 224 272 126 -204 -67 -150 -89 -26 149 -110 -21 73 112 43 -116 -14 134
8011 134 103 -146 5 42 89 -57 41 71 -36 -4 -88 -206 -84 -43 195 -82 -244 53 -87 167 155 -152 134
8034 134 -256 -36 60 -33 -308 -58 -29 -190 26 -21 -81 -21 155 -289 -15 -3 -96 -20 -318 9 251 321 -199
8057 -199 -65 269 134 63 -167 -138 -127 1 -185 195 -117 38 -134 -126 68 -309 109 82 -255 57 127 24
8079 24 219 -145 -135 6 13 -61 14 73 101 -57 -23 120 -187 3 165 263 -247 -103 -125 196 -124 59 9 -23
8103 -23 65 -33 144 -19 -53 -75 -289 -141 -13 224 -23 -28 189 43 -2 -12 49 265 56 120 22 -21 -102 -85 156
8128 156 54 -3 -165 -99 139 -115 117 -18 46 -13 -81 220 27 128 -234 32 153 208 -25 -114 -214 -225 -75
8151 -75 15 -177 19 253 -107 239 18 317 -177 -268 -30 -253 -145 62 129 118 184 401 22 -31 21 -104 60
8174 60 -54 -193 -261 -3 144 -219 -69 -99 -117 57 122 130 68 97 78 -152 -185
8191a85
##END NTUPLES=NMR FID
##END=
