##TITLE=1H_SA_61_Clean
 CDCl3, 8 sc, 
 23.08.2021
##JCAMPDX= 6.0         $$ Bruker NMR JCAMP-DX V2.0
##DATA TYPE= NMR FID
##DATA CLASS= NTUPLES
##ORIGIN= UXNMR, Bruker Analytische Messtechnik GmbH
##OWNER= root
$$ XWIN-NMR		Version 3.5
$$ Mon Aug 23 13:11:34 2021 Russian Standard Time (UT+4h)  she@DPX200
##.OBSERVE FREQUENCY= 200.131506
##.OBSERVE NUCLEUS= ^1H
##.DELAY= (6, 6)
##.ACQUISITION MODE= SIMULTANEOUS
##.ACQUISITION SCHEME= undefined
##.AVERAGES= 8
##.DIGITISER RES= 18
##SPECTROMETER/DATA SYSTEM= spect
##.PULSE SEQUENCE= zg30
##.SOLVENT NAME= CDCl3
##.SHIFT REFERENCE= (INTERNAL, CDCl3, 0, 15.7039)
##AUDIT TRAIL= $$ (NUMBER, WHEN, WHO, WHERE, WHAT)
$$ ##TITLE= Audit trail, XWIN-NMR		Version 3.5
$$ ##JCAMPDX= 5.01
$$ ##ORIGIN= Bruker BioSpin GmbH
$$ ##OWNER= she
$$ F:/spectra/data/she/nmr/H-F/1/audita.txt
$$ ##AUDIT TRAIL=  $$ (NUMBER, WHEN, WHO, WHERE, WHAT)
(   1,<2021-08-23 13:10:13.00 +0400>,<she>,<DPX200>,
      <created by zg, POWCHK disabled, PULCHK disabled
       configuration hash MD5:
       00 E9 B6 7A A2 85 ED C7 34 08 36 98 17 FE 4E 26
       data hash MD5: 16K
       D6 7C 4A 7E 66 E9 DF AE E2 E4 2C 8C 30 EF 4D E4>)
$$ ##END=
$$ 
$$ hash MD5
$$ 1C 42 77 83 83 C0 4C 40 19 D1 30 28 B2 6F 51 D2
##$RELAX= 
##$RELAX= 
##$RELAX= 
##$RELAX= 
##$RELAX= 
##$RELAX= 
$$ Bruker specific parameters
$$ --------------------------
##$DU= <F:/spectra>
##$EXPNO= 1
##$NAME= <H-F>
##$PROCNO= 1
##$TYPE= <nmr>
##$USER= <she>
##$AMP= (0..31)
100 100 100 100 100 100 100 100 100 100 100 100 100 100 100 100 100 100 
100 100 100 100 100 100 100 100 100 100 100 100 100 100 
##$AQSEQ= 0
##$AQ_mod= 1
##$AUNM= <au_zg>
##$AUTOPOS= <>
##$BF1= 200.13
##$BF2= 200.13
##$BF3= 200.13
##$BF4= 200.13
##$BF5= 200.13
##$BF6= 200.13
##$BF7= 200.13
##$BF8= 200.13
##$BYTORDA= 1
##$CFDGTYP= 0
##$CFRGTYP= 5
##$CHEMSTR= <none>
##$CNST= (0..31)
1 1 145 1 1 1 1 1 1 1 1 1 1 1 1 1 1 1 1 1 1 1 1 1 1 1 1 1 1 1 1 1 
##$CPDPRG= <>
##$CPDPRG1= <>
##$CPDPRG2= <>
##$CPDPRG3= <>
##$CPDPRG4= <mlev>
##$CPDPRG5= <mlev>
##$CPDPRG6= <mlev>
##$CPDPRG7= <mlev>
##$CPDPRG8= <mlev>
##$CPDPRGB= <>
##$CPDPRGT= <>
##$D= (0..31)
0 1.2 0 0 0 0 0 0 0 0.06 0 0.03 0 0 0 0 0.0002 0 0 0 0 0 0 0 0 0 0 0 0 
0 0 0 
##$DATE= 1629709812
##$DBL= (0..7)
120 120 120 120 120 120 120 120 
##$DBP= (0..7)
150 150 150 150 150 150 150 150 
##$DBP07= 0
##$DBPNAM0= <>
##$DBPNAM1= <>
##$DBPNAM2= <>
##$DBPNAM3= <>
##$DBPNAM4= <>
##$DBPNAM5= <>
##$DBPNAM6= <>
##$DBPNAM7= <>
##$DBPOAL= (0..7)
0.5 0.5 0.5 0.5 0.5 0.5 0.5 0.5 
##$DBPOFFS= (0..7)
0 0 0 0 0 0 0 0 
##$DE= 6
##$DECBNUC= <off>
##$DECIM= 32
##$DECNUC= <off>
##$DECSTAT= 4
##$DIGMOD= 1
##$DIGTYP= 9
##$DL= (0..7)
0 120 120 120 120 120 120 120 
##$DP= (0..7)
150 150 150 150 150 150 150 150 
##$DP07= 0
##$DPNAME0= <>
##$DPNAME1= <>
##$DPNAME2= <>
##$DPNAME3= <>
##$DPNAME4= <>
##$DPNAME5= <>
##$DPNAME6= <>
##$DPNAME7= <>
##$DPOAL= (0..7)
0.5 0.5 0.5 0.5 0.5 0.5 0.5 0.5 
##$DPOFFS= (0..7)
0 0 0 0 0 0 0 0 
##$DQDMODE= 0
##$DR= 18
##$DS= 0
##$DSLIST= <SSSSSSSSSSSSSSS>
$$ [...]
##$SUBNAM2= <"">
##$SUBNAM3= <"">
##$SUBNAM4= <"">
##$SUBNAM5= <"">
##$SUBNAM6= <"">
##$SUBNAM7= <"">
##$SUBNAM8= <"">
##$SUBNAM9= <"">
##$SW= 20.0188882624521
##$SWIBOX= (0..15)
0 0 2 0 0 0 0 0 0 0 0 0 0 0 0 0 
##$SW_h= 4006.41025641026
##$TD= 16384
##$TD0= 1
##$TE= 0
##$TE2= 300
##$TE3= 300
##$TEG= 300
##$TL= (0..7)
0 120 120 120 120 120 120 120 
##$TP= (0..7)
150 150 150 150 150 150 150 150 
##$TP07= 0
##$TPNAME0= <>
##$TPNAME1= <>
##$TPNAME2= <>
##$TPNAME3= <>
##$TPNAME4= <>
##$TPNAME5= <>
##$TPNAME6= <>
##$TPNAME7= <>
##$TPOAL= (0..7)
0.5 0.5 0.5 0.5 0.5 0.5 0.5 0.5 
##$TPOFFS= (0..7)
0 0 0 0 0 0 0 0 
##$TUNHIN= 0
##$TUNHOUT= 0
##$TUNXOUT= 0
##$USERA1= <user>
##$USERA2= <user>
##$USERA3= <user>
##$USERA4= <user>
##$USERA5= <user>
##$V9= 5
##$VALIST= <valist>
##$VCLIST= <CCCCCCCCCCCCCCC>
##$VD= 0
##$VDLIST= <DDDDDDDDDDDDDDD>
##$VPLIST= <PPPPPPPPPPPPPPP>
##$VTLIST= <TTTTTTTTTTTTTTT>
##$WBST= 1024
##$WBSW= 4
##$XGAIN= (0..3)
0 0 0 0 
##$XL= 0
##$YL= 0
##$YMAX_a= 25741
##$YMIN_a= -30873
##$ZGOPTNS= <>
##$ZL1= 120
##$ZL2= 120
##$ZL3= 120
##$ZL4= 120
##$ABSF1= 10
##$ABSF2= 0
##$ABSG= 5
##$ABSL= 3
##$ALPHA= 0
##$AQORDER= 0
##$ASSFAC= 0
##$ASSFACI= 0
##$ASSFACX= 0
##$ASSWID= 0
##$AUNMP= <proc_1d>
##$AZFE= 0.1
##$AZFW= 0.1
##$BCFW= 1
##$BC_mod= 2
##$BYTORDP= 1
##$COROFFS= 0
##$CY= 11.3945322036743
##$DATMOD= 1
##$DC= 2
##$DFILT= <>
##$DTYPP= 0
##$F1P= 2.36226072786647
##$F2P= -0.459571619588291
##$FCOR= 0.5
##$FTSIZE= 0
##$FT_mod= 4
##$GAMMA= 1
##$GB= 0.15
##$INTBC= 1
##$INTSCL= 1
##$ISEN= 128
##$LB= 0.24
##$LEV0= 0
##$LPBIN= 0
##$MAXI= 10000
##$MC2= 0
##$MEAN= 0
##$ME_mod= 0
##$MI= 1.114404
##$NCOEF= 0
##$NC_proc= 0
##$NLEV= 6
##$NOISF1= 3.799351
##$NOISF2= 2.8
##$NSP= 1
##$NTH_PI= 0
##$NZP= 0
##$OFFSET= 15.70392
##$PC= 1
##$PHC0= -13350.57
##$PHC1= 2.201
##$PH_mod= 1
##$PKNL= yes
##$PPARMOD= 0
##$PSCAL= 0
##$PSIGN= 0
##$REVERSE= no
##$SF= 200.130013532006
##$SI= 16384
##$SIGF1= 3
##$SIGF2= 2
##$SINO= 400
##$SIOLD= 16384
##$SREGLST= <1H.CDCl3>
##$SSB= 0
##$STSI= 0
##$STSR= 0
##$SW_p= 3612.71676300578
##$SYMM= 0
##$S_DEV= 0
##$TDeff= 0
##$TDoff= 0
##$TI= <>
##$TILT= no
##$TM1= 0
##$TM2= 0
##$TOPLEV= 0
##$USERP1= <user>
##$USERP2= <user>
##$USERP3= <user>
##$USERP4= <user>
##$USERP5= <user>
##$WDW= 1
##$XDIM= 8192
##$YMAX_p= 0
##$YMIN_p= 0
$$ End of Bruker specific parameters
$$ ---------------------------------
##NTUPLES= NMR FID
##VAR_NAME=  TIME,          FID/REAL,        FID/IMAG
##SYMBOL=    X,             R,               I
##VAR_TYPE=  INDEPENDENT,   DEPENDENT,       DEPENDENT
##VAR_FORM=  AFFN,          ASDF,            ASDF
##VAR_DIM=   8192,          8192,            8192
##UNITS=     SECONDS,       ARBITRARY UNITS, ARBITRARY UNITS
##FACTOR=    0.0002496,     1,               1
##FIRST=     0,             0,               0
##LAST=      2.0444736,     0,               0
##MIN=       0,             -30873,          0
##MAX=       2.0444736,     25741,           0
$$ Real data points
##PAGE= N=1
##DATA TABLE= (X++(R..R)), XYDATA
$$ [...]
1846g5j06L45jK31M7n65L4K79l4M09k00l67J48j75M77k07l06M6JJ58L7p9J7Q7
1870B01k27M91l98L3r3jn4J23o0L0p9J18m4l55M46m47J63J69j4jj43j57L85l9
1894D7k93j3J03MK2j04j33m2J07K57k32L5J46j77K11O7k74k68Q7L78O9l58L61
1917@j86N8L32M1k92j40J1j05O31l17j3R3m13M61J22K48q01P9K76L75j5l79k86
1940b20K25L65K39l27k42k80O57j51K11k10l50M57m08L68r1q2k69J85J73J56k03
1961B03k8o55O25Pm3j87j08J83l8N00m32j87M4n9o0N7j1J68l02J31J62J29r2k71
1985b64K74J7n8n77O10p9j82LQ7P6J0JJ02m12K99N4J12j9j50k92J12RL00K01l05
2010g1J39l56L3K17j78K88m06K09L50k21K36l6j67J28l0J91l89j68K75J56O4J47
$$ plain form
1846 -75 -181 164 163 394 441 -124 -90 189 155 564 364 -3 145 -30 447 240 -66 -20 -19 139 176 97 114 201
1870 201 -26 465 67 100 7 6 -48 75 15 45 -34 84 40 -315 131 -316 -153 16 2 1 -142 -299 86 47
1894 47 -246 -259 -156 -152 -130 -234 -367 -409 -302 -45 -277 -242 -96 -273 -62 5 -269 -537 -450 -72 -3 -361 0
1917 0 -186 -128 204 245 -47 -187 -176 -281 350 33 20 113 -300 161 283 531 -270 -191 85 460 445 66 -220
1940 -220 5 370 609 282 40 -240 417 266 477 267 -83 374 -34 334 243 161 -108 77 250 406 203
1961 203 175 -480 145 152 109 -78 -186 -3 -41 459 27 -160 -116 -175 -235 -178 -189 -21 -323 -192 -30 99 7 -264
1985 -264 10 27 -31 -608 2 -77 -259 -256 -169 -93 -83 -82 20 -392 -93 -39 73 54 -96 -388 -276 -267 33 234 -71
2010 -71 68 -288 -255 -38 -216 72 -334 -125 225 4 240 204 37 165 135 326 -63 -231 44 200 264 411
2032D11m53j94N42k30K35k63j71L4L03p3J86k12m81L57J16N9J8m64O3M36j24J4
2054A09K1l15j44L01M52m81K3q5q1J83P7k21j10J02L2J50m9k15o0J8L51j54J09
2077A3j87j70K12j96j74K14J74L4J81n86L66j93K58j1J12nK2n1k23J87j81j2L75
2100A59l15K57j35l43L45L15j91l96J36J05J76n5L75l25k52J08J35J42K52m19
2120G4J35j80J94pr8pJ0p4K64O1k09rj82K98J9o8J57l62Q6M9L7J16m67J63J71
2145A71r2K16j99r0r3J93L1K29k90j46k26L54j41m0q9JK46j54Ok03j37J57K83
2168a3K31m62K54r2K7J41k40kJ24k85Q4J30l69K51J37k02J04M5R1n6j56J93J26
2191F1Q6qk37j80J08J32K1j99K88p0j46j16M52j74rJ95j18Jj65J22L92m92J00
$$ plain form
2032 411 -42 -236 306 76 311 48 -123 -89 214 141 327 115 -366 -9 107 166 184 -280 -217 219 95 109
2054 109 130 -185 -329 -28 424 -57 -34 -119 -200 -17 60 -161 -271 -169 -137 13 -36 -251 -311 -293 58 -96 13
2077 13 -174 -344 -132 -328 -502 -288 -114 -80 101 -485 -119 -312 -54 -65 47 42 64 13 -210 -23 -204 -216 159
2100 159 -156 101 -34 -377 -32 283 92 -304 -168 -63 113 58 433 108 -144 -36 99 241 493 74
2120 74 209 29 223 216 118 111 121 47 311 372 163 154 -28 270 289 221 378 16 102 151 188 304 -163 0 171
2145 171 79 295 96 6 -87 106 137 366 76 -70 -296 58 -83 -123 -212 -211 35 -119 -113 -316 -453 -296 -13
2168 -13 218 -244 10 -82 -55 86 -154 -156 -32 -317 -233 -103 -472 -221 -84 -286 -182 -137 -46 -102 -258 -65 61
2191 61 147 139 -98 -278 -170 -38 -17 -216 72 2 -144 -260 192 18 9 204 86 87 -78 44 436 -56 44
2214D4j64K99J67o1k91k19J89M38k32k52K75l78L32J07K14l47N9k19J74J21j23
2235A33K98o22L82q4j99K55m52n8O18k76qk7n89K64N94l11o3n5J63p6j04M16l32
2258a33m5r7J49K36l28J01j40m2Q8J28K3l40J95J59J87l29j96K21k05K83K57k55
2280h3L5o8O4J52J7p6K2q6K00N4Mm62M81k97L29j51Q3q1j35K31K19l15o0L19j
2305C95k16k45K08r1K11N9m67J77k38R8K10j28r7J15j31J42q1K29l65J26Q9O2
2327F2Q6k8k62K04P7j69O0j56r1K18J77j11j72k01k6N22k04M5k87O9O6J16j80
2350a85J07l08j48M33J73k60j26k2K31K48m1j75p9m3J51J16n31J30L6J19k9L83
2372A80j08j69k31J54K85j14J16o9K52l46L25j31N0k12N9J09k17J29J07n1q4M
$$ plain form
2214 44 -120 179 346 285 -6 -225 -36 402 170 -82 193 -185 147 254 468 121 180 -39 135 256 133
2235 133 431 -191 191 107 -92 163 -289 -347 271 -5 -13 -40 -629 -365 229 -82 -145 -200 -37 -113 -217 199 -133
2258 -133 -178 -275 -126 110 -218 -117 -257 -299 -211 -83 -60 -400 -205 -46 141 -188 -384 -163 -368 -85 172 -83
2280 -83 -48 -116 -52 100 117 41 63 -23 177 231 235 -227 254 -43 286 135 218 137 2 233 452 137 77 396 395
2305 395 179 -66 142 51 262 321 -146 31 -207 -109 101 -27 -124 -9 -140 2 -79 150 -215 -89 0 62
2327 62 148 120 -142 62 139 -30 30 -126 -217 1 178 67 -105 -306 -332 190 -14 31 -256 -187 -121 -5 -185
2350 -185 -78 -386 -534 -101 72 -188 -314 -336 -105 143 102 -73 -152 -195 -44 72 -459 -329 -293 -174 -203 180
2372 180 72 -97 -328 -174 111 -3 113 44 296 -50 275 144 194 -18 41 150 -67 62 169 118 34 38
2394C8K24R5m81L71K25k81kL3k68q2K08J55k11J9R6l1j29j82J02p0N2M7p8L34
2418A84j39k15M69m62K21j17J82l10J16J1m0k14M98j23l71K43j27n1L77j61k9
2439e8l27M06r1j53L76j40m87M90Q4m6k81j21L55k02L19j72k40M5K49j31J09J64
2461A48m20K11m0J71J06j52j18J07J72kk97R2Q2J0R8J34k41L8j89K23P1L86j97
2484C93k01j75L1l8J33J47k98L6L1P1O2l06K59P9j51O9l39K84j3N2k02J71o4j01
2508g0K92j86k15J62P7N3j96P7q0o1J72l17L30k93P2O7L3j89K5L44J11k83O4m99
2532e10L60OJ84O2j57l9K51l16n9K58o0n7RJ71k30J76n4j44J06J93k16K04j36
2555Bj06J7J56J55R2o39L76k13K23j24K21j41J82K5j69j95J21Q4J1K6m0q4N7P9
$$ plain form
2394 38 262 357 -124 247 472 191 189 222 -46 -128 80 235 24 43 139 108 -21 -203 -101 -171 -119 -72 -150 184
2418 184 45 -170 299 -163 58 -59 123 -187 -71 -60 -100 -314 184 61 -310 -67 -194 -245 132 -29 -58
2439 -58 -385 21 -70 -223 153 13 -474 16 100 54 -227 -348 7 -195 124 -48 -288 -243 6 -125 -16 148
2461 148 -272 -61 -101 70 176 24 -94 13 185 183 -114 -22 60 70 168 302 61 99 -90 133 204 590 393
2484 393 192 17 48 10 143 290 -8 28 59 130 192 -114 145 224 73 142 -197 87 74 126 -76 95 31 -70
2508 -70 222 36 -179 -17 60 113 -83 -6 -86 -147 25 -292 38 -255 -183 -116 -83 -272 -247 97 208 -75 -11 -510
2532 -510 -150 -144 40 102 -55 -94 157 -159 -218 40 -20 -77 -68 103 -127 49 -5 -149 -43 150 -66 138 2
2555 2 -104 -87 69 224 316 -323 53 -160 63 -61 160 19 201 226 57 -138 -17 67 78 104 64 -20 37 116
2579A16j50J67k6r1j46K06L2k18J78l58N4K17ll4K87q4r0J31j63j9J33k08K6r4
2603a37R4Ok53K70j93L46j72mj87J51Kj36L67k73K84k64l27J72J72J43j31n3j31
2626b54J61k84N90j64k12j41Q2R8K00J01m06K52r6J90j29j66kk90N24J12j44j2
2648A0K7J00l28L59k90j8J58k7K18k14L13m52M38l66N46j58l24k66L32q5K07P0
2670B50l73K72k24L59k73k4j20K5K22J80l58J21j63J27L33m25j83K13j36L48j86
2691a5K1J30k4k23K50p8k03Pj96L83k8L7j15n7Q8J31k23J06n4l4p6P4rK09j96
2716i5j14K90k54M53n38J07J86j08O0l07O47m0m60K76j53K14l17M1j45L47k96
2737b06J86J29j89K33k19L20rl05J39J1N5J3J56o2j15j7k76J39J07j25oN4n0Q5
$$ plain form
2579 116 -34 133 107 16 -130 76 108 -110 68 -290 -236 -19 -22 -56 231 147 57 188 25 6 139 -69 -43 -137
2603 -137 -43 -37 -290 -20 -213 133 -39 -43 -230 -79 -77 -213 154 -119 165 -99 -426 -254 -82 61 -70 -123 -254
2626 -254 -93 -377 213 49 -163 -304 -222 -124 76 177 -229 23 -73 117 -12 -178 -180 -470 54 166 22 10
2648 10 37 137 -191 168 -122 -140 18 -9 209 -5 308 -144 294 -72 474 316 -8 -274 58 -27 180 250
2670 250 -123 149 -75 284 11 -13 -133 -108 114 294 -64 57 -106 21 354 -71 -254 -41 -177 171 -15
2691 -15 6 136 112 -111 139 61 -142 -135 -331 52 24 61 -54 -111 -23 108 -115 -9 -63 -97 -173 -99 -108 101 -95
2716 -95 -209 81 -173 280 -258 -151 35 -73 -13 -320 327 287 -173 103 -50 164 -153 -112 -257 90 -206
2737 -206 -20 109 -80 153 -66 254 245 -60 79 90 145 158 314 252 137 120 -156 -17 90 -35 -41 13 -37 48
2761D8o9P2k7J48o3L58k63l2m01K44M6J9K2q1JOj07J58l55M75k73O8L2mj71M2
2787a07rJ4N9L7P2J08k31njk06mj75N64M5l05K35j39k94K5L6N5L6K25M5K8k32
2813a24j20K63k91K61Nl25M62q3n4M0j43M6L00l37j00K62kP0k19j80J45o9l4K69
2837D2Q4k7k02K64j47L03j27j61M9m11L24K74l2j4k16j6M43m47J75j2K6j05J5
2860H2L1j59J21l52J43J39qj35P1r2K98l4J83m85K16k21K67j48rl7q5J53M3l72
2884c90K40J85o1J7j04J19k11J58N5K4l17L03k01P5K5m8o4n3j67N40k77K42n7
2907C3k87L29j93K83L8j24j12k30O31k88m3j29J43k13K33J04n32N22P6k1j02p1
2929D7J17J8j16K5j00J3J59o5K4Rk69J37M1J4l0K9k05J88j26LJ24j07n6K81qJ07
$$ plain form
2761 48 -21 51 24 172 109 467 204 172 -229 15 61 80 102 21 22 28 -79 79 -276 199 -74 -6 26 22 -149 -107
2787 -107 -116 -102 -43 -6 66 174 -57 -62 -63 -269 -273 -448 116 161 -144 91 -48 -342 -317 -281 -226 -190 35 80 108 -124
2813 -124 -244 19 -272 -11 -6 -331 131 48 -6 34 -109 -63 237 -100 -200 62 60 130 -89 -269 -124 -193 -227 42
2837 42 126 99 -103 161 14 317 190 29 78 -333 -9 265 233 219 3 -13 430 -17 158 146 172 67 82
2860 82 113 -46 75 -277 -134 5 -3 -138 -67 -159 139 105 288 -197 19 -202 65 -83 -92 -129 -214 -61 -18 -390
2884 -390 -150 35 -26 -9 -113 6 -205 -47 8 32 -285 18 -183 -108 -83 -131 -195 -248 -415 125 -152 90 33
2907 33 -254 75 -118 165 203 79 -33 -263 368 80 37 -92 51 -162 71 175 -357 165 241 220 118 47
2929 47 164 182 66 91 -9 4 163 98 122 131 -138 -1 40 54 24 53 -152 36 -90 -87 37 -70 -126 155 147 254
2955B54k99l9%J43kp0J44r0j42j63K70j56J29j84J55J73k15j0J45P7j80qJj03
2979a70J14K17k34l0J00r3K35k12P3j00j87J00L18j01r0J38m16LL67n2J55n48
3001d13K70K31P5q6p7J39l24J19J95K71l95n1J09J23l29K36J4o2qJ84J65m64K20
3024A42J04j61K2j7k10L28j25K23k1m18J10J87j46p1P8MK49j24l06J95n45L91
3046a11J25oK88m39J44P3Q0j71R7o8l96M24j21r1k49P4N88l19M48o31J45J40M6
3069G0j57p4O2o9N1M8k9p6l7J44j4K10p3r1J54j70q8Q6r8K43l20K19J69l16J88
3094C2j7k2R8m7L34l30J61j54K43j81j8L4J02r2J31l53J8K94j73L41k33l66L19
3117A21j08M42n40J69k08K01J76k37L0K9j8n3j06K23j72J47O0n2m02K36j98K66
$$ plain form
2955 254 -45 -84 -84 59 57 -13 131 41 -101 -264 6 -150 -21 -205 -50 123 -92 -102 43 120 -60 -68 -67 -170
2979 -170 -56 161 -73 -103 -3 -96 139 -73 0 -100 -287 -187 131 30 -60 78 -338 -335 32 -20 135 -413
3001 -413 -143 88 163 77 0 139 -185 -66 129 400 5 -46 63 186 -143 93 107 45 37 221 386 -78 142
3024 142 246 85 107 90 -120 208 83 306 285 -133 -23 164 18 -53 25 29 278 154 -152 43 -502 -111
3046 -111 14 8 296 -143 1 74 154 -17 80 12 -384 40 -81 -172 -421 -347 241 -78 370 -261 -116 24 70
3069 70 -87 -161 -99 -168 -117 -69 -98 -174 -211 -67 -81 129 56 -35 119 -51 -139 -53 -151 92 -228 -9 160 -156 32
3094 32 15 -7 91 44 378 48 209 55 298 117 99 133 235 143 274 -79 -61 233 60 401 168 -198 121
3117 121 13 455 -85 84 -124 77 253 16 46 75 57 4 -102 121 -51 96 156 104 -298 -62 -260 6
3139Fm9k8L39j12k68K87NR0k80r9K30J8k03L11m10K16o3K01l62m0J61r0K33K6
3163A19j89j8n3k4k3n1J95J95J01m82M29j62r8J42k41OJ27nl7l6K1j16K17L9j02
3188d6Rk5K30r3q8Q4O6j16J56j71K4J27M7j72j93L06L6j71J12j92N6K19l14J08
3212aJ40k6N6l77K11j17J85l0j59j14J38L67n40K73J26j68r5J60J42k78J25n8
3234d0K61k91j06J80l93J87o1K74m8L9q5N3k3l59K24J66K9R6l76L20N7L2Q1o18
3258d01L18p6R9j56K29j51k2J96j80O7J14M3r8m7k8k31J63K14l06K71J64l21K67
3281A28k64K37M3j05p9J36l33O3L91l8k53K15J24j41k2l9q3k0r8L19%k03QK71
3305B57j41r4L7j10J21P1J0k62J03M0J14N2j14j09Q5rm3k14K21K11l47Q0k20L98
$$ plain form
3139 6 -43 -71 268 156 -112 175 180 270 -10 -109 121 139 -64 247 -163 53 -10 191 -171 -211 -50 -140 93 119
3163 119 -70 -88 -141 -165 -188 -239 -44 151 252 -230 199 37 -61 81 -160 -154 -27 -32 -69 -105 -84 -200 17 56 -46
3188 -46 -37 -62 168 75 -13 71 137 21 177 6 30 157 204 32 -161 145 181 10 122 -70 -14 205 -109 -1
3212 -1 139 113 169 -208 3 -114 71 41 -118 -232 -94 273 -267 6 132 -36 -131 29 171 -107 18 -40
3234 -40 221 -70 -176 4 -389 -202 -263 11 -37 2 -83 -30 -53 -412 -188 -22 7 103 -273 47 104 136 217 -401
3258 -401 -83 -159 -60 -216 13 -138 -160 36 -144 -77 37 80 -18 -65 -93 -324 -161 53 -253 18 182 -139 128
3281 128 -136 101 144 39 -40 96 -237 -174 217 179 -74 141 265 124 102 63 -20 -40 -138 181 181 -22 -14 257
3305 257 116 22 59 -51 70 141 151 -111 -8 32 146 198 84 -25 60 51 8 -206 15 226 -121 -41 -261 137
3329A37j57r5J43Q4k64J77O9j87q8J24j53RQ0K90j55j83J35j60J73k4R3k24OJ68
3353bQ8l7J68n23M11M3r6J87j96m01K49R0K53k2j70k24L00l9J74j44n8k17J64
3376bJ7J35j54j09J35Q5J3j73L6L6O4P6k83L7o6K43K47k50m4k31M83m18K74R0
3400B41n3n9k22j11M0J8J61l3J65k40J75R1k93j7K01q5k66K57J52k83J46J22Q
3423A15l41n3K59Rk78J74M22o27L74j50L13k82N9j22k60K51M20m05L04k87J97
3444I2M2l73K56M4l30K31j66J33j8k16L38K7o2N9J67m03K55m1N1Qn0O4l59J11
3468a40L59j94j10K8M5K51L2M7p7l59J16N5M3j97K01j75K04nk61L41k28j89q8
3491c01L46j62K33j12j31J48K59m25o3O2O2Q7L6j79k68N54n67M05l99q0O64J7
$$ plain form
3329 137 -20 -115 28 112 -152 25 94 -93 -181 -57 -210 -201 -121 169 14 -169 -34 -194 -21 -45 48 -176 -170 -2
3353 -2 86 49 217 -306 105 148 52 239 43 -358 -109 -19 234 212 42 -182 118 79 253 109 51 -166 -2
3376 -2 15 150 -4 -113 22 107 120 -53 -17 19 83 159 -124 -87 -153 90 337 87 43 -188 295 -123 151 241
3400 241 188 129 -93 -204 -164 -146 15 -18 147 -93 82 173 -120 -137 64 -21 -287 -30 122 -161 -15 107 115
3423 115 -226 -279 -20 -11 -289 -115 307 -320 54 -96 217 -65 -6 -128 -388 -137 283 -122 182 -105 92
3444 92 134 -239 17 61 -269 -38 -204 -71 -89 -305 33 60 -2 57 224 -179 76 35 86 94 44 108 -251 -140
3468 -140 219 25 -85 -57 -12 239 271 318 241 -118 -2 53 96 -101 100 -75 129 124 -137 204 -24 -213 -301
3491 -301 45 -117 116 4 -127 21 280 -145 -208 -146 -84 3 39 -140 -408 146 -421 -16 -415 -495 169 186
3513A86k4P69j015j98K67K02n57K87K10m04M77n14K51k89K08j33L06r6n4k26P95
3534D48k50P6n20k52Q08o16L21R4q65Q98l50P6P2R7n7o0J64K58l80J13p8j6M02
3557C83k76J19k78K67J3j62L08k20L5K9J36j70m33J97J39k50N3L09l78M0K51j29
3579a7L29j46l36J54P1L46n20L49o5K5r51J013O0n70N0N19q6o83M43M26n33J11
3601a1k86K31k49J33jJ40l3r5J71j7K39k52J28oj2r0p7L16j06j70J56k52j59L89
3625H7P9l43l6K84k6k14K76j46R3N1j59K04j20K26k01j60j2N8J80k75J23J61j1
3648A19j43k8J88j16J61j37p2K8J52P18k88l81m5j10j66r9R8kK34k23J47q7L9
3671a3MNR0J40n30j08M60R2Q6j84R0k39J53m15L93Q6L18r49j51P04n78N58o14
$$ plain form
3513 186 162 931 -84 -282 -15 187 -370 -83 127 -277 200 -314 -63 -352 -144 -277 29 -67 -121 -347 448
3534 448 198 274 -246 -498 310 -306 15 109 -756 142 -208 -132 -60 37 -20 -80 84 342 -38 75 -3 -19 383
3557 383 107 226 -52 215 228 66 374 154 189 218 354 184 -249 -52 87 -163 -110 199 -179 -139 112 -17
3579 -17 312 166 -170 -16 55 401 -119 230 165 190 -761 252 312 -258 -208 311 225 -458 -15 411 -122 -11
3601 -11 -297 -66 -315 -182 -183 -43 -76 -171 0 -17 222 -30 98 92 80 -10 -87 229 123 -47 109 -143 -302 87
3625 87 166 -177 -213 71 45 -169 107 -39 54 105 -54 150 30 256 55 -105 -117 -59 121 -154 -31 130 119
3648 119 -24 -52 136 20 181 44 -28 0 152 870 582 201 156 46 -120 -219 -121 -123 111 -112 35 -52 -13
3671 -13 -9 -4 86 226 -304 -412 48 140 226 42 132 -107 46 -369 24 110 428 -521 -672 32 -546 12 -602
3694f02L37P0J96K15r0n85K42r5P08r5L47n95O53r76J56l79M46j88Q5K01r7mK0
3717c0OK10k93j34K95l26K86J29j32j63K21n9j32K43p5lJ5J76j66J20k46J61J56
3740B59j43j86K82k01J46rk90j19M4J99M3L6j04r5L13j65J11M7r9K80l39j36J91
3763F5j68j84K79lM6J34j69P5L4j02j24N6j01J40J46k11l7P9j85L35j79J51j03
3786b6Rj8J63p2q7J69l3j62K78j93j36L2k32M32r1k43M8K24K6j61m8J30J2j39
3810a18P9p2K02n0K61k11M7k41J91P0j18J27l33J48O0J90m19K98l5Q8J83o0m24
3833a37P6P5J47k1j04j0J01q1J13l21j48N18Q1m47M32l04Q7P6k59J49K49o07L50
3856A5j57M5J56k06K54m7R0j31l5J90m2k72J09j28J92K18k85J04k94J9J73j00
$$ plain form
3694 -602 -265 -195 1 216 126 -459 -217 -312 396 301 648 53 706 -270 -114 -493 -47 -235 -150 51 -46 -50 -30
3717 -30 -24 186 -107 -241 54 -272 14 143 11 -152 69 10 -122 121 46 43 58 234 68 188 -58 103 259
3740 259 116 -70 212 11 157 148 -142 -261 -217 -18 25 61 -43 -138 175 10 121 168 69 349 10 -126 65
3763 65 -103 -287 -8 -11 35 169 0 75 109 7 -117 -61 -162 -22 124 -87 -124 -45 -230 105 -74 77 -26
3786 -26 -17 -35 128 56 -31 138 105 -57 221 28 -108 -76 -308 124 33 -210 -162 62 88 -73 -121 9 21 -118
3810 -118 -39 -111 91 41 302 91 138 -103 88 158 40 167 -166 -18 42 232 -187 111 76 164 347 287 -137
3833 -137 -61 14 161 140 36 26 127 46 159 -162 -310 208 289 -158 274 -30 57 133 -126 23 272 -335 15
3856 15 -142 -97 59 -147 107 60 150 19 -16 174 132 -140 -31 -159 33 251 -34 70 -224 -205 -32 -132
3878a32l45M72K14l55J06J96k69R8L05M6l24Mo8j76K67j54k26%L32l09N55l87
3900a50J83k5J05o6k68M22j52j68J43j06J39j51q4L84j86j40J91m0k09N85j77
3921B30mj68J68l24J30k16K74J7l86L58p2n9K69J9o5M9m99L31j46J54j58r1M09
3944B20k68k37L38k58O2J10J90j00k85M09l43K50l91K58K32l65R4k8l1J77j23
3965h9J28q4j55J21PJ02j57O0K17o5j88k13N05l76K81k01J4j92M31k10L8l2L27
3988B69j41J9o8oJ00j63k33L08k21Q2J96j11M6l14L01Oj90K05j0j21N9k01K90
4011A02j53J09k07J10n1M3j60K23K6N9j74j19N1K46L13n15n7N66m21l7M2j57J82
4034B1Rj69J60k9P5j63j4J09J9N3R1l25J65m0q7L8J71J63n36M0J75N1j59j87M62
$$ plain form
3878 -132 -477 -5 209 -146 -40 156 -113 -15 290 336 12 16 -52 -228 39 -115 -341 -341 -9 -318 237 -150
3900 -150 33 8 113 47 -221 201 49 -119 24 -82 57 -94 -178 206 20 -120 71 31 -178 407 230
3921 230 226 58 226 -98 32 -184 90 107 -279 79 7 -52 217 236 171 220 -279 52 -94 60 -98 -189 220
3944 220 -48 -285 53 -205 -143 -33 157 57 -228 181 -162 88 -303 -45 187 -178 -84 -112 -143 34 -89
3965 -89 39 -45 -200 -79 -72 30 -127 -67 150 85 -103 -316 189 -187 94 -107 -93 -285 146 -64 -26 -58 269
3988 269 128 147 79 73 173 10 -223 85 -136 -54 142 31 77 -237 64 70 -120 85 75 -46 13 -188 102
4011 102 -51 58 -149 -39 -90 -47 -207 16 42 101 -73 -192 -141 105 418 -97 -154 412 -9 -46 -4 -161 21
4034 21 30 -139 21 -8 67 -96 -110 -1 18 71 162 -163 2 -38 -125 -87 84 247 -289 -249 -74 -23 -182 -369 93
4059I3q8k15J13J82Q8J85m53O5j25r9M89k36k7P4k55J96j05j81M16k67K5J53p9
4082e1j21o4K81L0J74l36L1j25Q4J37j45j24L44k04J37M5p6q0n1J50k0j98N3L26
4106A97N5lk28m22P04j21J3j75J06J81k21j32o4L8J73m8J03k87M79m42K31j95
4128e8p0J43ln7R5J77l40K06J39K3l19J42O9k47j3L16l07l6K51K5j92P3j02K35
4152A50n1n8k95k9K35j30L29k01jk77K47j74K13k05K75l9j1J79k63P1J14L2j60
4175d9j13K09l62M96k18j19P6L82l10m8QM41l61j79M62l38J74O1kJ8k37JM8j14
4199g4L6J27Q7k78J71k04K11J04k15O6k09L35r6K7k23q2K17o1J64J43l24K26l56
4222b08M07k84R8K2j34J51m1n0L2J4J54K5k37J58k30n6J4J89j67j29N5L8K26j25
$$ plain form
4059 93 5 -210 -97 85 173 358 -95 -30 -155 -254 235 -1 -28 46 -209 -13 -118 -299 117 -150 -125 28 -51
4082 -51 -172 -236 45 75 249 -87 -56 -181 -97 40 -105 -229 115 -89 48 93 17 -63 -114 36 16 -182 -129 197
4106 197 252 249 21 -401 303 182 195 20 126 307 86 -46 -110 -72 101 53 156 -131 348 -94 137 -58
4128 -58 -128 15 12 -45 50 227 -113 93 232 255 -64 78 147 -100 -113 203 -104 -140 111 136 -56 17 -85 150
4152 150 99 41 -254 -283 -48 -178 151 -50 -51 -328 -81 -255 -42 -247 28 -11 -22 157 -106 -35 79 111 -49
4175 -49 -162 47 -315 181 -37 -156 -80 302 -8 -56 -48 393 32 -147 315 -23 151 212 210 228 -9 -8 40 -74
4199 -74 -38 89 176 -102 69 -135 76 180 -35 31 -178 157 61 88 -135 -217 0 -61 103 246 -78 148 -208
4222 -208 199 -85 13 35 -99 52 11 -39 -7 7 161 186 -51 107 -123 -179 -165 24 -143 -272 -217 -179 47 -78
4246g8j23K16n2M9J48k4J11l72j7P6K75j44m8j98M02l91J39J4j76L18l03J7J45
4269a6o1K02R5k96m9K93n1k85K27j38j37J24j45L38k04K90j16k20J52q3N7J79
4291A56k56K37J48j66j01j71J09j49L04p3Q6n34M47K5m22N84l67J32k5q7M28l65
4313f0L57m36K45J03k15J87j63j62K00q1J19Q3k88N3J9k3j8PK31j02K54k21j39
4336e0L9J5q0J79j68p9K70k54P9N0l4J40l52L30k49Q2J75k91K38j17j38L15k08
4359a08J40o3J88k98J67J44j35Q9J39j17j64J0j30J74N1r6K07j09J67l65J10P
4381HJ45j50r4J84Q7o2k98M35m3j43J99k73l45L02J00jJ19l12J32L5K0P2q9J37
4405A65k10K12l68O1K02N7k90K60m7k10J31K80l52j44L9K93l03K76J26M8q7o4
$$ plain form
4246 -78 -201 15 -37 12 160 136 247 -125 -142 -66 209 65 17 -181 221 -170 -31 -17 -193 125 -178 -161 -16
4269 -16 -77 125 220 -76 -125 168 117 -168 59 -79 -216 -92 -237 101 -103 187 71 -149 3 -80 -23 156
4291 156 -100 137 285 119 18 -153 -44 -193 111 38 124 -410 37 62 -360 224 -143 -11 -36 -123 305 -60
4313 -60 297 -139 106 209 -6 181 18 -144 56 -25 94 177 -111 -58 -39 -62 -80 -73 158 56 310 89 -50
4336 -50 -11 4 -76 103 -65 -144 126 -128 -49 1 -33 107 -245 85 -164 -82 93 -198 40 -77 -215 100 -108
4359 -108 32 -31 157 -141 26 170 35 124 263 146 -18 -8 -138 36 87 -9 198 89 256 -109 1 8
4381 8 153 3 -91 93 180 118 -180 255 212 69 268 -5 -350 -48 52 51 170 -142 -10 25 45 117 28 165
4405 165 -45 167 -201 -140 62 119 -171 89 42 -168 -37 243 -109 -253 -214 79 -224 52 178 226 139 75
4427G5K17m33nr9K81J70j87J74j63P7p3j02j85M86P1l74lJ32j12J22p0j82L28
4450A45N2k55M6J78L4l46J73J5j10K1L52k64Q4k3Oj14J16m2m4J10J25q0l2Pq9
4475F5j09J15P2j41J49k24M30l95J03j16J53J54j34k41J11j0J19m22K18n2J73
4496A8j32N7l3q6K47k86J28Q2k3l1J8j71M12l93O5J43n8k5L5j63PM30m80K87j1
4521C7k44K34J23J28k36jP6j46l7oJ60p2j02o8K21j23J45J38k83m4j26J84J68
4544A26j51q1K67RJ42k56j16m2M38l78Q3j71K65%p1Q6j05r4p3L35l80M33j16k67
4568a17J04l6J90Q1j04J72l78j12K17p0l1O0L5K93l22j29K53j41PKK6L0j69O0
4592g9O8L9M1j7L0k5K5j23J75j95J22j7j54J85Q1O4k43J29k05K39O5k83J71j44
$$ plain form
4427 75 292 -141 -146 -245 36 206 19 193 30 107 34 -68 -253 233 304 -70 -73 59 -53 69 -1 -183 145
4450 145 197 -58 -12 166 200 -146 27 42 -68 -47 305 41 125 102 108 -6 110 68 24 134 259 179 147 154 65
4475 65 -44 71 143 2 151 -73 357 -38 65 -51 102 256 122 -119 -8 -18 101 -321 -103 -155 18
4496 18 -114 -57 -90 -176 71 -215 -87 -5 -28 -59 -41 -212 200 -193 -128 15 -43 -68 -33 -196 -189 241 -239 48 37
4521 37 -207 27 150 278 42 41 117 -29 -66 -72 88 16 -86 -154 67 -56 89 227 -56 -100 -226 -42 126
4544 126 -25 -106 161 170 312 56 -60 -102 336 -42 41 -130 135 135 64 150 45 -49 -122 213 -167 266 150 -117
4568 -117 -13 -49 141 222 118 290 -88 -200 17 -53 -84 -24 11 304 -18 -147 106 -35 -28 -26 0 30 -139 -79
4592 -79 -11 28 69 52 82 57 82 -41 134 -61 61 44 -110 75 156 220 -23 106 -99 140 205 -78 93 -51
4616e1N6m5K0j25K28j61j33J86J10j13R5n4O6M2j72K08K9k82o8l1L68k03j19J26
4640b3J13j64K25k08O7P1K02k87P4l2R1p4J62j30j77kJ64Q0p4j95L34j58n9j92
4664a92J42J4j97o3L57L62m17j70p0M07lk14n9P9k71K00P2N5L21m57l1J13P7J4
4688F9j04K52l32j68J89M6q9L83l69J37k03J34j25J04j7l2J06OM9r6j9K83J4l17
4712i9K33j30j31k23J26Q4K05Pj85K62rj23J34r7K84k44K40l32Q9j09j59L53p8
4735I8L7j92O8L40l95J77j2j4k68L89q4j64K02k47P8l33K36L30l42J79J02r7l37
4758b49J89M1J76k32J93k63j6P1q2R8j15J7M5J01m3km8M3k60K58K2J26j90J26
4782Fo3m9O9m1j01K78NJ1j83N1O3PJ4p5j97K35q8J24j0P8k7k68L70R9k21j37L24
$$ plain form
4616 -51 5 -40 -20 -145 83 -78 -211 -25 85 -28 67 13 79 121 -51 157 186 -96 -164 -195 173 -30 -149 -23
4640 -23 90 -74 151 -57 10 81 283 -4 70 38 129 55 217 87 -90 -92 72 152 78 -117 217 59 0 -192
4664 -192 -50 -36 -233 -296 61 423 6 -164 -234 173 170 -44 -103 -24 -295 -95 -23 32 353 -104 -135 -22 55 69
4688 69 -35 217 -115 -283 -94 -48 -137 246 -123 14 -189 -55 -180 -76 -93 -125 -19 -13 36 -60 -79 204 218 -99
4712 -99 134 4 -127 -350 -224 -140 65 72 -113 149 140 17 151 54 338 94 334 2 91 -18 -177 176 98
4735 98 135 -57 11 351 -44 133 121 107 -161 228 144 -20 182 -65 13 -320 -84 246 -96 83 185 88 -249
4758 -249 -60 -19 157 -75 118 -145 -161 -90 -172 -74 -189 -172 -127 -26 -69 -71 -119 -76 -336 -78 -56 70 -120 6
4782 6 -57 -106 -37 -78 -179 99 104 115 -68 -17 46 53 67 -8 -205 30 -58 66 56 134 107 -161 209 308 87 -50 274
4809B74l01P9m26L85Q6j82J81o1J67J3k16K3J25J10l47J99K11j95j51p0p1L05
4831A38j42k4M06l39q6n4J16J08k34J99j83J10P2j68J48k51R6J07J24k93J04j23
4853a69K99k60K85j21j80P1J21L75m08J81l3q2J92j79q5p2J07j61J24j62k6K62
4875G9o0j32r0L34k89J00L16M5j55j48K03r0j46K53k36mo3m6J09j13J85%j93k03
4899c44M46n44L42L5J96J37l46N07l46nl5K03m01O2J90m37L07P4O3j62J98Q3k59
4922c6J44m4K75k32O4k58J2j3O2N1p8K87l84J69j14L0O0k97M13Q7j68k8l4K61
4946B29m21K71J1m3k53j23K89k16K23j73q5K50J43j29j9q2L47k62Po7k6K81o4
4969H8k33j22J66L07o4j80p1R6j5k01J90RP3J41o70M10K8K02q3k24N41j43l89
$$ plain form
4809 274 -27 52 -374 11 97 -85 96 35 202 215 -1 22 147 257 -90 109 320 125 -26 -96 -167 138
4831 138 -4 -28 378 39 -47 -101 15 123 -111 88 -95 15 87 -81 67 -184 -88 19 143 -150 -46 -169
4853 -169 130 -130 155 34 -146 -75 46 421 13 194 161 79 271 92 7 -65 42 -119 5 -157 -183 79
4875 79 19 -113 -203 131 -158 -58 258 303 148 0 203 113 -33 220 -16 -20 -83 -129 -20 -133 52 52 -141 -344
4899 -344 102 -442 -100 -65 131 268 -78 429 83 78 43 246 -155 -93 97 -340 -33 41 104 -58 140 223 -36
4922 -36 108 64 339 107 171 -87 -75 -88 -26 25 -53 234 -150 19 -95 -65 -5 -302 111 198 30 2 -32 229
4946 229 -192 79 90 47 -206 -329 -40 -256 -33 -206 -291 -41 102 -27 -46 -128 219 -43 -36 -103 -129 152 88
4969 88 -145 -267 -101 206 142 -38 -109 -13 -28 -229 -39 -30 43 184 -486 -76 -48 154 71 -153 388 245 -144
4992a44K86l5m6l08PJ74J26q2J04j15L61l38l10M78r8M9j34Q4K27J8o3j87J11
5015A65j96K24kj70j80J7L7L14m07J82K4K9rp1j22L11r9q8m2K93k9m61K06j71
5039b45L24j3J01j93r4J2Q2p1K36K1k24N77n90K50M6k1k56J93j99K58K2j43o2
5062A1r0J3J07L3J0K01l5j49J68k67l7O2j3j16M9q2j59L84p2K1j60J39k9M6j67
5087a32J54k10J92j1K13j92l5k9J59N6J36l12o3J25j99J91k97O96n51K95l40J75
5109B1l6j17J66J4P4k6l12l6M40j70J33j70J2j40j60K03K00l43L03l8j18J3j9
5132a06p3J95k69k3J63K13l97L81j91M9j7j18K3R5J29j59k9QK85p2k88L53m16
5155b64K04N6K3k9J87k82j38K03k62J79J60Q5k79K4M9k3m7K45j38m4K21j43O2
$$ plain form
4992 -144 142 107 61 -247 -240 -66 60 -22 82 -33 328 -10 -320 158 60 109 -25 59 286 304 241 54 165
5015 165 -31 193 191 21 -159 -142 -105 209 -198 -16 8 37 28 -43 -165 146 47 -41 -83 210 181 -280 -74 -245
5039 -245 79 66 167 -26 -120 -108 -26 -97 139 160 -64 513 -77 173 219 198 -58 135 -64 194 216 73 11
5062 11 -79 -66 41 74 84 285 250 101 269 2 -35 27 14 -102 -53 -135 -294 90 18 39 -121 18 -11 35 -132
5087 -132 22 -188 4 -7 206 14 -21 -50 109 165 301 -11 -74 51 -148 43 -254 442 -109 186 -154 21
5109 21 -15 -132 34 48 122 96 -216 -252 188 18 151 -19 -7 -147 -307 -104 96 -247 56 18 -100 -87 -106
5132 -106 -179 16 -253 -276 -113 100 -297 84 -107 -58 -75 -193 -170 -75 54 -105 -134 -126 159 87 -201 152 -264
5155 -264 -60 -4 19 -10 177 -105 -243 -40 -302 -123 37 122 -157 -133 -84 -107 -154 91 -47 -91 130 -13 49
5178D9j12J31k50J01k8L19n3j61O1j49K26L9q7M8l19J46J79m6j19K9P3r0J77P4
5202B38l57P1j50K67J05l85K09j62K57r3p6j6K74J1k74K17j29l0l9O3K95l94J14
5225A6n8K32ok64R3k03K49k8q3J03l1j43p3L42n27j61M25M08k96O4j6k29J62p
5249c1N3j10J91k33K3J44K03l20K99j98K16m61Q0M10j94k38J75j0K86j55KQ2J2
5272B26n0l98L69j20J28p5j54m0J00n8L7K8o0M0O7m9n1k3R5J9K7l11J75K3K63
5297B08k97J04L0j57p6j1M0J05R5l3P6j16J53J61l35O3jJ07j51j29L23k88K94
5320A65k75J71k9m9L14N2l03p0m29O86k13J38k54N3K67n06K49p0q9K94L74o50
5342a74M43n39O35j4q92O9q3K70M02l05O41p19L94nl2j14m8k8m0J14J49j4k37
$$ plain form
5178 49 -63 68 -182 -81 -109 210 157 -4 57 -92 134 173 86 134 -185 -39 140 94 -25 4 77 -13 164 238
5202 238 -119 -48 -198 69 174 -211 -2 -164 93 0 -76 -92 182 193 -81 136 7 -23 -62 1 296 -98 16
5225 16 -42 190 184 -80 13 -190 59 31 -52 51 20 -123 -196 146 -381 -542 -117 291 -5 59 43 -186 -24 -31
5249 -31 22 -88 103 -130 -107 37 240 -80 219 21 237 -224 -144 266 72 -166 9 -1 285 130 132 214 226
5272 226 176 -222 147 27 155 80 -74 -114 -14 -72 -35 -7 -67 -27 40 -9 -60 -83 12 31 58 -253 -78 -55 208
5297 208 -89 15 45 -112 -188 -199 -159 -54 41 8 84 -32 121 282 -53 10 9 116 -35 -164 159 -129 165
5320 165 -110 61 32 -17 297 349 46 -24 -453 233 20 158 -96 -43 224 -282 -33 -103 -192 102 476 -174
5342 -174 269 -270 365 351 -541 -472 -555 -285 117 -188 453 -266 128 123 91 -23 -71 -99 -139 -25 124 110 -127
5365a27J13K70k11K8J38P2k49J3j70K87q6j91J22K0J17k30J32M0M9j29l36K86
5387d2n8K79j62P1k30j02q1L09J04J69m72p3Q0L69k15m00M01j3K7J35j75l5J49
5410C5J51l58J88R8k43O8l4J98j47J90m9n5l8j9L58o23K89P7J05l07K25q7k65
5433b43K36L99j04n91P37l26Q41j225O16k56m1j67J034j161K18k26l67O78N3j89
5453h4N7L56l82M2p5K49j21L2K0k7O4P9k54K37l96J25J37j40L80k30j23m7m7L52
5477B04l25j7K77k76K32k48J3J39J09ok03J05R4n81N75r9M47m01j35o6L5p3J42
5500e8L0L6l21J37L44k05j42Q7J56k90L07j11J93k43N2j98L46l12J46j64P0L9
5522a01K14l84K48J88j66j21K56N5q5J51j94lK10m39R3J95p3k30N2j3K01o8M4
$$ plain form
5365 -127 -14 256 45 73 211 283 34 47 -123 164 78 -113 9 29 146 -84 48 88 137 8 -328 -42
5387 -42 -100 179 17 88 -142 -244 -325 -16 88 257 -215 -288 -208 161 -54 -454 -53 -66 -39 96 -79 -114 35
5410 35 186 -172 16 114 -129 -61 -95 103 -44 146 97 42 4 -15 343 -280 9 86 191 -116 109 22 -243
5433 -243 -7 392 288 -303 434 108 949 -276 340 84 43 -124 910 -251 -33 -259 -626 52 105 -84
5453 -84 -27 329 -53 -11 -86 163 42 74 94 67 131 210 -44 193 -203 -78 59 -81 299 69 -54 -101 -148 204
5477 204 -121 -138 139 -137 95 -153 -140 -1 108 102 -101 4 98 -483 92 -7 440 39 -96 -162 -127 -200 -58
5500 -58 -28 8 -313 -176 168 -37 -179 -92 64 -226 81 -30 163 -80 -28 -226 120 -192 -46 -210 -140 -101
5522 -101 113 -271 -23 165 -1 -122 134 189 104 255 61 58 268 -171 -78 117 44 -186 -134 -147 54 -14 30
5545C0j5NQ5n0J98q0o5m2J39m27K28q6J47K59j52p7k78K11m3JJ78l45K48j67M1
5570e7J04j03J89K9l28J21oKJ11K01k18K7m2j46J09K7J59n3j03j37K58l36J99
5593GJ53R7m33J50r7J0N7j05K72J2j70J83k84J39K9r5K6O3j6J96k23j33O9L73
5617B80k42Q9k27J04k76K38K1nlr9J02J26Q9p8j89J31N9l43L09j34J86M4k34O7
5641A5K85l08J25j9j14K19k1m03N05n13J66%o1P4J51J08k83J41k02J48K58j65
5663A06L43m17J44m83L39n8M9m14L34K30j19J22k63j01J35K93k47L6j28O1RJ65
5685A36M1k11P9k32L43l26L06k72J59J27k35kj97L31J52m10M8L00j8P0k9j57J
5708Dj12J57j27J43L5m1j26J30J65l35p7L69k34k39j04N63o2Qj63j65K40p5l0
$$ plain form
5545 30 15 20 105 55 253 173 108 66 205 -222 6 -80 67 326 174 97 -181 30 -13 -12 166 -179 69 -98 -57
5570 -57 47 -56 133 162 -166 -45 -51 -49 62 263 45 72 30 -116 -7 20 179 126 23 -114 144 -192 7
5593 7 160 257 -176 -26 -123 -113 -56 -161 111 123 -47 136 -148 -9 20 -75 -49 14 -2 194 -29 -162 -93 280
5617 280 38 127 -100 4 -272 -34 -13 -18 -21 -120 -18 108 197 119 -70 61 120 -223 86 -48 138 182 -52 15
5641 15 300 -8 117 98 -16 203 182 -221 284 -229 -63 -63 -124 -50 101 209 -74 67 -135 13 271 106
5663 106 449 32 176 -307 32 -26 23 -391 -57 173 54 176 -87 -188 -53 240 -7 29 -99 -38 -29 136
5685 136 177 -34 45 -187 156 -170 136 -136 23 150 -85 -87 -284 47 199 -211 -163 137 119 189 160 3 4
5708 4 -108 49 -78 65 100 59 -67 63 228 -107 -184 185 -49 -288 -392 171 109 117 -46 -211 29 -46 -76
5731g6K68l22J56Lr3p0m9L55p3M8l23K27mJ76l55J73l00M64l8o4J57l30L28l01
5755d3J97k23K26k22n6l4pL08l12N8j19K79j15J9o4J35R7J4m12M36j97P5P4n0
5779F4j72j9K35Lk27o4j8J01J63Nj0P5j67q1k19M06J83j93l68M03n2l75K07L96
5803B76m46J62l0n5J05J81j34l5M0k2J39Pm25K50nj70K00k14J30R4r3Q9l2j62
5827a50N3j3J22J41R9j47p5N0j48j45M36k57J08j98J09k3Q0J17k55qK19k15M8
5850e2M12j95l48R5j12J07j07K36m2j15Q5j64J35J75j78K73j08m6J37l52K17j98
5872a45j4O5N9J0l7m5n5J19J67L3k2k93K53k26N2O0J44mo2j86K19l24K83o5j46
5897a60n3K52O7P2j7k54K87p2o7k43M34n4k3l9q7J44l14N55k91q0L5j84n8K15
$$ plain form
5731 -76 192 -130 26 29 -64 -134 -183 172 99 147 -176 51 47 223 -132 41 -259 205 167 103 260 -70 258 -43
5755 -43 154 -69 157 -65 -121 -155 -162 146 -166 -108 -227 52 -63 -44 -108 27 124 138 -274 162 -35 40 114 64
5779 64 -108 -127 108 111 -116 -180 -198 -97 66 71 61 136 -31 -112 -331 75 258 65 -303 100 48 -327 -120 276
5803 276 -170 -8 -38 -93 12 193 59 24 64 42 181 188 -237 13 8 -162 38 -176 -46 48 -45 44 12 -150
5827 -150 -97 -110 12 153 252 105 30 80 -68 -213 223 -34 74 -124 -15 -38 42 159 -96 -104 115 -100 -52
5850 -52 360 165 -183 -88 -200 -93 -200 36 -6 -121 -36 -200 -65 110 -68 205 97 51 188 -164 53 -145
5872 -145 -159 -94 -35 -25 -62 -107 -162 -43 124 157 135 -158 95 -131 -79 -19 125 121 59 -127 92 -232 51 -14 -160
5897 -160 -213 39 106 178 161 -93 194 122 55 -188 246 192 169 130 43 187 -127 428 137 57 92 -92 -150 65
5921F5O6r5j33j6L77j16k76K45k93K46nj98P3o1P0j70J00K69j15J16j42q9L0K32
5945A80l11P0j35K31j34J0N9K08r4K7R4j73k08j62K46m0Q6m6J43M7j33N7j30K44
5969A36k5kj21l9K73j68l0k30O5K57j99J11k7J4m6J36Q8k21L18l30J53k12K07
5992A08J86l53k9R1L9j59K30j79J76j87J07k8J36L1l10K83k78L08l13J15K12l34
6014a48K37l46N57l08k9m1O7K43m4l11J79L7NO1k65J63o9J53l74J92R3k21k2L81
6038A90l63K28j10J16j87N2k9J25L4j3J37l60J63J67m84J80L46l01R1R2j77J45
6060D2Ll6QJ7l39M12n9J7l04L48j20P9Q4J92l53J42k91N0j20K34j22J97k03K33
6084A11J14j99j20K9L3J71k89K87J12k99J73k13lJ74K25l46J32J15l08K75j94
$$ plain form
5921 65 131 36 -97 -113 264 148 -128 117 -176 70 65 -133 -60 -121 -51 -221 -121 148 33 149 7 -82 -52 180
5945 180 -131 -61 -196 35 -99 -89 -30 178 84 111 205 32 -176 -338 -92 -132 -46 -92 51 98 -35 22 -108 136
5969 136 111 109 -12 -51 222 54 24 -206 -141 116 -83 28 1 15 -31 105 193 -28 290 -40 113 -99 108
5992 108 294 -59 -88 3 42 -117 113 -66 110 -77 30 2 138 169 -141 142 -136 172 -141 -26 186 -148
6014 -148 89 -257 300 -8 -37 -78 -11 232 188 -123 56 93 98 159 -106 57 -12 141 -233 -41 52 -169 -191 190
6038 190 -173 55 -55 61 -126 -74 -103 22 56 43 180 -180 -17 150 -334 -154 192 -109 -18 74 -103 42
6060 42 45 9 17 34 -305 107 48 65 -239 109 -11 68 152 344 -9 133 -158 -108 -228 6 -116 81 -122 111
6084 111 225 26 -94 -65 -32 139 -150 137 249 -50 123 -90 -93 81 306 -40 92 207 -101 174 -20
6105b0j50N4N2R1k4m5j00j52L19q8J15O6k02J29k63L4K17k8P8k89L58k35L16k50
6129a7J69qk07r4M38k50n8J29l93J54J55o3jL8j5J41k66K41k07J81K2j65j9M08
6153C13l26J18m9q2N4l19N87m12O9J7%q3L9K49J4j61Kk27J61j28K30p9K36l52
6177a29K98M5l56L42M9R9l13N6j73J09p7J47j54J52m10L50j02N4p4J31n7Q3m3
6200B7R0j83L15j99k15K41k19J76l4j8j18L17m57K36O2O0q8N4j39O6J49j30j60
6223a67K42l2j84N5J03R1r1J40N7r6n3j80L4J45J57j15P6%j33j60K19k56J04o8
6247a12K56j27j72M01l27J76r8K06o8j90L72k88j10M41k97J26k32M9P9j09j73
6268a97J84P3p9O4k24J26r8K7o9L10k77K27K19k91K5p5K7j30j28K05J39k9j31
$$ plain form
6105 -20 -170 -116 -64 27 3 -42 -142 -294 25 -63 52 118 -84 45 -218 -184 33 5 83 -206 152 -83 233 -17
6129 -17 152 144 -63 -157 281 31 -27 102 -291 -137 18 -45 -46 -8 -23 118 -148 93 -114 67 89 -76 -95 313
6153 313 -13 105 56 -26 28 -291 296 -116 -47 -30 -30 -113 -74 175 189 28 30 -197 -36 -164 66 -13 223 -129
6177 -129 169 214 -142 200 249 348 35 91 -82 27 -50 97 -57 95 -315 35 -67 -13 -87 44 -13 70 27
6200 27 117 -66 249 50 -165 76 -143 33 -1 -19 -137 180 -277 -41 21 81 -7 47 -92 -26 123 -7 -167
6223 -167 75 43 -141 -86 17 108 17 157 214 118 65 -115 -81 64 221 106 182 182 49 -111 108 -148 -44 -112
6247 -112 144 17 -155 246 -81 95 -3 203 135 -55 317 29 -81 360 63 189 -43 6 85 -24 -197
6268 -197 -13 60 -19 45 -179 -53 -151 -124 -193 117 -160 67 286 -5 20 -55 -28 -158 -286 -81 58 29 -102
6291a02J7K32j93K06q1N7j95K13k33L22k6J8M8m67k9l8L73m27L3L82j22N7j76
6314a31J49rK34k26k56L86k67k16L75O3J54n13M10q1Pp0j08K91l71J49O0O2q4
6337Hk5p2P6M01n17K70M9k14N7N5J73m53L93j71K12p3k28Nmj29K91R3j69O3P8
6362A69n46M64L6j61J05q7l00M52M6j26k4k7l3N6m8m1j28K33O7j42PJ0j22K60
6386A20J8j90Q4j49M8j12Q1j42J52p2L11m7k08R3j84K6J43J7j68L19q8q8L49n07
6410a94K80j60n1q3J46K30j38P5m1j15l1r8J98l3n8J1M2J87j65m2pq9j47K32j80
6435b31L19qj92Q8P9p3K88m30K89k92K10M4k0K1N8j34n8j77K29J47j68J03k11
6458a19J35P8O5j05n7r0K3K59j10J00j25j37mj96L62k22MK35L5l26J14K91m9l12
$$ plain form
6291 -102 -85 147 -46 160 79 136 -59 154 -79 243 217 235 283 -184 -213 -251 122 -305 -272 110 -12 45 -131
6314 -131 18 9 243 17 -239 147 -120 -336 39 102 256 -257 153 72 79 9 -99 192 -179 -30 30 92 8
6337 8 -17 -89 -13 388 -129 141 190 -24 33 88 261 -192 201 30 242 169 -59 -54 -58 -187 104 197 28 91 169
6362 169 -377 87 123 -38 67 -20 -320 132 178 52 28 1 -32 24 -24 -65 -193 40 107 -35 -28 -18 -140 120
6386 120 138 -52 32 -117 -69 -181 -100 -242 -90 -162 149 102 -106 -13 -197 -171 -28 -11 -179 140 52 -36 313 -194
6410 -194 86 -74 -125 -208 -62 168 30 105 64 -51 -82 -180 18 -15 -73 -62 -20 167 2 -40 -47 -136 -283 -51 -231
6435 -231 88 80 -112 -24 55 -18 270 -160 129 -163 47 91 71 92 150 16 -42 -219 10 157 -11 92 -119
6458 -119 16 94 159 54 -3 -93 -70 189 79 179 54 -83 -87 -283 79 -143 -139 96 131 -195 -81 210 161 -151
6482a51J77l55M99j3j04k37J05Rj28L78J7j87O1J73l99MJ73j20J08N1n9O8k72
6505b02P3J89k20J33O0J94p2j35L8K27k81N1j39K07r8rK9j87j39K07M8L3J37j02
6529D2J13p6O0k25rJ10o5L22j39j18j46L93J01l57Qj12K38q6P9J53m22Q3lk7j34
6554b17K3k8K19j29K63j55K6J13j1j47K25j65Q7l12J41K3J84k57J62k32p2J29
6576a30Q2k10L61O5j76j45J30J56j47kM9p5j00J79k6o7M1n9J06r9P3j41K52m4
6600G3p4j27k8J63nj8j06j28L99K00n16K63j06j10J93k52K93j56L15o02M58n8
6622G1j89J33o5J20r8J02r9J61j66j65R7j50L50j47k44J2J89M5M4l13M01l17K13
6645a5J74l58K33p1M9o0L03l75O1J60j6r8J73m35p7K57J28J60l19K93k28q3j33
$$ plain form
6482 -151 26 -329 170 157 53 -184 -79 -70 -198 180 197 10 71 244 -155 -151 22 -98 10 61 2 70 -202
6505 -202 -129 60 -160 -27 33 227 155 20 58 285 4 55 -84 123 25 16 45 -142 -281 -74 -26 7 144 42
6529 42 155 79 139 -86 -95 15 -50 272 133 15 -131 262 363 6 14 -98 140 54 133 286 -136 -53 -56 -83 -217
6554 -217 -194 -222 -3 -132 131 -24 2 115 104 -43 182 17 104 -208 -67 -44 140 -117 45 -187 -259 -130
6576 -130 -48 -258 103 168 -8 -153 -23 133 -14 -16 33 -42 -142 37 11 -56 -15 -74 32 -67 6 -135 117 73
6600 73 -1 -128 -156 7 2 -16 -122 -250 149 349 -167 96 -10 -120 73 -179 114 -42 273 -329 129 71
6622 71 -118 15 -50 70 -28 74 -25 136 -30 -195 -98 -248 102 -45 -289 -277 -88 -43 1 -312 89 -228 -15
6645 -15 159 -199 34 -37 12 -48 255 -120 -59 101 85 -13 160 -275 -352 -95 33 193 -126 167 -61 -144 -277
6668b77K56J38j41J5M9M9j71j21L23J63j33j52r0J71j57J25R6l21j06K37M2J01
6690I6j54m3K15k30P2K51k37J48k1j64rJ60n3M6j89J28K87k41m0P4q8L9m4k79
6714b76J91j00J59l4K1M5J30l5r4n1K01M7l81K92r4L25l53p9K83j01j48R0P8J45
6738B61k64R7p0j58J92K4J58P0j79p8Q0j51K96m14J83j87K19j64L3K63l91R6K00
6761A16k25J65j42R9P1l2j14P6j82L50l18O8KN5j71J12L0R6m8k64J50M2K05j7
6785A24j24m43M94J67j2j96m4j52J14mrJ45K54o04K72MJ3j70M33l14K46l0k77
6808a13J1J89k73K31J11j65J39j21K88m56K26j27j02K41l4J82r0o9J11N8l56J67
6830D8m5J6J31l00K33K9o2J57k47j9K51k42O6jj40O3j06J0L43k15J6J31k0k55
$$ plain form
6668 -277 -21 117 -24 -9 40 89 -82 -203 120 283 150 -2 -92 79 -78 47 143 -178 -284 -47 -5 96
6690 96 -58 -101 114 -116 -44 207 -30 118 97 -67 -76 84 31 77 -112 16 303 62 22 96 8 47 3 -276
6714 -276 -85 -185 -26 -60 -39 6 136 101 7 -44 157 204 -177 115 21 346 -7 -86 197 96 -52 38 116 261
6738 261 -3 94 24 -134 58 82 240 310 131 53 133 -18 278 -136 47 -140 79 -85 -52 211 -180 -84 116
6761 116 -109 56 -86 13 84 52 -62 14 -168 182 -136 -68 -66 -11 -182 -70 -40 56 8 -256 -106 -64 141 124
6785 124 0 -443 51 218 206 10 -34 -186 -72 -76 -85 60 314 -290 -18 -14 -1 -171 262 -52 194 164 -113
6808 -113 -102 87 -186 45 156 -9 130 9 297 -159 67 -60 -162 79 45 227 137 68 179 237 -119 48
6830 48 3 19 150 -150 83 112 50 207 -40 -59 192 -50 16 15 -125 -62 -168 -158 185 -30 -14 117 97 -158
6854a58L66l29J68k03j9R3k1K02j4N1k29P7M1j5k1J85m17J11n5J93j14j33k5J95
6878g1L2p6M0R6r6L30k55OO5l13J55k6K8K73m63L1M77k00j6p9J36J98m23J72j46
6903a25K63m44M44J20k65K18j5k09L3k0PJ00PJ13j62K5n3J09j72J98m10J45J20
6926B7m6O4Oj09Q8j59qN4O4k55K80p3j11J00J00m1J62q1J0l3k76M4K06Q8k73K84
6952A12j93K95l74Q6n8J42P6N8j98l5K6j47R8J46J08j28o9J43oq9N6k38K60j58
6976h7o5K38k80j21K18K41k64J05J25k36R0r2j0J22q9P1K05k97M25n22J13j3P5
6999d8J23J06n86N59k31J1j49J38J7L24l86L8K56j24k24K6P9n6J30j84L9J66n9
7022c5K15j58O3Pj70J30Ln4J23j62J63k15k08L59r5j32N4J64o1J70j94J74m25
$$ plain form
6854 -158 208 -121 47 -156 -175 -82 -103 99 85 136 -93 -16 25 10 -11 174 -243 -132 -187 6 -108 -241 -266 -71
6878 -71 -39 -115 -75 21 -75 255 0 6 71 -242 -87 -113 -85 188 -275 -244 233 33 17 -62 74 272 -151 21 -125
6903 -125 138 -306 138 258 -7 211 196 -13 20 0 7 107 114 227 65 90 37 146 -26 172 -238 -93 27
6926 27 -19 45 51 -58 30 -129 -137 -83 -19 -274 6 -67 -178 -78 22 -19 143 62 72 39 -237 -193 13 101 -172 112
6952 112 -81 214 -160 -74 -132 10 86 144 -54 -89 -63 -210 -112 34 142 14 -55 88 82 -7 49 -189 71 -87
6976 -87 -152 86 -194 -315 -97 144 -120 -15 110 -126 -36 -128 -138 -16 -105 -34 171 -126 299 -223 -110 -123 -48
6999 -48 75 181 -405 154 -77 -66 -215 -77 -60 264 -122 -84 172 48 -176 -150 -71 -127 3 -181 -142 24 -35
7022 -35 180 22 85 92 -78 52 55 1 124 -38 125 -90 -298 61 -34 -166 -112 52 -9 161 -33 141 -284
7045b84R2J45K30j21l25M42m19L52j47J62j03j33j7J96j51o3J97J28kJ56k2k84
7067B9k31K76K1k03M2J24L1N6k19J59j24J53P1m27M80j98j50K27j56q4P3j20J25
7090d5J22q9%p3l35L99j31Q3l0j53K46j43L02j07k00J83m50L04K1r8M56k65J77
7113A74j97J64r1q1K6Jl43L37r1J10Q4j49J26n2N1jK39l64Q1J32k56K63n90K85
7137a42L88l57M8q2K45J59j72r1mj27J68k05o1J43M1QJ74j21N9p3J69L5k07P3
7161F8L2k75N2K84j0R6m30J90K21n1k17L6j88l9J7J70J63l03Q5K67m8K18l30n00
7185d92L96K85j20j36m9J32J04k23J22p6J73k21J84k2p3q2j87J97J35l4J2N9j57
7208g3j51k46P47k22m6J77k69K4J0J97k99R2jp9K22j5J93k90J12j41M17m54J1
$$ plain form
7045 -284 -192 -47 183 62 -263 179 -240 112 -35 127 24 -109 -126 70 -81 -144 53 181 179 335 313 29
7067 29 -202 74 95 -108 -66 58 89 145 -74 85 -39 114 185 -242 238 40 -110 117 -39 -123 -50 -170 -45
7090 -45 77 -12 -12 -85 -420 -21 -152 -69 -99 -252 -6 -149 153 46 -154 29 -421 -117 -96 -194 262 -3 174
7113 174 -23 141 50 -31 -5 -4 -347 -10 -101 9 93 -56 70 18 69 68 307 -57 24 156 -100 163 -427 -142
7137 -142 246 -111 -63 -145 100 259 87 -4 -8 -135 33 -172 -233 -90 -49 -41 133 12 71 -2 167 202 -5 68
7161 68 100 -175 -123 161 151 247 -183 7 228 177 -40 -4 -192 -231 -214 -44 119 -184 -99 168 120 338 8 -492
7185 -492 -96 189 69 -67 -116 16 120 -103 19 -57 116 -105 79 57 -16 -98 -285 -88 47 13 25 84 -73
7208 -73 -224 -470 277 55 9 186 -83 -59 -49 148 -151 -59 -60 -139 83 68 261 -29 83 -58 359 -95 -84
7231h4L97l03K05n5k72N4N9P6j02m6n9J32J7k4Q3p8M3j75M20m59J12K92l76J35
7255hk63L87q5k0l83O56m05q6K87M2J9q0k86N15k07k53P6n2M48l36j27J03n2P9
7279c1M7k32L58n08M66j59O0rj37L9P2J44P5k01j27K06j36J32k57N8L0K85k57
7302h2J06k8K8M8q7o4J33j59qK61j84K47j61M4k63O0j81K73m3J12p1k78J59J31
7326gK26k84j72K77p7K31j49r5M38j73k65M6K75l43K97j78j8R6q0%p9r8Q2K0R4
7351F4M0k6R2k4l10L1j34K74%J35k19J52L3L0l41P4K18k27K36j94J84r7l1J33
7375I3qj24m9O6q2J36k00K51k8k03K22j33O3L6j5r1J3O8K2K51n00J55K72l51K40
7400A04j54J15o7K09M6j94m0n6m6n6K98l79L63l46P2K01o2O4J98k18J0j97l0J50
$$ plain form
7231 -84 313 10 215 160 -112 -58 1 77 -25 -71 -130 2 19 -5 78 0 43 -132 288 -171 -59 233 -143 -8
7255 -8 -271 116 31 11 -372 284 -121 -207 80 122 141 61 -225 290 83 -170 -94 -146 302 -34 -161 -58 -110 -31
7279 -31 16 -216 142 -366 100 -59 1 -8 -145 -106 -34 110 185 -16 -143 63 -73 59 -198 -140 -110 175 -82
7302 -82 24 -4 24 72 -15 -79 54 -105 -113 148 -36 211 50 94 -169 -109 -290 -17 -60 52 -19 -297 -138 -7
7326 -7 219 -65 -237 40 -37 194 45 -50 388 215 -50 -4 271 -72 225 47 29 125 45 45 -34 -132 -50 -30 64
7351 64 104 78 170 146 -164 -133 -267 7 7 142 -77 75 108 138 -203 -129 89 -138 98 -96 88 -9 -40 93
7375 93 85 -39 -88 -22 -104 32 -168 83 55 -148 74 -59 4 40 25 -66 -53 15 37 288 -212 -57 215 -136 104
7400 104 -50 65 -2 207 253 59 19 -37 -83 -139 159 -220 143 -203 -131 70 8 72 270 52 62 -135 -165 -15
7424a5qJ19j26J66j77L5J91r9P8k49M13n07K86mj78K53n22M81k36J16j05Q3k31
7447b36L87%j89K66l01j2J3L46j34r6K3j55J40J62j57j43L58r2n05N48k41J65
7469A47r0nl13J21j6K48j71J64j22p6K48n7j06r6J52k04J79O1N5k9J19n06K84
7492a3jj68K75l9Q0l9j93k14K01J9j0N7J5J03j63K14m2j50J89m33K30K8L21j73
7516I4j31L9j4O4j25O1oJ17p3l7K54k81K30K0m04L7L1J57K3k60J28K86k21j50
7540a61L90j09j69J43O6K8l94K82r4O5K0j66J8J28J65m18L61j08j47j03K37j9
7562A5K5p7j16J53m0L8M83m17N0L8J9j83K33m28O81l76n7J51j85l5P0R7j74K34
7586A99l85L95q5j19j51L04m01L42q1J47j35K5J36k31Q6r9n2mL95l63k8J70N1
$$ plain form
7424 -15 -23 96 -30 136 -41 -6 185 86 164 -85 328 -179 107 103 -75 178 -344 137 -99 17 -88 -5 -236
7447 -236 151 151 -38 228 -73 -85 -72 274 140 44 67 -88 52 214 57 -86 272 180 -325 223 -18 147
7469 147 57 52 -261 -140 -156 92 -79 85 -37 -113 135 78 -28 -124 28 -176 3 64 119 90 209 -297 -13
7492 -13 -14 -182 93 54 134 95 -98 -312 -111 -92 -102 -45 -30 73 -90 124 82 -68 121 -312 -82 -54 267 94
7516 94 -37 2 -12 52 -73 -12 -18 99 26 -11 243 -38 192 212 -192 -155 -124 33 56 -204 -76 210 -11 -161
7540 -161 229 120 -49 94 160 188 -206 76 -18 47 67 -99 -81 47 212 -206 155 47 -100 -203 34 15
7562 15 40 -37 -153 0 -40 -2 481 64 114 152 171 -12 221 -207 474 98 41 192 7 -28 42 139 -35 199
7586 199 -186 209 124 5 -146 158 -243 99 18 165 30 55 191 -40 46 -53 -105 -109 286 -77 -105 65 116
7609A16j40J33n0j30J82l97R7K34M3J00q3k59J95J49l9n54K77j34J23L03r4k00
7631a28J30N7JR8k87J79l31K88j32O3K93k28K89j01j44J8j64K09K2k20R0M2L47
7654C91n39J88k03J18PJ4P9j74J38J23q6j25Q0q2j7J21k09L19j85p5kL8K02j82
7678f1K2J17q0O9K0J45l42M9J79l5j63K38k19%K4l2J72M4k3j85M22o93K99J5N7
7703C9p6K5j4K92r2j04r8J35j88j03K2L69p4l29J91n4L50k39j4J22k48r8L50p
7727A57k44K36M9k50J46l8m1k85K78j65j1J60J61N3n06L09L0k89K50K4RQ6o5K
7751E6p0O5j26K10j51j03Jj49K04M23k60n3r3P3j22%l14M97l04K75k68L75l16
7774a50J90m1j09O4R6J70L4l37r8Q6J65o1J11M1o1j2k53J97k5J7j00K96L1k13
$$ plain form
7609 116 -24 109 59 -71 111 -286 -189 45 88 188 105 -154 41 190 151 -403 -126 -260 -137 166 72 -128
7631 -128 2 59 60 158 -129 50 -281 7 -125 -62 231 3 292 191 47 65 -99 110 132 -88 2 44 391
7654 391 -148 40 -163 -45 -38 -24 55 -119 19 142 56 -69 11 -71 -88 33 -176 143 -42 -117 -119 -81 121 -61
7678 -61 -39 78 -2 67 87 232 -110 -61 118 83 -80 158 -61 -61 -37 -69 103 147 124 -61 361 -332 -33 -18 39
7703 39 -37 -12 -26 266 174 70 -28 107 -81 -184 -162 207 133 -196 -5 -59 291 52 38 160 -88 -186 164 157
7727 157 -87 149 198 -52 94 56 15 -270 8 -157 -168 -8 153 206 -300 9 39 -250 0 24 33 119 54 56
7751 56 -14 51 -75 135 -16 -119 -118 -267 -63 360 100 47 -46 27 -95 -95 -409 88 -216 59 -209 166 -150
7774 -150 40 -1 -110 -46 50 220 254 -83 -181 -95 70 9 120 161 100 88 -165 32 7 24 -76 220 251 38
7798C8j33jJ39j04K0O1QJ82n58N69r8J49j22j56L07m86M05l42J64r0l7K39j8K8
7822A64k12l25M70q8m8o4J94j87K58l66K9Q2J5K14m72J85j44M95l37J82K46p9
7844B12k13J57m8l05P9K55L7k77J06m5K00k07J08L2k50J89j65J1J2P4l2J39J47
7867B16o7O6j36k54J78J77l03J27K25m1k90J43J92l03K91k09r4K04r1n5p4M6L94
7890C42m84K74k06J53k26j09K6K36J05P5j88N1k88K53M1k66K86j61K18r6K4l0
7912C0K9j87J35k52K07N0n1l7L60l68k11J53J17J31k75O9J47j11L2j26O7j04L31
7935A36j63L61m67J75Q2N5j98j62J39J00k2L2J07j5p4k87R6kk7J89j39J74j15
7958b5j18M0o1K24n5n0K52k84k06L41N7k61L6L3N0j80M44k92l7M2Q7Q6k11K23
$$ plain form
7798 38 -95 -96 43 -61 -41 20 28 210 -348 221 123 272 150 -6 301 -185 220 -122 42 -48 -85 154 136 164
7822 164 -48 -373 97 9 -39 -103 91 -96 162 -204 -175 -93 -78 136 -336 -151 -295 200 -137 45 291 212
7844 212 -1 156 108 -197 -118 137 174 -103 3 -42 158 -49 59 91 -159 30 -135 -124 -112 -38 -70 69 216
7867 216 149 215 79 -175 3 180 -123 4 229 188 -102 41 233 -70 221 12 -82 122 31 -24 -98 -52 342
7890 342 -142 132 -74 79 -147 -256 -230 6 111 186 -2 49 -239 14 55 -211 75 -86 132 36 60 30
7912 30 59 -128 7 -245 -38 12 -39 -76 284 -84 -295 -142 -25 106 -169 -100 47 -64 -32 -158 -91 -195 136
7935 136 -27 334 -133 42 124 179 -19 -181 -42 58 36 68 175 160 86 -201 -105 -107 -134 55 -84 90 -25
7958 -25 -143 -103 -164 60 5 -45 207 -77 -283 58 115 -146 -110 -77 -27 -207 237 -55 -92 -50 37 123 -88 135
7982A35L5m41R7L20k37L74q8k73O8K02j31m8M2k07L69m04K8K99k85j32mJ62J58
8005C9k45K78j71j3Q2M5l35L44L3J24m60M35l36J44L7k65M11k87J31K39j32k66
8027a68M21l18j6L05k4j12N6n2n2J18k31l40L86K71j31p2o2q9J6L04p6k64N2J21
8051D3j95J48l6p8j03K16J13R3k05K09j76j11J14j48r6K40o4Oj10K80L3l53K9
8074a51J27J74q0k6O9O3j95ll0J09j68J05R5q4K32m17J87j05M7l5Q3N3O1m8j94
8099a31L3J09j46Ll3P5p6J47J82j21J08k44q1L15q1J25n1r8j33q1J46lJ39j28
8123b5j14J88j51L07l04J54r5%j91J67L6M2J54j91k51K53O7l2p6M2P3r3L4L0l33
8148c09K00L32j89L5M8n3n6L52j42k01J15p4J7r0J60l57L38j6l29J25K66k00o3
$$ plain form
7982 135 170 -271 -174 146 -91 283 195 -78 -10 192 61 13 55 -152 217 -187 -159 140 -145 -277 -281 -119 39
8005 39 -206 72 -99 -112 -30 15 -320 24 57 181 -279 156 -180 -36 1 -264 147 -140 -9 230 98 -168
8027 -168 253 -65 -81 224 200 88 144 92 40 158 -73 -413 -27 244 113 41 -21 -110 -94 210 134 -130 -78 43
8051 43 -152 -4 -40 -118 -221 -5 108 201 -4 205 29 -82 32 -116 -212 28 -36 -30 -140 140 173 -180 -151
8074 -151 -24 150 70 44 113 176 -19 -22 -52 57 -111 -6 89 5 237 -180 7 -98 -51 -86 -3 50 111 63 -131
8099 -131 -98 11 -135 -132 -165 -90 -166 -19 163 42 150 -94 -175 140 59 184 133 35 -98 -179 -33 -36 103 -25
8123 -25 -139 49 -102 205 -99 55 -40 -40 -231 -64 -28 14 168 -23 -274 -21 46 14 -62 -20 53 -40 -6 24 -309
8148 -309 -109 223 34 69 117 64 8 360 218 17 132 58 75 -15 145 -212 126 110 -219 -94 172 -28 -91
8171i1J85O8o5k05nk1J54j83P8j11J90J21q1M8P0k03M4j77k3O0
$$ plain form
8171 -91 94 162 97 -108 -113 -134 20 -163 -85 -196 -6 115 34 82 152 -51 -7 -184 -207 -147
8191a47
$$ Imaginary data points
##PAGE= N=2
##DATA TABLE= (X++(I..I)), XYDATA
0@%%%%%%%%%%%%%%%%%%%%%%Oj4J6j6J6j6J6j7K5l2L2l3L9m6N0n6O3p1Q0q9R8j08
44e7J20j33J46j59J75j95K16k37K62k89L18l54L94m37M88n51O25p14Q29r79J183
65F51j481J950k811M879j8901j5160L9250q108j3392J6504m803k2271J6992J6586
79I885j5879q112R971o178k204J4155j990j3537Q47P960L134k410O71P71o961
94i877L679J2247m510p321L825J795p80J832L698l649p293O174P012p006j885
109b059O175k846n163Q429M967j2790J571J3778j1149m496J5440o516j1295J3225
123G271R61j4131O364R700j1419l210J1007m656p203R912J407j0061K003O525
137D470j461k876L027o40o639L753Q592n435o055M019o50r00M329J870p230l544
$$ plain form
0 0 0 0 0 0 0 0 0 0 0 0 0 0 0 0 0 0 0 0 0 0 0 0 6 -8 8 -8 8 -8 8 -9 16 -16 16 -17 22 -24 26 -30 33 -38 42 -47 51 -57
44 -57 63 -70 76 -83 92 -103 113 -124 138 -151 167 -187 207 -230 258 -293 332 -382 447 -532 651
65 651 -830 1120 -1691 3188 -15713 -30873 8377 269 -13123 3381 -1422 -23693 -6701 9885
79 9885 -5994 -14106 -4135 -10313 -12517 1638 -352 -13889 -13042 -5082 -1948 -4358 -3687 -2916 -9877
94 -9877 -6198 6049 1539 -5782 -1957 -162 -942 890 4588 939 -6354 -180 6832 -174 -2059
109 -2059 4116 1270 -3893 4536 9503 -3287 -1716 12062 913 -3583 11857 5341 -5954 7271
123 7271 8232 -5899 465 10165 -1254 -4464 6543 1887 -5316 4596 6003 -4058 -2055 4470
137 4470 3009 133 3160 2520 -4119 -366 8226 2791 -3264 755 105 -795 3534 5404 -1826 -5370
153e370O937M389m104k79l69l196J990P188Q63r714j733Q190k196j238P009q188
169A79q867J1374N251q392l0K209o670J269J2422m082j1917N843L367m521O017
184C452J903r593k697P972K469m911n42O80m745K269P500l595n767J773K492L96
200i44O41J556l153l624N168M005l958j144J133m79n85K487K382n091j895O499
216B998j232m138N543J7n817L630M774m625k647O871j459o368N691K514p191L512
232B073M158o662j834O177k27m286K030J468n095J661O421m415m322L336L55r25
248h7K032K62l924k573M668K454l541r12p68j411K351K900m91n006j515N048O17
265A04j126J940l377l874N073N077l775l694K020l79j116O178O51r531J567O109
$$ plain form
153 -5370 1567 5956 1852 1573 1204 -1992 -2 7186 8049 -1665 -3398 4792 2596 1358 8367 179
169 179 -8688 2686 7937 -455 -485 1724 -4946 -3677 8745 4663 -7254 -1411 1956 -2565 3452
184 3452 5355 -4238 -6935 1037 3506 -1405 -1947 -1267 -6012 -3743 3757 162 -5605 -3832 -1340 -944
200 -944 -303 1253 -1900 -5524 -356 3649 -309 -1453 -320 -799 -1384 1103 3485 -1606 -3501 2998
216 2998 1766 -2372 3171 3188 -2629 1001 5775 1150 -1497 5374 3915 -2453 3238 5752 -1439 2073
232 2073 6231 -431 -2265 3912 3685 -601 1429 2897 -2198 -537 5884 1469 -2853 483 838 -87
248 -87 1945 2207 -1717 -4290 378 2832 -709 -1621 -2389 -3800 -1449 1451 960 -4046 -5561 -513 104
265 104 -1022 918 -2459 -6333 -1260 3817 42 -3652 -1632 -2011 -3127 3051 3702 -5829 -4262 1847
281A847j562J79J847l813l601N989M958n260k220L152k614R19O198k772n681J263
297a171L581N0m20J019k890k691N164K137l488p59p2K61N93J455M23l361j266
314a435M039m36k164J089N4k155N86K842j203l761K995J726m813J821L138l789
330a466r34L723j732l146K929K585m058l43L306k813r99N259k241m212K740J667
346B65j177K74J271k636k336M496J833l708j3K40j031K201K038j050l146p04L891
363G08P96j137K61k063j365K791L055j540m082P44K177n18K357P09n455r55N200
380A683J051k120Rl52k827K787M827l606m113L271J3n06L364r43m885J33M305
397B091M66k172J006j170k648L934K548l345j101Q22J35R51P98j53k456p58K916
$$ plain form
281 1847 285 464 2311 -1502 -5103 886 5844 584 -1636 1516 -1098 -179 6019 3247 -2434 -1171
297 -1171 2410 2460 2040 3059 169 -2522 2642 4779 1291 532 460 721 1314 2769 3192 -169 -1435
314 -1435 2604 2168 4 1093 1147 -1008 -422 2420 1217 -2544 451 2177 -2636 -815 2323 -1466
330 -1466 -2400 1323 -409 -3555 -626 1959 -2099 -2442 864 -1949 -2948 2311 70 -4142 -1402 265
346 265 -912 -638 633 -2003 -4339 157 1990 -1718 -1731 -1491 -2522 -321 1717 667 -2479 -3183 708
363 708 1504 367 628 -1435 -2800 -9 3046 1506 -2576 -1832 345 -173 2184 2893 -2562 -3517 1683
380 1683 2734 614 623 271 -2556 231 5058 1452 -2661 610 623 117 3481 2538 -2347 -2214 2091
397 2091 2557 385 1391 221 -2427 1507 4055 710 -391 431 566 1517 2315 2162 -294 -1052 1864
414A864P0j278R5m56o28N31J072%k383P89K089k271O25J330j310r34J730L39k227
433i53M9K946k218k161L232r78k359L127N6l455M90K732p46j410J829n84k762
450c165K827K744l615m47J030o39Q05J676j032k846J22L225l1j077j9j357J96
467a603K364J519r41k665K54K343N05N64k88k910k83K989J759j854j708J73m69
484b51J287L505j847m179J963J779J4P06k4k752j148M077J225l221k37J51j713
501f65K311K203l155k067R02R03K32L55l29k461K51K769k57j249k41p02J63Q59
519a78L87n76j866O1J661q69k13L46j080J22J98J361r72j204K196j27j548J674
537f27K7j378J171P33j192o01J562P33k358R54J026k113J418K629k344j123J555
$$ plain form
414 1864 1934 656 751 295 -333 198 1270 1270 -1113 -324 1765 -506 119 1449 139 -795 935 1274 -953
433 -953 -904 2042 -176 -2337 895 -83 -2442 685 741 -2714 -2224 508 -238 -1648 181 -403 -3165
450 -3165 -338 2406 -1209 -1656 -626 -1265 -460 1216 184 -2662 -2540 685 654 -423 -442 -1799 -1603
467 -1603 761 2280 1339 -1326 -1072 1271 1776 2340 2052 -858 -1141 1848 3607 1753 45 218 -251
484 -251 1036 4541 2694 -1485 478 2257 2271 2977 2953 201 -947 3130 4355 1134 897 1048 -665
501 -665 1646 3849 694 -1373 -471 432 664 1019 690 -1771 -1520 1249 992 -257 -498 -1200 -1037 -178
519 -178 209 -367 -2233 -2172 -511 -1380 -1593 -1247 -2327 -2205 -2007 -646 -1618 -2822 -626 -753 -2301 -627
537 -627 -600 -1978 -807 -74 -1266 -1867 -305 428 -1930 -976 50 -2063 -645 1984 -360 -1483 72
554G2K01J80P83K77k388L38K819l16j257Q9j195n2J923J078j937j761K86J943
572A083K42J94p35k078O95J935J415j115k119k12J063M97J291j264k468K10J964
589E98N31r46n01r46q09K520K082k831j279J200k21R39J824j747k475P68K440
606A147n31o67oj993k04L042j39j831j23J83K01O76O22o67j452P21J246l48n9
625a82J78q96j93M27O15m59j106N50L13o55Q02l85n63L50O53n8p68O17J270j649
645a139J58J067j109K12J165p36j315O86J122m06l36O72j212p73K888j42j251
662d49K98j19J36J374N80j198j581P65J460Q6O1r69j446Q25J654K90j000j893
680a126J089R38L86P25j182j665O45J460P35q82j081m60k29J310J241k126j544
$$ plain form
554 72 273 453 1236 1513 -875 -537 2282 1966 709 798 -397 -449 1474 2552 615 -1146 -860 1083
572 1083 1325 1519 784 -1294 -599 1336 2751 1636 -483 -695 368 865 2156 892 -1576 -1366 598
589 598 1129 183 -318 -1264 -2073 447 2529 -302 -1581 -381 -602 337 2161 414 -2061 -1293 1147
606 1147 616 -51 -57 -2050 -2254 788 649 -1182 -1305 -1122 -921 -245 377 -290 -1742 -1021 225 -123 -182
625 -182 -4 -900 -1093 -666 -51 -510 -1616 -1066 -753 -1408 -606 -991 -1554 -1204 -551 -609 -1377 -760 510 -1139
645 -1139 -981 86 -1023 -811 354 -382 -1697 -1011 111 -295 -631 41 -1171 -1944 944 802 -449
662 -449 -151 -270 -134 1240 1820 622 -959 -194 1266 1352 1413 444 -1002 -177 1477 1767 767 -1126
680 -1126 -37 901 1287 2012 830 -835 -190 1270 2005 1123 42 -418 -647 663 1904 -222 -1766
697a766P10N33O65K83o34j899K23K233k5j397M19p95l46K240L23j972o79O37K85
716i62L04O01o76j717J079J321o29M41n38q10Q83M78O36l78q53P60N05k98L92
735E39l00l15J97L12j75l31k47J151n40pR92p02m3N08m3n39k38Q92L07j142R16
756A192m74r33J422L70j328n46O92K33Q3M02j78j843R63J697j278K23j36j459
774h98O12J587%r33j649P18Q41J1N93j387q35N35J318J71o66j337N57K38J063
793E39O16j683q74O08P86Q24o42q15n27l24K302K36j580n14J79r2J261N72j386
812e14j160Q61J274o58M76o7j835Q05J701o02m53j92m83M90Q86K29q86n42P33
831F3K73m8mm06O7J44L18K52n82J52M92n33J32M95l85K08l45L84j86l98O53L54
$$ plain form
697 -1766 -1056 -523 142 425 -209 -2108 -1885 348 323 -1074 -655 -1450 -1796 444 767 -1205 -1884 -1247 -962
716 -962 -658 -57 -733 -2450 -1371 -50 -679 -238 -776 -1586 -703 -225 411 33 -820 -60 445 147 539
735 539 239 -76 121 433 258 -73 -320 831 291 284 1276 574 531 1039 996 457 219 1111 1418 276 1192
756 1192 718 -215 1207 1577 249 -297 395 628 711 1113 935 -908 55 1752 474 697 561 -898
774 -898 -286 1301 1301 368 -1281 -563 278 289 882 -505 -1340 -805 513 684 18 -1319 -762 -524 539
793 539 1155 -528 -1402 -794 -8 816 174 -641 -1168 -1492 810 1046 -534 -1048 -869 -961 300 872 -514
812 -514 -1674 -813 461 -197 279 212 -1623 -818 883 281 -172 -364 -847 -357 529 758 -128 -670 63
831 63 336 288 284 -122 -55 89 407 659 77 229 721 188 320 815 430 638 293 677 491 93 746 1100
853A100o13R4J3l97M95J15m17p14N90O03m42M90k34j450N23J581p30n35j64n67
873f59O41M18J47p33j017P64N70lL72j132o97O48R26J24o89r60J70N98R31o0r93
894f34q19M31J064L80q06q38J9L00J216K71j550l25J95O53Q95j36l83j348O84
913g31J437k32q45J28p31O64J145o4j345O8L67L21M59l60l37m73R55J87l2k5l79
934A77l3M25J56K4m83j69N14j91J61M4n43M34m81J01M51k52qK85m73K88J63l34
956B56M04j31l08k67K5M52j17l31o0q18M16Q83n88l07l66K97M56K06L50r01q38
977a287Q88O61m62M6p38m44R34K35Q3o60o37M12L14P06l15j099J55M57Q31N62
997F42j020m66M80J47Q54n7q57j36j41J190M88q77m33o85L66J683k6j022J43k12
$$ plain form
853 1100 487 581 594 197 692 807 390 -324 266 869 427 917 683 -767 -244 1337 607 72 -92 -659
873 -659 -18 400 547 -186 -1203 -439 131 128 500 -632 -1329 -681 245 369 -320 -1280 -1110 -512 419 359 -634
894 -634 -1453 -1022 42 422 -384 -1222 -1203 -903 313 584 -966 -1291 -1096 -443 452 316 -67 -1415 -731
913 -731 706 474 -371 -243 -974 -310 835 771 -574 -506 -139 182 641 281 -56 -529 426 613 581 556 177
934 177 144 569 725 749 266 97 611 420 581 625 82 516 35 136 587 335 327 612 139 427 590 256
956 256 660 529 221 -46 -21 431 314 -17 -77 -895 -479 404 -184 -491 -857 -560 -104 102 452 -449 -1287
977 -1287 -399 262 -200 -154 -892 -1336 -402 -167 -84 -744 -1381 -969 -655 51 -264 -1363 -1208 -751 80 642
997 642 -378 -844 -364 -217 637 580 -277 -413 -554 636 1124 247 -186 -871 -505 1178 1152 130 273 61
1017F1N29Q64j16o78p23P34N96k95R8n83p42Q60N50m08k61m26K17M71j78L95p55
1038B10p6O11l73N51m15l00m0K56j73J83n35k39L51j74R3l11J61P3q8j30j8j41
1060e24P19l99k14K34k48r6P58k17m83k67L00L25j42L86l76r15O75Q70n02J18
1080Bp06L74L30O23n7p59o93R20oM15L7j019j75R70Q9Q0m84n18K33L43R98l02
1102F95q94j87K46R34L83p40n99R1L48Q82m18l69m61j03P22L72k99m73j90N06
1122D46P50o43kn38J9N09O12m99l70m60M54J01J57p3m72m80Q55k05k06J44p65
1143f66N71Q6K85j47o28M77J20k40P3k27J42Ql45M3L29n41L95k23K01J66n45P4
1165e92M45j87j33l15M01J87k13J6K7n43P54K32j38k84m11NP73j04K28p71k32
$$ plain form
1017 61 590 1454 1338 660 -63 671 1267 972 1070 487 -255 605 1155 747 486 60 277 748 570 965 210
1038 210 134 745 372 923 508 208 168 424 251 434 -101 -340 11 -163 -70 -381 -220 -147 -235 -365 -383 -524
1060 -524 195 -204 -418 -184 -432 -528 230 13 -470 -737 -437 -112 -254 132 -244 -1159 -484 386 -116 2
1080 2 -704 -330 0 623 566 -193 -886 34 28 443 480 -539 -714 256 345 425 -59 -577 -344 -1 997 695
1102 695 -199 -386 -140 794 1177 437 -162 -71 277 1159 741 372 -89 -192 530 902 603 130 -60 446
1122 446 1196 553 551 13 32 541 1153 654 284 -176 278 379 536 463 -9 -489 366 161 -45 99 -666
1143 -666 -95 -9 276 129 -499 -22 98 -142 -69 -296 -154 -146 -491 -448 -119 -660 -265 -488 -287 -121 -666 -592
1165 -592 -147 -334 -467 -782 -381 -194 -407 -391 -364 -907 -153 79 -59 -343 -754 -749 24 -80 148 -623 -855
1186h55Q58J90j24M19r48N00N3O60P3j094L92P4M7N44m31q24M94K71N49o1p00
1207H7k13O6P20M80p95j94k16J29N93L95n14m80o49P09O93m18l03m01l03R68J82
1228E36k39n61l95Q19qM7J8p12m37J055r3n5l48j44M2K02K16j35o31J11N24o06
1250g94P12l17k93K20j19M72j28l52K76q4Q3Q7j87J62J52l25K00j79p3L87k30
1271c30K02j47q2J78J76M4k43k64L10M57j29m7k82l40P17L81j14k07m13m3L41
1292A65P83o19n94L37J54j7O99l77p41L88J53N03k16k66n17K95J39N20l45m98
1312e4l5k19J118k85n93k05j68P50L79l17p78n2l0Q96j76M0q20j87P72R6k00M1
1334b7l55j3L86J02N4n74n31P31j23L98m8p40K93P3j5L02j94k66L12J06J43k9
$$ plain form
1186 -855 3 193 69 488 -460 40 93 753 826 -268 124 198 245 789 358 -466 28 299 848 787 87
1207 87 -126 -60 660 1140 345 151 -65 64 657 1052 538 58 -591 118 811 393 90 -311 -614 354 536
1228 536 297 -264 -659 160 152 199 217 -495 -932 123 30 -25 -373 -517 -475 -273 -57 -192 -823 -712 -188 -794
1250 -794 -82 -399 -692 -472 -591 -119 -247 -599 -323 -407 -324 -237 -424 -262 -110 -435 -235 -414 -487 -100 -330
1271 -330 -128 -275 -357 -179 -3 41 -202 -466 -156 301 172 125 -157 -497 220 601 487 280 -133 -176 165
1292 165 948 329 -265 72 226 209 908 531 -210 178 331 834 618 352 -165 130 269 789 444 -54
1312 -54 -89 -308 810 525 -68 -273 -441 309 688 371 -407 -459 -489 407 231 271 -549 -736 36 132 -68 -27
1334 -27 -382 -395 -9 93 147 -427 -958 -227 -350 48 0 -740 -447 -374 -389 -87 -281 -547 -235 -129 14 -15
1356a5l80K04j82o6N72n19M69Lm36J36J95J12k2k95L44R9L5O2K0J57l17j40N57
1379E93k7k11r9j51r2M45P8k49k05j79M37j41M30p4n58L0O16p4kk7p79Q6N36J86
1403E69m06m63R2k2L85O34r50r5QJ95O62n40k75P4k78P70j47k75l26k56K98M33
1425H7n4k22n64mQ73j68k35j66k48K70K71K59j50p61r0O72J83L33j37p02K86L41
1447G4l46K53l13M0K14P4L38k28o60O17j25K24L69o67K64j11P2K12l14l7J42Q0
1469A72J67k79j31Q2K05k97M64j81q0J76k56L17l44L3L44n9J47l21k30J56J57
1490B42K52k29o96RO49j74p6j9m98L07N47J52n56n40K79P3M77M43j071l15M59
1511b85J00K89l8l55l66K66N01l9o50m1j69M97L23J32n05j2k85M97N48o77j18
$$ plain form
1356 -15 -395 -191 -373 -439 133 -386 83 86 -350 -214 -19 93 71 -224 120 219 254 316 336 493 176 36 593
1379 593 566 355 256 105 13 458 536 287 82 -97 340 199 629 555 -3 27 643 569 567 540 -239 -153 383 569
1403 569 163 -300 -208 -230 155 789 -161 -256 -248 -53 609 69 -206 -132 -410 360 213 -62 -388 -644 -346 87
1425 87 33 -189 -753 -757 116 -52 -287 -453 -701 -431 -160 99 -51 -812 -902 -230 -47 286 149 -553 -267 74
1447 74 -272 -19 -332 -292 -78 -4 334 106 -554 63 -62 162 531 -136 128 17 89 301 -13 -50 92 172
1469 172 339 60 -71 11 216 -81 383 202 122 298 42 359 15 48 392 333 480 159 -71 85 242
1490 242 494 265 -431 -422 227 53 -23 -42 -540 -233 314 466 -90 -630 -351 -278 199 642 -429 -744 -285
1511 -285 -185 104 66 -289 -655 -389 112 73 -577 -618 -787 -290 33 165 -340 -352 -637 -140 408 -269 -387
1532c87m8Q6M91p5k04p11L54O80K36m19J5m84L40J99N43l14o22M00k9J57J77n14
1554a29j55M11kK51ol01j03M6K31L47m18l8J63j54N21k82r2q9K15k75J86l57J85
1577A55K5J0j65K25k97K23j56J24k34J18J87k06l3q8m59M66M3J74r7m12J26R6
1599a75j86M66o52k51M97L63m99L15k07l10J76J58O17n74K1j26L6M98n5m31K4
1620b95j20K14L34j97l30j04L32K47L55m00P5o23O81K53j77R5n41L92J29K07l91
1641A36k96K03M54j24K05m10j39L8M52J54m7m99O7J06L1J23P2m62J87j34L26p7
1663C66m18L31k51J75j02r1L7j3j49O33K1l52o7L5k14K08j35J25J54j66j96p7
1685a46k21N51o21N12j52k06K51qJ82l40k52R9J60J12L60n54Pj64L40j2Q6o41
$$ plain form
1532 -387 -435 -349 142 67 -137 -848 -494 186 422 3 18 -466 -126 73 616 302 -320 80 51 208 385 -129
1554 -129 -284 127 125 376 370 69 -34 12 243 590 172 134 297 143 664 382 290 201 416 141 327 -30 155
1577 155 180 190 25 250 -47 176 20 144 -90 28 215 9 -24 -112 -571 -105 -62 112 15 -397 -271 -175
1599 -175 -361 105 -547 -798 -301 62 -437 -122 -329 -639 -463 -305 312 -262 -241 -367 -331 167 112 -319 -295
1620 -295 -415 -201 133 -64 -394 -498 -166 81 436 36 111 -512 169 422 245 340 -201 191 320 527 136
1641 136 -160 43 497 373 578 168 29 67 519 673 626 127 194 300 331 454 526 64 251 117 443 366
1663 366 -52 279 28 203 101 10 47 34 -115 518 539 187 120 155 -59 149 14 139 293 127 -69 -146
1685 -146 -367 184 -437 75 -77 -283 -32 -40 142 -198 -450 -351 -191 -79 281 -273 -266 -430 -90 -102 -16 -657
1707f57L27j33K25K89k2o06O2N58p2J5l44R2J2K05L47k64m76R3N6M26J10m83r2
1730c32K9M18J07J68m89J75J06L25r2N1m71k18M09J55j66m6k64M09Pj5J25k15
1752A76l00L48J17J2l2n87N95l64JL29j56k33K57J22O1k36k72K17k22K90p7l4
1774A2l10L30k71L46l29J11j25j00K14k88R3O31k63k53m7k19K90P3J41j74j32
1795b70O0J03K95m40O7k18K27J07j36J80k54N1J35J87m7k45j63J54L94M8k19r
1817Gk93K11J58N7k48K3r9J61M24q8l22O8N1J37K89m17K03m60K70K77k92O8m52
1840b67J80M51O1k17k19j74L26J49Q3k10o66M8K80L50J09pk93j61J90L44k66k89
1862a98J27j39P1K72r8l58oj02K98K21j41q0p7k58L26j60K3J08j6J20l54J5L07
$$ plain form
1707 -657 -330 -463 -238 51 29 -577 -515 43 -29 -14 -358 -266 -254 -49 298 34 -442 -349 -293 133 243 -240 -332
1730 -332 -303 115 222 390 -99 76 182 507 415 466 -5 -223 186 341 175 129 -135 274 281 266 391 176
1752 176 -124 224 341 353 321 -266 329 -35 -34 295 139 -94 163 285 346 110 -162 55 -167 123 46 12
1774 12 -298 32 -239 107 -222 -111 -236 -336 -122 -410 -317 314 51 -202 -249 -468 -178 -105 36 -138 -270
1795 -270 -210 -107 188 -252 -185 -403 -176 -69 -205 -25 -279 -228 -93 94 47 -198 -361 -207 187 235 16 7
1817 7 -286 -75 83 140 -108 -85 -184 -23 401 313 -9 59 110 247 536 119 322 -138 132 409 117 185 -267
1840 -267 -87 364 425 208 -11 -185 141 290 373 163 -503 -455 -175 175 284 277 -16 -177 13 357 91 -198
1862 -198 -71 -210 -139 133 35 -323 -329 -431 -133 88 -53 -133 -210 -468 -142 -302 -279 -171 -187 -67 -421 -406 -99
1885i9j08R2j45m8J24J64q0l8K2j78K70J24rk08J66J20O9J37n07PK91k38J51J79
1909B58r3k76N2L86J62n06oK68k71N30l05k2l74J76L11J26M9l88j07L16j30R6
1931B52l8l01M20j93K93k5l81k6%K00K2j63p9j21K94J70j4m89R5k77L66K63M4
1954C12n55j96L13J26q3P2l43J30mK69pj90R6j59K37J85j35l61J63o8L6O6k61
1977c57J82K45l53M16j24m42K13J68k99L08j09M7L87j91k64K13J25k57K48o7l56
1998b67J27M14j18j77J4o5J26j0K92K74p18K50Q7J3R7j6m74L40Q3j93M39l32j34
2021E2J09K27Nl09l1qK50M9k47k07j6o0K63L16k49j15m80L16L1K9K34l41m9j74
2045d05K34K71k03k91K10J94k7n6k63j81M93p7K07j92l42J33L34J11k70j45q9
$$ plain form
1885 -99 -207 -115 -260 -308 -184 -20 -100 -138 -116 -294 -24 100 91 -117 49 169 238 375 -132 -125 166 -72 79 258
1909 258 165 -111 -59 327 489 -17 -23 245 -26 504 199 177 -197 -21 290 416 465 77 -30 286 156 252
1931 252 214 -87 333 140 433 408 27 1 1 201 223 60 -19 -140 154 324 310 -179 -84 -361 5 268 312
1954 312 -243 -439 -126 0 -83 -11 -354 -224 -228 41 34 -156 -60 -219 18 203 68 -293 -130 -198 -162 -96 -357
1977 -357 -175 70 -283 133 9 -433 -220 -52 -351 -43 -152 -105 282 91 -173 40 165 -92 156 89 -267
1998 -267 -140 274 156 -21 -7 -72 54 44 336 610 -108 142 229 242 339 323 -151 189 272 79 518 186 52
2021 52 161 388 393 84 53 45 295 344 97 -110 -126 -186 77 393 144 29 -451 -135 -104 -75 159 -182 -231 -405
2045 -405 -171 100 -103 -394 -184 10 -17 -73 -336 -517 -24 -101 106 -86 -428 -295 39 150 -120 -265 -354
2066c54J00j84N87n18L76k71K00j54M12k24k11M48j78J29l62J8ll0J68J92l32
2087a91J11J65K03l36L27j26r9r6M55l78L37r6k77N42l21j60o1L14j56P0k29j
2109cj16L61M1k61p8K16K2j08j18M4O9M3O5J99l98l44J24RL71k27L1p0k87N15
2133A00r6l04j28J08M65k27J63j5l73N0L13j63j64j0j68K14Q8q5K56n31J19L88
2155@j3q6K06n08J78R6p3L04l83n5J58N3mJ11j76L30l6j24o6o0RK39j88K16N3
2180A81q0J57q6k9m8j34Q4J54J29o9M8j93j08J14j17L7q5M29n67L25J4j63n9J42
2204G6j2N3%q8J5L41j62j91p8P4j76L05k50k42L91k2j11M44n07p8K70n8K13m65
2228b58J48Q4k10J10J36j65r4m1K20M02l56k54P4M7L06J02l24j47j38K91N3R2
$$ plain form
2066 -354 -254 -438 149 -369 7 -264 -64 -218 194 -30 -241 207 29 158 -204 -186 -189 -219 -51 141 -191
2087 -191 -80 85 288 -48 279 153 54 -42 413 35 372 276 -1 541 220 60 -1 313 157 227 -2 -3
2109 -3 -119 242 283 22 -56 160 182 74 -44 0 69 112 177 376 -22 -366 -242 -233 138 -89 -58 -128 -415 100
2133 100 4 -300 -428 -320 145 -82 81 66 -307 -257 56 -107 -271 -281 -449 -235 -147 -232 24 -507 -388 0
2155 0 -13 -99 107 -401 -223 -127 -200 104 -279 -334 -176 -123 -127 -16 -192 138 102 -22 -88 -148 -139 100 -88 128 181
2180 181 101 258 172 143 95 -39 45 199 328 259 307 114 6 120 3 40 -45 384 -183 142 156 -7 -66 76
2204 76 64 117 117 29 44 385 223 32 -46 28 -148 157 -93 -335 56 34 -77 367 -140 -218 52 -6 207 -258
2228 -258 -110 -26 -236 -126 10 -155 -249 -290 -70 332 -24 -278 -204 -157 149 251 -73 -220 -358 -67 -14 78
2250G8j91k56K2K18K09j68%j55J39K84l19L00m80L42j79L50m67J16K5L91l98K23
2272H4J43n02K22Q6K0K05K2j65J86k72K53J12l01k30K48Nn1k40N26q1j68k2R4
2295A74k19K73k09J26K55m90L48j96L1L2j74K87k36O1J27k37J51Pl83K69p4j66
2317b43N0K49ql14L51k07N5Mj16J09k62j47K07L96rJk11k11N29%j48k15R8L0J08
2342I6oJ23l46j20J99K37j85k4P0j61K50j73j67L46j46j37L59O0k42j33K77J99
2364C76k96J06n7O0J54k40L5L3l2j85J14K13r0j85j48K47m2K30j40j42j14K47
2386A44O8k39R2M2n4mJ84j27k46K62k28K86j70j30o5K90l10J86k41K94J04j65
2408b7j09J67l18L18j5Q5k52MN3q9RO7Q3j19p7K54Q2l13J49o7j15J81K3r2k34
$$ plain form
2250 78 -113 -369 -347 -129 80 -88 -88 -243 -104 180 -139 161 -319 23 -156 194 -273 -157 -132 259 -139 84
2272 84 227 -275 -53 33 53 258 280 115 301 29 282 394 93 -137 111 116 65 -175 351 270 102 80 174
2295 174 -45 228 19 145 400 -90 258 62 93 125 -49 238 2 63 190 -47 104 111 -272 -3 -77 -243
2317 -243 -193 56 48 -266 85 -122 -67 -63 -179 -70 -332 -479 -272 124 115 116 -95 -306 223 223 75 -140 -42 -12 96
2342 96 90 213 -133 -253 -54 183 -2 -26 44 -117 133 -40 -207 139 -7 -144 215 275 33 -100 177 376
2364 376 80 186 129 189 343 103 138 171 139 -46 68 281 191 6 -142 105 63 293 153 11 -103 144
2386 144 212 -27 65 107 53 49 233 106 -140 122 -106 180 10 -120 -185 105 -205 -19 -260 34 138 -27
2408 -27 -136 31 -287 31 16 101 -151 -147 -94 -183 -174 -107 -24 -143 -220 34 116 -197 -48 -115 -230 -49 -26 -118 -352
2433c52K40O0Q0l3nJ57K1mj06N4j08p4P9k39L75j16j55j1M94o9m17J06L5L1j57
2458a14L80r8j42L07k39J59l6k44o9N2M72j59J56k26l24L73m4o9R7l02M4K04J90
2481C68l69J70N6k02K09l02O1M4M3r1J66k13J26nk52K51J54j87P3m85K89p0J0
2504a56J85k25n1J73j96L19J7k54J90j90J6J45K6j6k11jK21Q8kk78O1Q2J86k18
2528h9J22K18m83P8K62r7k43j7m8M37L8j61R5J94N5m02j3L06j5r3j97q3K05J07
2552A76L7j00K1j61N17l49J39j79L24j45j10ln13L89J21J35N2l18j02l1K4K92
2574B16k03j19O1J87J45j74k93Q8p3o8L51p7p8k81K50K10k25r2M6r8j78L12m9
2597a42L49m07L17k54j6K65o7n9j17K6K02qk25k06L37p7J76q3j44J53l5JJ26l18
$$ plain form
2433 -352 -112 -52 28 -5 -10 147 168 164 58 112 4 -70 9 -230 145 29 -126 -137 357 288 -129 -23 12 43 -114
2458 -114 266 168 26 333 94 253 217 -27 -96 -44 428 269 425 199 -125 248 204 135 232 -70 -26 178 368
2481 368 -1 169 225 23 232 -70 -9 35 78 -13 153 -60 66 61 -191 60 214 27 100 -385 -96 -166 -156
2504 -156 29 -196 -247 -74 -270 49 66 -188 2 -188 -172 -27 -1 -17 -228 -229 -8 80 78 -200 -139 -57 129 -89
2528 -89 33 251 -232 -154 108 11 -232 -249 -297 140 178 17 112 306 361 -41 -54 252 237 144 -53 -136 69 176
2552 176 213 113 134 -27 490 141 280 101 425 280 170 167 -346 43 164 299 351 33 -69 -100 -76 216
2574 216 13 -106 -45 142 287 113 -180 -92 -165 -233 118 41 -37 -318 -68 142 -83 -175 -129 -227 -405 -93 -142
2597 -142 207 -200 117 -137 -153 112 45 -14 -131 -105 97 89 -136 -342 -5 -82 94 11 -133 20 -15 -14 112 -206
2621b06L95N1l01mQ8J2J92j02j05J4k42L01jo5k3p9J90k26j36J68K1p3L11j5j70
2646eQ6j01j89M55k72J23l2NJ86l9K19l14k1n6J62R4m30L6J11K88m26k1K15k25
2670a51K17N3NQj32R1n6k59M17j41l40L11k1J6l0j54k33K42J10N4k25N6J84k42
2694b20P9J05k50L23j29r7K77k57j10J69K04k60K65k20J7J68P3J78m26K97k69
2715h3PJ0j6J28N1j90J15J26j22p3j14J78K80k73j03K13K3j19J27j12P6J90l46
2738b7J68n4P4l19K70J50k07m6K00q0J98q2l67K75J66l35J16j12P3l11L82K0q8
2761F4J30o20L27K49k57L35m15o5N15j51pp5l05L44m73O23k51j34Q0pJ30k95K61
2784Cq7M9J02k20L20j23j44J67k68j35M24j57Rj53J96J80r4k16oK4J53J29j36
$$ plain form
2621 -206 189 240 -61 -65 23 35 227 125 20 34 -208 93 92 27 4 -75 115 -111 -247 -79 -58 -131 180 165 -5
2646 -5 81 -20 -209 246 -26 97 65 70 256 217 436 122 101 45 207 301 -129 -93 18 306 -120 -141 74 -151
2670 -151 66 119 124 132 0 91 35 -224 193 52 -288 23 2 18 -12 -166 -399 -157 -47 7 -218 -162 22 -220
2694 -220 -141 -36 -286 37 -92 -189 88 -169 -279 -110 94 -166 99 -121 -104 64 137 315 -111 186 -83
2715 -83 -76 -66 -82 46 97 -93 22 148 26 -47 -161 17 297 24 -79 134 157 38 165 53 129 319 -27
2738 -27 141 87 161 -158 112 262 55 9 209 129 327 245 -122 153 319 -16 100 -12 61 -250 132 152 64
2761 64 194 -426 -99 150 -107 228 -187 -252 263 112 105 30 -275 69 -404 219 -32 -166 -86 -93 37 -258 3
2784 3 -84 -35 67 -153 167 44 -100 67 -201 -336 88 -69 -60 -213 -17 163 69 -147 -153 -129 24 153 17
2807A7k13K46O7j43K74j47l1J11j89R4k38K19j97L38j36r7L58m73L36k52l00P81
2829D25m7l57j62M9K11o7R2P7o1k3k38L16l15p7K55j09j75J48K01k39jK33q7J03
2853A52j57L9l96K12K59j32j80L29l79J5q1J94N8k20K01J39J13k42j42p2J47j26
2875b69K55k91J26k4R1L7j9k0n4J23j88K72q1OK36l6m03J70K29j10r0r8K45J73
2899B80l88M9K74m5j13l51N44m21L41j6k19K51l1j04M6nk20M22k16J88l78J27
2921A5L12k09Oj00nK09k11j89J87j17L7j1l8K15n8j13K49j90k08M86j54j55J69
2944A27p0Nj35r5m4K6R5J82o8j75m6P7P3l0L09k78Oq6L61k13l15J08J08P3K2R3
2970A10p3m1J35N1j21o6l26K50J60r5J09q6j19J07j94L54k75J5K32j31k09M43
$$ plain form
2807 17 -196 50 117 -26 248 101 70 181 -8 86 -152 67 -130 208 72 -25 333 -140 196 -56 -356 425
2829 425 378 21 -141 -92 119 52 144 221 160 137 -101 215 -100 -177 78 -31 -206 -58 143 -96 -97 136 49 152
2853 152 -5 34 -362 -150 109 -23 -203 126 -253 -238 -319 -125 -67 -287 -86 53 166 -76 -218 -290 -143 -269
2875 -269 -14 -305 -179 -203 -112 -75 -94 -114 -168 -45 -233 39 -42 -36 200 164 -239 -69 160 50 -40 -138 107 280
2899 280 -108 -59 215 170 57 -294 250 -171 170 154 -65 186 155 51 97 92 -128 294 78 266 -112 15
2921 15 327 118 124 24 19 228 17 -172 15 -102 -65 -76 -114 101 43 -70 179 -11 -219 267 113 -42 127
2944 127 57 62 -73 -168 -212 -186 -91 91 23 -152 -198 -121 -48 -78 231 -47 -41 -127 234 21 -294 -186 -78 -5 17 110
2970 110 37 -4 131 182 61 -5 -331 -81 79 -16 93 7 -112 -5 -199 155 -120 -105 127 -4 -213 230
2992B30J28j28m7k2J43j90K8k12K08j50L21m56L43oj08r2K76l67J2K50j85J56
3014A32r0J07k03N1M9j71n0M63l43kQ2Rm1P3J30j78k55K05k2k09K78j20N4k7k96
3039c74L33m6J06k64K52L3J31l16J12m9j90K67J10j23l26K36j17L14r8j51k2J23
3061e9J2QP1k31j13L61j55K10%n08M02K37j29k63J01p5Q4j32L16m3q4p8K50l87
3085b05P0K51k72K55j64M24n68NK18J29q4M3m9j64L34j36J04oj48L7P6r7j62O7
3109d2j5M5O7j53K47j51j74L41k10n0K0J64l05K74j09l7P9j2JJ81k47P0P6j30
3133g0j68K73j12j69K40M6m3o8p8R8qr3j41N00k91n6J80k23R2j14Q8j03K12k20
3157b28J80J21j92O7O1j89kR6J56k4j44J3J14J52k34K6KR5q5J06r5J83j3k65J53
$$ plain form
2992 230 358 230 183 161 304 114 142 -70 138 -12 309 -147 196 190 82 -10 266 -101 -89 161 -24 132
3014 132 42 149 -54 -3 46 -125 -175 288 -55 -57 25 34 -7 66 196 18 -237 -32 -54 -263 15 -105 -51 -78 -374
3039 -374 -41 -87 19 -245 7 40 171 -145 -33 -82 -272 -5 105 -18 -344 -108 -225 89 -9 -160 -182 -59
3061 -59 -47 -39 32 -199 -312 49 -106 104 104 -404 -2 235 106 -157 -56 -131 -47 -179 137 94 10 -68 182 -205
3085 -205 -135 116 -156 99 -65 359 -209 -204 14 143 59 102 53 -111 223 87 191 185 37 74 150 53 -109 -42
3109 -42 -57 -12 55 -98 149 -2 -176 165 -45 -95 -75 89 -216 58 -51 -88 -9 -21 -20 161 -86 -16 60 -70
3133 -70 -238 35 -77 -246 -6 40 -3 -71 -149 -51 -59 -152 -293 207 -84 -140 40 -183 -91 -205 -117 -220 -8 -228
3157 -228 -48 73 -119 -52 9 -180 -182 -86 70 46 -98 -85 29 181 -53 -27 -25 70 -15 91 -4 179 166 -99 54
3182E4l50L77Rk59k5M41l9L9k41j35J19J52j60J10k66M09k60L6o8r6j10L12K2
3205G1m2q8K3r0J62J33j29k21J38J06k9j6j70q8L13j95J03O2k44L82k82K07j87
3228h1j53J06J57K3j4o0Q8j83Q6j06K53j81k43L50j47r8J62m7o7j47K64n5o3J11
3252d5k1N25m83J95k40M0L5J80J19m23Q0J29J1Q8J6l98N1J53J3p2Q2J9Nj29L22
3277B52k77J51j57MK13M7j83m3k25K38Q3j43J90j95M7J32k62J16j88M30j29j33
3299c2L6J0Ko3jJ87k87J84q0j52K03J58l06j0K21n2P6K1p9j10j51L51k05K5Mk05
3325b55N41o47J29J08J08p9J47l06N62n02p5N39k17n5j70J00j17M1rJ49j2j05
3347a25J40k02M97m53J21K7K69m22N6q0L49k12R6rJ88j21j63OJ62r8J07L0k59
$$ plain form
3182 54 -296 81 90 -169 -194 247 208 247 6 -129 -10 142 -18 92 -174 235 -25 11 -57 -153 -263 49 71
3205 71 29 -59 -36 -126 36 169 40 -181 -43 63 34 18 -152 -240 73 -122 -19 43 -201 181 -101 106 -81
3228 -81 -234 -128 29 52 38 -22 66 -117 -31 -137 116 -65 -308 42 -105 -203 -41 -88 -155 -302 -38 -93 -156 -45
3252 -45 -66 459 -24 171 -69 -29 6 186 305 -118 -38 91 102 190 206 -192 -141 12 25 -47 35 54 59 -70 252
3277 252 -25 126 -31 -27 186 233 50 7 -218 20 103 -40 150 -45 2 134 -128 -12 -200 230 101 -32
3299 -32 4 14 16 -47 -48 139 -148 36 -44 -196 7 165 -141 -151 70 18 94 115 36 -74 -225 126 -79 -54 -50 -255
3325 -255 286 -361 -232 -124 -16 -95 52 -254 308 -194 -269 270 53 -2 -172 -72 -189 -148 -157 -8 -20 -125
3347 -125 15 -187 310 -143 -22 5 274 -148 -92 -172 177 -35 61 52 240 119 -44 -38 124 26 133 163 -96
3370i6K27j16K03k52K3J44K3j66j77L05k60Q7K19k86K60j2p8p5K5L9j13OK15j80
3394c5n8J8j14J58k1Oj8N6J96l86m5K4O1J41J77k21k76M35m7lK7j58K99l03l9
3419a26J45j50J2K05k7j15j11j11M56l33K96l72J97j9K85j12J0j6L0o7n3j24n6
3442a56J97j06J88j49k6O3K56l20j91K61J7N1j8J8L02j32l74N29j50j58J6j37
3464a9J31k64K07Q6k43K40pj17j00J0O0j01M3j5J29P6K1j01j52J04n4J14J24l22
3488a50J28K8Q6j46J47k97J95j07N2J16m36M97m61Kj64N98m7j86N2R4M02m42L
3511c6j94L09L69n56R3m8K87m0l70N50l82k48N53l62k63O62j90L4M6m7J02P0m84
3534a45L36o30P68n01J29K90p43P55O1o77L40j33J25K40l06L6J17N1O4J16k03
$$ plain form
3370 -96 131 15 218 -34 -11 133 156 -10 -187 118 -142 -55 164 -122 138 126 48 -27 -2 37 -76 -70 145 -35
3394 -35 -93 -75 -189 -31 -52 -46 -64 -8 188 -198 -243 -219 -158 -17 160 -61 -337 98 51 48 75 -83 216 -87 -126
3419 -126 19 -131 -119 86 59 -56 -167 -278 178 -155 141 -231 -34 -53 232 120 130 114 144 77 24 -100 -156
3442 -156 41 -65 123 -26 -52 11 267 -53 -244 17 34 85 67 85 387 255 -119 410 260 102 118 -19
3464 -19 112 -152 55 141 -102 138 131 14 -86 -76 -16 -117 -74 -89 40 116 137 36 -116 -12 -66 48 172 -150
3488 -150 -22 6 92 -54 93 -204 -9 -116 -64 52 -384 113 -348 -346 -510 88 41 -145 -93 1 403 -39 -36
3511 -36 -230 79 448 -108 -15 -63 224 184 -186 364 -18 -266 287 -75 -338 324 134 168 214 167 269 339 -145
3534 -145 191 -439 329 -172 -43 247 -496 259 320 -357 -17 -150 -25 215 -91 -55 62 113 177 293 90
3555I0j36J0j68L41R8l64M71l67r4M06l19N30j36j026P36m59N19L76o99L09L9
3576A57j53m2K37k63K35k00k32K12M3l81N47Q9o97o3J82M16m19M60K08R5m82K71
3598B20o61J09K65L39l61j58L82J1m67M27k78L47l43j61M32J45j75l06K38K88
3618B93j99l37J84NK7L58k00j74L2J33j39L04l35j8J71J14l0pl65J43K44n2k67
3641a15L32k93p9J82o7J34j08j06J75k11J02j83K90O79M16k429J940q63q1M01
3661A16m54q2L02N09n20J2L8N1L6J61l07L86l88J64j55Q9Lj3J35Q8j83J13r0N5
3685F6j20N9M0j49J48j98K56nN02p21j26N10l50j52M6J22M95j248J157m01l16
3706c85j51P23K49l81M41m42R6l17KJ79J4k40K68j77K10l7j64R2J49r4M2q7L8
$$ plain form
3555 90 -46 -36 -204 137 235 -129 342 -25 -119 287 -32 498 362 -664 72 -387 132 508 -191 118 157
3576 157 4 -38 199 -64 171 -29 -261 -49 -6 -387 160 249 -448 -511 -329 87 -332 128 336 431 -51 220
3598 220 -441 -332 -67 272 -89 -247 135 146 -321 106 -172 175 -168 -329 103 248 73 -233 5 293
3618 293 94 -243 -59 -54 -27 331 131 -43 -11 122 -17 287 -48 -66 105 219 189 182 -183 -40 204 152 -115
3641 -115 217 -76 -155 27 -40 94 -14 -120 55 -156 -54 -237 53 732 1148 -1281 659 -204 -285 116
3661 116 -338 -420 -118 391 -129 -117 -79 -28 8 169 -138 248 -140 24 -131 -42 -39 -52 83 171 -12 101 11 66
3685 66 -54 5 45 -104 44 -154 102 97 599 -122 -248 262 -88 -240 -194 -72 423 -825 332 -69 -385
3706 -385 -536 187 436 55 496 54 150 -167 -165 14 28 -212 56 -121 89 52 -112 -20 129 35 77 -10 28
3729B8M8l22L47J98nl00Mj59K25mn9L10k67N2r0j83R5J04kr8Q3N8J96k42J13l58
3755b28M45l46n4J88j32P9R7n1N8j95n8J20j25J17J30l52p6N27m21L24K9l18M60
3778B18l97J28l9r2J56J56j25m8J20J00j1k57J05j25K79N6k55M9Q2j7L1j03L40
3801C51l30M5q1K9k1j50K14K19k40R5j65K46k10K72j29j40k25L11l2J7pm2J22
3824A49m14L32Mj71j11L84l74M16J23k46Ml00J76j19J11K33j3m2K05m59K16O7
3846A71j63K1M7j47N8mK09l11J12j65J01J33q0j51M63k93l75N44j45j75K29k99
3868b20J77k74L44J86k95O0j41K17q5J62k4J11j5m6o4k9l23L00j21K49j40k18
3890a89M29l11K42k53L5K59r9r2k46K57l28K39q8L02l62J37K86j43o3k26J55j19
$$ plain form
3729 28 76 -246 101 299 294 -6 -2 -161 64 60 1 311 44 96 6 -177 -82 22 20 -78 5 63 259 17 130 -228
3755 -228 217 -129 -183 5 -127 -48 49 -2 56 -139 -197 -77 -202 -85 45 -307 -383 144 -277 47 76 -242 218
3778 218 -179 -51 -90 -182 -26 130 5 -43 77 177 166 -91 14 -111 168 224 -31 18 100 83 114 11 351
3801 351 21 66 -15 14 -7 -157 57 276 36 131 -34 212 2 274 145 5 -220 91 59 76 69 27 149
3824 149 -265 67 71 -100 -211 173 -201 215 338 92 96 -204 -28 -147 -36 197 184 142 347 -112 104 171
3846 171 8 29 76 -71 -13 -17 192 -119 -7 -172 -71 62 -18 -169 294 1 -374 170 25 -150 79 -220
3868 -220 -43 -317 27 213 -82 -22 -163 54 -31 131 107 218 203 157 93 64 -259 41 -80 169 29 -189
3890 -189 240 -71 171 -82 -47 212 113 21 -225 32 -296 -57 -145 157 -205 -68 218 75 12 -214 -59 -178
3912a78K69j25K05p5j18j84K37p8Q2m52K16K55NK64n16L90l29J76J95k91Q7J9
3934E4j61J58o1J65l00J92j80j11M7J53m3M19n57m6R8J91j3j22j77k63M75j08
3956a90O04l08k57j46M59m57K87k9JJ23l9J03l66J13J76o2J11O1k43j40N5O4J83
3979A03k10R4p1R7k10j11oM93k84K61k82J06j36K38k1R4K9r4J54j33j49N4J34
4002A50j92Q6J86j65k6K3M0K3j13j72J25o0J34k1P8j71J98L0j63K51j92k19K59
4025H9k12L09k74o0K05l18K88j3J8m8J1p1K79j95R8kj66J20L8l51k1J5J04L98
4049B41J4l29J36l41jK19O9J86j45k30J76N9p4o6o5K34k08N7JK16k45J22j1k38
4073b23L8L47j88J97k80L93k09j03K8j3q0K24k75NR4K16k59JL07k87j59L34Q2
$$ plain form
3912 -178 91 -34 171 96 -22 -206 31 -47 35 -417 -201 54 59 323 -193 197 -132 44 239 -52 35 54
3934 54 -107 51 -10 155 -145 47 -133 -244 -197 -44 -87 332 -225 -271 -173 18 5 -117 -294 -557 -82 -190
3956 -190 414 106 -151 -297 162 -295 -8 -37 -36 87 48 151 -215 -102 74 12 123 184 -59 -199 -144 -80 103
3979 103 -107 -13 -84 13 -197 -308 -314 179 -105 156 -126 -20 -156 82 61 155 184 90 244 111 -38 16 150
4002 150 -42 44 230 65 39 62 102 125 12 -160 -35 -95 39 18 96 -75 123 153 -10 241 49 -170 89
4025 89 -123 186 -88 -148 57 -261 27 14 32 -16 -5 -76 203 8 106 104 -62 58 96 -255 -276 -261 -157 241
4049 241 255 -74 62 -279 -280 -61 8 194 49 -181 -5 54 -20 -86 -151 83 -125 -68 -67 149 -96 26 15 -223
4073 -223 -185 162 -26 171 -109 284 75 -28 0 -13 -93 131 -144 -139 -45 171 -88 -87 220 -67 -226 108 190
4096A90k06r7M8j37N13j66l06J21j42K72r9J94k49L9j61L50l00P1N0O2o9k87K90
4119a9J50K2l94K34J64k55J62j51J48j04N8o2J33k55J73J37j51Q6k25J43j01J79
4141G2j85J21J30m3j3J1j43o8K72m07L56O4l92NL74k36M8j4m7J39k35K87k25L04
4165A75j81R0r7p6J2L37r1N7k21J65k54l0J49k73L13k94K21J74j75K7l4M5j0k34
4189b05j1Q1n1K05m1K55j43j89l2j9M12q7k34K43k71J22j67J80k09J84NQ0l99
4212b91L38j3j8l1j92JR9K34j64K18k25j42J20J20N7J71n14K66k04M7JJ18k67
4235b71L96j65K04mJ3o0J1j42K5L9k33J88J23k22J30J21k09O4J31j44k6K95l93
4258a29L24m1j53M1K07l46J66J18j75l4OK0L3l3pL9O1k67M20k60qOJ47m1j79J34
$$ plain form
4096 190 -16 -113 -65 -202 311 145 -161 -40 -182 90 -9 185 -64 -25 -186 164 -136 -65 -15 47 -22 -309 -19
4119 -19 131 153 -241 -7 157 -98 64 -87 61 -43 15 -47 86 -169 4 141 -10 76 -149 -6 -107 72
4141 72 -113 8 138 95 82 93 -50 -118 154 -253 103 167 -225 -220 154 -82 -34 -48 -95 44 -191 96 -129 175
4165 175 -6 84 -13 -89 -77 260 169 226 5 170 -84 -114 35 -238 75 -219 2 176 1 28 -6 39 29 -205
4189 -205 -216 -135 -186 19 -22 233 90 -99 -131 -150 262 175 -59 184 -87 35 -132 48 -161 23 28 108 -291
4212 -291 47 34 16 -15 -207 -206 -107 127 -37 181 -44 -186 -66 54 111 282 -232 34 -170 -123 -122 -4 -271
4235 -271 125 -40 164 160 173 113 124 -18 7 46 -187 1 124 -98 32 153 -56 8 139 -5 -31 264 -129
4258 -129 195 154 1 42 249 -97 69 187 12 -22 -16 4 37 4 -3 36 97 -170 250 -10 -18 -12 135 94 -85 49
4284D9r3J22M8o5J7k14J84m3o8J81j00J42o9k77K52j17lK54k00M8K0m1l7m1J69
4309A18j90P2l78L12L05k62J90o1k19J94M6j58K88l02K5J93l2o8p7j27J13j20
4331a38R9K56l94K01j57K88j51k4k62j2L7M17j40o4O8n2K5o8Q4k55J1J27K42J20
4355B58p4k10qK1o1K7oj83L70l31K20k99M36l25L66j28j32j11Q7J78j26j10K10
4378F9k60J01j86l5N28o37M54j4k15J03M5Q1J0j96K83j56J89k23L49j91J48n01
4400b54L59j36k88M85k24J05j54P4J47k13K08J04l21K02J2L1j35K8m8o4j20n6
4422b58L14p1J03n5j40L07k76k06J12J33j06N2J03J18p0m8J01j35r6lM73l21k69
4445b38J95J00N9L4l21K85r4J51k42q2mK30j90k30N27j43j16j23L41k86q7J45
$$ plain form
4284 49 -44 78 126 61 78 -136 48 5 -63 118 18 160 91 -186 66 -51 -54 200 0 48 68 27 -10 -51 118
4309 118 -72 0 -378 -66 239 -23 167 106 -113 81 127 -31 257 -45 -20 173 141 73 -4 -131 -18 -138
4331 -138 -39 217 -177 24 -133 155 4 -20 -282 -294 -257 160 20 -44 24 -28 -3 -71 13 -242 -231 -104 138 258
4355 258 184 -26 -34 -13 -74 -47 -53 -236 134 -197 23 -276 160 -165 201 73 -59 -170 -83 95 -31 -141 69
4378 69 -191 -90 -276 -311 217 -420 34 20 -195 -92 -47 34 44 -152 131 -25 164 -59 290 99 247 -254
4400 -254 105 -31 -319 166 -58 47 -107 -33 114 -99 109 213 -108 94 106 137 2 30 -18 -82 -202 -258
4422 -258 56 -15 88 33 -107 200 -76 -282 -170 -37 -143 -91 12 130 60 12 113 -22 -118 -121 352 31 -238
4445 -238 -43 57 116 150 -171 114 20 171 -71 -153 -157 73 -117 -347 180 37 -79 -202 139 -147 -234 -89
4467h9K62k73J8J44r1K22K1l51L7K72p1qk02p0J02n9J97lm5L6n7K68k77Q2L7k19
4493a17M20m4k35Q7L0m20J67M0R3J23k1m63K57P1J48Qj58P9p4qL6J38k89N5O2
4518a5J27j87N2J60j63L1o4j28J25L27r3j57L62k21P7l50q7M14m37L30o3j71K26
4541I5j32l7J45mK9K8l8k69J35J19J86m52J00r6L47mj98k04K01R6j85J57P0O6
4565A55k25K14k39j15N18m79J6k30L57J83j98O6m7J52j59J85P9o9l1k07o7J72
4587C1n2J7K15k30j35J10K6l3j39J4J31j46R1J7n4K14J42k24J13P8r5Jq4r4K26
4612A40j35r1L27j05k12K09j52l2N0j11K0J45K1rk09K24j01Q0K37k92Q4O8Q3R
4636B48l45O9N6K2j47J42J2J13j75J34p3m0r7m5J25k15K36j06K61k13j91J25Q2
$$ plain form
4467 -89 173 -100 -82 62 -29 193 214 -137 -100 172 101 93 -109 -179 -77 -136 61 58 13 49 -8 260 -17 65 102 -117
4493 -117 303 259 24 111 141 -279 -112 -72 21 144 123 -340 -83 -12 136 144 -14 65 -9 -17 19 157 -132 -77 -15
4518 -15 112 -75 -23 137 -26 5 -59 -187 -62 265 172 15 377 156 233 -117 -204 210 -227 103 40 -131 95
4541 95 -37 -74 71 67 96 124 86 -183 -48 71 257 -195 -95 -191 156 152 -46 -250 -49 47 -138 19 89 155
4565 155 -70 144 -95 -210 308 -171 -155 -385 -28 155 -43 23 -24 128 -31 154 233 164 133 -74 -141 31
4587 31 -21 -4 211 -19 -154 -44 -18 -51 -190 -176 -45 -191 -100 -83 -137 77 219 -5 108 186 91 92 8 -86 140
4612 140 5 -86 241 136 -76 133 -19 -51 -1 -112 -92 53 74 65 -144 80 -21 59 296 4 88 156 239 248
4636 248 -97 -28 28 50 -97 45 57 170 -5 129 56 16 -81 -126 -1 -216 20 -86 175 -38 -229 -104 -22
4659b2r8N4k0k8m2J11Q0k14N3J88j61p2K71r7K9k9l11J52L04l07J32L7m3l4P6
4684Im9j22J60k69J85K5K6Oj5Q4l69M06r6j13J1J36o6N8%j95K25J29j63J07j8
4709I2K75j94o5q9k02J16J88j01L0n2k11K50J4O9l37M33k22K25n90K80K84l11
4731a18J78j46oJ89j11J78j57Q5J55j52K6J34k99p2M35k34j91J01O1P2l3q7r3
4754h5J65j53J4J73P2j66j99m3J88j93J41J36j87j95J75n8K58j5j96K98r9K0k81
4777b30J9P4k69K67J25J64j15j30l7Q6j05R3M9m4K03k29R1L5p7J40K48l91j02
4800a35J07poL99k28l6k65N39k27L1m45K90q3p0N67k87k7l42K89J12qj77P3k08
4824a44L77k97K2k1K1r4P0K30j30M1N0k22j11J84K71k26P6m0J0j13L79l90n2J32
$$ plain form
4659 -22 -120 -66 -86 -114 -156 -45 35 -179 -126 62 -99 -171 100 3 32 3 -308 -156 148 -159 -27 10 -33 -67 9
4684 9 -40 -162 -2 -271 -86 -61 -35 -29 -44 40 -329 77 -19 -132 -121 15 -51 7 7 -188 37 166 3 110 92
4709 92 367 173 108 19 -183 -67 121 20 50 -2 -213 37 51 120 -217 216 -6 219 -371 -91 193 -118
4731 -118 60 -86 -92 97 -14 164 7 92 247 95 121 255 -44 -116 319 85 -106 -5 56 128 95 8 -85
4754 -85 80 -73 -59 114 186 20 -179 -222 -34 -227 -86 50 -137 -332 -157 -215 43 28 -168 130 31 51 -230
4777 -230 -211 -137 -406 -139 -14 150 35 -95 -132 -46 -151 -58 -9 -53 150 -79 12 47 -30 110 358 -33 -135
4800 -135 -28 -35 -41 358 130 94 -171 368 141 172 -273 17 -66 -136 431 144 117 -225 64 176 168 -9 64 -144
4824 -144 233 -64 -42 -63 -42 -136 -66 164 34 75 125 -97 -208 -24 247 21 97 57 67 -46 333 -57 -109 23
4848B3J13n1l39K18j38L36j09n3j14L91k56P9Kr5o6K09j17m3q9L98l60k37M92
4871A94m39J10J92j09J52k69M57j94k34M29k74j07K48j28j21K9j0k52J81J65O1
4892H1K80m51K56l60P6J63K4k72K15l8J66k35J46j67J94n2p8J40r6q7j02K03r
4915cj5N9j61J71l33J76O9J41j6j28K65m71L18k87K80n8j08j06Q7J65j72l8M7
4938a18K0j17L73j84R9j97M0J27L0J07j60j01k9K4J29j82O9rK21j72j02L92k56
4961DJ7K9J15k1j81P5K4j39J04j3m4J01J26r7p3l08L67k42K78k9Q5j3m2p0K8K76
4987C57l46L41l18J15k18j7K17k64J02k5p1M23k47L03k24j56J23k1j58k2K51k74
5009a29m6K72k47J77l77M51l65L56j22J66q0j43J71o1j9j74K18J06J2l38K50j56
$$ plain form
4848 23 136 85 -254 -36 -174 162 53 0 -114 277 21 100 102 7 -59 150 33 -10 -99 299 -61 -298 194
4871 194 -245 -135 57 -52 100 -169 288 94 -140 289 15 -92 156 28 -93 -64 -74 -326 -145 20 81
4892 81 361 -90 166 -194 -118 45 69 -203 12 -26 140 -95 51 -116 78 26 -52 88 -8 -95 -197 6 -3
4915 -3 -18 41 -120 51 -282 -106 -37 104 88 -40 225 -246 72 -215 65 7 -101 -207 -120 45 -127 -165 -118
4938 -118 -98 -215 158 -26 73 -124 -84 43 73 180 20 -81 -110 -86 43 -139 -70 -79 142 -30 -132 260 4
4961 4 21 50 165 144 -37 38 62 -77 27 14 -30 71 197 100 27 -281 86 -156 122 93 178 165 123 53 81 357
4987 357 11 352 34 149 -69 -86 131 -133 -31 -56 -127 296 49 352 128 -28 95 74 -84 -106 145 -129
5009 -129 -175 97 -150 27 -350 101 -264 92 -30 136 56 -87 84 23 4 -170 48 154 166 -172 78 -78
5031g8O2P4l62L12l8O7N2k35P9P1l5J82p5K11k59j34N4m05M74j53J94j53J63o2
5055Fj15K92j04L30j09l10R7j40J47j9k15J94P6Oj57n4J27O5j69K66m72K20K43
5078B05p4j52P8j03J11Pj10O7J03k78L51k40J05L4J08l21n7J91j11K85m41L03
5100F1j69J58k03j14J91R8L1r7j52M09k02M0m43K25l1O9M2K14k25J26j62N8Kj9
5124i3JM7o5J18P1L6j28OK0j0j16J31J78j37L67o58J62q8J51L0j5o1K59q5K04
5149C25l07%J10L7K9q2nq1J0r6M0J79p8q1J9m00L22K68j30k30Q4j44J66j3J67
5174A09k25j09N1K56Q3j42k58j08L47P1o9N4j20l2O3P4J4n8J26j96J77M5j58M4
5198C9L6M9k4J23l61o1J55K21l55K58p1j80J80j11P7j1O4m15L48N9k2N9L01m31
$$ plain form
5031 -78 -16 58 -304 8 -30 37 89 -146 -67 4 -31 151 76 287 28 -106 -52 -457 17 -136 58 -95 68 6
5055 6 -109 183 79 409 300 -10 87 -53 94 75 -140 54 130 136 -21 -75 52 117 -52 214 -258 -38 205
5078 205 131 -21 57 -46 65 72 -38 29 132 -146 205 -35 70 104 212 -109 -166 25 -86 199 -242 61
5100 61 -108 50 -153 -267 -76 22 53 -44 -196 213 11 51 -392 -167 -198 -129 -87 127 -98 28 -134 -76 -74 -93
5124 -93 -92 -45 -110 8 79 115 -13 -7 13 3 -113 18 196 59 426 -232 -70 -158 -7 23 8 -53 206 121 325
5149 325 18 18 128 165 194 112 107 26 36 -60 -20 159 81 0 19 -381 -59 209 79 -151 -67 -211 -45 -58 109
5174 109 -116 -225 -174 82 165 23 -235 -343 4 75 6 60 -60 -92 -29 45 59 1 127 -69 108 153 -5 39
5198 39 75 124 100 223 -138 -199 -44 177 -178 80 9 -171 9 -102 -25 -36 28 -387 -39 20 -2 57 358 -73
5222g3K42J32p0j62o2j66J58q6J80q8O4k15J25P5L7j57L69O65o95m48k08N16j11
5245B2K27j15O3j89J6Q0P0j92k66L60n06P94l04J09k22k2L33k1p02L35P4L2J51
5268A27l74L31P8j21r1L25n8k07J13j15K74l56l9J45O5l85J24J31k2O4%j27j18
5291b36M29J00k61Q3k05j26j81M02J6j08J80K5j89J3J18L5n7J14N6l34m7K45j64
5314i2L6j59K87L8j47J62j80J32j50n7Q3K60j33j5Q6k1M4j11j18Q46r43j60N90
5337B78J21o6o57P03p68O07K00n12l55K97m8O21o77O58m58K02k00Q9j21J26L9
5358G9l1OM7r2P5Q5n2k58L6L5Q5k1J7j07J84J32k96K00l05Ko2J88L21l30K65j77
5384B6J53k22p5K61j58k13K54r4jN3km2J5k98M79j8J53r8k65L2J4j24o1J98J04
$$ plain form
5222 -73 169 301 231 69 7 -159 -1 -87 93 5 69 -146 -21 54 91 -66 303 968 273 -175 -383 133 22
5245 22 249 134 197 8 24 104 174 -18 -284 76 -430 364 60 169 -53 -75 258 237 -465 -130 -56 -24 127
5268 127 -247 84 162 41 -50 275 217 10 123 8 282 -74 -113 32 97 -288 -164 -33 -55 9 9 -118 -236
5291 -236 193 293 32 115 -90 -216 -397 5 21 -87 93 118 -71 -58 60 95 38 152 208 -126 -173 72 -92
5314 -92 -56 -215 72 110 -37 125 -55 77 -73 -130 -47 213 80 65 151 130 174 63 -55 791 -152 -312 278
5337 278 399 333 -324 379 -389 218 418 -94 -449 -152 -200 421 -256 402 -56 146 -54 35 -86 40 79
5358 79 48 54 101 9 84 169 117 -141 -105 -70 15 -6 11 -96 88 220 -76 124 -181 -179 -241 -53 268 -62 203 26
5384 26 179 -43 -118 143 -15 -228 26 -68 -69 -16 -18 -60 -45 -343 136 118 271 173 -92 -60 -46 -170 -231 -33 71
5409G1j03M0J05k18P5k70N06k04L40j79j16J40rj16O1l17J65k26L20j59K85L5
5431B26j28P3J0l67J17j33j92M02M75J2j46p21K47k63K80J71r6J99o94M82k17
5452b63K27k18K03j91L72o4k14J29l51L12R3k71M21l19l4M1K95j85j64J85l9j09
5474a44J79Pj0k39J50Qk1M02o14K50J07m25N40k14L04o97K96Q0o2J03K4p1J66
5497A19o9j55K44j80o8M66j61k35m7J05o5r3p3K54M7J70q8J36m18p3K99m3K60
5520C32l38J60j28k10K92q3n5Q4j17J77k75K31r2N1o9q2K18j09N5J44k61J40k20
5543a55L5L64k78K7n4l0l3k03L59J17n6r0M7J63k4j88j97K82l9K4j1m48N29r2
5567D9j86K79m01L92j09k04R7o2mJ55Q1L8k19M5J43p6j29J29K7j00K70j74J64
$$ plain form
5409 71 -32 8 113 -105 -30 -300 206 2 342 163 47 187 178 62 123 -194 -29 -255 65 -94 191 226
5431 226 98 171 181 -186 -69 -202 -394 8 483 495 349 -372 -125 -388 -108 63 -33 166 -528 -46 -263
5452 -263 -36 -254 -51 -242 130 66 -148 -19 -370 -58 35 -236 185 -134 -168 -127 168 -17 -181 4 -35 -144
5474 -144 35 42 32 -207 -57 -49 -70 332 -282 -32 75 -350 190 -24 280 -417 -121 -41 -103 0 24 -47 119
5497 119 50 -105 139 -41 -109 357 196 -39 -86 19 -46 -139 -212 42 89 259 171 307 -111 -184 115 72 332
5520 332 -6 154 26 -184 108 25 -30 54 -63 114 -161 70 -22 29 -40 -122 96 -13 42 186 -75 65 -155
5543 -155 -120 244 -34 -7 -61 -91 -124 -327 32 149 93 3 50 213 189 1 -196 86 47 71 60 -388 141 49
5567 49 -137 142 -259 133 24 -180 -83 -145 -149 6 87 125 -94 -49 94 18 -111 18 45 -55 215 41 205
5590B05l41K13p1N6p6M6N8J21q0j44J07n4p3J90m2r4M1k6J48m18K73J3k29J67
5614a0L2K33k91M32k90j40j5k18K29L7k4J8Q9n34M78k15n4J87K11m3m7j42J93
5637A16k03j95L69O5J14j85k55M6J06J01l14K36j90J1r9L48R1k43J36J05j60o2
5659f2j96K63J51j32M0k57p4J97R4Mn1p0Kj12J53k23O9O6L35k05O0J27j58J4o8
5684c3O6q7P4l21L13K9r7J44m16L96k04O8n1P4J23j19kJ44k05M2J33j62J78K83
5708C70j99M9k94K07m2k57K27j21J29k2O9j41l9j04O2q2L46q0k60JL96k47j92
5731b24J99L3m6J07n6J72j04j54p1J11k75P8O3O8L05l65K21P4k23R7Q7P4k73o3
5755a65J16M9l15M47o7J71k6n3j10O7j52J89nKK5M6q5J8p7j71L73k26j13O7L3
$$ plain form
5590 205 -136 77 6 62 -14 32 90 211 131 -13 94 40 -33 157 115 21 62 36 184 -234 39 52 -177 -10
5614 -10 22 255 -36 396 106 -34 -49 -267 -38 -1 -25 -7 82 -452 26 -189 -243 -56 155 112 65 -77 116
5637 116 -87 -282 87 152 266 81 -174 -128 -22 79 -235 1 -189 -178 -277 71 162 -81 55 160 0 -62
5659 -62 -258 5 156 24 64 -193 -267 -70 24 28 -23 -93 -91 -203 -50 -273 -204 -138 197 -8 52 179 21 35 -33
5684 -33 33 -54 20 -301 12 41 -56 88 -328 68 -136 -68 -119 -45 78 -41 -43 101 -104 -62 71 -91 87 370
5708 370 171 220 -74 133 91 -166 61 -60 69 47 116 -25 -64 -168 -106 -188 158 78 -182 -181 215 -32 -224
5731 -224 -25 8 -38 69 13 185 81 -73 -144 -33 -308 -230 -167 -99 206 -159 62 136 -87 10 97 171 -102 -165
5755 -165 -49 0 -315 132 65 236 210 157 47 114 -38 151 146 148 173 219 134 152 75 -96 277 51 -62 5 38
5780C8R4k37J30j54J74k66K40n7L0J39P0k42J7O9mR3P8j61P4j87L71k30j40n9
5804a20J27K28l08J13k55K61p7J59k63K58p7k89K92j50J0j93K80k44K10R4l01
5825b45K90j38J13j91M8K38q9J33l38R5k9M6J51K08n36K53q8J50J09k16K86k50
5847@J92k33J66J14k77J64k65J21J56j77J6k67N17j35m2j8p4j09L21k65J84j93
5869a04J73kMj68N2l9P4k20K88k26J85j97J97pK38j59qJ5q9J06O6k8j09J41J08
5894B91j23q2j72L88l19k37L95k09J9R2r9J73l2j40J60n7l7m6k4j43K21j03L50
5917B66l66J60L2n7L1j23j22m8K33j21J35j66L4k40M12P7m45L75l04K10p8q7K53
5940F1l5j61M4J53p0J2q6K04k03K48k63J82O1k11L06P4l54M85j83j64L3k02P3
$$ plain form
5780 38 132 -105 25 -129 45 -221 19 -38 -8 131 201 -41 -24 45 41 134 212 51 125 -62 309 79 -61 -120
5804 -120 7 235 -73 40 -215 46 -31 128 -135 123 46 -243 49 -101 -91 -284 -4 -248 -38 56 -245
5825 -245 45 -93 20 -171 -123 115 26 159 -179 -84 -113 -67 84 292 -244 9 -79 71 180 -36 250 0
5847 0 192 -41 125 239 -38 126 -139 -18 138 -39 -23 -290 227 92 50 32 -42 -151 170 -95 89 -104
5869 -104 69 67 71 -97 -45 -84 -10 -230 58 -168 17 -180 17 10 248 89 81 96 7 113 179 151 42 183 291
5894 291 168 86 -86 302 -17 -254 141 -68 -49 43 -56 117 85 -55 105 48 11 -35 -59 -202 19 -84 266
5917 266 -100 60 92 35 66 -57 -179 -227 6 -115 20 -146 -112 -352 60 137 -308 67 -237 -27 -105 -192 61
5940 61 26 -135 -91 62 -8 4 -82 122 -81 167 -96 86 147 -64 242 316 -38 447 264 100 133 -69 4
5963Do0J95j79jNj06J94L1j61L30j70jj53L65K4n20M86l91m7J17M8mL25j50j27
5988E4j98K38J09j68RmMj9p9K54j23k97L89j01P8j63r6j06K46k50M39j47l21K12
6012d0k10P3M12l88J96l26J63P8m7J17J07k6L1j39L8QRL73q50M53J82j77k17J25
6036e5K17k32J29m1r7n1k9RL21k15l0o0K32l91N01j23Q1r7j85K9K64%k66J78k23
6061a34O00m54O1j46J40j41j8O1r5K30k39K47j18J53j76j29J39l9n2K32j26J89
6083A85n2l14K49J68j5k59P5k86R9J45pj74J71J89k33K23l12l1J17M9Q1j59O3
6106b8R3j85L12j13J1j4k09k13L70m3j6J35j78J68j82K53j00m0o4j83K39J50j53
6129A0j8l9J62J52j33Kj97J00j49J06r5L5K8J1j03M59m14N2Kl0r1L01J6k03K72
$$ plain form
5963 4 -56 139 -40 -41 -36 -142 52 83 -78 252 82 81 -72 293 317 -203 283 -108 -155 -38 10 6 331 181 54
5988 54 -144 94 203 35 44 40 44 25 -54 200 77 -220 169 68 146 -17 -113 -219 27 -223 216 69 -252 -40
6012 -40 -250 -177 235 -153 43 -283 -120 -42 -89 28 135 109 140 1 39 47 56 429 -421 32 214 37 -180 -55
6036 -55 162 -70 59 18 -79 -130 -159 -150 171 -44 -74 -134 98 -293 208 85 166 69 -116 -87 177 177 -89 89 -134
6061 -134 466 12 73 -73 67 -74 -92 -31 -126 104 -135 112 -6 147 -29 -158 -19 -58 -110 122 -4 185
6083 185 133 -181 68 236 221 -38 37 -249 -150 -5 -12 -186 -15 174 -59 164 -148 -179 -62 -13 68 -91 -28
6106 -28 65 -120 192 79 90 76 -133 -346 24 -19 -35 100 -78 90 -92 161 61 21 -43 -226 13 163 10
6129 10 -8 -47 115 267 134 136 -61 39 -110 -4 -99 -64 -36 -25 -128 331 -83 -31 -29 -59 -150 151 167 -36 236
6154B36l11K11j22O8j70J87n4j08M08m14N9k01J12j2j01J75K85r0j54J17j99K75
6176A97j57J60j29K52n70J20L04j73k33K29J82p1k40J53m4K4k8Q3q9o1L98j18
6198A89l29n5L7J08L8L1r5o8rj15L39k94L35k36P5r9k6p7K08J86j63k18K53J67
6222A82J73k81j40J11p6K2P4O8j9j87J04k75K26R6k52M1K16Lj27j6Q8J54j64P4
6246I5j01P8J69k10O7J44j86j52L2J15R7j25L1J01j48J5j74K01M1m6j06K06n6
$$ plain form
6154 236 -75 136 14 82 -88 99 45 -63 345 -69 -10 -211 -99 -111 -212 -37 248 158 4 121 -78 197
6176 197 40 200 71 323 -247 -127 177 4 -229 0 182 111 -129 24 -20 4 -24 59 -30 -91 307 189
6198 189 -140 -195 -158 -50 -12 19 -76 -144 -153 -268 71 -223 112 -124 -49 -148 -174 -251 -43 143 -20 -238 15 182
6222 182 355 74 -66 45 -31 -9 65 133 114 -73 31 -244 -18 78 -174 -133 83 86 -41 -57 31 185 21 95
6246 95 -6 72 241 31 98 242 56 -96 -64 51 148 23 54 155 7 22 -152 49 90 44 -62 144 88
$$ [...]
8191I7
##END NTUPLES=NMR FID
##END=
