##TITLE=1H_SA-61.242
 DMSO-d6, 8 sc, 
 8.06.2021
##JCAMPDX= 6.0         $$ Bruker NMR JCAMP-DX V2.0
##DATA TYPE= NMR FID
##DATA CLASS= NTUPLES
##ORIGIN= UXNMR, Bruker Analytische Messtechnik GmbH
##OWNER= root
$$ XWIN-NMR		Version 3.5
$$ Tue Jun  8 13:37:46 2021 Russian Standard Time (UT+4h)  she@DPX200
##.OBSERVE FREQUENCY= 200.131506
##.OBSERVE NUCLEUS= ^1H
##.DELAY= (6, 6)
##.ACQUISITION MODE= SIMULTANEOUS
##.ACQUISITION SCHEME= undefined
##.AVERAGES= 2
##.DIGITISER RES= 18
##SPECTROMETER/DATA SYSTEM= spect
##.PULSE SEQUENCE= zg30
##.SOLVENT NAME= DMSO
##.SHIFT REFERENCE= (INTERNAL, DMSO, 0, 15.7039)
##AUDIT TRAIL= $$ (NUMBER, WHEN, WHO, WHERE, WHAT)
$$ ##TITLE= Audit trail, XWIN-NMR		Version 3.5
$$ ##JCAMPDX= 5.01
$$ ##ORIGIN= Bruker BioSpin GmbH
$$ ##OWNER= she
$$ F:/spectra/data/she/nmr/H-F/1/audita.txt
$$ ##AUDIT TRAIL=  $$ (NUMBER, WHEN, WHO, WHERE, WHAT)
(   1,<2021-06-08 13:36:23.23 +0400>,<she>,<DPX200>,
      <created by zg, POWCHK disabled, PULCHK disabled
       configuration hash MD5:
       00 E9 B6 7A A2 85 ED C7 34 08 36 98 17 FE 4E 26
       data hash MD5: 16K
       91 E2 87 41 FD 4B 95 C8 89 79 E4 5F 28 A2 19 C9>)
$$ ##END=
$$ 
$$ hash MD5
$$ 9A 6D 1C AA 9A E1 B6 7D 3F D0 F7 46 AF DD 42 CC
##$RELAX= 
##$RELAX= 
##$RELAX= 
##$RELAX= 
##$RELAX= 
##$RELAX= 
$$ Bruker specific parameters
$$ --------------------------
##$DU= <F:/spectra>
##$EXPNO= 1
##$NAME= <H-F>
##$PROCNO= 1
##$TYPE= <nmr>
##$USER= <she>
##$AMP= (0..31)
100 100 100 100 100 100 100 100 100 100 100 100 100 100 100 100 100 100 
100 100 100 100 100 100 100 100 100 100 100 100 100 100 
##$AQSEQ= 0
##$AQ_mod= 1
##$AUNM= <au_zg>
##$AUTOPOS= <>
##$BF1= 200.13
##$BF2= 200.13
##$BF3= 200.13
##$BF4= 200.13
##$BF5= 200.13
##$BF6= 200.13
##$BF7= 200.13
##$BF8= 200.13
##$BYTORDA= 1
##$CFDGTYP= 0
##$CFRGTYP= 5
##$CHEMSTR= <none>
##$CNST= (0..31)
1 1 145 1 1 1 1 1 1 1 1 1 1 1 1 1 1 1 1 1 1 1 1 1 1 1 1 1 1 1 1 1 
##$CPDPRG= <>
##$CPDPRG1= <>
##$CPDPRG2= <>
##$CPDPRG3= <>
##$CPDPRG4= <mlev>
##$CPDPRG5= <mlev>
##$CPDPRG6= <mlev>
##$CPDPRG7= <mlev>
##$CPDPRG8= <mlev>
##$CPDPRGB= <>
##$CPDPRGT= <>
##$D= (0..31)
0 1.2 0 0 0 0 0 0 0 0.06 0 0.03 0 0 0 0 0.0002 0 0 0 0 0 0 0 0 0 0 0 0 
0 0 0 
##$DATE= 1623144982
##$DBL= (0..7)
120 120 120 120 120 120 120 120 
##$DBP= (0..7)
150 150 150 150 150 150 150 150 
##$DBP07= 0
##$DBPNAM0= <>
##$DBPNAM1= <>
##$DBPNAM2= <>
##$DBPNAM3= <>
##$DBPNAM4= <>
##$DBPNAM5= <>
##$DBPNAM6= <>
##$DBPNAM7= <>
##$DBPOAL= (0..7)
0.5 0.5 0.5 0.5 0.5 0.5 0.5 0.5 
##$DBPOFFS= (0..7)
0 0 0 0 0 0 0 0 
##$DE= 6
##$DECBNUC= <off>
##$DECIM= 32
##$DECNUC= <off>
##$DECSTAT= 4
##$DIGMOD= 1
##$DIGTYP= 9
##$DL= (0..7)
0 120 120 120 120 120 120 120 
##$DP= (0..7)
150 150 150 150 150 150 150 150 
##$DP07= 0
##$DPNAME0= <>
##$DPNAME1= <>
##$DPNAME2= <>
##$DPNAME3= <>
##$DPNAME4= <>
##$DPNAME5= <>
##$DPNAME6= <>
##$DPNAME7= <>
##$DPOAL= (0..7)
0.5 0.5 0.5 0.5 0.5 0.5 0.5 0.5 
##$DPOFFS= (0..7)
0 0 0 0 0 0 0 0 
##$DQDMODE= 0
##$DR= 18
##$DS= 0
##$DSLIST= <SSSSSSSSSSSSSSS>
$$ [...]
##$SUBNAM2= <"">
##$SUBNAM3= <"">
##$SUBNAM4= <"">
##$SUBNAM5= <"">
##$SUBNAM6= <"">
##$SUBNAM7= <"">
##$SUBNAM8= <"">
##$SUBNAM9= <"">
##$SW= 20.0188882624521
##$SWIBOX= (0..15)
0 0 2 0 0 0 0 0 0 0 0 0 0 0 0 0 
##$SW_h= 4006.41025641026
##$TD= 16384
##$TD0= 1
##$TE= 0
##$TE2= 300
##$TE3= 300
##$TEG= 300
##$TL= (0..7)
0 120 120 120 120 120 120 120 
##$TP= (0..7)
150 150 150 150 150 150 150 150 
##$TP07= 0
##$TPNAME0= <>
##$TPNAME1= <>
##$TPNAME2= <>
##$TPNAME3= <>
##$TPNAME4= <>
##$TPNAME5= <>
##$TPNAME6= <>
##$TPNAME7= <>
##$TPOAL= (0..7)
0.5 0.5 0.5 0.5 0.5 0.5 0.5 0.5 
##$TPOFFS= (0..7)
0 0 0 0 0 0 0 0 
##$TUNHIN= 0
##$TUNHOUT= 0
##$TUNXOUT= 0
##$USERA1= <user>
##$USERA2= <user>
##$USERA3= <user>
##$USERA4= <user>
##$USERA5= <user>
##$V9= 5
##$VALIST= <valist>
##$VCLIST= <CCCCCCCCCCCCCCC>
##$VD= 0
##$VDLIST= <DDDDDDDDDDDDDDD>
##$VPLIST= <PPPPPPPPPPPPPPP>
##$VTLIST= <TTTTTTTTTTTTTTT>
##$WBST= 1024
##$WBSW= 4
##$XGAIN= (0..3)
0 0 0 0 
##$XL= 0
##$YL= 0
##$YMAX_a= 13500
##$YMIN_a= -9184
##$ZGOPTNS= <>
##$ZL1= 120
##$ZL2= 120
##$ZL3= 120
##$ZL4= 120
##$ABSF1= 10
##$ABSF2= 0
##$ABSG= 5
##$ABSL= 3
##$ALPHA= 0
##$AQORDER= 0
##$ASSFAC= 0
##$ASSFACI= 0
##$ASSFACX= 0
##$ASSWID= 0
##$AUNMP= <proc_1d>
##$AZFE= 0.1
##$AZFW= 0.1
##$BCFW= 1
##$BC_mod= 2
##$BYTORDP= 1
##$COROFFS= 0
##$CY= 11.3945322036743
##$DATMOD= 1
##$DC= 2
##$DFILT= <>
##$DTYPP= 0
##$F1P= 15.9154993809931
##$F2P= -4.1035820241983
##$FCOR= 0.5
##$FTSIZE= 0
##$FT_mod= 4
##$GAMMA= 1
##$GB= 0.15
##$INTBC= 1
##$INTSCL= 1
##$ISEN= 128
##$LB= 0.24
##$LEV0= 0
##$LPBIN= 0
##$MAXI= 10000
##$MC2= 0
##$MEAN= 0
##$ME_mod= 0
##$MI= 1.114404
##$NCOEF= 0
##$NC_proc= 0
##$NLEV= 6
##$NOISF1= 3.799351
##$NOISF2= 2.8
##$NSP= 1
##$NTH_PI= 0
##$NZP= 0
##$OFFSET= 15.70392
##$PC= 1
##$PHC0= -11492.54
##$PHC1= 17.40101
##$PH_mod= 1
##$PKNL= yes
##$PPARMOD= 0
##$PSCAL= 0
##$PSIGN= 0
##$REVERSE= no
##$SF= 200.130013532006
##$SI= 16384
##$SIGF1= 3
##$SIGF2= 2
##$SINO= 400
##$SIOLD= 16384
##$SREGLST= <1H.CDCl3>
##$SSB= 0
##$STSI= 0
##$STSR= 0
##$SW_p= 3612.71676300578
##$SYMM= 0
##$S_DEV= 0
##$TDeff= 0
##$TDoff= 0
##$TI= <>
##$TILT= no
##$TM1= 0
##$TM2= 0
##$TOPLEV= 0
##$USERP1= <user>
##$USERP2= <user>
##$USERP3= <user>
##$USERP4= <user>
##$USERP5= <user>
##$WDW= 1
##$XDIM= 8192
##$YMAX_p= 0
##$YMIN_p= 0
$$ End of Bruker specific parameters
$$ ---------------------------------
##NTUPLES= NMR FID
##VAR_NAME=  TIME,          FID/REAL,        FID/IMAG
##SYMBOL=    X,             R,               I
##VAR_TYPE=  INDEPENDENT,   DEPENDENT,       DEPENDENT
##VAR_FORM=  AFFN,          ASDF,            ASDF
##VAR_DIM=   8192,          8192,            8192
##UNITS=     SECONDS,       ARBITRARY UNITS, ARBITRARY UNITS
##FACTOR=    0.0002496,     1,               1
##FIRST=     0,             0,               0
##LAST=      2.0444736,     0,               0
##MIN=       0,             -9184,           0
##MAX=       2.0444736,     13500,           0
$$ Real data points
##PAGE= N=1
##DATA TABLE= (X++(R..R)), XYDATA
0@%%%%%%%%%%%%%%%%%%kMmMmMoQqQj0J2j4J6j8K0k2K6l0L2l4M0m6N0n4O0o8P5
46C9q2R1j00J10j22J34j48J64j80J98k20K45k73L07l48L97m59N40o49Q06j051
67f01J492k536R926N219j7921k924R270P820n816q101M67Q488R52o899k575O093
83B354K481l891l723J353N128J791o248n034M781P508j992r200k373Q595N573
98G103o255q803L414J0149o81j0161j219Q755L349p160n034M861O417k374p534
113e173k38P189J948n406l594K640M182P03m409l048M117M784k419n550N38O331
129B595K369n985n147M973P758l323q690Q54Q379K064o974m099N184N326k998
144B286n539J387N477J04m863j139L882K526k215l939k04M369K608l898m920J635
$$ plain form
0 0 0 0 0 0 0 0 0 0 0 0 0 0 0 0 0 0 0 0 -2 2 -2 2 -2 2 -4 4 -4 4 -6 6 -8 8 -10 10 -12 14 -16 16 -18 22 -24 26 -28 32 -36 39
46 39 -43 48 -52 58 -64 70 -78 86 -94 104 -116 129 -144 163 -185 212 -247 293 -356 450 -601
67 -601 891 -1645 8281 13500 -4421 -7345 1925 9745 3929 -4172 -3705 4783 5735 -1164 -3739 2354
83 2354 4835 944 -2779 -1426 3702 5493 -755 -5789 -1008 6500 4508 -4692 -7065 1530 7103
98 7103 848 -7955 -4541 5608 4927 -5234 -6453 2302 5651 -1509 -6543 -1682 4735 2361 -5173
113 -5173 -5411 1778 3726 -1680 -5274 -2634 1548 2251 -2158 -5206 -1089 3695 1276 -4274 -3736 2595
129 2595 4964 -1021 -6168 -1195 6563 3240 -5450 -4596 3783 5847 -1127 -5226 -42 5284 2286
144 2286 -3253 -1866 3611 3715 -1148 -2287 1595 4121 1906 -2033 -2237 2132 4740 842 -4078 -2443
160b443O069Q74n677l776M030O018k311o647Q60O128M02n269j448M513K383m190
176d84l741L255N104k146n609p0M894K291k985l746M17M077J861k828l432J135
192b007L626P67l639j984K942L067k680l924K289M564j430n204J71N218J721m467
208i70l339L369M327j343m614R5L944R96k683j763J307K421j4k491j206K067K393
225B496j168k800l75L128J970k704l291K102M033j305m131K51L927O50l758j726
241b701L343K518k705l466J635L743j79l221j295J956K413o43k340r61J776J738
257A611r69j849j91J746Q01j541j625J787J991j696k841J568L621p21l791j037
273c136L899K389k795l384J417L456k46k468p62J409J303o94j010J79P88K96j067
$$ plain form
160 -2443 3626 4500 -1177 -4953 -923 5095 2784 -3863 -3003 3125 3527 -1742 -3190 1323 3706 -484
176 -484 -4225 -970 4134 1988 -3621 -3691 1203 3494 509 -3237 -2820 1257 3118 290 -3142 -2007
192 -2007 1619 2386 -1253 -3237 -295 2772 92 -3832 -1543 3021 1591 -3613 -3442 1776 3497 -970
208 -970 -4309 -940 3387 2044 -2570 -2475 1469 2465 -218 -1981 -674 1747 1733 -758 -1964 103 2496
225 2496 1328 -1472 -1847 1281 3251 547 -2744 -642 3391 2086 -2045 -1794 2133 2783 -975 -2701
241 -2701 642 3160 455 -3011 -1376 2367 2188 -1033 -2328 -372 2041 1398 -942 -1903 -127 1611
257 1611 642 -1207 -1398 348 1149 -392 -2017 -230 1761 65 -2776 -1208 2413 1692 -2099 -3136
273 -3136 763 3152 357 -3027 -1610 1846 1600 -868 -1630 -221 1082 388 -622 -443 345 641 -426
290d26k41R47P45l74j555l95K363J265k275k416J593L176m51l338o62K794J594
307B344j968k352J619K117j044j899N19J545P9j452o46R08J090k98j200j96R54
324A20P72n27j081l55J353Q94j378j378J338J686r31k164J84K561M97k227j531
341b167K021K084j367k012M38J501L90j106n29P18M10m72k85K70N92k09p29j57
359f09O13R72j37j518q50J788J648j066k379K76K301M76j592j301J165J316q60
376B43j028P44P44o18r31N25J215j12j171o21J007J051k32j327m15O63J031J49
394I17j372q05J108J113o37j192K43J131M3r55k81J060N03j293p77J393Q91q21
412B69j232L65J364q9r04o28O90O84k74o16j03L87M83j8p14j72O97O08p37p72
$$ plain form
290 -426 -667 280 1025 651 -904 -1299 1064 2329 54 -2362 -769 2407 1956 -1382 -2044 750 2344
307 2344 376 -1976 -357 1760 716 -1183 -664 881 960 -492 -1138 -230 860 562 -638 -834 120
324 120 892 365 -716 -1071 282 1176 -202 -1580 -242 1444 513 -1651 -1467 1094 1591 -636 -2167
341 -2167 -146 1938 571 -1441 -1003 498 888 -218 -747 -29 381 -91 -376 -106 486 277 -452 -609
359 -609 4 976 839 -679 -1529 259 1907 841 -1538 -1262 1039 1515 -77 -1378 -213 1103 243
376 243 -785 -41 703 85 -846 -321 894 782 -389 -1010 -3 1048 816 -511 -926 -263 768 917
394 917 -455 -1260 -152 961 324 -868 -625 506 549 -406 -687 373 876 -417 -1194 199 1090 269
412 269 -963 -598 766 677 -227 -855 -165 519 245 -371 -474 -87 396 378 -336 -508 189 797 60 -712
432g12N21R17k80j025k66J072M85q81o98P99O80p31m46M66Q07l83j075L03R84
451E37L32q08q09M09O98K58m08o32k78J053M99n75o75J03O69j3k78j29J76j2m19
472c02N5J045m5j215m98Q37R02m18j146k87J074N59l76n89k08L67M10J35k18l98
492c16J65K01N5o0J35n7l14j22L47M00k26p43k9R57L66p04o79M67O22N9n89r4
514a59M34J67n86K5K34J20l01r8J08l5J70j31j56K8K62K07k91j46K58K38m4m61
536a57q4N83O5n88k59O01L17l46o23J14O14K24n68k32O6K46J42q7o8j21j8J07
558g2Q2p9m1m26L5L22L56Nm83l63L65Q56j0q02k99O11O08k03l98k67J26M24L3
581C80j72j64l5m6K59K78j94l85k24L87M04J5m65k31M3M45J99l72m29j67O17K98
$$ plain form
432 -712 -191 726 446 -579 -845 227 712 -169 -867 -68 612 -119 -565 -99 708 325 -750 -447 537
451 537 869 61 -748 -339 359 617 209 -423 -701 352 851 276 -399 -296 373 360 82 -47 129 117 -302
472 -302 -247 798 753 -462 -960 -123 779 361 -785 -1072 2 561 185 -404 -612 -245 165 300 82 -316
492 -316 -151 50 105 45 180 123 -191 -313 34 434 208 -535 -564 393 759 55 -624 -157 465 524 -65 -159
514 -159 275 442 -144 -119 115 235 -66 -164 -56 -91 79 -52 -208 -180 82 289 -2 -148 110 348 304 -157
536 -157 -241 342 407 -181 -440 161 478 132 -491 -377 237 461 -107 -339 -273 -27 115 28 -40 -161 -179 -72
558 -72 10 -69 -110 -536 -501 -179 177 182 -301 -664 -299 557 547 -255 -554 57 665 462 64 -203 -77 347 380
581 380 208 44 9 -37 222 500 306 -79 -303 84 488 503 38 -193 -150 295 494 122 -307 -474 143 441
603D41l91l20n1K53k0j14R6o9l4K7o2L67j19l64J39L14j1j35p4j26K39L0j04k50
627c38J84J85j91P7o8k9L19J8l47L0J61K14j70j65R0J06L6kj67J2oj05K25J63
651B32j86r2j49K64K05j8l51l8L62J75j11k78q0K6K14K46m70k43J65J2J89J11
673A85j77k12m7M09n6L3l68j38J92M13%n32p5k0M43K13k90m49J60L85K05j45k18
696h9k27K71K09M0j75r3j34J71L16j15k04j70M1J16L34r9m53p6M41J36k8j94j20
719a02J27Q2J18k67J07q3J64p7o4l4R9l0m4o7J07N1j17k2J49j25o9K31o7m5j14
744i2M7J32O9q7k45N9P6K43q2j57k61J95J16M0m4j93q9L03J09K0k87J8o6J48K97
769B69j30k32l29L73J26N8j39k07p8L61L0l4j85o2J90L13r4j15m09K01Q1K70o4
$$ plain form
603 441 50 -270 -321 -68 -88 -202 -106 -175 -209 -182 -244 123 4 -360 -221 93 82 -53 -127 -253 -14 16 -88 -338
627 -338 -154 31 -160 -83 -151 -180 139 157 -190 -160 1 215 45 -120 -30 76 112 110 -57 -45 -51 -156 69 232
651 232 46 -46 -195 69 274 256 -95 -133 229 404 293 15 -65 -39 175 421 -49 -292 -127 -115 74 185
673 185 8 -204 -251 158 102 135 -233 -371 -179 234 234 -298 -373 -393 50 263 -27 -476 -316 69 274 129 -89
696 -89 -316 -45 164 204 29 -64 -198 -27 289 174 -30 -200 -159 -43 291 192 -261 -337 104 240 212 18 -102
719 -102 25 107 225 -42 65 -18 146 69 5 -29 70 40 -4 -71 36 87 -30 -52 97 -28 -97 134 67 22 -92
744 -92 -45 87 156 69 -176 -117 -41 202 120 -37 -298 -103 13 53 9 -184 -273 30 139 159 -128 -110 -176 -28 269
769 269 139 -93 -422 -49 77 135 -4 -211 -289 72 102 68 -117 -179 11 324 230 115 -294 -93 -12 258 194
792A94k73k37L45K48j82O3l82J62J46J48m2l41j4L08J85m3k88j70J74J80k1L3
814A93j66j33J04J89j4j48j40n6J48K33j01j41k0P9P8k7r2j19J43l2Q4j39K2R7
838D2j86J49j7r6J15l5o6p8l3J30J03r4j4o7j0J99R0j11j46kK18P4k29j99J30
863a33N4K23l8j58j71J72J74K0l7k68K4K16J74N1j54k94N0K17J08p1k41j96L31
886E3J16R5k95j56J22J61O3k6r3l02J85L14J05k55j84j40L06J46j57r1m3m6J82
909F0Q4p7l00R6J49Q0m0j71n0J65J37q4l5o8J20k59K24mj24k1JK64k16P5N7J25
935A88o5pq0m1M6M0j08L4n7J67L3r2j81L1J3P3J37j60r9J63M3O7l0j83P6r6K55
962A67m8k34m0J59o8K27j35j88j9J89J08K4k12j28K26J77l4m6l33J29K11M3Nj61
$$ plain form
792 194 -79 -316 29 277 95 158 -224 -62 84 232 190 -151 -165 143 328 285 -3 -173 1 181 160 193
814 193 27 -106 -2 187 173 25 -115 -171 -23 210 109 -32 -52 27 105 78 -14 -133 10 -22 62 -77 -55 42
838 42 -144 5 -12 -108 7 -28 -94 -172 -205 -75 28 -66 -80 -147 -157 42 132 21 -125 -127 91 165 -64 -263 -133
863 -133 -79 144 106 -52 -223 -51 123 143 106 -162 -138 78 252 303 149 -145 -95 122 230 159 -82 -278 53
886 53 169 264 -31 -187 -65 96 159 133 40 -262 -77 237 342 87 -97 -237 69 215 58 -33 -76 -122 60
909 60 144 67 -233 -137 12 92 52 -119 -169 -4 133 49 14 -54 66 -193 31 27 -97 -118 -117 147 -69 6 63 188
935 188 123 116 36 -5 41 81 -27 7 -50 117 150 58 -123 -92 -79 -6 131 -29 -128 35 78 145 115 -68 8 -88 167
962 167 119 -115 -155 4 -64 163 28 -160 -179 10 118 142 -70 -198 28 205 171 125 -208 -79 132 175 180 19
986A9m6J41L5m7q6j30j09J93J59jj92k35L16N7J52l37k4J25m0P0m7j21j09L3J75
1011d9O4l4j42j56M75Q7j24j38k2j25K29J08j54j20pK40Pk0k29qO5L0j28J12J03
1036F4j38Q2J25q6n7r8J40po3P1j13J66o2r1M4m3P3rJ47j60r4K47L5j28K0R4L7
1063A96R7j02k49n1J64K9P8j19l1k03R2K61j89j1k19K16k4J95j8l23N8J4K09k0
1087E0k02m1L9K27j51n7j5M1J64J04j28j07r8K6K43J66k00r7n1O4J52M0k32j07
1111a70J63J86j67J19k06j30K49K06j33k72R3J63rj06L8p4K8J04J04m8q8k23R8
1134g5O8J8l3q6MN0rR0j32N7J60k27J16l8J90j09J16k84Q3Qn9K14j55pj29M4L5
1161i0J03o8O8m3K8J26r5j98J27J88J9j25Mj25k9L23j08k07Kn1J57J74j36o8r6
$$ plain form
986 19 -27 114 149 102 16 -114 -223 -30 129 128 -64 -299 17 74 226 -111 -135 -10 -50 20 -27 -148 -257 -224 -49
1011 -49 15 -19 -161 -317 158 245 121 -17 -39 -164 65 173 19 -101 -108 132 139 119 -110 -118 -53 -23 -151 -39 64
1036 64 -74 8 133 47 -10 -108 32 25 -38 33 -80 86 24 -67 -23 -66 7 -2 145 -15 -109 138 173 45 65 159 196
1063 196 293 191 -58 -109 55 84 162 43 12 -191 -99 162 -27 -38 -257 -41 -65 130 112 -211 -153 -139 70 50
1087 50 -152 -193 -154 73 -78 -135 -150 -109 55 159 31 -76 -174 -148 95 261 61 -36 -87 -23 129 169 -63 -170
1111 -170 -7 179 12 131 -75 -205 44 250 117 -155 -62 101 92 -14 24 -50 -22 82 186 138 50 -173 -75
1134 -75 -7 11 -22 -108 -104 -54 -63 27 -105 -48 112 -115 1 -37 153 44 160 -124 -41 -33 -92 122 -33 -40 -169 -125 -90
1161 -90 13 -55 13 -30 -2 124 29 -169 -42 146 165 40 44 -81 -110 213 105 -102 -100 -151 6 180 44 -24 -120
1186a20J67J04l5l2k03M6J30nJ27k63q7O8J30Q6j87n5J08J46l2j09j32P0Q6K27
1210B35q3j89l6k1J13N4k6j24l0J58N2o7N4j70p2L23j80O4m9M3j20J17p6R3N3
1235A16o9j55j1L4J8J06Po4Q1l8K4M2p2r3J56p6kn3Jo3J27pk4J68l32R1J7J70
1263I9j30L3o1N4J2J1L2j49K2R4N5k2o6J1j05J94r1m2p3P8J26P1L3k78N5QK13
1290A84j05L4k88R8J20J76j39j00pn8Q8J55j65Kn7J12J83k22J1j32qJ96m2Q3j08
1315A1L4j24Q2K8l7l7J26o2l2m3m8J99l2O0j46M9qp0J30nm1J1n8K8O2j07qO2Q
1344C2p1J02j79J87j8j70J57p0m1P2%k9jM6R9k6p9o8K3P6j1O5j51q6j7J26J45
1371A13j67Q3j06O0J04l9j33j51K43R5k2k6p8J6J5J96q5j74m4Q1n6J13J58k32
$$ plain form
1186 -120 47 151 116 84 -119 -73 57 52 179 -84 -171 -103 27 113 -74 -129 -21 125 93 -16 -148 -78 8 235
1210 235 152 -37 -73 -94 19 73 47 -77 -107 51 103 36 90 -80 -152 171 -9 55 6 49 -71 46 -30 63 116
1235 116 47 -108 -119 -85 -67 39 46 -18 63 25 49 91 19 -74 82 6 4 -49 -48 -111 16 9 -15 153 -179 -88 -71 99
1263 99 -31 2 -59 -5 7 18 50 -99 -77 17 72 50 -16 -5 -110 84 -7 -49 -122 -44 82 153 186 -92 -37 -29 184
1290 184 79 113 -175 -77 43 219 80 -20 -27 -85 3 158 -7 -5 -62 50 233 11 22 -110 -118 78 36 119 11
1315 11 45 -79 3 31 -6 -43 83 21 -11 -54 -102 97 65 125 -21 28 20 -50 80 75 34 45 -13 15 77 -30 -38 24 32
1344 32 -39 63 -116 71 53 -117 40 -30 -71 1 1 -28 -29 17 116 90 11 -57 -34 42 31 96 -55 -141 -158 -32 113
1371 113 -54 29 -77 -17 87 48 -85 -236 7 102 80 54 -24 -8 7 203 118 -56 -100 -19 -75 38 196 -36
1395c6q5J56j7J1Jj54qJ77K6m5l0m1Q4J8N7k67J66RJ7J0k3j14P5p3J18J06j42
1422dj10K59j11rl3j9j52J76rJ2l9kj1L5q1L0R9l5n5J16k40J21M9N8K7k4q1R9
1450F6j54K26J4k79P1m6J65m9r5K8K6o8J54j98Q2P0J15j73P7j40K5P9l2K4o0J32
1476F0k39J82P3j31m0J87o4k0J69l83J52k0J66j00m8KJ5P5kQ8k60M8J38j2J3k28
1502a79J41J20j3M2k22Q8j38J24K22r6j68O3q7J12M3J22k64m3J25m1m5k0J83j3
1526E6r0J21r2r2J60l9M3j9R2k58J22R2l8l2N0j62J33L9j04Q0q9n3Q9l8n7J59
1552G3Qr3o6P3k0lJ7Mj23K0J31J73r8j56R1j06J51J02j33j13M2O2rJ01j20j02
1578i4J69j53J67j22j49M7J15N4Pm0j4p5J75q4M9q3j30J83m9j19n7J69j36J65
$$ plain form
1395 -36 -121 35 18 29 30 -124 -132 45 71 26 -4 -45 39 57 114 -153 13 22 39 49 26 -88 -13 -86 32 138 -4
1422 -4 -114 145 34 25 -8 -27 -179 -3 -12 0 -39 -41 -52 -17 -98 -68 31 -4 -59 57 -183 -62 -13 45 72 48 -33 66
1450 66 -88 138 152 -127 -56 -102 63 14 -81 -53 -27 -95 59 -139 -57 13 128 -45 32 -108 -83 -4 -36 -12 -72 60
1476 60 -179 3 76 -55 -95 92 28 8 177 -206 -54 -74 92 -8 -56 -54 -39 36 34 122 -138 -90 48 36 49 -179
1502 -179 -38 82 69 111 -111 -23 -161 -37 185 89 -79 -16 -103 9 52 174 -90 -133 -8 -49 -94 -114 69 56
1526 56 -34 87 -5 -97 63 24 67 48 140 -118 4 96 58 26 76 -86 47 86 -18 62 -27 -80 9 -29 -86 73
1552 73 81 -12 -78 -5 -25 -28 -11 -7 -130 -110 21 194 96 -60 31 -75 76 178 45 -68 -26 36 27 128 8 -94
1578 -94 75 -78 89 -33 -182 -135 -20 34 41 1 -13 -88 87 3 52 -31 -161 22 -27 -146 -203 -34 -170 -5
1602ej0r9Q7j08J71M9q5l3j5jJ37k7j63J21k4J0N3L5p7Q9q3O0m0o0L2j77J73Q0
1630I0j18J73k09J36r8J03j11n2Ql2J94j87J01l7M4L9r2P6M5k13K75j97j4N4l3
1655e5J26r4j8qn0J09K0m1mq1j5J63j15K9l4K6J73j29n2q5O1N3n9O2l1oj23J97
1683A9o1m3OL8J39j32j02J38n2J63j01klo2J54L1j41p2MNK15k03O7J00p2J19j6
1710A36j18j4n0L1Q6n8k0qj6L4K7Q9m1j71J8J5J12p2k3K8L5J3Nq9K9nJ38o6j55
1739a10N5j30J27J3J81j84Q9M8k9j4j10J02N2K1j26Q0k7r5J03j97R6m0lJ70j23
1764e1l9J04KM9j08k4pN6N0R9j01p5J00j47R0N8j23m3J01l5K8p2j5K8Q6k4O8k9
1792B6j59N4L05k71J5rj04J33k3p2M5K7k6N7L7q4j17J93o0J33j50JP7KN4r9M3
$$ plain form
1602 -5 -15 -114 -27 -135 36 85 0 -33 -48 -49 88 61 -102 19 -5 5 58 93 16 105 22 82 42 -18 14 -163 10 90
1630 90 -28 145 -64 72 -26 77 -34 -86 -78 -110 84 -103 -2 -39 5 44 -48 28 73 -140 135 -62 -76 -22 -55
1655 -55 71 -23 -41 -49 -99 10 30 -11 -15 -96 -111 52 -63 -34 -68 -42 131 2 -50 -135 -74 -21 -80 -18 -49 -55 -178 19
1683 19 -42 -85 -79 -41 98 -34 -136 2 -50 113 12 10 7 -55 99 130 -11 -83 -79 -74 141 -62 5 105 33 152 136
1710 136 18 4 -46 -15 71 13 -7 -15 -31 3 30 119 78 -93 -75 -60 52 -20 -43 -15 20 33 38 -51 -22 -27 111 45 -110
1739 -110 -55 -185 -58 -45 136 -48 41 89 60 46 -64 38 90 111 -15 65 38 -57 46 -151 -55 -95 -98 72 -51
1764 -51 -90 14 16 65 -43 -67 -74 -18 32 131 30 -45 55 -92 -2 56 -67 -110 -9 -44 -16 -88 -103 -75 11 -13 55 26
1792 26 -133 -79 226 -45 -30 -39 -143 -10 -33 -105 -60 -33 -59 -2 35 -49 -166 27 -33 100 -50 -49 28 30 84 -15 28
1819B8j3OQ4o0p9L3M7j47K34j31n8L4R5o5O8j08K0R4m0R0l2j67J22p0J7N7j20
1846f1M5K5J6o8P6L6P3j76Q8J4o6l7O5Mo4J7j25K56k66O4K02r1m0p1J04Mq2JQ2
1875B5K17j62r1K8j1P8J4k40J10l9N4K4J04j45j04oK13n0k25K57M9j16%J6m3k0
1901f3M6n8J36lj93J00K18o5j39J9N9r4p4J84L7k38R4L9R8K7j85R9j4r0L4J25
1927I9p2j5M0K1Rm1j81J41M1m8j3m3K6O0j63K01J1q5p0k5J80r7J32j46J7J64k09
1954f6OP9kJ6o2L3l6O1p5J07k01R8N2n0q6l9K07J3n1q0oQ0j04J37o1k3J79j51
1982b5N7j36J26n4p8L03j04r2m5J05p9L6J55j55lj75L41j31N4j67m1J76m0K7J2
2007F7j21J00m0J3J39k52Q7Q8o6O8n8r4J54j22J02j20n0J19JK5M7q1j34Q8N1M2
$$ plain form
1819 28 15 21 105 45 -34 -1 46 -101 133 2 -56 -22 73 8 76 -32 -12 82 42 132 100 -67 55 -15 2 59 -61
1846 -61 -16 9 25 -43 33 69 142 -34 54 68 2 -35 30 34 -30 -13 -138 118 -148 -84 118 27 -13 -84 20 24 -58 -57 25
1875 25 242 80 -11 17 6 84 98 -142 -32 -71 -17 7 111 -34 -138 -144 69 19 -206 51 100 -16 -16 0 -43 -63
1901 -63 -17 -75 61 58 -135 -35 183 118 -21 -2 57 -37 -111 73 110 -128 -34 5 103 130 -55 44 30 -60 -26 99
1927 99 27 12 52 73 82 41 -140 1 42 -6 -19 -62 -36 24 -139 62 73 -12 -82 -107 73 -24 108 -38 -21 143 -66
1954 -66 -60 19 17 33 -29 4 -32 29 -46 61 -140 -42 10 -40 -126 -165 42 55 4 -76 -82 -2 -106 31 -30 -53 126 -25
1982 -25 32 -104 22 -32 -110 193 89 -3 -48 57 -22 14 169 14 11 -164 177 46 100 -67 -108 68 28 55 67
2007 67 -54 46 6 19 158 -94 -7 81 15 83 25 -69 85 -37 65 -55 -105 14 15 40 87 6 -128 -40 11 53
2033E3q2j04J20M5j33J36L4q2j22K07K3j69p6L8K28m0m0r3J79j44R2o6j4n9j8
2058h7K8Q3j1o6P6J35r8j69Q4k0k6o0K18q5p1q8J47j55K19j13j7J04m0J14k58
2083a56K55j67O1pM5K2n7qJ34k88OR6J23M7m9q2J29j32P0k3j1N3j45J82J03k22
2109b1j51R3J13j4m8mR0J82j75o2J10k60M0J33j3j03Jq5J55O8M8j29K9j4n5R3
2135B1K5m6l1O7q0P3j82J09J39p5J3j59J12m9L3p8N6J07k45P5R2k1N0K4L1o2K1
2162B0j2J8N6j36J09k7m6L2j11r1L47k00J80L0j59j08j1Q2J00j08o9J39o4l0R2
2187C3M9j01o8J26J3k1m9M9OL8j19PJ36lj54Q7J11p2j33L6J16N1j31N1q2o3n3
2214a40J01J87j10m8o8J43r0j3o9J3J22k7Q1j49P2n5N7J7L9n2q4K44J2j74Q6Q8
$$ plain form
2033 53 -29 -133 -13 32 -101 35 69 -13 -135 72 95 -74 -150 -112 116 76 36 -57 122 -22 70 4 -10 -69 -87
2058 -87 -59 24 13 -53 23 158 60 -109 -25 -45 -71 -131 87 2 -69 -157 -10 -165 54 -59 -76 28 -12 102 -156
2083 -156 99 -68 -7 -14 31 53 -4 -12 122 -166 -160 -64 59 106 57 -25 104 -28 42 19 8 61 -84 98 201 -21
2109 -21 -172 -79 34 20 -28 -32 58 240 65 3 113 -147 -107 26 13 -90 -89 -174 -19 49 97 -32 -3 -17 -72 21
2135 21 46 0 -31 36 -44 29 -153 -44 95 20 33 -126 -14 -63 -30 -108 -52 55 -190 -115 -23 -44 6 30 61 -1 20
2162 20 8 26 82 -54 55 28 -18 14 -97 -188 159 -41 139 169 10 -98 -109 -27 73 -35 -104 35 -29 -59 33
2187 33 82 -19 -87 39 52 31 -18 31 37 75 -44 -37 99 96 -58 29 140 68 -65 -29 87 138 7 58 -24 -87 -140
2214 -140 -39 148 38 -10 -78 65 -25 -38 -107 -94 28 1 82 -67 5 -50 7 24 63 11 -73 171 183 9 95 183
2240A83j87k0N9J8j03N1j09J60N0rj38j0J19j26M8J93j28j86Q1K9L0pNk5q6R7
2266a1J4o0J78j63J35J4k16K00j19P6k6j49K05j18P9l7o6J17K1j85P4P8j52J23
2290A2j26K03j58J26K0k8j38R9k17L20M4j07j33R7J18o8j28J6O9j30J18J13q9
2313C3j54N0K28j41q6n1JJ48J16r4L8j13oj33K56q1j06K9M4J45j9j89n8J83n0
2338a0q9P9m4m3L8N5J8j01j5R1R0N0k46J38J23j33k7M8J24j48j22J84J0m5j04
2363g9O9O9j43k9J07P0j27j4P8J05q8J06o6j06O9k04K07K3Kj79J59O7j11l2Q3
2388C6k01J06N2N8M3j80k0J29mP5j03L4q6o1J01J22m9m5P3j5n8j8n7j4J81j79
2414h0R8q8P6j24J65m0K8l5j71J63Q4n9rQ3N2j44O5r7Q1q3L8K7q1K9M3j5j11J45
$$ plain form
2240 183 -4 -24 35 53 -50 1 -108 52 102 93 -45 -55 64 -62 -14 179 51 -135 -54 -25 5 -2 3 -22 -108 -11
2266 -11 3 -57 121 -42 93 107 -109 91 -28 48 22 -127 78 -40 39 2 -64 53 74 -111 -37 41 -111 12
2290 12 -114 89 -69 57 77 49 -89 10 -207 113 157 50 -83 14 132 64 -64 -48 21 -109 9 122 33
2313 33 -121 -71 157 16 -70 -121 -120 28 144 50 88 -25 -31 -164 92 11 -95 -66 -22 123 104 -85 -143 40 -10
2338 -10 -99 -20 -64 -107 -69 -14 4 -97 -112 -21 69 119 -127 11 134 1 -26 22 146 -2 -124 60 70 25 -79
2363 -79 -10 59 -84 -113 -6 64 -63 -77 1 106 18 124 58 -48 21 -183 24 47 49 -130 29 96 -15 -47 36
2388 36 -165 -59 -7 51 94 -86 -106 23 19 94 -9 25 -61 -122 -21 101 52 7 80 65 7 -11 -68 -82 99 -80
2414 -80 18 -70 6 -118 47 7 35 0 -171 -8 76 17 8 91 143 -1 64 -33 48 -35 3 30 -51 -22 21 6 -105 40
2442D0j4L2nN7j1j71j04J32k2J38j8m0j13J60j18J6n8J99q6M0j14MQ4m3K7l9J68
2469A41j35j19K33p5MK1J6k8j07J75k65N0L5J63q0O3l9j21J08K4l7o4l4J20j53
2494a04M0kJ32j83O7L8n1K06k04J68j19o0J5l0J65Kj41J55K1j11L9J22j65j27
2518a27J44k1J39mK2j95J62j37R2j16N5r2o5J07N0l5K2o4J62j04K0O8o8P3j14
2543b6m4J32O5j99j5J65j10n6R4M9P7Pk83J27j33R4J62l9Q5k13J08r2N0Q1k03
2568a17J98q3RQ9j11m7J47n8J2j30N3J05j24O5p8J48l7o3j51O7J08n8J08n7oj15
2594a26J03ok1P9M2l9j6r8N8K9j3n0J53k37J99j35J2N7M7kj11J13L3Q9l7j46M
2621a9R3o6o6M4N6n4P4M5Oj49nqM8Lr9O5j67J2K23rO1k9j21J04j02r7J55m0J37
$$ plain form
2442 40 26 58 53 110 99 -72 -176 -44 -66 72 54 14 -99 61 -57 -41 -99 100 14 54 -60 -56 28 -15 12 -27 141
2469 141 6 -113 120 45 49 70 86 58 -49 126 -139 -89 -54 109 29 92 53 -68 40 64 27 -37 -71 49 -104
2494 -104 -64 -66 66 -117 -50 -12 -63 143 -61 107 -12 -72 -57 -87 78 80 -61 94 115 4 43 165 0 -127
2518 -127 17 -4 135 131 153 -42 120 -17 75 -41 14 -78 -143 -36 14 -21 1 -63 99 -5 15 83 15 88 -26
2543 -26 -70 62 127 -72 -87 78 -32 -88 6 55 132 139 -144 -17 -150 -56 106 67 152 -61 47 -45 5 86 -117
2568 -117 81 -2 7 96 -15 -62 85 27 39 -91 -38 67 -57 8 -70 78 41 -22 -173 -106 2 -56 52 -5 -11 -126
2594 -126 -23 -29 -50 29 71 32 16 -82 -24 5 -8 -58 95 -142 57 -78 -66 -9 38 36 -75 38 71 160 123 -23 -19
2621 -19 74 8 -58 -14 42 -12 62 107 113 -36 -41 -49 -1 2 -97 -32 -199 -187 36 27 88 59 -62 42 -60 -157 -2 -42 95
2650I5j46n4J00J9L9r1J17r0o2Q7MO8j28J75n3r7J55k28J55j20K5M8%L3l2k5Q4
2677G8k2rk3p5k7O0J21j44j21K18q1M1l2l1k5j4J21j30J06k6j23J91j28K7klJ0
2704d3J72j20N0j7k9K3r2J61j20o2K3M4J0j8J08l1ol1j38J00K5J44j13k12J13
2729e9J6K6R0j44R4jm2J51K5k74L8P2J5L0k7N6j18O3K3Q9j85J17l5N3j22N4pl
2757eL3JMm7pJ63k88Q3N5kk1J48j73J21p9P1j16J6Q0L8m6mN7n1l3Lk2K6Rj24Q3
2788b7n5n4R5J50m6n9J0N5j61M4M7n6O4j6k4K7nnk9J05j13JJ23l0K2Kp7O1j21
2817g2J59L0j83p0N8%J90j94N2j8M7L4j27O6Qj8P4J08j27K7J3q8J5K3O3K9l1j31
2845f3MK2l9J55qQ6j55K9K9P2j44O1J3k2P4j64J08j18Q0J09k23J15n4kM6j5k5
$$ plain form
2650 95 -51 -105 -5 14 53 -38 79 -11 -73 14 18 86 -42 133 80 -17 138 -90 65 -55 -30 18 18 51 19 -6 78
2677 78 56 47 24 -51 -78 -18 103 -41 -162 56 -25 16 -16 -47 -72 -86 35 -95 11 -15 -138 53 -75 -48 -50 -53 -43
2704 -43 129 9 59 42 13 36 -56 105 -15 -77 -54 -10 0 -18 90 59 53 22 -116 -16 9 153 40 -172 -59
2729 -59 -43 -17 73 -71 23 22 -20 131 156 -118 -80 -8 7 37 10 66 -52 11 34 123 -62 55 20 73 -49 5 -2 -5
2757 -5 28 29 33 -14 -21 142 -146 -63 -8 -10 -31 117 -56 65 -14 57 -59 -43 37 75 29 25 82 31 -2 1 -21 5 14 -110 -27
2788 -27 -82 -136 -41 109 63 4 14 69 -92 -48 -1 -57 7 -9 -33 -6 -11 -16 -45 60 -53 -52 71 41 63 65 -12 49 -72
2817 -72 87 117 -66 -136 -78 -78 112 -82 -30 -48 -1 33 -94 -28 -20 -38 36 144 17 44 57 -31 -16 7 70 99 68 -63
2845 -63 -59 -37 -76 79 71 157 2 31 60 132 -12 49 62 40 114 -50 58 -60 20 129 -94 21 -33 -35 11 -4 -29
2872b9k4j8J5N7J32j46j21N4N8O3p4r8J63p3P0mm0N0n5k5nP3j63J54r2Q3P8n1
2900C2M7m9k1q9k9J63L6k40K04p2j90L04j2n3mp7L8K9m7Q5r5J15p2J59j53j27
2926a18J03N9R9k19K15j73J9j5p0J54Oj44J05k15P7J21Q7j05P1J1r8L7L4j49M3
2951f5J24p2R5J9r1J5n9J04n1L2j40P0N7%m1Kk3R6%pL1m0L0j25O6p3J27k7J0q9
2981b5oJ4R5j09J09q5J0J3n7O6J3j9J5m1m7K4q4l3K28j61k9J47n5n7O5J5p6J05
3009C5o2Q5m0n7nR4j04K0J8k5m8J02N7j24P4m5m4r5J18P3Q4j18J00q1K3N6O9k39
3037g9Q0LM7pp7Ql7J07r4J41k0m1O7r1L0r4L0rM0K3j0L6q5K8nr1K5J83k0j35j36
3068a83J99n2N3J9P5j92M8N3k3K0j48J21k8m2J43j9p4O4R7k19p6J76o9J75j54
$$ plain form
2872 -29 -53 -71 -56 1 133 -13 -134 -80 -22 41 -33 -131 32 -41 29 25 -15 35 -20 -45 -50 23 -140 14 -78 5 83 32
2900 32 79 30 9 -80 -109 54 90 -150 54 -18 -208 96 84 31 27 -50 -12 17 -30 55 -40 75 3 162 9 -118
2926 -118 -15 44 143 -76 139 -34 -15 -30 -100 54 60 -84 21 -194 -117 4 91 -14 57 68 -30 7 41 -108 -65
2951 -65 59 -13 82 101 10 25 -34 70 19 51 -89 -19 38 38 -3 -1 -24 72 72 65 96 56 86 -39 27 -46 81 54 64 -25
2981 -25 -31 -17 78 -31 78 -7 3 16 -41 25 38 19 34 -7 -54 -30 -114 -147 81 -80 -109 38 -17 -74 -9 6 -70 35
3009 35 -27 58 18 -39 -44 50 -54 -34 -16 -41 -89 13 70 -54 20 -25 -69 -164 -46 27 111 -7 93 12 35 91 160 -79
3037 -79 1 4 51 44 -33 -25 -62 45 -49 92 72 31 98 7 37 -57 -27 -36 4 27 17 53 -32 -4 -9 -100 -75 108 88 -47 -183
3068 -183 16 -36 17 36 111 -81 -33 20 -3 17 -131 -10 -38 -80 63 44 -30 34 131 -88 -164 12 -57 118 -36
3093c6lN7R8p4n3%m3Q4O4k8m9J6l2O8N8q2kq4M1M3k0n9m3R2J06q0km7O2m0j59
3124a47J59m0M1k3P1K2p2P5o6J12k24O1j5LJ81n9o4po7P1O8q8J4m2k6L6M9O8n
3153H6p8p4Q5N5r2P4q3K7M4j04j2L4J9K0k7N4n3nm3N2l2J43j91N8J44j52O8m6
3181b9O3n0o9OP3jn0J2J5M5j35P4R3q7J28p6j22R2LK5L4K7k07J55m6M7knJ20q7
3211D6l2Q6Nn2Ln6j17K18q6l2PR1K7q9k4j4O2r6L9J07k17J29j4N3O1j85J30l9
3239A1N6j38K28j10N0j01Q8j80R8PK4p0K7J3L4n3Rq1M3J51l2Q5o9l1j02L5j3j3
3267c4m0l1J14K7j31M4K9jR3oj31J62r6Q5o0l9rq6J40p6R2K4q4K4k3o2Q9O9r4
3296a1R9j09Qr2L6P5j6o1Q4J7R9l5j75pN2J0j17K13qk0j8j04J22p4oK2Q5n2K1
$$ plain form
3093 -36 -39 18 116 42 -11 -11 -54 30 94 66 17 33 1 69 127 45 43 -41 0 43 23 -36 -79 13 119 39 37 -10 52 12 -147
3124 -147 12 -28 13 -10 61 83 11 86 20 132 -92 -31 -46 -43 138 79 15 8 -59 12 80 -8 6 -36 -62 -26 23 91 86
3153 86 8 -66 19 74 -18 56 -27 0 44 -60 -72 -38 -19 1 -26 28 -25 -30 -73 -21 -53 90 -101 -43 101 -51 17 -29
3181 -29 34 -16 -85 -79 -6 -7 -57 -45 -30 15 -120 -46 47 -40 88 12 -110 -18 -15 10 44 71 -136 19 -27 20 18 13 133 46
3211 46 14 100 105 53 56 0 -117 101 15 -17 -10 81 108 19 -5 -19 43 -53 -14 93 -124 5 -9 44 105 -80 50 11
3239 11 67 -71 157 47 97 -4 84 -96 2 9 33 -37 -10 3 37 -16 -7 -88 -45 106 74 159 90 59 -43 -8 -21 -34
3267 -34 -74 -105 9 36 -95 -51 -22 -23 70 64 -67 95 -1 84 24 -15 -24 -110 30 -46 46 70 -14 10 -13 -75 14 83 -11
3296 -11 88 -21 -13 -105 -69 6 -10 -71 13 30 129 94 -81 -88 -36 -26 -143 70 62 42 24 -80 42 -32 -38 -16 69 17 38
3325C8j05l1J51R6j83M4M7j35R3j25J22k0l2k1J97r7LR9l0k15j3R7J9m3J19j28
3351e3R1j10M8P9j24J42j20Pq4Q8k6oO6J0j30J77N2j60J60J0j34KL9j00P1oP5
3378F4j85Q1K2p9J81j74%O3P8kN2k25K14j18M0r3J65M1j39K8J8N7j68P4O7j57
3404i5oQ6R4j24L0n5O7Q0j14j92J98n5J19r8O6J27j75Q6l1J4lQ3k3L0j31N7jM4
3432G8m4p6M5j4j05J02N8R9j56J49j53j61K23j00L3Jo2K0l4J24K0Nj3j7o2OJ27
3459I3r0l8j26K44o9j2j6Q6M1j89K0R6q6nQ9Jl9r4Q5lM7o9P7j4j6N7L6j08K0l7
3489a9m2O7k2p7L5J59k22K19m7j39J13r6K3O0K6q7J14J55k43qP7l4k9J5j37J21
3515a8M6j88K05J0j5j73J03j33K27j09L9L7J3K9j24P7j45J71r8J05o2Qj8J0R2
$$ plain form
3325 38 -67 -98 53 149 -34 10 57 -78 15 -110 12 -8 -40 -61 136 39 42 141 111 -104 -117 -20 -1 -44 75 -53
3351 -53 38 -72 -24 55 -69 73 -47 -40 -124 -36 -62 -68 -2 8 -122 55 107 -53 107 117 -17 -15 24 -76 -5 -11 64
3378 64 -121 -40 -18 -97 84 -90 -90 -27 51 49 101 -124 90 -28 12 -81 84 125 -14 14 32 89 -79 -5 62 -95
3404 -95 -101 -15 79 -45 -15 -70 -3 77 -37 -229 -31 -86 33 -65 1 128 -47 39 8 22 19 102 79 109 -22 35 34 78
3432 78 34 -42 3 -11 -116 -14 44 143 -13 136 -17 -178 45 -55 -22 -21 -83 -63 -97 27 47 52 39 22 -40 -34 93
3459 93 3 -35 -161 83 14 2 -14 72 113 -76 -56 40 -46 -51 38 39 0 -94 -9 -12 35 -34 43 29 13 70 106 -2 18 -19
3489 -19 -61 6 -16 -93 -58 101 -121 98 51 -88 25 -71 -48 12 38 -49 65 220 -23 -31 46 12 -17 -2 -139 -18
3515 -18 28 -160 45 55 40 -133 -30 -163 64 -45 -6 31 44 73 -51 26 -119 52 -46 59 -3 5 -13 -3 89
3540H9r5P2oj06J13k07J37m8J0J06J0k02Q4P9O7Nr8J27p6k02J15K1j3N8p6J3Q2
3567E9j3O4j09k2R6j33n0N6J20q8N3Jj48J10O7l4q8J40L5j2n2n0Ql2J6L0o6k2
3595f4J15o6M2j39J40k0j47J76nk8J15j24J1o5J40j9n1J04j85P7M9l10L28p7Q4
3620H1om9N6j36L9j4R4o7K6J3k32K08J01j62P0K2m0j59J80p6JJ11n5o9O2q3p9
3647a63J94jp2o1J11k0l4p5K27k08L9J10n0Opo0l3J62j06J53Q3k59R1j8J7n8O9
3674C7j61K25j41m7J88j31R1o8r2J12J29j57l4MM8MJ39k78J16k2%j01K99r3%p3
3700fR5j08q8P8J17j4j02Q3k01m4J51O6N1j04J3r6qM0J77j59N1N5j58Q9o4J59
3726G3k6p8K28k19Q5j59R6j15J02m8M1kK5p6N7J93l11P1o3J57lm2o3M5p3K2L2
$$ plain form
3540 89 -6 66 60 -46 67 -140 -3 -51 -41 65 75 -127 -43 36 103 108 10 137 61 -141 -26 -5 -18 40 -36 -23 59
3567 59 46 110 1 -21 75 -58 -108 -52 68 -20 33 34 -114 -4 63 29 -59 81 116 104 52 2 10 -22 -6 24 -42 -64
3595 -64 51 -15 27 -112 28 8 -139 37 32 4 119 -5 6 -59 81 62 11 115 -70 7 56 -254 74 -3 81
3620 81 75 26 82 -54 -15 -29 65 -2 24 37 -195 13 114 -48 22 44 4 -155 25 -51 -50 61 6 -63 -1 -84 -163
3647 -163 31 30 -42 -103 8 -12 -46 -121 106 -102 -63 47 -3 3 -4 -64 -97 65 -41 112 195 -64 27 9 26 -32 37
3674 37 -124 101 -40 -87 101 -30 61 -7 -99 13 142 -15 -49 -45 3 7 146 -132 -16 -38 -38 -139 160 67 67 -6
3700 -6 89 -19 -107 -29 88 74 -28 55 -146 -190 -39 27 78 -26 -13 -109 -117 -77 100 -59 -8 47 -111 -22 -86 73
3726 73 47 -31 197 -22 63 -96 0 -115 -13 -61 -20 -22 3 -73 -16 177 -134 -63 -126 31 28 -14 -77 -32 -105 -83 -51
3753e1K8j3P8j9j17N3j4N5L1p9M5r7J65r1J02r6j7M4L0Rj4lq0n2J73o5O7K2q7
3782GO7L6k3j96J00nQ8p2o6M0m0nk9J11p7N3R6r4p0PO3m7L8o5O4K1o8l5L3J55
3812H7r3n9R9mO5p8n4NO3j4M5q2K5M7o5j3O9p9J36p0n8Kp2P4J05j10QJ0o6J46
3842F9L4k4l2K9k23K5M1Q8L2k7K0m0j03K4J02Lk6o8J6J00j18O6M5pr3l6Q5q6M6
3871e8M3l1J13j62J17j36K6M9K1q6O7J13n8J6o6j0K2L2No8J55N2k28Q7j4k5M7
3898B3r2P9m0N9j46R5P7j01On6J36p8n4J05J16k98J32J38l5p8k0j9N0K6r9K25
3924A51q3j06l8R8j7M9R9j67o1J69k53J21J3lR1j13N4q1pJ26M4j49J16Qj66J92
3950H7q8n6J01j60J76q0m5O4j40J21O1j74R5P4j0n8M5OO1q3o1L0O1o2m1R7O8j05
$$ plain form
3753 -51 -23 -36 42 23 -94 -41 -55 0 31 -48 -3 -100 65 -26 76 -20 -37 7 37 46 32 29 -51 -103 70 5 72 94 7
3782 7 74 110 87 -109 -9 -14 74 2 -64 -24 -64 -69 -98 13 -64 -11 85 -9 -79 -72 -9 -56 -18 -83 -19 2 -66 -101 -68 87
3812 87 -6 -65 34 30 95 17 -37 -32 31 17 62 -20 5 52 -13 -26 43 -36 100 30 -28 -26 -98 -24 81 -29 -21 -11 -77 69
3842 69 103 79 47 76 -147 -122 -81 7 39 12 32 -8 -111 -87 15 18 -8 -76 -60 40 -78 -12 33 26 -67 -103 -18 -104 -58
3871 -58 -15 -46 67 -95 22 -114 -88 -39 -18 -104 -37 76 18 34 -32 -42 -20 12 17 -51 104 156 -72 15 1 -24 23
3898 23 -69 10 -30 29 -117 -22 55 -46 -40 -96 40 -38 -92 13 129 -169 -37 101 66 -12 -32 -51 -1 25 -74 151
3924 151 68 -38 -76 22 5 54 153 -14 -75 94 -159 -38 -25 -28 63 -50 4 -77 -84 42 86 -63 53 61 -105 87
3950 87 -1 -57 44 -116 60 -20 -65 -1 -141 -20 41 -133 -38 36 26 -32 13 19 80 -3 -64 -34 27 -35 -76 21 89 -16
3978a6k0Q9p5J11j14J48j27R8p7j25J07oM9j09o4R5R7M1j46O6r4J61j15p9J78
4003G3k1j53P6R7j29R2l4M0l3p3P7J1ol3O4m7Q1j82J26o5Q4k6l3j10J18p6k9J68
4031E7p5J4J8m3J2l2N9M7k5m3j00K43j51K2Ml9M2Q4j78M0M2n5L3J63k09J36K5
4058I1j95L3J40r4j00J42j84J20Q8j36J9K0J2J1K1o2k1L8j9KK55k02q2O0MN4q
4085Gm6O5j07J22q7J69j57J03P1j27J34j98J47j18l1M9j4M3oj79J86Q0j36L9M8
4110E7k13K42j91J12rJJ33k01J94k11lR3r1N2n9k7J06R6K0j00R1j15O3p6l1K08
4136A41j44N1n0k0l5N1P5q2M5j8J1l9j00J21J3n8j30J64N8j19P1p6J06J07j16
4161B7LJ7o4k0J04n5q3K27j08L9l6N5j24j15J30k9ro9J34M6O7M5j58l2R3j6m4
$$ plain form
3978 -16 -36 53 -22 89 -25 123 -4 94 17 -108 -1 -7 42 -67 -131 -36 61 102 -44 22 -72 89 -26 -105 73
4003 73 52 -101 -25 72 -57 35 1 41 8 -65 12 23 17 -16 48 1 82 -100 26 -39 45 19 -14 -124 -6 -82 -111 57
4031 57 -18 -4 14 -29 -17 -49 10 57 32 -11 -111 132 -19 3 7 -32 10 94 -84 -44 -2 -57 -24 139 -70 66 91
4058 91 -104 -71 69 -25 -125 17 -167 -47 41 -95 -76 -56 -44 -33 -12 -74 -95 -57 -76 -74 181 -21 -103 -43 -39 15 7
4085 7 -39 26 -81 41 -46 123 -34 69 140 13 147 -51 96 -22 -53 -4 -18 25 19 -160 26 106 -30 9 57
4110 57 -156 86 -105 7 -2 -1 132 -69 125 -86 -89 4 -87 -35 -94 -121 -15 81 101 1 92 -23 40 -36 -67 141
4136 141 -3 48 -2 -22 -57 -6 69 -13 32 14 25 -14 -114 7 20 -38 -168 -4 54 -65 6 -70 36 143 27
4161 27 30 47 -17 -37 67 12 -71 156 48 87 51 106 -18 -133 -3 -32 -41 -110 24 70 137 182 24 -8 85 69 25
4188B5k2oL1j6KN1rj83J28Jm3m7P5K9M8j00Q9O0k0m5j36K46j06o2J19p0l1%j06
4217i8J48oK5j35R1j83K50l1j56K11J03j66o7M7m2N9o1M2o5J7p4k1J09L0N9j41
4243e5N4j9m1o5K2J6L4p0K33j43l8M4K8lp6Q1n3J7K1P1k0o7J67j16m0M4M5j1m2
4272A8M6O3J3j75M5N7p3jM4k9j27J75N8j55l9P8k12K87oj17K6o2O6m4L3P6M9o6
4300B8O1j81L5P2J10r9R4k04J29j04q6K03qr2L7M2l1k0l6O7Pp7O1rj18Q6l6P5
4328Fj5J04k19Q6L3J26m7j28K3r0R9j1n2k3J33L8rq7N7l7m1L8J01j12%m9J54k4
4356E4n3j2P8L3j52J30j89J7Q0j24J65n8o5Q0Q9j43M6M5l1n6k2J51q3p2j1J7q
4383i4j5Q8O9J7nrp9rK0N%J38k12J07q5K5O1M5q2M1L7j69K08L5jj66J1j2n1J05
$$ plain form
4188 25 3 -3 28 12 14 65 56 -127 1 2 -41 -88 -13 16 64 -36 53 113 93 48 -88 158 52 -10 109 39 8 8 -98
4217 -98 50 44 69 -66 25 -158 92 61 -95 116 219 53 -14 33 -9 50 -11 31 -34 -17 -91 -112 -3 27 86 -55
4243 -55 -1 -20 -61 -126 -104 -88 -54 -124 109 -34 -72 -28 0 -3 -79 2 -51 -34 -13 58 38 -29 138 22 -18 26 71 60 18
4272 18 64 127 140 -35 10 67 -6 -7 37 8 -119 56 114 -41 -80 -2 -214 73 67 -50 -24 -86 -20 -64 -31 45 94 28
4300 28 89 -92 -57 15 125 26 120 -84 45 -59 -145 58 50 -42 -5 37 6 -14 -50 17 24 -53 8 -1 -119 -33 -69 6
4328 6 -9 95 -124 -38 -5 121 74 -54 -31 -121 -22 -33 -85 -108 25 63 54 -33 24 -13 -54 -16 85 -27 -27 -76 78 54
4356 54 1 -11 67 100 -52 78 -111 -94 -14 -138 27 -31 -96 -16 73 -70 -24 21 -10 -66 -88 63 -20 -92 -103 -86 -94
4383 -94 -109 -21 48 65 60 51 -28 -37 -17 -12 -12 126 -86 21 -64 -39 22 67 -15 26 63 -106 102 137 136 -30 -19 -31 -82 23
4413B3j87J80O5j00j10K33j36L7j8j85L19k23K27k07JQ4j5L1nJ8N8Pj75J94j52
4438c6OK9Q4k18J48nQ8j74M5J09j16j25K39j55l2P2J00j34J5l6J99n0k9J7r9J19
4464F1QP4l21K38r0k7O2j27J11J08r0n6R3p1o9l0K32rj35o1J37l2o5N5o5J34j51
4491h6J8P3nl4n1J69r7o8Q2j38K14j09J10j88J01J35o9r6j9q1K18j20M8q1P8M8
4517E2M7k3j20O4p5J43q4j2l7k1J7L1l1L2n3J30n5j01kO0L1j01P9o4Q8PN4l4j6
4546FN1k4l1nm0pP6j09J64p3MK8jq1J47j18J44r9K8K6j11j3J81j58L3kp8O9j9
4575a2l0P6j05J29j31R6j2O5j86J06K4p8L4J30j23p9J66j67J60q2m6M9P2k8r4
4600f6P7p6J06j02J51l3j25J32p9L1o5K3m3K14j09j8j18J61p0k5J09Oqn8r6J26
$$ plain form
4413 23 -164 16 81 -19 -129 104 -32 5 -13 -198 121 -102 125 -82 -81 3 -12 19 14 32 90 97 -78 116 -36
4438 -36 -30 -1 83 -135 13 8 96 -78 -33 76 -40 -165 74 -81 -113 -41 59 -75 -60 -96 103 53 24 41 -58 61
4464 61 69 143 -178 60 -30 -57 5 -122 -11 97 7 -49 44 -27 -96 -126 106 97 -38 -99 38 6 -59 -4 -69 65 -86
4491 -86 -68 5 0 -34 -85 84 -13 -81 1 -137 77 -32 78 -110 -9 126 57 -39 -58 -139 79 -41 7 -74 4 52
4517 52 99 76 -44 20 -55 88 4 -8 -45 -66 -49 -18 -49 -17 -70 60 5 -96 -98 -38 -7 -108 -29 -93 -5 2 56 22 6
4546 6 57 33 2 -3 -43 -50 26 -83 81 8 12 40 39 -42 105 -13 131 32 60 86 -25 -38 143 -15 18 16 -62 7 -12
4575 -12 -42 34 -71 58 -73 23 11 76 -110 -4 20 -58 -24 106 -17 -96 70 -97 63 -19 -65 -16 56 28 -66
4600 -66 11 -65 41 -61 90 57 -68 64 -15 16 -49 -26 -69 145 36 18 -100 61 -9 -34 75 81 73 15 -81 45
4626D5n4r7Q2j2O4k3j33J74q6RR4Lj77K34j05jJ08l3j30o5M7j4j18K30M4n1k4
4653A1n0J98k56K07j53R8k7M8j39K23j25QJ6L9l9K7j44J16p5l3J17o4m4m2J38
4678E5j64Q5j19J54n1N0N8q9JLo7J08p9l3Q2k0p2M8R2l7kL1j1k9j6J3j37K21j46
4707g1J12R3o5o5K9j9m9m8qN7K1m1J06j52J33M7J37j04j64lK4J32j30R5j33M8
4733a8R7m8p0M5K4o3K9j7J11m1M7K4j83Q1P1j45M7L9M8p4l9N5K4p5J24N4r3m3
4761A1R1p0Nk2k3m8n2K74k52J53j46J2R5nn5LQ0n6r4J45p4L9n9Q9O3j83J18L1
4789G0j66J68j36k6J95j53k4PJ41q1J21j67K9O3J4k4p1J57l5q4k6MK4m4n4J70
4815G2j46R9p7J07n9p4J15j50J22Q0n0n7J05m1l1j27j9K14r0q1nK51r6Q1q6j15
$$ plain form
4626 45 -9 -106 -24 -36 28 5 -128 46 -40 -31 63 66 -111 123 18 17 125 92 -38 -103 -56 -70 -188 42 86 35 11
4653 11 -39 159 -97 110 -43 55 28 76 -63 160 35 43 59 98 59 86 -58 58 -17 -50 67 3 -41 -83 55
4678 55 -109 -24 -143 11 -40 10 68 -21 -20 -17 -84 24 -55 -88 -6 -26 -98 -50 42 5 3 34 23 -6 -22 -9 -146 75 -71
4707 -71 41 134 69 4 33 14 -35 -83 -91 -34 -13 -54 52 -100 33 80 217 113 -51 -54 -30 102 -28 67 -66 -18
4733 -18 79 31 -39 6 30 -33 -4 -21 90 49 96 120 -63 18 89 -56 -9 30 78 4 -35 20 44 -31 93 147 54 11
4761 11 102 32 37 15 -8 -56 -108 166 -86 67 -79 -67 28 23 -32 -29 51 -5 -99 46 -28 11 -48 41 104 -79 39 70
4789 70 -96 72 -64 -90 105 -48 -72 -65 76 -5 116 -51 -22 41 55 31 -40 117 82 -2 -28 -24 0 -44 -98 72
4815 72 -74 25 -52 55 -4 -78 37 -113 9 89 39 -18 87 46 15 -112 -131 83 -7 -88 -93 158 62 143 57 -58
4841e8J59j41K38k23q4J69k5p3J00%J2j40P9k1rM5j00J28j45J33l7l3q2R0P7J9
4867G8j16Q6j16P2m3M6K8l2p4RJ18l9j25L0K2J00j00O7K3P0m1r8K4m6j6J08J11
4894A46j63Q6k9j6q7N6R3j04l1j9J02oL3p3J17j81P1L9j18P7O6oj60K6K2K5m6
4921h0J10p5N0Q2rk5j64K08j34p7J82j48NP9j1J56q8n2M7j41R0k4n0J7J83j68
4947c7K9O3q3O7j51R1Q9q8J79j92j8K8K6l9p3J39rj5l1n6J9K6j0nK8K0l1M3k5
4976a6pl7j01J68j7M2J2k7j07Q9j2J7p7Q0p4O5q7K8J37Jp3P4L7j06k8J9M3j32
5004h9np7J45J21p3O8q1m4k5M9J9l6j3M3l6pp4J47K8kj61M8J55j57L5J55j26N3
5032F0p3J64q8N4j48J7Q9l9j5J0p1J9P3k2j7Jk4j01J34j08L5L3Jn4P9n8J8N9n2
$$ plain form
4841 -58 101 -40 198 -25 -109 60 35 -38 62 62 74 -66 13 -8 -17 28 -72 56 -89 44 7 -26 -108 -18 59 78
4867 78 -38 48 -68 4 -39 7 35 3 -71 -62 56 17 -108 -78 -56 44 -56 11 34 104 63 -35 -11 -57 -73 35 146
4894 146 -17 69 40 24 -63 -7 86 -18 -49 -68 34 28 61 -12 105 -76 -5 34 -84 -7 59 53 -107 -81 -59 -34 -80
4921 -80 30 -45 5 87 78 53 -111 97 -37 -114 68 -80 -75 4 -7 149 61 9 56 -85 5 -19 -69 -52 131 -37
4947 -37 -8 55 -28 39 -112 -21 68 -20 159 -33 -51 -23 3 -36 -109 30 21 6 -25 -81 -62 -36 -46 -51 -23 -3 -34 9 -16
4976 -16 -23 -60 -161 7 -10 32 44 17 -90 -1 -13 4 -73 7 -67 -2 -89 -61 76 77 4 78 115 9 -19 0 43 -89
5004 -89 -94 -171 -26 95 22 90 9 -35 -60 -11 8 -28 -41 2 -34 -41 -115 32 60 58 -103 -55 100 -57 -22 133 7 60
5032 60 -13 151 63 117 -31 -14 75 36 21 31 -40 -21 52 30 13 14 -10 -111 23 -85 -50 -17 -16 -70 9 -49 -31 28 -24
5061b4k5o2K60l3j42J6j39K80o2p6J45j12m1K6O9N4j54K6N8p9OK2j41L4J68j23
5087d9Q8n9p7J40O1k30J64K2q1l1LM9j66O6N7P7j54K40j16K0j04n4J96o8p7J52
5113F9j49O6K3j09K6P3j2j52K10m6p5R2n3o3j0J15M1K1q7n3J03ll8j01J62J6J0
5140G6m3k2mj1p4J09j13l3J30J21j82Q3n9K2r2J70j19P2L8q0N4j92J58o5O2m8
5166d2J7L8J4M2j03l5J6m3Q2J3O8r6oJ07lm6p9N0j6r0J33N1L5m3j20J07j14J38
5194G5l3M5j07j7R7L2j59K9Q4q1M0N5K7j7l6k1O8j51l9K4J02l5O4m9k2K0J64q5
5222G4j57N7Q4p3J17j13k2R1n1j7j9k4qQ7m5r1J70n4P1j16QJ4m5N1Nj8K2J19n8
5251E9j26M1m7O4n5l5K30j43P6n5j4r1J03l7M9mj9j5j0Q2r8j00J69k8m2J03j46
$$ plain form
5061 -24 -49 -111 149 116 -26 -10 -149 131 69 -7 138 26 -15 11 80 134 -20 6 64 -15 -9 13 -128 -94 74 -49
5087 -49 39 -20 -97 43 104 -126 38 60 -21 -52 -49 0 -166 -100 -43 34 -120 120 4 24 -80 -134 62 -6 -83 69
5113 69 -80 -14 9 -100 -74 -1 -13 -165 45 -1 -76 16 -37 -100 -110 5 46 67 -20 -73 30 27 -11 -112 50 66 76
5140 76 33 11 7 -4 -78 31 -82 -115 15 136 -46 37 -22 0 -92 78 -41 31 69 -11 43 -149 9 -56 6 -42
5166 -42 -25 13 27 69 -34 -69 -53 -96 -14 -1 67 -29 -35 72 69 23 -56 -6 -22 -112 21 72 107 64 -56 51 -63 75
5194 75 42 87 -20 -37 60 92 -67 -38 46 -35 5 60 87 70 34 13 81 -70 -109 -85 17 -18 46 -3 -25 -5 159 74
5222 74 -83 -26 58 -15 102 -11 -33 58 7 -10 -29 -53 -61 26 -19 -110 60 6 77 -39 -31 -17 -62 -11 -6 -24 -2 117 59
5251 59 -67 -26 -73 -9 -64 -99 131 -12 64 9 -5 -96 7 -30 19 15 -4 -19 -29 53 -45 -145 24 -4 -46 57 -89
5278h9J51j27Pq4J92q0M3q1k9J98j66K8L2m4R8j5q7O1Q3J0j26M5j21M4K2Q2j5
5305C2Q4p9j34M9j4J76J5j03j22K24j8k10K59j84K0n2J19j11M7M1Kj4l3J25j18
5330Aj19J72q1o1J82n7n7L8m6L9Q7j16J15L1q4K3Q1j04k07J60l0p3Q9M9K8n1r3
5357h4R2R0m7k7j00Jo2K66j60j6m2R3rJ1j35L7J48Q4j51l1k8K3KRQQm0K5J13k60
5387a82J80OJ09j57qj02J41R5j62J82n6p1J0o2oJ38m8kj8r2P4J7N9j22n4J95m7
5414A7m1J01pn7J27r3l6o3Q4Lrr1J7P4o6j15Q7J45k1m6j3M7N0p0O2N8k04J23r
5443E4K2j22Q6K4q7K7m3N8J1M1k17J54L7L3r3M0lOrN8J5j04m7O9j89K27j05J20
5471F3r9j3R5n6L6Rj04J85j2n3j45R3q6RJ23q4J25j04M5o3L7J19k04M4kOL4kj07
$$ plain form
5278 -89 62 -65 -58 -142 50 -30 13 -68 -97 101 -65 -37 -5 -49 49 34 -53 8 91 101 -25 20 -101 -57 -35 47 32
5305 32 116 37 -97 -48 -62 114 129 26 -96 128 110 -100 159 -25 -5 -57 62 -49 -2 39 41 27 -6 119 1
5330 1 -118 54 -27 -88 94 37 -20 18 -28 11 98 -18 97 128 44 67 148 44 -163 -3 -33 -106 -17 32 60 9 -84
5357 -84 8 98 51 24 -76 -75 -137 129 -31 -47 -89 4 -5 6 -129 -92 56 140 -11 -42 -70 -47 -45 -36 -28 -20 -60 -35 78 -182
5387 -182 -2 4 113 -44 -52 -154 -13 82 -80 102 46 -25 -15 -77 -83 55 7 5 -13 -105 -31 -14 45 -77 -131 64 17
5414 17 -24 77 70 13 140 47 11 -52 32 35 26 -65 -48 26 -40 -155 -68 77 56 10 -3 44 94 24 86 144 -60 63 54
5443 54 76 -46 40 64 -23 4 -39 19 30 71 -146 8 45 78 -15 25 22 28 19 77 92 -12 -59 10 -179 48 -57 63
5471 63 -36 -49 46 -10 26 35 -69 116 104 51 -94 -1 -87 -78 45 -39 86 -18 27 -36 1 120 -84 -40 -42 -36 -2 -4 -111
5500a11Q1P5n1L2j51L06l38J11j2Q3o1O2j4K6k3j7M1oKJ4j9K3m8r5Q6l4j66J24
5528h0P7k7j0K2Q8j8K8M9k54R2l3N0J1J35p3p8R6M3n2j14J19l5j7m2n7J2J59j65
5556g4jO3J26j36M0O0j27K8J8rJ13q4r0N7J14n4j03J12L3j29J27l4j14J09K6j10
5582c9P9L5r9rNK6J17j21P3O7j51P6j07j0p1J6J48o4Q5m6p2M2MRp1R0J6k4M0n1
5612gl4J78r6q3N8K6j10O5J04j70q6K35j19J1p8J06j1K8L4r7Q3n9J55k24J31j18
5638g8N3J42j09Q2n4j47J71j93R8k9OJ9q3J63m7m0L7R6j44%J11j03M3q7J02M5
5664E4j20J10r4L6m0J1J40p0Q6o2m2j08J15j4j2J2Oo4L1k8N1j8M5l1O0j74J46
5691B6l3j20J02P3q2K8m3L6j12J60p5Q9p3p1J38o0P6nKj00n8J85p9L2M3j45O8
$$ plain form
5500 -111 -30 45 -6 26 -125 181 -157 -46 -58 25 -36 26 12 38 15 -2 39 33 35 49 30 53 5 -90 -4 -38 -204 -80
5528 -80 -3 -30 -40 -18 70 52 80 129 -125 -33 -66 -16 -5 130 57 -21 75 118 66 -48 71 36 19 -23 -80 -68 91 -74
5556 -74 -75 -12 114 -22 18 78 -49 -21 -3 -12 101 17 -73 -16 98 44 -59 53 86 -43 84 50 -64 45 71 -39
5582 -39 40 75 -24 -33 -28 -2 115 -6 67 134 -17 59 -48 -58 -129 -113 35 -29 56 10 -62 -20 -16 -7 -78 12 28 4 44 -7
5612 -7 -41 137 41 -42 16 42 -68 -3 101 -69 -155 80 -39 -28 -106 0 -11 17 51 -46 37 -22 133 -91 40 -78
5638 -78 -25 117 8 90 36 -111 60 -133 -35 -64 -58 -39 -122 41 -6 -46 -9 87 -57 -57 54 -49 -6 -93 9 54
5664 54 -66 44 -50 -14 -54 -43 97 27 113 51 9 -99 16 2 -10 2 8 -56 -25 -53 -2 -20 25 -6 54 -120 26
5691 26 -7 -127 -25 48 -34 -6 -49 -13 -125 35 -40 49 -24 -95 43 -17 59 54 56 -44 -102 83 4 36 79 -66 2
5718BQ3j3k3n9l8J72j25J71j33j76J26k6Q4m0L8oM4j0r7J29j61P8jk4j7O2k6j21
5746a07J44l0J00r1J27k07J19r9P0N3j41J56j14j00Q2J00q9J9K0K4Q7j50L9j02
5770i0J11K1o1kL4j4J41j23k1qR9r9M3o5Jj2p1Q0j4k1N8O3k38J51Nn3J22k4pp2
5800f6J10ql4Q8j79J31o0J7M5j58J01o8R2j03K9Q7j14J22m1kp2K7L5K9qMM3K6
5828G3l3K1r4K2m9J11j7r6L4l5j7Q2M1r1J3K0j02J84j6r5Q1o1O6j02K3J40j37
5855c4J0J16k57K48j34J22l9L9k7MJ5j22%M3L9jjl8l3LN0Q9j50j8Q9Kn8m3J42
5884E6m3R0j19Q4j82o9J33LJ08l1o1%N1j10L7J02Nj51J29q9L1O0l7k0j8l2J50
5911G7Mk5k7j56N9j1J8J17n8N2o6m5K31j7n8j69J30r7j51R0J85j09mn6L0J72p0
$$ plain form
5718 2 85 72 49 -10 -48 124 -1 170 37 -139 -13 -39 45 5 43 37 81 71 -26 103 -58 20 19 -5 -22 40 14 -107
5746 -107 37 7 107 16 143 -64 55 -44 26 79 -62 94 -20 -120 -38 62 -27 -8 12 36 123 -27 12 -90
5770 -90 21 42 -19 -21 13 -1 140 17 -4 -12 87 -12 31 -34 -33 -45 -116 -36 -50 -71 -13 50 -188 -37 -32 -85 37 13 6 -66
5800 -66 44 36 2 90 -89 42 -18 -1 44 -114 -13 -81 11 -92 -63 24 -90 32 -9 -11 -83 -56 -21 8 0 4 47 73
5828 73 40 61 -33 -11 -60 51 34 -62 -28 -63 -80 2 43 -48 -35 -15 -117 67 51 -44 37 -24 42 -60 -37 103 -34
5855 -34 -24 92 -165 83 -51 71 32 71 44 48 63 -59 -59 -16 23 22 21 -17 -50 -47 3 92 -58 -76 13 15 -43 -86 56
5884 56 13 103 -16 68 -114 -183 -50 -47 61 30 -31 -31 20 -90 -53 49 54 -97 32 -57 -26 34 -3 -23 -41 -73 77
5911 77 81 56 29 -127 -68 -79 -61 56 -2 50 -16 -61 170 153 95 -74 56 -41 -192 -102 83 -26 -30 -86 -56 116 46
5938D6k8l4N9o1L0j15L9N3J04j65J10j19L1N5n3q2J01LJ2O1O5j94R5QmJr3J83
5966A08j57J08r3nk9R0J21j48k1L6r7J85j49J58j40l8qJ3Q6r0Q2j9J9J0j3j7L7
5993B9m7n8J43m2K0l9j48O2J02J6ql6PKm9Q0O3q8k8Q3L3k0j06jL9k7K4M3K5r1
6023a7J3j2J42r0j59N0J80n0Q2j19pO0j17R6P6j35l3k4J33j66R8k7J5M1j6j44
6049a30J30j8J2j5r0MQ8j5O3j61J93j04J22k5n1M8L1j71J77p2j84J65l8R2Ml1
6075B4J5rL4j2j27RL3Lk0O8j1Q4j11K9l3kN6p8j1R9o2R7m1j22R9Pj58J74k01K28
6105F1r2N3Jj4M9J8j32k8M0Q3N0j6P8n2j22o0j16J27O2Q4j45M1P3j43O8J02L5
6132A05q6po2N6j31J94n1p8J49p4rn1N1r1K8Q8j6n6p4P8Jk6P0j5P6j03J25p0m7
$$ plain form
5938 46 18 -16 43 -18 12 -103 -64 -11 93 -72 38 -81 -50 5 -48 -130 -29 -26 -14 47 112 -82 13 21 17 18 -75 108
5966 108 -49 59 -34 -39 -68 22 143 -5 -26 10 -87 98 -51 107 -33 -71 -79 -66 20 -70 12 -7 12 22 9 -8 29
5993 29 -18 -76 67 25 45 6 -142 -80 22 38 30 -6 1 3 -46 34 97 9 -19 64 97 77 -29 -30 9 -18 6 49 74 -17
6023 -17 -4 -16 126 36 -123 -73 107 57 139 20 13 73 -44 52 128 -7 -40 -64 69 -97 1 -26 -11 30 14 -130
6049 -130 0 -18 -6 -21 -111 -107 -19 -34 29 -132 61 -43 79 54 3 51 82 -89 88 16 -168 -3 -41 51 55 24
6075 24 39 30 64 52 -75 -66 -33 -30 -50 18 7 91 -20 9 -24 -26 30 -48 -59 40 -22 75 34 -88 11 18 -140 34 -167 61
6105 61 -31 22 23 9 58 76 -56 -84 -44 39 89 73 151 99 -23 -83 -199 -72 -10 74 -71 -30 43 -100 -32 70 105
6132 105 19 12 -50 6 -125 69 18 -60 89 15 6 -45 6 -85 -57 31 15 -41 -115 -37 -36 -62 8 -7 69 -34 91 21 -26
6161b6J51j24L5q9J42n6M5j07Q7k0J0k04K96j64K3k4m7L8L5N%J31j70M4J8k08
6187a79Q4J83j61P7J4Kj59J24q7J46o3O2j5N4j66k5J73n2p8J18L9j5j08J13j33
6212e2Q7RJ25j24n8N1j01J4No1K33j44J35k1j15k6Lm6K00k78J82k8J22j38j8l1
6238g5j1Q4m4Q9P8or0Rj64M0L8P5k8PLJ7J6L5j39J48n5q3j0J26q3P7n6j80K33
6267E1M7j42J3o4K1O2o2PN2p2R3M9qq4K6k2k9O0k4Q5l3j44J58p8P0j8Q6n7r9N
6297e1j7J04k5j2J13n7L4k7q7nP7l2n3J32j18K0m1k1j2J06j3oNj8LR7n1j75K08
6326G8m9j07J25J19k25J13l2j1o8J26l2p4MJ03j73O5J15lq2j14K12q2l6p1J52
6351E3k3K1q3LK5KJ04l8l8J2n1J38j28J19j39O0p0N1n3j4J68kj26k3J83j18%l0
$$ plain form
6161 -26 125 1 36 -53 89 33 78 -29 58 38 48 -156 140 -24 -1 -25 -72 -34 1 6 6 137 -33 11 29 -179
6187 -179 -95 88 -73 4 18 20 -139 -15 -102 44 -19 43 28 82 -84 -109 64 12 -66 52 91 76 -32 81 -52
6212 -52 35 44 169 45 -13 38 -63 -49 -44 -105 128 -16 119 98 -17 -43 -40 -86 114 -164 18 -10 112 -26 -44 -75
6238 -75 -86 -2 -46 43 121 115 25 34 -130 -90 -52 23 -5 2 5 22 38 73 -66 82 27 -56 -66 60 -23 54 -2 -182 51
6267 51 98 -44 -31 -95 -74 -12 -74 -67 -15 -87 6 55 47 -37 -11 -33 -62 -2 -26 59 26 -118 40 -38 32 14 100 43 -56 -51
6297 -51 -68 36 11 -1 112 55 89 62 -25 -30 47 15 -38 94 -24 -4 -45 -66 -78 28 15 9 14 -4 -1 96 45 -130 78
6326 78 29 -78 47 166 -59 54 22 11 -57 69 37 -37 -33 70 -103 -38 77 74 -8 -122 90 8 -28 -99 53
6351 53 30 51 -32 -29 -4 -2 102 64 26 38 -13 125 -3 116 -23 37 -33 18 -35 -49 119 117 -9 -32 151 33 33 3
6379CN8L0j11j0m8MJ49j33K02j44K7n1Q8n8O2k48K71j42l9P3M7o0L6J41k50J25
6405B2n3K5L8N7j34jK8j02J12l6N1j4L1K7nj21L6Km0K23j15M0n1Oj95J61NP2j05
6434c6o7J23j02O3K2l8MJ7l0J14p4N1N4j4j95K18j95J46L6j31P8k0j34J32o3J43
6460A02q4K0m9p5K1P5l2Q2K5j80J31j64J90m3L3p7j0r7j2J51j29K41j17J3l9k8
6486e2P3q6L6J76j68L4j28MJ84K3n7r0O2j9J5j06J78j83J13J3Lj57J40j22R5L4
6512A5L4p4J6p9P8K7o0M5O3r3O3Lj33J08Q2J3nj08pJ03j1j65P9O3K2q6r6J40q5
6541d8N3j44P1J33j03N7j8P8M0j23J34m3n3l8q2J83j62P6P3j05n3J17l4j36K24
6566I7n3rQ3k7L4j32pK2Lkqm8O9J16k24L8K1K2J62k67J21k7N9j12O9j11J40Q4
$$ plain form
6379 3 61 91 -20 -30 -78 -74 75 -58 144 0 27 -24 64 6 68 -180 91 -51 -90 -17 30 -30 6 147 -103 22
6405 22 -31 -6 32 89 -45 -46 -18 -120 -8 -44 7 -7 24 51 46 -75 -39 -37 -77 146 31 71 20 26 -169 -8 -3 69 -36
6434 -36 -103 20 -82 -19 3 -35 -31 -14 -44 70 -4 47 101 87 -108 110 -85 61 97 -34 44 24 -110 22 -41 102
6460 102 18 38 -11 -86 -65 10 -22 60 85 -95 36 -128 62 19 52 -25 -35 -132 -144 7 -122 119 2 15 -24 -52
6486 -52 21 -65 -29 147 -21 13 -115 -111 73 96 39 -51 11 -8 7 -99 79 -104 9 22 25 -132 8 -114 -19 15
6512 15 49 -25 -9 -88 -10 17 -43 2 65 -28 35 38 -95 13 95 108 103 -5 -12 91 80 -85 -6 57 79 -7 -103 37 -48
6541 -48 5 -139 -68 65 -38 19 1 79 119 -4 130 87 34 -4 -86 97 -65 11 84 -21 -74 43 9 -127 97
6566 97 44 35 118 91 125 -7 -14 8 11 9 1 -47 22 138 -86 -48 -27 -5 157 -110 11 -16 43 -69 0 -111 29 113
6594A13j26l2M3J1J3K3n9n1K4J20p3P8N0k5nq2J5j10J48j21R4o2r2J00J25j19
6620@l7%P2j53J62on1j0K1n3K14j9l03J88P6j7j7q7M4p2J7J05l4l6Q4j41K9J7
6648glQ4J4j07O5j40K9K4n3M7J07q2J8Kn9J94k71J72j29R6m6k5J0Q9p7lJ2O4L3
6677E8m9L1nm0j7O7PM0j88J16N4p2J8p3R2j08M8k1j46J32Q7P7K7k25J56n2K6k
6705C8q0J50j63N8P4j65J11p6mj74K35p9j5N4O5O5r5nn0O3Q7l7j14J24Jlm4l0
6733iN8j5Ln0P0n4j6J18j68L4lQ5j34M7Rk1m8rJ55j6p4M7O1j00M7l6j13P0L1p1
6763a02O9J8Q6p2P2j15J3O6j73O3J60j71N3N0j14O2M3J1p9J26m3o3J06r0K6Q5
6789H7O8j88Q9q2O2qo4O5J5r2k7O2M6m0J4R0l34K52rK2J08k3j31M4K3Mj30L5Q6
$$ plain form
6594 113 -13 -45 -2 9 22 45 -14 -65 -41 79 6 84 134 109 104 22 37 -73 75 -46 48 -14 -106 -6 119 0
6620 0 -37 -37 35 -118 44 38 -13 -23 -2 -55 159 140 -163 25 101 84 67 -20 24 -48 -31 74 40 4 88 -53 -24 -7
6648 -7 -10 74 88 -19 46 -94 -65 -41 -94 -47 60 -22 -4 -2 -61 133 -138 34 -95 1 -45 -70 -60 29 -48 -51 -39 25 58
6677 58 9 40 35 -5 -22 45 52 92 -96 20 74 2 20 -53 39 -69 -21 -42 -188 -56 31 108 135 -90 66 14 40 38
6705 38 -42 108 -55 3 77 -88 23 -53 -57 -231 4 -75 -90 -36 29 94 -1 -6 -56 7 94 57 -57 67 68 65 21 -9
6733 -9 49 34 37 -13 57 3 -13 105 -63 -29 -32 53 -81 -34 -25 -46 -94 -103 52 36 -38 9 70 -30 17 -19 -132 -62 -31 -102
6763 -102 -33 -15 71 -1 71 -44 -31 35 -138 -75 85 -86 -33 17 -97 -35 8 19 -60 66 23 -40 66 -24 2 87
6789 87 155 -33 56 -26 36 28 -36 29 44 -48 -75 -13 33 -7 7 97 -237 15 6 28 136 113 -18 26 49 53 -77 -42 44
6818D4Jj53L3kK7J08p1L8j25J8K2J45j18M8p1M3k5Q4R2k32R8L1N5J6m5mj89O3
6846f9J09j1k4j12J21r1K6P3j11K00o6qk9q7Q6m9N3J73j34or9J37j2Ro8M9j01
6873d1O7m6J04j20Q1rp9k1J41o5J7J32j41q2O9K6K7K4K2r3L2J8n5r2R5l0J8Jn0
6902e0J05q7L9O0k2L3j07P1k7j43J38o0O5k01L13j66J6Q5o6M0q6J11L1o9K3pj03
6929f4R4L6m2j2Q1r5l7J32m9j70R1J05q0l8J1O0j3Q9j43pj1J11p1L4NP2j64J08
6957C3jj5J8j35J14K5Ol5M1m4J8m5M6r9J61j27LL5Q0jr8k5qk8L9j0L3Ql1J76j01
6988C3Q3j17M2j22J42n9j7K4n9J51j67J3kJ47m6jn1O0l7o2k7J0N8L3N6j03J17
7015I9r5j2M1N3j11N6j00P0R8j56K3kN0j09M2J15q6k1k3J25j9L1j42R5J6j54J26
$$ plain form
6818 44 45 -108 -75 -77 -50 58 -13 25 -100 -82 -60 85 -33 15 -56 -13 -38 46 138 -94 4 35 90 106 61 57 -132 -69
6846 -69 40 29 5 -107 14 -77 -51 22 -89 111 45 37 8 -79 7 -42 11 184 50 44 -55 82 70 79 11 60 -41
6873 -41 26 -20 84 -36 45 36 -43 -64 77 12 29 161 20 -62 7 33 60 84 106 13 45 63 8 -84 11 -19 -1 0 -50
6902 -50 55 -32 7 67 45 78 -29 42 15 -128 10 -50 15 -186 127 -39 -23 62 -4 36 -50 61 92 23 46 39 -64
6929 -64 30 66 24 12 93 -2 -39 93 44 -126 -35 70 -10 -48 -37 23 10 99 -44 -51 -62 49 -22 12 17 89 -75 33
6957 33 32 17 35 -100 14 39 45 10 51 7 25 -20 26 -73 88 -39 -36 -1 79 78 -20 -45 -53 -81 -42 -52 -19 -11 -42 134 33
6988 33 116 -1 41 -81 61 2 -15 9 -50 101 -66 -53 -55 92 46 45 -6 54 17 -45 -72 -62 -4 29 85 -18 99
7015 99 4 -8 33 86 -25 31 -69 1 99 -57 -34 -36 14 -95 -53 62 -24 -45 -68 57 38 69 -73 22 38 -116 10
7042A0oj26p5J48K4N2mp6P5o6LJ17k60J43k8J09j83J15RP1k8j35J15l1k9l7oL2
7070f7K10j64j1j44J64j83J75J26j01M0n2k0kj07J29m1J41Km5k5j77J75m1P9j14
7095e3k5Q2N8j51J09J4Kj64J16J24q6Pj38N2J66j09K9r1J9N%p7N2J9k57L56l1
7122B8q4J11L0L1k50J21M8j19J89k08J19k7Pn1Q8m1o2Q7N9O1j13k4j4Q4o1m3J79
7149A45j21q1M7m2J30j24J17M7j26L4k6Nk7O8J1ko0j5N2j6L0K8l3L4j07m1K8J2
7177c3J17j58MO6j0j06P4P6j31RK3k0J10R2K0o1j65K10j77N3P9j41M9J86o2k43
7203a39K18p7o1J30p2pP9j7M6L8k20N6L7J55k42M5j2J50j82K24k29P7L6j57Q6
7228c8M6j62J31Pp6J19p5Q0j30Q4n7J45Qj92J39O8M0j15L8j8r8J68k50M8J89j5
$$ plain form
7042 10 4 -122 -197 -49 -25 27 23 -53 22 -44 -41 76 -184 -41 -69 40 -143 -28 -19 52 24 -111 4 -27 -56 -93 -99 -67
7070 -67 143 -21 -32 -176 -12 -195 -20 106 5 45 -7 -27 -29 -136 -7 -48 93 95 50 25 -152 23 -18 61 -53
7095 -53 -78 4 62 -89 20 34 36 -128 -12 112 26 33 -105 -53 113 4 33 -58 -39 -34 -34 -111 -59 -40 -297 59 28
7122 28 -56 55 85 116 -134 -13 35 -84 105 -103 16 -11 -4 -55 33 -8 -70 17 76 137 24 0 -14 70 9 -34 145
7149 145 24 -57 -10 -52 78 -46 71 118 -8 26 0 5 -22 46 57 55 -5 -20 32 16 46 74 41 75 -32 -73 -45 -33
7177 -33 84 -74 -70 -4 -14 -120 -46 30 -101 -92 -69 -89 21 113 133 72 -93 117 -60 -7 72 -69 -20 166 104 -139
7203 -139 79 2 -59 71 -1 -8 71 54 100 138 -82 -26 11 166 -76 -31 -43 107 -75 149 -80 -3 33 -124 -38
7228 -38 8 -154 -23 -16 -92 27 -48 32 -98 -14 -71 74 82 -110 29 97 137 22 60 42 -56 112 -138 -90 99 84
7254H4o4j05N8np9J63q2LoL8Q1k8J5j38N0K0J8r3oO7R3j24O6M2n2Kj07J91j05
7283cJ0K0p9Q6J1m9p3J31o5O5j36J04n7M8O9j16P7pO1mRj84J38k9K4O5j77R8j4
7312B3R4k18J07o8k4P4m2pJ90j14r4j0N4L0M1q1P3l6j14J91j8k7Q4k08J51n3J00
7339I8j54L0N6l8mn0Q%J12j33N7K5O8n0l8J21j12K4l3Ll6K9N7k9l3N0k7m4N3n9
7369d9n2J15N9k05J36l0OJ13k42J80n2jk2L9J5jp1l4J60j14r6K20r4J18j30%k8
7396f0P8k4J7j4l5M5J3J15k00O3r8L1J21l6m0K8L8n3k4o5J29L5M9n7m8NK4m0k9
7425c2K8OL2L5o0k8J1l9J89l42K32k6q5J82k24J40j85O0J35q6O3q3N1Q3l3J7N0
7452I1J1m7r1J00j54K1L4j8mQ6q6k7P3r8J21p6O7q3J39j28K0J49j51j3M7N8l3
$$ plain form
7254 84 20 -85 -27 -32 -111 52 -30 -27 -33 5 86 58 73 -65 -15 5 23 -70 -76 -9 84 -40 26 68 16 18 -89 102 -3
7283 -3 7 27 -52 34 45 -4 -77 54 -11 54 -82 22 -35 13 82 -34 43 36 97 93 102 -82 56 27 51 116 -61 37 23
7312 23 117 -101 6 -62 -86 -12 -54 -61 129 15 -79 -89 -35 -5 36 -45 28 -8 -122 69 51 24 108 -100 51 -2 98
7339 98 -56 -26 30 -8 -12 -62 -54 -54 58 -75 -18 7 75 25 -13 108 -4 20 -13 -10 -46 -17 40 11 -22 28 1 -43 10 -49
7369 -49 -101 14 73 -132 4 -26 -20 93 -149 31 -21 -22 -44 -5 10 9 -62 -96 64 -50 -146 74 -20 98 -32 -32 -60
7396 -60 18 -6 11 -3 -38 7 20 135 -65 -2 -100 -69 52 16 -24 4 42 -11 -35 -100 29 64 113 56 8 13 37 -3 -32
7425 -32 -4 2 34 69 9 -19 -8 -47 142 -200 32 6 -79 103 -121 19 -166 -106 29 -57 6 -77 -26 57 24 41 91
7452 91 102 55 -36 64 -90 -69 -35 -53 -57 29 -57 -84 -11 -109 12 -64 3 -80 59 -69 -49 100 -51 -64 -17 41 8
7479Hn4pJ14P7j31K3j96J02K46o0k29J7J00k8p0kJ16r2P0p6J02Kn5Q6q7L0J6j9
7507CJ09q9k1k9j09J48P6j15rl3L6O4P4k7j72N9J70m8j94P0j9l4P1O7q5Q6M6k15
7535a20J17j11J17J85j62K0k8k5olJ69j95l7J9J24l3m8K0m9N9o7m0N8mMj1n8J20
7563A5o9K3J33p9N0%j70J13J5jK0n6L8p9J1k2M0j4L2Q5j18j9Q0n9o3Q2j20K45
7591A13j01K7l4qNq7J64Oj50J63k26J71m4K7m5Pn5NQ1K2R7j14p2O5j00j4J39j70
7619a28K20k06K09nj01N6J36k86K11q7o6J5P7r6J1l5jQ8j07K0M5O7j50J49nk6
7645EK0j1rj55J49L3m4K7m1J6R1j00K4l6n0n7L4P2K0K5k8j3J3K9j09R5R6k20J03
7674b1Q5K3m9j05R0l2O9j17J06Jl8R8j32nL3K0o8m8R9r1m7J9K1K0J18l2q4K32
$$ plain form
7479 8 -46 -53 61 138 7 30 -166 -64 182 122 -107 -90 10 -18 -88 -90 26 -66 4 -72 30 32 -23 63 -24 6 22 3
7507 3 112 23 2 -27 -136 12 88 -27 -36 -69 -33 31 105 78 -94 -35 135 87 -107 -37 -56 -90 -19 48 -37 49 95 -120
7535 -120 -3 -114 3 188 26 46 18 -7 -13 -16 153 -42 -79 -60 64 31 -17 3 -46 13 -54 -94 -36 -40 -36 -47 -105 15
7563 15 -54 -31 102 23 73 73 -97 16 31 30 50 -6 32 -47 -36 -58 -18 -32 0 85 -33 -52 28 -31 -94 -12 -132 113
7591 113 12 39 5 -3 2 -85 79 85 -65 98 -128 43 -1 26 -19 -12 -67 -62 19 41 138 24 -48 17 -83 -97 42 -128
7619 -128 92 -114 95 90 -11 45 181 -105 106 19 -47 -32 45 -51 -40 -75 -76 12 -95 -75 -30 37 -113 36 31 5
7645 5 25 14 5 -150 -1 32 -12 15 -26 -10 81 -19 5 -31 -81 -138 -104 -32 -12 13 -15 -28 -15 14 -95 0 96 -124 -21
7674 -21 64 87 38 -67 23 -9 60 -57 49 50 12 110 -22 -27 6 26 -42 -90 9 -82 -129 -110 -89 -69 49 17 -67 165
7702A65j65nrj56J11Q5R9j29j16K29j77Q9o3n6J13QP1n0p3L8j9jn7Knl1L01k62
7730f3J62j82J50J4J3k24J02r6O2P0l8L1j8L6n8J7N0N3j38P9j57J22J68o2q2J
7756A2j34J66J17j75J8l6j3k7J02j17K11L6j39L0Lo7l2J5m1J34j25J44pq8j4J00
7782G3l2l0L6j20J0J66q6l2j8Q6Lk00J25o0J48K1n4nK4J3J5j53M1J52j62k19K60
7809BJ9n5Q3j68N9K12p7o1q9J19n3l5J28j34L0l9J15Jn4m9j0p0J47o9P1m2l0J86
7837A37j60K6j40M8K06k5j92N8J10p3J08j65J02j15O3P5k8O3j83J54r2j0J40n1
7861E6j33J81k7j41J49p3%qMP6o3M6o6M1n0J63k12L9j05J65L1o1k6m5k1Q3o3R0
7889C0Po5k4m6J26L2m7j9q5k4P4L0O1l6M5n2j00J03M8j41QJ32m3K7K2p6K28k27
$$ plain form
7702 165 0 -5 -14 -170 -59 26 125 -4 -120 109 -68 21 -42 -98 15 23 94 44 -29 9 -10 -11 -68 -66 -71 -102 199 -63
7730 -63 99 -83 67 81 94 -130 -28 -124 -62 8 -30 1 -17 19 -39 -22 28 81 -57 22 -135 -13 155 93 11 12
7756 12 -122 44 161 -14 4 -32 -45 -72 30 -87 124 160 21 51 54 -13 -45 -30 -71 63 -62 82 75 -13 -27 73
7782 73 41 11 47 -73 -63 103 17 -15 -33 53 56 -144 -19 -79 69 90 36 31 55 68 83 -70 -29 123 -39 -258 2
7809 2 21 -34 49 -119 -60 152 75 14 -75 44 -9 -44 84 -50 -20 -59 56 57 3 -46 -56 -126 21 -48 23 -19 -49 137
7837 137 -23 3 -137 -89 117 92 -100 -42 68 -5 103 -62 40 -75 -12 63 35 98 -85 69 -23 -33 107 56
7861 56 -77 104 77 -64 85 12 12 4 8 84 21 67 1 42 -8 155 -57 -18 -123 42 73 12 -14 -59 -80 3 -60 30
7889 30 37 -28 -52 -98 28 60 13 -6 -91 -115 -41 -11 50 14 59 7 -93 10 58 -83 -75 57 14 41 63 -13 215 -12
7917a2K5j37L25k71Q9J2o1j07P4J60j80J72j14P1k07L5P2O8k8j2J19j09j55J47
7941b4J50k08J08j0n5O2N3l4J2j65J50q2J10j65N1k9J10o9J34j22J18j06l5N7
7965A1j8l9J33r8m9P2q2J00j80J18m4N6J30k33O9L4J3p2M6N0PJ5KnL9q1l6J57
7993A15q0n8j6Qk9l7R3p3J00j11o9J29rR3p0q4J60j15Q2m1p7J10j0k34K95r9k1
8020d8R0k01J03R9l5J6n4jl7P0Q5j71J40l8L7J1j80O1n2J4K1J31Pk10R0L9R7j64
8048h0J06LL9R4j76J7O4p3L2jo8N0r4R2j3o9j32J57m9P8K9l3O8r7P4q7j0k4J70
8077F7M9j70%M9P2p2j29K14m4j11PJ05Jj67J63Q7pj5j30L6m8J0P9l8r3J31q6L2
8105hM5mK5j96J06Lk0MP2l5j8L8n8J21N1k22Q5j43O5J19J9q1k3JM9o5R4l4L4k8
$$ plain form
7917 -12 13 -124 201 -70 19 31 -30 -137 -63 97 -83 89 -25 46 -161 -126 -54 14 -14 -26 93 -16 -171 -24
7941 -24 126 -82 26 16 -39 23 76 42 54 -111 39 -43 67 -98 -47 -76 34 -35 99 -23 95 -11 -46 11
7965 11 -7 -46 87 -11 -60 12 -70 30 -150 -32 -76 -20 110 -123 -54 -20 -7 -79 -33 17 24 39 41 36 75 -6 -42 115
7993 115 35 -23 -39 -31 -60 -97 -4 -77 23 -88 -157 -28 -37 56 -14 -98 62 -53 29 -12 -89 21 11 -223 72 -27 -48
8020 -48 42 -159 -56 43 8 24 -30 -31 -68 2 87 -84 56 18 55 66 -114 -53 -105 -91 -70 61 68 -142 -52 -13 84 -80
8048 -80 26 29 68 162 -14 3 67 -6 26 25 -43 7 -87 5 -8 -77 -209 -52 -101 -23 6 -27 41 -56 18 -69 -79 -103 67
8077 67 116 -54 -54 -5 67 -5 -134 80 36 -75 -68 37 38 -129 34 121 114 99 -31 5 -43 -33 46 8 -85 46 -40 -8
8105 -8 37 33 58 -138 -32 -29 -49 -45 27 -8 -26 12 -46 75 126 -96 -11 -154 -89 30 49 -32 -55 -54 -5 -70 24 -10 24 -4
8135dL8j9rn6jQ1l4J41j6j23l7M9Q8k33J42m9J59j51J4J03o7n3k7k9Q7J0J05j19
8163a0j10N5N2pJ24j28M2k7n3J12j01lR9k5R5o4M3o6r8J8O5oJ5o6j4KkN6
$$ plain form
8135 -4 34 15 6 -50 -51 30 -4 137 121 -2 -39 10 98 -135 7 -42 117 -34 -20 83 16 -37 -64 -93 -6 4 109 -10
8163 -10 -120 -65 -13 -20 104 -24 18 -9 -62 50 -51 -54 45 20 115 51 94 28 -70 -52 13 7 22 -44 -58 -56 -58 -2
8191b
$$ Imaginary data points
##PAGE= N=2
##DATA TABLE= (X++(I..I)), XYDATA
0@%%%%%%%%%%%%%%%%%%%JlMmMmNpQqRj1J3j5J7j9K1k4K7k9L2l6M0m5N1n7O2o8
47c6P6q4R2j01J12j23J35j50J66j83K03k26K53k86L25l73M34n14O27p94J075j677
69a049N993r207m901J4435M473o959q667K964P995L84q380j678O091K395n393
84a504k980K466M713r9n837l456N916O136l573q564r9Q715M232p717p533M885
100d299R543k021j0381k13R874K194p796l940O235N958l492o882J339P585J307
115E011o618k655M170L891q16m500k134M588M086l535n269J618O237J083o144
130i87l736N798O550m272q468K278Q785L36p895l253O041M726m182n388J938N389
146C660o07n172n13M320J970l125l227J113M132J341m439m047K926N495o28o237
$$ plain form
0 0 0 0 0 0 0 0 0 0 0 0 0 0 0 0 0 0 0 0 0 1 -2 2 -2 2 -2 3 -4 4 -4 5 -6 7 -8 9 -10 11 -13 14 -15 17 -19 21 -24 27 -30 32 -36
47 -36 40 -44 48 -53 59 -64 71 -79 87 -96 107 -119 134 -152 173 -200 234 -280 347 -447 628 -1049
69 -1049 4944 -4263 -9164 5271 9744 2785 -5882 -2918 5077 5461 -2919 -4597 1494 3889 -1504
84 -1504 -4484 -2018 2695 2596 -3241 -6697 -781 5355 1782 -6782 -6881 1834 6066 -1651 -9184 -4299
100 -4299 5244 3223 -7158 -7371 2503 4697 -3099 -7039 -804 5154 1662 -5220 -3881 3704 5011
115 5011 -1607 -4262 -92 3799 2983 -1517 -3651 937 5023 1488 -3781 -2163 4074 5157 -987
130 -987 -4723 1075 7625 3353 -5115 -2837 5948 6284 -1611 -4864 1177 5903 1721 -3667 -1729 3660
146 3660 3053 -2119 -2632 1688 3658 533 -2694 -1581 2551 3892 -547 -4594 -1668 3827 3199 -3038
162c038k463M903M986l298o640J636O552l94n567p18M881J939m415l000L968M402
178C734k725n609J123N508J093l894l220J808M225Q07l561k621K185L749j49l636
194a183j136L351K455k800l339K392M263j881m978P22N123R99n299k420M027M026
210D322k525m620Q58M464K33l230j298J796K130n76k650p58K356J867j941k444
226b016K47L035J172l046k532K430L717j838l931O43M018L29l804j253L496K111
242B778k858l238K186L828j154l784m75K924J815j424k346k39K280J452j377j796
258a428M50J750O42j623j297J750J596j740k383J790L187j372l653n3L882J716
274C214l348k898K221L562r25l023k52J916J000r91j182M54P69M4p75l56Q74O03
$$ plain form
162 -3038 -5501 -598 4388 1090 -5550 -3914 2638 2244 -3323 -4041 840 2779 -1636 -4636 -668 3734
178 3734 1009 -4600 -3477 2031 3124 -770 -3990 -2182 2043 2850 -711 -3332 -1147 2602 2453 -1183
194 -1183 -2319 1032 3487 687 -2652 -260 4003 2122 -2856 -2134 2989 3988 -1311 -3731 296 4322
210 4322 1797 -2823 -1965 2499 2732 -498 -1796 0 2130 1554 -1096 -1854 502 2369 428 -2016
226 -2016 -1769 1266 2438 -608 -3140 -710 3007 1169 -2762 -2119 1899 2228 -1576 -2829 667 2778
242 2778 -80 -3318 -1132 2696 1542 -2242 -2717 207 2022 598 -1748 -1987 293 1745 368 -1428
258 -1428 -978 772 1414 -209 -1506 244 1840 100 -2283 -493 2694 1322 -2331 -2384 1498 3214
274 3214 -134 -3032 -811 2751 1826 -1197 -1449 467 1467 476 -706 -252 517 561 -214 -570 304 907
292I07p09j277R6K085P49k291k073K090K885r66l478j13L227R95k341k011J756
309d69K237j260k064Q37J733j21j676m25J363P76q14j031N5J149N40p70q94k1
327h55J353O47j637j005J442J504j105k018O70K441N3k426j095K358J829j592
343E64k319R83J841Q0j416n36R68N87o91k37L07M88l82o19O6N99O15m35j359k42
363a138J816J251j662j922O07K345K71k023r97J435J281r95j223O92J096q68q22
380h56N65J056k82j306j09J141Q90q24j232O8J011O96k53j287m16J240Q78p33
398B47j235L50J172J3j297l6J100L46j171o10J316Q83j075j089P67J392k99j186
416d12l89R69N53l73q52JO39K83l11l31r3P50K55o97o69O49R27n09q79P4R80J72
$$ plain form
292 907 198 -1079 -983 1102 1851 -440 -2513 -423 2462 1496 -1982 -2095 1132 2127 -214 -2225 -469
309 -469 1768 508 -1556 -719 1014 893 -783 -1208 155 931 117 -914 -859 290 830 60 -834 -855
327 -855 498 1145 -492 -1497 -55 1449 344 -1674 -1004 1437 1490 -936 -2031 327 2156 564
343 564 -1755 -772 1069 1149 -267 -803 165 752 61 -176 131 619 237 -382 -316 283 898 463 -896 -1138
363 -1138 678 1929 267 -1655 -1048 1297 1568 -455 -1452 -17 1264 269 -954 -262 834 -34 -856
380 -856 -291 765 483 -823 -932 209 1099 275 -957 -889 122 818 565 -722 -1138 102 980 247
398 247 -988 -638 534 547 -750 -786 314 660 -511 -1121 195 1078 3 -1086 -319 1073 774 -412
416 -412 -801 168 721 348 -504 -503 136 419 108 -223 -316 434 689 -8 -677 -28 899 390 -489 -415 565 737
438G37q22o18P78O62q75n49O91M78l62r51L73R18P9q73n37N73Q65l2n99n78Q6
459e56R77K42o97p16K63Q27K3o76K9L14R7l99J29P84Jj123k61J179Q13o67j264
480f81n2J304L26o60q92K72M26K12j66k51j64O1N71j5k88m5N4j77O9M16K18m23
502A15n99L5R04J69r78n84P14O52j95p06J39L99L27k55l67K13L05l74p6L0J02
523c0P7j55j60K6Q8K15m18lK91J22k14j76J09N13O0p84J53N77L04n12n38L01N61
546D07J2m21m22L05M95k49m4l2q9J0K73J96l24N8k65J00K02J39l24l73jM05K98
569C56j54q03j81Q43L79l27n35o1M02M13j01l50n5J43O4J27J69k12m49Q9K42L46
591C45k51m04j05L12O63j22n46k58J54N32K68n83k59J91J50R5k33l0j53N2J62
$$ plain form
438 737 -85 -703 75 737 -138 -687 4 482 120 -831 -458 460 539 -334 -871 -298 567 535 -64 -642 -556
459 -556 421 663 -34 -750 -487 340 363 -313 -284 30 127 -272 -143 641 642 -481 -742 437 1250 583 -681
480 -681 -733 571 897 237 -655 -383 43 255 89 -162 -326 -265 306 291 3 -42 12 -165 -96 320 538 115
502 115 -484 -449 455 624 -354 -938 -224 428 233 -473 -334 65 392 137 -230 -17 288 -86 -162 -132 -30
523 -30 47 -108 -268 -242 -154 61 -357 -360 -69 53 -161 -337 -228 285 345 -439 -286 291 595 83 -455 -154 407
546 407 419 -2 -424 -119 376 127 83 51 -38 -28 245 441 117 175 -90 10 212 351 27 -346 -347 58 356
569 356 202 -601 -782 61 440 113 -422 -483 -81 332 231 -119 -174 -31 33 160 329 117 -332 -243 -1 345
591 345 94 -310 -415 -103 560 438 -108 -366 -212 320 588 5 -254 -63 87 182 -51 -81 -234 -182 -20
612b0r1J09m1k71LL14J02k03m8O2K17N9r5j90j4J19Q6k44J95j14J89j21j30m2
636a69K65J38k64k7J2L36j70N2k43P2M6j1k6K91m05k63J64K31R6j20k54O7K34
659E2J96j60k49o5K85K81N9l24k28K00J21q9nj44k33J34K67J04k47k4k54L78K17
682B72k19k15j22J44L94l5l63k54J05M91n1j44l31j56L04M33k04k19J8n4K25K77
704B96M3m21j10K76J55O9k67k15J94K28lk78o3R1J80J07j25J3j87J08M6p9J41
727A99j30m1jk1n4J75q6k03J35P2j29K3R9j8j07M6p9LK49k36j07N6O2K62k27p9
753a37P4K7J11Q4k72O0j92L46n0j28j72K07l6J89J13l49j02O0K37K27j59k61n
776a28K6L97j9l06j27J72k1K16J7k68p6P2K81p8j41l6j74K56J15L6l29o7J46K43
$$ plain form
612 -20 -111 -2 -43 -314 -311 3 105 -98 -146 -84 133 192 97 -93 -107 12 98 -146 49 -65 124 3 -127 -169
636 -169 96 234 -30 -57 -45 291 121 173 -70 2 48 37 11 302 -103 -366 -202 29 125 5 -249 -182 52
659 52 248 88 -161 -226 59 340 399 75 -153 47 168 79 74 -70 -303 -169 98 202 -45 -69 -323 55 272
682 272 53 -162 -284 -140 254 219 -144 -398 -293 198 147 3 -328 -484 -180 253 49 -170 -152 -206 19 296
704 296 339 -82 -192 84 239 308 41 -174 20 248 245 -33 -96 -5 175 282 157 170 -17 91 137 58 199
727 199 69 28 27 6 -48 127 41 -162 -27 45 -84 -61 38 20 -87 -41 -120 -117 132 -104 -211 -155 -93 169 -58 -137
753 -137 -63 -36 75 159 -113 -53 -245 101 51 -77 -249 -42 -78 111 224 -125 -227 -167 70 297 138 -123 -128
776 -128 -102 295 276 -30 -157 15 -6 210 227 -41 -117 -45 236 158 17 -19 -193 63 178 214 -115 -182 -36 207
800B07P8j91k62k4K75J83j68j97j9K2J07R2j79j25q3K24J39r5j37qMK71j0j86
824h2j07Q1J72k7O1k30j8J45O7q2j88K22KR8k69Q1n4J54ok0l5Q5J12j09O0k02
850h9O4P5K03k58O2k04K31K38k81j30k0J08J06n3J05l51LM2M36r8k15j74Q7L25
874B12Q7n2k94j49K05R4J09j55k69n7L23J46j49j85o0J00K77ol24R7j99K33J68
897A52o1k39j42K04K04Pj44r2j32J82K92r2l53M2M3J55O5k09q0K6J74J28j02j02
921g4o4J59Q9p9%j4j84K23o5N6q4R1MN1Rj54NJ10q2OJ29j13L0K6J05j30j35J62
949G7m6Ln5J8j15L04o8q2l8J19j02J36r5j11K8J25lQ1k96j16R4L06k11M4l82M00
975A5p9J83k8k84l8NK25J79j58j57Q4Q9J12j02R1m30O4L16J35k75j21K0J56J20
$$ plain form
800 207 285 94 -168 -192 83 266 98 -99 -118 -96 11 103 -76 -201 -284 -60 79 -16 -153 -161 -157 114 104 -82
824 -82 -189 -108 64 37 98 -132 -150 -5 62 -20 -208 14 16 114 -155 -74 -128 26 20 0 -35 50 162 53 113 -89
850 -89 -25 50 253 -5 57 -147 84 322 41 -89 -109 -1 105 52 157 -194 -191 -149 287 189 -26 -200 -113 212
874 212 299 247 -47 -196 9 103 212 57 -212 -269 54 200 51 -134 -194 -94 183 177 -147 -50 -249 -16 152
897 152 91 -148 -290 -86 118 125 -19 -111 -243 -61 231 139 -214 -172 -129 26 91 -118 -198 -172 2 130 28 -74
921 -74 -138 21 110 31 31 17 -167 56 -9 47 -37 54 58 109 118 -36 -31 79 -3 3 132 19 49 75 180 50 -85 77
949 77 31 34 -21 -3 -118 186 118 36 -2 117 15 151 56 -55 -27 98 95 176 -120 -236 -142 164 -47 -3 -385 15
975 15 -64 119 91 -193 -231 -226 -1 178 20 -137 -53 36 148 46 137 -293 -229 87 222 -53 -174 -154 2 122
999A22L1k26pj5K32L2p8j59j03J70P6R8k45o5K7J81Q6k49Ko8J28K58r1j25JK2
1025C5M4J79k08k7M1j4J40l25J96j51j4Q5J30r0q1L4N9P2r5j62R0J40r5j9%l1
1051f7J68K9l23n7O8K05Lo0o1L3J7J35j21J79k13K11k9N1n4k14J58K2R4M9j49
1076G4o4MK11j14j62j16M6K10O5q0j72j22K66J70j20k61M7pJ13J46j71n1j56J23
1100a21J40J93k55r7%J90J19k8j37j4Q2M8j3k66M3K9R5L04l27k1Q8M4N3r1K4j11
1126b9Q8j16J02Q5j91j6oK22j1j84Q3j10Q1l7NL1K7K3l5Nj9LK0n0J7J2J5M4j43
1155h4PM5m0N1Q2j10q8P0j9J47k5p8o3pJ79o1k8k00J38K06J07k77j19K0J35J20
1181A08Q0q0j39j1Q6J54j51o3j41K41P3j00l6j18J1J58jrp3j0r9K43Q4k69J5l2
$$ plain form
999 122 153 -73 -80 -95 137 169 91 -68 -171 -1 75 173 -72 -137 -110 71 157 -92 -90 -158 -30 228 137 12 13 35
1025 35 79 258 50 23 64 50 190 -135 61 -90 -104 -19 111 21 -60 -26 33 105 10 -152 -62 78 -17 -36 -36 -67
1051 -67 101 130 -193 -250 -182 23 26 -34 -95 -62 -45 90 -31 148 -65 146 117 168 114 -100 58 80 174 223 74
1076 74 10 14 225 111 -51 -167 -121 89 154 74 -98 -220 46 216 96 -165 -118 -125 -12 134 -37 -88 -244 -121
1100 -121 19 212 -43 -140 -140 50 169 141 4 -10 72 120 107 -159 -116 -87 8 312 -15 -36 52 96 149 58 82 -29
1126 -29 59 -57 45 130 -61 -77 -83 139 128 -56 27 -83 -2 -39 -34 -3 24 47 12 17 -2 1 21 -29 -12 0 15 59 -84
1155 -84 -77 -32 -72 -21 61 -49 -137 -67 -86 61 36 -42 -105 -112 67 6 -22 -222 -84 122 229 -48 -167 -147 -12 108
1181 108 188 108 -31 -42 44 198 47 -16 -157 84 157 57 21 -97 -86 72 71 62 -11 -21 -120 123 207 -62 -47 -79
1207g9J00P3o0k3j4J2J81p3r4k04lL53r7J7j59K6j37K46lK2o9q0J42N5j20m5K5
1234hL0p1Q6P4m5l9J35j47n3M2o8J9j9J5J7j0Q8J1m1rm7R7J3r6J58k6l1k6kj32
1264h5J2K78j42o4r0N0Q3L3q2J33j15J9Q4J05Pk82j16Q7J46k3J3r9j34J72R9K0
1290A09j46j79J48P8O9j76j8J3L1Q7M7j07j70J79R0m7O5k32%J81J74j66j35l9
1314a44Q3K10p0j65j1R2j50J82m8o4PL0R5k1Ko7L3J37k32K51k46m4J64J11q1r9
1340d5nL5j6O4j11M0M3KJq1L6Q9q5Lp7J9L1J25J1j03L5M5j95J25k0R7j29M8J51
1369A33j11l3j03J19P9J11k33O3j04J28L6q5k2l9K6K46N3l02n0J01J38l7r6n9
1393d1q3J71k8rJ11j27k00J11K54l9j61j09J36L2J55Kj36r7J23Q5l5r6j07J54
$$ plain form
1207 -79 21 94 34 11 -3 9 190 117 23 -181 -184 169 72 89 -70 -44 -181 65 62 84 15 -65 77 132 12 -33 -8
1234 -8 22 -49 37 111 66 27 162 15 -38 4 -64 -45 -64 -49 -32 -42 46 57 16 7 -40 57 70 -26 132 106 75 49 47 -85
1264 -85 -73 205 63 -1 -91 -41 42 75 -7 126 11 30 114 219 226 -56 -172 -85 61 38 51 -48 -182 -10 89 109
1290 109 -37 -216 -68 10 79 -97 -115 -102 -71 16 63 -44 -214 -35 55 8 73 -159 -159 22 196 30 -105 -144
1314 -144 -61 149 79 -86 -97 -5 -155 27 -21 -85 -78 -48 47 26 28 -39 -6 131 -101 150 -96 -140 24 135 54 -45
1340 -45 -50 -15 -31 33 -78 -38 5 7 8 -73 -37 52 -33 -30 -107 -88 -57 68 79 -24 11 56 -139 -14 -34 63 -66 -18 133
1369 133 22 -11 -114 5 84 195 -38 25 -79 49 85 0 -22 -61 -35 211 264 -38 -88 13 151 114 18 -41
1393 -41 -124 47 19 10 121 -6 -206 -95 159 120 -41 -150 -14 18 173 175 39 -58 65 150 115 19 -88 66
1417F6K2j1p4n7m4J35Q1o0o4j09M8J93J8j12o3J34k08J91j09r8J59o3Q5j18R4
1442C6LMj7Kp1j7J2l7J88j37P2K7k3J7j31N0P1o4K44k12l7MK5J01j09O6k17J56
1470FJ49m0k41P8J06%R0j64O4j96J49KR4j20J5m3J41k6m6L1k31N4K15K8k18o6
1496a69J53k7R5m5j82N6J71j7rL7j15n6J59Q6J2k33Q2j03Q0J09j30j23J66Qn5
1521e0n0J02q4P5j32K40j61q8P2K20j12M0K3j39m8J57j2kj6j9q2L3o9n5J43J9
1547EN8L8r6k8p2OJ97j14k5P3o1j33J36N5j52J80k12J36N2p4%N1k3L7l0n6K3j1
1575d0j25J35J1Q8j03R5o3m2L0Q3k27K34J3j3o3l0N7j4L9K7k5j31Q0O8mk9N0j77
1603g6PJ13J5L9p7j3q4K56pk69RJ2J18J2M7r7o0m5J44N8j42K5J2O8l5K2j13K3
$$ plain form
1417 66 88 77 3 -54 -98 37 118 58 -6 -115 -67 126 144 32 -31 103 -105 86 -23 -121 38 -25 60 -58 36
1442 36 39 43 26 28 -43 -60 -48 -85 103 -34 38 65 42 59 -72 -22 49 -15 229 17 -20 -16 9 110 1 67 -150 6
1470 6 155 115 -126 -48 58 58 148 -16 48 -148 1 3 97 -23 -8 -51 90 64 18 49 -182 -128 87 115 -103 -169
1496 -169 -16 -43 52 7 -175 -119 52 35 26 63 -52 -108 51 137 149 -84 -2 -105 -25 84 -46 -169 -3 5 -50
1521 -50 -100 2 -82 -7 -139 101 -60 -148 -76 144 32 72 95 -44 -92 65 53 51 35 16 -66 -33 -102 -157 -14 5
1547 5 63 101 5 -23 -95 -89 108 -6 -31 42 -19 -152 -16 39 -113 67 -145 -9 43 -31 -31 20 -3 34 4 -52 -29 -40
1575 -40 -165 -30 -19 69 -34 61 -2 -44 -14 69 -158 76 89 76 13 -17 40 26 65 92 67 -64 16 84 80 51 101 -76
1603 -76 -69 44 59 98 21 8 -76 180 173 -96 -87 -75 43 55 102 5 -55 -100 44 102 -40 -15 -3 65 30 52 -61 -38
1631c8Q0m3M5n8j0k9J45Q5k48J7J79n7o6j14Q9On0l6O9k7l1r8J96j8R0L9J3j70
1659d0O4k6m4n8jJ90O6k50L2J39j39J05j45K05j01ML8j3LmjM3j6q0m8m7K28J32
1687B36k80K0Nj9M2p2J9P3l0j9J35q0j12kJ76l2Q9j82o5K0J07O7k50J63j04O9
1713b6J08p2p2j13J36R6J2p1n5J0Q4N2o4j50l5J84Rj05j1J11L7m6M2j27Q9j1N7
1740F9LMo6j00j25K48lm8k3oJ26o9l0l2P5M0j90J14N4jj06J1M1j53K14m8O3Jm0
1769B3o2J53j19o1J17p2N7m6k6J21j82J4N9K25k29L7P6j00p6J12j7k7j29Q0J40
1794F8j01rK3j4M1L6n1J15j83O7J06K5j57k04J66J7K05j93q7Q1r9N6K4L4j13J70
1820B3p8K02j99J2N0m7J35p6Nn7Kqk0J23n6m2J10J9m5Lj82Q0Q2j4J2j72L04k68
$$ plain form
1631 -38 42 -1 44 -14 -24 -53 92 177 -71 -54 125 68 2 -112 -23 -17 -67 -103 -34 -61 -92 -190 6 -12 78 117 130 -40
1659 -40 24 -2 -46 -104 -105 85 151 -99 -67 72 -67 38 -107 98 -3 1 39 26 29 25 24 67 51 -29 -77 -124 104 236
1687 236 -44 -24 -19 -38 4 -68 -49 24 -6 -25 110 30 -82 -84 92 60 149 -33 -98 -78 29 96 -154 9 -95 -26
1713 -26 82 10 -62 -175 -39 57 69 -2 -57 -47 37 89 25 -125 -160 24 33 -72 -83 28 65 19 61 -66 23 12 69
1740 69 72 76 10 -90 -215 33 30 -18 -41 -47 79 10 -20 -52 23 63 -127 -13 41 40 -66 -55 -14 -167 47 -1 62 63 23
1769 23 -39 114 -5 -66 51 -21 36 -10 -36 85 -97 -83 -24 201 -28 9 85 -15 -91 21 4 -23 -152 -72 68
1794 68 -33 -42 -19 -33 8 44 -7 108 -75 -8 98 123 -34 -238 -72 -55 150 -43 -130 -49 -148 -92 -68 -34 -147 23
1820 23 -55 147 -52 -40 10 -37 98 22 27 -30 -28 -36 -56 67 11 -31 79 98 53 56 -126 -46 36 22 34 -138 166 -102
1848a02J21n5N2L4r7M1J9k0n8o3K72j90n0J17nn8nR5n7J26k00N0J08n3p1J13k
1875F2n5j27J18J03j9k08J52LK1n5j5J1o9J01Opm8lrLP7m7m1K29k19P9J39k45
1903f3Q6j70J74J51j71m9Ql3J65J3N8p6j52J6J79K0p5j33Q4n1J9N1p9j4M1j34
1929a35K08m8n4j99L23J11j39j77O6N7j2k1n5Q9r8O3N7kk6n3N6K7j0r8j0P4q6
1956i2Q8k03K62q6O6o2l3m7Q8N7j35J21j36J28k0J55j35j38J30r6J18J33j65m5
1980d7j30J89J24q3j06J45j74Q8k2j52K79r9J21o2j30r9N4K19n5k2k03K47P4j74
2004a8J9r5J65j27O6k0p9J30q4k4K33j24j19J53j03N0j28J05Pj28Q3R6l2Lj05
2029g6N6J57n4j77O2L3K1Rnk3M6j78R6J17j6q9P9L9J38k38j7n2O0P9rM8p5q2r6
$$ plain form
1848 -102 19 -36 16 50 -47 -6 13 -7 -65 -128 144 -46 -96 21 16 -42 -47 48 -9 117 -83 -33 75 22 -49 64 62
1875 62 7 -120 -2 101 82 -126 26 29 50 -5 -20 -9 -78 23 29 22 -26 -29 -38 -35 42 -5 -46 183 -36 43 182 -63
1903 -63 23 -147 27 178 7 -42 -34 -67 98 111 169 93 -59 -43 136 156 81 -52 32 -19 0 51 -28 -42 -1 -135
1929 -135 73 25 -29 -228 95 206 67 -110 -44 13 1 -20 -75 14 -84 -21 36 34 8 -45 11 38 28 -70 -80 -6 -92
1956 -92 -4 -207 55 -31 35 -27 -60 -107 -19 38 -97 24 -112 16 -4 151 16 -122 8 -88 30 163 -2 -47
1980 -47 -177 12 136 53 -53 92 -82 6 -16 -168 111 12 133 71 -59 -158 -104 115 60 38 -165 82 156 -18
2004 -18 1 -94 71 -56 10 -10 -89 41 -43 -67 166 42 -77 76 -27 23 -105 0 7 -121 -38 58 26 29 -76
2029 -76 -20 137 83 -94 -32 1 22 31 26 3 49 -129 -33 84 68 -21 58 97 235 -3 -20 -72 -12 67 58 106 31 -51 -147
2058a47K91n4k36J03K19j82P2l2J48j70j21Q1k3J01m6k22J83pj5J5Q0j56lR0J26
2083I5j35k9L4J65p4j37J33n7J16j62R1nk2l2l8Q5n4L5m8j2J5q0R7J73n2j33R
2110b2J05j5m0k2L9L9q4J01q9Q1j05j63K12k1o8K7R4m2k9J7lm6l3K9J91k36r2
2137a75K05K5k9m1p7J81j39P5n3l7J18j37K8J19o0r8l7J85K9j05MJ04jk20MK37
2163A05r7n4j02K22mj20jJ95p8j60J6OR2l9j6M1j2m4J75j14k1l8l7O6P2m3k0J45
2191A35q5n1K5l4J03m8J3p8rM9j2m9j0M1O0j13K08j98p2J73j06O1J0J13m9j46
2217f9k4R2M1k54J94j35J41j4J15n7j7q3J10J44m7j07r2J27jJ8Q6j81J61j68l
2242b3k0m8Q2jR2r6k7o0J21O4j36kO8Q9j56J31n0Pr4L6J30k8N1j57Q8j1o6L9l7
$$ plain form
2058 -147 144 90 -146 -43 176 -6 66 34 182 12 -109 -28 -51 50 4 -218 -35 -42 -57 -42 38 -118 -121 -31 95
2083 95 -40 -69 -35 130 56 -81 52 -5 111 -51 40 35 13 -19 -57 28 -26 9 -39 -51 -36 -116 -19 154 102 -31 -22
2110 -22 83 68 28 6 45 84 0 101 12 93 -12 -175 37 16 -52 -25 69 27 -2 15 12 -34 -67 -38 153 -83 -175
2137 -175 30 55 26 -15 -92 89 -50 25 -28 -65 53 -84 -56 63 3 -95 -132 53 82 -23 -19 85 84 -136 -132 105
2163 105 8 -46 -148 74 70 -50 -51 144 66 -94 -78 -72 20 -19 -35 6 -6 -50 125 11 -10 -48 -85 -19 53 10 -10 135
2191 135 50 -1 24 -10 93 45 58 -20 -29 20 8 -41 -51 -10 50 -63 145 -53 -125 48 -58 3 13 126 77 -69
2217 -69 -93 -1 40 -214 -20 -155 -14 -28 87 30 13 -70 40 184 137 30 -62 65 64 82 168 -13 148 -20 -23
2242 -23 -43 -91 -9 -10 82 -14 -41 -101 20 84 -52 -54 14 103 -53 78 28 35 -59 -23 107 79 130 -27 61 50 -16 23 -14
2271a4Q1j22o2K36q1ln8J62j09m4P7R3k26k6J46m3K9k3m7M5J04j52n3L3l0j9M5
2298f1K05j16l8r7R6L0j08P2O0m3j05J35K6o3j50K20N5p7p5J26j38N8j5m9L4L4
2324A6m4n1J55M0j53J0M3j10J10j18L01j91l6j8PJ15k73J24J7J46r8j5n8J63q4
2349bo9J80m7j80K9J43l8k49J87J31J8j57R3J20j38L7K5j03M2j50QM9J07j70J22
2374a2j5J15j18k1O6J09j95%R4K2k2k2O5o9j4q2J04N6lL4oK7j59l8J09o3OL8N4
2403F0L9k32J22J7P9j46lO3R0j30R2m3Q2l9q1J11k9j52N8R1Ok4n7OM2j15m4J62
2431B5j04J10k0p0P4p2O8N5jj4p5j69K33j00M8J04j6k18P6J00P9j70Q9o7l2N8
2457iJ7N7oj8q5k1J33p5L6J7j1J4N9q0J01K4l17J73J1R0o7po3L8k05K72o0O4j10
$$ plain form
2271 -14 67 -55 -117 119 38 35 -23 139 30 -14 63 156 -70 -96 50 7 36 13 -34 11 115 -37 -90 -57 -87 -106 -61
2298 -61 144 28 -10 -107 -11 19 -89 -17 43 0 -105 30 56 -7 -157 63 118 41 -34 92 -46 12 -3 -52 -18 16
2324 16 -28 -79 76 116 -37 -27 16 -94 16 -102 199 8 -28 -46 -39 76 -197 -73 -56 90 -8 -23 -81 82 -2
2349 -2 -71 109 62 -118 -89 54 16 -233 -46 85 103 -54 39 159 21 58 83 -20 22 -128 -120 -71 36 -134 -12
2374 -12 -27 88 -30 -51 15 124 -71 -71 23 45 23 1 66 -3 -17 -99 5 61 58 92 86 113 -46 -84 25 -38 -32 6 60
2403 60 99 -133 -11 6 85 -61 -64 -1 89 -41 51 8 90 51 -30 81 52 -100 -42 49 55 31 -26 -20 22 -93 -137 25
2431 25 -79 31 11 -59 15 -57 11 66 65 51 -24 -193 40 -60 -12 92 76 -142 -66 34 113 -57 32 -35 -67 -9
2457 -9 8 65 59 41 -44 -65 68 -7 29 46 35 49 108 28 129 153 -164 9 20 110 43 36 -27 11 -194 78 18 82 -28
2486b8RJ16o5P9o2k6m4k6P4O2q5K7J02j62J4JP5q3J6k0j2J00q0J52k61K30j45
2513d2J24r1K1j3p6J00m1J28j89MR7Q3j40M5j15J17l0J25j31M1L3j25J04J3o8
2538b6M2P5K4n4n1r2J21n1l9qo3J5J19L6M2q6lM3l8K0mp4N0O2j15J05q4J41k82
2567a75O8J76r5L1N2o7j3M4rl2l6Q3J7j8N7q5l6J9j0m5J82K6m8O5j58J39q3j06
2595e7J00K3j70J17O0j72J35n1l8M6K0o1M1K4J9K5j02J49j43L7Kj0j12R9J24j91
2621h6J55m0Pj53J59K1%m9o0Q9p3L8k3rj1J3O1O1m1o8m2J01j2o3n5M4L8J42k71
2650a27J71l1N9j01P3Q3k3k4k03K27j82K4r9K78k05l4K12lp3J10n9j06j5M7m3
2675d4J42k71Q3N2J26k46K45L7j50O8j14P6r7J68j6M2o2j11J45p0p1M2Q1M8j1
$$ plain form
2486 -28 -19 97 32 111 49 23 -21 -47 27 89 4 31 133 -29 -15 -14 61 -22 -6 -26 -38 62 -18 134 -127 103 -42
2513 -42 82 -9 12 -1 -77 23 -18 110 -79 -75 22 105 -35 10 -105 12 -18 107 -24 17 50 -75 29 42 -26
2538 -26 16 91 115 61 10 -82 39 -12 -51 -59 -122 -107 12 48 90 4 1 44 6 26 22 -52 -2 60 -55 50 -34 107 -175
2567 -175 -107 69 -26 5 57 -10 -23 21 12 -20 -56 27 44 26 83 -2 -38 -19 -29 -74 108 134 86 151 -7 132 49 -57
2595 -57 43 66 -104 13 73 -99 36 -15 -53 -7 13 -48 -7 17 36 61 -41 108 -35 2 4 -6 -118 -19 105 -86
2621 -86 69 29 36 -117 42 63 63 14 -46 43 -30 8 -15 -24 -35 -22 39 100 59 -9 -51 50 38 -25 -80 -36 2 144 -127
2650 -127 44 13 72 -29 44 127 104 80 -123 104 -78 -54 -153 125 -80 -114 98 95 22 132 73 -33 -48 -1 -44
2675 -44 98 -173 -90 -38 88 -158 87 124 -26 42 -72 4 -93 75 59 101 39 -72 73 3 -68 -26 55 103 92
2700I2r5%Rj9r3M5J4K2P8l8m3N8l9N7J11j57p4J39nj05MRP9Lj7NN6p1m7o3l7J17
2732er4N8O1j0Rr2J1M3O7M6j12o2J98r4k7J37Qj75N5jm6n0J47k38J04J11J2m3
2760A8r9M4p5K19qj09lR2p9n1P2m3J95j43L8q6M7k1Q2j38R4j44J10O9m6r7K2K3
2788a7J14l8n8L4o2j07Q8N1o4R9l4l6J4j5K4K5L1K3j27M5K8J76k04M5k8J0O7j11
2816b7k8J67q6j6J9k9k3Q5j07l5r6J84l5L2m7Q5l6r5J09p8m3J22j27K8L6R3j58
2843a06Q3J86j09j17p8K20q7J80q9q5j20Q8n1R1l5J8J3p6L2R8R4l4j16M0n6p3
2869h9R7l8J11ql8o3J6J54m0J2r3L0k4k9L8p5L7j3L4R7j00J3k06Q6J37k7Mn3M0
2898A0K0j45P6K11k33P0J3n1O3J9K2j31J16m8k8K2O5j43kJ03O6q6M0N5m8l6j02
$$ plain form
2700 92 -3 -3 6 -13 -106 -61 -47 -25 53 15 -28 30 -9 48 159 2 -72 67 62 -43 -39 -30 49 52 35 40 96 25 -22 -85 -122 -5
2732 -5 -99 -41 20 10 19 -73 -62 -19 48 94 -18 -80 118 24 -3 134 142 -33 22 21 -25 -75 72 -166 -62 49 61 18
2760 18 -81 -37 -112 107 99 -10 -13 79 0 -51 21 -22 173 30 68 -18 29 8 90 -48 46 -98 12 81 35 -62 -40 -17
2788 -17 97 59 1 35 -27 -134 -46 5 -59 40 6 -30 -16 -31 -7 18 49 72 -55 -10 18 194 -10 35 7 17 84 -27
2816 -27 -55 112 26 10 29 0 -23 62 -45 -80 -176 8 -27 5 -42 43 7 -88 21 -57 -100 22 -105 -77 -41 52 -106
2843 -106 -23 163 54 -63 -141 79 -8 172 83 -2 -122 -34 -85 6 -29 -11 2 -74 -42 56 150 116 0 40 -16 -89
2869 -89 8 -30 81 73 35 -28 -12 142 102 114 21 51 27 -2 36 -39 -2 -15 19 116 16 29 -177 -91 46 19 23 -30 10
2898 10 30 -115 -39 172 -61 9 22 -29 34 53 75 -56 60 12 -16 6 71 -72 -74 29 95 9 49 104 56 20 -82
2925h2Q9m7O4j0L3J6q8l0O7P4q6m0P4k2Rq0Pj9K6J06Pl8q1J14lj34O0M7l4lKm9
2957e1K6kkqk6Q1k1M3j14J67j50k8O7m3J46j76J94n6q9J1m6L8Q3r0L7p5J15MN
2986D0Q0L9p9q8k2o7k9J26m2k4P8K3P4j87J06Lm3J60j78M2Q3j03R5j09k8N1n2
3013e1K30j36m9K46k68J3L7r9J49j74J77j03m6J93o7j54J1J58K8J0j42QL2P8j23
3038d2o2J04M5n6L4p9P2j0m2P1jN1n1k7L8o4k6M1rQ0j08rJ73j98J08k9K7j02M1
3067c0o0J08O2j08P1j05J63l4m1m6l9N7J12k50J54J9j14L4O7l4N4j68R5o7L3R6
3093B9j76J25P4n0l2n4L8J61j99J14l7k7K4l1J24k4j8q4J0J42j00n8Q5Jr3J09
3119E3rl0M5L6j65N2J17j10M8j30M9J1j22J41L7O6q0n0L9o7J37l1j33J21l9J33
$$ plain form
2925 -82 7 -40 24 14 47 63 -25 -55 12 86 0 -40 34 12 21 -59 -52 -71 -45 61 68 30 -51 63 60 -74 -14 33 -1 -4 -2 -51
2957 -51 -25 -27 -29 -37 -63 18 -3 40 -74 93 -57 -85 -18 -61 85 -91 103 47 -42 -31 -77 -39 44 -46 -9 -84 31 35 40
2986 40 120 159 80 -8 -30 -97 -126 0 -42 -66 12 35 109 -78 28 31 -12 148 -30 12 95 -8 87 -22 -50 1 -51
3013 -51 179 43 -6 240 -28 -15 22 -77 72 -102 75 -28 -74 119 52 -102 -91 67 95 105 -37 -29 3 81 -42
3038 -42 -104 0 45 -11 23 -56 16 6 -36 35 34 85 34 7 45 -19 -45 -4 -13 67 -41 -50 123 -75 33 4 31 -71 -30
3067 -30 -90 18 80 -28 43 -62 101 67 26 -20 -59 -2 110 -140 14 33 -81 -47 20 -14 40 -128 -33 -100 -67 29
3093 29 -147 -22 52 2 -30 -84 -46 115 -84 30 -7 -34 -10 -41 83 59 41 -43 -33 109 9 -49 36 37 -56 53
3119 53 44 14 59 95 -70 -18 99 -11 37 -93 -44 -33 -155 -14 23 89 9 -41 -2 -69 68 37 -96 25 -14 119
3145A19j60J27n0p2J27r8o2Q4Q4m2q8J13l3j24K0J15o3NR1k24K22j28ll3R4J8
3171C9j66K68j86OJ00q5N1l9m4PM7LL5r4P8ON1m8p3R1q0R1r1k0K6j3M4J13j86
3200f9N7L8j56J61qnL1mp3Q0k11J92P3n4j93J41L1j4J07k25R1L6m7j1M2m8J45
3227A07j05N3l7k9l3N6N8p3N7j42J31J11j22J36j38K5qq1O9j7k3j7J51j36j3J44
3253A24nj80P1N6l3p7%l4J03m4o8N3Q4j4J8p4J06j01o5K48j01r0K3p4O5j13J83
3280F1l2KR4r9R9j82Q5O2n3p4J4P3l6J6l1j20J64k2N7j85L4J13J0o4PO0On9pJ15
3310A08o1j01M3J1%N3j21J10N6j92O3M5J8j28K03K0k37J05O0om5R3j44L9N2Kp2
3337b6J12j36J29j03J1l0P6j5m8n2J21n2J6O9o9o9LJ40j09J0L6L2j5k3m0N7J03
$$ plain form
3145 119 -41 86 36 -36 91 -7 -69 15 99 57 -31 82 49 -75 -55 60 -3 2 93 -131 91 -37 -40 -73 21 39
3171 39 -127 141 -45 -39 61 -24 27 -12 -56 -49 -2 1 36 -58 20 26 77 29 -44 47 -33 58 -33 -53 -27 -40 4 117 -69
3200 -69 -12 26 -130 31 23 18 49 45 -28 52 -159 33 106 52 -141 0 31 17 124 -101 -10 26 -21 -32 10 -38 107
3227 107 2 55 18 -11 -44 12 70 -3 54 -88 43 154 32 168 30 55 47 -34 35 18 -5 -22 129 -7 -20 124
3253 124 119 -61 10 66 33 -44 -44 -78 25 -19 -87 -34 50 36 54 -20 86 -15 -80 168 67 -23 0 -74 -9 -122 61
3280 61 29 31 125 26 125 -57 28 90 37 -37 -23 50 14 30 -1 -121 43 21 78 -107 -73 40 50 -14 -7 53 59 0 -7 108
3310 108 47 -54 -11 0 0 53 -68 42 98 -94 -31 14 32 -96 107 127 -110 -5 55 49 4 97 -47 -8 44 46 -26
3337 -26 86 -50 79 -24 -13 -43 33 18 -30 -82 39 -13 3 72 3 -66 -63 77 -32 -22 14 46 31 8 -32 25 128
3364A28j52l9P7J5N6q8r7K23j75R6j07P6k5N4j08P2pK3k6m6m1LJ50j15j4J0J6
3391d1J43j17L3L1o1L4Q9j69N7J23j46k8n2K07j30K01j37n2n9J36j17Q2l4rl0
3416d6M0J21r3j4l1J25j98J54o4r1J71j7j2j6r2J08n0j12M9R8J0p6J21j9r3P3
3442D6p9M2o8l7J61j39q6P4Q6L9p8R2q7J11nk2j43Q9n8J12O8k11Q2P0K9r4Q4o
3470G2k57J92j08Q9n6M9NO1M3j91J98j16n5mj2Q2O3%p2o3R6m0j00R3J4L0j56L3
3498a10Q8J0j52J31N5m6k6J35j31Q0M2p1oO0K9m2j20M3k2R8o9O7j05L6Q4r4Pj
3526c0l0J30o3O0j98K46j94N7RP2j3j30Q6k2K4r5N7J4r7O2K0L8K0Krm9J20r6j4
3555b3N8R4j23n8M3l0P1N0j16L6o3K7J82j84j4M9m3K9K1J01j39O0o0l4R0l0N1
$$ plain form
3364 128 -24 -63 14 29 85 -3 -100 123 -52 44 -63 13 -12 42 -66 6 -1 22 -4 -50 -91 -88 62 -53 -67 -57 -41
3391 -41 102 -15 18 49 -12 22 111 -58 -1 122 -24 -52 -104 103 -27 174 37 -15 -74 62 -55 27 -7 -16 -46
3416 -46 -6 115 22 8 -23 102 -96 58 -6 -97 74 57 45 29 -63 45 -5 -117 -68 30 40 -36 85 66 -27 46
3442 46 -33 9 -59 -96 65 -74 -160 -86 0 39 -39 53 -34 77 72 50 -93 -4 -62 50 118 -93 -11 59 88 -6 78 72
3470 72 -185 7 -101 -12 -68 -19 -14 47 90 -101 97 -19 -74 -78 -90 -8 55 55 -17 -80 16 -24 -124 -31 -17 13 -143 -110
3498 -110 -22 -12 -164 -33 22 -24 -50 85 -46 34 76 5 -1 59 88 46 -74 -31 -53 45 -24 43 -62 -26 58 -36 -29 -30
3526 -30 -60 70 7 67 -131 115 -79 -22 -13 59 46 -84 2 -20 4 -91 -34 -20 -117 -55 -35 3 23 25 16 -33 87 -9 -23
3555 -23 35 129 6 -52 -9 -39 32 82 -34 2 -61 -34 148 -36 -50 -1 -44 -15 6 107 -32 28 -32 -66 24 -6 45
3582D5J2j54Q0P3o5j5J40p2J7p1q5J16j3K4k4m2Ll8J49p5O7r0j7O4J2P1j61L8
3610a1J10r3o6L6pP9k2pj75J89m9J00J0l7M2j64P2nQ1j56R0J8n6M2o1J32j38l9
3638h5K1J03p3J00j34J5R3J26l8j50R2j47J31o7P7m7J5P1j01pR7j52L4R0l8j54
3664a28K70n8j57J21L8Mo7q1M9j3p9k3J06J70k62J15Q8j8n7p4J28j39oL1K27j29
3690E6q1O6n9j52K56N2j96q1K50j07j59K89o2j01j6M6j2L6k9o0O6M0n2J1N7o6
3716hO2j95J84l3j54J77n3Q4j03J3Q6K3j20%J19j21Rk8lM7q1M0J17k8pq7O6lj44
3745a41K42k0q0J05r2K3k8O4m5M0r7rJ01o4k5Q1P5j04j20K00k61N6J28q8J11l0
3771B2P4j07l8J00J2o2m1N0k4l4QoJ3P9k1L4n8m9J45r0%j0K2n4o0O8j39J99J05
$$ plain form
3582 45 57 -97 -17 56 -9 -24 116 44 61 -10 -95 21 8 32 8 -34 -31 -69 80 5 72 -18 -35 29 41 112 -49 -11
3610 -11 99 6 -60 -24 -31 48 26 19 -156 33 -16 84 94 57 99 -65 7 2 83 -73 17 35 -21 21 -40 92 -46 -85
3638 -85 -64 39 -34 66 -68 -53 40 166 128 -22 70 -77 54 -13 64 17 32 103 2 -5 92 -60 -26 64 26 -128
3664 -128 142 84 -73 48 86 90 23 -58 -9 -22 -101 -124 -18 152 -110 5 93 75 18 -56 72 -67 -73 -42 185 56
3690 56 -25 41 -18 -170 86 138 -58 -139 111 4 -155 134 72 -29 -45 1 -11 25 -4 -64 2 42 -10 1 58 -8
3716 -8 54 -141 43 10 -144 33 -20 64 -39 -26 60 83 -37 -37 82 -39 -30 -58 -61 -14 -95 -55 62 34 27 -60 6 3 -141
3745 -141 101 81 1 106 14 37 9 73 28 68 -29 -38 63 -1 -26 55 130 26 -94 106 -155 -99 29 -59 52 22
3771 22 96 -11 -49 51 63 1 -40 10 -14 -48 -40 -46 -33 46 25 59 1 -48 97 7 7 -3 19 -35 -95 -27 -166 33 138
3800A38j80J81k44J19L7L8j07k0o1P8l0M6o3ll3J05j8LKJ9J16Oj79J11p8k2J0
3827b9K6L1Lj26N1M1j6j09K6J28K1K8jl7j36J79r5O6J1l8PM4Oq1j24J56L4m2k8
3856dn6J32j03R8j41Q4j18J70j5op2J9Lq2J8P0N7j7n4M1r6k2J15O7o0K4j11M9
3884a0k9j0J7N3po1M8r9R0Q2K5j84J06M4p8L5k5R9M5j27j08J20q3J02j13M2j8
3911d4P1j7m0P8k1j03J03n7q8K06j33R7r6j25J01N9O8j5O7J1k49R8R5o9l9M3j13
3938a12J42o5l6N1m9J24l9j05K09r1o3K9LpOP9r0Q7q1J54n2r2L2q2j5j01J19K3
3966b2J51r3j49R7K7k0J9J03j16L3L6n0l7K21r0j67l5J63m5j2j16N3O5O7j59P6
3992@j1K2j0n9L8j21J20J12r1O5k24J45jrJ49j74rPN4p4L3n2M9m2N0j7L6q1J32
$$ plain form
3800 138 -42 139 -105 14 51 89 -18 -38 -99 -21 -51 -5 -68 -71 -104 1 -17 -14 -12 7 123 129 -50 61 -17 -39 -29
3827 -29 -3 28 31 -95 -44 -3 -19 -128 -102 26 47 75 74 37 -99 80 -15 51 62 24 31 75 81 0 -124 32 66 24 -4
3856 -4 -60 72 -31 67 -74 10 -108 62 47 41 -31 -12 -9 -91 -73 -3 54 37 -17 24 -72 -94 21 88 28 52 -59 -10
3884 -10 -39 -49 -32 21 14 -47 1 -98 -8 74 99 -85 21 65 -13 22 -3 96 141 14 -94 26 -57 45 -68 -26 -44
3911 -44 27 10 -30 48 27 -76 27 -30 -118 88 -45 52 -44 -169 -68 -9 59 44 111 122 -127 -29 66 -3 -42 1 -112
3938 -112 30 -35 -71 -20 -69 55 16 -89 120 29 -34 -5 -2 -9 -3 76 -14 73 -8 146 94 2 34 -48 -63 -164 -45 -22
3966 -22 129 36 -113 -16 11 -9 10 113 -3 30 66 16 -21 200 110 -57 -92 71 26 14 -102 -49 16 83 -76 0
3992 0 -11 11 1 -58 -20 -141 -21 91 0 65 -159 -14 -15 -24 125 -49 -58 -51 3 -71 -38 -90 -41 -83 -33 -50 -14 -95 37
4021C7k4j2o1J10n3K9r9R4l8p8M6J31j40MJ04rNj00J33j74J61r8J03n0m4n6Q3
4048DJ21j89O4%m4J16j08N3Pj50M5P3L2J53k13P0j46J84j8J32j94N8j25J0J1L9
4074a5R7m8l3o7J25n6L2n0Rm6N1j0N3j4o6O2P8q1m9J59j13qN4j22j15K03j33L2
4102g1n2J31o2lJ6j8Q4J5K1m1j31R9j2L9m4R4j10N7m7J07Oo8J37j95l5O0Q9q9
4130b3n2l5J02r7Q3O1K2j36J14k12J23k2J27o5K2K0j59P8J18J24r1j10k1J3R5
4155G9p6J64l21J16K1pO8p1Q0J4n6k05J68J00pj10K8kp3J06J8j53J38K7K0j22
4181e6J90j57K0k5O7L0R0l25J66n1O8j21K4J11j53N6M6n8J25P0j08j3R6j16nJ3
4207a6l3Q1o3j56J76j1n7K13q3k4j22K54j78o3N6L3j4Q5o4l0J03k64K40j87K8
$$ plain form
4021 37 13 1 -60 50 -3 26 -73 21 -17 -95 -49 82 -58 -54 50 41 46 -54 79 -95 66 -32 71 21 -23 -79 4
4048 4 125 -64 0 0 -44 72 -36 17 24 -126 -81 -8 24 177 -36 34 -112 72 54 186 -8 50 -75 -65 -54 -15
4074 -15 82 34 1 -66 59 3 35 -15 -6 -52 -1 -11 42 28 -38 24 102 21 -28 131 18 10 64 -58 -173 30 -103 -71
4102 -71 -123 8 -54 -57 -41 -59 25 40 61 20 -111 -12 -24 15 -29 65 -45 12 -35 72 78 10 147 -48 -83 -23 66 -23
4130 -23 -75 -110 -8 -105 -22 39 61 -75 39 -173 -50 -72 55 -10 12 32 -127 -49 69 193 102 -8 -29 -16 79
4155 79 3 167 -154 -38 -17 -24 44 -27 53 67 11 -194 -26 74 67 -43 -15 -17 -90 16 34 -119 19 46 66 -56
4181 -56 134 -23 -3 -28 39 69 159 -166 0 -51 17 -104 -80 31 -122 -66 -20 -78 47 117 9 -4 92 -24 -29 -16
4207 -16 -49 32 -31 -187 -11 -22 -79 134 51 27 -95 159 -19 -82 -26 7 -7 78 14 -16 87 -177 63 -124 -96
4232i6J87j18J59n3r9P4jk4o8M3K8Q1j21j7k0j2J04o8p7M9Q4q1N0j51J07J35p7
4259A8p9Q4p1M5q4J34qO4j56PJ23n4M5j57N8J7O9O6k20J9J00J28j72k2Q9n3o3
4286g3L9N9j54J36J20j11r2J60j43K7J04k39J61Pj3L4M0j5p9J22o9J22k09Q4q9
4311g1L4Q9j68J47m3q7Q2L2L0j12J04n4l3J56k4n6k2m4Q3p7N0J04j18k1J4q8k8
4338a21J23n0NP9j03J12j14n9J5K7J14P0nj25K3k2k1%P8j2k6lm6J28o0j09J24
4365B2J04p5l2K7n4P5K6k02K24p0Q3k45J8O5J59p8o2ql8P2K5m5P3m6O3R9l10J18
4393a2K1L4n6J45l5q0j6P8r6L3N8o8kk3Q7m5m2L8Kj00J03J8o7j4j2kJ50j2q6K5
4423B4p0jN9M2k7L0k3l3J22q9j29J0K9J74j48L8o7M5P5J5p0j17J74j40J18j41
$$ plain form
4232 -96 91 -27 132 79 -20 54 53 29 -39 4 32 113 -8 -25 -45 -57 47 -21 -98 -49 35 -46 4 -147 -40 95 18
4259 18 -61 23 -48 -3 -87 47 39 103 -53 -46 77 23 68 -89 -31 -14 55 121 -99 -80 20 148 -24 -46 43 -10 -73
4286 -73 -34 25 -129 7 127 16 -76 84 -59 -32 72 -167 -6 1 -12 22 62 47 -32 90 21 143 -66 18 -71
4311 -71 -37 52 -116 31 -12 -99 -17 15 45 -67 37 -17 -50 106 82 26 4 -40 43 -34 16 120 2 -19 -5 -93 -121
4338 -121 2 -48 -43 36 -67 45 -69 -128 -113 -86 28 98 93 -32 -9 -31 -52 -52 26 14 -12 -15 -61 67 7 -102 22
4365 22 126 51 19 46 -8 67 93 -109 115 45 128 -117 -99 -34 125 47 -15 -23 -61 11 36 -9 64 18 81 180 -130 -12
4393 -12 9 43 -13 132 97 17 1 79 -17 16 74 6 4 -19 68 23 -19 19 21 -79 24 42 -25 -39 -51 -53 97 85 -1 24
4423 24 -46 -47 12 54 27 57 34 1 123 34 -95 -85 -56 118 -30 8 -59 -14 61 76 6 -111 63 -77 41 -100
4449a00L7J66o0o5l8J20j15k0J82j24q0J82o5O9m3j29N6J02j12J50j57L6M3p1
4473c6j5J36k53Q1M7N5j05J68j60J65j05j64K40p4P5l9L0p0JlOj0M8p4J03M4j55
4500f4R1O2k1p7%R5j01J09k39J57pj5M2J01j28j4j48K65j23l1Q1p7O3p8l4J19
4526B8j06J51j13o5K9L2L5L1J00q0j00j6O5k6Q4p1J07j34K1K1j5K0o6K10j13j05
4552g6K33j31J78j21k34O8N6M3Qr4J80n1K3j61J92q6j0m9mJ35k13K09r9J72j89
4577b1J28j18L8k5j04Q7K8K2R8k45L9J25j01L4K9m9n0M9Q4Nr8J10n0P1Jj23J46
4604A10k1m3m1j6m3M6JL7J23o8ro9k8J53j49P5M6j02J4k8OL5k7r0RJ17j38O5K2
4633a3j16J87j13L3J76q7n0l5K1L2p4J5j5j10K40Rk06J36n4o3QJ56rp7J03j08
$$ plain form
4449 -100 -63 103 43 -22 -60 60 -55 -75 107 -17 -97 85 20 89 46 -83 -27 75 -37 113 -44 -8 35 -36
4473 -36 -51 85 -168 -87 -40 15 -90 78 -82 83 -22 -186 54 -20 55 16 46 -24 -23 -26 -20 -30 18 -56 47 91 -64
4500 -64 27 89 68 -9 -9 86 -15 94 -145 12 5 -10 32 133 5 -9 -157 108 -15 -46 35 -42 21 -57 -91 28
4526 28 -78 73 -40 -105 -76 -44 -9 22 122 42 -58 -74 -9 -35 49 -22 85 -49 -28 -7 -22 -2 -68 142 29 -76
4552 -76 157 26 204 83 -151 -83 -27 16 24 -70 110 59 82 -79 113 27 17 -32 -36 99 -114 95 -4 168 -21
4577 -21 107 -11 27 2 -102 -15 13 35 133 -112 -73 52 -49 -15 14 -35 -85 -36 48 53 -45 65 15 86 87 -36 110
4604 110 89 46 5 -11 -54 -8 -7 30 153 85 76 7 -21 132 -17 58 104 2 16 -12 -6 29 2 -88 -79 38 -100 -35 -13
4633 -13 -129 58 -55 -22 154 67 17 -18 3 35 -39 -24 -39 -149 91 100 -106 30 -24 -87 -79 77 68 -9 94 -14
4659a4j15K38m1j39P1MK6j71J42P3o2m8l8J85j89m5J29j08J01L9J4O4j2n9L7q2
4685@L2m6L0m0K6j76K24l2L6nn7m1J52o9K3j32J8Mj34J44R0K9l6o1j3P3r7J65
4713A07j42l1K02j49O4o6L4Q1qk05P1j2p4Q4J7L2J00m8n6M2k4l6M0K7q0p5N3n8
4741a10M9M7N8K8j31J02p4J8r1K07j00j94J88K5LPm2j06K77j94J0J62j03k5N5
4766F6j26J03l7j9k9J11p6n8Q6Nk5j34J56k3kj52lJ07J73j03j9L4k5j04J9N9R8
4793H2j00J46n1j07o9J11M5J8r4p1J61Jj60p4J83L7j45Q4o1L7J73j35k6Qk5J17
4819H5j24KL4j5O2o9J4O2r9N7j5M0K7q1PJ76k10j0L2J5M7j00J52j14N8oR2j18
4847An4M0J6l7k5J5J13n7k3K0J7Nj8l0R1o7l8P6p6N3j3j57N4J59O5p4J27k07M2
$$ plain form
4659 -14 -129 109 68 -71 0 4 30 -141 1 74 12 -36 -74 111 -78 -123 6 -102 -1 38 52 116 104 45 82 0
4685 0 32 -14 16 -24 2 -174 50 18 54 49 -8 -49 103 34 57 -75 -57 -53 -187 -43 47 76 40 -21 -34 39 -58 107
4713 107 -35 -66 136 -13 51 -15 19 100 92 -113 -42 -54 -128 -44 -27 5 105 57 1 43 19 -17 23 50 -30 -105 -52 -110
4741 -110 -61 -14 44 72 -59 43 -31 -13 -104 103 3 -191 -3 22 25 32 -10 -116 161 -33 -23 139 36 11 66
4766 66 -60 43 6 -13 -42 69 -7 -65 21 26 1 -133 23 0 -2 -154 -157 -50 123 20 1 35 10 -94 -75 -16 82
4793 82 -18 128 77 -30 -99 12 57 75 -19 -90 71 72 -88 -162 21 58 -87 -3 -64 -27 146 11 -15 -7 -32 85
4819 85 -39 -37 -3 -18 44 -25 -11 51 -48 9 -6 34 61 -20 -13 163 -47 -57 -25 -10 37 -63 89 -25 33 27 119 1
4847 1 -53 -13 3 -34 -59 -44 69 12 -11 9 26 31 13 -17 74 7 -31 45 -31 22 9 -148 -94 65 130 56 183 -24 18
4876A8R1k46P9O2N4o4ql5N3K2K6K9r8L1M0N4m9j58Q8j0N2j09R7K4j86N4J30l2
4904Ij8K8L4N9p8m6J1Q5j82JJ14j6P3p5m2O3p6J25o0J43k89J30n0ON5L9j03N8
4932bj3K1O0k9P4J2o5q4O2j03rJ13q2K3P3o3oJ33j84JM5k8N9o4M0P8p4r0J42m1
4962ar5lO1l6Q0mk9O2K5j55j9L2q0J53M6p2k4mJ37j5J3O9j32K4m1n8P0Rj44M2
4992h9JO4K05p2j31M0lmJ32j64j00J18j14J33%Ln4RJ7K6j12J32j14Q1RJ44k31
5019g4q3J15N8j00J37p7N2q7N5q2M5m0K9j3j3J20j07J48j5n0jJ6l2m8J9N4o9o7
5047a10Q4r6J7J82m1K6l5J1j6K0l9Q6j40J49n3k9R9j15K00j62j34J93j46k2M9
5072b2p7J17o1Q4oN2J0j54J41j12K4R3m7m0L3j28P6R5r4J03k49K63j19J65j04
$$ plain form
4876 18 109 -137 -58 4 58 -6 -14 -49 4 26 52 81 -17 14 54 108 59 -99 -11 -21 31 -78 19 43 -143 -89 41 9
4904 9 -9 19 53 112 34 -12 -1 84 -98 -97 17 1 74 -1 -43 20 -56 69 9 152 -137 -7 -57 -51 4 43 -60 -2
4932 -2 -15 6 66 37 111 123 58 -26 36 -67 -76 37 -45 -22 51 -12 -18 115 -69 -68 -23 -51 8 -56 -16 62 -12 -102 40 -1
4962 -1 -96 -99 -38 -74 6 2 -27 35 60 -95 -114 -82 -162 -9 37 -35 -59 -63 74 59 72 141 9 33 -8 -66 4 13 -131 -89
4992 -89 -88 -24 181 109 -22 18 15 11 143 -21 -121 -3 -117 16 16 19 -35 -26 -9 17 -95 37 -77 4 13 157 -74
5019 -74 -157 -42 16 -84 53 -24 28 -59 -4 -86 -41 -81 -52 -65 -78 42 -65 83 68 18 17 33 1 -47 -28 26 -43 -110
5047 -110 -26 -122 -105 77 36 62 27 38 22 42 3 89 -51 98 45 16 115 0 200 38 -96 97 -49 -71 -22
5072 -22 -99 18 -43 41 35 87 97 -57 84 -28 -4 89 42 2 35 -93 -17 78 -16 87 -162 101 -18 147 43
5097D3jj7N7j35N5pl1r8J02J74j30rKoLm1N1l0l4K1k1J35K5Oq2ok2n2N6J0rl7
5129b8P0L7o3P7j09r4Q3L0l3n7K02j21L6k24J92K0n5RQ7OJ8k4J0m1o3N3Rm0P2
5158E9J6%mr9R4j97N2J32j20l0lQ1K6L8J9m1M4j17N3j02J52%k3J16p9o5M5o4N3
5187C6m8Rm1Kj1M3P3o9K3J0j10J45l1j00K04Oj07k2Qm3M7m6K0o0N1N1j5q1N0K4
5217A8P5J9j14ql7J66j53J57j05O5p2qkj4nL8q1J42p4qK0oK9j06J6r4J18O9l0
5246A5Q0q3rQ1j29K6NJ5J09j15p3O7M2k1Lj62J87Q5Nj36J45j95k6J43o6J17j30
5273b0J96j83m2J23q1j04J37p8%J48j22M8R2j60L5n1K7NLlR7q8rJ30r3m3qJ43
5301I9p1p5P3j38J25M7j42K9J30r8J7Q8o1j6n5J9j4QR8j60M5J03j06J9J62j89
$$ plain form
5097 43 42 25 82 -53 2 -5 -36 -134 -32 142 12 3 5 -1 2 -39 12 -18 -52 -31 -52 83 108 114 32 26 4 -48 8 18 9 -28
5129 -28 42 79 16 93 -16 -110 -27 3 -30 -87 115 -6 30 -194 -2 18 -37 -28 59 65 83 59 69 28 -35 18 27 -13 59
5158 59 75 75 71 -28 66 -131 -79 53 -67 -97 -100 -19 7 45 64 23 67 -50 3 -99 53 53 30 146 67 2 47 -17 36
5187 36 -12 -3 -44 -42 -53 -10 63 -6 17 27 -83 62 31 -69 135 141 34 12 20 -23 24 -22 -2 -62 -11 40 25 -56 -6 18
5217 18 93 112 -2 -10 -47 119 -34 123 18 83 11 3 1 -13 -18 20 -61 81 7 -1 19 13 42 -64 -48 -142 -24 45 15
5246 15 95 12 3 84 -45 -19 -14 1 110 -5 -78 -11 31 10 13 -149 38 123 128 -8 137 -58 -84 59 -7 110 -20
5273 -20 176 -7 -49 74 -7 -111 26 -52 -52 96 -26 22 114 -46 -11 -62 -35 -30 -27 -30 67 -21 -30 100 7 -36 -44 99
5301 99 28 -47 26 -112 13 60 -82 -53 77 -21 -4 84 23 7 -48 -29 -43 -35 63 -97 -52 51 -55 -36 126 -63
5327f3k8J05N0p4J41j71J6l1O7k8mK5P2n8mP7j6p8k2N7N8j37PJ35j12rR7j7j25
5356g0OP0p4O7j08K7p2P9R6o5K1K9l0M8%L6j30M3LR3k3N3j11nN9j21J4J18j40
5385h7J51k64K22p0R4l8O9j13J8K5J8M6M9j20l0J59j41N9j23J10j4Q9j48M8L3
5410D2l3k6k5J0L5l0L9N5N5r7n6P1n5M8K3n7m1P4m0mP2j03M0k9J26q2n4R5k4j23
5440i4j6J02jK9j09J40j2k6L3q3J98j91L7j5qJ9r4PK34j40mM3OJ17j06K02l50
5467h2nJ31j07n9J19o0k2J40r8l8k7R0j15K03j32O6P8o4k2J1j5QM2r6R9p8j6R5
5495D6pm6N0k63J19J11J1k5o1J48j52K28j50J2j24J08j8r5J09PkR8j01K1K9j2
5521D1K6j28J10r5P8m7J59k12J67j34R6o4p3J30p2M8K9j29m0J18m4L8N5O1J9j40
$$ plain form
5327 -63 -91 14 64 -10 131 -40 -24 -55 12 -16 -20 5 77 19 15 92 76 -2 -24 33 91 -46 -39 96 -16 -25 72 55 -70
5356 -70 -64 6 -68 -1 -109 -82 -154 -75 21 -44 -23 6 -24 24 24 60 -70 -27 -24 69 46 99 -12 -17 42 -79 -65 53 -87
5385 -87 64 -200 22 -48 46 8 77 -36 -18 7 25 71 120 0 -30 129 -12 47 -76 34 20 109 -39 9 42
5410 42 9 -17 -42 -32 3 -27 12 67 122 25 -31 40 -15 33 56 -1 -42 32 -8 -12 60 -43 -3 -32 94 12 -42 53 29 -94
5440 -94 -110 -8 -9 20 -89 51 39 13 46 -37 161 -30 7 -8 -16 3 -91 -84 150 10 6 49 55 172 66 268 -82
5467 -82 -87 44 -63 -122 -3 -63 -85 55 -43 -81 -108 -18 -133 70 -62 4 82 18 -4 7 -8 0 42 -54 45 -33 -49 46
5495 46 39 -7 43 -220 -101 10 21 -4 -65 83 -69 159 9 21 -103 5 -13 -108 1 8 6 104 3 24 53 41
5521 41 67 -61 49 -46 32 -15 144 -68 99 -35 61 -3 -76 54 -18 30 59 -70 -110 8 -36 2 57 118 137 -3
5547cM4k5L1J01j49J01j60M1JK8n2J42r9m4j2P9K7p1J41q6j63P1O4k2J25j13M9
5574D6q1M0l0n3P7L1J8N9j8j24N5m0K3J05q0J11j17J02l6j3j62J68j14K4pN5J43
5601A82j88m0o3K09M1j74m2Q1l6LO4j23J15M8j72P1p7J68j19M9j04K16o0o9n7
5626g7N8N9%k09J55Okj0Pl3P2p9K84k40P2%R0k15R5M3k1Pm7l5N3p2o3J75q9n0
5656f6j7J18j62J07M9j2N4p1m6M6O4l4J3K0r9O6j1P0j22Q6o7J17r1L6k9l1Q4N
5684G7k0l3j02M5OO2M8j59M9mpM6m9P0M9L2k87K43k2jN0k6q0J54r4ll3m6N5M5
5714F5l8RJ6K6n8%pPl8j15J58j06M6P2k1j9p7R0n4N3l4J31j5n4j57K18k0j42J7
5743d7N6pJ0j79K04r8M9q2L0M0j5O5P9j04o0J80r0j5J10k04J38n3L6j22P1q2J10
$$ plain form
5547 -3 41 16 47 148 -1 100 -60 -19 -18 10 -42 100 1 -43 -55 24 51 -20 121 35 -128 -57 7 -15 110 -3 46
5574 46 -35 5 -25 -78 -1 30 48 107 89 -35 20 -20 3 108 28 139 22 124 88 75 -87 81 -33 -9 -16 39 182
5601 182 -6 -46 -109 100 141 -33 -75 6 -30 -27 37 -86 29 77 -95 -24 -101 67 -52 -3 -107 109 49 -20 -77
5626 -77 -19 40 40 -169 -14 -8 -10 -20 -13 -46 26 -53 231 -9 63 63 153 -62 33 76 55 62 15 -20 33 -39 -102 73 -16 -66
5656 -66 -83 35 -127 -20 29 17 71 0 -46 0 64 30 43 63 -36 30 19 89 -33 53 -14 103 12 48 19 -12 72 77
5684 77 57 24 -78 -33 -27 35 83 -76 -27 -31 -38 8 -41 29 78 110 -177 66 44 43 93 67 -13 141 47 44 11 -35 20 65
5714 65 27 36 52 78 20 20 13 20 -18 -133 25 -81 -35 37 16 -3 -80 10 -44 9 -25 106 91 37 -120 98 78 -64 -47
5743 -47 9 2 12 -167 37 -61 -12 -94 -64 -24 -39 26 105 1 -59 121 31 16 126 -78 60 7 43 -79 -8 -90 20
5770B0L3N1q0p3J28l5J3L3l6j48N8K2R9q6j4J39r8m8n0k5J10m5l4L1J2J01l6p7
5798c5Q7Rpl8l0M6m4J15n1N5j03O9mn1N2Q9k45J28j7J0o9n0K08j19N7m9J10j59
5826c6J42j3o2j47J70Ok0J11k23J31j01n7K43k16J09l6q3R2r2O4l1N3O4l9r6R6
5852B9n2J5m1P1k4Pm6M4l6mjn1L1k4J13O5j23rQ8J8p5N2M6r7L2r0J30N8o2K4j12
5883b4J33j17J59j98J9j07N8P3m6O6j46O3K04j34k2j00J17J6k3Q7l1q2k4J10p1
5908b0J29m2r3j4Kk2O1r5J48o4N2k2k3J58r0L2j56R0o4J29q3m4K4PM3l4O2L6j64
5937e7R1n5J4LN5P6k03J6N2N4j54J25j03P8J55r1j3k4j1O1p8L2p7kJ02K5j41J51
5965H1q6n1J48p8L1K5j26m2R4mk2R6p0n2Nk5J62k7kn7ll8j00J16L5k1Q6k2m1m5
$$ plain form
5770 20 53 104 24 -49 79 44 57 90 54 -94 -36 -14 85 -1 -15 124 26 -22 -72 -97 13 -32 -66 -35 -23 78 42 -35
5798 -35 52 61 54 16 -14 32 -12 103 52 107 4 73 69 18 70 159 -86 42 25 35 -34 -84 124 5 62 13 123 -36
5826 -36 106 93 31 -116 54 60 40 151 -72 59 -42 -99 144 -72 37 1 -82 10 -82 -18 -49 4 68 29 -67 29
5852 29 -23 -8 -49 22 -2 5 -41 3 -33 -37 -38 -89 -58 -82 31 96 -27 -36 52 70 -5 47 93 -4 28 -62 68 126 64 88 -24
5883 -24 109 -8 151 -47 -28 -135 -77 -4 -50 16 -130 -67 137 3 -19 -119 -2 14 -9 78 47 -35 -59 51 -20
5908 -20 109 67 -26 -40 -38 -60 1 -94 54 -10 42 20 -3 155 65 97 -59 31 -33 96 13 -31 -7 0 43 9 71 107 -57
5937 -57 34 -21 -7 -4 51 127 -76 -60 -8 46 -108 17 -86 -8 147 56 43 19 8 69 -9 23 -54 -56 46 71 -70 81
5965 81 -5 -56 92 14 45 70 -56 -98 -4 -8 -30 66 -4 -56 -51 -76 86 59 57 0 -3 -41 -141 -25 10 -11 75 53 12 -33
5995c3O2K8l8p6P5o1m7J87p0rj23K5n7K23j0j04R5q5p8K37j4o4n9j3r1J22J1q1
6023d8L6L4j61J27l4n2J79r1j92K34J5o4rN8r1O0J5Kpj01J15r8j0J4j6P6r0L2
$$ plain form
5995 -33 29 57 19 -57 18 -43 -90 97 27 18 -105 -80 -137 86 76 -28 67 -18 -96 141 127 63 4 -9 -100 22 33 -48
6023 -48 -12 22 -139 -12 -46 -98 81 -10 -202 32 47 -17 -26 32 -59 1 16 18 11 -90 25 -73 -83 -69 -85 -9 -99 -67
$$ [...]
8191d9
##END NTUPLES=NMR FID
##END=
