##TITLE=1H_SA_61.237
 CDCl3, 8 sc, 
 21.12.2020
##JCAMPDX= 6.0         $$ Bruker NMR JCAMP-DX V2.0
##DATA TYPE= NMR FID
##DATA CLASS= NTUPLES
##ORIGIN= UXNMR, Bruker Analytische Messtechnik GmbH
##OWNER= root
$$ XWIN-NMR		Version 3.5
$$ Mon Dec 21 13:21:41 2020 Russian Standard Time (UT+4h)  she@DPX200
##.OBSERVE FREQUENCY= 200.1315066352
##.OBSERVE NUCLEUS= ^1H
##.DELAY= (6, 6)
##.ACQUISITION MODE= SIMULTANEOUS
##.ACQUISITION SCHEME= undefined
##.AVERAGES= 8
##.DIGITISER RES= 18
##SPECTROMETER/DATA SYSTEM= spect
##.PULSE SEQUENCE= zg30
##.SOLVENT NAME= CDCl3
##.SHIFT REFERENCE= (INTERNAL, CDCl3, 0, 15.7039)
##AUDIT TRAIL= $$ (NUMBER, WHEN, WHO, WHERE, WHAT)
$$ ##TITLE= Audit trail, XWIN-NMR		Version 3.5
$$ ##JCAMPDX= 5.01
$$ ##ORIGIN= Bruker BioSpin GmbH
$$ ##OWNER= she
$$ F:/spectra/data/she/nmr/H-F/1/audita.txt
$$ ##AUDIT TRAIL=  $$ (NUMBER, WHEN, WHO, WHERE, WHAT)
(   1,<2020-12-21 13:19:51.32 +0400>,<she>,<DPX200>,
      <created by zg, POWCHK disabled, PULCHK disabled
       configuration hash MD5:
       00 E9 B6 7A A2 85 ED C7 34 08 36 98 17 FE 4E 26
       data hash MD5: 16K
       9D 40 69 68 28 2A C7 CB F2 4A 4D 29 35 F2 62 CB>)
$$ ##END=
$$ 
$$ hash MD5
$$ 8D C5 A5 A6 0C AC A9 FD 20 DE C3 37 4C 37 FC 23
##$RELAX= 
##$RELAX= 
##$RELAX= 
##$RELAX= 
##$RELAX= 
##$RELAX= 
$$ Bruker specific parameters
$$ --------------------------
##$DU= <F:/spectra>
##$EXPNO= 1
##$NAME= <H-F>
##$PROCNO= 1
##$TYPE= <nmr>
##$USER= <she>
##$AMP= (0..31)
100 100 100 100 100 100 100 100 100 100 100 100 100 100 100 100 100 100 
100 100 100 100 100 100 100 100 100 100 100 100 100 100 
##$AQSEQ= 0
##$AQ_mod= 1
##$AUNM= <au_zg>
##$AUTOPOS= <>
##$BF1= 200.13
##$BF2= 200.13
##$BF3= 200.13
##$BF4= 200.13
##$BF5= 200.13
##$BF6= 200.13
##$BF7= 200.13
##$BF8= 200.13
##$BYTORDA= 1
##$CFDGTYP= 0
##$CFRGTYP= 5
##$CHEMSTR= <none>
##$CNST= (0..31)
1 1 145 1 1 1 1 1 1 1 1 1 1 1 1 1 1 1 1 1 1 1 1 1 1 1 1 1 1 1 1 1 
##$CPDPRG= <>
##$CPDPRG1= <>
##$CPDPRG2= <>
##$CPDPRG3= <>
##$CPDPRG4= <mlev>
##$CPDPRG5= <mlev>
##$CPDPRG6= <mlev>
##$CPDPRG7= <mlev>
##$CPDPRG8= <mlev>
##$CPDPRGB= <>
##$CPDPRGT= <>
##$D= (0..31)
0 1.2 0 0 0 0 0 0 0 0.06 0 0.03 0 0 0 0 0.0002 0 0 0 0 0 0 0 0 0 0 0 0 
0 0 0 
##$DATE= 1608542390
##$DBL= (0..7)
120 120 120 120 120 120 120 120 
##$DBP= (0..7)
150 150 150 150 150 150 150 150 
##$DBP07= 0
##$DBPNAM0= <>
##$DBPNAM1= <>
##$DBPNAM2= <>
##$DBPNAM3= <>
##$DBPNAM4= <>
##$DBPNAM5= <>
##$DBPNAM6= <>
##$DBPNAM7= <>
##$DBPOAL= (0..7)
0.5 0.5 0.5 0.5 0.5 0.5 0.5 0.5 
##$DBPOFFS= (0..7)
0 0 0 0 0 0 0 0 
##$DE= 6
##$DECBNUC= <off>
##$DECIM= 32
##$DECNUC= <off>
##$DECSTAT= 4
##$DIGMOD= 1
##$DIGTYP= 9
##$DL= (0..7)
0 120 120 120 120 120 120 120 
##$DP= (0..7)
150 150 150 150 150 150 150 150 
##$DP07= 0
##$DPNAME0= <>
##$DPNAME1= <>
##$DPNAME2= <>
##$DPNAME3= <>
##$DPNAME4= <>
##$DPNAME5= <>
##$DPNAME6= <>
##$DPNAME7= <>
##$DPOAL= (0..7)
0.5 0.5 0.5 0.5 0.5 0.5 0.5 0.5 
##$DPOFFS= (0..7)
0 0 0 0 0 0 0 0 
##$DQDMODE= 0
##$DR= 18
##$DS= 0
##$DSLIST= <SSSSSSSSSSSSSSS>
$$ [...]
##$SUBNAM2= <"">
##$SUBNAM3= <"">
##$SUBNAM4= <"">
##$SUBNAM5= <"">
##$SUBNAM6= <"">
##$SUBNAM7= <"">
##$SUBNAM8= <"">
##$SUBNAM9= <"">
##$SW= 16.9725356469052
##$SWIBOX= (0..15)
0 0 2 0 0 0 0 0 0 0 0 0 0 0 0 0 
##$SW_h= 3396.73913043478
##$TD= 16384
##$TD0= 1
##$TE= 0
##$TE2= 300
##$TE3= 300
##$TEG= 300
##$TL= (0..7)
0 120 120 120 120 120 120 120 
##$TP= (0..7)
150 150 150 150 150 150 150 150 
##$TP07= 0
##$TPNAME0= <>
##$TPNAME1= <>
##$TPNAME2= <>
##$TPNAME3= <>
##$TPNAME4= <>
##$TPNAME5= <>
##$TPNAME6= <>
##$TPNAME7= <>
##$TPOAL= (0..7)
0.5 0.5 0.5 0.5 0.5 0.5 0.5 0.5 
##$TPOFFS= (0..7)
0 0 0 0 0 0 0 0 
##$TUNHIN= 0
##$TUNHOUT= 0
##$TUNXOUT= 0
##$USERA1= <user>
##$USERA2= <user>
##$USERA3= <user>
##$USERA4= <user>
##$USERA5= <user>
##$V9= 5
##$VALIST= <valist>
##$VCLIST= <CCCCCCCCCCCCCCC>
##$VD= 0
##$VDLIST= <DDDDDDDDDDDDDDD>
##$VPLIST= <PPPPPPPPPPPPPPP>
##$VTLIST= <TTTTTTTTTTTTTTT>
##$WBST= 1024
##$WBSW= 4
##$XGAIN= (0..3)
0 0 0 0 
##$XL= 0
##$YL= 0
##$YMAX_a= 531814
##$YMIN_a= -257254
##$ZGOPTNS= <>
##$ZL1= 120
##$ZL2= 120
##$ZL3= 120
##$ZL4= 120
##$ABSF1= 10
##$ABSF2= 0
##$ABSG= 5
##$ABSL= 3
##$ALPHA= 0
##$AQORDER= 0
##$ASSFAC= 0
##$ASSFACI= 0
##$ASSFACX= 0
##$ASSWID= 0
##$AUNMP= <proc_1d>
##$AZFE= 0.1
##$AZFW= 0.1
##$BCFW= 1
##$BC_mod= 2
##$BYTORDP= 1
##$COROFFS= 0
##$CY= 11.3945322036743
##$DATMOD= 1
##$DC= 2
##$DFILT= <>
##$DTYPP= 0
##$F1P= 15.9154993809931
##$F2P= -4.1035820241983
##$FCOR= 0.5
##$FTSIZE= 0
##$FT_mod= 4
##$GAMMA= 1
##$GB= 0.15
##$INTBC= 1
##$INTSCL= 1
##$ISEN= 128
##$LB= 0.24
##$LEV0= 0
##$LPBIN= 0
##$MAXI= 10000
##$MC2= 0
##$MEAN= 0
##$ME_mod= 0
##$MI= 1.114404
##$NCOEF= 0
##$NC_proc= 0
##$NLEV= 6
##$NOISF1= 3.799351
##$NOISF2= 2.8
##$NSP= 1
##$NTH_PI= 0
##$NZP= 0
##$OFFSET= 15.70392
##$PC= 1
##$PHC0= -10762.4
##$PHC1= 13.20095
##$PH_mod= 1
##$PKNL= yes
##$PPARMOD= 0
##$PSCAL= 0
##$PSIGN= 0
##$REVERSE= no
##$SF= 200.130013532006
##$SI= 16384
##$SIGF1= 3
##$SIGF2= 2
##$SINO= 400
##$SIOLD= 16384
##$SREGLST= <1H.CDCl3>
##$SSB= 0
##$STSI= 0
##$STSR= 0
##$SW_p= 3612.71676300578
##$SYMM= 0
##$S_DEV= 0
##$TDeff= 0
##$TDoff= 0
##$TI= <>
##$TILT= no
##$TM1= 0
##$TM2= 0
##$TOPLEV= 0
##$USERP1= <user>
##$USERP2= <user>
##$USERP3= <user>
##$USERP4= <user>
##$USERP5= <user>
##$WDW= 1
##$XDIM= 8192
##$YMAX_p= 0
##$YMIN_p= 0
$$ End of Bruker specific parameters
$$ ---------------------------------
##NTUPLES= NMR FID
##VAR_NAME=  TIME,          FID/REAL,        FID/IMAG
##SYMBOL=    X,             R,               I
##VAR_TYPE=  INDEPENDENT,   DEPENDENT,       DEPENDENT
##VAR_FORM=  AFFN,          ASDF,            ASDF
##VAR_DIM=   8192,          8192,            8192
##UNITS=     SECONDS,       ARBITRARY UNITS, ARBITRARY UNITS
##FACTOR=    0.0002944,     1,               1
##FIRST=     0,             0,               0
##LAST=      2.4114304,     0,               0
##MIN=       0,             -257254,         0
##MAX=       2.4114304,     531814,          0
$$ Real data points
##PAGE= N=1
##DATA TABLE= (X++(R..R)), XYDATA
0 0 0 0 0 0 0 0 0 0 0 0 -8 8 -8 8 -16 16 -24 24 -32 40 -48 56 -71 80 -96 112 -128 150 -170 195 -224 255
32 255 -287 327 -369 415 -465 522 -581 649 -721 802 -888 983 -1086 1201 -1323 1461 -1606
49 -1606 1772 -1950 2150 -2369 2616 -2892 3202 -3560 3969 -4447 5013 -5697 6541 -7613 9024
64 9024 -10977 13863 -18567 27547 -50908 245090 531814 121536 25582 97766 416367 411948
76 411948 58000 -48541 192660 384570 334194 25568 -11196 244657 366812 216904
86 216904 -28580 -34788 185314 223430 26130 -159471 -100527 59413 71512 -114471 -206948
97 -206948 -93584 24606 10695 -107953 -145935 -27669 43003 -9459 -70478 -87121 -22714
108 -22714 11633 -53051 -64564 -60918 -38650 -15095 -29405 3484 24779 12586 35554 78928
120 78928 114183 105564 44331 59213 136297 141615 68922 -16276 18524 116460 100731 -24368
132 -24368 -84865 3452 108935 72918 -79006 -103078 36927 121225 32104 -130071 -129213 35657
144 35657 78744 -77173 -218659 -175946 6798 20876 -169078 -252980 -138801 43255 28548
155 28548 -168503 -201286 -26444 111489 44649 -143552 -142867 59003 140346 21231 -133051
166 -133051 -86901 115044 155921 9056 -92285 7482 183070 188880 34723 -21532 106818
177 106818 231158 186960 38332 11776 134410 205791 118414 734 5907 111936 150723
188 150723 52223 -18963 16477 97838 108496 21984 -17378 26868 70473 51941 -7746 -32378
200 -32378 2345 12006 -16141 -38458 -48044 -30292 -35550 -44452 -30595 -26246 -35367 -41377 -19816
213 -19816 9941 6296 -37654 -38778 8262 36581 6341 -57862 -43885 32417 55156 -8241
225 -8241 -65156 -25455 70886 77586 -19944 -58723 8927 104298 79185 -43514 -64712 34485
237 34485 108114 43114 -81689 -80481 48414 92346 -7935 -112316 -75721 65266 77736
248 77736 -47842 -123638 -46691 77774 56764 -81614 -126195 -15857 75807 23035 -107039
259 -107039 -114858 13394 73281 -8004 -108948 -77464 42166 73147 -24346 -90754 -28901
270 -28901 66760 68619 -29103 -62390 13340 79884 52559 -26938 -33930 40826 79414 32842
282 32842 -17487 -6749 51694 66151 16044 -9693 11091 46876 42073 5159 -2115 20250
294 20250 28703 15185 2927 4036 15083 670 -8800 370 3164 -8149 -31372 -25819 2918
307 2918 1427 -35010 -49151 -20324 17278 3661 -51612 -50774 1902 33718 -3947 -65212 -49102
320 -49102 23464 38478 -25909 -77004 -39400 45226 40546 -43180 -73828 -7197 71798 43444
332 43444 -50497 -60424 30369 86613 30066 -63833 -52897 50348 78596 -4392 -83120 -44432
344 -44432 58212 65116 -32219 -84506 -16399 71789 56443 -45418 -70818 11035 74532 31479
356 31479 -62434 -67352 15861 54878 -7631 -77312 -60000 19697 41741 -24363 -65947 -30623
368 -30623 36604 39937 -20564 -45600 -3949 39110 22737 -26113 -41437 -2203 18433 -3682
380 -3682 -32522 -34620 -3289 8025 -6663 -15663 -8135 4854 11134 5107 3490 4939 -5763 -4105
394 -4105 266 -164 -13303 -34962 -27744 -4534 -4342 -30877 -46887 -27362 12902 7200 -35221 -44393
408 -44393 -10828 28661 4579 -53244 -57158 -7288 19757 -21832 -79931 -68659 2080 18874
420 18874 -34603 -78877 -41864 37781 39859 -28318 -59990 -3533 63222 42563 -39990 -57717
432 -57717 14126 61320 19788 -59508 -51591 31441 65956 7989 -52128 -18180 63565 78866
444 78866 7454 -35656 11130 74954 62952 -14847 -43869 8925 55656 21283 -44863 -52781
456 -52781 6714 39543 -1334 -47488 -35147 19751 33712 -10158 -41939 -22957 13881 9098
468 9098 -33006 -55040 -33820 -12374 -22347 -50048 -55870 -32132 -18950 -22530 -30901 -27187 -11898
481 -11898 -6630 -7839 -6591 -7904 -13163 -12940 -10331 -4012 -12842 -31093 -25074 -5650 6286 -9322
495 -9322 -28796 -11300 26081 30649 1079 -19181 5346 46312 33542 -15109 -33289 1275
507 1275 36778 8813 -48266 -52483 599 30071 -7781 -60766 -44343 20925 37968 -16010
519 -16010 -62477 -30213 30736 26306 -42924 -77399 -30588 21472 592 -67839 -79931 -18234
531 -18234 27500 -5840 -61660 -52073 15075 46221 -650 -44995 -22639 35725 44798 -10014
543 -10014 -43585 -11784 35370 27880 -20785 -37084 5452 41531 26272 -10448 -11680 29119
555 29119 47887 24963 -4035 -1507 27965 30263 3585 -16640 -8871 6518 5987 -15558 -21967
568 -21967 -9797 -3103 -3842 -14627 -12177 -5976 -6784 -9522 -8426 -8522 -14349 -20796 -21908 -11690 -17193
583 -17193 -31993 -34511 -23958 -5389 -13661 -32075 -27174 -2110 12371 -2967 -26458 -16583 16582
596 16582 19158 -8463 -32389 -13942 21265 15573 -22786 -37433 -4002 29521 15006 -27978
608 -27978 -29368 15606 40917 12432 -31202 -21624 25994 37543 -7276 -44783 -23124 22975
620 22975 22694 -29787 -52468 -15853 26663 13574 -36464 -45163 430 33706 5371 -37724 -34698
633 -34698 11836 30322 -7279 -40883 -25771 17320 22728 -15954 -37485 -10824 24110 19161
645 19161 -14364 -23259 7747 29810 17434 -10532 -10857 15483 24449 7019 -11633 -6341 12400
658 12400 13718 -1738 -8840 -642 8488 5984 -3814 -1627 3200 1474 -1491 -2903 1300 -1650 -10368
673 -10368 -11102 -1508 394 -10774 -21360 -13222 4244 1090 -17422 -24119 -5617 13320 3559 -22423
687 -22423 -22263 6206 20542 1028 -26671 -17079 18286 25715 -4899 -27878 -6900 29171 26511
700 26511 -12910 -26596 4752 36853 21841 -20383 -22620 16565 39731 12038 -26138 -17736
712 -17736 24719 35715 -1870 -31367 -12555 27865 24773 -16183 -34291 -6131 26436 13131
724 13131 -25752 -32466 2731 24070 3293 -28791 -23838 10846 20976 -3958 -27682 -14683
736 -14683 13780 14233 -11186 -23614 -5911 13551 9073 -12537 -13938 4383 16027 8716 -6043
749 -6043 -952 12138 15517 6043 -633 3327 9932 7339 960 2355 4281 3544 1002 2545 7297
764 7297 5633 -62 -424 8440 12113 4532 -6573 -3097 11835 10358 -6142 -18254 -6031 10524
778 10524 5933 -16481 -20750 434 17165 5908 -17816 -15502 13196 25192 4066 -20991 -9827
791 -9827 19077 25097 -6662 -26267 -7152 24435 20993 -14079 -24356 5242 35012 21140 -12671
804 -12671 -13626 20804 41346 16205 -14790 -8867 25351 34132 3847 -21593 -6515 25573 24943
817 24943 -5758 -21118 2254 30096 22703 -6138 -11944 12040 28317 13852 -11332 -10837 10289
830 10289 16881 -200 -19276 -11392 5870 8438 -8399 -15144 -4617 8029 6950 -4777 -6227
843 -6227 2095 7912 2464 -4508 -3756 -718 -2722 -6526 -6477 -4114 -4360 -7006 -3288 4646 4974 33
859 33 -1473 7764 16523 11497 -750 580 13992 19058 5033 -9440 -2717 14987 17534 -1188
873 -1188 -11945 3534 26125 22939 -858 -5015 16572 34999 21336 -6411 -6146 19212 30115
886 30115 6082 -18945 -10731 18933 21973 -5627 -22510 -3625 26155 20797 -8277 -17584 7257
899 7257 29399 14745 -15863 -18033 9418 21527 619 -25788 -18184 9855 15422 -6268 -22846
912 -22846 -6533 19065 18912 -3304 -11064 7071 24617 17318 -5247 -7073 8668 17953 6287
925 6287 -9777 -5838 9528 13755 3424 -3002 3781 15481 16046 7152 5945 10492 14858 10087
939 10087 5018 4107 5011 2243 -1434 529 1009 -875 -4352 -1937 5221 6728 339 -2639 4910 11771
955 11771 7896 -4756 -7469 3535 9200 411 -15870 -12363 4110 9577 -4546 -16485 -6354
968 -6354 14347 16130 -3252 -11035 3852 23499 16638 -6208 -10769 8049 22620 8649 -13400
981 -13400 -11834 11996 21138 4057 -13643 -2897 21795 25155 4392 -9303 6485 27571 21314
994 21314 -1489 -10288 7824 22354 11213 -10051 -11288 9098 18802 5427 -11554 -4447 14527
1007 14527 18517 2742 -8811 1042 15780 12977 -3719 -9311 409 10104 3409 -9234 -9011 1426
1021 1426 7248 98 -6593 -2555 6538 7046 926 -1817 1937 5937 2723 -1597 -1219 1195 63
1036 63 -2840 -2497 357 1358 -3185 -2782 2652 5772 2631 -2879 176 8505 8500 -623 -4810 945 9908
1053 9908 5920 -6636 -8096 2925 11594 3661 -9336 -5630 10239 14950 2171 -9440 -1522
1066 -1522 16269 15171 -2573 -11111 2158 18000 10941 -8193 -11239 7092 19119 7372 -11529
1079 -11529 -7849 13033 19786 3781 -12249 -2370 16749 17009 -2056 -12988 750 16550 11363
1092 11363 -8086 -12193 3286 15631 6077 -10573 -8295 6064 13846 1570 -10703 -4869 8444
1105 8444 10223 -2346 -9638 -2628 8199 4761 -4951 -7443 -246 6060 1024 -4862 -4429 2199 3512
1120 3512 -595 -2685 -1084 2298 421 -1047 -213 1322 321 -1556 -279 2839 2410 -2902 -2470 1680
1136 1680 5311 967 -5879 -3338 4324 6885 -1740 -7723 -1669 8713 7037 -4611 -8244 731
1150 731 10931 4101 -8263 -9752 3247 11054 491 -11889 -8473 7341 10895 -2619 -13109
1163 -13109 -4243 11509 10289 -5031 -12505 659 13330 7152 -9509 -12316 3199 12599 2479
1176 2479 -12701 -9098 6844 12298 -292 -12290 -3734 10828 11797 -2755 -10164 -198 11678
1189 11678 7690 -6396 -9599 829 9569 2187 -8863 -7839 3165 7958 281 -6858 -3163 6363
1203 6363 6827 -927 -5266 -1423 4101 2124 -4095 -6025 -2120 -188 -2046 -5242 -4129 -1092 -1589
1218 -1589 -1732 -1529 -326 -384 -2248 -1370 755 -138 -3964 -5572 -2932 1023 -2458 -8380 -7551 -728 3272
1235 3272 -2292 -8311 -4291 5744 7073 -1701 -7375 -982 9392 6693 -5219 -9695 461 9493
1249 9493 3610 -9212 -9388 4588 11781 3158 -9634 -4676 10589 14015 1303 -9457 -1772 11789
1263 11789 10401 -5757 -12976 -2306 9347 3509 -12089 -13773 -241 9362 325 -12357 -9672
1276 -9672 3760 8868 -2804 -12648 -8303 3595 3580 -8779 -15219 -8229 1577 -1895 -11360 -13362
1290 -13362 -3955 2568 -1483 -7831 -6808 2139 4066 -817 -5309 -2879 1840 1232 -3141 -4851 -1798
1305 -1798 -163 -1220 -2816 -1222 896 604 559 1338 3964 2773 444 616 3313 3859 -1005 -4189
1321 -4189 -2514 1902 88 -6141 -8094 -2183 3375 -564 -6938 -6149 2782 6005 -821 -8359 -5158
1336 -5158 4404 4022 -5723 -12332 -5660 3672 1012 -10079 -13157 -1827 6493 1504 -9276 -7808
1350 -7808 4820 10478 1338 -8787 -4110 7471 9150 -2768 -10487 -3250 7715 5972 -6246
1363 -6246 -10184 672 9787 4840 -5625 -5398 5070 11153 3008 -6455 -4394 4891 6336 -2914
1377 -2914 -10093 -5779 2516 1238 -6511 -10390 -4223 2477 -210 -6372 -6757 -1271 1807 -2038 -7099
1392 -7099 -6102 -2667 -2577 -5840 -8472 -6786 -4748 -5278 -6802 -5932 -4111 -3345 -3595 -3158 -899 -1435 -2945
1409 -2945 -3187 -955 187 -2602 -5410 -4381 -194 147 -4108 -6951 -2420 3068 2096 -3429 -5029 2235
1425 2235 6674 2935 -4403 -3861 4211 6695 -134 -7693 -3939 4338 5395 -3179 -8404 -1306 7515
1440 7515 5752 -3738 -6173 2639 10155 4716 -5420 -5136 4715 9215 299 -7979 -4683 5305 6732
1455 6732 -2798 -8668 -2007 7708 5612 -3511 -6658 1620 8131 3065 -5423 -6003 2210 5381 -825
1470 -825 -8055 -5527 2138 2577 -3772 -8016 -3553 2232 1069 -4883 -6015 -1585 1757 -1020 -5725
1485 -5725 -4643 -1268 -908 -3827 -6054 -3871 -1889 -2620 -4543 -3893 -1866 -1884 -3003 -3114 -1075 -520 -2227
1502 -2227 -3552 -1443 680 -919 -3856 -4162 677 1655 -1934 -5301 -2880 2682 2579 -2824 -5618 -428
1518 -428 4950 2862 -4449 -5494 1789 5845 904 -6571 -4915 3397 6397 -1472 -7859 -2989 5528
1533 5528 5700 -3725 -7798 -603 7110 4323 -5407 -6788 1933 7597 1917 -6499 -5371 4083 7047
1548 7047 -237 -6934 -3386 5435 5555 -1884 -6749 -919 6401 4199 -3019 -4950 1235 6248 2796
1563 2796 -3743 -2901 2590 5216 1072 -3754 -1262 3297 3585 -318 -2994 -266 2632 1944 -882 -1116
1579 -1116 860 2059 677 -676 -25 827 94 -823 -343 -123 -620 -2023 -2136 36 -191 -2392 -3719
1596 -3719 -1589 961 162 -3497 -3987 452 2271 -717 -5106 -3652 1283 2262 -2825 -6741 -3360 2298
1612 2298 2470 -3846 -6184 -616 5222 2626 -4439 -4366 2498 6921 1613 -5118 -3396 4199 6485 -691
1628 -691 -6115 -1984 6079 5532 -2182 -5252 784 7775 4937 -2612 -4171 3163 7819 2917 -4688
1643 -4688 -3902 3738 5443 -694 -6443 -3052 3712 3608 -2393 -5508 -590 4531 3299 -2599 -3837
1658 -3837 1185 4228 1483 -3632 -2924 901 2602 -904 -3435 -1590 1584 1999 -426 -818 1060 2930
1674 2930 1998 1118 1467 2505 2337 930 1354 1816 1206 -13 -129 2003 2420 574 -960 1203 3943
1691 3943 3580 438 -1038 2528 5067 2956 -1973 -2096 2257 4272 126 -4982 -3241 2664 3703
1706 3703 -2213 -5517 -1268 4798 4198 -2540 -4888 1078 6318 2560 -4452 -4969 1459 5195 -279
1721 -279 -6342 -4685 3086 4903 -1150 -5746 -1274 5913 5406 -1303 -4219 1510 6658 3824 -3018
1736 -3018 -3809 1829 5310 1037 -4330 -2838 2700 4675 211 -3108 17 4586 4948 299 -1673
1751 -1673 1369 4249 2681 -1212 -1775 890 2367 -63 -1928 -1313 927 1427 -53 -572 654 2003
1767 2003 1519 439 860 1007 941 -973 -511 123 186 -1105 -1782 -21 710 -436 -1958 -623 2032 2887
1785 2887 307 -1205 1084 4064 2781 -1177 -2069 1306 3843 1385 -2728 -2107 2374 4833 948
1800 948 -2267 14 5220 6008 1124 -1799 1830 6970 5179 -287 -2550 2341 6333 3188 -2507
1815 -2507 -2525 3533 6187 2013 -2828 -599 5482 6070 1236 -2678 823 5595 4520 -1602 -3805 612
1831 612 3906 1934 -3773 -3456 1045 3826 752 -3718 -2252 1878 3219 -778 -3067 -1485 1823
1846 1823 1532 -2118 -3244 -1612 890 -445 -2561 -2680 -776 740 -692 -1184 -971 1103 509 -213
1862 -213 104 379 479 -176 -236 429 769 -457 -867 329 1892 1438 -354 -103 2201 3700 1633 -457
1880 -457 637 3858 4013 558 -1157 901 4155 2934 -869 -1965 1789 4622 2095 -1719 -1319 3407
1896 3407 5483 1297 -2341 -632 4081 4261 -710 -3777 -289 4110 2562 -2499 -3882 820 4232
1911 4232 1543 -3285 -2830 2552 4505 672 -3485 -1513 3039 3682 -736 -3710 -521 3130 2635 -1873
1927 -1873 -2816 706 3899 1862 -1661 -1580 2173 3836 1114 -1580 -346 2694 2576 260 -1201 110
1943 110 2028 1326 -214 -854 632 1407 607 -445 -170 786 456 -30 -217 290 252 -517 -646 216 461
1962 461 -800 -1415 -634 859 419 -1588 -1678 404 1698 -249 -2244 -1448 1382 2270 -700 -2419 -964
1979 -964 2523 2225 -1244 -2742 297 3359 1828 -2050 -3114 1751 3974 777 -2870 -2355 2792 4002
1995 4002 109 -3562 -767 3326 3490 -1109 -3452 -374 3564 2351 -2164 -3387 757 3737 1279
2010 1279 -3167 -2508 1593 3516 453 -2715 -1314 2245 2955 -196 -2564 -645 2633 1913 -1052 -1933
2026 -1933 175 2526 1015 -1151 -1316 1186 2088 633 -813 -108 1615 1401 340 -404 325 1018 734
2043 734 -337 -338 505 30 -67 -50 449 326 -206 -57 823 1338 268 -697 -176 1307 1366 -810 -1646 -252
2063 -252 1396 819 -1783 -2145 512 2293 163 -1965 -1631 1804 2542 -44 -2741 -811 2279 1626
2079 1626 -1705 -3534 -477 2486 984 -2921 -3354 843 2941 274 -3260 -2235 2025 3101 -502
2094 -502 -3615 -1487 2082 2123 -2101 -3834 -878 2605 1126 -2701 -3310 146 2962 620 -2152 -1645
2110 -1645 1667 2618 -183 -2573 -1390 1659 1680 -1222 -2740 -993 1249 771 -1641 -1774 111 1636
2126 1636 679 -1069 -546 840 1241 204 -1012 -387 160 -292 -688 -543 -36 -384 -482 -718 398 207
2144 207 -323 -443 289 1178 247 -622 -428 877 1337 -573 -1818 -493 1165 767 -1351 -2119 441 2211
2162 2211 1113 -1625 -1359 1479 2808 538 -2017 -1523 1909 2264 -949 -3222 -1054 1765 1339 -1924
2178 -1924 -2988 23 2453 1565 -2167 -1943 1231 3286 365 -2705 -1556 1517 2502 -1026 -2997 -1442
2194 -1442 1606 1403 -1549 -2722 -191 2411 1129 -1480 -1921 766 2254 330 -1991 -1581 854 1036
2210 1036 -872 -2537 -1593 201 237 -1670 -2335 -410 206 -111 -1553 -1796 -224 -188 -756 -1720 -1341 -603
2228 -603 -858 -1660 -1414 -1064 -980 -1080 -1185 -453 174 -237 -468 -23 918 343 -383 -510 504 1087 117 -659
2248 -659 -279 1914 1590 180 -864 693 2472 2377 307 -994 1408 3396 1785 -1248 -480 1819
2264 1819 3034 491 -2136 -941 1259 2475 -1756 -2531 -389 2271 1322 -2236 -3229 -225 1714 292
2280 292 -2843 -2876 259 1757 -1531 -3868 -2270 322 82 -2453 -2718 -1628 1361 207 -1362 -3296
2296 -3296 -485 1355 473 -1818 -2172 1000 993 -199 -2042 -1281 720 979 -42 -1354 -14 1194 1138
2313 1138 -97 -211 718 1241 608 -191 118 565 407 -145 -270 302 -6 -16 -638 346 483 -106 -830 -167
2333 -167 661 244 -638 -1466 -106 916 108 -1563 -1599 320 901 -584 -2113 -1033 1020 1260 -832
2350 -832 -1874 57 1762 1193 -1514 -1738 461 1904 459 -2029 -1675 1194 2300 -59 -2230 -664
2366 -664 1714 1962 -913 -2139 -306 2091 1350 -1372 -1952 281 2042 304 -1941 -1740 712 1438
2382 1438 -341 -2173 -1225 1298 1230 -926 -2257 -557 1093 756 -1411 -1697 -114 1039 93 -1209
2398 -1209 -843 362 1041 -234 -1016 -384 475 683 -304 -377 -115 594 372 -34 141 292 430 307 102
2417 102 444 345 -45 -296 555 555 -29 -632 -340 595 506 -517 -1083 5 816 297 -1142 -1269 309 943
2437 943 -245 -1484 -1050 659 1412 -379 -1969 -732 1195 1335 -864 -1877 -109 1701 936 -1420
2453 -1420 -1564 635 2013 304 -1641 -1553 935 1762 -109 -1819 -806 1657 1545 -435 -1865 67
2469 67 1972 1270 -1013 -1524 564 1869 844 -1146 -984 954 1275 -72 -1820 -706 713 730 -573
2486 -573 -1394 -205 953 517 -764 -909 -25 617 104 -794 -699 4 251 -615 -943 -632 340 -16 -593
2505 -593 -5 66 395 -3 -42 413 301 -7 -318 143 686 460 -607 -349 834 858 -132 -812 -78 1101
2525 1101 1084 -418 -899 392 1402 759 -1191 -1244 298 1320 -240 -1538 -906 1139 1524 -744 -1755
2542 -1755 -628 1459 1166 -844 -1598 -70 1846 664 -1344 -1311 644 1456 69 -1506 -1128 1204
2558 1204 1746 -249 -1448 -45 1681 1676 -615 -1194 507 1783 1129 -889 -792 554 1526 414 -1203
2575 -1203 -438 835 1182 -157 -826 -330 830 1019 -464 -761 -133 573 -41 -1020 -671 -304 166 -549
2593 -549 -960 -793 -261 -178 -610 -283 -634 16 -532 -357 -192 -9 -639 -785 -209 180 350 -456 -439 458 986
2614 986 62 -313 17 1302 1213 192 -279 520 1716 1415 -112 -356 910 1759 870 -596 -308 1089
2632 1089 1828 423 -906 -215 1533 1544 131 -1408 69 1595 977 -967 -1559 26 1380 261
2648 261 -1600 -1210 286 1046 -135 -1615 -1143 698 820 -695 -1708 -498 808 507 -1190 -1565 -247
2665 -247 786 -40 -1248 -909 242 1017 39 -689 -356 736 696 -13 -407 215 921 644 16 -524 236
2684 236 978 -10 -167 -8 400 671 318 194 442 664 194 278 447 368 113 -337 245 479 313 -368 -329
2705 -329 99 560 307 -723 -652 591 894 -329 -590 -344 982 670 -443 -1276 -216 800 327 -1203
2723 -1203 -1423 190 1305 -66 -1077 -810 682 1089 -239 -1282 -195 1072 1055 -514 -1769 -110
2739 -110 1112 631 -1121 -1306 426 1178 249 -1254 -721 632 1003 -141 -1056 -308 825 932 -576
2756 -576 -1157 -242 1187 580 -513 -870 322 929 477 -603 -345 459 897 141 -66 239 762 615 -44
2775 -44 -132 241 267 339 265 94 731 277 197 21 537 379 -10 2 198 560 -214 -235 -180 562 154 -249 -675
2798 -675 -3 643 14 -797 -821 480 847 -190 -1212 -466 598 267 -354 -1255 -376 761 623 -524
2816 -524 -1173 140 1066 483 -1091 -1021 454 1007 217 -1174 -582 792 1112 -211 -1281 113 1093 1023
2834 1023 -676 -1211 134 1208 493 -1041 -671 463 1067 294 -849 -565 467 1015 -207 -1071 -507
2851 -507 725 511 -148 -491 -249 772 220 -570 -662 140 576 318 -236 -367 140 240 0 -386 60 226
2871 226 395 192 -58 154 124 543 -39 386 375 31 175 84 600 269 -278 -141 622 541 -205 -368 160
2892 160 595 331 -420 -592 -45 999 -88 -842 -564 595 706 -158 -1043 -340 641 562 -318 -1166 -370
2911 -370 886 572 -682 -1197 369 1163 321 -739 -814 623 1006 89 -1042 -473 1112 952 -312 -726
2929 -726 -63 886 813 -511 -1055 206 763 87 -688 -704 315 752 -182 -740 -575 465 418 -162 -524 -148
2949 -148 462 176 -217 -514 31 90 -130 -413 -351 39 179 -159 -245 -224 35 -117 -479 -48 85 -161 -126 -169
2971 -169 247 249 -205 -65 -7 471 262 -39 74 501 570 -141 -266 39 379 530 -388 -536 184 691 324
2992 324 -278 -267 433 890 287 -566 -263 719 893 18 -719 82 992 726 -457 -738 75 844 441 -702
3012 -702 -529 315 899 216 -452 -585 246 1059 -39 -880 -287 770 643 -360 -946 -357 744 91 -745
3031 -745 -882 -249 625 3 -789 -705 41 271 -350 -1007 -429 159 89 -80 -586 -196 -172 168 -435 -402 -8
3052 -8 -29 -96 -235 -7 19 188 71 -85 167 123 89 220 84 250 68 89 356 335 194 6 274 595 694
3075 694 323 -369 26 533 336 168 -565 90 759 529 -224 -616 147 699 558 -551 -718 49 502 -136
3095 -136 -931 -708 248 433 -724 -1199 -428 522 497 -690 -1053 -332 592 68 -1025 -829 89 543 -142
3114 -142 -902 -602 437 400 -45 -615 -312 515 496 -70 -521 244 961 343 2 -203 458 731 218 -112
3134 -112 -268 564 518 -19 -277 167 214 336 9 -101 244 550 288 -118 -52 339 282 70 -14 -3 157 -25
3156 -25 -86 19 88 -210 -401 251 110 -176 -202 -399 -97 195 -51 -477 -413 286 592 -243 -827 -385 546 388
3178 388 -489 -663 -1 599 481 -359 -441 100 840 114 -377 -562 434 634 343 -543 -521 524 795 -412
3198 -412 -721 -234 702 595 -62 -271 137 820 407 -415 -539 404 712 -98 -640 -188 207 432 58 -418
3218 -418 -16 484 249 -436 -230 185 555 366 -321 -140 -124 418 132 -557 -206 -16 182 -109 -116 155 97
3239 97 59 -77 -64 -18 285 69 49 -19 30 83 110 273 151 -29 -60 -637 -182 331 -20 -357 -130 298 284 -332
3263 -332 -322 89 651 -43 -515 -115 134 448 -77 -390 -215 571 502 -369 -598 -235 788 170 -480 -809
3283 -809 206 956 62 -736 -619 276 768 -127 -819 -211 529 605 -354 -572 193 802 562 -414 -716 295
3303 295 626 289 -417 -281 316 429 -19 -575 -104 619 159 -250 -276 -59 -49 324 231 -804 205 -483
3323 -483 122 144 -390 161 -9 -203 -231 -156 78 74 -48 13 2 41 -187 -253 -133 -264 -7 -116 46 120 -13
3346 -13 -130 -169 336 529 96 227 -29 359 564 -131 -144 261 374 484 -406 -464 249 731 68 -512 -411
3367 -411 170 825 -18 -542 -38 666 601 -380 -558 60 434 246 -694 -586 124 528 -52 -707 -661 497
3387 497 417 -35 -595 -15 557 588 -192 -844 38 625 202 -549 -354 -9 447 2 -121 -136 12 558 -87
3408 -87 -276 -60 212 126 -215 -238 -187 -21 -384 -236 206 174 -22 -212 -161 -367 136 -41 -151 10 66 345
3430 345 -25 -109 1 -106 -162 33 -243 187 205 -193 -128 170 538 102 -111 163 463 505 -99 -263 262 583
3452 583 397 -72 -512 244 679 437 -215 -337 311 600 181 -353 -359 473 480 -450 -609 -288 313 85 -819
3473 -819 -892 -156 197 55 -779 -769 146 475 -143 -615 -709 119 127 -229 -823 -266 252 287 -332 -565 -146 529
3495 529 180 -276 -156 184 416 289 -132 -102 691 491 93 -104 73 587 294 120 11 203 485 423 158
3516 158 151 469 129 300 213 104 340 -55 -83 -3 1 26 184 78 148 -45 -175 -198 32 219 -202 -224 -568 277
3540 277 268 77 -482 -421 348 367 -220 -600 -18 313 131 -605 -490 -120 453 150 -499 -385 488 425 -190 -789
3562 -789 -244 533 421 -279 -552 -26 553 325 -286 -503 147 500 208 -225 -196 -16 488 41 -553 -266
3582 -266 534 220 -265 -550 -131 430 157 -366 -414 -16 292 44 101 166 266 339 46 -237 -338 73 136 69
3604 69 -305 -324 -80 -336 54 15 16 108 130 5 -93 38 -85 -187 113 245 7 -300 -100 228 210 -56 -138
3627 -138 -97 290 5 -269 -331 324 220 61 -325 -412 416 286 -142 -594 75 268 348 -103 -490 -57 582
3648 582 287 -199 -426 155 635 191 -566 -71 548 606 41 -285 -18 329 492 -147 -279 -7 410 251
3668 251 -286 -359 273 321 144 -309 -144 100 167 103 -179 -317 80 271 -320 43 -123 237 68 -350 -254 63
3690 63 206 62 -171 -240 179 175 -7 -119 -88 -186 35 67 -301 41 12 30 -9 32 0 -76 -199 16 -138 -200 72
3715 72 -140 201 119 -144 -227 -91 111 360 66 -83 80 304 234 -244 -376 244 275 153 -474 -81 537 223
3737 223 -115 -630 15 183 237 -306 -399 -108 416 191 -216 -325 267 533 -54 -488 -159 309 326 165 -604
3758 -604 -267 247 235 -190 -428 -10 500 245 -269 -295 1 143 266 -186 -417 157 378 -132 -380 -278 23
3779 23 295 67 -413 -119 324 224 -144 -48 105 106 283 30 159 281 -127 -111 -190 -69 -299 -129 -30 41 50
3802 50 -95 73 -47 129 -56 -131 -74 133 243 159 -129 218 244 414 6 -327 -99 458 255 -253 -236 94
3824 94 469 47 -202 -382 95 282 -231 -602 -69 130 400 -242 -469 -200 22 124 -103 -297 108 274
3844 274 220 -377 -517 131 256 -125 -441 -338 266 263 -36 -604 -47 362 -60 -341 -417 40 331 21 -384
3865 -384 -272 -88 244 -217 -70 -100 89 379 126 -124 -94 329 408 224 -259 139 239 19 363 181 146
3886 146 89 96 45 340 -152 104 69 21 123 80 121 -64 340 -14 148 -255 -108 407 -39 -326 -268 49 81
3909 81 -272 -229 -114 348 6 -63 -437 -81 66 14 -350 -166 37 169 -40 -428 -356 -8 481 -180 -467 -541
3931 -541 193 181 -246 -427 -150 418 -20 -336 -416 -45 275 211 -65 -363 452 302 -8 -461 -131 374 367 -69
3953 -69 -398 -5 334 185 -179 -365 135 -78 84 -5 -226 30 139 228 -144 68 163 176 -158 -122 56 -7
3975 -7 -137 -75 29 10 -93 -70 -53 327 11 15 -85 24 129 -53 -322 -175 291 -62 -339 -175 10 252 95
3998 95 -422 -261 43 63 -76 -453 34 195 303 -65 -375 -43 231 281 -165 -184 93 445 297 -268 -201 232
4020 232 116 94 -369 -342 192 405 -30 -222 -228 -4 224 -53 -307 33 538 36 -201 -368 -111 133 -76
4041 -76 -274 -209 200 12 -40 -238 -93 -182 214 -23 -186 -35 22 -111 80 -236 -50 83 146 -141 -232 -122
4063 -122 99 -71 -301 -252 0 89 -17 -195 -136 185 101 21 -45 -149 -41 -116 -3 -197 195 -248 -187 -41 224
4086 224 -31 -453 100 239 480 -111 -141 -53 94 202 56 180 121 279 -13 -309 226 -9 386 122 -430
4107 -430 -337 354 259 -18 -10 53 408 313 -263 -110 81 258 -14 -209 -86 167 394 -179 -330 -125 294 312
4129 312 61 -167 -81 240 -47 -139 -283 -148 54 -338 -296 -428 83 -1 -30 -263 -220 -67 46 20 -182 38
4151 38 40 -105 -310 -289 -206 -107 37 -208 -149 -133 -18 -138 -185 99 145 -63 -27 114 146 -167 -13 21 96 540 201
4176 201 62 79 235 119 -276 172 98 54 90 -258 203 200 16 -127 -263 88 436 -23 31 -255 -14 202
4198 202 -133 -433 -136 88 550 26 -233 197 255 56 -88 -314 35 295 8 -343 -399 196 486 311 -477
4219 -477 -209 277 384 118 -9 39 282 91 -300 -224 109 229 33 -353 -103 176 385 24 232 -19 -16
4240 -16 158 -62 110 -50 436 187 -68 22 65 263 61 -53 -35 98 109 -114 120 157 118 146 279 26 86
4263 86 112 -244 157 122 246 85 -290 128 233 100 -273 -114 -9 157 -152 -413 -90 32 67 -138 -130 -217
4285 -217 150 83 -53 -263 13 204 -239 -155 -272 -152 173 168 -263 -221 -206 86 -173 -315 -94 477 263 -155
4307 -155 -74 189 305 -12 -86 -311 3 280 177 -234 40 214 354 -188 -83 -138 222 207 -186 38 -91
4328 -91 261 -23 -95 3 220 367 -21 93 61 171 144 111 58 44 206 35 -68 13 0 23 37 -53 98 216
4352 216 19 -200 128 87 -60 -83 -141 -4 109 -255 -275 -77 79 111 -332 -54 28 239 46 -156 -20 142
4374 142 466 -123 -147 -267 223 -196 -527 -289 179 335 198 -461 -375 130 337 -17 -31 -89 170 499 -41
4395 -41 -56 -130 270 166 -72 -156 -181 162 187 -131 -305 3 392 -60 -338 -248 353 221 -27 -87 -78 308 295 -29
4419 -29 -39 24 9 -60 -102 -20 143 269 213 20 113 -106 -42 9 5 -131 -79 221 48 -187 -79 129 132 -169 -118 -135
4445 -135 42 -264 210 -46 56 -52 -4 297 177 104 58 -142 -28 174 72 -1 73 174 43 -146 -66 121
4467 121 194 123 -542 -14 343 113 -75 -255 -193 -66 138 139 73 81 244 452 -253 -558 -46 264 179 -295 -174
4490 -174 249 260 -122 -198 -381 265 119 -75 -107 -1 344 -130 10 178 61 329 33 -214 -61 39 341
4511 341 -40 -60 126 168 -214 -117 -256 73 389 54 20 80 -214 236 -38 3 -28 162 209 -28 -127 240 -229
4534 -229 -114 137 169 -145 44 -157 -37 87 212 12 -64 -370 280 -105 156 135 115 373 -390 160 -27
4555 -27 124 101 -91 -28 498 75 194 -123 26 237 431 92 172 76 17 336 -75 81 -26 -17 -157 -437 -387
4578 -387 77 9 29 -52 -154 -33 208 83 -218 -196 162 119 -170 -238 -205 376 -112 152 -415 -115 -125 -33 -154
4601 -154 -65 163 147 -139 -16 29 -120 130 -151 -194 -21 -63 218 -107 -303 55 171 313 -93 -21 -92 -31 -27
4624 -27 150 -58 262 -49 22 111 134 -200 -35 -87 -200 -65 63 13 223 38 -181 95 -53 250 127 137
4646 137 66 -118 -53 238 165 -203 -116 29 398 22 -46 -169 204 -85 -77 -77 335 229 -22 -93 -56 213 151 -169
4670 -169 -242 -119 488 74 -99 -154 152 183 198 -291 -138 -5 272 -39 -357 -32 156 196 75 -121 -31 193
4692 193 306 -165 -9 183 336 -98 0 42 -105 77 -96 -89 66 179 270 113 -343 -26 13 -189 105 -180
4714 -180 55 299 -39 18 -126 -141 -29 -156 182 110 -1 -114 -214 -40 -97 -18 14 54 -58 -116 -113 -177 8 -9
4738 -9 -32 21 -132 -37 149 103 -264 23 135 44 -201 -92 -107 -13 147 -20 -182 63 60 -35 -204 -319 -58 266
4762 266 252 -129 134 192 257 -168 -108 -10 186 271 -2 -75 13 487 -30 -97 -115 163 209 198 -184 -112 131 232
4786 232 64 -140 -202 233 -31 47 18 46 -1 -6 109 306 -62 81 45 90 -39 -31 69 -31 111 8 -102 117
4810 117 -254 -64 -66 -140 -90 -29 -65 42 -47 -127 181 -158 -109 -25 155 28 101 12 -107 -83 218 105 -81 -179 112
4835 112 -9 -32 86 -9 208 -60 -49 -397 -60 24 22 79 -278 23 22 89 -184 -104 57 -140 -37 -8 -77 39
4859 39 -71 -223 -220 -145 177 103 -68 -144 231 51 -142 -177 -271 167 -67 -103 -306 -73 -32 283 -148 -279 -186 -227
4883 -227 119 -51 86 -91 90 271 -152 -139 153 -65 -67 151 -71 62 89 -278 -91 127 -54 -159 31
4904 31 147 38 -100 -141 0 -145 -144 -147 -128 -71 236 -128 -329 -83 179 111 -45 -225 18 224 52 -3 -119
4927 -119 113 159 41 -246 1 -90 132 65 -102 -36 9 133 -85 -64 127 159 146 -271 -95 -46 -72 -174 -384
4950 -384 -272 89 53 -65 -11 62 183 225 139 -255 -20 170 156 -328 -269 58 -14 267 23 -168 -14 -8 -95 -314
4974 -314 -57 31 32 -226 -87 7 38 14 -276 -199 -150 242 39 296 5 -159 40 87 267 46 -66 92 238
4997 238 204 225 -5 -52 -121 -149 -134 -214 123 123 194 -38 27 -89 171 -80 204 -201 77 165 54 338 -144 6
5021 6 79 59 -205 -232 144 77 -76 -31 -203 152 132 -85 -52 25 -2 204 122 -211 29 127 31 -134 -148 144 292
5046 292 55 -115 43 269 139 105 -100 -77 69 -35 -198 -20 127 58 -187 -132 -157 5 61 -67 31 -170
5068 -170 -18 -77 221 52 42 -2 -95 90 59 79 74 -83 -202 -102 143 301 41 54 -13 65 105 44 4 65 -86
5093 -86 20 17 -201 -15 -111 -84 -47 156 -40 -207 86 25 268 -175 -212 -219 133 -100 110 -51 82 -7 -308 -371
5117 -371 -202 88 125 89 -278 -204 69 133 -44 -184 -99 -65 198 -7 -421 120 112 267 112 -108 -139 286 -33
5140 -33 -274 -132 314 67 -11 74 -80 59 289 -266 -187 40 170 -84 24 122 -144 90 9 -29 -104 -84 -16
5163 -16 55 14 -91 241 226 17 119 -94 126 -67 58 29 -84 -6 -49 -107 -115 26 -228 66 -31 93 45 -151
5187 -151 -9 -144 5 10 -158 -273 44 -52 -47 -60 100 25 -145 41 -122 37 355 -164 -150 -51 41 98 -187 -34
5211 -34 -30 110 187 178 -87 178 172 298 -72 28 52 253 162 -303 -87 197 85 -189 -141 -66 -146 167 -18 -191
5235 -191 64 202 29 -21 -137 23 23 130 -110 -175 -38 64 230 -175 108 134 190 124 -9 218 137 149 -32
5258 -32 29 -148 -189 103 -116 -37 -132 47 -85 -159 -25 -151 -74 -214 0 64 127 -322 127 193 200 132 140 89 194
5283 194 -224 -206 61 338 -45 93 24 -150 -28 46 -106 -186 13 -94 57 -184 109 275 4 247 39
5304 39 33 247 -58 -10 -71 212 210 210 -49 -184 144 -145 117 -93 52 -100 160 -163 35 1 17 77 47 -195
5328 -195 215 180 29 -155 18 56 240 -7 -24 -41 42 195 325 -28 97 153 125 -122 -98 34 177 16 -58
5351 -58 -119 -203 -190 -81 258 143 -242 19 -119 170 148 79 -19 8 -36 53 26 109 184 256 44 -57 -189 -162 131
5376 131 -78 16 98 19 -10 43 -217 -83 54 230 -38 -281 77 27 -79 -175 -140 -29 24 -331 157 107 227
5399 227 49 44 -202 8 -15 -202 -81 -61 198 258 183 21 12 88 294 -38 -19 206 10 132 143 -118 -75 -118
5423 -118 53 -44 53 250 -18 -125 109 26 124 28 -68 182 -113 -140 259 -12 356 34 36 177 186 -97 -61 18
5447 18 119 260 -116 224 83 107 290 -109 110 -53 268 -18 -13 -181 48 -68 137 42 -68 47 -33 335
5469 335 35 -56 -12 -62 -57 100 -135 56 176 -164 42 -30 101 87 114 6 130 22 -41 -71 3 42 414 144
5493 144 -35 -41 -266 -72 145 0 -106 -129 136 -39 24 -115 191 55 280 25 105 32 37 -81 251 -3 59
5516 59 93 -43 7 -59 44 179 106 31 175 385 107 56 -61 -14 198 76 -13 -70 50 186 -17 -72 62 236
5540 236 179 110 -36 -66 80 -85 217 88 161 -113 115 47 112 -290 281 -206 -65 -310 175 31 -126 -188
5562 -188 148 -108 -230 -209 86 -124 -127 -136 -48 163 -356 -62 -87 -2 168 158 -4 114 -19 126 -54 -134 -148 203
5586 203 243 61 -92 51 264 -88 -151 84 29 -90 128 75 -77 -60 330 -68 77 200 43 279 -171 -41
5608 -41 -92 222 101 17 -109 118 -4 -64 -100 89 -28 70 -71 -31 -15 -137 39 -65 -184 -191 324 55 71 2
5632 2 105 -126 -41 -278 30 -251 137 -120 19 -10 -199 38 8 2 234 -111 -76 10 16 113 -134 97 -81 103
5656 103 -57 -37 -53 130 -144 99 -85 -85 1 155 -295 -243 122 24 -79 260 -30 13 -4 -90 -79 -211 231 136
5680 136 127 3 192 14 -188 -96 -151 -101 166 73 -115 -35 154 -246 -164 56 -449 206 -71 -25 -184 -48 61
5703 61 -90 -128 -356 365 97 -75 -72 50 -32 -138 57 -202 -147 -207 -131 41 197 123 -125 94 -54 79 92
5726 92 24 -87 90 -67 -100 -50 -57 130 74 -148 -224 -123 -54 20 -35 -189 -96 158 5 -333 -231 -118 -43 -46 -123
5751 -123 25 32 73 -80 47 -11 103 92 40 -47 210 -83 24 -157 -108 24 -30 -18 -60 79 -14 -12 131 15 164
5776 164 -4 -19 158 -224 -88 54 41 -124 -180 -206 55 -149 -155 -89 -10 -37 -313 -133 163 -47 234 14 -22
5799 -22 -283 4 -24 -341 -18 -165 70 116 -81 -41 1 170 76 -178 -123 -263 13 39 75 196 -17 -233 -79
5822 -79 188 175 57 9 138 -170 44 -67 14 140 -49 -61 10 -122 294 -153 43 18 -50 15 -140 -62 118
5845 118 -78 230 31 -154 73 -52 -128 -91 -35 274 -19 27 173 -24 -66 280 49 -427 50 120 -37 -139
5867 -139 -49 -13 -61 161 -225 -152 -38 -158 -101 141 -37 76 -246 178 -24 -75 220 53 -23 -199 -36 -6 183
5890 183 303 -175 58 259 -163 -43 -13 -43 88 40 102 -15 114 144 111 -132 -162 82 -101 242 -59 145
5912 145 -57 67 153 -9 259 -73 -118 60 61 132 -100 -110 67 23 18 -2 30 56 66 -241 298 156 -21 -46 -248
5937 -248 92 126 -204 132 278 -115 -104 41 -50 -326 -225 25 -3 -238 8 -179 109 -198 -141 77 183 -168
5959 -168 267 -107 -58 -9 -64 -141 2 19 -26 85 91 203 -175 6 131 267 -24 250 227 124 -74 86 -18
5982 -18 63 117 10 40 6 134 -102 -167 -200 156 38 89 -126 -81 -86 -217 4 45 -66 256 -243 2 -148 -144 235
6007 235 480 69 142 -69 -163 204 -169 65 -295 121 66 8 78 -65 -20 259 246 166 -19 199 246 52 -60
6030 -60 -119 -66 20 66 46 -89 -160 263 133 -99 124 200 -51 -249 -98 261 -16 -9 71 -120 36 7 -72 75
6054 75 31 150 -32 0 -132 -46 46 42 8 -245 116 -9 -92 54 -77 126 157 221 33 -110 -361 -176 156 -8
6078 -8 -38 -114 -1 -48 61 72 -48 -186 -73 74 67 -126 18 -16 47 -65 -274 -384 90 113 -58 90 -151 -68
6102 -68 65 88 27 196 2 29 -335 95 -70 -247 56 -149 64 -298 227 169 90 -33 -251 72 -4 -158
6124 -158 -52 -117 131 -294 -236 327 -88 -11 -36 -399 149 -18 248 -6 -15 16 -162 52 -105 67 -142 -32
6146 -32 -177 -165 89 89 244 -75 -272 -239 -223 -116 100 322 2 182 -179 -343 107 -16 -40 42 -28 -223 153
6169 153 -154 -149 -34 -9 -156 136 38 1 191 40 -70 105 -253 179 -50 17 58 296 -166 -117 -40 372 -10
6192 -10 -39 108 172 148 185 -182 12 235 -37 6 -38 -149 -78 167 -136 -32 -54 -205 205 27 -161 137 22
6215 22 89 71 128 -42 32 -76 -59 59 -175 61 -77 -74 47 167 165 85 36 16 -6 -117 -196 34 209 98 57
6240 57 -8 65 -209 -122 160 96 -65 100 -91 19 44 -83 2 170 237 32 114 -77 158 -97 5 -70 10 106
6264 106 79 -135 129 345 152 -72 84 -98 123 202 -189 -32 191 189 -144 72 52 80 190 95 -155 135
6286 135 56 39 134 -119 193 -14 -50 -156 45 470 -41 -124 55 48 -198 -154 93 -179 -239 -296 -85 -50 -85 19
6310 19 -107 -113 -132 -52 -34 52 -155 200 183 -104 -53 -23 316 41 -31 -6 54 156 -113 49 106 -43 41 49 -47 77
6336 77 137 -143 -255 -114 48 -194 132 -47 267 115 166 18 174 68 -42 -128 -29 -200 -5 58 -41 -218
6358 -218 91 136 -61 152 -361 -47 -34 250 21 151 -79 -60 -29 124 101 -285 28 -130 -38 -253 -150 -69
6380 -69 274 63 68 -242 199 -12 72 -29 -2 163 -61 76 19 248 37 62 -248 -17 146 131 -41 -2 -20
6403 -20 -107 -153 -146 -36 95 -46 -23 -214 172 -21 -268 305 177 -134 -138 -212 83 78 -143 -68 -62 -62 128 137 -171 -41
6429 -41 -137 -6 -33 -101 21 52 -195 218 63 108 279 -144 -93 96 -21 -150 19 116 108 -36 -85 -118 -141 -129 130
6454 130 -168 74 -111 -21 2 160 -198 -189 45 266 12 -274 69 -131 -50 -118 9 -147 -113 101 195 138 126
6477 126 -21 -9 -49 343 219 52 -50 71 5 -94 -202 -40 75 -45 110 -62 -4 -24 -118 -196 36 -32 58
6500 58 154 -93 -12 10 119 231 -154 -18 -110 -222 -82 219 -52 -145 84 123 -104 -83 -39 -9 -175 -42 101
6523 101 -7 -45 4 -9 165 51 -200 -242 -136 -69 -114 -42 30 14 -127 140 126 12 125 -74 -85 95 241 5
6547 5 142 208 38 39 -115 8 -149 29 53 -2 246 25 -146 97 -139 11 -119 181 158 111 255 -67 91
6570 91 116 86 -225 -200 -51 132 -36 -108 -133 86 35 -400 -139 100 143 -12 119 58 68 152 -201 159 142 149 -37
6595 -37 120 -21 122 -166 -120 154 6 28 61 -48 65 223 -154 -128 -227 -16 27 68 -1 8 52 266 261 90 -140
6620 -140 -44 16 -301 -161 31 -58 -46 41 193 -34 77 -8 -9 94 -70 -25 214 -177 72 19 -64 125 181 143
6644 143 17 76 -199 -11 116 -53 102 99 -70 54 129 61 -125 -106 278 5 18 -136 -20 -45 -71 171 136
6667 136 -157 -85 163 -60 209 -87 20 149 37 -83 54 -95 -50 209 19 25 107 4 71 -77 231 -66
6689 -66 -120 -91 216 39 76 235 105 326 -50 -97 -86 -69 -196 10 -55 106 -146 99 -96 -77 -81 354 -495 -114
6713 -114 116 -94 81 -91 104 -119 33 -81 -149 64 236 -115 -119 -201 -12 221 -63 165 126 -38 -136 133
6735 133 40 30 69 -204 -13 140 -15 -150 -35 119 -78 14 269 104 273 76 -191 -157 142 201 -18 -1
6757 -1 -43 142 67 194 114 -7 60 -92 47 95 -269 -52 171 -64 -152 23 -168 -174 40 19 82 -16 -37 202 -114
6782 -114 -190 5 -13 -76 -203 114 129 -15 -33 -41 67 166 19 79 -85 -69 2 36 -226 119 90 -35 -38 -9 190
6807 190 105 -51 -246 -97 -229 158 -46 -123 -208 -1 27 -117 -113 -144 209 -1 -159 167 29 -124 -101 6 4
6830 4 -88 -21 -6 -62 -27 99 -179 18 -8 -49 -277 198 142 200 -83 152 -86 316 -67 -131 278 -48 88 -76
6854 -76 -63 120 -22 131 -414 -68 -74 -37 -58 194 163 39 -86 14 -171 -115 220 15 177 202 23 -3 -11 -10 -61
6879 -61 91 221 -283 13 260 117 213 127 261 -186 88 -76 -6 -75 -3 91 147 68 -63 2 -162 196 26
6902 26 40 41 112 -13 -37 84 256 -176 -10 16 -193 -177 -29 -153 51 19 68 -126 64 -137 10 -226 52
6925 52 -144 -46 13 -70 48 40 161 -236 -55 15 121 49 104 -85 -78 103 141 62 -226 -155 36 123 48 -93 -184 55
6951 55 117 79 -242 -14 127 -59 -8 -140 12 -318 -55 -63 312 -120 -93 83 186 119 149 118 -104 -143 -19 8
6975 8 126 225 -161 61 215 -10 -205 125 -212 9 133 -140 -75 106 -71 6 -247 110 -27 -11 180 171 -4
6998 -4 120 -151 41 -85 -12 20 38 121 -133 -89 -62 23 22 -206 24 99 -276 104 -57 78 30 -5 -159 214 -57
7023 -57 80 -586 -4 597 334 -216 252 -120 72 97 137 276 193 116 54 -43 31 -93 62 -184 -76 100 67
7046 67 -187 -29 -56 -11 -327 27 -57 118 12 -236 -191 124 -176 -33 -6 -88 -29 118 193 -26 38 -45 -25 4
7070 4 44 104 50 78 138 -10 -5 -118 -50 -6 -13 14 -132 -219 -116 17 -33 166 -121 -27 -27 -7 49 -149 38 50 115 -48
7098 -48 -197 99 22 -9 27 48 -150 -102 200 36 132 163 -17 14 -100 100 10 110 -84 -61 -5 36 -392 139
7122 139 29 50 -2 -90 34 -23 0 119 -87 -33 27 -74 30 -78 11 57 78 -115 28 214 167 -19 -77 -93
7146 -93 -93 84 -13 -166 -185 -4 -100 39 269 -76 -221 -232 -37 235 121 203 -60 79 -127 -20 -48 -38 -64 99
7170 99 -133 -69 32 -32 -29 -149 -100 -258 119 -94 21 -135 122 265 162 23 -211 46 -210 -16 13 -79 104
7193 104 253 141 23 14 172 -182 182 143 -145 118 -12 -35 165 6 76 -26 -53 -1 31 18 53 51 85 -94
7217 -94 151 22 266 -14 -39 -54 7 -179 -206 -177 -22 39 23 113 9 114 40 68 -125 45 20 -64 -84 -29 -40
7242 -40 182 -137 -27 331 -321 -69 41 -195 -96 -31 -2 13 -50 209 -11 -50 70 -118 -144 93 -228 64 -129
7265 -129 111 -47 147 -43 174 -64 -15 46 91 -469 -82 4 -176 96 55 -26 -276 111 -9 14 88 -110 25
7288 25 181 -168 5 -151 -12 10 98 160 -61 -33 31 -261 -228 -92 -52 32 68 66 19 -88 -10 223 134 -141 266
7313 266 -177 191 -300 -218 106 -18 -228 -71 -391 38 -311 98 -233 -395 -49 303 13 -342 196 -422
7333 -422 66 -746 -59 -69 -106 -149 77 15 198 -87 98 -36 -211 -80 -114 -70 -1 -260 -8 30 30 126 34 -43
7357 -43 135 -106 -168 204 -14 14 -75 156 71 115 174 -113 24 46 -138 -244 -178 -54 -79 101 -26 -23 -145 -40
7381 -40 12 -21 52 72 -296 -424 180 -176 176 196 33 64 -65 -53 -4 26 179 -46 27 -14 244 186 34 -87
7405 -87 79 -100 -176 3 2 197 162 -84 150 104 255 -97 19 32 21 -21 196 40 -54 -165 -306 263 -91
7428 -91 -25 -177 233 -11 -86 -279 40 -54 4 91 -11 -1 138 -112 56 163 -7 109 -226 43 56 -120 108
7451 108 -202 44 -73 -95 0 39 124 -179 -104 -11 -170 -45 86 42 -217 169 -339 169 -66 -149 -73 184 205
7474 205 -139 223 121 250 -132 -52 139 -116 127 -76 116 81 -7 -113 113 56 -513 362 301 550 470 -58
7496 -58 528 -78 129 13 436 594 349 -863 -1195 88 172 324 281 39 -111 348 -239 -204 103 420 -282
7517 -282 32 -382 131 464 -220 298 -490 438 -611 -136 565 -298 -425 187 -963 -149 -403 55 -638
7536 -638 341 261 -686 -176 -476 -213 35 -393 146 -527 -385 693 -28 -213 477 -422 106 88 208 -101
7556 -101 -14 -335 -211 0 -38 71 364 28 332 -20 -240 80 238 -138 232 -267 -152 347 -129 159 -99
7577 -99 159 -297 31 -121 21 284 -56 -286 -65 -47 3 283 134 -34 39 146 14 50 22 156 -7 -29
7599 -29 57 56 -155 -208 8 -398 -146 36 -462 -199 45 9 -455 174 -538 -471 -300 -504 -117 -152 347 -14 295
7622 295 112 -130 231 115 -73 217 -144 -108 -27 76 -85 152 102 20 -265 -162 -429 58 -89 -256 -346 -439
7644 -439 -78 -121 -362 406 -43 -141 195 285 27 340 -349 98 248 103 -417 -203 327 197 306 -423 29
7665 29 226 322 171 509 -310 54 104 371 -49 -94 80 435 -503 -163 -249 209 -354 -74 219 -168 368 -297
7687 -297 -58 -395 53 11 121 308 -5 -362 122 -141 -27 14 5 -105 22 127 56 115 -126 124 64 -51
7709 -51 50 53 -133 -164 49 -97 45 67 120 32 44 172 -55 -23 -56 -296 143 -102 -83 19 -43 107 16 99 142
7734 142 78 -74 348 -281 -151 -51 506 391 -190 5 -64 27 129 -117 -235 36 47 20 -195 -133 126 358
7756 358 -456 -123 79 14 -206 134 246 -1130 219 168 -185 450 -14 35 191 180 141 -46 -39 -158 -134 -13
7778 -13 -180 -77 -10 179 -228 136 164 106 -540 700 440 358 450 -246 -365 -134 78 -521 -216 61 259 -58
7800 -58 -110 -70 475 17 -192 -336 -222 -166 195 149 -197 70 286 -202 -147 -170 418 41 -629 196 -52 -10 19
7823 19 -67 -87 72 111 -367 6 -413 46 156 -168 208 -547 173 102 31 314 562 27 -150 -167 -347 -445 81
7846 81 -190 15 -162 -323 180 -599 -164 615 441 -70 9 -858 256 137 -92 -129 393 316 -150 -66 -56 -210
7868 -210 -199 -356 -122 81 281 -147 -76 64 228 99 -176 -245 -135 -72 48 -5 -74 -236 28 89 -21 -108 -125
7891 -125 11 -224 -80 24 24 84 -184 -91 -240 -45 80 80 92 -47 -85 14 22 258 121 21 7 -259 -52 -12
7915 -12 -208 137 189 5 -130 -122 -90 26 -20 -72 275 -13 106 -30 86 84 -99 -143 36 -33 76 112 50 102 -47
7940 -47 -89 -132 55 80 45 95 320 41 -182 113 -157 -73 222 -330 44 -15 18 199 135 16 72 22 -76 216
7964 216 73 -125 -225 -55 -218 95 75 147 -71 78 -147 -9 -38 50 -34 161 9 -132 -190 -179 222 -5
7986 -5 -43 -226 -127 -53 -83 64 -82 9 -32 88 151 47 151 -33 178 38 157 54 281 82 123 210 -101 64
8010 64 51 9 79 238 -159 -155 178 18 -27 -103 49 -145 -108 183 100 -27 41 55 -141 -200 -166 -258 -190 -9 -64 1
8036 1 -10 25 -9 48 -121 185 109 -65 79 27 203 14 -12 -101 125 -97 -93 112 307 -460 -1154 344 75 -49
8060 -49 -290 541 -543 373 73 313 144 -3 -104 52 288 -17 148 -23 35 -232 77 -26 -110 27 40
8081 40 341 43 64 -133 -63 -145 143 49 132 239 9 -119 -195 -62 76 -72 -90 192 29 15 102 -111 -99 -164
8105 -164 -147 -85 -104 138 -178 -34 -267 27 -212 108 -8 165 137 125 96 80 153 -334 -34 71 -349 -29 -568
8128 -568 -430 16 58 88 -216 90 -141 73 -33 144 65 39 -139 -263 98 -150 -211 35 -59 190 -38 -31 191
8151 191 97 130 -140 10 194 101 54 64 18 63 -6 -31 -98 90 427 -50 59 102 44 294 -68 102 343 28
8175 28 1 78 191 -67 -43 207 -114 263 48 181 -302 -23 72 67 287 -111
8191a11
$$ Imaginary data points
##PAGE= N=2
##DATA TABLE= (X++(I..I)), XYDATA
0 0 0 0 0 0 0 0 0 0 0 0 -8 8 -8 8 -16 16 -24 32 -32 40 -48 62 -72 83 -98 115 -134 155 -179 206 -235 270
32 270 -305 346 -392 441 -497 554 -622 695 -772 858 -954 1056 -1168 1290 -1424 1572 -1734
49 -1734 1907 -2102 2315 -2553 2814 -3110 3439 -3817 4247 -4747 5334 -6035 6890 -7958
63 -7958 9347 -11222 13916 -18153 25844 -44493 196037 143364 -23947 232995 386212 357174
75 357174 -60799 -130715 131753 253782 71633 -202890 -231131 69040 132095 -67161 -256782
86 -256782 -181565 67009 94044 -123037 -241044 -122051 48288 8408 -180576 -257254 -108561
97 -108561 -10940 -74407 -192347 -198751 -60577 19283 -48318 -91240 -53232 26405 75959 14302
109 14302 -5119 30497 36364 48361 15322 10004 21436 -9397 -6058 25475 33565 16778 -20674
122 -20674 2326 88838 86951 16677 -26918 24614 113659 73023 -54418 -92166 5582 76229
134 76229 2146 -135922 -131345 26004 85697 -21602 -134713 -75626 108037 142005 -17363
145 -17363 -102006 3232 169137 156896 -45039 -95439 58616 189308 127704 -70106 -73162
156 -73162 129482 223896 112938 -43225 -1380 213572 259492 95566 -23049 52942 233179
167 233179 219992 27082 -56765 56924 190763 134294 -42341 -79891 65140 157442 71087
178 71087 -69159 -61545 78881 126919 15301 -90123 -50760 53276 63181 -54478 -122634
189 -122634 -60622 8901 -2832 -92206 -117572 -45337 3277 -19810 -65382 -63321 -8545 16638
201 16638 -14140 -26824 -20466 -339 3264 -13841 -3641 -275 -10308 -11391 8053 29633 22180
214 22180 -10622 -3383 51564 67113 31366 -15663 7317 78096 77062 -378 -45190 3570
226 3570 75288 54790 -51979 -75464 10008 76271 31166 -82538 -77146 38444 87413 3231
238 3231 -101001 -67736 61414 81286 -42173 -117728 -51318 75998 64483 -75263 -116296
249 -116296 -10892 96959 50791 -81054 -90171 44327 117558 35965 -74890 -52320 85551
260 85551 119362 13382 -69128 -12157 104211 104123 -6287 -57721 26262 109124 80559 -19144
272 -19144 -38678 51508 101327 49842 -28711 -20106 55514 78901 15165 -34452 -7635 45011
284 45011 46479 -15205 -37945 -4755 23239 9448 -31753 -34151 -6286 470 -18743 -29244 -23560
297 -23560 -11391 -17352 -28084 -13793 -9503 -19274 -31266 -22398 3908 -869 -34503 -40067 -4944
310 -4944 20340 1209 -45462 -34136 25446 43271 1045 -43607 -11733 59556 60675 -10647
322 -10647 -42440 8394 76564 53348 -38242 -51415 23833 78711 29842 -60826 -49956 47383
334 47383 82616 7729 -68099 -33436 69379 77014 -22239 -79991 -22573 68282 47066 -61661
346 -61661 -95262 -11658 58233 15387 -82191 -86753 11743 59750 -714 -79237 -58207 34857
358 34857 58158 -18219 -77120 -37525 35451 37178 -41472 -75609 -23537 33196 19989 -42679
370 -42679 -52765 4371 44925 20944 -22259 -20633 26523 46479 12128 -14290 -9492 18575
382 18575 22784 -4374 -17727 -8513 3316 4425 -1717 -5103 3452 1121 5282 15896 12083 3639
396 3639 -10669 -3407 15044 4947 -26292 -39047 -18066 6492 -7010 -51161 -48207 -6035 21643
409 21643 -2806 -50801 -35399 22233 39031 -9350 -54595 -29945 33838 32745 -36670 -68775
421 -68775 -25620 40169 22758 -50772 -62588 6049 63038 29062 -41917 -36527 46519 80718
433 80718 22288 -45621 -24477 55999 64270 -11436 -64352 -18804 53605 45164 -31256 -59398
445 -59398 6058 65069 39296 -31364 -39531 27903 66275 17777 -46126 -38484 18493 35384
457 35384 -23617 -69334 -44518 5831 10278 -40866 -62129 -25135 14778 7480 -31598 -39589 -6783
470 -6783 14668 -6410 -34118 -39233 -16716 -10024 -28147 -40591 -37176 -22899 -18576 -21624 -19466
483 -19466 -13563 -12761 -6368 1637 6231 492 -14122 -8449 8444 5530 -16072 -35807 -21177 8748
497 8748 1839 -31072 -37661 -5783 32310 17731 -24090 -21648 22718 51592 17693 -33081 -23984
510 -23984 28392 41254 -9837 -55311 -28947 32370 33208 -25119 -53942 -4740 55921 41028
522 41028 -22282 -36129 25339 68959 31429 -34202 -34268 28228 53157 122 -56066 -34911 27758
535 27758 40989 -15815 -52107 -12779 42631 39794 -18070 -39912 3577 42497 18960 -35297
547 -35297 -44988 -3561 19788 -13844 -53013 -48496 -6720 6270 -24264 -45643 -29707 4651
559 4651 6754 -19263 -30722 -11825 5349 -1581 -22890 -28882 -13625 -9796 -15126 -24285 -21858 -9941
573 -9941 -8622 -8676 -3551 1203 1990 2487 6697 15414 12495 -1808 -1407 8446 16396 4145 -16897 -10268
589 -10268 11557 17092 -3562 -20523 -6230 25827 22551 -7695 -20109 2935 32632 15614
601 15614 -24562 -32675 1539 22358 -5531 -47235 -41621 4508 17181 -19277 -53041 -30766
613 -30766 18569 21177 -24938 -49552 -13663 28652 16957 -35209 -47615 -1872 30250 5472
625 5472 -43091 -39502 11103 35285 -302 -36743 -17763 31152 42531 -298 -25766 1489
637 1489 40412 35379 -8419 -23673 7690 35851 19146 -17110 -20273 13186 29390 7238 -17636
650 -17636 -13068 15837 20665 -1588 -17340 -7972 10602 6810 -12155 -18789 -8443 -1703 -6949
663 -6949 -18358 -16567 -8922 -10506 -12702 -11989 -7374 -7531 -12940 -10773 -1034 -70 -10290 -15533 -6075
678 -6075 9084 3468 -14757 -16290 3892 18160 3792 -18388 -12387 17201 24779 419 -20367
691 -20367 -5012 27870 25855 -7843 -23917 2735 32517 19673 -20252 -26849 9569 31681
703 31681 7772 -31501 -25524 15836 28056 -7056 -39489 -20838 20488 21960 -20582 -40272
715 -40272 -11282 24822 14718 -28230 -36139 -748 25827 4336 -32565 -29784 8496 23959
727 23959 -4156 -30396 -17419 19096 22715 -6743 -22304 -2395 25783 19303 -7794 -14816 7683
740 7683 23875 12116 -10655 -10320 10883 16653 3676 -10027 -3955 11449 11633 694 -4078 3764
754 3764 10041 7374 -380 538 3718 689 -2325 -3222 448 -2725 -8365 -7928 1049 3264 -4471 -11010
770 -11010 -4127 12482 8378 -6592 -10921 2475 16644 6859 -14373 -15005 6839 15743 -776
783 -776 -22468 -14106 15357 20047 -3242 -21570 -3602 26256 24047 -7809 -20847 4953 29405
796 29405 16207 -20415 -24763 6816 26145 3389 -28852 -21933 14091 27536 -1815 -26312
808 -26312 -9690 25007 28066 -7000 -23920 -2813 26704 17060 -16581 -25864 1341 21996 5755
821 5755 -21011 -20067 9308 22913 4882 -15108 -7877 19217 22775 2372 -13059 -1733 15238
834 15238 11198 -8285 -15161 -2565 7154 2483 -11526 -8836 1870 7358 1709 -2637 768 6407
848 6407 5304 888 1439 1230 -1137 -4778 -4910 598 -2735 -9666 -9644 -299 5505 229 -7500 -3125
864 -3125 12798 15305 2609 -8088 2125 18445 14138 -7053 -14838 2710 17744 8461 -15273
877 -15273 -14329 10650 24078 8512 -13602 -3758 24475 30527 5333 -13281 1786 28346 23872
890 23872 -7959 -20015 1920 25278 12476 -18154 -19168 9667 28197 8682 -16811 -8724
902 -8724 21558 28883 3093 -18250 -5773 20352 15868 -11932 -25706 -7790 13405 4393 -19702
915 -19702 -23087 -189 14096 3347 -16155 -12042 8361 13667 -122 -15122 -8601 5281 4598
928 4598 -9967 -17430 -9233 273 -1598 -11083 -9616 -1396 4028 2900 -495 2850 6310 6983 3762
943 3762 5483 5829 2379 -50 1365 6770 5462 -762 -2550 6024 14123 10150 1197 3804 18131
958 18131 22309 12015 -277 5116 20482 19017 1121 -9583 1224 16394 11909 -9072 -13341
971 -13341 4993 19583 10318 -11276 -8876 12288 22011 4339 -16455 -9887 11623 13889 -9115
984 -9115 -23603 -11274 10704 7155 -16488 -24045 -4297 15600 5266 -15156 -16251 6241 18156
997 18156 3021 -15078 -10652 8955 13197 -3847 -18587 -7891 10868 9967 -6827 -13579 1168
1010 1168 16390 11195 -3909 -4476 9325 17075 8519 -4683 -1707 8908 10675 1089 -6489 -1522
1024 -1522 6676 5324 -2408 -3096 2762 6718 4477 310 2194 5330 4582 778 956 2027 1242 -3191
1040 -3191 -3991 410 948 -2483 -7036 -2711 5221 4659 -3557 -4961 3170 10017 5375 -6256 -4883
1055 -4883 6630 11520 1268 -10681 -4353 10078 11120 -3380 -11378 -35 15581 11759 -6104
1068 -6104 -9072 6857 19859 9026 -9524 -8077 10965 18200 1723 -14248 -6933 13146 14295
1081 14295 -4284 -15699 -2544 16167 10996 -8475 -14537 2585 16298 6357 -12514 -12390 5322
1094 5322 13255 171 -15580 -9353 6834 9384 -4244 -14495 -4764 8546 7159 -5668 -10488
1107 -10488 -395 9137 3904 -6844 -6268 1978 7439 1206 -5078 -2632 3941 4727 -748 -2292 291
1122 291 3705 1796 -484 802 2383 1663 -236 1362 3714 3007 -1632 -1109 3696 4843 716 -5376
1138 -5376 -1315 5734 5225 -3002 -7623 -100 8015 4546 -7009 -7811 3095 10479 2530 -9192 -5952
1153 -5952 6998 11595 -1094 -11150 -4575 9851 9627 -5824 -12684 -1277 12764 7078 -8394
1166 -8394 -10985 4132 15123 5139 -9707 -7765 9018 14563 1220 -11919 -5490 10604 10750
1179 10750 -4212 -13414 -2467 11067 7968 -6853 -10756 2364 12799 6009 -7446 -7025 5376
1192 5376 11194 1469 -9544 -5806 4897 7037 -3284 -9517 -3591 5336 4770 -3799 -5964 502
1206 502 6504 3527 -2632 -2676 2410 4021 245 -3277 -2727 240 -1081 -2831 -2685 -1952 -1533 -2458 -646
1223 -646 1297 1368 -1625 -1127 2393 4406 1282 -4658 -2886 2582 4073 -3287 -8317 -3298 4855 4156
1239 4156 -5066 -7394 889 10254 6052 -4937 -5208 5873 12632 3546 -8395 -6211 7309 10085
1253 10085 -2269 -12371 -5389 9476 8739 -4504 -11389 246 13645 8950 -6187 -9279 4421
1266 4421 13561 4468 -10789 -9536 4347 9554 -2291 -14043 -7634 5840 7660 -4492 -11546
1279 -11546 -2156 9218 7445 -5262 -8237 839 8638 2619 -8289 -8300 124 4281 -2910 -9403
1293 -9403 -6880 1717 3015 -2909 -5283 -1610 4777 3326 -1220 -2184 1192 2719 196 -2550 -2242
1308 -2242 -369 -1644 -2788 -1631 115 -137 -1670 358 3689 4627 1190 235 3347 7143 4992 -1275
1324 -1275 -1767 3417 6815 994 -5035 -2534 5688 7759 -81 -4371 1381 11049 9898 -199 -3522
1339 -3522 4786 12696 6380 -4707 -6353 4362 9156 -274 -10412 -7427 4739 7158 -3616 -11593
1353 -11593 -3652 8120 6508 -5792 -11421 -1624 7182 1559 -11354 -13375 -2822 3606 -4458 -15247
1367 -15247 -12440 -1062 3304 -5833 -12845 -6600 3878 4274 -5035 -9491 -3042 5077 2111 -6647
1381 -6647 -8535 -1210 4009 -173 -6118 -4442 2427 5493 1762 -1480 1615 6912 6418 3460 1680
1396 1680 4156 5567 3950 1697 1218 2330 1867 1082 462 2503 2137 657 1406 3731 4807 2082
1412 2082 -448 1331 4787 3300 -1930 -4170 -605 3212 -383 -6040 -6228 844 4124 -1110 -6623
1427 -6623 -3871 4792 6084 -1269 -6592 -1144 6823 4867 -4276 -8331 166 6775 2573 -7070 -6835
1442 -6835 3273 8770 2064 -6532 -3066 7480 9921 530 -6425 -576 8366 7341 -3628 -8185
1456 -8185 -134 7219 2986 -7105 -7500 1077 6918 -15 -7453 -5389 3670 5369 -2333 -7679 -4268
1471 -4268 3402 1761 -5622 -8533 -3588 1815 -1462 -7031 -6941 -1418 1266 -1797 -5371 -3460 1284
1486 1284 1017 -1844 -3500 -916 1369 -419 -2105 -1592 297 36 -915 -1142 1067 1615 -64 -312 1857
1503 1857 3953 2069 -486 -117 3675 4645 551 -2129 433 5193 3779 -2157 -3627 1942 6316
1518 6316 2513 -3869 -3522 4323 6768 548 -5688 -2242 6175 6419 -2069 -7068 -403 7146 4640
1533 4640 -4520 -6951 1921 7844 2624 -6329 -5297 4010 8005 401 -7094 -3196 5920 6762 -1891
1548 -1891 -6870 -1186 6935 4971 -3560 -5663 803 7066 2716 -4708 -5186 2056 5572 528 -5125
1563 -5125 -3071 3204 3878 -743 -4953 -1771 2971 2048 -2375 -4418 -969 1653 -259 -3331 -3166 -746
1579 -746 -166 -1360 -3061 -1823 -527 -1360 -2065 -1537 -437 -1327 -2171 -1972 -476 -653 -2881 -3645 -1442
1596 -1442 665 -1005 -3748 -3324 1293 2355 -799 -3742 -1418 3929 3571 -1458 -3764 483 5265
1611 5265 3280 -3158 -4236 1974 5933 1959 -4494 -2782 4610 7072 1105 -4728 -446 6692 7193
1626 7193 -992 -4942 374 6868 4373 -4007 -5717 1201 6640 1538 -5593 -4838 3127 6703 217
1641 217 -5347 -2501 5306 5928 -1471 -5760 -1714 5069 2849 -3787 -6248 -357 4225 1048 -4248
1656 -4248 -4112 1876 4256 818 -3147 -1277 3183 3416 -364 -3249 -778 1559 769 -2330 -3179 -895
1672 -895 51 -613 -1932 -1070 -63 417 -682 -19 742 185 -893 -862 505 219 -1891 -3141 -1674 717
1690 717 -387 -2988 -3578 633 2998 596 -2573 -1609 3538 4666 168 -3671 -771 4655 3953 -2334
1706 -2334 -5164 -39 4995 2617 -3924 -4219 2561 6837 2338 -3946 -2135 4772 6895 320 -5254
1721 -5254 -1839 4602 3868 -3462 -7460 -2078 3903 1321 -5408 -6583 -189 4450 32 -5814 -4729
1736 -4729 1535 3565 -1672 -6713 -4154 1313 1157 -4037 -7097 -3164 1149 351 -3770 -4340 -55 3031
1752 3031 1179 -2331 -947 2495 3454 1452 -1379 341 2146 1856 -90 -486 978 2247 1812 1531
1768 1531 1803 2414 2467 2181 2348 3261 3338 1574 1816 2311 2681 775 -1172 -161 1771 1240 -1334 -2411
1786 -2411 501 2578 1230 -2434 -2000 1733 3011 -102 -4107 -2889 972 1641 -3016 -6308 -3217
1801 -3217 1400 940 -4203 -5796 -1228 3455 892 -4238 -4305 1368 4314 -231 -5295 -3633 2220 3358
1817 3358 -2321 -5968 -2817 3148 2525 -2769 -4863 -73 4980 2884 -2300 -3024 2151 4862 1457
1832 1457 -3367 -2705 2080 3351 -789 -4488 -2171 1983 1971 -1456 -3399 -256 2626 1762 -1935 -2128
1848 -2128 427 1981 373 -2624 -2094 -10 517 -1359 -2473 -1561 -95 -2 -1001 -566 239 374 -105
1865 -105 162 966 1103 15 -515 684 1120 481 -1390 -770 1335 1940 -224 -1426 299 3186 2977
1882 2977 -368 -1267 1533 4095 2247 -1871 -1764 1988 3596 152 -3367 -2020 2342 3235 -1409 -4092
1898 -4092 -605 3521 2597 -2420 -3827 468 4098 1323 -3322 -4073 924 3652 -518 -4850 -3042
1913 -3042 2162 2831 -1614 -4787 -1314 3460 2374 -2142 -4070 560 3251 1715 -2846 -3198 1005
1928 1005 3099 183 -3561 -1777 1602 2262 -731 -2859 -932 1883 1504 -1474 -2105 -205 1444 238
1944 238 -1920 -1646 47 773 -642 -1688 -1277 -110 -150 -1053 -956 -312 -338 -667 -539 -65 77 -986 -948
1963 -948 -122 837 308 -1708 -1119 865 1640 -124 -2086 -746 1919 2141 -839 -1895 220 3309 2076
1980 2076 -1480 -2088 1103 3962 1269 -2304 -2049 2248 4042 -48 -3301 -1505 2918 3465 -1334 -3828
1996 -3828 -439 3574 2450 -2032 -3426 699 3947 1638 -2679 -2686 1689 3491 298 -3458 -1863 2284
2012 2284 2822 -638 -3549 -957 2438 2432 -1266 -2723 404 3077 1912 -1721 -1594 919 2380 266
2028 266 -1856 -1498 736 1405 -605 -1957 -699 1227 828 -574 -951 -56 811 -38 -444 -828 5 -276
2046 -276 -794 -609 -399 121 -1085 -724 -169 234 -581 -1386 53 817 787 -832 -1273 467 1797 535
2064 535 -2049 -1360 739 1709 -455 -2770 -1114 1776 2233 -1255 -2210 175 3148 2002 -1163 -2144
2080 -2144 1141 3656 1206 -2217 -2152 1720 3096 -265 -3380 -1323 2717 3145 -695 -2860 107 3633
2096 3633 2440 -1605 -2730 835 3402 867 -2783 -2744 561 2402 -402 -3678 -1892 1645 2121 -1088
2112 -1088 -3052 -986 2248 1553 -1419 -2136 -6 1921 359 -2096 -1804 110 1108 -345 -1620 -600
2128 -600 1290 1256 344 -4 875 1932 1437 814 922 1639 969 849 856 1163 1140 374 767 1543 1931 1066 131
2149 131 1104 2386 2324 767 -135 893 2380 1260 -1333 -1632 545 2010 -200 -2469 -2033 1009 1643
2166 1643 -1159 -2967 -1344 1803 1261 -1904 -3480 -895 1485 12 -3549 -4068 -608 1207 -623
2181 -623 -4169 -3199 877 1699 -896 -3310 -1148 2336 2216 -1043 -2442 270 2509 1602 -1964 -2066
2197 -2066 736 2899 792 -1658 -1080 1705 2983 630 -489 136 2983 2686 364 -614 784 2429
2213 2429 1504 -628 -1118 828 1357 481 -912 -691 877 1253 312 -414 197 1138 382 -23 -236 103
2231 103 100 -179 -428 -139 82 -535 -554 -20 493 256 -289 -109 984 1491 205 -295 314 1971 1177 -533
2251 -533 -1024 368 2013 893 -878 -1271 1305 2380 816 -1784 -798 1975 2162 -25 -2157 -662
2267 -662 1728 1024 -1337 -2692 -70 1615 516 -2127 -2268 465 2399 -383 -2319 -1379 1056 2525
2283 2525 -1525 -2775 -1018 1303 1856 -1291 -2381 203 1641 972 -1169 -1232 463 2644 490 -1271
2299 -1271 -802 1529 2011 464 -1486 -422 1577 1293 -322 -1113 -42 983 650 -678 -628 599 942
2316 942 250 -325 156 672 368 166 23 599 208 -116 -289 347 259 -351 -537 -118 887 611 -311 -436
2336 -436 772 1522 299 -949 -369 1468 1437 -267 -1060 -33 1636 1021 -668 -1535 699 2004 1019
2353 1019 -1212 -1277 1245 2064 436 -1837 -889 1582 1944 -627 -2483 -557 2141 1117 -1560 -2122
2369 -2122 52 2021 632 -1975 -1633 743 2188 -38 -2123 -1223 1323 1655 -698 -2130 -582 1785
2385 1785 1134 -677 -1660 147 1643 472 -1151 -1048 645 1401 393 -960 -726 1001 1380 218
2401 218 -872 105 887 691 -308 -496 173 837 107 -326 -63 534 112 -10 -185 287 -9 32 -339 329
2421 329 349 -294 -516 -177 743 98 -679 -936 292 1058 -47 -1009 -575 902 1106 -149 -1192 -348 1093
2440 1093 1284 -504 -1483 166 1797 1092 -945 -1591 446 2024 526 -1419 -1462 975 1979 208
2456 208 -1679 -681 1666 2045 -417 -1815 -366 1836 1047 -1188 -1847 90 1601 308 -1528 -1558 715
2473 715 1642 80 -1735 -1001 795 1105 -535 -2014 -616 893 373 -1086 -1497 34 669 93 -1110
2490 -1110 -841 166 592 26 -823 -179 658 638 -357 -272 125 568 460 -155 56 451 491 342 195 592
2510 592 527 346 20 864 1086 696 -246 2 1103 825 -67 -653 245 1270 252 -581 -961 703 1120
2529 1120 205 -977 -502 1004 1044 -345 -1492 -616 1140 903 -1230 -2087 -492 1309 434 -1618 -1610 69
2547 69 1442 -17 -1793 -1365 1033 1471 -560 -1694 -1145 1177 1239 -1211 -2057 -504 1448 547 -1071
2564 -1071 -1368 370 1682 238 -1469 -1081 1123 1117 31 -1429 -710 978 802 -547 -1388 -48 721
2581 721 465 -394 -526 485 957 386 -173 -124 548 780 25 -382 198 263 173 -137 13 -37 106 -41 -48 482
2603 482 241 -19 -314 389 431 329 -477 -166 530 314 -354 -787 -342 739 568 -646 -1144 -14 807
2622 807 262 -1100 -1192 447 978 -350 -1719 -1041 476 734 -779 -1800 -781 1191 561 -964 -1431
2639 -1431 103 1516 619 -1023 -939 775 1658 65 -1463 -506 1275 1462 -390 -1289 -72 1290 1233
2656 1233 -328 -1145 404 1266 825 -808 -864 725 1446 266 -1199 -571 839 884 -590 -1166 -456 448
2674 448 374 -820 -1017 -269 484 -26 -887 -602 -360 180 -295 -653 -704 -37 -263 -481 -438 -386 -416 -387 -390 -63
2696 -63 -36 65 -389 -19 575 198 -317 -316 395 516 -354 -886 101 627 877 -425 -692 233 1160 900 -593
2717 -593 -714 477 1319 352 -1197 -638 434 1119 -349 -1418 -520 933 1126 -778 -1635 -341 930
2734 930 411 -1099 -1305 -25 1263 155 -1376 -1106 310 879 -363 -1561 -719 545 847 -266 -1244
2751 -1244 -154 868 984 -714 -1117 293 1325 405 -616 -391 626 1014 306 -329 -322 592 975 -216
2769 -216 -271 162 896 522 -119 62 311 211 -13 -81 -278 280 -47 -211 -16 -59 -174 -458 -497 -154 54
2790 54 -445 -667 -469 333 -99 -607 -802 -193 350 13 -807 -730 214 614 -511 -998 -471 495 642 -361
2810 -361 -1100 112 1164 529 -733 -903 439 1269 170 -853 -619 664 1097 -102 -1121 -396 1132
2827 1132 919 -374 -1224 83 1076 346 -908 -1091 161 1035 275 -1142 -863 690 816 -86 -1035 -618
2845 -618 775 583 -428 -941 -36 448 514 -555 -647 -78 889 193 -520 -367 101 650 89 -528 -39 516
2865 516 308 -25 -89 175 655 489 155 73 209 288 -133 170 153 127 -117 -1 126 96 -66 -135 -203 134 181
2888 181 -430 -505 179 530 193 -865 -755 15 609 -455 -655 -592 505 751 -503 -1018 -249 565 779
2907 779 -535 -1189 48 918 385 -715 -1225 309 892 30 -691 -716 775 691 -307 -1351 -340 537
2925 537 446 -597 -864 -215 979 442 -937 -699 -94 696 -163 -917 -760 116 829 -243 -884 -576 465
2944 465 446 -392 -451 -86 510 291 -211 -477 373 526 142 53 -196 457 363 250 -173 232 525 364 314 204
2966 204 380 313 315 50 246 637 130 -51 581 366 -83 -95 89 497 77 -428 -437 -5 508 208 -666 -521
2988 -521 133 395 -231 -902 -540 213 204 -428 -937 -457 447 487 -658 -1135 -106 798 307 -591 -968 154
3008 154 683 63 -842 -691 384 991 151 -869 -260 673 833 -310 -877 180 972 725 -402 -591
3026 -591 381 844 291 -661 -297 492 679 123 -823 22 463 735 -38 -506 -31 703 342 -240 -183 -40
3046 -40 333 76 -283 -260 254 176 -326 -354 -409 175 -292 -220 31 239 -163 -97 -118 -209 24 -396 98 -131 224
3069 224 141 -309 -6 312 348 -8 -403 -6 368 374 -4 0 -69 431 381 -386 -516 60 715 -11 -687 -419 718
3092 718 1012 13 -971 -124 715 392 -255 -756 -148 568 337 -700 -768 395 495 143 -815 -372 620 760
3112 760 -173 -1126 -141 613 621 -310 -547 -394 684 281 -585 -769 113 712 332 -662 -482 146 581 -19
3132 -19 -453 -320 216 456 -232 -351 10 261 161 -321 -357 55 27 74 -240 -118 182 138 -184 -64 -59 -37 -110
3155 -110 56 323 111 -121 -24 9 314 33 -127 -231 20 306 -87 -394 -264 321 344 -160 -628 -90 455
3176 455 292 -502 -599 -26 659 230 -379 -399 439 730 158 -653 -404 707 571 -444 -496 -254 935 652
3196 652 -291 -569 110 918 412 -699 -621 307 730 272 -629 -461 348 787 -47 -692 -238 521 424 -240
3216 -240 -714 -248 443 273 -387 -435 86 448 -31 -282 -334 236 415 83 -333 47 218 262 -92 71 112
3237 112 -40 58 -169 -305 22 -192 -37 248 160 -46 -111 -52 333 442 -61 231 -17 311 225 -16 -282 68
3259 68 340 109 -431 -357 142 547 -119 -555 -127 287 472 -318 -637 -78 507 386 -636 -639 366 635 262
3280 262 -687 -455 483 719 213 -748 -357 439 627 -386 -678 -106 661 608 -480 -773 37 822 225 -440
3300 -440 -491 330 815 76 -429 -483 329 410 -65 -709 -147 607 257 -267 -825 429 859 498 -690 132
3320 132 396 348 207 -626 405 150 302 -176 -115 278 -128 -104 3 137 462 277 237 138 139 279 36 -55
3342 -55 215 -38 -80 -276 -158 267 332 -107 -309 376 330 290 -368 -309 -20 307 -45 -366 -584 368 412 -179
3364 -179 -771 -188 514 502 -249 -900 -100 577 387 -713 -385 3 637 128 -750 -491 446 955 -118 -759
3384 -759 -290 572 400 -160 -569 -175 636 263 -254 -470 186 764 663 -107 -319 611 538 -118 -641 -193
3404 -193 1131 24 43 -167 -154 310 585 -592 -350 401 30 -102 -550 18 71 -88 -104 -1 10 50 110
3425 110 -342 45 219 26 -87 148 177 -152 -222 -323 204 215 -138 -469 -280 385 186 73 -270 -251 193
3446 193 306 -156 -305 153 354 243 -499 -203 205 395 -166 -755 -239 128 512 -85 -604 66 562 365
3466 365 -283 -454 135 535 151 -513 -515 198 512 -12 -559 -118 369 622 -155 -489 39 626 599 -42 -440
3487 -440 311 609 223 -451 -404 331 520 284 -343 -271 349 277 -152 -216 -421 316 285 -180 -451 233 394 -198
3509 -198 -261 -269 108 293 -56 -246 30 -93 -37 -216 32 147 41 37 48 370 370 -55 -108 128 -71 69 -445
3532 -445 -280 6 456 43 -192 -81 498 456 14 -163 -33 453 131 42 -473 45 246 267 -417 -512 158
3553 158 502 -80 -432 -371 322 605 -142 -320 -22 366 176 -503 -392 -45 461 332 -362 -362 554 377 127
3574 127 -545 -92 423 618 65 -573 -143 527 598 -145 -282 257 539 -3 87 -198 322 659 178 -127 -167
3595 -167 26 167 13 -337 70 458 214 -105 -89 108 157 -142 -102 -231 36 215 -291 -42 -45 73 -176 -242
3617 -242 263 122 -25 99 20 84 -26 -203 -337 27 378 68 -214 -43 131 461 -171 -410 -81 186 400
3638 400 -228 -99 113 561 393 -297 -86 229 447 59 -509 -175 290 540 -260 -428 -213 314 278 -98
3658 -98 -699 -33 447 375 -211 -447 269 496 184 -511 -433 383 445 20 -453 -437 269 35 -363 -468 -123 363
3680 363 112 -291 -182 -17 365 -22 -260 -142 -56 266 -25 -155 25 201 204 -89 -209 91 248 -16 19
3701 19 -61 154 213 85 -7 -39 150 -271 -214 147 96 -213 -193 -200 284 270 -200 -111 -11 173 277 -78 104 0
3725 0 133 47 -367 -60 245 382 -241 -208 58 357 106 -199 -461 -182 390 376 -212 -350 22 162 96 -340
3747 -340 -58 67 531 229 -348 -110 302 595 -314 -448 -121 501 171 -321 -430 -2 339 -142 -458 -329
3767 -329 90 433 -24 -365 -88 256 199 -171 -349 -142 222 151 -147 -108 -181 282 -49 -286 146 57 44 142
3789 142 -119 -63 88 296 -104 148 -35 -11 -68 -114 -55 -28 -316 -276 -6 0 -25 -244 -317 13 75 118 -375 103
3813 103 237 84 -393 -271 30 172 -58 -336 -247 -73 225 -83 -338 -260 207 345 -12 -357 -269 389 377
3834 377 -327 -439 -176 390 201 -450 -482 170 562 -44 -373 -138 292 497 -116 -332 311 274 489 74 -384
3855 -384 -256 230 407 -501 -259 -30 400 144 171 -96 31 126 100 -253 -238 393 -132 -65 -448 35 28 -23 91
3878 91 -294 -69 -206 93 75 -110 -37 -75 -135 -226 -56 -123 74 -253 -99 16 -201 73 -130 95 -42 -135 -252
3901 -252 74 205 121 -244 -154 333 42 -258 -373 -79 92 -60 -142 -217 155 336 -244 -147 -256 211 333 -28
3923 -28 -426 -257 167 523 -188 -590 -30 88 596 -251 -267 -95 393 121 -218 -506 239 488 42 -316 0
3944 0 322 154 44 -454 -319 266 330 -213 -413 53 204 320 -249 -94 276 339 241 -197 -21 360 -35 105
3966 105 -181 30 256 -76 -31 -48 13 -107 -17 -192 -192 39 174 77 32 56 180 -241 124 59 -36 -12 -193 -46
3990 -46 -64 80 -323 -250 -46 18 26 -156 -289 63 -33 -11 -224 -393 160 339 -247 -386 129 81 69 -208 -433
4013 -433 320 341 215 -387 -37 42 189 56 -713 -101 411 330 -182 -370 122 314 541 -304 -379 -9 339
4034 339 -85 -201 -290 125 98 -37 -298 -307 263 159 -255 -392 -223 10 149 -226 -126 -88 206 45 -366 -337
4056 -337 -208 327 -161 -265 14 149 -32 -82 -111 -187 -81 17 -168 71 27 -109 -8 17 258 -107 36 96
4078 96 -74 130 61 -10 136 13 281 140 -137 53 81 155 -352 -171 -27 385 55 -138 -237 111 262 232
4100 232 -266 -297 384 249 64 -186 -127 214 185 -157 -165 27 173 -11 -397 -482 163 117 18 -456 -496 300 191
4123 191 -240 -351 -168 218 -97 -71 -257 146 173 97 -14 -417 27 277 -1 -245 -221 14 337 -240 -215 -84
4145 -84 131 -249 -188 -224 -17 126 -92 -168 266 93 -3 -263 -247 -74 -255 35 -347 -54 -100 173 -146 -207 72
4168 72 -266 -69 -111 215 231 177 117 -242 50 -74 85 -47 -18 -86 94 -144 -273 174 352 58 -1 -90 367
4191 367 133 -229 -120 -134 82 81 30 -445 -78 329 23 -24 -184 111 156 77 4 -118 207 471 11 -314 -109
4214 -109 428 244 53 -131 -192 243 230 -182 -321 -26 396 172 -98 -121 150 322 1 -260 -264 222 158 108
4236 108 37 16 162 222 -11 -56 32 -23 24 55 -248 116 -65 -104 -66 -35 -197 251 -88 -68 -111 -145 83 0 265
4261 265 -81 -270 -88 146 210 -12 42 -17 50 107 -202 -442 -177 138 -46 -107 -197 26 488 192 -46 -160
4283 -160 202 129 -131 -227 90 58 480 20 -314 -62 46 387 100 -14 -198 343 304 -301 -259 299 420 3
4305 3 -225 -153 261 157 81 -456 -28 -124 160 270 244 -77 189 188 -5 18 -22 171 -99 -136 -142 3 98 36 -135
4330 -135 -194 98 402 -63 77 -34 77 80 -7 -25 242 185 41 149 -104 80 175 -44 -143 64 -38 -16 82
4353 82 -52 67 -146 114 29 103 88 -169 -308 202 291 132 -117 -145 75 274 38 -88 21 137 214 -254
4375 -254 -115 24 303 179 -448 -346 -41 280 -207 21 25 309 171 -57 -98 140 131 342 228 -96 74 404
4397 404 202 64 82 -19 415 192 -267 -462 -26 99 121 -419 -74 262 364 100 -18 -14 90 210 82
4418 82 -110 173 110 128 -130 -88 20 233 -113 43 -28 116 226 -172 -211 -66 -29 12 -61 -110 -15 38 -157 192
4442 192 -148 199 -63 -284 76 54 102 138 -83 54 74 -231 -101 19 90 134 -307 25 113 248 56 -185
4464 -185 0 -5 235 85 -224 -19 115 184 -102 -66 142 479 223 -381 -85 -260 180 -51 -29 -308 92 290
4486 290 -76 -221 -134 393 151 -31 -271 22 163 66 71 -322 183 44 -50 -224 -263 27 28 -56 -237 -65 40
4509 40 136 37 -204 -21 332 23 -141 -333 -147 -6 -28 -174 -83 122 66 8 -104 104 158 23 36 157 -121
4532 -121 -249 103 -49 59 -240 -113 -77 239 -160 128 312 53 65 -41 46 -78 114 9 531 154 249
4553 249 239 289 21 -95 -103 154 80 259 -102 -55 -35 190 -222 -335 -63 -23 123 -81 -177 1 17 139 -97
4576 -97 -85 -149 167 -230 -408 -276 -46 89 -155 -507 -126 354 369 -217 25 -212 221 -27 -201 -222 95 147
4598 147 159 41 -652 394 -111 64 -52 -87 108 96 -54 -192 -43 26 50 -64 -88 105 41 85 -34 9 162
4621 162 166 -39 -67 -33 -12 179 62 110 45 76 -6 -279 -179 -82 127 117 -1 72 58 -216 222 213 -1 -55 -17 -7
4647 -7 69 214 -223 -306 71 266 128 -6 -10 30 327 49 -238 -112 115 40 -273 -194 -143 -41 -136 -158 -259 132
4671 132 273 235 85 -66 67 159 111 -100 20 -19 207 71 -82 23 266 124 -226 17 -106 198 -26
4692 -26 -308 -58 44 149 35 -249 -119 86 27 -61 -266 40 -80 -88 -331 -71 52 -518 -165 -107 -184 140
4714 140 3 124 177 -135 49 7 -53 -54 59 41 -152 -78 -69 -52 25 -112 -17 122 279 -78 -60 97 48 67 -176
4739 -176 -1 170 -45 82 -94 -178 -37 68 -138 -185 8 -36 248 -262 15 181 432 46 -58 -90 222
4760 222 261 -37 -315 -63 138 342 -191 -147 -2 189 258 -50 -218 320 385 24 -215 -75 299 149 -69
4781 -69 1 77 21 -84 -31 -117 -31 236 -62 63 41 -104 -126 98 -118 34 -182 -37 25 54 87 -163 55 -39
4805 -39 -218 6 -131 17 -46 98 3 -104 -50 -46 40 -31 10 -122 -8 -67 -84 -24 46 173 31 -296 -219 -93 142
4830 142 -140 -126 -125 142 72 18 -193 -54 65 76 -77 -1 61 259 220 -83 -188 359 -162 57 -38 -20 85 52
4854 52 79 -358 -113 54 154 -168 -62 -156 5 42 -146 -63 110 165 107 -114 -125 148 7 119 43 -138 298
4877 298 325 -59 -153 -299 245 301 -82 -80 -139 182 -1 -47 -82 66 -26 -185 -16 -19 186 215 320 24 441 221
4901 221 54 34 124 -35 -145 32 -148 178 -7 -22 -60 36 -74 75 -40 113 268 22 236 -219 175 16
4923 16 19 188 -85 -94 211 55 -142 -56 -10 249 88 -464 -214 316 15 -362 -425 -52 80 163 -166 -143 303
4946 303 -83 97 -332 -233 -75 203 -167 -59 -43 344 70 -35 -63 -103 65 -29 -24 -71 128 62 69 -34 -158 59
4970 59 325 -100 -336 -92 39 247 -271 -145 223 204 159 190 -137 140 138 122 53 46 56 193 94 -59 373 4
4994 4 -6 -181 330 -71 118 13 -258 186 146 24 98 -38 188 206 -158 -13 -42 -80 -88 -293 20 -14 43 -25
5018 -25 -134 46 -35 -107 -114 73 120 147 -94 -80 76 89 -110 -70 -34 -109 202 241 -159 -296 85 254 -39 -341
5042 -341 62 59 210 -107 -279 -140 6 76 -158 -55 -442 193 96 6 -100 -84 139 214 -194 -150 110 287 147
5065 147 -57 96 123 79 55 7 -3 171 -78 -68 72 200 67 80 -39 20 75 62 -138 -53 -60 -91 -52 -272 44
5090 44 97 -111 9 -156 -41 35 -82 -138 259 -66 81 -121 124 20 90 14 -131 -307 263 -85 41 18
5112 18 161 52 53 70 138 166 35 -2 -52 -467 160 113 73 -183 -234 93 124 36 100 -163 30 113 84 -116 15
5137 15 -22 185 177 -285 38 32 -284 -65 -51 472 -77 -44 -74 -82 -129 110 -40 -114 191 19 58 -81 41 -84 -89
5162 -89 -239 -60 -259 -67 -18 69 209 175 -69 64 107 -36 47 -16 9 -8 151 22 -126 103 -21 -55 -10 -178
5186 -178 8 117 189 -35 150 -248 99 49 94 122 42 -11 35 -129 -169 135 161 74 -154 122 228 212 125 140
5210 140 -84 358 -62 -43 -111 257 -12 -50 -89 -116 11 -37 47 -166 -89 8 133 -172 60 22 -134 1 9 -320
5234 -320 58 129 8 11 41 162 243 20 19 49 52 90 43 -104 -147 -15 66 -23 -84 49 112 104 -154 -39 150 -38
5260 -38 -68 64 -152 -245 213 102 9 24 -10 133 -119 -72 -60 -61 105 -129 43 159 89 15 155 -54 -2 -5 -25
5285 -25 199 152 48 -43 127 23 -28 -87 3 40 -76 -148 -16 -119 3 148 74 -6 72 -60 -79 51 -77 5
5309 5 223 -347 -362 -249 4 210 5 299 22 189 37 -119 -91 -30 39 145 -196 -174 -64 3 271 -167 -269
5332 -269 129 -73 -106 -111 -69 118 -383 52 -44 -123 9 -160 -166 -138 -30 148 -212 71 -13 -159 -40 179 17
5355 17 127 -221 -79 -110 270 156 -86 -22 153 -114 -21 0 -40 316 -162 8 -45 -85 391 40 -30 63 -109
5378 -109 50 -49 50 -264 198 23 22 -72 -168 233 246 -48 -201 -169 -88 83 -132 61 -228 275 -16 157 29
5401 29 -3 200 63 -133 40 144 221 80 -129 -151 138 59 110 -286 30 142 28 -49 -326 -15 -91 67 -45
5424 -45 88 -328 35 71 -58 171 -83 166 -234 -110 152 -138 116 -150 -145 2 175 -9 88 -28 -116 -82
5446 -82 28 27 -70 -130 18 146 36 -167 59 73 12 155 13 20 -74 -171 -45 337 -198 -76 -146 -198 -55 -84 19
5471 19 107 176 95 -157 -77 24 56 -206 -87 -225 115 113 7 -171 31 -37 94 -214 -197 -161 39 100 -175 -71
5495 -71 -97 3 16 -203 -47 -116 129 -26 6 158 232 110 -164 384 -176 253 108 -24 18 197 95 -51
5517 -51 -145 121 -30 -67 -65 -76 -33 112 -168 -144 122 -211 53 120 -108 9 7 217 288 202 106 7 101 74 -84 24
5543 24 -15 -77 -49 -75 -46 67 10 61 -153 -195 122 18 64 97 79 86 -44 -208 -154 3 -199 102 -4 -115 -214
5568 -214 -69 83 -69 -100 17 -241 123 21 -17 -125 -95 183 -13 111 -124 -43 -102 222 -61 -3 -49 289
5590 289 -20 -94 -80 -3 340 8 59 185 -26 -79 -53 -89 -156 -66 -176 106 71 101 182 53 149 -116 171 5
5614 5 210 -52 -31 62 -110 -293 -129 83 -193 114 -6 -3 97 -95 37 99 -135 -103 -49 -91 71 -49 -65 54
5638 54 -185 5 80 272 20 71 -58 -8 -112 116 -211 145 49 2 7 196 -231 -127 -219 151 278 55 76
5661 76 27 82 100 -115 35 -141 141 145 96 93 -158 -17 -6 47 -1 65 202 250 -13 -21 -157 208 -77 -133 -130 -103 -13
5688 -13 -21 -138 -174 -215 243 112 -77 -44 -77 -92 -58 -212 -134 -57 23 65 -100 169 -163 171 -217 30 -180 163
5712 163 -48 -38 -156 -13 -47 -14 32 240 19 321 198 60 -127 126 -28 -104 -17 -108 233 -99 -35 34 79
5735 79 -67 -80 15 11 185 9 -61 5 -226 -297 -114 193 206 5 -254 82 409 82 251 71 -79 -170 77
5758 77 -44 -123 143 -17 111 146 64 62 187 -140 -14 -66 -61 -45 -57 -183 22 55 -136 28 -173 -301 -34 -5
5782 -5 -231 -293 22 -145 -43 85 -43 32 76 -27 -163 256 58 179 102 -47 96 113 -132 -3 -325 -4
5804 -4 49 77 71 97 199 25 13 -81 -103 38 262 -343 -111 -117 194 191 10 -205 193 -6 36 -62 123 84 -55 10
5830 10 -106 -43 240 12 44 181 154 -23 5 35 110 -146 -16 17 44 90 132 -54 -14 81 12 -6 -12 -126 -221 49
5856 49 140 91 159 133 308 -114 17 111 39 -144 -121 122 174 -134 -110 10 164 59 -3 -4 187 68 230 -104
5880 -104 -54 -186 225 166 152 -168 35 -17 -77 91 55 1 105 31 -260 -25 6 117 -121 59 -73 197 42
5903 42 46 60 -32 104 -56 53 188 -54 -80 54 64 155 -148 -99 -225 -275 -75 7 -80 132 109 77 139 -51 96
5928 96 218 -46 -57 146 99 257 27 131 118 4 -113 116 -31 270 -221 151 0 -81 36 -79 189 34
5950 34 159 -136 129 -73 98 -198 -6 155 -166 80 -52 212 -27 347 85 -24 162 194 11 -322 62
5971 62 124 169 -144 -7 136 -28 -31 -110 214 201 -99 -42 346 -125 -191 129 -32 92 -35 -63 -42 -29 100 -24
5995 -24 90 -17 130 -139 76 -57 -136 244 260 116 -84 -57 -191 -227 -32 23 115 -97 36 93 74 225 -51
6018 -51 -104 57 -24 78 -47 94 88 -72 125 187 0 224 -10 95 -125 -112 -61 30 170 -361 -6 1 81 25
6042 25 -32 -264 -25 9 95 74 -59 -72 -25 -209 -211 113 198 134 9 -181 -102 84 -61 272 -25 -172 164 71
6066 71 -318 180 75 310 24 -172 32 98 188 124 -317 -174 -57 -187 27 45 -6 10 89 151 -66 155 -4
6089 -4 -173 167 -389 36 -88 4 185 -87 67 -178 -205 -92 88 -96 164 9 -108 53 -152 -35 -2 -29
6111 -29 37 -120 -184 344 133 -98 -143 97 -142 106 -126 -103 8 248 152 -77 0 -179 -144 -25 203 -200 39
6134 39 261 119 -64 -116 -272 -38 -131 -107 9 21 -39 113 -241 415 -113 -297 102 -25 -201 -11 -344 -5
6156 -5 93 -254 398 -539 60 180 -54 33 -91 106 -17 112 80 -181 54 0 -15 104 66 -93 -7 -14 -19 49 -25
6181 -25 237 0 -109 59 -37 99 -88 -187 92 -143 -92 -84 7 -15 -41 107 157 -40 -21 -147 -29 104 47 120
6205 120 32 14 136 -134 -377 -195 94 158 126 -11 -77 -110 -66 7 -164 -49 126 81 17 191 33 4 -65 0
6229 0 17 104 88 -55 59 12 11 35 52 -19 4 42 66 -110 163 -184 -74 116 103 -164 -57 -18 170 17 -8 -316
6255 -316 158 27 88 195 -28 -95 182 144 -24 -39 273 -50 -112 81 -279 67 -85 -168 -49 236 -159 -162 -4
6278 -4 5 52 -34 24 31 -66 -101 23 97 34 -110 -89 47 91 73 -188 -249 2 -113 -64 106 104 332 -185 -29 28 -136
6305 -136 143 127 111 154 -87 -238 5 -43 138 -104 -80 -18 224 -290 118 201 -18 -161 -12 -43 -7 48 -122
6328 -122 -92 148 98 41 165 -62 153 112 251 180 166 77 68 -54 170 49 88 30 81 -107 188 10 203 -22
6352 -22 23 -226 15 -77 -76 -91 42 -87 191 62 -165 38 38 24 -57 -68 -30 279 205 -183 -155 -1 -24 -2 -52 -100
6378 -100 18 -140 123 77 10 -166 -18 -140 -233 101 -173 -21 -118 195 -69 35 221 -107 -15 -357 333 -108
6400 -108 103 18 -66 79 -89 -6 27 -103 -4 -166 34 -263 -62 168 -241 210 175 35 -116 -135 -213 74 -198
6423 -198 232 -217 92 -60 -319 -204 95 109 -141 271 111 -247 55 16 87 149 105 -185 -205 103 101 15 -130
6446 -130 -49 73 56 116 120 -132 228 -112 212 -227 -173 44 48 -39 -87 -118 -39 -49 67 120 -40 28 170 316 -220
6471 -220 3 -15 272 17 258 -67 104 -92 -52 -39 88 -131 -128 -73 -5 -117 8 86 33 0 -95 9 292 86
6495 86 -229 63 -286 62 -79 -55 -27 -73 22 28 -132 60 20 -88 -32 -32 317 102 -75 52 168 -265 89 -254
6519 -254 43 88 -154 18 142 10 110 118 -20 81 191 18 21 -70 -246 -99 138 5 138 -16 134 -62
6541 -62 101 -75 193 93 -61 -6 -29 -5 0 29 64 11 -132 -156 -146 -119 -36 334 52 -121 61 -103 244 -81
6565 -81 -106 -204 -43 2 125 -89 110 -25 202 -154 101 -95 32 -162 124 198 105 -92 -79 -60 93 155 40
6588 40 -48 -172 49 100 40 -58 78 159 -172 74 118 -75 26 -96 -105 -169 -51 -105 170 -222 -86 207 -24 -224
6612 -224 99 281 0 -107 -48 199 41 -137 191 -198 193 0 198 179 18 -228 -112 16 68 50 -207
6633 -207 -38 122 90 -206 327 190 96 86 -129 -147 31 40 156 110 256 -8 -77 152 -203 -146 168 -5 64
6656 64 137 -94 -11 69 -293 -58 217 37 51 17 -170 -168 -43 -57 13 -42 -73 -96 72 -118 -53 -181 130 -72 -68
6681 -68 -287 -172 -15 -176 43 194 -102 -243 60 132 66 -25 -135 7 -59 -85 44 339 -69 -281 -186 59
6703 59 219 -70 -4 220 -172 -27 -292 -133 -102 213 55 117 272 -159 -24 -77 9 128 -106 -145 96 32 2
6726 2 -20 19 -24 -13 137 6 129 -114 -141 19 118 -79 -7 73 19 -15 40 115 -103 74 -179 51 -34 -117 -127 -21
6752 -21 114 -78 -144 150 -201 -15 -188 12 -105 -52 -40 -142 200 56 24 80 -118 -97 80 -108 85 -55
6774 -55 111 87 1 43 20 50 -6 34 -57 198 -140 -18 59 -77 11 -136 110 203 -115 -29 -187 3 160 -152
6798 -152 72 16 -70 36 -189 -74 207 72 17 8 -8 -84 236 -132 -58 7 -189 251 1 -75 145 98 -166 -182
6822 -182 -67 -44 -73 54 -110 99 -243 -366 64 11 -127 -198 -189 -140 -79 -111 25 88 -77 -66 151 -34 -11 -292
6846 -292 -166 287 20 -136 115 -63 88 20 -120 -77 17 -201 173 -153 -222 -26 -123 101 -37 191 -25 142
6868 142 140 -106 285 20 -105 183 54 -65 148 -105 -67 -217 28 21 57 -172 133 75 -174 -186 -24 54 176
6891 176 171 226 27 105 44 206 -129 350 35 293 -19 130 42 40 -38 209 113 -248 189 -17 -109 114 144 -170
6915 -170 -149 285 143 16 -134 -88 259 -36 169 -235 275 54 -20 -235 149 157 -78 55 8 50 105 90 -105
6938 -105 200 264 70 -59 3 117 24 -11 -31 121 -139 -36 129 68 -25 -85 -36 46 -51 -321 10 76 58 6 118
6963 118 -111 -79 -111 -57 22 195 -21 160 -212 -46 -179 24 -239 21 203 -95 54 -53 -43 -106 -156 18
6985 18 19 103 43 91 -296 81 118 173 -209 69 0 14 137 153 32 -100 -196 93 190 -27 165 -37 16 112 94
7010 94 -101 -50 81 -42 74 -216 -143 -105 214 35 -5 55 -68 244 314 488 -202 -44 20 -14 105 48 -23 255
7034 255 17 -113 -97 -158 104 -22 335 -18 50 -124 49 -636 -2 266 -41 157 -325 -18 -134 -77 -106 -31
7056 -31 -103 201 316 -27 -73 29 160 -167 177 71 -180 -161 67 106 -231 85 -41 43 74 -62 -96 -2 -28
7079 -28 102 160 -132 32 -239 -261 89 12 -146 79 -170 75 87 -213 -75 96 -63 -150 -95 82 74 -273 -91
7102 -91 -143 175 -22 186 98 33 52 22 -89 72 67 -63 138 135 -36 8 95 24 -51 -11 174 -101 56 -255 50
7127 50 95 -160 -96 136 24 199 -109 227 108 -76 -177 -164 30 -243 63 42 39 -132 -17 129 -133 74
7149 74 -53 -47 -40 175 221 -12 103 -195 -57 -168 -171 -57 -28 82 -152 178 138 -184 53 -95 18 -93 -152 -29
7173 -29 81 -184 71 -26 -269 94 -25 -201 -110 96 36 -12 112 -67 51 -195 216 -36 -28 -5 142 116 -70
7196 -70 -51 146 73 -161 -63 -39 141 -31 37 -269 156 -43 -349 66 56 -48 22 -7 88 41 -90 13 34 132
7220 132 93 -41 -203 112 -186 -90 252 108 243 -112 -5 127 -65 336 86 89 14 56 49 -101 -50 11 -147
7243 -147 13 89 -17 -154 12 -50 170 56 -145 158 -53 -92 25 103 10 126 5 -195 -99 20 -297 12
7265 12 -331 -7 -111 -48 -188 -8 -106 -4 147 -9 229 243 -73 -221 169 -16 -180 -210 100 -266 -237 -213
7287 -213 79 -25 91 27 -121 -77 -174 -264 -68 75 -186 36 -63 170 -42 61 -37 119 -262 110 216 -32
7309 -32 -22 -162 71 168 -33 -195 -265 -22 -97 383 309 -60 -241 161 -195 375 275 124 83 -446 -306 -73
7331 -73 444 203 358 -39 3 -215 133 38 -47 77 -111 136 188 -188 212 297 -179 -70 65 -15 33 -10 118
7354 118 -102 55 -77 -149 -45 -240 69 75 29 -109 -269 62 -4 -43 21 -79 -66 -22 -47 -197 -1 -181 11
7377 11 -60 -126 -92 -93 59 -128 42 -154 24 -472 -165 137 70 188 -240 70 10 -87 167 -27 78 83 -35 -233
7401 -233 149 -252 148 -84 35 22 -140 172 26 204 221 -165 154 75 -62 -254 -213 -66 -77 260 -97 148
7423 148 -223 -45 162 -3 119 -122 37 262 373 151 89 13 -113 33 -192 83 68 104 21 -146 99 -211
7445 -211 -100 -30 244 -73 -54 -4 -10 156 79 123 -183 80 -106 1 -48 213 89 304 169 -27 124 58 161
7468 161 29 46 -102 -193 -58 100 228 63 12 73 129 -210 13 -112 -29 47 13 -109 94 90 62 -63 -265 -159
7492 -159 12 -191 508 140 -1 -66 799 129 485 -311 14 -336 -276 95 -601 339 178 -121 148 462 -330
7513 -330 527 -176 -348 -270 248 702 325 -417 1116 465 597 517 -619 -656 -291 317 217 505 103 448
7533 448 -1078 -138 -563 236 241 508 83 -670 122 191 256 440 -77 -751 -35 248 80 134 -87 113 -37
7554 -37 111 436 -61 56 -382 -145 -140 42 -124 -34 92 50 -153 110 -113 -114 42 -172 -146 -34 -47 -61 -68 -79
7578 -79 204 69 -124 -3 -313 124 -122 82 -37 -192 -78 199 31 84 -123 74 139 -34 -87 189 6
7599 6 -82 -146 -320 -182 336 115 121 -106 -126 -343 -140 23 81 -38 -41 -301 240 162 -298 -76 233 454 -65 276
7623 276 66 242 125 -144 -62 106 383 330 -495 -45 -231 31 92 8 286 191 -161 511 -370 149 -86 -233
7645 -233 -299 332 -322 -10 -100 -107 485 135 -240 -126 253 447 -306 8 214 -429 -104 -162 -217 -253 -384 45
7667 45 285 -361 251 -199 126 -289 320 -168 20 -122 -69 -514 -387 914 -54 -474 409 -179 -561 391
7687 391 25 24 33 -162 -113 -289 -107 43 -57 -74 255 -187 -14 -241 -223 -111 -51 241 65 -33 -259 114 -237
7710 -237 23 -48 -304 124 -112 -18 -154 45 -30 82 15 -235 13 31 82 -7 80 -34 -192 80 38 -77 -96
7733 -96 -213 -73 -189 156 136 124 -50 -217 -645 -48 183 -205 -261 153 126 -94 160 286 -114 228 -153 9
7755 9 49 201 296 291 -193 555 356 588 -71 542 543 174 338 -58 -24 -218 236 22 307 -97 12 1 98 -95
7779 -95 -152 187 -63 30 -209 -183 -283 39 88 421 -589 413 -383 67 -86 537 -68 -190 201 -27 11
7800 11 -191 -140 -562 -86 -180 218 273 73 -276 126 20 170 12 -358 95 -640 -390 85 230 36 -146
7821 -146 -352 284 117 -379 51 104 38 -497 64 44 -295 320 -426 753 540 -88 352 172 488 212 201
7842 201 -104 -205 -212 -494 298 -183 -482 -393 507 160 -32 -48 -528 -565 80 211 498 694 -155 -619 -122 229
7864 229 33 -89 -454 147 106 -75 -242 -142 81 88 89 210 -129 187 -221 -176 -122 60 39 -153 119 -96 -356
7887 -356 298 -83 134 -225 191 64 -9 -82 -175 95 -140 -255 196 38 167 91 -238 -45 -68 60 -24 -5
7909 -5 148 -13 -224 -109 -47 158 -84 -41 132 3 -50 -15 100 -70 156 -154 -19 217 -83 84 -25 105
7931 105 170 108 85 186 -93 230 -58 -19 -22 64 106 117 173 162 236 -61 92 -15 97 -112 207 59 -220 147
7955 147 103 -4 -63 123 -313 -281 47 45 -27 107 -3 -94 60 -365 53 230 54 61 74 -51 -29 79 88 184 -8
7980 -8 -58 -80 0 401 -117 143 110 -180 -102 5 -104 10 -64 86 67 -59 -90 126 292 -7 -33 27 14 -64 78
8005 78 4 -134 -238 -62 -216 -20 -45 160 -147 -61 5 -59 6 64 108 44 7 212 38 106 -218 -365 -173 -88
8029 -88 -134 125 162 193 17 -29 -33 146 -77 -258 -275 -12 -35 -35 -93 -108 -97 -176 -162 182 39 110 -187 65 -404 270
8055 270 -1198 -525 816 -167 -4 429 39 -433 495 -166 -76 222 -22 27 24 -81 -157 73 324 52 301
8076 301 -2 47 109 -136 -29 16 -18 145 240 146 -9 -266 -119 114 -225 153 63 -27 -157 152 -156 232 -22
8099 -22 -151 72 -98 8 182 -102 45 -103 33 -58 78 -30 -6 -26 -79 189 -27 -117 32 16 -63 -27 133
8122 133 -113 -290 -302 -34 83 371 167 -145 10 -93 48 3 50 171 -18 -21 25 -70 10 100 190 183 4 -23
8146 -23 -15 -25 -73 -243 113 -9 -33 20 315 -46 126 -214 80 166 -26 -12 -111 -45 420 143 95 -41 116 -13
8170 -13 335 257 -481 -200 32 -188 -178 -226 99 -118 -223 76 235 -16 -68 171 61 113 115 -101 -11
8191a1
##END NTUPLES=NMR FID
##END=
