##TITLE=1H_SA_60.234
 DMSO-d6, 108 sc, 
 2.9.2020
##JCAMPDX= 6.0         $$ Bruker NMR JCAMP-DX V2.0
##DATA TYPE= NMR FID
##DATA CLASS= NTUPLES
##ORIGIN= UXNMR, Bruker Analytische Messtechnik GmbH
##OWNER= root
$$ XWIN-NMR		Version 3.5
$$ Wed Sep  2 09:59:17 2020 Russian Standard Time (UT+4h)  she@DPX200
##.OBSERVE FREQUENCY= 200.1315066352
##.OBSERVE NUCLEUS= ^1H
##.DELAY= (6, 6)
##.ACQUISITION MODE= SIMULTANEOUS
##.ACQUISITION SCHEME= undefined
##.AVERAGES= 108
##.DIGITISER RES= 18
##SPECTROMETER/DATA SYSTEM= spect
##.PULSE SEQUENCE= zg30
##.SOLVENT NAME= DMSO
##.SHIFT REFERENCE= (INTERNAL, DMSO, 0, 15.7039)
##AUDIT TRAIL= $$ (NUMBER, WHEN, WHO, WHERE, WHAT)
$$ ##TITLE= Audit trail, XWIN-NMR		Version 3.5
$$ ##JCAMPDX= 5.01
$$ ##ORIGIN= Bruker BioSpin GmbH
$$ ##OWNER= she
$$ F:/spectra/data/she/nmr/H-F/1/audita.txt
$$ ##AUDIT TRAIL=  $$ (NUMBER, WHEN, WHO, WHERE, WHAT)
(   1,<2020-09-02 09:58:24.40 +0400>,<she>,<DPX200>,
      <continue with go, POWCHK disabled, PULCHK disabled
       configuration hash MD5:
       00 E9 B6 7A A2 85 ED C7 34 08 36 98 17 FE 4E 26
       data hash MD5: 16K
       35 F4 F6 44 AA C9 F5 CC 61 F5 F8 B2 9B 29 42 43>)
$$ ##END=
$$ 
$$ hash MD5
$$ 59 A8 34 B5 B6 64 5F EB 98 C5 48 84 32 9C A3 8B
##$RELAX= 
##$RELAX= 
##$RELAX= 
##$RELAX= 
##$RELAX= 
##$RELAX= 
$$ Bruker specific parameters
$$ --------------------------
##$DU= <F:/spectra>
##$EXPNO= 1
##$NAME= <H-F>
##$PROCNO= 1
##$TYPE= <nmr>
##$USER= <she>
##$AMP= (0..31)
100 100 100 100 100 100 100 100 100 100 100 100 100 100 100 100 100 100 
100 100 100 100 100 100 100 100 100 100 100 100 100 100 
##$AQSEQ= 0
##$AQ_mod= 1
##$AUNM= <au_zg>
##$AUTOPOS= <>
##$BF1= 200.13
##$BF2= 200.13
##$BF3= 200.13
##$BF4= 200.13
##$BF5= 200.13
##$BF6= 200.13
##$BF7= 200.13
##$BF8= 200.13
##$BYTORDA= 1
##$CFDGTYP= 0
##$CFRGTYP= 5
##$CHEMSTR= <none>
##$CNST= (0..31)
1 1 145 1 1 1 1 1 1 1 1 1 1 1 1 1 1 1 1 1 1 1 1 1 1 1 1 1 1 1 1 1 
##$CPDPRG= <>
##$CPDPRG1= <>
##$CPDPRG2= <>
##$CPDPRG3= <>
##$CPDPRG4= <mlev>
##$CPDPRG5= <mlev>
##$CPDPRG6= <mlev>
##$CPDPRG7= <mlev>
##$CPDPRG8= <mlev>
##$CPDPRGB= <>
##$CPDPRGT= <>
##$D= (0..31)
0 1.2 0 0 0 0 0 0 0 0.06 0 0.03 0 0 0 0 0.0002 0 0 0 0 0 0 0 0 0 0 0 0 
0 0 0 
##$DATE= 1599025894
##$DBL= (0..7)
120 120 120 120 120 120 120 120 
##$DBP= (0..7)
150 150 150 150 150 150 150 150 
##$DBP07= 0
##$DBPNAM0= <>
##$DBPNAM1= <>
##$DBPNAM2= <>
##$DBPNAM3= <>
##$DBPNAM4= <>
##$DBPNAM5= <>
##$DBPNAM6= <>
##$DBPNAM7= <>
##$DBPOAL= (0..7)
0.5 0.5 0.5 0.5 0.5 0.5 0.5 0.5 
##$DBPOFFS= (0..7)
0 0 0 0 0 0 0 0 
##$DE= 6
##$DECBNUC= <off>
##$DECIM= 32
##$DECNUC= <off>
##$DECSTAT= 4
##$DIGMOD= 1
##$DIGTYP= 9
##$DL= (0..7)
0 120 120 120 120 120 120 120 
##$DP= (0..7)
150 150 150 150 150 150 150 150 
##$DP07= 0
##$DPNAME0= <>
##$DPNAME1= <>
##$DPNAME2= <>
##$DPNAME3= <>
##$DPNAME4= <>
##$DPNAME5= <>
##$DPNAME6= <>
##$DPNAME7= <>
##$DPOAL= (0..7)
0.5 0.5 0.5 0.5 0.5 0.5 0.5 0.5 
##$DPOFFS= (0..7)
0 0 0 0 0 0 0 0 
##$DQDMODE= 0
##$DR= 18
##$DS= 0
$$ [...]
##$SUBNAM2= <"">
##$SUBNAM3= <"">
##$SUBNAM4= <"">
##$SUBNAM5= <"">
##$SUBNAM6= <"">
##$SUBNAM7= <"">
##$SUBNAM8= <"">
##$SUBNAM9= <"">
##$SW= 16.880792210976
##$SWIBOX= (0..15)
0 0 2 0 0 0 0 0 0 0 0 0 0 0 0 0 
##$SW_h= 3378.37837837838
##$TD= 16384
##$TD0= 1
##$TE= 0
##$TE2= 300
##$TE3= 300
##$TEG= 300
##$TL= (0..7)
0 120 120 120 120 120 120 120 
##$TP= (0..7)
150 150 150 150 150 150 150 150 
##$TP07= 0
##$TPNAME0= <>
##$TPNAME1= <>
##$TPNAME2= <>
##$TPNAME3= <>
##$TPNAME4= <>
##$TPNAME5= <>
##$TPNAME6= <>
##$TPNAME7= <>
##$TPOAL= (0..7)
0.5 0.5 0.5 0.5 0.5 0.5 0.5 0.5 
##$TPOFFS= (0..7)
0 0 0 0 0 0 0 0 
##$TUNHIN= 0
##$TUNHOUT= 0
##$TUNXOUT= 0
##$USERA1= <user>
##$USERA2= <user>
##$USERA3= <user>
##$USERA4= <user>
##$USERA5= <user>
##$V9= 5
##$VALIST= <valist>
##$VCLIST= <CCCCCCCCCCCCCCC>
##$VD= 0
##$VDLIST= <DDDDDDDDDDDDDDD>
##$VPLIST= <PPPPPPPPPPPPPPP>
##$VTLIST= <TTTTTTTTTTTTTTT>
##$WBST= 1024
##$WBSW= 4
##$XGAIN= (0..3)
0 0 0 0 
##$XL= 0
##$YL= 0
##$YMAX_a= 824559
##$YMIN_a= -869860
##$ZGOPTNS= <>
##$ZL1= 120
##$ZL2= 120
##$ZL3= 120
##$ZL4= 120
##$ABSF1= 10
##$ABSF2= 0
##$ABSG= 5
##$ABSL= 3
##$ALPHA= 0
##$AQORDER= 0
##$ASSFAC= 0
##$ASSFACI= 0
##$ASSFACX= 0
##$ASSWID= 0
##$AUNMP= <proc_1d>
##$AZFE= 0.1
##$AZFW= 0.1
##$BCFW= 1
##$BC_mod= 2
##$BYTORDP= 1
##$COROFFS= 0
##$CY= 11.3945322036743
##$DATMOD= 1
##$DC= 2
##$DFILT= <>
##$DTYPP= 0
##$F1P= 16.9975609425685
##$F2P= -3.02152046262296
##$FCOR= 0.5
##$FTSIZE= 0
##$FT_mod= 4
##$GAMMA= 1
##$GB= 0.15
##$INTBC= 1
##$INTSCL= 1
##$ISEN= 128
##$LB= 0.24
##$LEV0= 0
##$LPBIN= 0
##$MAXI= 10000
##$MC2= 0
##$MEAN= 0
##$ME_mod= 0
##$MI= 1.114404
##$NCOEF= 0
##$NC_proc= 0
##$NLEV= 6
##$NOISF1= 3.799351
##$NOISF2= 2.8
##$NSP= 1
##$NTH_PI= 0
##$NZP= 0
##$OFFSET= 15.70392
##$PC= 1
##$PHC0= -9983.73
##$PHC1= 23.0009
##$PH_mod= 1
##$PKNL= yes
##$PPARMOD= 0
##$PSCAL= 0
##$PSIGN= 0
##$REVERSE= no
##$SF= 200.130013532006
##$SI= 16384
##$SIGF1= 3
##$SIGF2= 2
##$SINO= 400
##$SIOLD= 16384
##$SREGLST= <1H.CDCl3>
##$SSB= 0
##$STSI= 0
##$STSR= 0
##$SW_p= 3612.71676300578
##$SYMM= 0
##$S_DEV= 0
##$TDeff= 0
##$TDoff= 0
##$TI= <>
##$TILT= no
##$TM1= 0
##$TM2= 0
##$TOPLEV= 0
##$USERP1= <user>
##$USERP2= <user>
##$USERP3= <user>
##$USERP4= <user>
##$USERP5= <user>
##$WDW= 1
##$XDIM= 8192
##$YMAX_p= 0
##$YMIN_p= 0
$$ End of Bruker specific parameters
$$ ---------------------------------
##NTUPLES= NMR FID
##VAR_NAME=  TIME,          FID/REAL,        FID/IMAG
##SYMBOL=    X,             R,               I
##VAR_TYPE=  INDEPENDENT,   DEPENDENT,       DEPENDENT
##VAR_FORM=  AFFN,          ASDF,            ASDF
##VAR_DIM=   8192,          8192,            8192
##UNITS=     SECONDS,       ARBITRARY UNITS, ARBITRARY UNITS
##FACTOR=    0.000296,      1,               1
##FIRST=     0,             0,               0
##LAST=      2.424536,      0,               0
##MIN=       0,             -869860,         0
##MAX=       2.424536,      824559,          0
$$ Real data points
##PAGE= N=1
##DATA TABLE= (X++(R..R)), XYDATA
$$ [...]
2660D40k38j86O76j789J642j866J228m65J371j119J19R89p45Q46j846J939j149
$$ 440 202 16 692 -1097 545 -1321 -93 -558 813 -306 -187 802 57 903 -943 996 -153
2677a53L47m05n15R63o19J18j260J757p90P19m43j21M85j118K083k298R03o37
$$ -153 194 -211 -726 237 -382 -264 -1524 233 -557 162 -281 -402 83 -1035 1048 -1250 -347 -984
2695i84O65m68P19J12j284J892j159P32o47L46j82l66Q67q05O01j172K598j610
$$ -984 -319 -787 -68 44 -1240 652 -507 225 -422 -76 -258 -624 243 -562 39 -1133 1465 -145
2713a45J148k044J252M06j544J329p05J903k199R53o54N22N83j749Q27k2N68j406
$$ -145 1003 -1041 211 617 -927 402 -303 1600 -599 354 -300 222 805 -944 -117 -139 429 -977
2731i77J862o11l25L59n09L14j865L047j832O92J50qp1j344J826r38L80j02L78
$$ -977 885 274 -51 308 -201 113 -1752 1295 -537 155 305 297 226 -1118 708 -230 150 48 426
2750D26l19k77n1k37K206k536J781j552R32j518N80J107L5L48k131J557j592J312
$$ 426 107 -170 -221 -458 1748 -788 993 -559 373 -1145 -565 542 577 925 -1206 351 -1241 71
2768G1K79m39M84n22J329j841J254j323J484j623N67J949k548R98k10J330k255
$$ 71 350 -89 395 -127 1202 -639 615 -708 776 -847 -280 1669 -879 119 -91 1239 -1016
2785a016K164o03q54P05j56L24j812J824j636K062k098J556J7N7k17j191K011
$$ -1016 1148 545 -309 396 240 564 -1248 576 -1060 1002 -1096 460 477 534 317 -874 1137
2802A137j540L85p17J460n06n38N40j70R57j864R99K44m01L2J46k26m91K278k776
$$ 1137 -403 -18 -735 725 219 -319 221 51 1008 -856 143 387 -14 18 164 -62 -553 1725 -1051
2821a051P66m36Q79n4p84J147o84R80j564Q41l99k43l8o5J515k037J772j302R18
$$ -1051 -285 -721 158 104 -680 467 -217 763 -801 40 -359 -602 -640 -705 810 -1227 545 -757 161
2840A61k89N64n94o22O96j098K528j805Q01q44j77k40Q78R46j932J331p57N48
$$ 161 -128 436 -158 -780 -84 -1182 1346 -459 342 -502 -679 -919 -41 905 -1027 304 -453 95
2858I5j413J060n94j57J324r48R73j650K474j675R58m49n10J499r77P23r40n83
$$ 95 -1318 -258 -852 -1009 315 -633 340 -1310 1164 -511 447 -2 -512 987 10 733 -207 -790
2876g90k51N45M92n11J036j585R52j177K350j328K03L72j436J625j368J409j359
$$ -790 -1041 -496 -4 -515 521 -1064 -112 -1289 1061 -267 -64 308 -1128 497 -871 538 -821
2893h21J644q23q40k16L50J350k027J887j842Q99q67J515m52j27J425j951J221
$$ -821 823 0 -840 -1056 -706 644 -1383 504 -1338 -439 -1306 209 -243 -370 1055 -896 325
2910C25r77J000n52O04p95L01M22q39Q37k336J928k66P38p44O55k87O4J024q65
$$ 325 -652 348 -204 400 -395 -94 328 -511 326 -2010 -82 -348 390 -354 301 14 78 1102 237
2929B37k4j022J855r31j52k16m04J229j098J405k35K9m05l37J097r01N71j673
$$ 237 213 -809 1046 115 -37 -253 -657 572 -526 879 644 673 268 -69 1028 127 698 -975
2947i75R76k20R46r05Q95j08l96J38o78M00o41J178p69k86R63k02L53j662J527
$$ -975 1 -219 727 -178 717 609 213 351 -327 73 -568 610 -159 -445 518 316 669 -993 534
2966E34j347J143p69N19j08k87J330j422R06M21m13m14R22j566L71R38j68J35
$$ 534 -813 330 -439 80 -28 -315 1015 -407 499 920 507 93 1015 -551 -180 758 590 725
2984G25q90L66r48J031k47j85M96m78Q95j343J821j380l77Q52N1K55j171N81J19
$$ 725 -165 201 -747 284 37 -148 348 -130 765 -578 1243 -137 -514 338 389 644 -527 54 173
3003A73J81j089N77K37j300J853j347M07q25K125r46M64J81j602J446r31J508
$$ 173 354 -735 -158 79 -1221 632 -715 -308 -1133 992 46 510 691 -911 535 -396 1112
3020A112j868Q38N1j086J964j192J370j493M02o29P44q84J526n58m74J299j913
$$ 1112 -756 82 133 -953 1011 -181 1189 -304 98 -531 213 -671 855 297 -177 1122 -791
3037g91Q97m57P14l28p86O74j19J57m17k8P11q4m71J10J44k85R26k217K313q23
$$ -791 106 -351 363 35 -751 -77 -196 -39 -456 -484 227 143 -328 -218 -74 -359 567 -1650 663 -160
3057a60M45j160J952j513N2P51q27J179j007Q82m11m66L20l78J075j508J544j032
$$ -160 285 -875 1077 -436 -384 367 -460 719 -288 594 183 -283 37 -341 734 -774 770 -262
3075b62O84j055O47l15j07J103r03Q58p84M85k11J10r36P65M60j341J170o88P44
$$ -262 422 -633 14 -301 -408 695 -208 650 -134 351 140 250 -686 79 539 -802 368 -320 424
3094D24m24P5q84J83J20o99J935j616J379l81n25N12l14N86j620J459l88J179
$$ 424 0 75 -809 -626 -506 -1205 730 -886 493 112 -413 99 -215 371 -1249 210 -178 1001
3112A001j185L83n53L88J372k383J253j092K121j372R18M0j114J141m14L93q82
$$ 1001 -184 199 -354 34 1406 -977 276 -816 1305 -67 851 891 -223 918 504 897 15
3129A5O0R4K78o34J58l07J71J379l209K342j096J140k09o6n19j32J712j375J154
$$ 15 75 169 447 -187 -29 -336 -165 1214 -1995 347 -749 391 182 116 -403 -535 1177 -198 956
3148I56j902J257M02K48o16n1K27o22Q33o14J81k3j6K80q95L38N21QM5n44K00
$$ 956 -946 311 713 961 345 294 521 -101 732 118 299 276 260 540 -355 -17 504 512 557 13 213
3169B13j124J096l58J100j499J590n64j70j70l03Q74r44O26n86R47j608J112m8
$$ 213 -911 185 -173 927 -572 1018 454 284 114 -189 685 -259 367 -219 728 -880 232 184
3187A84l95O75p16N48r84N09K06Q90j067M5P73j460L04N48M17j792J664m59o16
$$ 184 -211 464 -252 296 -688 -179 27 917 -150 -105 668 -792 -488 60 477 -1315 349 -110 -726
3206g26N50j16j28n90J582L73j934R75N79O5j327J080j779Q13M39P58j293P26
$$ -726 -176 -292 -420 -1010 572 945 -989 -14 565 630 -697 383 -1396 -583 -144 614 -679 47
3224D7Q28j385J641j423J129k258K183j783j19R53l7j1l73J619j536Q14M12j88
$$ 47 875 -510 1131 -292 837 -1421 762 -1021 -1140 -187 -224 -235 -608 1011 -525 289 701 513
3242E13o02o29J343p60P38j757K062j347L26P5p12J530j062J575j824N45K37r45
$$ 513 -89 -718 625 -135 603 -1154 908 -439 -113 -38 -750 780 -282 1293 -531 14 251 -694
3260f94N31k3K61j160J571P7r60J89L86Pm89J052n90m99j24J407m80L77j230j36
$$ -694 -163 -186 75 -1085 486 563 -397 -208 178 185 -304 748 158 -341 -465 942 462 839 -391 -527
3280e27J552j298L77j246J774j042o83J386N02n1j883K287j858P61l38J542p48
$$ -527 1025 -273 104 -1142 632 -410 -1093 293 795 744 -1139 1148 -710 51 -287 1255 507
3297E07r08Q70j747J132r3O01r35O02R08q56K64n56J710l068J517j34J049m29
$$ 507 -401 469 -1278 -146 -239 362 -573 29 937 81 345 -211 1499 -1569 -52 -186 863 434
3315D34j129J187j814K458j618K13Q52l87j90p41M71P8q1N21J00r16M53J85o43
$$ 434 -695 492 -1322 1136 -482 -269 583 196 6 -735 -264 -186 -267 254 354 -562 -109 76 -567
3334e67J174o21K96j378J701p18J5o40J198r94K45R17j48p3k00J139k143K61J814
$$ -567 607 -14 282 -1096 605 -113 -98 -738 460 -534 -289 628 480 407 207 1346 -797 -536 1278
3353A278j626M69Q05p79q78J656m14l9r0l97N89l64P87j292O33j37Pj76l06L85
$$ 1278 -348 121 926 147 -731 925 511 472 382 -15 574 210 997 -295 338 201 208 32 -274 111
3373A11r28N21j37J591j514l72J865o85j68k46O29k102J614p7q0M37Q2q21L36
$$ 111 -817 -296 -433 1158 -356 -728 1137 452 284 38 667 -1435 179 102 22 459 541 -280 56
3392E6M16p60p61J370J14j29q31J076j121J181m78j1j255K101J13k423J587L66
$$ 56 472 -288 -1049 321 435 306 -525 551 -570 611 133 122 -1133 968 1081 -1342 245 611
3410F11R82k910J774J81j467R32j273J238r43J188p76O7R70K96j151p7J360j597
$$ 611 1593 -1317 457 638 -829 103 -1170 68 -875 313 -463 -396 574 870 -281 -358 1002 -595
3428e95O49O21m94k35L69Q77j682J030n51L80j024J82J490j690K44R67n24j227
$$ -595 54 675 181 -54 315 1192 -490 540 -11 369 -655 -473 1017 -673 -429 538 14 -1213
3446a213K152m33k208J008J571j615K8J397j478J418j4n73j698N30J650j712M25
$$ -1213 939 506 -1702 -694 877 -738 -710 687 -791 627 613 40 -1658 -1128 522 -1190 -765
3463g65M28J107j993J548l1l87m63J328j023o42J209n48n77R73O63j835K8K126
$$ -765 -337 770 -1223 325 294 -93 -556 772 -251 -893 316 -232 -809 164 827 -1008 -980 1146
3481A146j431j063N86J054r95J542j07k381J163R76Q17j999M80N11j247Q03Q38
$$ 1146 -285 -1348 -762 292 -703 839 732 -1649 -486 490 1307 -692 -212 299 -948 -145 693
3498F93l31j717J739q9J43m48N23p55k10J905j524r24O85O28n68l07J095q94J47
$$ 693 362 -1355 384 295 438 -10 513 -242 -452 1453 -71 -995 -310 318 -250 -557 538 -356 -209
3517b09R86j02k437K812q03j472J102J02J05j060K231j026j34L27N13n80o86J672
$$ -209 777 675 -1762 1050 247 -1225 -123 -21 84 -976 1255 229 95 422 935 355 -331 1341
3535A341p62l29m56J011j239Q99K85k252J711n75R62j801J834P55k013J48J387
$$ 1341 579 250 -206 805 -434 465 750 -1502 209 -366 596 -1205 629 1384 -629 -481 906
3552I06r39j080J632o32o04P58J080k428O02K030j577n6q3O48p56J96O07p73J400
$$ 906 -33 -1113 519 -113 -717 41 1121 -1307 -705 1325 -252 -308 -391 257 -499 -303 304 -469 931
3571I31j006Q6l58J965r04j611N30J106p69p86K199j109o43n62J696j514l45K322
$$ 931 -75 11 -347 1618 714 -897 -367 739 -30 -816 1383 274 -369 -931 765 -749 -1094 1228
3589A228k661M89P07m9r16O88J648k236K4P40J165j962J548O87j678L07M60r48
$$ 1228 -1433 -944 -237 -286 -1202 -514 1134 -1102 -1078 -338 827 -1135 413 1100 -578 -271 189 -759
3607g59l21K037j646o6O66J026j610K1L57o7K55O1P83j211O44J158k092K2J942
$$ -759 -1080 957 -689 -755 -89 937 -673 -652 -295 -362 -107 -46 737 -474 170 1328 -764 -742 1200
3626A200r70q98O17J528k205N77R35j126m67J701j42j203J90O01o99r37J678m44
$$ 1200 230 -668 -51 1477 -728 -151 784 -342 -809 892 750 -453 -263 338 -361 -1298 380 -64
3644f4m74N14L51j448J498O55k003J446J52o23q77R65n50n14J575K74q34j44J514
$$ -64 -538 -24 327 -1121 377 1032 -971 475 627 4 -873 92 -458 -972 603 877 43 -101 1413
3663A413k184L00l9J206j218N66R48k959J427J094m80k87K46O90q00q17J531j145
$$ 1413 -771 -471 -510 696 -522 44 992 -1967 -540 554 74 -213 33 723 -77 -894 637 -508
3681e08L02J288o42j262O63R16j402J28J159j116K94P70J06j715P74R80j182J072
$$ -508 -206 1082 440 -822 -159 757 -645 -517 642 -474 -180 590 696 -1019 -245 735 -447 625
3699F25j07K76r08l50J174j020l17J437n42j170J647k18k010J393J599j519p00
$$ 625 518 794 -114 -464 710 -310 -627 810 268 -902 745 527 -1483 -90 1509 -10 -710
3716g10J738j687J81O04k29M43j028J589j351J96L41O52j668P70O21n72m83J442
$$ -710 1028 -659 -478 126 -103 340 -688 901 -450 -254 87 739 -929 -159 462 -110 -593 849
3734H49q88j581L243j715L01m23M48n87N80J076q45j586J496j3j564R48J265j182
$$ 849 -39 -1620 1623 -92 209 -214 234 -353 227 1303 458 -1128 368 355 -1209 -261 1004 -178
3752a78K8M9P93j715R34N65o91O92k74l5k057K839j649k09K1J878j178n71J344
$$ -178 -150 -101 692 -1023 -89 476 -215 477 203 168 -1889 950 -699 -908 -887 991 -187 -758 586
3771E86j012L37O17L22j811K88J078j497J734j02n33j429K137L1l87J30j93j063
$$ 586 -426 -89 528 850 -961 -673 405 -1092 642 540 7 -1422 715 746 359 489 296 -767
3789g67K1J048l55P8l27P82j62r83J101l40k38M53l65n69J405L91j702J190r30
$$ -767 -746 302 -53 25 -302 480 318 -665 436 96 -142 311 -54 -623 782 1173 -529 661 -269
3808b69R63j490O95K44o45J004L30m33J13O35j194j53N72J063r94r97J234j654
$$ -269 694 -796 -101 143 -502 502 832 399 512 1147 -47 -200 372 1435 441 -556 678 -976
3826i76O73o3K8l52R58m10o24r3J534K98k117J924q79k36R6J352j10j122L21j56
$$ -976 -303 -366 -338 -690 268 -142 -766 -859 675 973 -1144 780 -99 -335 -239 1113 1003 -119 202 46
3846D6j98K81M8j50l3O29q27r4P4N65l90K98n08P87j348O90P22j298J128J05o05
$$ 46 -152 129 177 27 -6 623 -204 -298 -224 341 -49 249 -259 528 -820 -130 592 -706 422 527 -78
3867g8n55P37p73NJ585q22n22K42O47j464K90J437n43k91r60K128k018O75O64
$$ -78 -633 104 -669 -664 921 99 -423 -181 466 -998 -708 729 186 -105 -1065 1063 -955 -280 384
3886C84r35O97J04O49k127M21N90k87N9P22j02K70p81N26Q0K33k06q19k44J051
$$ 384 -551 146 250 899 -1228 -807 -217 -504 -445 277 175 445 -336 190 270 503 297 -522 -766 285
3906B85p7o6l44O74j70M26M4r43R00n90o53J67K024k023n5P23l3n79J20Q24j262
$$ 285 208 142 -202 472 302 728 772 -171 729 139 -514 -347 1677 -346 -401 322 289 -290 -170 654 -608
3927f08K01k71R29o71K19M00o44O17k6N63p08N59j17J90K35r36k75nj62J174j067
$$ -608 -407 -678 251 -420 -201 199 -445 172 146 709 1 560 443 633 868 -68 -343 -348 -510 664 -403
3948d03P35j138R10m46Q29r39Q76q95J000m18P7p3m50N98j532J360J82L97j162
$$ -403 332 -806 104 -342 487 -452 424 -471 529 111 188 115 -335 263 -1269 91 273 670 -492
3967d92j18L17Q04Q65k755J482K95K17l85l8k86o43J459j40l42J27J29l62j506
$$ -492 -610 -293 511 1376 -1379 103 398 615 230 192 -94 -737 722 582 240 367 496 134 -1372
3986a372J612j62k89O70r11l67P09M35l09K36p79L11P35k34L11K46j017J8q7l75
$$ -1372 240 78 -211 459 -452 -819 -110 325 16 252 -527 -216 519 285 596 842 -175 -157 -244 -619
4006f19J913j177J93k70N95k89l63J005j607O23K28P16k382K410j085N6P4j7m45
$$ -619 1294 117 310 40 635 346 -17 988 -619 4 232 948 -1434 976 -109 -53 21 4 -441
4025d41L54K79N4l55m15k38J090o09J558r11l60K1M90o55N00N39j772J283P2p71
$$ -441 -87 192 246 -109 -524 -762 328 -281 1277 366 6 27 517 -138 362 901 -871 412 484 -287
4045b87p9N28r73J010Pl9o0m03L15R2L13j215J704r01p76J069j76J99p89J143
$$ -287 -366 162 -811 199 206 167 107 -296 19 111 424 -791 913 12 -764 305 129 328 -461 682
4065F82j360K71R73j188J184j03n7j671J939j170k0N00l90K91n02L51K02m40m2
$$ 682 -678 -407 566 -622 562 459 402 -1269 670 -500 -520 -20 -410 -119 -621 -270 -68 -508 -550
4084e50P52o02P04P0J08o04k67J34l09M21O1j67l96l63K064j782J514j310J53
$$ -550 202 -400 304 374 482 -122 -389 -255 -564 -143 -82 -249 -645 -1008 1056 -726 788 -522 -369
4103c69O15j98L84p40P75j263R34M57M33j301m47Q44j08m92J04j3j2J357q61P03
$$ -369 246 48 432 -308 467 -796 138 595 1028 -273 -720 124 16 -476 -372 -385 -397 960 99 802
4123H02p44k94Q70q19L72J15K89k69o73O51p50M03P66p5q29Q45p15l44J437j238
$$ 802 58 -236 634 -185 187 302 591 322 -351 300 -450 -47 719 644 -185 660 -55 -399 1038 -200
4143b00k50j85J153l00P9o19O61N09j173K83j010N41J27m59O73N99J22j128J375
$$ -200 -450 -635 518 218 297 -322 339 848 -325 -42 -1052 -511 -384 -843 -170 429 551 -577 798
4162G98o63M55n45J11P82j214R47j479J052p59P09O0M92p02l91M18M08k65q64
$$ 798 135 590 45 156 938 -276 671 -808 244 -515 194 254 746 44 -347 71 479 214 -650
4181f50J017p55j02M77q6M21m83N31r4j67j225J601L51j130n18Q97l71P02r30
$$ -650 367 -388 -490 -13 -99 322 -161 370 276 109 -1116 485 836 -294 -812 85 -286 416 -514
4200e14p1r6M84j85O0L42J47L12J01j00q0O7o62L11l89K99n79R57q61P52r18P74
$$ -514 -585 -681 -197 -382 -322 20 167 479 580 480 400 467 -195 116 -273 26 -553 404 -457 295 -623 151
4222A51J01m92N61p2q6j318O80J58J062J56q40Mk07O60q66P90q51P51Pj187R00
$$ 151 252 -240 321 249 163 -1155 -475 -317 745 901 61 65 -142 518 -348 442 -409 342 349 -838 62
4243F2L94j431R61Q9r07J264m75q07N25k37P40q76M66o31L16J27J263n42j842
$$ 62 456 -975 -14 75 -832 432 -43 -850 -325 -562 178 -698 -232 -863 -547 -420 843 301 -1541
4262a541K390k253J344M03o1J51P9j30m84R02j002P61j25L5p92L2N09q23N05K16
$$ -1541 849 -1404 -60 343 282 433 512 382 -102 800 -202 559 434 469 -323 -291 218 -605 -100 116
4282A16J15L65j256O16p35R99r3K6k18O55o08J87Q0l02O84l46m19k83J280j454
$$ 116 231 596 -660 -44 -779 220 127 153 -65 590 -18 169 249 -53 631 285 -134 -417 863 -591
4302e91J334m00l65m20M06R23q18K02P5r1q19Q53j84l52l31m19J078J38j97m48
$$ -591 743 343 -22 -442 -36 887 69 271 346 255 -564 289 105 -247 -578 -997 81 219 22 -426
4322d26m5Q25j953K159q82J307j306J001n56L2P46j076M14L33m37L24l22m61M09
$$ -426 -471 354 -1599 560 -322 985 -321 680 124 156 902 -174 240 573 136 460 138 -323 86
4341H6k91o3L99n9P89r72o11K09J38R56o52N73l23r85J133m19P6K25o93P46Q90
$$ 86 -205 -268 131 72 861 -111 -722 -513 -375 581 -71 502 179 -806 327 -92 -16 209 -484 262 1152
4362A152j762O30J08J12P94j295K3n0m9J138n13j239N71K68r31J170o69K66k11
$$ 1152 -610 20 128 240 1034 -261 -238 -288 -337 801 288 -951 -380 -112 -1043 127 -542 -276 -487
4381d87K41O03m22Q24j043J224p63n2q75J081j314O94O89j23r6j550J765J74o23
$$ -487 -246 357 -65 759 -284 940 177 125 -750 331 -983 -289 400 277 181 -1369 396 570 -53
4400e3q1o1k7L11k36J12O38r77R76p97n5O12j78m10k17Q63j348P10L98m06P11
$$ -53 -134 -195 -222 89 -147 -35 603 -374 602 -195 -250 362 184 -226 -443 420 -928 -218 180 -226 485
4421D85n26q4N36J26n6j068m08Q68M04m19J73k27O9p69Q52L47j97j19O82p08M73
$$ 485 -41 -125 411 537 481 -587 -995 -127 277 -142 31 -196 -127 -896 -44 303 106 -13 669 -39 434
4442D34K79j922J428n62j19K51r91J366m37k12M95l0K42k98J19J15l26n02J398
$$ 434 713 -1209 219 -343 -462 -211 -1202 164 -273 -485 10 -20 222 -76 43 158 -168 -670 728
4461G28j689M39J28N68l37N50p80O90M28m22N37q84o73R17j22n65j44O31l28J059
$$ 728 -961 -522 -394 174 -163 387 -393 297 725 303 840 -44 -717 200 78 -487 -631 0 -328 731
4481G31k72p44Q16j55m14k88P48p18K61J56M16J43j726J59J528L60j504J224j719
$$ 731 459 -285 531 376 -38 -326 422 -296 -35 121 537 680 -1046 -887 641 1001 -503 721 -998
4500i98J179K26l53j16J82j98K63K76j345R82k55K13N98j467J105l23m33K5L36
$$ -998 181 407 54 -62 120 -78 185 461 -884 98 -157 56 654 -813 292 -31 -464 -439 -103
4519a03J26j004J597j135j69J118j146J60j5m22O27J95L8N55l22k29m33J89R48
$$ -103 23 -981 616 -519 -688 430 -716 -556 -571 -993 -366 -171 -133 422 100 -129 -562 -373 575
4538E75j13p11KJ195j915J143j49K11o06R81n41m64K83l96J621r55L93j341Q05
$$ 575 462 -249 -247 948 -967 176 27 238 -368 613 72 -392 -109 -505 1116 161 554 -787 18
4557A8L08M92p85o63J462r00o86R77j120P25P87m83J89Qo44J073n99m7q83N65
$$ 18 326 818 33 -630 832 -68 -754 223 -897 -172 615 132 321 329 -315 758 159 112 -771 -206
4577b06l04L82J72k43P34j467P43o51O22L02L12J35l3q0l91n50J432n36l20n80
$$ -206 -510 -128 44 -199 535 -932 -189 -840 -218 84 396 531 498 418 27 -523 909 373 53 -527
4597e27R89ln78K82L49j073R07q81J189n53l19K71k0q64N98J74K45L89p96Q1l23
$$ -527 462 459 -119 163 512 -561 346 -535 654 101 -218 53 33 -831 -233 -59 186 575 -221 -140 -463
4618d63J224o65P8m13O19p32k40Q4L11m79m66J016Q85j68j307J523j461J059K37
$$ -463 761 96 174 -239 380 -352 -592 -508 -197 -676 -1142 -126 759 591 -716 807 -654 405 642
4637F42j505J492L9j043Q91l57j83q5J09J74n73M83q99J039k14l17J36L57p24
$$ 642 -863 629 668 -375 516 159 -24 -109 0 174 -399 84 -815 224 10 -307 -171 186 -538
4656e38K40L39j29r7N47k32M44q67K8J7NN51n82J152j554J047j088N95K25l70
$$ -538 -298 41 -88 -185 362 130 574 -293 -265 -248 -243 308 -274 878 -676 371 -717 -122 103 -267
4676b67J37k73Q45K1Q33j242j36k52J133n43n56N68j339J443M22j111K92K52n92
$$ -267 -130 -403 442 463 1296 54 -82 -334 799 256 -300 268 -1071 372 794 -317 -25 227 -365
4695c65K09K45q90P46O68k47J34p02N73k34o76Q62K16O46n71j39n69J421j259
$$ -365 -156 89 -801 -55 613 366 500 -202 371 137 -539 323 539 1185 614 475 -94 1327 68
4714F8l40l46J103n60j05L02j272J696m90n93R0J09O07j563K270j399m3J190n01
$$ 68 -272 -618 485 -75 -180 122 -1150 546 56 -537 -447 -338 269 -1294 976 -423 -466 724 223
4733B23p12r2J024j381R21P5k05n02R9j09J257j29j332O99n85R88j037M92L31
$$ 223 -489 -581 443 -938 -17 58 -147 -649 -550 -659 598 469 -863 -164 -749 239 -798 -306 25
4752B5K4k97J42m09J218l83l92J51j42K75j83N96j67O89q32r45M21l45j56j99
$$ 25 49 -248 -106 -515 703 320 -72 79 -63 212 29 625 458 1147 315 -630 -209 -554 -710 -909
4772i09P94n05J34Q26K65j212J92J008j250L14k0J06L11J09k2k37m16K97Q68n40
$$ -909 -115 -620 -486 340 605 -607 -415 593 -657 -343 -363 -257 54 163 141 -96 -512 -215 653 113
4792A13N40o44L94j331M63J588j176N2l21J01J8N02j86K35rl81o2K92L11r2n82
$$ 113 653 9 403 -928 -465 1123 -53 -1 -322 -221 -203 299 113 348 339 -42 -104 188 499 407 -175
4813a75R22j870J096m46M06q96J168k75K33j247K86J545q21o06P5J564j389N20
$$ -175 747 -1123 -27 -473 -67 -963 205 -70 163 -1084 -798 747 -74 -680 -605 959 -430 90
4831I0m88k43M1K65J08K9J32n2K47r8l99L45j74j02J58K40j51k37K92M57l96o60
$$ 90 -398 -641 -600 -335 -227 -198 -66 -118 129 31 -368 -23 -197 -299 -141 99 -52 -289 3 460 64 -596
4853e96J38L76n71J089p74J124p69n43O47j46j26nN04j148J122m93P06l0m43J64
$$ -596 -458 -82 -653 436 -338 786 17 -526 121 -25 -151 -156 348 -800 322 -171 535 505 62 226
4873B26K14o54k2J99rm79M36n16K25K60K02n59J05P82n95K62p04r1N71n39LR19
$$ 226 440 -214 -236 -37 -46 -525 -89 -605 -380 -120 82 -477 -372 410 -185 77 -627 -718 -147 -686 -683 236
4895B36m87O13j66l08r16J338k46K94o59P32o4o69R81p12M99j261J599j093k58
$$ 236 -251 362 196 -112 -1028 310 64 358 -301 431 367 -302 679 -33 466 -795 804 -289 -547
4914e47J244j852J543L09q23M83o48K86k68J126j543M74O89o05O10n18m95J59
$$ -547 697 -1155 388 697 -126 357 -291 -5 -273 853 -690 -216 473 -132 478 -40 -535 -376
4932c76L21L39m45l75N00N0M8n72q1K44L84m3J44r31k04J176n0l17Q29m15P0o43
$$ -376 -55 284 -161 -536 -36 14 62 -510 -591 -347 37 -6 138 -793 -997 179 129 -188 641 226 296 -347
4954c47J80LJ07n40M06O33l7o61l48N45O31l84r9M90n19j43M31p14o3N29n19J39
$$ -347 -167 -164 -57 -597 -191 442 405 -256 -604 -59 572 188 89 579 60 -83 348 -366 -429 100 -419 -280
4976b80m12O09M14j49R1q63R76p58j18J72J96o32J390o11j4J88j269N32L31P02
$$ -280 -692 -83 331 182 273 -590 386 -372 -490 -318 -122 -754 636 25 11 199 -1070 -538 -207 495
4996D95Q4M39r53j34m41J041n65R22j286K97Q46j792J044l56K74N33q47L52L13
$$ 495 579 1018 65 -69 -510 531 -34 888 -398 -101 745 -1047 -3 -359 -85 448 -399 -47 266
5015B66k78o38M26m12O22j65k15n11J301l98N2l44L5O86n40r94J315n39M36l6
$$ 266 -12 -650 -224 -636 -14 -179 -394 -905 396 -2 50 -294 -259 427 -113 -1107 208 -331 105 69
5035F9P2m76K61R22j059K04k69j57k33K91J87N95j570J340k25j23J14L90q93J87
$$ 69 141 -335 -74 848 -211 -7 -276 -433 -666 -375 -188 407 -1163 177 -48 -171 -57 333 -560 -373
5055c73O20m03o8P29o62k2j090K159j263M2m58P41j048J026m5j365J433P57k28
$$ -373 247 -156 -224 505 -157 -179 -1269 890 -373 -331 -789 -48 -1096 -70 -115 -1480 -47 710 482
5074D82n10O72j69k81m1l07M85l24N65n37n7N15J09k45p77J004J48j119J483k97
$$ 482 -28 644 475 194 153 -154 331 7 572 35 -22 493 602 357 -420 584 732 -387 1096 799
5094G99L7p22r68N28J69J52l7m55M78K42k9l2R9m07m75R42J89j285O71O72j117
$$ 799 836 114 -854 -326 -157 -5 -42 -497 -19 223 194 162 261 -146 -621 321 510 -775 -104 568 -549
5115e49N78m72m7J6R41n62l62J098r5l23j224M77j30K23K54K77q0j26P34j169
$$ -549 29 -443 -490 -474 467 -95 -457 641 546 223 -1001 -524 -654 -431 -177 100 20 -106 628 -541
5135e41k18L56k41Q18o42N98k06j32J70K79p85J39Ml2J55M17m08M52l53M44m53
$$ -541 -759 -403 -644 174 -468 130 -76 -208 -38 241 -544 -405 -401 -433 -278 139 -269 183 -170 274 -179
5156a79K24k45L54l46K76Qm31K91n64J400j255J399r20k95N24o36P7N92r37R25
$$ -179 45 -200 154 -192 84 92 -339 -48 -612 788 -467 932 12 -283 241 -395 -318 274 -663 262
5176B62o64O24N2m50N8Np93J135K20m50j046Q91m28M53j31L34l6j60m74J338q49
$$ 262 -402 222 274 -176 -118 -113 -906 229 449 -1 -1047 -156 -584 -131 -262 72 36 -124 -598 740 -109
5197a09R9p72M52O55j194J117o91K84l6L27m36L91l59M1R68j203L00P04l97m09
$$ -109 -10 -782 -330 325 -869 248 -443 -159 -195 132 -304 87 -272 -231 737 -466 -166 538 141 -268
5217b68J226j416J18O93k50j90K37K57r49J62R88n79j05L33L99q65l87J51J22
$$ -268 958 -458 -340 353 103 -87 150 407 -542 -380 608 29 -76 257 656 -209 -596 -445 -323
5236c23l99N75J54Q67j271M35O49n92pM42r61M90k27J8M55j071J095k29L07q16
$$ -323 -722 -147 7 874 -397 38 687 95 88 530 -431 59 -168 -150 305 -766 329 100 407 -409
5256d09M33Q7l07j52O68n08L02p4m05R65m48q10R21L05r22J265l48q80J21l52
$$ -409 24 111 -196 -348 320 -188 114 40 -365 600 152 -658 263 568 -354 911 563 -317 -196 -548
5276e48J624m72r90J21J71m71K39N87m2L22j819K433j701P63r78M93K71N50r55
$$ -548 1076 604 -386 -265 -94 -565 -326 261 219 541 -1278 1155 -546 217 -761 -268 3 553 -402
5295d02L50N93p60rj4k29P35l25L32L02j002J7J450j518M3P7n02K00J047N11j176
$$ -402 -52 541 -219 -228 -242 -471 264 -61 271 573 -429 -412 1038 -480 -437 -360 -862 -662 385 896 -280
5316b80k47J41M76q65J32j27Q3P21m54N60m35P3N3O47N52j521R04n81R93q57N45
$$ -280 -527 -386 90 -775 -643 -770 -687 34 -420 140 -295 -222 -169 478 1030 -491 413 -168 825 -32 513
5337E13l73l10nL43m99Mj85Q42P99k067N04P60L1o26N22j99L58r54O33J37k03
$$ 513 140 -170 -175 168 -331 -327 -512 330 1129 -938 -434 326 357 -269 253 54 412 -542 91 228 25
5358B5n85N54r6L7O05r14O87n62K41J86J39m48k56K92P44n00j85Q48q33M66o70
$$ 25 -560 -6 -102 -65 540 -374 313 -249 -8 178 317 -131 -387 -95 649 149 -36 812 -21 445 -225
5379b25J53j83M09m57K35L68n54N1n81J376l15q3j1k87O76o87Q56j542Q39k97
$$ -225 -72 -255 154 -303 -68 300 -254 -203 -784 592 277 194 183 -104 572 -115 741 -801 38 -259
5399b59L63o1L82p70K25L00l77M8P27o54P6J11k46p29J668j279J21L95j32o53
$$ -259 104 43 425 -345 -120 180 -197 -149 578 -76 0 111 -135 -864 804 -475 -354 41 -91 -744
5419g44M53M26r47j48Q77R6j359J808K06j68r72O57l8n52M03J44Q71l09o98N50
$$ -744 -291 135 -812 -960 -83 13 -1346 462 668 500 -472 185 147 -405 -2 142 1013 704 6 556
5439E56n06L03j021K86J107o92K2L43m1q52m57J219j011K24Q81p53M53O21p06
$$ 556 50 353 -668 -382 725 33 55 398 357 -495 -952 267 -744 -520 361 -392 61 682 -24
5458b4O68p73k87J48k66N52M43J09r27K98r59J215l32J175j468r5J828j489K57
$$ -24 644 -129 -416 -268 -534 18 461 570 -357 -59 -1018 197 -135 1040 -428 -523 1305 -184 73
5477G3J34r51o8R77r72J822p08j78M45l22j74p11J298Jp01K83m04O24p66M03r01
$$ 73 207 -744 -812 165 -807 1015 307 129 574 252 78 -633 665 666 -35 248 -156 468 -298 105 -796
5498g96J448k32m84m84L62q7N1n05Q12l12J006j655J047k50q3l19M67LJk31K40
$$ -796 652 420 -64 -548 -186 -273 -222 -727 85 -227 779 -876 171 -79 -162 -481 -14 -11 -10 -241 -1
5519am50L70J324j677R33r13R25p97N23l06j41R34j26j371Q97j70o41J217k57
$$ -1 -451 -81 1243 -434 499 -414 511 -286 237 -69 -210 724 598 -773 124 -46 -687 530 273
5538B73k07K58M35l90p44N1L02O65l37o49j40J019M34o89j65o04K66l43J383k76
$$ 273 66 324 759 369 -375 -324 -22 643 306 -343 -483 536 970 281 116 -488 -222 -565 818 542
5558E42o78J037q54Q3k8Q96j370J57m9M75k80M15l44J3kQ5L20Q7j138K49L26j41
$$ 542 -136 901 47 130 102 998 -372 -215 -264 211 -69 346 2 15 13 98 418 505 -633 -384 -58 -199
5580a99J006k53L2J0p88J73Q68j328L61M13J11m38j72J17p5n5J16N38n45K74o41
$$ -199 807 554 586 596 -192 -19 849 -479 -118 295 406 -32 -204 -87 -162 -217 -101 437 -108 166 -475
5601d75L38j25k84j47Q51j50k18O98Nl39m86M75L93m59j65r05J708Mq41O24n24
$$ -475 -137 -262 -546 -693 158 8 -210 488 493 154 -332 143 536 77 -88 -993 715 719 -122 502 -22
5622b2j49j5J17k42N69j50N04p35j3J10j59P33J77l12j108R97o77J253l67n28
$$ -22 -171 -186 -69 -311 258 108 612 -123 -136 -26 -185 548 725 413 -695 302 -375 878 511 -17
5642a7K53P9j565J324K46r71m9R06r7j4n73O48l98M53m72R21l36n67q6N72j059
$$ -17 236 315 -1250 74 320 -651 -700 206 109 95 -478 170 -228 225 -247 674 338 -229 -315 257 -802
5663h02J101O14n35m27o27M23J119j432K9J047m33K63o02k28L16N96r26J048l60
$$ -802 299 913 378 -49 -676 -253 866 -566 -537 510 77 340 -262 -490 -174 422 -504 544 184
5682A84o45P55j97r34J237p96J002m94Q5l85l63l0J14Q26n22p17O86J10O72r12
$$ 184 -461 294 97 -837 400 -396 606 112 197 -188 -551 -581 -467 359 -163 -880 -194 -84 588 -324
5702c24k98J961j726P65n93Q22j141M07L28J0p5L97p57m21J391J6l88m47J181
$$ -324 -622 1339 -387 378 -215 607 -534 -127 201 211 136 533 -224 -645 746 762 374 -73 1108
5721A108p32K38O7J1m95j37r4r0L04l37P31O4n90N3P09j308K39N77N6m95Q83j412
$$ 1108 376 614 681 692 197 60 -34 -124 180 -157 574 638 48 101 810 -498 -259 318 374 -121 762 -650
5743f50O52QL61J4M4m71m55K06n04J051J81q95L02L07l90M36j23k22L75J53j226
$$ -650 2 10 371 385 429 -42 -497 -291 -795 256 437 -458 -156 151 -239 197 74 -148 227 380 -846
5764h46J757k21o73k28L19k53K65J8n09N99o65l48O70N17j96m61R8k84R59j147
$$ -846 911 690 17 -211 108 -145 120 138 -371 228 -437 -785 -115 402 206 -255 -157 -441 518 -629
5784f29N32Q9o03m8Q81r24J244j376o28J683n69N74p10J321o92q12Q60K45q50
$$ -629 -97 -8 -611 -659 222 -702 542 -834 -1462 221 -348 226 -484 837 145 -667 193 438 -412
5803d12M5L93m5k9m16l23J287o97j66P74o04j7j44O65J16n09m88l13J598m97m17
$$ -412 -367 26 -19 -48 -464 -787 500 -197 -363 411 -193 -210 -354 311 427 -82 -570 -883 715 218 -199
5824a99m77Q86o15O38o19P91o88N32q96J244o14M04l4N8n63L65m08K39n58M12
$$ -199 -676 210 -405 233 -386 405 -283 249 -647 597 -17 387 353 411 -152 213 -195 44 -514 -102
5844a02k55L56L69J32o99P8O75j038N34M36L57q07l64N82l62l2L06J13j00q09
$$ -102 -357 -1 368 500 -199 -121 554 -484 50 486 843 36 -328 254 -108 -140 166 279 179 -630
5864f30J349m82j113R42k01Q38m03q10N24Q03m58K57p91O2L66k12o55L21P30q67
$$ -630 719 237 -876 66 -135 703 300 -510 14 817 359 616 -175 -113 253 41 -614 -293 437 -430
5884d30L3L12M67j37m18R60m13o11M06J13Q8j201K117j828K46m1Q14r14k05Q59
$$ -430 -397 -85 382 245 -173 787 374 -237 169 282 370 -831 1286 -542 -296 -337 477 -437 -642 217
5904B17J09n48QO18K55M97j044p62k57M78M97o9k86k7L05j61Q24n43j71N75j421
$$ 217 326 -222 -214 404 659 1156 112 -650 -907 -429 68 -1 -287 -314 -9 -170 654 111 -60 515 -906
5925i06K09P67k25K68r25R22j33K17j05L86m87O49j85n22N36j038M93Q32j584
$$ -906 -697 70 -155 113 -812 110 -23 194 89 475 -12 637 452 -70 466 -572 -79 753 -831
5944h31Q33n51J004l75K66k14L47j45r13L52O54J03q49j72J199m0j147N12J77
$$ -831 2 -549 455 80 346 132 479 334 -579 -227 427 530 -319 -491 708 668 -479 33 210
5963B10n73K78l39Q81q91K84O16l11J2m29P40m09J77j49k12M21m60n40J126l60
$$ 210 -363 -85 -424 457 -434 -150 466 155 167 -262 478 69 246 97 -115 306 -154 -694 432 72
5983G2l43l1k42J68j09O16P50j385N46k29O96p29j08R79q99L45o48M15L9k11q4
$$ 72 -271 -302 -544 -376 -485 131 881 -504 42 -187 509 -220 -328 651 -248 97 -551 -136 -97 -308 -392
6004c92R1j48Q85M16r63j86N79Q4L71n55l99R62k169Q38K97r2O21L81l41k94n51
$$ -392 -301 -449 436 852 -111 -297 282 366 737 182 -217 745 -1424 -586 -289 -381 240 621 280 -14 -565
6025e65M24M08J070j377Q5q33J558L2J37j288O33p49L3K72P27j465J410l67J51
$$ -565 -141 267 1337 -40 45 -788 770 802 939 -349 284 -465 -432 -160 567 -898 512 145 296
6044B96q19N35N71k61n16K78K65k75k63K12Q21j456O39k75n95J061L79j529J706
$$ 296 -523 12 583 322 -194 84 349 74 -189 23 844 -612 27 -248 -843 218 597 -932 774
6063G74j514J012L08q94R34k49l82k6k78J47m88R64n4k20J59K69k23l98L0N20
$$ 774 -740 272 580 -314 620 371 -11 -37 -315 -168 -656 308 254 34 193 462 239 -159 -129 391
6083C91j209J331n23l38m99M1O68n12O18j95M05n0q40R41J06L09o67L70R7j061
$$ 391 -818 513 -10 -348 -847 -806 -138 -650 -32 -227 178 128 -712 229 335 644 -23 347 444 -617
6103f17J827o57p83p3j17N34M61j93r55O73K02m87mL82J1l37K93k78q8L97l68
$$ -617 1210 553 -230 -303 -420 114 575 382 -573 100 302 -185 -189 193 204 -133 160 -118 -206 191 -177
6124a77J01j51l33K65J005j79o43j03Q43j014Q74o16R21p08P25k05r47L17m21
$$ -177 -76 -227 -560 -295 710 531 -112 -215 628 -386 488 -128 793 85 810 605 -342 -25 -446
6143d46J17j14L93j70Q17m42K22k74o0J72k19R75j520J3L25L71p9j81Q78q77o59
$$ -446 -329 -443 -50 -220 597 155 377 103 43 215 -4 971 -549 -536 -211 160 81 -100 778 -99 -758
6164g58L03J048j771J971j501R62M55j366J87O33J75k8k3o63J19K67J35K23j52
$$ -758 -455 593 -1178 793 -708 254 709 -657 -470 163 338 310 287 -376 -257 10 145 368 216
6183B16l34L58j4n48M40M71o30K20j12k84m99O96j52K56L52K29j579N96L66N4
$$ 216 -118 240 226 -322 118 589 -41 179 67 -217 -716 -20 -172 84 436 665 -914 -318 48 102
6203A02k81q79p0R49L16j82k78L11p11J347l41k91L56m17j85R2j54P62m38l29
$$ 102 -179 -1058 -1128 -179 137 -45 -323 -12 -723 624 283 -8 348 -69 -254 -162 -316 446 8 -321
6223c21J92O29m50j50K57r74J313r09Q39m06J68j074J404k06L2n45J59K62N7o25
$$ -321 -129 500 50 -100 157 -817 496 -413 426 20 188 -886 518 312 344 -201 -42 220 277 -348
6243c48L02r57J386J31p85J789j577L2l51k8L52L56m09j20K02J41j06n48J03P3
$$ -348 -46 -1003 383 514 -271 1518 -59 -27 -378 -406 -54 302 -107 -227 -25 116 10 -538 -435 -362
6263c62N24m59Q64j086K66pJ286m02k89l44N22Q6k75M7m94N06J58o13O94o16J91
$$ -362 162 -297 567 -519 -253 -260 1026 624 335 -9 513 599 324 371 -123 383 541 -72 622 6 197
6284A97m26L0k85P63o07P6K79l54R07k8k27J20l78o20J149l57N50j507J013m16
$$ 197 -229 -199 -484 279 -328 -252 27 -327 580 552 325 445 67 -553 596 239 789 -718 295 -121
6304a21L23J244j577P72o54O43N56n07q47J51l22K9J107j110K18P89j194j03J261
$$ -121 202 1446 -131 641 -13 630 1186 679 -168 -17 -339 -310 797 -313 -95 694 -500 -603 658
6323F58j405J209o60r9K23q4P89j312J161l00p91M48l91R62o58N68K06r38L06
$$ 658 -747 462 -198 -297 -74 -158 631 -681 480 180 -611 -163 -554 408 -250 318 524 -414 -108
6342a08k29L88j0L38r8p75N84n80j3K47Q0N95l51N23q29R4L69K56m83k24J103
$$ -108 -337 51 41 379 281 -494 90 -490 -503 -256 -176 419 68 591 -238 -144 225 481 -2 -226 877
6363H77j911L53P72J64M9q8k37J092j274O47J5q97N46P3J241j835P60k55J117
$$ 877 -1034 -681 91 255 304 216 -21 1071 -203 444 459 -438 108 181 1422 -413 347 92 1209
6382A209j80j659N19K81P35p78o95O50l98O79n17k57L10j38L71J36L66m83k53
$$ 1209 1029 -630 -111 170 905 127 -568 82 -316 363 -154 -411 -101 -239 132 268 634 151 -102
6401a02L17%p3K22m15j1N08q00M6P30j109Q95l09K40M00j191J275j080P0m97J520
$$ -102 215 215 142 364 -51 -62 446 -354 -308 422 -687 208 -101 139 539 -652 623 -457 -387 -884 636
6422F36l19p88J100o38M06n80n7o08J482q16O60k3n29R9m91O13o27m35J131l7
$$ 636 317 -471 629 -9 397 -183 -240 -848 634 -182 478 455 -74 25 -466 147 -480 -915 216 179
6442A79J04k97O9J92J2L21j070N93J28L32r12O08l13j32Q42m01J62k09j07l03
$$ 179 283 -14 55 247 259 580 -490 103 231 563 -349 259 -54 -186 656 255 417 208 101 -202
6462b02L08r02N81R91j442J64O70r16J466r46O10n27m11R97k82n97P59j525J532
$$ -202 106 -796 -215 776 -666 -502 168 -748 718 -228 382 -145 -556 441 159 -438 321 -1204 328
6481C28O0l96l29O97n09K09J30m68L3l11M48M36r36O11%m79O32p50J492l77j95
$$ 328 388 -8 -337 360 -149 60 190 -278 -245 -556 -108 328 -608 3 3 -476 156 -594 898 521 326
6502C26q13Q00mn6m17K07k84L39k91N59m79J19m9n53M41J50k14Q79o51k83K68
$$ 326 -487 313 309 253 -164 43 -241 98 -193 366 -113 6 -43 -596 -155 -5 -219 660 9 -274 -6
6523fm94M43M61K06j095q7j53K52n2L56J065j8j185P42j049L23J21P99m05k4q45
$$ -6 -500 -57 404 610 -485 -572 -725 -473 -525 -169 896 878 -307 435 -614 -291 -170 629 224 200 -645
6544f45J73J536r85L13m11k91J182j213O7Q3J057k00m3m75r40R89j73l11L24L47
$$ -645 -472 1064 79 392 -19 -310 872 -341 -274 -191 866 666 623 148 -792 197 24 -287 37 384
6564C84J85o83k9N1k58M22L15l49J6O99j007M18J0N33n84R73j011k58L09J97K34
$$ 384 569 -114 -143 -92 -350 72 387 38 54 753 -254 164 174 707 123 1096 85 -173 136 333 567
6585E67j440L44N16L5r01R65n97J011j338N45J59o64J148q2k6l87m58J080K40
$$ 567 -873 -529 -13 22 -879 86 -511 500 -838 -293 -134 -798 350 268 242 -145 -603 477 717
6604G17J32q89M85p05K03J019r00k06K88l40k24N52n16L2Q98o73O91o25J68K11
$$ 717 849 -40 445 -260 -57 962 62 -144 144 -196 -420 132 -384 -352 546 -127 564 -61 107 318
6624C18k16jo66j2J120NK41o65p7P08o37l40J189j050L26K40n62M30n42m63O51
$$ 318 102 101 -565 -577 543 548 789 124 47 755 118 -222 967 -83 243 483 -79 351 -191 -654 -3
6645ck66j68J086n63K57n73P10L43n68j15M79r27p26Q90P8jK08o93P07M45p34
$$ -3 -269 -437 649 86 343 -230 480 823 255 140 619 -308 -1034 -144 -66 -67 141 -552 155 600 -134
6666a34j28J49k58M11j123J268j84O90o94R65l73o21N46j498o9P69n09P71L61
$$ -134 -262 -113 -371 40 -1083 185 1 691 -3 962 589 -32 514 -984 -1053 -284 -793 -22 339
6685C39L84m53J85k38j28Nm91nN97q30R77j43p70L03O44q5J15r57L25l12n7Q32
$$ 339 723 270 455 217 89 94 -397 -402 195 -635 342 199 -571 -268 376 291 406 -551 -226 -538 -595 237
6707B37o28Q97K54j055O00j55k1P6J93k93n18M14o8Q5r75K82J079m19j94O5l91
$$ 237 -391 506 760 -295 305 150 129 205 398 105 -413 1 -67 18 -957 -675 404 -15 -209 -144 -535
6728e35Q81m45p7N50K45j152Q65m4p14J33n02J531j032j51J92M88J17r57L23l32
$$ -535 346 -99 -176 374 619 -533 332 288 -426 -293 -795 736 -296 -447 -255 233 350 -607 -284 -616
6748f16O39M12j4m51K96j58N01p18N95l60qK60K4o97j19M21L66o40O18l47Q07
$$ -616 23 435 421 -30 266 108 609 -109 486 126 118 378 402 -295 -414 7 373 -267 351 4 811
6769H11K47j224J292p95o11L47ql87J118l57k00p29J76L33L36p60O93k41l46J398
$$ 811 1058 -166 1126 331 -280 67 59 -328 790 433 233 -496 -320 13 349 -411 282 41 -305 1093
6789A093q09j75j90k21L3j65O34m2N05m14j331J085q51L88J402j233M97k34n85
$$ 1093 284 109 -81 -302 -269 -434 200 158 663 249 -1082 3 -848 -460 942 -291 206 -28 -613
6808f13N38Q09j045O12o87L18Q87r18N15K65j283j02J281N84o55j168O39m02M81
$$ -613 -75 734 -311 301 -386 -68 819 -99 416 681 -602 -704 577 1161 506 -662 -23 -425 56
6827E6M72J73q37Q59q00k57O49j21K19j56M4k98k87p86J235l14n50N78k28m13
$$ 56 528 701 -136 723 -77 -334 315 194 413 257 301 3 -284 -1070 165 -149 -699 -121 -349 -762
6847g62N16K52P73j078K19l45L21l64J373k27o98m6K2M93j61j4n3o85kP16r21
$$ -762 -246 6 779 -299 -80 -425 -104 -468 905 678 -20 -66 -44 449 288 274 221 -464 -466 250 -671
6868f71J498j182j34Q12Q15j255M76n45J22M21j69p68J137n69N93J08j423Q34
$$ -671 827 -355 -489 323 1138 -117 359 -186 -64 357 188 -580 557 -12 581 689 -734 100
6886A00k66J024j755J78J277l24n71K15Q1k78j80M59q23N29K16K21r05J094o21
$$ 100 -166 858 -897 -719 558 234 -337 -122 -41 -319 -499 -40 -863 -334 -118 103 -802 292 -329
6905c29J88N6P3N51N59j229m47P57L61N2K99j124k6Q31o16L9J15M87j77n16k26
$$ -329 -141 -85 -12 539 1098 -131 -578 179 540 592 891 -233 -259 572 -44 -5 110 597 420 -96 -322
6926c22M95K52n23J17L08o38Q3j21P74k42P66L09j178P27j242Q55j18m27M87k45
$$ -322 173 425 -98 19 327 -311 -228 -349 425 183 949 1258 80 807 -435 420 302 -125 362 117
6946A17K19j80j030L49Q64j30j184P87Q44l14M11p07n15O53p56p10O18M60P50
$$ 117 336 156 -874 -525 339 209 -975 -188 656 342 753 46 -469 184 -572 -1282 -664 -204 546
6965E46o21Q8k52j74L85K11n23M47M9L91j233O35P58r82j0O2L58l34K22r5K02
$$ 546 -75 13 -239 -413 -28 183 -340 107 156 547 -686 -51 707 -275 -285 -223 135 -199 23 -72 130
6986A30j131J304k92n67J315K31j183P90o28K91j05L53o85m2q7l72Q30k1k60k78
$$ 130 -1001 303 11 -556 759 990 -193 597 -31 260 155 508 -177 -219 -306 -678 152 131 -129 -407
7006d07P27k61o5k6mP51p04Lr01R05n21P85k83L80n88L3P9p57J701q96P35j424
$$ -407 320 59 -6 -32 -36 715 11 14 -887 18 -503 282 -1 379 -209 -176 -97 -854 847 -49 686 -738
7028g38J096m63o41Q05k79m58J554j422M83l16M26j87K52J63l83K46k95j97O12
$$ -738 358 -105 -746 59 -220 -678 876 -546 -63 -379 47 -140 112 275 -108 138 -157 -354 258
7047B58l41J55Q06l98r01K93K45K60l84n51P04k69l42J136p60q0M9M22o53m07
$$ 258 -83 72 878 480 -421 -128 117 377 -7 -558 146 -123 -465 671 -89 -169 -120 302 -351 -758
7067g58J424q71k98O39K45o84K67P83o65n04Q4M95n01N57o26L11O7l27M09O27
$$ -758 666 -205 -503 136 381 -303 -36 747 82 -422 -338 157 -344 213 -413 -102 -35 -362 47 674
7087F74l97k93j424J278K08l93J34M83j62m20L72k67J37n86J147k7o74M5L42q76
$$ 674 277 -16 -1440 -162 46 -347 -213 270 108 -312 60 -207 -70 -656 491 464 -210 -165 177 -699
7107f99J304L48j020K57m20J116n93O01j809R53k05L37l31m18l76J526j282m41
$$ -699 605 953 -67 190 -230 886 293 894 -915 38 -167 170 -161 -579 -955 571 -711 -1152
7125a152J116M75j70o45J122j164J15J08J49r3j90K15m69O36l12n26J671o43L03
$$ -1152 -36 439 269 -376 746 -418 -303 -195 -46 -139 -329 -114 -583 53 -259 -785 886 243 546
7144E46j095N05J24M15j99n79N06M52p27J06N15M5l28k0o24k6J817l69j144O69
$$ 546 -549 -44 80 495 296 -283 223 675 -52 54 569 614 286 266 -358 -384 1433 1064 -80 589
7164E89r7o66N76J43j030J213o29P86j334J85K31J54o94QN53m2m10J020p29M7
$$ 589 492 -174 402 545 -485 728 99 885 -449 -264 -33 121 -573 -565 -12 -54 -464 556 -173 -126
7184a26l79Q53j8L63o01n03l08N18Q11n81J58p92R64m51m13R14m33L24J7q19m60
$$ -126 -505 348 330 693 92 -411 -719 -201 610 29 187 -605 359 -92 -505 409 -24 300 317 -502 -962
7205i62J95J747q74K73J7n3k77J96m04k59k71j5QO64q89J749q52N29J88j054R81
$$ -962 -767 980 106 379 396 343 66 262 -142 -401 -672 -687 -679 -15 -904 845 -7 522 710 -344 637
7226F37n4j065j17P36n49P00O79j256n12N80L15L66m50j44P64q04k55J009n59
$$ 637 583 -482 -599 137 -412 288 967 -289 -801 -221 94 460 10 -134 630 -174 -429 580 21
7245B1L09m71P38p26m24M36L57p52J528j150Q39r59L73J31q9k76q12L67P75n20
$$ 21 330 -141 597 -129 -553 -117 240 -512 1016 -134 705 -254 119 250 161 -115 -927 -560 215 -305
7265c05R5O56J15o68n04M93j74K39J27J42r25P38o39l63Q55k64N96l56M49o0l22
$$ -305 -210 446 561 -107 -611 -118 -292 -53 74 216 -709 29 -610 -973 -118 -382 214 -142 307 247 -75
7286g5l83L27j54Q21P20j001p80J326l88o1o33L66K36n93P8N40o97M03P23j073
$$ -75 -458 -131 -285 536 1256 255 -525 801 413 352 -281 85 321 -272 -194 346 -351 52 775 -298
7306b98M77N5m37l01O22oL67k92M45j25j161N07r5P3P46l76j367J032k58j43J15
$$ -298 179 234 -203 -504 118 112 479 187 632 507 -654 -147 -242 -169 577 201 -1166 -134 -392 -535 -420
7327d20R89o20K31r8k21j94Q18n42L33k12L52j51j01j089O22m02P96M45l20K65
$$ -420 569 -51 180 82 -139 -333 485 -57 276 64 416 265 164 -925 -303 -705 91 536 216 481
7347D81N89j041J67K2o50J72k09J305j21j196L8n41Q69k53n7O09O55m11l57j15
$$ 481 1070 29 196 218 -432 -260 -469 836 715 -481 -443 -984 -115 -368 -425 184 839 428 71 -44
7367d4J33j55J5K79J11r14J216o90J61o3j3k95K98n95k50L37K45J83L95N13j276
$$ -44 89 -66 -51 228 339 -575 641 -49 112 49 36 -259 39 -556 -806 -469 -224 -41 354 867 -409
7388d09l92R62k35L20j7m71j55m2J28j22M49O0J63j72n47N50m84Q2L36o90N11
$$ -409 -801 161 -74 246 229 -242 -397 -439 -311 -433 16 76 239 67 -480 70 -414 -332 4 -686 -175
7409a75Q64o19j480K076j043j50J911j135j29O04j167m87N99L97m0l75L32o17
$$ -175 689 70 -1410 666 -377 -527 1384 249 120 724 -443 -930 -331 66 26 -349 -17 -634
7427f34K32J085o35N1O46J61r77n49J298m21l93j4P0n73P25m94N76P16p89Q2j44
$$ -634 -402 683 48 99 745 906 -71 -620 678 257 -136 -150 -80 -653 72 -422 154 870 81 163 19
7448A9O19r23j25N69l43J016j081j67Q21p99P09l43l13O70L27o53%K13q68R12
$$ 19 638 -285 -410 159 -184 832 -249 -416 405 -394 315 -28 -341 329 656 3 3 216 -652 260
7468B60l90l6O29o99J28L69l29j88J310p84Q3k01l17O11j37o87P11j43M62j034
$$ 260 -130 -166 463 -236 -108 261 -68 -256 1054 270 353 152 -165 446 309 -378 333 190 652 -382
7488c82R04L47l09l98k24Q48m86o1J10N16p53J79J93n94j54N12k72J19J17L10
$$ -382 522 869 560 162 -62 786 300 239 349 865 112 291 484 -110 -264 248 -24 95 212 522
7508E22n53O25L4Nm80m49N72j1K78N6q34J043n18n58l3P45P3k93K17m2q41O10
$$ 522 -31 594 628 633 153 -296 276 265 543 599 -235 808 290 -268 -301 444 517 224 441 399 -442 168
7530A68p60K5LJ204j167j74R74Q2M3o30l66J024J36k56N19m33r86J689j538K29
$$ 168 -592 -567 -564 640 -527 -701 273 355 398 -232 -598 426 562 306 825 392 -594 1095 -443 -214
7550b14P37k52N4P04j327N15n06k68O87K25m17P30jr24O76n84q64J625k089P34
$$ -214 523 271 325 1029 -298 217 -289 -557 130 355 -62 668 667 -257 419 -165 -1029 596 -1493 -759
7570g59P59l13L99n6o57J080q49N30j115k53K108j260J07l38O96l58M29N2O54
$$ -759 0 -313 86 30 -627 453 -396 134 -981 -1234 874 -386 -279 -617 79 -279 150 202 856
7589H56m69q88J55J08J69L64j91l38N92K59j199M17L72l3n51N6j3J71N4k99M87
$$ 856 387 -501 -346 -238 -69 295 104 -234 358 617 -582 -165 207 174 -377 -321 -334 -163 -109 -408 79
7610G9O48j184J322j271M89K68M56l68o99J337j639N30M84m67M67k47K35j27o81
$$ 79 727 -457 865 -406 83 351 807 439 -260 1077 -562 -32 452 -15 452 205 440 313 -368
7629c68J032m03K41j062K95p62P32N10q16Q27l9R5l52P92j103J52N55q6J10R0
$$ -368 664 261 502 -560 -265 -1027 -295 215 -601 226 187 282 -70 722 -381 -229 326 240 350 440
7649D40J38k95L07Q0j96l55J56J45j92j08p20P19K08k43p20M36R20n84j48j83
$$ 440 578 283 590 670 474 119 275 420 228 120 -600 119 327 84 -636 -200 720 136 -12 -195
7669a95L34N7Q4j55m50K27N65K35m65Pj046J281n17K10q27P66L67K58q2n47j088
$$ -195 139 196 280 125 -325 -98 467 702 237 244 -802 479 -38 172 -655 111 478 736 654 107 -981
7690i81M65K95n13Q11o74K82q18J378k63L23r9k61K91m61K30M31n14R47o27m63
$$ -981 -516 -221 -734 77 -597 -315 -1133 245 -18 305 206 -55 236 -225 5 436 -78 869 242 -221
7710b21L29l40M52p70P1L08Q28j003J40N69j102J441q00o85Q68J47n73M02j1j027
$$ -221 108 -232 220 -550 -479 -171 657 -346 -206 363 -739 702 -98 -783 85 232 -341 61 50 -977
7730i77J488j898J473J2n51J117n55l39K19N96j150J106k69j053N62k3P1n64M47
$$ -977 511 -1387 86 98 -453 664 109 -230 -11 585 -565 541 272 -781 -219 -242 -171 -735 -288
7749b88J031p19n5j56m25O08Q4k89J098j411N84p25L42m65Q33P25m24q5j97N42
$$ -288 743 24 -31 -187 -612 -4 80 -209 889 -522 62 -663 -321 -786 47 772 348 263 66 608
7769F08O0l44m83q72K41J148K96l72m18L61m58P23j167Q5P77m71J72j26q3K33
$$ 608 668 324 -159 -1031 -790 358 654 282 -136 225 -233 490 -677 -592 185 -286 -114 -240 -323 -90
7789i0Q12j73j424J678l70j45o52N57j5k96K3L1r62O33O6Q61o47l12O7P76m46
$$ -90 722 549 -875 803 433 288 -364 193 178 -118 -95 -64 -1026 -393 -327 534 -113 -425 -358 418 -28
7810b8M15m09Rn5j15L80M21l19j14p71M04K78N20j229pL36P6K74q96R7l4K22k87
$$ -28 387 -22 -13 -68 -183 197 618 299 185 -586 -182 96 616 -613 -620 -284 -208 66 -830 -733 -767 -545 -832
7833h32J242l74k47m33O74j04p8L25l94K44j32M03j054Q48o92l23R79J07k95P5
$$ -832 410 36 -211 -644 30 -74 -152 173 -221 23 -109 294 -760 88 -604 -927 52 159 -136 -61
7853f1l28n10K45Q11O09K5j022J53q44J205m9n28R73q70L23j077P01K90k75Q30
$$ -61 -389 -899 -654 157 766 791 -231 -78 -922 283 234 -294 679 -191 132 -945 -244 46 -229 601
7873F01p88J79l57J08N80k77l39N55o9L11l92j094J408R13j499k74o67J977p21
$$ 601 -187 -8 -365 -257 323 46 -293 262 193 504 112 -982 426 1339 -160 -434 -1101 876 155
7892A55N4j20n30J41K37J44j50J69N60q44q04J033l16P51o07Q1m0P27j57l99J94
$$ 155 209 89 -441 -300 -63 81 -69 100 660 -184 -988 45 -271 480 -127 -46 -86 641 484 85 279
7913B79j94n39k54R04N47o72m06O88o43L86J72o55R12m82p5L0l43R3p54K15J732
$$ 279 85 -454 -708 196 743 71 -335 353 -290 96 268 -387 525 43 -32 -2 -345 -252 -1006 -791 941
7934I41r81n96R25l07k62N2O06o99M36K36n73p36J472p68J623q46o20J45K0L29
$$ 941 -40 -636 289 -18 -280 -228 378 -321 115 351 -222 -958 514 -254 1369 523 -97 48 68 397
7954C97p76J373o39q89P03P06m40K92l72l45P35o1m92m44K53M95o03K91l1L76
$$ 397 -379 994 355 -534 169 875 435 727 355 10 745 684 192 -252 1 496 -107 184 153 529
7974E29j175L93L51k42P5J45L33p24l82R30lj000R20q3P02j154M6K99KN67M97
$$ 529 -646 -253 98 -144 -69 76 409 -315 -697 233 230 -770 150 67 769 -385 -339 -40 -38 529 1026
7995A026m95q67P20q54K15R28m42n08M41o7j94R66o21o29N70m8p65P40m92O81
$$ 1026 531 -336 384 -470 -255 673 231 -277 164 97 -97 869 248 -381 189 141 -624 116 -376 305
8015C05m52j81K64J65K1Q14j346L30j76J32m80O79j12L74n75j008J302m71P08
$$ 305 -147 -328 -64 101 122 936 -410 -80 -256 -124 -604 75 -37 337 -238 -1246 56 -415 293
8034B93p55L40N9j77p38J044N93j45o24K44k62K25J01L4j61o72R98m64j84P53
$$ 293 -462 -122 -63 -240 -978 66 659 514 -110 134 -128 97 198 232 71 -601 397 -67 -251 502
8054E02n20k37J54r10O34N54J18n62m49P61O28o47p77J333j689J155l25j1K12
$$ 502 -18 -255 -101 -1011 -377 177 295 -267 -716 45 673 26 -751 582 -1107 48 -277 -288 -76
8073g6j0M84p40o75J349J35p14K68o27N09N10n9q53n82J844Q0j033k17O28m98
$$ -76 -86 398 -342 -1017 332 467 -247 21 -606 -97 413 354 -499 -1081 763 843 -190 -407 221 -277
8093b77m37P43k13P22l35R90j204j02l02J2N74K03N5m08L13L05j168L55q2j040
$$ -277 -714 29 -184 538 203 1193 -11 -113 -415 -403 171 374 429 21 334 639 -529 -174 -256 -1296
8113a296K038p63L25K0m37O31l13R4q7M02l99n7n22J278n69r58O95p71M93K01
$$ -1296 742 -21 304 324 -113 518 205 299 212 614 215 158 -364 914 345 -613 82 -689 -196 5
8133EnJ24j235J355l35l61Q33m94M48r24K55m77J195m46J99L71q83M29J33K8j01
$$ 5 0 124 -1111 244 -91 -452 381 -113 335 -589 -334 -811 384 -62 137 508 -375 54 187 215 114
8154A14q56J019J7K54K14m79R64n24m95m41J17o2Q69j206Q67k86l09M03p88O6
$$ 114 -742 277 294 548 762 283 1247 723 228 -213 -96 -158 711 -495 372 86 -223 180 -608 -542
8174e42J207l84L46j068j98R99j79n88M95L60q3o27P04k75O10j229N35
$$ -542 665 281 627 -441 -639 360 181 -407 88 448 365 -262 442 167 777 -452 83
8191H3
$$ Imaginary data points
##PAGE= N=2
##DATA TABLE= (X++(I..I)), XYDATA
0@%%%%%%%%%%%%%%%J08k16K16k16K16k24L32m32M42n50O53p61R25j036J193j407
$$ 0 0 0 0 0 0 0 0 0 0 0 0 0 0 0 0 108 -108 108 -108 108 -116 216 -216 226 -324 329 -432 493 -543 650 -757
31g57J622j839K057k281K576k902L251l659M079m530N040n595O193o854P572q360
$$ -757 865 -974 1083 -1198 1378 -1524 1727 -1932 2147 -2383 2657 -2938 3255 -3599 3973 -4387
47d387R222j0161J1194j2328J3579j4964J6509j8231K0164k2362K4878k7792L1202
$$ -4387 4835 -5326 5868 -6460 7119 -7845 8664 -9567 10597 -11765 13113 -14679 16523
60A6523l5273M0230m6414N4374o5051Q0237j03693J44846k37853Q50997j14418
$$ 16523 -18750 21480 -24934 29440 -35611 44626 -59067 85779 -152074 698923 584505
71E84505j454365R12023O69036m96860p39321N24330M39466k78436l34256L0618
$$ 584505 -869860 42163 711199 214339 -524982 -652 438814 160378 -173878 -143260
81a43260K70374L75680n42398m77371P57128M95153r86150m11135J180558R1541
$$ -143260 127114 502794 -39604 -516975 240153 735306 -250844 -661979 518579 610120
91F10120j101248J22751Q50632j08615p35190K22133M01541m2398j77599k75252
$$ 610120 -491128 -368377 482255 373640 -361550 -139417 262124 219726 42127 -233125
101b33125J72633N02434k73142o74776L74655P97079n62549q73138R07815O02311
$$ -233125 -60492 441942 168800 -505976 -131321 665758 103209 -769929 137886 740197
111G40197r77320k47855P46293K04656o33073r5082M14553N4625j40944k31210
$$ 740197 -237123 -484978 261315 465971 -167102 -262184 152369 206994 66050 -165160
121a65160l3689M26012J01243o92945r728Q54243j51184r30260L93508Q06655
$$ -165160 -198849 227163 328406 -364539 -374267 479976 328792 -601468 -207960 598695
131E98695n46193n50988M45667M44559m25337k65595K68319J09205N5197k10969
$$ 598695 52502 -498486 -52819 391740 -33597 -299192 -30873 78332 133529 -77440
141g7440k24935L57523L49610n38518l61103P21493K77766q70473r7111Q81619
$$ -77440 -302375 55148 404758 -133760 -494863 226630 504396 -366077 -463188 418431
151D18431j55471o76777J72951N28700j79069l62227J48138J35657R8548r6166
$$ 418431 262960 -413817 -240866 287834 108765 -253462 -105324 30333 128881 32715
161C2715k91942J34188M67658k55828n83493M48534N43134n94732m30768O83756
$$ 32715 -259227 -125039 342619 86791 -496702 -48168 494966 -99766 -530534 153222
171A53222K17615n84056j08264M67180M6476l33243K2131O2107J36316N1294l23577
$$ 153222 370837 -213219 -321483 145697 192173 -141070 -118939 -56832 79484 130778 -192799
182a92799o5930M72094L7808o31035J16891O69142k49924o25093L97123M69915
$$ -192799 -258729 213365 251173 -379862 -262971 406171 156247 -468846 -71723 398192
192C98192m11140k99949L25614K04884k49200p3580K2854J05367J48573k30318
$$ 398192 -12948 -312897 12717 217601 -31599 -105179 -82325 23042 171615 -58703
202e8703k22625L41658K84976n23903j91605O11813O7909o19691O6309N42739
$$ -58703 -281328 60330 345306 -178597 -370202 241611 309520 -310171 -243862 298877
212B98877j67743l81922J50340K67853j27367r5477k9442L1288K31131j05265
$$ 298877 131134 -250788 -100448 167405 40038 -55439 -84881 -53593 177538 72273
222G2273l22430J64850M27504l17238m12725M37196L19256m89424k09675M95915
$$ 72273 -250157 -85307 342197 24959 -387766 49430 368686 -120738 -330413 165502
232A65502N5738l67183q835K52182n307j01297n1703l3386K16754L3912l16110
$$ 165502 221240 -145943 -154778 97404 92097 -9200 -60903 -94289 122465 156377 -159733
243a59733l0670M44327o6635n00895K03998M40640k67243l75963L31298K29336
$$ -159733 -190403 253924 187289 -313606 -109608 331032 63789 -312174 19124 248460
253B48460k77085j28978J78403P4825o3598m8578j06295J60592J62742k55088
$$ 248460 -28625 -157603 20800 95625 32027 -16551 -122846 37746 200488 -54600
263e4600j90492L66245J60449m71486l3920M57071l9898m28879J36103L14167
$$ -54600 -245092 121153 281602 -189884 -223804 233267 193369 -235510 -99407 214760
273B14760j52166j84558Q4975J11943j7444l0576j37760O7238K34902j40098k83775
$$ 214760 62594 -121964 -36989 74954 57510 26934 -110826 -43588 191314 51216 -232559
284b32559K17915L10670l36390k23694L60712J55714l66685o3661L14448j9533
$$ -232559 -14644 296026 -40364 -264058 96654 252368 -114317 -177978 136470 116937
294A16937j83980o230J02554L2383M88j35119l1115K46415o686l02699M0512L76224
$$ 116937 -67043 -73273 29281 61664 62152 -72967 -104082 142333 135647 -167052 -126540 249684
306B49684j56438l39465K18169K68494k39461j97398K37499Q7555j38190o6978
$$ 249684 93246 -246219 -28050 240444 983 -196415 41084 128639 -9551 -76529
316g6529O4290N2948L8635r4012j24984K03404J13157k61002j10374L41152L0544
$$ -76529 -12239 40709 79344 -14668 -139652 63752 176909 -84093 -194467 146685 177229
327A77229l52629M8494L03300p8149k62919J26621J50542p4770q8236M857N8519
$$ 177229 -175400 -126906 176394 98245 -164674 -38053 112489 37719 -50517 -45660 12859
338A2859O4993m7922j69585J17726J89037j62624k14081K37700J82927k90909
$$ 12859 77852 29930 -139655 -21929 167108 4484 -209597 28103 211030 -79879
348g9879r2658K59414O2516k46670L928J61933j0717p6504m2121L5008P9597J4543
$$ -79879 -172537 86877 149393 -97277 -93349 68584 57867 -18637 -60758 -25750 53847 68390
360F8390j75100J5813K21138m9075k54027J01608K61687j79814j85143J65745
$$ 68390 -106710 -90897 130241 81166 -172861 -71253 190434 10620 -174523 -8778
370h778J51299j70430r1671J33761L8534l9456o1541k428Q0049O7297j41074p8253
$$ -8778 142521 -27909 -119580 14181 52715 13259 -48282 -50710 29339 96636 -44438 -122691
382a22691J98635N5134k34092l3526K66851m6639k20329N5201J92606o9152j50837
$$ -122691 75944 131078 -103014 -136540 130311 83672 -136657 -81456 111150 41998 -108839
393a08839Q1936O7172j680o4341m2649O4551Q8655q3678j34722J34648J32353
$$ -108839 -26903 40269 38589 -25752 -68401 -3850 84805 1127 -133595 1053 133406
404A33406j64758j27903K15193O7296j90862l8643J65445K9539j53069J6659N9187
$$ 133406 -31352 -159255 55938 123234 -67628 -106271 59174 88713 -64356 -47697 11490
415A1490L0032k9698q1074K6152J09832j3130j61379N2781J78925p2224j87510
$$ 11490 41522 11824 -69250 -43098 66734 53604 -107775 -54994 123931 51707 -135803
426a35803J25141J52084j34369j10782J09847R9989j20697m1725M6683N1723J509
$$ -135803 -10662 141422 7053 -103729 6118 106107 -14590 -56315 -9632 42091 43600
437D3600r3650J454Q8991M0432j38848l1478J67354K857j78930K6749J59041m6056
$$ 43600 -50050 -48596 40395 80827 -58021 -89499 77855 80712 -98218 -71469 87572 41516
449D1516j23397K8972J31958n8318o0981J8693L3609O0458q0525n2469P2693P9465
$$ 41516 -81881 -52909 79049 20731 -40250 -21557 12052 72510 -8015 -60484 12209 91674
461I1674r5183r9134J26055Q4285j42639o8678J58287L1318j24518k7251J19102
$$ 91674 -3509 -102643 23412 107697 -34942 -103620 54667 85985 -38533 -65784 53318
472E3318M990p1378j6938K4990P9240o5992o0053L8165Q1834k4186j30315P3493
$$ 53318 58308 -13070 -30008 -5018 74222 8230 -51823 -13658 68176 43990 -86325 -12832
484a2832J14660q7092r6113Q7379P3074p1567q0076P2700N0765n7170k5601j5793
$$ -12832 101828 14736 -81377 6002 79076 7509 -72567 133 50898 -6272 -31873 -47666
496d7666Q7966k651q5871K692Q6549L1768j29935N731J23547j1292j24118K0370
$$ -47666 40300 37649 -48222 -45530 41019 72787 -57148 -51417 72130 60838 -63280 -42910
508d2910J14904l5367r4946L1847P1180j7315m2368l8480Q8507J8235q0944j2797
$$ -42910 71994 36627 -58319 -26472 44708 27393 -14975 -53455 35052 53287 -27657 -40454
520d0454M2945P2278j00769n2576J10686K5033r1333k6284Q7999K2921p2150k5667
$$ -40454 2491 74769 -26000 -78576 32110 57143 -34190 -60474 27525 50446 -21704 -47371
532d7371O7588J4974l0007n5407L7427O3146n5699m8065J6592R4780n4194q5871
$$ -47371 20217 35191 5184 -50223 -12796 50350 -5349 -53414 -36822 57958 3764 -82107
544h2107P1220O4417m4661q0140O6563O2759n8329m8088M0868M1576j1892o7897
$$ -82107 -10887 53530 8869 -71271 -4708 58051 -278 -48366 -7498 34078 22186 -45711
556d5711J5367P9616l5514m1514j3276Q4428K278j04307L5359O2574r793p7367
$$ -45711 -30344 49272 13758 -27756 -41032 43396 45674 -58633 -23274 39300 29507 -47860
568d7860J2371O7535j4175n8321M478N3473J0382m9966k3953P1039R871m5003
$$ -47860 -35489 32046 17871 -40450 -35972 17501 27883 -22083 -46036 25003 34874 -10129
580a0129m0223O4637M3610r2398q050N2272L5878o8070l1690P4082J2723m6850
$$ -10129 -50352 14285 57895 -34503 -42553 9719 45597 -22473 -54163 19919 32642 -14208
592a4208k6029M4259L5636m0611m7395N6322K7547l1511m4597K6557P3374o4002
$$ -14208 -40237 4022 39658 -953 -48348 7974 35521 4010 -40587 -14030 59344 -4658
604d658l1585L6129M5806k9621n6193M5292L4442k2624m9203K2288M4138j5088
$$ -4658 -36243 -114 45692 16071 -40122 5170 39612 16988 -32215 -9927 34211 19123
616A9123n5419J7029N0984j2125m9014k233P5919k6724m4770P849N0744N060p2102
$$ 19123 -36296 -19267 31717 19592 -29422 -31655 44264 17540 -27230 -19381 31363 36423 -35679
629c5679K1556M2620N62m8602o419N1989P545n1600r859N3275N723l7975l1610
$$ -35679 -14123 28497 29059 -19543 -25962 26027 33572 -18028 -27887 25388 31111 -6864 -38474
642c8474O3627R208n0414j0283L3212L6108n9118j1948L8723K3679l5517l1364
$$ -38474 25153 34361 -16053 -26336 6876 42984 -16134 -28082 10641 34320 -1197 -32561
654c2561M4573K3586l2177l4606L8723K5910k6933m1885L8165L3741l7699k4444
$$ -32561 12012 35598 3421 -31185 7538 33448 6515 -35370 2795 36536 -1163 -25607
666b5607J4804N0498l7608l1900K4429L2351j2898m7418K5474L4650j1537m4075
$$ -25607 -10803 39695 2087 -29813 -5384 26967 14069 -33349 -7875 26775 15238 -28837
678b8837J6943L9025r765m2435P132M9796j8667l0479n852N1860q914m4171R398
$$ -28837 -11894 27131 17366 -25069 -17937 31859 13192 -17287 -23139 28721 19807 -24364 -14966
691a4966L0444J0750n0700M576L6515N973m1037n908M0600L438l1007j8141M7288
$$ -14966 15478 26228 -24472 -19896 16619 22592 -18445 -24353 16247 19685 -11322 -29463 17825
704A7825K259k8301j8427L5307J9350l9607q953K1580L0018m0402j5622K7794
$$ 17825 20084 -8217 -26644 8663 28013 -11594 -20547 1033 31051 -9351 -24973 2821
716B821K0984k4251k9570L2469J9847j9718l2759L0558K2703k1407k7195J6786
$$ 2821 23805 -446 -30016 2453 22300 2582 -30177 381 23084 1677 -25518 -8732
728h732L7490l1161j9794J0008L6964j9342l1402J8975K5718o704l8834K0883
$$ -8732 28758 -2403 -22197 -12189 24775 5433 -25969 -6994 18724 12020 -26814 -5931
740e931K2823m857l4427Q372L2681j0244k5066l848M0752j2001k4267k264L2040
$$ -5931 16892 12035 -22392 -14020 18661 8417 -16649 -20497 20255 8254 -16013 -18277 13763
753A3763L964l6686M093K1770J3698l8484k126K7188Q863k9221j2495L7655K036
$$ 13763 17727 -18959 -14866 6904 20602 -17882 -20008 7180 16043 -13178 -25673 11982 14018
766A4018j9446j9824L5778P577k5605j2155K1253K0757l3779o679J4116K4137
$$ 14018 -5428 -25252 10526 18103 -7502 -19657 1596 22353 -11426 -18105 -3989 20148
778B0148k5496j8848K6179J4741j4139k8344K8546J2826j0258k6375J9550K0104
$$ 20148 -5348 -24196 1983 16724 2585 -25759 2787 15613 5355 -21020 -1470 18634
790A8634j8672j5943M585L2592j8047j6941L610K9524q365l1205J6092J7210j73
$$ 18634 -38 -15981 -11396 21196 3149 -13792 -10182 19342 10977 -20228 -4136 13074 12901
803A2901l4131J2126K2059o534k3552K436K8784q972j3665p522L2763n001j9478
$$ 12901 -21230 -9104 12955 6421 -17131 -14695 14089 5117 -8548 -16070 16693 11692 -7786
816g786l113K0167J2236l5300M025J6547J2072k9570k926K5295J485j5278j1147
$$ -7786 -10899 9268 21504 -13796 -9771 6776 18848 -10722 -13648 11647 13132 -2146 -13293
829a3293K4740K137j2878j4934K0723R485j7268j0928R658K6357k8487o944J6068
$$ -13293 11447 13584 706 -14228 6495 15980 -1288 -12216 -2558 23799 -4688 -11632 4436
842D436J5678j6023j8683K4245O158j0935j8934J6649Q280p859j7622O308K1314
$$ 4436 20114 4091 -14592 9653 15811 4876 -14058 2591 10871 3012 -14610 -8302 13012
855A3012j1259j2704k425L3055j5268j7480Q618J6892o06l0565J8994J0773k562
$$ 13012 1753 -10951 -13376 19679 4411 -13069 -4451 12441 11835 -18730 264 11037 8475
868H475j7912L653J8168k055j4108m187K2434l088j1476j4475K8641r97k5432
$$ 8475 -9437 -5784 12384 10329 -3779 -7966 14468 11380 -96 -14571 14070 13073 -12359
881a2359M060J0003J1917k9493P134J4225J050r784o544J6806J745p327j3752
$$ -12359 -8299 1704 13621 -15872 -8738 5487 6537 -3247 -9791 7015 8760 1433 -12319
894a2319J3524P526p294k1379J8351J4160k2317k259N112K3949k5073o308J7628
$$ -12319 1205 8731 1437 -19942 -1591 12569 -9748 -12007 -6895 17054 -8019 -14327 3301
907C301J278k261j8041J3707O837k266j5269O117J6070k031j9391P360K4324j6557
$$ 3301 4579 2318 -15723 -2016 4821 2555 -12714 -6597 9473 7442 -11949 -4589 19735 3178
921C178o552j849K3717j4637j6301J4893k035N372j7067M307Q816J644q349p556
$$ 3178 -3374 -5223 18494 3857 -12444 2449 414 5786 -11281 -6974 1842 3486 -4863 -12419
935a2419J5612Q066j7556q235K4687o476q199j0337K0868L919k4963J4553J10
$$ -12419 3193 11259 -6297 -14532 10155 3679 -4520 -14857 6011 9930 -15033 -480 -370
948c70R616j2791l553J0754K838l354j4757J2824R923j1892j4241J8973L790r714
$$ -370 9246 -3545 -7098 3656 6494 3140 -11617 1207 11130 -762 -15003 3970 7760 -1954
962a954q169J4832J2810k3578J1297l905J0702n313j2307J1573k346O126j8051
$$ -1954 -10123 4709 17519 -6059 5238 1333 12035 6722 -5585 5988 3642 9768 -8283
975h283J942J6902m673j7806R824J1895n610j2803N25K2901j9947K356o81N219
$$ -8283 -6341 10561 5888 -11918 -2094 9801 4191 -8612 -8087 14814 -5133 -2777 -3458 1761
989A761N852j7740R529J154R441j3077l971J6637N72j3508k170J5213k972j1992
$$ 1761 7613 -10127 -598 556 9997 -3080 -7051 9586 10158 -3350 -5520 9693 6721 -5271
1003e271k465J9674j4590J08J72K10J3306j7916Q393l542J0920m204j5973J6137
$$ -5271 -7736 11938 -2652 -2544 -2372 -2162 11144 -6772 1621 -1921 8999 4795 -11178 4959
1017D959L844q625j0042J3012M467q105r798J6783j667q340K714m398J5249j4793
$$ 4959 8803 178 -9864 3148 7615 -490 -10288 6495 4828 -3512 -798 -5196 10053 -4740
1031d740J205k434Q149L218k0945J4153L996r72j1967P126J2176p640r656R361
$$ -4740 -3535 -5969 2180 5398 -15547 -1394 2602 1630 -10337 -3211 8965 1325 -8331 1030
1045A030O140p955K724r579J5391p476m318Q74N38J3692k0910M323Q977J516j1205
$$ 1030 7170 -785 1939 -7640 7751 275 -4043 -3169 -2631 11061 -9849 -5526 3451 4967 -6238
1060f238j184J3007k974r353J89J1344p009K226p166P961K644o780J338l888J8131
$$ -6238 -7422 5585 2611 -6742 -6553 4791 -2218 8 -7158 803 3447 -3333 -1995 -5883 12248
1075A2248j7088j852P646K809m674j0810J3836P17o531l924J0311k331j226l889
$$ 12248 -4840 -6692 954 3763 -911 -11721 2115 2832 -3699 -7623 2688 357 -869 -4758
1089d758L574P431p810Q78o787J7287r991o660Q590J336J676j4560J1794K055
$$ -4758 -1184 6247 -1563 -685 -7472 9815 -176 -6836 1754 3090 4766 -9794 2000 4055
1103D055l668n451N040K263r52k892k896J0826p530J813p325J0953J844j2479
$$ 4055 387 -5064 -24 2239 1287 -1605 -4501 6325 -1205 608 -6717 4236 6080 -6399
1117f399N113K976P081j5429N312O341j695n035j762P453k063q65o174R171j880
$$ -6399 -1286 1690 8771 -6658 -1346 4995 3300 -1735 -3497 3956 1893 1028 -5146 4025 2145
1132B145n44p276N411Q932j4884N839K2P427r122j532Q131j667j564o473P697
$$ 2145 1601 -5675 -264 8668 -6216 -377 -355 7072 -2050 -3582 4549 2882 1318 -5155 2542
1147B542r96K178q501N920K526k239l670k575J3007r103m19r70P626l088q938
$$ 2542 1546 3724 -4777 1143 3669 1430 -2240 -4815 8192 -911 -1330 -2300 5326 2238 -6700
1162f700Q541j251K862r872P016J369m33m391L11P413k962j671o207J2645o185
$$ -6700 1841 590 3452 -6420 596 1965 1532 -2859 -2548 4865 1903 232 -5975 6670 485
1177D85k462j055M432K584j1055P351r08M920o930P11L616l47q3n970P813k419
$$ 485 -1977 -3032 1400 3984 -7071 280 -628 4292 -2638 -1927 1689 1342 1259 -4711 3102 683
1193F83K04q768J0032M87n612N69M45R411j1332L059M2O210n321m200O266j214
$$ 683 887 -7881 2151 2638 -2974 -2405 -1960 7451 -3881 -822 -780 5430 109 -4091 2175 961
1209I61R86q826P850Q4j89n652M246M881n220J088l904R827q430K92M29K838J224
$$ 961 1947 -6879 971 1055 866 -4786 -540 4341 -879 209 -3695 6132 -2298 -2006 -1577 1261 2485
1226B485r482P621m79L990p000L324L770j361l333k449J0016p246K62l643O223
$$ 2485 -6997 624 145 4135 -2865 459 4229 2868 -465 -2914 7102 -144 118 -3525 2698
1241B698j893m293K054J080N479r981N518J11K958m307j864O511k805p25n562
$$ 2698 805 -3488 -1434 -354 5125 -4856 662 773 3731 -576 -2440 4071 1266 541 -5021
1256e021Q313l786P59l524M018K930n158J425k201Q155p668O07J024K342k146
$$ -5021 3292 -494 265 -3259 759 3689 -1469 -44 -2245 5910 -1758 -1151 -127 2215 69
1271F9o155P400j300J977n235N379R47q91k264N36O541p089K774m797P413n673
$$ 69 -6086 1314 14 1991 -3244 2135 3082 2191 -73 463 7004 -85 2689 -2108 5305 -368
1287c68j891K558O29K306q162O369M0O89m056j124M775k566j327l029P602m069
$$ -368 -2259 299 928 3234 -4928 1441 1481 2170 -1886 -3010 1765 -801 -2128 -5157 2445 -1624
1303a624R34l188L897K888n969K690o09O687q321J685K570p7k273m089O356k982
$$ -1624 -690 -3878 19 2907 -3062 -372 -981 5706 -2615 -930 1640 1563 -710 -4799 1557 -1425
1319a425J356m517O800o68p62j417O71N660p140L729m990P566m074l588M857j699
$$ -1425 -69 -4586 2214 1546 784 -633 38 5698 -1442 2287 -2703 4863 789 -2799 2058 359
1335C59K082o688O582p12j42l257J354J586j658j742k153O501o001K817m499O707
$$ 359 2441 -4247 2335 1623 1481 -1776 -422 1164 -494 -2236 -4389 2112 -3889 -1072 -5571 1136
1351A136n8o983P063k241N373p509M585J721l262J041k153K639k078O46j686L838
$$ 1136 1078 -5905 1158 -1083 4290 -3219 1366 3087 -175 866 -1287 1352 -726 -80 -1766 2072
1367B072k421J984k461Q82O075r739N029k893N463o189p41O324l074R09m284O356
$$ 2072 -349 1635 -826 56 6131 -3608 1421 -1472 3991 -2198 -2939 3385 311 1220 -3064 3292
1383C292k784J026l214L621j381P36j554l902Q482r091J929l17M123k168n490
$$ 3292 508 1534 -1680 1941 560 1296 -258 -4160 4322 -4769 -2840 -3157 966 -1202 -6692
1398f692R290m577J414j315K776j307J085q05n02J660M21J82o512R120k987j085
$$ -6692 2598 -1979 -565 -1880 896 -411 674 -131 -633 1027 1448 1630 -4882 4238 1251 166
1414A66j148J823L477j0157R194k290j365r50L27J362k836K126k358K076N91K048
$$ 166 -982 841 4318 -5839 3355 1065 -300 -1250 -923 439 -2397 -271 -2629 -553 38 2086
1430B086p365P689j04l141q36L45P202j2161O697J048l666P94K49L744n247M579
$$ 2086 -5279 2410 2306 -835 -1671 -1326 5876 -6285 412 1460 -2206 -1412 -1163 2581 -2666 1913
1446A913k654j546J502L996o728K586M849m892q75l50R711j1917L886N107n680
$$ 1913 -741 -2287 -785 3211 -3517 -931 3918 -974 -1849 -2199 7512 -4405 -519 4588 -1092
1461a092K607j857L154l891K467M60m479J599M045n659k335R100m860j543j566
$$ -1092 1515 -342 2812 -1079 1388 1848 -2631 -1032 3013 -2646 -4981 4119 -741 -2284 -3850
1476c850R982p690l512R919n439Q23k231N702o122R19N189o555J403M291k314
$$ -3850 6132 -1558 -5070 4849 -590 233 -1998 3704 -2418 -1499 3690 -2865 -1462 2829 515
1491E15n953Q804l72m667k153Q752l894p647J2158o497N67q65N627m950k377J0199
$$ 515 -5438 3366 2994 -1673 -3826 4926 1032 -6615 5543 -954 -387 -1252 4375 -575 -2952 7247
1507G247q456q68N666N14j0017O393M395n611l535P927J57j1739J1156k514k141
$$ 7247 -1209 -2077 3589 4103 -5914 479 4874 -737 -4272 3655 3812 -7927 3229 715 -1426
1522a426j191N087n94q010J1576n588m075N852M012r495O28R396n434n516O725
$$ -1426 -2617 2470 1876 -6134 5442 -146 -4221 1631 5643 -3852 -3224 6172 738 -4778 1947
1537A947M776j3319O654M838n900j724M417K736j2119J1295q40p507L109P313
$$ 1947 6723 -6596 58 4896 -1004 -2728 1689 4425 -7694 3601 2761 -4746 -1637 5676
1551E676o310o529J1970j860p461K375R821j1046k56R151o247j798L384M474j2663
$$ 5676 -634 -7163 4807 2947 -4514 -2139 7682 -3364 -3620 5531 -716 -2514 870 5344 -7319
1566g319Q424N023j0075P10Q301j695j2002J2223K271j0633J211J0971q671n856
$$ -7319 1105 6128 -3947 -3237 5064 3369 -8633 3590 5861 -4772 -3561 7410 -1261 -7117
1580g117J2510m449m212K080P838j2287J814J1973j0970j926Q008K522j4226P340
$$ -7117 5393 944 -3268 -1188 6650 -5637 -3823 8150 -2820 -4746 3262 5784 -8442 -1102
1594a102P902r207l846J1115j419j1742J1157L96o899M11J1247j0052o323J6895
$$ -1102 6800 -2407 -6253 4862 3443 -8299 2858 3254 -3645 -3234 8013 -2039 -8362 8533
1608H533p934p026P709P321j5105P89J3788r536o121J0543L699j5983J0175O305
$$ 8533 599 -6427 1282 8603 -6502 -5713 8075 -1461 -7582 2961 6660 -9323 852 7157
1622G157j0431j564J1140l797j3120J4932o80r763K214J2017j0554p412J7261
$$ 7157 -3274 -4838 6302 2505 -10615 4317 3637 -6126 -3912 8105 -2449 -9861 7400
1635G400n764r125P119R049j4607J536J1762q804n117R844L345j6960J2522O072
$$ 7400 1636 -7489 -370 8679 -5928 -4392 7370 -1434 -6551 3293 6638 -10322 2200 8272
1649H272j4077O55J2915l780j5299J6785J150j2820K933J1466j0182n964J5590
$$ 8272 -5805 -5150 7765 3985 -11314 5471 6621 -6199 -3266 8200 -1982 -7946 7644
1662G644o252q689P913Q965j6477L664J4464j3422n260J1882L040j8578J1209
$$ 7644 1392 -7297 616 9581 -6896 -3232 11232 -2190 -7450 4432 7472 -11106 103
1675A03Q428j2311l039J4348l759j3133J5019R94j3131L744J3727j4718m451J8259
$$ 103 8531 -3780 -6819 7529 3770 -9363 5656 6650 -6481 -2737 10990 -3728 -8179 10080
1689A0080q049j0175R447Q962j8518M259J5981j4107m081J1917J843j7273J0856
$$ 10080 2031 -8144 1303 10265 -8253 -3994 11987 -2120 -6201 5716 7559 -9714 1142
1702A142Q406j4621k129J5341p064j4014J9505j182j3549L885J5620j5153o058
$$ 1142 9548 -5073 -7202 8139 1075 -12939 6566 5384 -8165 -4280 11340 -3813 -9871
1715i871J9080p593r520Q527Q401j6041L191J3720j1798o404J5102O9j7771J4033
$$ -9871 9209 1616 -7904 623 9024 -7017 -3826 9894 -1904 -8308 6794 6863 -10908 3125
1729C125O680j3998l387J7695o340j6253K0095j692j3744M477J4277j4080m476
$$ 3125 9805 -4193 -7580 10115 3775 -12478 7617 5925 -7819 -3342 10935 -3145 -7621
1742g621J7612r041r050J0946P730k0397N555J4427j3437p124J5832J803k0861
$$ -7621 9991 950 -8100 2846 10576 -9821 -4266 10161 -3276 -10400 5432 7235 -13626
1755a3626J4183P473j3583j093J6190q045j3409J7602q0j4699O721J3381j5937
$$ -13626 557 8030 -5553 -6646 9544 1499 -11910 5692 5612 -9087 -2366 11015 -4922
1768d922l618J8770q022j2312J2422R830k1613O677J3178j1803o547J4273Q77
$$ -4922 -8540 10230 2208 -10104 2318 12148 -9465 -2788 10390 -1413 -7960 6313 7190
1781G190j9854J3956Q376j6809O51J5646q985j2495K0271j747j4814N752J4292
$$ 7190 -12664 1292 9668 -7141 -6490 9156 171 -12324 7947 6200 -8614 -2862 11430
1794A1430j5901m249J7525p056j0570R755Q851j9721O497J4224j3863m899J4717
$$ 11430 -4471 -8720 8805 1749 -8821 934 9785 -9936 -3439 10785 -3078 -7977 6740
1807F740j264j7625J3893P202j5860q68J8433r664j1467J7833j506j2555M727
$$ 6740 5476 -12149 1744 8946 -6914 -7782 10651 987 -10480 7353 5847 -6708 -1981
1820a981J4216j6599l663J9309r414j1657J2846N574j8606O748J4178j3778p132
$$ -1981 12235 -4364 -8027 11282 1868 -9789 3057 8631 -9975 -3227 10951 -2827 -9959
1833i959J6324j196j7791J5398M460j4371j49J7087j0522j1408K0912n836j3618
$$ -9959 6365 5169 -12622 2776 7236 -7135 -7284 9803 -719 -12127 8785 2949 -10669
1846a0669Q647J3011j6222k844J9002r673j1341J3816N282j8760P055J2393j1959
$$ -10669 -2022 10989 -5233 -8077 10925 1252 -10089 3727 9009 -9751 -2696 9697 -2262
1859b262o526J6362j474j7678J6780K761j3711J743J5063r973j2522J9665k500
$$ -2262 -8788 7574 6100 -11578 5202 7963 -5748 -4005 11058 1085 -11437 8228 5728
1872E728j2960O647J2219j6667k231J6953q511r947J1803O378k0078R088J0733
$$ 5728 -7232 -585 11634 -5033 -7264 9689 1178 -8769 3034 9412 -10666 -1578 9155
1885I155j3324l388J3708r62j7537J5381N670j5352J965J5023j0619r321J7541
$$ 9155 -4169 -7557 6151 5189 -12348 3033 8703 -6649 -4684 10339 -280 -9601 7940
1898G940l100j2074O388J3100j8704J075J4561r052q098J1047N838j9171Q703
$$ 7940 4840 -7234 -846 12254 -6450 -5375 9186 134 -7964 3083 8921 -10250 -1547
1911a547J1119j3259k767J3958k128j5737J3383N518j4224K96J6325j2931p062
$$ -1547 9572 -3687 -6454 7504 5376 -10361 3022 8540 -5684 -5388 10937 -1994 -9056
1924i056J7628m177j0760M456J3220j7000q21J6511r031r313J0889N439j7013
$$ -9056 8572 4395 -6365 -1909 11311 -5689 -6510 10001 970 -8343 2546 7985 -9028
1937i028P737R828j1107n103J6430n661j3583J4986J066j0561p82J5831j1871
$$ -9028 -1291 8537 -2570 -7673 8757 3096 -10487 4499 5565 -4996 -5778 10053 -1818
1950a818p405J6976m729j0504O229R251j3223j026J4131q219r181J2590L238j6312
$$ -1818 -9223 7753 3024 -7480 -1251 8000 -5223 -6249 7882 -337 -9518 3072 6310 -10002
1964a0002R148Q196j0155m771J4415l842j4319J5541J881j1497J342J3042r758
$$ -10002 -854 7342 -2813 -7584 6831 2989 -11330 4211 6092 -5405 -4063 8979 -779
1977g79o969J4555k807j1523P117Q754j4919J752J2323o796q319J0749M509j7184
$$ -779 -7748 6807 4000 -7523 -406 8348 -6571 -4819 7504 708 -7611 3138 7647 -9537
1991i537Q969P240r996k269J0434j465j3086J3368J270j0622K116J0987j0641
$$ -9537 -568 6672 -3324 -5593 4841 3376 -9710 3658 4928 -5694 -3578 7409 -3232
2004c232l480J2161l685q211N696R508j5481K845J0376p398m876Q281M140j5061
$$ -3232 -6712 5449 1764 -6447 -751 8757 -6724 -3879 6497 -901 -5777 2504 6644 -8417
2018h417P963O794r508k095J1594l933j0962J1642K187j0539J579J1756j0524
$$ -8417 -454 6340 -3168 -5263 6331 2398 -8564 3078 5265 -5274 -3695 8061 -2463
2031b463m143J2664m836o341M953P647j3212K026R960p418l768P425K042j3172
$$ -2463 -6606 6058 1222 -5119 -166 7481 -5731 -3705 6255 -1163 -4931 2494 4536 -8636
2045h636Q174N877q352l375J2026l535j0826J2598p35p105K23R884p813m178J1723
$$ -8636 -462 5415 -2937 -6312 5714 2179 -8647 3951 3216 -3889 -3666 6218 -1595 -5773 5950
2060E950m870o661M954P460j2249K362Q691n180n232P460K910j2426P894L634
$$ 5950 1080 -5581 -627 6833 -5416 -3054 5637 457 -4775 2685 5595 -6831 1063 4697
2074D697o451k708R429l220q866J0188Q3o352J704Q128q913j815Q822k025p453
$$ 4697 -1754 -4462 4967 1747 -7119 3069 3152 -3200 -1496 6632 -2281 -4096 4726 2701 -4752
2089d752M592P160j2059L844N416n021l974P035K034j0206P507L270o013k366
$$ -4752 -160 7000 -5059 -1215 4201 -820 -4794 2241 4275 -5931 1576 4846 -1167 -3533
2103c533Q694l855o996R521q73n948J388P098p295k163Q485k624m519K759N918
$$ -3533 5161 1306 -5690 3831 2958 -2990 -1602 5496 -1799 -3962 4523 1899 -2620 139 6057
2118F057j0197L592N649n361k415M799K082r914O343L309n047j546P706l344m944
$$ 6057 -4140 -548 5101 -260 -2675 2124 4206 -5708 635 3944 -1103 -2649 5057 1713 -3231
2133c231P389j020m583N32P158p839j497Q330m686k552K965M185r003L577M437
$$ -3231 4158 3138 -1445 -913 6245 -1594 -3091 5239 553 -1999 966 5151 -3852 -275 4162
2148D162m035l492N842P33p733O264J440n206p50O073k426n852Q126m02m030o26
$$ 4162 127 -3365 2477 3210 -4523 1741 3181 -2025 -2775 3298 872 -4980 3146 2744 -1286 -1912
2164a912P174p464r78O525l175l253K357M693q029L475K852l047k060N022Q08
$$ -1912 5262 -2202 -3180 3345 170 -3083 -726 3967 -4062 -587 2265 -782 -2842 2180 2988
2179B988p360O416k84l241k13M947k609m302O248j447k976K12M858m667p84L899
$$ 2988 -4372 2044 1760 -1481 -1694 3253 644 -3658 2590 1143 -1833 -1621 3237 -1430 -2214 1685
2195A685j702k342K098K450o560L920K040k324k243L615J348p258O206J464l663
$$ 1685 -17 -2359 -261 2189 -4371 -451 1589 -735 -2978 637 1985 -5273 933 2397 -1266
2210a266n31M052k159k736L877q98k271K55N012m348N17K497k042k125J659L098
$$ -1266 -1797 2255 96 -2640 1237 339 -1932 -1677 3335 -1013 -496 2001 -41 -2166 -507 2591
2226B591n502L258J955k216k299M023m4m507M619l96k656o68L955k229k805M227
$$ 2591 -2911 347 2302 86 -2213 1810 1766 -2741 1878 1482 -1174 -1842 2113 -116 -2921 1306
2242A306j239j430j669M882m623O20L447k947m20O0L906m657J576K443j788j342
$$ 1306 67 -1363 -3032 1850 -2773 -2153 1294 -1653 -2073 -2013 1893 -2764 -1188 1255 -533 -1875
2258a875L025n5l498L142n93p07j936M674k655k411L588o57O7j480L095k545m42
$$ -1875 1150 1095 -2403 739 146 -561 -2497 2177 -478 -2889 699 42 109 -1371 1724 -821 -1263
2275a263K744j746r40P01K278l720K908J38j255j315K953N02m129L592k235K16
$$ -1263 1481 -265 -1205 -504 1774 -1946 962 1100 -155 -1470 1483 1985 -2144 1448 -787 -571
2291e71m79K464j754q73L389k612M13j662L103k298J002O80L62j727K66K605m202
$$ -571 -1050 1414 -340 -1213 2176 -436 -23 -1685 1418 -880 122 802 1164 -563 -297 2308 -1894
2308a894L509j751R68k199K186J413m570L291o72j50j553K766j054r75Q86n5n56
$$ -1894 1615 -136 832 -1367 819 2232 -2338 953 281 131 -1422 1344 290 -685 201 146 -410
2325d10k72K110k736K199l8j057K46j70J348l315K890r7m46k25Q34o8k181K851
$$ -410 -682 1428 -1308 891 853 -204 42 -128 1220 -2095 795 698 252 27 861 793 -1388 1463
2343A463q39K2j409L316k710N64K03m29P03k100L234k213J007m26j11J35L5J661
$$ 1463 624 646 -763 2553 -157 407 610 181 884 -1216 2018 -195 812 386 275 410 445 2106
2361B106k643J654m53K47j094J232q42j653K848r61k2o78K275k385Q5J844j523
$$ 2106 -537 1117 664 911 -183 1049 207 -1446 1402 441 419 -259 2016 -369 -284 1560 37
2378C7J568j658K236l518J385o20L71K19j98J141j988J786r25Q67q10J175r18
$$ 37 1605 -53 2183 -1335 50 -570 -199 20 -178 963 -1025 761 -164 703 -107 1068 150
2395A50n37K343j521N63j635J074q73M79L71q78J530j874J387j977K567l52n12
$$ 150 -387 1956 435 998 -637 437 -436 43 414 -464 1066 -808 579 -1398 1169 817 305
2412C05Nj009J583j418J576j651J544j884O31P93j591J834j475J016j229J472
$$ 305 310 -699 884 -534 1042 -609 935 -949 -318 475 -1116 718 -757 259 -970 502
2428E02j12j057K97N47J23j380K145k500K089j101M08Q05k141K122k029L137l201
$$ 502 390 -667 -370 177 300 -1080 1065 -1435 654 -447 -39 766 -1375 747 -1282 1855 -1346
2445a346J311n49J6J096j573J352j641N21K35J604j397J035j559K06J823k802
$$ -1346 -35 -584 -568 528 -1045 307 -1334 -813 -578 1026 -371 664 -895 -689 1134 -1668
2461a668K841k767J582p43O87O48j688J400j438J378j624J106j32Q74j313O7O19
$$ -1668 1173 -1594 -12 -755 -68 580 -1108 292 -1146 232 -1392 -286 -418 456 -857 -790 -171
2478a71l35J678j898J638j296R30l15j151K105j318R17j255R15q52J78P6J199
$$ -171 -506 1172 -726 912 -384 546 231 -920 1185 -133 784 -471 444 -408 -230 -154 1045
2495A045n6k454L031k769K435j363P08j01j912L069k513J972k151J194l98L73
$$ 1045 989 -1465 1566 -1203 1232 -131 577 476 -1436 1633 -880 1092 -1059 135 -263 110
2511A10q43J174K37j311J358j740J962j639P42k63r3P52r37J020j057N97n33L34
$$ 110 -733 441 678 -633 725 -1015 947 -692 50 -213 -306 446 -491 529 -528 69 -464 -130
2529a30j69j0J302k034J786j542J082j454J511l67P8N60n97J055k061K096k074
$$ -130 -299 -309 993 -1041 745 -797 285 -1169 342 -25 53 613 16 1071 -990 1106 -968
2546i68J158r5L69N77j359J558k244K099n16J84l62p08O26q93J528j095J428j410
$$ -968 190 95 464 1041 -318 1240 -1004 1095 579 763 401 -307 319 -574 954 -141 1287 -123
2564a23j65jK96N8r24J208j699J418n17O93j018M65K90j359J625m94J639j599
$$ -123 -288 -289 7 65 -859 349 -1350 68 -449 244 -774 -309 -19 -1378 247 -247 1392 -207
2582b07L64j8M98N4r80J303j834J070p96J322j115L09Q29j978K477k011P85m89
$$ -207 157 139 637 691 -289 1014 -820 250 -546 776 -339 -30 799 -1179 1298 -713 72 -417
2600d17M08j141J183k06l94J773j816J013j711R01m40O18j07p58J127n45J612
$$ -417 -9 -1150 33 -173 -567 1206 -610 403 -1308 -407 -847 -229 -336 -1094 33 -512 1100
2617A100j435q1R71p77J87j056K466j791J464j229J497j406l64J021n10Q45k104
$$ 1100 -335 -416 555 -222 -35 -1091 1375 -416 1048 -181 1316 -90 -454 567 57 902 -1202
2634a202K347j553P17k72n82N32p25R93m87N70j176P43l37k94N22J88K84j734
$$ -1202 1145 -408 309 37 -545 -13 -738 255 -232 338 -838 -95 -432 -726 -204 -16 268 -1466
2652a466K064k115J531k8J48l89k10P22j189R77n77J478j589P77J96l17J688k568
$$ -1466 598 -1517 14 -14 134 -255 -465 257 -932 45 -532 946 -643 134 330 13 1701 -867
2670h67K259k228J279o4q5K08j272K125k837L057j525R77j187J251j029k96J127
$$ -867 1392 -836 443 379 294 502 -770 1355 -1482 1575 50 1027 -160 1091 62 -234 893
2687H93r67N62j330J441j107K95K30J49K25j349K048k608K475j075q7K40q90J017
$$ 893 -74 488 -842 599 -508 -213 17 166 391 -958 1090 -1518 957 -118 -205 35 -855 162
2705A62r67J183j042O69m90M49J33n54J410j725J559j349J511r24R1Q03j109K50
$$ 162 -805 378 -664 5 -485 -36 97 -457 953 -772 787 -562 949 25 116 919 -190 60
2723F0o71K001j188K05j02P23k52n26J63l50J618j474O54q86J92J04j027R41p50
$$ 60 -611 1390 202 407 305 1028 776 250 413 63 1681 207 861 -25 167 271 -756 185 -565
2742e65J051j480J745q88M83K60n52o04O01Q98j855K271j539R19j164O65J252
$$ -565 486 -994 751 -137 346 606 54 -550 51 949 -906 1365 -174 745 -419 246 1498
2759A498l087K197j213J042n41N07k62q93J436o07R1n09O94j08k47o98O89l86
$$ 1498 -1589 608 -605 437 -104 403 141 -752 684 77 168 -341 353 245 -2 -700 -11 -397
2777c97l84M53p27J888j122K7K89q61R70q92O10l20O72j265J279j000O45J024
$$ -397 -781 -328 -1055 833 -289 -262 27 -834 136 -756 -146 -466 206 -1059 220 -780 -135 889
2795H89j137J378j889R56q6j23M53m85O50j666J895j469J262q70K95q93N52J077
$$ 889 -248 1130 -759 197 111 -12 441 -44 606 -1060 835 -634 628 -242 53 -840 -288 789
2813G89j395Q12m17N86j334J509j116K09M76j323J868j440R38r96ML13j57J029
$$ 789 -606 206 -211 375 -959 550 -566 -357 119 -1204 664 -776 162 -834 -830 -517 -674 355
2831C55q55J371j771J766j222Q43J37j357Q33n55J108j140J708k181J430k36k5
$$ 355 -500 871 -900 866 -356 487 624 -733 100 -455 653 -487 1221 -960 470 234 209
2848B09M24N5j45j5k22o36O87q7p39M90l02J5j187K663k809K676r54j045P83l81
$$ 209 633 688 543 528 306 -330 357 270 -469 21 -281 -266 -1453 1210 -1599 1077 123 -922 -139 -520
2868e20J348k018K265j564R34r74J20J295o29M63L01k57j177J126p04p08J094
$$ -520 828 -1190 1075 -489 445 -529 -409 886 257 720 1021 764 -413 713 9 -699 395
2885C95q55J758j450J530j655Q12l4k26j59j339J907o15j0RO46j365P15M22j294
$$ 395 -460 1298 -152 1378 -277 535 501 275 116 -1223 684 69 59 68 714 -651 64 486 -808
2904h08J115Pj96k92R47q8r26J285j522J180k27L15p67l94P63n59q1k16J194j426
$$ -808 307 314 118 -174 773 685 -241 1044 -478 702 475 790 23 -371 392 -167 -248 -464 730 -696
2924f96J89M69L75j424J003J370j915O59j040J938j786O84P4n00J75O7J417j618
$$ -696 -507 -38 337 -1087 -84 1286 -629 30 -1010 928 -858 -174 -100 -600 -425 -358 1059 -559
2942e59J346j297J454j154Q9m22K00J209j423J019r62O82k20Q4O83j334R61j096
$$ -559 787 -510 944 -210 -121 -543 -343 866 -557 462 -500 182 -38 46 729 -605 356 -740
2960g40J779j475Q70p35M23r61k24K196j837J412j606J533j162k24P38n01R54
$$ -740 1039 -436 434 -301 122 -839 -1063 1133 -704 708 -898 635 -527 -751 -13 -514 440
2977D40j422J230m87R28q48R14j034M80k9j001R77j596K375k071J464m47k49J766
$$ 440 -982 248 -239 689 -159 755 -279 201 172 -829 148 -1448 927 -1144 320 -127 -376 1390
2995A390k129R62j020P38N23n79J321j688P19j489J145m89P58k72l48J86o51J170
$$ 1390 -739 223 -797 -59 464 -115 1206 -482 237 -1252 -107 -596 162 -110 -458 -272 -923 247
3013B47j082J015n24Q26j231J110k74j97l16N65K31j165M27J74k69q4N27j23l63
$$ 247 -835 180 -344 482 -749 361 87 -110 -426 139 370 -795 -368 -194 -463 -547 -20 -143 -506
3032e06J194j247N24m92J093j078M68j37o62J229j002J519q16j29j87J51J241
$$ -506 688 -559 -35 -527 566 -512 -44 -181 -843 386 -616 903 87 -42 -229 -78 1163
3049A163j028k3q56J129q09Q12n61o43J586j111O54m91N55p76Q02p91O51k14p56
$$ 1163 135 112 -744 385 -424 388 -173 -816 770 -341 313 -178 377 -399 403 -388 263 49 -707
3068g07K092k417J802o07K16n97Q4Q12p92J270n90K62j193J345j523J185K4j163
$$ -707 1385 -1032 770 163 379 -218 -134 678 -114 1156 566 828 -365 980 -543 642 666 -497
3086d97Q07j602J819k10J159j747JQ12p73J068k85N29j086M11m80o06Q75o88J054
$$ -497 310 -1292 527 317 1476 -271 -270 542 -231 837 552 1081 -5 406 -74 -680 195 -493 561
3105E61j284N62j51N67J091j554L18P01j028k20J806j700M14o97J517l15j133
$$ 561 -723 -161 -312 255 1346 -208 110 811 -217 -437 1369 -331 83 -614 903 588 -545
3122e45K246j218k34j209K164j100m37M02n12J502j291J449j571Q39p0j724J075
$$ -545 1701 483 249 -960 1204 104 -333 69 -443 1059 -232 1217 -354 485 415 -1309 -234
3139b34l43J107r63N51j463K023k97o38M00j141K079j881O03j22O34j548N62m70
$$ -234 -577 530 -433 118 -1345 678 381 -257 143 -998 1081 -800 -197 -319 315 -1233 -671 -1141
3157a141J074N19n07N61j289J074o10P7M94o18P79j225R44m2rL98m19L33p09J781
$$ -1141 -67 452 -55 506 -783 291 -319 -242 252 -366 413 -812 132 90 81 479 60 393 -316 1465
3177A465j355N54j559K035k104J818p33k51Q27j246J165j193J211o9m54j9N37
$$ 1465 110 664 -895 1140 -964 854 121 -130 697 -549 616 -577 634 565 111 92 629
3194F29m05j138J569o75P47p24m98M42r86J351j508P63J146o34n32Q68L6j304
$$ 629 224 -914 655 -20 727 3 -495 -53 -1039 312 -1196 -433 713 79 -453 415 451 -853
3212h53J667j363P4j33Q46k32M16k35K04k7j598K045j020J032j300P79q6k76J334
$$ -853 814 -549 -475 -608 238 6 422 187 391 364 -1234 811 -209 823 -477 302 216 -60 1274
3231A274k128J171p31N17j42l44J101j633K036q29k22l63O44K84j156K4P57M53
$$ 1274 -854 317 -414 103 -39 -383 718 -915 1121 292 70 -293 351 635 -521 -497 260 713
3249G13j471J579j282N62o08R55j70o44J031r64J83m19J490o72j24M0m94J126
$$ 713 -758 821 -461 101 -507 448 278 -366 665 -299 -116 -535 955 283 159 199 -295 831
3267H31r75K73o79J430j299O04J42j195P04m12J626j467O2K33Q13r23M58J048
$$ 831 -144 129 -550 880 -419 185 327 -868 -164 -576 1050 -417 -355 -122 691 -232 226 1274
3285A274k043J304r10N37p95R18M7K97J54p62j32j127J226n24m92J138J85o93
$$ 1274 -769 535 -375 162 -633 285 332 629 783 21 -111 -1238 -12 -536 -1028 110 295 -398
3303c98J98Q97r34JM81l8j62M03J84j142K86m52P41Q59K11j407N61o2Mo95K25
$$ -398 -200 697 -237 -236 245 207 45 448 632 -510 -224 -676 65 924 1135 -272 289 227 231 -464 -239
3324b39J425o49n36O89j650O43o8J172r50K74j06L97r63Q9J422j521L93Q29l93
$$ -239 1186 537 1 690 -960 -317 -385 787 -163 111 5 402 -561 -472 950 -571 -178 651 258
3343B58q69R60p9l51O53j461L36K22Q82j535L93J939q17l74j756J564j025Q86
$$ 258 -611 349 270 -81 572 -889 -553 -331 551 -984 -591 1348 531 157 -1599 -35 -1060 -174
3361a74J085k116Q98J13Ll31l6R14p35J0R25N85j159N38l71k07q77J892l2k75
$$ -174 911 -1205 -307 -194 -191 -522 -558 356 -379 -369 556 1141 -18 520 149 -58 -935 957 925 650
3381F50J82j06p00l63J215j954J269m46K9k89N90o45j29J69J154p73o92J341R86
$$ 650 832 726 26 -337 878 -1076 193 -253 -224 -513 77 -568 -697 -528 626 -147 -839 502 1488
3400A488k916J831J58l94j029K108j047L46J68j152L25j25O41j081O45qK47k80
$$ 1488 -1428 403 561 167 -862 1246 199 545 713 -439 -114 -239 402 -679 -34 -42 205 -75
3418g5L40k46j044R43L23k10j089J769o53j405J321j62J61j032J714r3j009K77
$$ -75 265 19 -1025 -82 241 31 -1058 711 58 -1347 -26 -188 -27 -1059 655 562 -447 -170
3436a70R12j280L44J782k664Q63M93M93j936J666Q87j757J04O6M41o76J710q02
$$ -170 742 -538 -194 1588 -1076 -213 280 773 -1163 503 1390 -367 -263 -197 244 -432 1278 476
3454D76j257R78k24m02k8J91L32j324J727n54r07Q67J036j169j46J146l76j145
$$ 476 -781 197 -27 -429 -457 -266 66 -1258 469 -85 -992 -125 911 -258 -404 742 366 -779
3472g79J706K22j751O51j12J19j99J144j296k00J192L91o17j270K650k773J117
$$ -779 927 1149 -602 49 -63 56 -143 1001 -295 -495 697 1088 471 -799 1851 -922 195
3489A95p26J320j479J128J423k470R25K62J10j544Q91R03j156K51M9k20j399K601
$$ 195 -531 789 -690 438 1861 -609 316 578 688 -856 35 938 -218 33 82 -138 -1537 1064
3507A064j208r1j40K06M82j362K256k007N00J42M76n90k64K027k230P41j4J561
$$ 1064 -144 -235 -375 -169 313 -1049 1207 -800 -300 -158 318 -272 -536 1491 -739 2 -12 1549
3525A549k929J965k8j200J461l03p31n70J450m74p61J162J50r49m62J813j988
$$ 1549 -1380 585 557 -643 818 515 -216 -786 664 190 -571 591 741 -208 -670 1143 -845
3542h45J59J168M01j324Q2J892j997J44J074o30j219J662j40j092J388J49R9j789
$$ -845 -686 482 883 -441 -359 1533 -464 -320 754 124 -1095 567 427 -665 723 872 971 -818
3560h18R62R8j162J147o9n49L78J521j964k78N53N33j181J642o5k135J401Q61
$$ -818 144 242 -920 227 158 -391 -13 1508 -456 -734 -181 352 -829 813 748 -1387 14 875
3578H75r81j404K364J95j977J182J101p32j319K531j378q65J087p86p71R30K299
$$ 875 -106 -1510 854 1049 -928 254 1355 623 -696 1835 457 -408 679 -107 -878 52 2351
3595B351k952n8L32Q66j484Q54O31j241J131m58j9j021J947o88j404J554l9m86
$$ 2351 -601 -659 -327 539 -945 -91 540 -701 430 -28 -47 -1068 879 191 -1213 341 302 -184
3613a84j044J248J25j187J084L72l02p71M61j47M64Q15j117n49R38O60j707O26
$$ -184 -1228 20 145 -1042 42 414 112 -659 -198 -345 119 934 -183 -732 206 866 -841 -215
3631b15L37l69N7J180j420K33Q94l65q12n75J714L21j478K34L87j169N98K127
$$ -215 122 -247 -190 990 -430 -197 697 332 -480 -1055 659 980 -498 -264 123 -1046 -448 1679
3649A679j623j054J618O6k087J442P55k092K540j187M5o91J364k35j958J827q39
$$ 1679 56 -998 620 686 -1401 41 796 -1296 1244 57 102 -589 775 540 -1418 409 -430
3666d30K71j583J681O27k42K54j50j502R32J273j694K21M98N36j406J161N12j946
$$ -430 -159 -1742 -61 566 324 578 428 -1074 -142 1131 -563 -342 156 692 -714 447 959 -987
3684i87J682m8j385m8J736m44n63J030m06n63j507K261j015j002J605N4j583J167
$$ -987 695 647 -738 -786 950 506 -57 973 567 4 -1503 758 -257 -1259 346 400 -1183 -16
3702a6O82j828J424j99K23o03L99P66k012R13J394j040j322J947m68j602K090
$$ -16 666 -1162 262 63 286 -317 82 848 -1164 -251 1143 103 -1219 728 260 -1342 748
3719G48k83J09j069J985j977J41J279N65k119N18K091k478J94P94J144j509P58
$$ 748 465 574 -495 1490 -487 -346 933 1498 -621 -103 1988 -490 -296 498 1642 133 891
3736H91o58j547J539M11p5j443R80L35j120J087M28r22o63J593j666L13L59J664
$$ 891 233 -1314 225 636 561 -882 98 433 -687 400 828 -94 -757 836 -830 -517 -158 1506
3754A506k762J282L52j357P98m38O22j138J164L67j586J483K41L78j519J796j573
$$ 1506 -1256 26 378 -979 -181 -619 3 -1135 29 396 -1190 293 534 912 -607 1189 -384
3771c84N17k09nj78m16J388p22k00M33M65j343R98K7j107M25O58N11j761J146
$$ -384 133 -76 -81 -259 -675 713 -9 -209 224 689 -654 344 371 -736 -311 347 858 -903 243
3790B43K54j623J075o48R91k52P39r16Q5k03O02n17j100K355j532L9j62J647j020
$$ 243 497 -1126 -51 -699 292 40 779 -137 -52 -255 347 -170 -1270 1085 -447 -408 -570 1077 57
3809E7NJ093r43r66P08j46j585J607J032k150J616N24r49p5Q57q74l62R06K30
$$ 57 62 1155 212 -754 -46 -192 -1777 -170 862 -1288 328 852 -97 -172 685 -189 -551 355 585
3828E85j063J50J251r61J339j043m54Q8j67J554k438J044k97P91j340J069K98
$$ 585 -478 -328 923 -38 1301 258 -196 -108 -275 1279 -1159 -115 -412 379 -961 108 406
3845D06p49L50L88k14r11J468p43J33M54o41q05J068P36p12p80O86Q00j526O12
$$ 406 -343 7 395 181 -730 738 -5 128 582 -59 -864 204 940 228 -552 134 934 -592 20
3864B0N15j109j70m4rJ82N05P67J24j02k00k08r5M85k72r60J125m80n63J49J554
$$ 20 535 -574 -744 -788 -797 -615 -110 657 781 679 479 271 176 661 389 -571 554 74 -489 -340 1214
3885A214j380k10J305j199k30N22J315j889P34J57Q8n00M77K05m54p95Q29n60
$$ 1214 -166 -376 929 -270 -500 22 1337 -552 182 339 427 -73 404 609 155 -640 189 -371
3903c71l55J228p23j84J48J034j637L35J181j005M1j5M2Q0k2O40r64L88j8L84
$$ -371 -726 502 -221 -405 -257 777 -860 -525 656 -349 -308 -323 -281 -201 -223 417 -547 -159 -177 207
3923B07p32R20N82p32m11Q19o98J07M40M1o87j59J743k031L82P95j205K12L24
$$ 207 -525 395 977 245 -166 653 -45 62 502 543 -144 -303 1440 -591 -209 586 -619 -407 -83
3942h3R55r19n9K45j81Qk15Q94j591J607j034J116n00n42N47j115J847r68P36
$$ -83 872 -47 -106 139 -42 -34 -249 645 -946 661 -373 743 243 -299 248 -867 980 12 748
3961G48K2l11o15o52J177j64K75o33Q42o82j53M53n5M6K09p78k31P41n13O88l63
$$ 748 770 459 -156 -808 369 205 480 -153 689 7 -146 307 252 298 507 -271 -502 239 -274 414 51
3982E1k79J11j257J587L27k39K52n00n91R10j83o20O71p89J252l53l51O84j100
$$ 51 -228 -117 -1374 213 540 301 553 53 -538 372 189 -431 240 -549 703 350 -1 683 -417
4001d17P69J61O31j916J309o84mJ12P07j91j155N84L02J87j675J339o85O63P45
$$ -417 352 513 1144 -772 537 -147 -151 -39 668 477 -678 -94 208 395 -1280 59 -626 37 782
4020G82j120K52N43r97N58K48m12m74L59J270j395J131j260M85O6Km5p2k98R48
$$ 782 -338 -86 457 -540 18 266 -146 -620 -261 1009 -386 745 -515 -30 36 38 -7 -79 -377 571
4040E71M34r75R6j181P33O76M84j448J503m58l00q4N74k93j159R33J23l8j525
$$ 571 1005 30 126 -1055 -322 354 838 -610 893 435 135 51 625 332 -827 106 229 191 -1334
4059a334R60q0P88q45J80M60l02M67o58N35k82N29q26Q36k16j19k00M73r49M2
$$ -1334 -374 -454 334 -511 -331 129 -173 294 -364 171 -111 418 -408 428 212 93 -107 366 -583 -541
4079e41M12K82n49k38J421q07q07P68L92p42M26k34J039j341N58j068N86O61o5
$$ -541 -129 153 -396 -634 787 -20 -827 -59 333 -409 17 -217 822 -519 39 -1029 -443 218 153
4098A53j26k56Q34k08O74j194M40o59L82N17j072P87m97O72j148J604j448J140
$$ 153 27 -229 605 397 1071 -123 317 -342 40 557 -515 272 -225 447 -701 903 -545 595
4116E95o8k79L05j978J776r03R83o42O25j436O36J414j447K35J11M35j43K52j145
$$ 595 527 248 553 -1425 351 -552 431 -211 414 -1022 -386 1028 -419 -184 -73 362 219 471 -674
4135f74M97P56k84q35J258q04k9n26L43O07J5p23k69J080o83K46N7J53k99k07
$$ -674 -177 579 295 -540 718 -86 -115 -641 -298 309 324 -399 -668 412 -271 -25 32 185 -114 -321
4155c21L67M2L98N19j638R63l83M57l62j33L10k01N81o75j79O35o95Q69r24R12
$$ -321 46 88 486 1005 -633 330 -53 404 42 -91 219 18 599 -76 -255 380 -315 554 -370 542
4175E42j114J08p0R39p25J4N73K91k66L0J09j254J138K04p82m73Q03L88j221P46
$$ 542 -572 -464 -534 405 -320 -306 267 558 292 322 431 -823 315 519 -263 -736 67 455 -766 -20
4195b0pM80m58L18o5k23M54o15J011r10j42k02K89k77K75j23M83M9n61J198n37
$$ -20 -27 453 -5 313 248 25 479 -136 875 -35 -177 -379 -90 -367 -92 -215 268 317 -244 954 417
4216D17K18j183N49l21K60J235j381J81J38O85p23k84P91L31j58j138m84O02J373
$$ 417 635 -548 1 -320 -60 1175 -206 -25 113 798 75 -209 582 913 755 -383 -867 -265 1108
4235A108j750Q56K79j067M90n75R08L6m40M02q72M43j84k46Q52o16Q39M06j184
$$ 1108 -642 214 493 -574 -84 -659 249 285 -155 247 -625 -182 -366 -612 240 -376 463 869 -315
4254c15M2J293j701J004j098J173q41J098l6j530J915j543N06j087J210M54j92
$$ -315 -273 1020 -681 323 -775 398 -443 655 619 -911 1004 -539 -33 -1120 90 544 352
4271C52r36M6Q63j13k23o39K46N15K60j072M62J47l5R49j153J07L40M00m74l97
$$ 352 -584 -538 325 212 -11 -650 -404 111 371 -701 -239 -92 -127 822 -331 -224 116 516 42 -355
4291c55P44n59P67p33J156j016j17P97j136Q50K4k3R5j49M6o77R03j022Q19j397
$$ -355 389 -170 597 -136 1020 4 -113 684 -452 398 422 399 494 345 391 -286 617 -405 414 -983
4311i83J593m31j22L49J13k70j49J2j43k86Q96J14k54K6j297L84J646j03j047
$$ -983 610 179 57 406 519 249 100 112 -31 -317 579 693 439 465 -832 -448 1198 1095 48
4330D8k89M28k32N22o21l36J123r42K35j21K62J20n68J175m03k23m23O58r30O89
$$ 48 -241 187 -45 477 -144 -480 643 -299 -64 -185 77 197 -371 804 401 178 -245 413 -517 172
4350A72Q4j40J44k88j68N63q08O43r61P67L29l27K36P31j376k95K32L72J9L50
$$ 172 256 116 260 -28 -196 367 -441 202 -759 8 337 10 246 977 -399 -694 -462 -90 -71 279
4370B79j038M52J072j114N05j01L09M72j353J285m76k2N53q52L49J74j032J764
$$ 279 -759 -307 765 -349 156 55 364 836 -517 768 292 270 823 -29 320 494 -538 1226
4388A226j342J101n70n33Q3o06M60J40M40j92KM44p00L30m77K76J19n30n8O23
$$ 1226 -116 985 415 -118 -35 -641 -181 -41 399 207 209 653 -47 283 -194 82 201 -329 -387 236
4408B36m2n22M55r63J422K7q4Q9j180N48l24K26J89O18o2q91L65m0j511J303L33
$$ 236 194 -328 127 -836 586 613 529 618 -562 -14 -338 -112 77 695 633 -258 107 67 -1444 -141 192
4429A92o77N17L83k50j40K78j30m8m11L99O6o00M65K9L02J03j061J393p32R32
$$ 192 -485 32 415 165 25 303 173 125 -286 113 179 -421 44 73 375 478 -583 810 78 1010
4449A010j270K1k00L47J124r13n35J56M9M23R7k28m49J094j941R91N07R0p22M38
$$ 1010 -260 -239 -439 -92 1032 119 -416 -260 -211 212 309 81 -368 726 -1215 -224 283 373 -349 89
4469H9p08O65m01O88J84m13Q76j194K73n29O87L55l10l94N53n48l20j99Q13m0
$$ 89 -619 46 -355 333 517 104 980 -214 59 -470 217 572 262 -132 421 -127 -447 -646 167 127
4489A27k2l83K85M42j92k08nK4q1r45N72r58K082M95j515m94J125j136J587j020
$$ 127 105 -278 7 449 257 49 44 68 -13 -958 -386 -1344 738 1233 -282 -776 349 -787 800 -220
4509b20M06o90J034q15K0k55j90Q51m11O64m04J558k015M52j51J75l68J92N49
$$ -220 186 -504 530 -285 -265 -520 -710 141 -270 394 -10 1548 -467 -15 -166 9 -359 -167 382
4528C82j014P10j95J57n67K99O59o46J79K27l53p17J122j26Q36m4j521O06O15
$$ 382 -632 78 -117 40 -527 -228 431 -215 -36 191 -162 -879 243 117 953 909 -612 -6 609
4547F09n24m32J70K1M41m44K3k41J583j702M8O52o25l41N91m71J08J342j282J07
$$ 609 85 -347 -177 -156 285 -159 -136 -377 1206 -496 -448 204 -421 -762 -171 -642 -534 808 -474 -367
4567c67P12m21j10K48n41Q38L04n40m32N67J47m63O39o76N18k28k86K83J08O07
$$ -367 345 -76 -186 62 -479 359 663 123 -309 258 405 -58 581 -95 423 195 -91 192 300 907
4587I07j072k14R90o49L62j150N94P21j071J050m81k04J191j063LK70k61L76m62
$$ 907 -165 -379 611 -38 324 -826 -232 489 -582 468 -13 -217 974 -89 -86 184 -77 299 -163
4606a63Q97p80J98p73O83o52Q26L70k18K1j053M99K15m30N75l78K15K3m28J005
$$ -163 734 -46 152 -621 62 -590 236 606 388 409 -644 -145 70 -360 215 -163 52 75 -353 652
4626F52r9j47O27j256L57Q3j78o4l17L43k8n38R89J39l31N74j348J30O69P7O27
$$ 652 553 406 1033 -223 134 217 39 -25 -342 1 -27 -565 424 563 232 806 -542 -412 257 334 961
4647I61pm11r58Q39j165O15L62j11k16N7N43q77l18N34P6q06L70P52q30K34J451
$$ 961 954 543 -415 424 -741 -126 236 125 -91 -34 509 -368 -686 -152 -76 -882 -512 240 -590 -356 1095
4668A095m17j037K03K45J98l65k47N12J03l38N57J41p87K69J74J76q05R10m30
$$ 1095 678 -359 -156 89 287 -78 -325 187 290 -48 509 650 -137 132 306 482 -323 587 157
$$ [...]
8191i18
##END NTUPLES=NMR FID
##END=
