##TITLE=1H_SA_60.225
 D2O, 108 sc, 
 1.9.2020
##JCAMPDX= 6.0         $$ Bruker NMR JCAMP-DX V2.0
##DATA TYPE= NMR FID
##DATA CLASS= NTUPLES
##ORIGIN= UXNMR, Bruker Analytische Messtechnik GmbH
##OWNER= root
$$ XWIN-NMR		Version 3.5
$$ Tue Sep  1 12:34:03 2020 Russian Standard Time (UT+4h)  she@DPX200
##.OBSERVE FREQUENCY= 200.1315066352
##.OBSERVE NUCLEUS= ^1H
##.DELAY= (6, 6)
##.ACQUISITION MODE= SIMULTANEOUS
##.ACQUISITION SCHEME= undefined
##.AVERAGES= 108
##.DIGITISER RES= 18
##SPECTROMETER/DATA SYSTEM= spect
##.PULSE SEQUENCE= zg30
##.SOLVENT NAME= D2O
##.SHIFT REFERENCE= (INTERNAL, D2O, 0, 15.7039)
##AUDIT TRAIL= $$ (NUMBER, WHEN, WHO, WHERE, WHAT)
$$ ##TITLE= Audit trail, XWIN-NMR		Version 3.5
$$ ##JCAMPDX= 5.01
$$ ##ORIGIN= Bruker BioSpin GmbH
$$ ##OWNER= she
$$ F:/spectra/data/she/nmr/H-F/1/audita.txt
$$ ##AUDIT TRAIL=  $$ (NUMBER, WHEN, WHO, WHERE, WHAT)
(   1,<2020-09-01 12:29:18.23 +0400>,<she>,<DPX200>,
      <continue with go, POWCHK disabled, PULCHK disabled
       configuration hash MD5:
       00 E9 B6 7A A2 85 ED C7 34 08 36 98 17 FE 4E 26
       data hash MD5: 16K
       4D BD 42 58 6C FD 1A E5 55 86 49 FB 77 19 62 56>)
$$ ##END=
$$ 
$$ hash MD5
$$ C5 A0 0C BB 7A 89 49 12 77 03 87 09 84 A7 EB 60
##$RELAX= 
##$RELAX= 
##$RELAX= 
##$RELAX= 
##$RELAX= 
##$RELAX= 
$$ Bruker specific parameters
$$ --------------------------
##$DU= <F:/spectra>
##$EXPNO= 1
##$NAME= <H-F>
##$PROCNO= 1
##$TYPE= <nmr>
##$USER= <she>
##$AMP= (0..31)
100 100 100 100 100 100 100 100 100 100 100 100 100 100 100 100 100 100 
100 100 100 100 100 100 100 100 100 100 100 100 100 100 
##$AQSEQ= 0
##$AQ_mod= 1
##$AUNM= <au_zg>
##$AUTOPOS= <>
##$BF1= 200.13
##$BF2= 200.13
##$BF3= 200.13
##$BF4= 200.13
##$BF5= 200.13
##$BF6= 200.13
##$BF7= 200.13
##$BF8= 200.13
##$BYTORDA= 1
##$CFDGTYP= 0
##$CFRGTYP= 5
##$CHEMSTR= <none>
##$CNST= (0..31)
1 1 145 1 1 1 1 1 1 1 1 1 1 1 1 1 1 1 1 1 1 1 1 1 1 1 1 1 1 1 1 1 
##$CPDPRG= <>
##$CPDPRG1= <>
##$CPDPRG2= <>
##$CPDPRG3= <>
##$CPDPRG4= <mlev>
##$CPDPRG5= <mlev>
##$CPDPRG6= <mlev>
##$CPDPRG7= <mlev>
##$CPDPRG8= <mlev>
##$CPDPRGB= <>
##$CPDPRGT= <>
##$D= (0..31)
0 1.2 0 0 0 0 0 0 0 0.06 0 0.03 0 0 0 0 0.0002 0 0 0 0 0 0 0 0 0 0 0 0 
0 0 0 
##$DATE= 1598948563
##$DBL= (0..7)
120 120 120 120 120 120 120 120 
##$DBP= (0..7)
150 150 150 150 150 150 150 150 
##$DBP07= 0
##$DBPNAM0= <>
##$DBPNAM1= <>
##$DBPNAM2= <>
##$DBPNAM3= <>
##$DBPNAM4= <>
##$DBPNAM5= <>
##$DBPNAM6= <>
##$DBPNAM7= <>
##$DBPOAL= (0..7)
0.5 0.5 0.5 0.5 0.5 0.5 0.5 0.5 
##$DBPOFFS= (0..7)
0 0 0 0 0 0 0 0 
##$DE= 6
##$DECBNUC= <off>
##$DECIM= 32
##$DECNUC= <off>
##$DECSTAT= 4
##$DIGMOD= 1
##$DIGTYP= 9
##$DL= (0..7)
0 120 120 120 120 120 120 120 
##$DP= (0..7)
150 150 150 150 150 150 150 150 
##$DP07= 0
##$DPNAME0= <>
##$DPNAME1= <>
##$DPNAME2= <>
##$DPNAME3= <>
##$DPNAME4= <>
##$DPNAME5= <>
##$DPNAME6= <>
##$DPNAME7= <>
##$DPOAL= (0..7)
0.5 0.5 0.5 0.5 0.5 0.5 0.5 0.5 
##$DPOFFS= (0..7)
0 0 0 0 0 0 0 0 
##$DQDMODE= 0
##$DR= 18
##$DS= 0
##$DSLIST= <SSSSSSSSSSSSSSS>
$$ [...]
##$SUBNAM2= <"">
##$SUBNAM3= <"">
##$SUBNAM4= <"">
##$SUBNAM5= <"">
##$SUBNAM6= <"">
##$SUBNAM7= <"">
##$SUBNAM8= <"">
##$SUBNAM9= <"">
##$SW= 16.880792210976
##$SWIBOX= (0..15)
0 0 2 0 0 0 0 0 0 0 0 0 0 0 0 0 
##$SW_h= 3378.37837837838
##$TD= 16384
##$TD0= 1
##$TE= 0
##$TE2= 300
##$TE3= 300
##$TEG= 300
##$TL= (0..7)
0 120 120 120 120 120 120 120 
##$TP= (0..7)
150 150 150 150 150 150 150 150 
##$TP07= 0
##$TPNAME0= <>
##$TPNAME1= <>
##$TPNAME2= <>
##$TPNAME3= <>
##$TPNAME4= <>
##$TPNAME5= <>
##$TPNAME6= <>
##$TPNAME7= <>
##$TPOAL= (0..7)
0.5 0.5 0.5 0.5 0.5 0.5 0.5 0.5 
##$TPOFFS= (0..7)
0 0 0 0 0 0 0 0 
##$TUNHIN= 0
##$TUNHOUT= 0
##$TUNXOUT= 0
##$USERA1= <user>
##$USERA2= <user>
##$USERA3= <user>
##$USERA4= <user>
##$USERA5= <user>
##$V9= 5
##$VALIST= <valist>
##$VCLIST= <CCCCCCCCCCCCCCC>
##$VD= 0
##$VDLIST= <DDDDDDDDDDDDDDD>
##$VPLIST= <PPPPPPPPPPPPPPP>
##$VTLIST= <TTTTTTTTTTTTTTT>
##$WBST= 1024
##$WBSW= 4
##$XGAIN= (0..3)
0 0 0 0 
##$XL= 0
##$YL= 0
##$YMAX_a= 611780
##$YMIN_a= -384182
##$ZGOPTNS= <>
##$ZL1= 120
##$ZL2= 120
##$ZL3= 120
##$ZL4= 120
##$ABSF1= 10
##$ABSF2= 0
##$ABSG= 5
##$ABSL= 3
##$ALPHA= 0
##$AQORDER= 0
##$ASSFAC= 0
##$ASSFACI= 0
##$ASSFACX= 0
##$ASSWID= 0
##$AUNMP= <proc_1d>
##$AZFE= 0.1
##$AZFW= 0.1
##$BCFW= 1
##$BC_mod= 2
##$BYTORDP= 1
##$COROFFS= 0
##$CY= 11.3945322036743
##$DATMOD= 1
##$DC= 2
##$DFILT= <>
##$DTYPP= 0
##$F1P= 16.9975609425685
##$F2P= -3.02152046262296
##$FCOR= 0.5
##$FTSIZE= 0
##$FT_mod= 4
##$GAMMA= 1
##$GB= 0.15
##$INTBC= 1
##$INTSCL= 1
##$ISEN= 128
##$LB= 0.24
##$LEV0= 0
##$LPBIN= 0
##$MAXI= 10000
##$MC2= 0
##$MEAN= 0
##$ME_mod= 0
##$MI= 1.114404
##$NCOEF= 0
##$NC_proc= 0
##$NLEV= 6
##$NOISF1= 3.799351
##$NOISF2= 2.8
##$NSP= 1
##$NTH_PI= 0
##$NZP= 0
##$OFFSET= 15.70392
##$PC= 1
##$PHC0= -9949.818
##$PHC1= -27.19909
##$PH_mod= 1
##$PKNL= yes
##$PPARMOD= 0
##$PSCAL= 0
##$PSIGN= 0
##$REVERSE= no
##$SF= 200.130013532006
##$SI= 16384
##$SIGF1= 3
##$SIGF2= 2
##$SINO= 400
##$SIOLD= 16384
##$SREGLST= <1H.CDCl3>
##$SSB= 0
##$STSI= 0
##$STSR= 0
##$SW_p= 3612.71676300578
##$SYMM= 0
##$S_DEV= 0
##$TDeff= 0
##$TDoff= 0
##$TI= <>
##$TILT= no
##$TM1= 0
##$TM2= 0
##$TOPLEV= 0
##$USERP1= <user>
##$USERP2= <user>
##$USERP3= <user>
##$USERP4= <user>
##$USERP5= <user>
##$WDW= 1
##$XDIM= 8192
##$YMAX_p= 0
##$YMIN_p= 0
$$ End of Bruker specific parameters
$$ ---------------------------------
##NTUPLES= NMR FID
##VAR_NAME=  TIME,          FID/REAL,        FID/IMAG
##SYMBOL=    X,             R,               I
##VAR_TYPE=  INDEPENDENT,   DEPENDENT,       DEPENDENT
##VAR_FORM=  AFFN,          ASDF,            ASDF
##VAR_DIM=   8192,          8192,            8192
##UNITS=     SECONDS,       ARBITRARY UNITS, ARBITRARY UNITS
##FACTOR=    0.000296,      1,               1
##FIRST=     0,             0,               0
##LAST=      2.424536,      0,               0
##MIN=       0,             -384182,         0
##MAX=       2.424536,      611780,          0
$$ Real data points
##PAGE= N=1
##DATA TABLE= (X++(R..R)), XYDATA
0 0 0 0 0 0 0 0 0 0 0 0 0 0 0 0 0 0 0 0 0 0 0 0 60 -108 108 -108 108 -108 116 -180 216 -216 237 -313 326 -375 431
37 431 -481 543 -607 678 -754 841 -942 1041 -1150 1279 -1407 1552 -1723 1890 -2082 2295
53 2295 -2530 2787 -3073 3393 -3750 4160 -4621 5173 -5807 6568 -7505 8682 -10220 12349
67 12349 -15618 21875 -111046 360039 221990 191877 -203324 -325881 -20434 191275 501447
78 501447 173819 -71499 -295584 -122361 272357 416236 171658 -189172 -334960 -161225
88 -161225 221936 322265 121599 -221787 -352581 -169653 156840 346987 101774 -182949
98 -182949 -362026 -140873 196454 331707 162668 -204204 -287192 -132841 222085 343006
108 343006 147652 -143204 -316432 -94311 184440 348553 146801 -180330 -293300 -138677
118 -138677 198426 297729 130292 -183213 -311708 -128331 157032 300642 113888 -175421
128 -175421 -310969 -134580 165824 294680 123317 -174679 -289399 -128475 175268 286232
138 286232 128046 -162186 -289067 -118517 152423 286664 116519 -162587 -289222 -130164
148 -130164 157513 267847 118175 -167453 -278121 -126055 148041 273823 114618 -148921
158 -148921 -275100 -118376 151228 271834 119948 -150191 -264160 -118329 147168 258380
168 258380 116560 -146415 -267803 -123627 135094 255803 109427 -145983 -262629 -118106
178 -118106 137911 251919 116921 -137424 -248822 -115365 138491 255186 118560 -129436
188 -129436 -246163 -109677 135151 250432 115447 -129465 -242601 -114844 130437 241170
198 241170 113167 -130685 -242829 -113172 126993 239905 111504 -125010 -235783 -108348
208 -108348 127463 237230 114869 -119312 -229348 -110407 124063 235375 113130 -119760
218 -119760 -230321 -109194 120364 227445 106690 -118735 -227377 -109655 115455 223736
228 223736 108053 -116649 -224880 -109294 116248 223924 108184 -114027 -220891 -104998
238 -104998 113722 220039 105818 -112681 -217978 -105924 111076 216494 106167 -110835
248 -110835 -216394 -107061 109157 214481 104059 -109696 -213791 -103470 107894 211360
258 211360 104242 -106998 -209480 -103002 107170 209975 103402 -105904 -208386 -102178
268 -102178 103728 206016 101006 -104162 -205795 -101942 101833 203781 100891 -103222
278 -103222 -203943 -101069 102666 202460 99483 -102272 -201769 -98082 101459 200150
288 200150 99843 -99380 -197986 -99317 98916 197576 98355 -99572 -198431 -98352 98136
299 98136 196304 96963 -98522 -195714 -96988 96912 194073 96447 -96205 -192144 -96016
310 -96016 95883 191783 96463 -94590 -190375 -95959 94253 189650 94872 -94266 -188163
321 -188163 -94051 93255 187750 94423 -92335 -186928 -94753 91665 185608 94333 -92338
332 -92338 -185521 -92200 91779 184234 93044 -90295 -182665 -92358 88511 181884 92770
343 92770 -89781 -181949 -92282 89618 179755 90964 -88226 -179150 -91665 86598 178169
354 178169 90784 -86597 -177323 -91432 85811 177850 91485 -85689 -177207 -90425 85941
365 85941 175635 90387 -86485 -173878 -89129 83891 172020 88438 -83351 -173691 -89420
376 -89420 82483 172334 89831 -82787 -171572 -87820 82501 170207 87659 -81343 -168928
387 -168928 -87543 80973 168934 87695 -80096 -168236 -87496 79827 167325 86572 -80419
398 -80419 -166241 -85352 79836 164551 85652 -78233 -163247 -85455 77010 164459 85976
409 85976 -78151 -163837 -86354 77754 162343 84174 -77534 -160717 -84882 75678 160065
420 160065 84039 -74198 -159676 -85071 75166 158392 84013 -75508 -158541 -84228 74081
431 74081 157720 82740 -74018 -156960 -83350 72818 155938 82745 -71718 -155732 -82649
442 -82649 70973 154741 83260 -72433 -152781 -81786 70963 152064 81912 -69737 -152289
453 -152289 -81302 70022 151745 81850 -69430 -149918 -80672 69424 150870 80878 -68080
464 -68080 -148416 -80308 68071 146970 80035 -67962 -146897 -79915 67271 146513 80262
475 80262 -66099 -146502 -79259 66954 145470 78421 -65556 -144941 -77712 64862 144015
486 144015 78881 -64480 -143284 -78228 65245 143261 78068 -64962 -141777 -78362 63556
497 63556 140734 76611 -64042 -141383 -76804 63775 140068 75615 -62459 -139368 -75831
508 -75831 62307 137727 76564 -62551 -137835 -77072 61865 137152 75226 -61045 -136782
519 -136782 -75228 61138 135532 75429 -59521 -135731 -75790 60094 134845 74714 -59594
530 -59594 -133948 -75086 59166 133405 74089 -58643 -133477 -74175 58721 131888 73888
541 73888 -57704 -130178 -73918 57959 131163 72973 -56484 -130408 -72937 57455 129297
552 129297 73128 -55790 -129443 -73677 56167 129312 72728 -56376 -127289 -72014 55490
563 55490 126882 73452 -54555 -126652 -71980 54881 126091 71430 -53439 -126070 -72314
574 -72314 54117 125410 71338 -53574 -124633 -71224 53035 125181 70238 -52536 -123540
585 -123540 -70826 51966 121380 70305 -53161 -123093 -70662 51903 122216 70099 -51831
596 -51831 -121606 -70291 51045 120041 69691 -50657 -121216 -70331 50896 120099 69550
607 69550 -50127 -118795 -68778 50890 117924 68109 -49397 -117551 -68544 49807 116585
618 116585 69581 -48886 -117216 -68448 49059 116463 68103 -48428 -116083 -67006 48254
629 48254 115393 67959 -47913 -114987 -68165 47095 115035 67302 -47364 -114796 -66799
640 -66799 47125 113729 66503 -46265 -112468 -66422 45372 112435 66473 -45020 -111117
651 -111117 -66438 45214 111528 66602 -44602 -110490 -65702 44887 110249 64765 -44218
662 -44218 -109996 -65382 44263 109869 64863 -44566 -109063 -64638 43825 108163 65079
673 65079 -43913 -107213 -64951 42863 107626 63680 -43126 -106919 -64907 42478 106054
684 106054 64545 -41286 -105932 -63240 41154 106023 63482 -42167 -105689 -63988 41487
695 41487 104500 63920 -41044 -104122 -63133 40250 103731 63834 -40221 -103254 -63121
706 -63121 40028 102421 62808 -39245 -103217 -62544 39499 101144 62215 -39989 -101482
717 -101482 -62305 39370 100143 60814 -38929 -100870 -62545 38773 100608 61227 -38318
728 -38318 -100213 -61236 38760 98587 61013 -37852 -98347 -61536 37299 97832 60428 -37268
740 -37268 -97883 -60523 38128 97724 59966 -37136 -96350 -59776 37170 96566 59002 -36195
752 -36195 -96712 -60053 36274 95359 59343 -36916 -96214 -58464 35367 95695 58887 -36146
764 -36146 -94373 -58527 35986 94126 59036 -35404 -95858 -59221 35778 93852 57865 -36129
776 -36129 -92338 -58122 35058 92008 58112 -33070 -91974 -58992 34113 92797 57753 -34593
788 -34593 -91841 -58782 34634 90428 57067 -34031 -91011 -57302 33395 90552 56985 -33091
800 -33091 -89959 -56420 33212 90003 56877 -33399 -89841 -56319 32648 88611 56472 -32581
812 -32581 -87689 -56229 32709 88137 56924 -32127 -88607 -56147 32218 87452 54742 -31943
824 -31943 -86523 -55420 31557 86150 54875 -32069 -86405 -55053 30981 86224 54643 -31866
836 -31866 -85475 -53795 31354 85209 53452 -30918 -85034 -54309 30205 84466 54177 -31068
848 -31068 -84170 -53410 30133 83183 53843 -30615 -84046 -53392 30274 83999 52805 -29510
860 -29510 -82407 -52718 30043 83250 52885 -29653 -82690 -52116 28949 81757 52710 -28333
872 -28333 -81236 -52597 28834 81722 52631 -29386 -81503 -51411 28890 80635 51998 -28887
884 -28887 -79476 -51649 28528 80083 51190 -28588 -78964 -51115 28283 78953 50591 -28029
896 -28029 -79224 -51486 27124 78349 50459 -27032 -78876 -49218 27396 78537 50525 -26494
908 -26494 -77324 -50703 28089 78366 49424 -26772 -76572 -49545 26930 75970 49718 -27357
920 -27357 -76209 -49447 26990 76133 49135 -27309 -75305 -49036 26553 74797 49039 -26467
932 -26467 -76208 -48687 26755 74783 48053 -26469 -75469 -49098 25791 73781 48273 -26504
944 -26504 -73911 -48223 26674 73787 47954 -25938 -73360 -47704 24615 73734 48026 -26265
956 -26265 -71999 -46871 25734 73109 46762 -24816 -71751 -47070 24796 71432 48044 -24192
968 -24192 -72117 -47116 24983 71250 47197 -25300 -70532 -45396 23693 70964 45971 -24495
980 -24495 -70970 -46716 24828 69991 46547 -23314 -69767 -45503 23980 69406 45560 -24071
992 -24071 -69005 -45072 23016 68314 46534 -23124 -69168 -45407 24249 68789 44906 -23516
1004 -23516 -67732 -45016 23892 68073 44321 -24269 -67316 -45347 22770 67937 44684 -23785
1016 -23785 -67257 -44677 22326 68016 44241 -22553 -67396 -44548 23779 65872 42917 -22960
1028 -22960 -66226 -44618 23285 66026 42397 -21716 -66314 -44469 22279 65026 43529 -23261
1040 -23261 -64766 -42961 21696 64110 42539 -21710 -64554 -43052 21422 64937 43160 -21509
1052 -21509 -64388 -42797 20954 64158 41935 -21339 -63407 -43648 21529 64053 42351 -21386
1064 -21386 -63612 -42424 21202 63663 41960 -21132 -63781 -41681 21478 62825 42643 -20681
1076 -20681 -62087 -42090 19937 62716 41475 -21190 -62400 -41615 20177 62642 41534 -20924
1088 -20924 -61429 -41807 19940 62009 41522 -19214 -60595 -41090 20148 60698 40904 -19896
1100 -19896 -60189 -41033 19816 60230 40281 -19309 -60093 -40971 19757 60058 40729 -19034
1112 -19034 -59728 -39727 19058 59667 40158 -19091 -59020 -40119 18311 58752 40892 -18276
1124 -18276 -58757 -39987 18724 58844 40204 -18413 -58149 -40000 18399 58238 39153 -18673
1136 -18673 -57430 -38803 17856 57666 39363 -18170 -57229 -38402 18276 57630 39648 -18601
1148 -18601 -57327 -38810 17797 56138 38788 -17244 -56317 -39238 17822 56924 38366 -18371
1160 -18371 -55779 -38355 18237 55331 38400 -17933 -55783 -38189 17651 55069 36988 -17675
1172 -17675 -55485 -37561 18062 56360 37589 -17841 -54787 -37550 16671 54425 36921 -16931
1184 -16931 -55177 -36971 17064 53921 37512 -18041 -53045 -37633 17354 54074 37398 -16935
1196 -16935 -54481 -36860 16110 53767 36736 -16692 -53063 -37626 16845 53651 36442 -16413
1208 -16413 -52702 -36146 16814 52924 36341 -15894 -52337 -36874 16605 52906 36205 -15618
1220 -15618 -51645 -35515 15841 51457 35742 -16888 -52617 -35718 16397 51477 35321 -17246
1232 -17246 -51862 -35765 15729 51182 34666 -16000 -50265 -35378 16468 50993 34359 -15228
1244 -15228 -50472 -34342 15665 49926 35337 -15944 -50232 -34535 15317 50050 35207 -15074
1256 -15074 -49694 -34470 14436 49701 33832 -15520 -49440 -35407 15367 49552 33543 -15514
1268 -15514 -48374 -34289 15160 48888 33433 -15125 -49832 -33417 14793 48706 33754 -14669
1280 -14669 -48262 -34104 15017 48672 34081 -15020 -48417 -33300 15198 48381 33186 -15198
1292 -15198 -47979 -32582 14334 47756 32483 -15450 -47993 -32136 15172 47382 32671 -14191
1304 -14191 -47132 -33291 13965 46350 33249 -13436 -47825 -31877 14369 45979 32049 -13496
1316 -13496 -46262 -33869 13986 47530 32385 -14135 -46602 -31946 14308 45924 31901 -14084
1328 -14084 -46070 -32554 13968 44598 31023 -13669 -45103 -31661 14032 45745 31835 -13531
1340 -13531 -45791 -31349 13591 46302 31202 -13716 -45512 -31317 13739 44360 31776 -13048
1352 -13048 -44852 -31551 12638 45202 31899 -12678 -44528 -30905 13602 43656 31421 -13293
1364 -13293 -44433 -31027 13133 44024 31049 -12859 -43462 -30652 13300 43905 30977 -12248
1376 -12248 -43828 -30842 12492 43265 31080 -12838 -42865 -30296 13099 42552 30083 -13797
1388 -13797 -42871 -29722 12610 43138 30198 -13113 -42604 -30088 12305 42018 29937 -12272
1400 -12272 -42488 -29057 12945 41931 29996 -12521 -42499 -30323 12601 41822 29931 -11707
1412 -11707 -42200 -29178 11979 41413 29062 -12143 -41712 -29883 11543 41265 28782 -12717
1424 -12717 -40745 -29146 13046 41160 29072 -12365 -40054 -28524 12595 40198 28585 -11417
1436 -11417 -41202 -27916 11016 40752 28550 -11908 -41409 -27619 12514 40754 28714 -11980
1448 -11980 -40765 -28682 11120 40585 28279 -11033 -39739 -28846 12388 39853 28807 -12341
1460 -12341 -39488 -27896 11038 39367 28210 -11039 -39492 -28819 11858 38523 27630 -11220
1472 -11220 -38483 -27318 10915 38289 28099 -11320 -39028 -26878 10774 39048 26607 -11492
1484 -11492 -37885 -28242 11551 38434 27959 -10907 -38804 -27467 11693 38180 26580 -11134
1496 -11134 -37382 -26399 11361 38056 27424 -11331 -37925 -27156 11064 37313 27049 -11208
1508 -11208 -38142 -26887 9947 37838 26161 -11431 -36822 -26606 9866 36801 27448 -10573
1520 -10573 -37158 -26442 11376 37537 26403 -10801 -37035 -25802 10226 35801 25812 -10737
1532 -10737 -37296 -25860 10698 36804 25692 -11125 -37210 -26213 10480 36178 25967 -10807
1544 -10807 -36242 -26265 10620 35535 25025 -10396 -36299 -25090 10388 36202 27114 -9808
1556 -9808 -36099 -26518 9828 35248 25732 -10660 -35444 -24704 9878 35397 25361 -9295
1568 -9295 -36012 -24858 9778 35426 25019 -10367 -35034 -25442 10342 34743 25169 -9726
1580 -9726 -34220 -25756 9918 35531 24222 -10125 -34803 -24813 9553 33872 25257 -9453 -33750
1593 -33750 -25006 9106 33987 24915 -9486 -33909 -25051 9735 34207 24299 -8964 -34159 -24468
1606 -24468 9764 34023 24321 -9804 -33230 -24788 9751 33862 24099 -9261 -33237 -23740 9217
1619 9217 33272 23850 -9995 -33227 -24202 10040 32471 23239 -9184 -32957 -23162 9334 33266
1632 33266 24229 -9298 -32526 -23901 9555 33054 23969 -8970 -32969 -23481 8794 31872 23684
1645 23684 -8854 -32017 -23362 9731 32427 22449 -9768 -32140 -22955 8857 32369 23697 -8872
1658 -8872 -32084 -23982 9253 32638 22722 -7997 -32332 -22586 8460 31102 23239 -7920 -32235
1671 -32235 -22506 8830 31597 23341 -8438 -30731 -23366 8306 32200 22654 -9031 -31711 -22262
1684 -22262 8323 30959 22818 -8665 -31517 -22595 9193 30694 23162 -7961 -30832 -23043 8417
1697 8417 30914 21748 -8169 -30673 -22621 7976 30669 22517 -8171 -30539 -22329 9150 30417
1710 30417 21315 -9130 -30434 -22103 7864 30786 22154 -8259 -29859 -21581 8301 29686 21741
1723 21741 -8151 -29163 -21749 7828 30268 21377 -7754 -29167 -21886 7978 29928 21975 -7868
1736 -7868 -29397 -22560 8862 29268 21277 -8472 -29354 -20931 8481 29494 21180 -7245 -28890
1749 -28890 -21770 8391 28426 21068 -7536 -28735 -21617 8915 29207 20962 -7193 -28863 -21116
1762 -21116 7817 29304 21184 -7941 -29529 -21047 7581 28720 21564 -7490 -28487 -20171 8348
1775 8348 28503 20774 -8151 -28756 -20763 7145 27732 20738 -7692 -28352 -20602 7364 29140
1788 29140 20286 -7901 -27885 -20693 7064 28098 20893 -6889 -28799 -20419 8259 27261 20527
1801 20527 -7695 -27402 -19974 7651 27132 20171 -7356 -27509 -20395 7111 27341 20395 -6687
1814 -6687 -26556 -20114 8008 27528 20059 -7148 -27124 -19907 6377 27869 19232 -6741 -27381
1827 -27381 -20025 7357 26907 19412 -6771 -26882 -19686 7346 26808 19340 -7335 -26700 -19400
1840 -19400 6658 26259 20448 -6521 -27342 -19155 6940 26128 19340 -6451 -26164 -18835 6724
1853 6724 25881 20103 -5931 -26823 -18899 6083 26418 18956 -7188 -25328 -19579 7121 25683
1866 25683 19178 -6794 -25392 -19924 6965 25630 19049 -7611 -26517 -19184 6968 25572 20059
1879 20059 -6755 -25365 -18819 6779 25147 18326 -5516 -25949 -18073 6366 25653 19634 -6970
1892 -6970 -24657 -18265 6957 25393 18309 -5482 -24021 -18898 7577 24458 18246 -5881 -25438
1905 -25438 -19471 7033 26022 18592 -6629 -24597 -18010 6312 25651 18480 -6673 -24183 -18632
1918 -18632 5746 25040 17274 -5983 -24651 -18517 6738 24181 18305 -5572 -23548 -18012 6562
1931 6562 23979 18031 -6704 -23872 -18480 6247 23936 17537 -5923 -24751 -17929 6369 23992
1944 23992 17980 -6215 -24842 -18184 6384 23789 17719 -6884 -24812 -17614 6328 23461 17697
1957 17697 -6893 -23472 -17047 6896 23511 17416 -6118 -23507 -17654 5452 23751 16880 -5936
1970 -5936 -24024 -17201 6554 23645 17411 -5245 -23227 -17517 6041 23364 17085 -6347 -24169
1983 -24169 -16757 5590 23150 17128 -6126 -23038 -16641 6342 24011 17473 -6393 -23007 -16565
1996 -16565 4849 22291 16592 -6385 -22779 -15941 6859 22792 16149 -5551 -22539 -16480 6274
2009 6274 23079 17327 -5595 -22381 -17052 5096 22548 15985 -6496 -21045 -15238 5304 22812
2022 22812 17276 -6745 -23146 -17215 5720 22143 16990 -6022 -22133 -16493 5389 22183 16684
2035 16684 -5502 -22119 -15336 5134 21146 16517 -6257 -21675 -16513 5743 21415 15686 -6176
2048 -6176 -21865 -15859 5914 21902 16276 -4735 -21149 -16678 6091 20971 15693 -5288 -22922
2061 -22922 -16373 5368 20693 15438 -3901 -21659 -15884 5789 21066 15256 -5111 -21781 -15735
2074 -15735 5212 21520 15518 -5698 -21540 -16684 5999 21821 15767 -5169 -20909 -15154 5748
2087 5748 20691 15634 -5976 -20826 -15445 5653 20777 15552 -5456 -21047 -14899 4718 19611
2100 19611 15713 -4906 -20714 -14786 5340 20157 15510 -4072 -20752 -16570 5052 20555 15603
2113 15603 -5241 -20140 -14805 5009 19873 15548 -5245 -21384 -15253 4623 20419 15518 -4838
2126 -4838 -19564 -15687 5457 20129 15126 -4955 -20047 -15105 4611 19056 15399 -5238 -19692
2139 -19692 -15049 4547 19538 14801 -4740 -20804 -14390 5594 20046 14923 -5231 -19563 -14724
2152 -14724 4906 19223 14745 -4481 -19903 -15042 4937 20049 14297 -5398 -20602 -13861 5099
2165 5099 19139 14572 -5440 -19455 -15293 5358 19345 13551 -5009 -19870 -15412 5203 18883
2178 18883 15213 -5589 -18876 -14844 4049 18813 14888 -3906 -18418 -14663 4207 18577 14042
2191 14042 -4743 -19063 -14791 4788 18654 14338 -4564 -18684 -14571 4927 18731 13518 -5540
2204 -5540 -18215 -14155 3670 18688 14328 -4040 -18796 -14664 5044 18141 13890 -5509 -18764
2217 -18764 -13489 4770 18305 13256 -3752 -18538 -13469 3767 17973 13826 -4070 -18721 -13149
2230 -13149 4099 18679 12930 -5149 -18196 -14520 3809 17532 14272 -4221 -17889 -12797 4151
2243 4151 18239 14178 -4816 -17400 -13762 4931 17784 13748 -4576 -16895 -12708 5403 17843
2256 17843 13210 -4102 -17769 -13472 5301 17907 12747 -3924 -17519 -12963 4520 17262 13428
2269 13428 -3876 -16716 -13460 4497 17264 12848 -4171 -17341 -13164 4604 16311 13222 -3815
2282 -3815 -17126 -13228 4281 17262 12883 -3163 -17181 -13117 4198 17038 12179 -3966 -16910
2295 -16910 -12387 4273 16921 13267 -4127 -17360 -11694 3743 16540 12909 -4750 -17416 -12287
2308 -12287 4096 16503 13101 -3613 -16409 -12781 4876 16295 12261 -4257 -16917 -12559 3934
2321 3934 16196 12482 -3614 -15801 -12136 4617 16508 12381 -4356 -16994 -12927 3877 17621
2334 17621 12358 -4140 -17266 -12695 3930 16451 12688 -3543 -17209 -12817 4657 15828 12214
2347 12214 -3756 -15869 -12056 4425 15575 12109 -3064 -16648 -13122 3632 15722 12246 -3863
2360 -3863 -16732 -12328 3595 15860 12027 -3777 -15064 -12020 4492 15725 11508 -3179 -15433
2373 -15433 -11362 3618 16067 12350 -3986 -15496 -11553 3331 15359 11482 -3482 -16420 -11910
2386 -11910 3495 15601 12005 -3858 -15917 -11556 3715 16196 11539 -3942 -15363 -11939 3849
2399 3849 15879 12359 -3698 -15295 -12399 2716 15496 12081 -3928 -15374 -11764 3804 15558
2412 15558 11683 -4985 -15566 -12114 3456 14838 11208 -3610 -14541 -11245 4273 15306 11691
2425 11691 -3258 -15137 -12140 3283 15099 10757 -3318 -14975 -11160 3194 14244 11805 -3263
2438 -3263 -15549 -11553 3076 13868 11446 -3122 -14339 -11297 3665 13935 11556 -3070 -13960
2451 -13960 -11183 4114 14143 10725 -3537 -14200 -11351 3210 14675 10779 -3440 -14318 -11481
2464 -11481 3062 14123 11031 -3613 -14516 -10623 3407 13879 10955 -3782 -14466 -11355 2953
2477 2953 13685 11013 -2893 -15548 -11326 2824 13463 10929 -3043 -13657 -11067 3281 14337
2490 14337 10406 -2744 -13904 -10452 2933 14119 10648 -3398 -14639 -11354 3107 13759 10417
2503 10417 -3492 -13872 -10425 3289 14208 10207 -1854 -13628 -11025 3530 13998 10572 -3351
2516 -3351 -13832 -10312 3399 13624 10964 -3931 -12923 -10769 3119 12834 10602 -3294 -13364
2529 -13364 -9725 3893 14116 10568 -2549 -13440 -11052 2370 13511 10001 -3220 -13701 -10379
2542 -10379 2977 12626 10907 -2359 -13958 -10123 3772 13311 9780 -2905 -12889 -10137 3816
2555 3816 13161 10312 -3341 -12636 -9155 2903 13129 10917 -3399 -13479 -9060 2668 12184
2568 12184 10573 -3207 -14396 -9773 2576 12548 10268 -3191 -12546 -10574 2360 12439 10231
2581 10231 -2538 -13130 -9974 2495 13396 9634 -3305 -13057 -9646 2266 12394 9005 -2342
2594 -2342 -12145 -10114 2941 13002 9289 -3095 -12537 -9131 3338 12406 10613 -3010 -12771 -10089
2608 -10089 3279 12735 9625 -3801 -12916 -9278 2603 12250 10163 -2370 -11754 -10127 3050
2621 3050 11949 9613 -3316 -12104 -8761 2006 12418 10101 -2765 -12391 -8991 2279 11933 9149
2635 9149 -2106 -12211 -9624 1934 12307 9515 -2597 -12105 -8962 2931 12673 8977 -2368
2648 -2368 -11912 -9576 1925 11759 8960 -2828 -11967 -9792 2838 11698 9644 -2974 -11790 -9002
2662 -9002 2501 11345 8920 -2914 -11019 -9019 2690 11800 9056 -2610 -12065 -9607 2732 12001
2676 12001 8947 -2338 -11952 -9800 2031 11469 9627 -2890 -12490 -9146 3653 12143 9888 -2173
2690 -2173 -12033 -9399 2587 11404 8790 -2610 -11561 -9159 2335 11675 9245 -1977 -10324 -9167
2704 -9167 1590 11105 8354 -2528 -11816 -9652 2473 10398 8580 -2339 -11309 -8255 2197 10944
2718 10944 7840 -2583 -10587 -8659 2826 10959 7868 -2399 -11594 -8233 2422 12191 8744 -1746
2732 -1746 -11036 -8596 2457 11225 8269 -2303 -10474 -8505 1805 11143 8468 -2464 -10723 -9383
2746 -9383 1756 11203 9857 -2366 -11023 -8311 2056 10594 8062 -1849 -11004 -8981 1902 10034
2760 10034 8624 -1634 -10399 -9085 2355 10356 7537 -2139 -10383 -8840 2523 10466 8512 -894
2774 -894 -10787 -8138 2101 11377 8525 -2268 -10724 -8753 2249 10281 7983 -2703 -9647 -8402
2788 -8402 2210 9703 8097 -2214 -11175 -7889 2572 10085 9039 -1973 -10298 -8841 1744 10630
2802 10630 7603 -1531 -10244 -8912 3049 10467 8174 -1647 -9907 -9267 2567 10454 8483 -2569
2816 -2569 -10061 -7855 2492 9594 7930 -1660 -10335 -7368 2057 10300 7957 -1686 -8792 -7574 2046
2831 2046 9822 7146 -2185 -11233 -7314 2958 9605 8415 -2013 -10329 -7067 2332 9739 7839
2845 7839 -1815 -9895 -7951 1744 9429 7770 -1020 -9398 -7806 1882 9944 7384 -2309 -9114 -6782
2860 -6782 2531 9575 7985 -1787 -10240 -7081 2499 9489 7359 -2170 -10209 -7636 2297 9180 7440
2875 7440 -1344 -9808 -7897 1667 9061 7016 -2467 -10600 -7634 2225 9139 7194 -1399 -9079 -6898
2890 -6898 1774 9299 6636 -2095 -9659 -7493 2200 9597 6758 -1698 -9404 -7503 936 8212 6763
2905 6763 -1284 -8929 -8345 1950 9551 7017 -1305 -8599 -6777 2790 9289 6847 -1774 -8801 -7649
2920 -7649 2092 8716 7507 -1225 -8767 -7509 2052 8615 7060 -1691 -8484 -7513 1980 8908 7048
2935 7048 -555 -9138 -8262 2476 8686 7367 -2258 -9259 -5667 2416 7873 7054 -2127 -9021 -5381
2950 -5381 1280 8630 6743 -2018 -9433 -6821 1844 8995 7598 -2148 -7879 -7741 1852 8760 7522
2965 7522 -1502 -9090 -6837 2061 8171 7602 -1801 -9397 -7227 1985 8005 6685 -1637 -8663 -6685
2980 -6685 1791 8668 7637 -1838 -7907 -7386 2261 8848 6999 -1203 -8680 -6691 2239 8978 6798
2995 6798 -1425 -8915 -7268 2875 7808 6522 -1411 -8540 -7459 2023 8080 5238 -1331 -8277 -6422
3010 -6422 2345 7837 6726 -1731 -8451 -6564 1987 8769 6749 -921 -8069 -5933 1504 8230 6216
3025 6216 -1348 -8054 -6890 2673 7348 6487 -1639 -7893 -6315 950 8376 6783 -891 -7825 -6366
3040 -6366 1397 8114 6415 -1374 -8415 -7219 1464 7990 6584 -992 -9160 -6360 1331 7821 6220
3055 6220 -1468 -7867 -6175 1173 7902 5840 -1945 -7901 -6853 1048 7647 6428 -772 -8296 -6867
3070 -6867 2032 8340 5325 -2349 -7944 -7075 1137 7779 6016 -698 -7305 -6278 699 7620 7019
3085 7019 -1258 -7439 -5743 1235 7284 6969 -1409 -8272 -5864 1530 7208 6847 -1121 -8762 -5819
3100 -5819 963 8186 6426 -2064 -8121 -6436 1500 7898 5756 -833 -7722 -5840 1270 6900 5764
3115 5764 -1827 -7987 -5400 1735 6963 5934 -2184 -7821 -7111 769 7643 5818 -1696 -7522 -5939
3130 -5939 2231 8183 6025 -1742 -7169 -5978 2790 7727 6491 -1540 -7727 -5255 901 7970 5847
3145 5847 -1789 -7351 -5885 1455 8071 5865 -1569 -6117 -5673 1157 7546 5695 -727 -7616 -5485
3160 -5485 1040 6930 5440 -1679 -7072 -6109 642 6307 5533 -1089 -6993 -6423 1797 6156 6077 -1312
3176 -1312 -7308 -6354 1046 7145 5009 -1365 -6951 -5472 1334 6666 4880 -1142 -7444 -5360 1674
3191 1674 7332 5392 -2132 -6815 -5504 1841 7420 5438 -1068 -7076 -5452 1312 6108 5906 -2000
3206 -2000 -6556 -5809 1024 6906 4999 -401 -6911 -5338 1604 7035 5936 -1555 -7386 -5484 224
3221 224 7411 5453 -955 -6594 -6043 2062 6878 5370 -1221 -5539 -4910 1901 6300 5132 -1510 -6237
3237 -6237 -5419 1756 6604 4546 -1486 -6476 -5597 1119 6308 5367 -1460 -6829 -5855 1989 6693 5568
3253 5568 -797 -6540 -5815 1776 6658 4789 -1687 -6798 -4490 813 6086 4865 -1551 -6139 -5757
3268 -5757 1548 6556 5462 -956 -5918 -4775 1882 6045 4930 -1147 -6474 -4895 1401 6696 4686
3283 4686 -2151 -6140 -4510 1117 6498 4628 -721 -6522 -5665 1549 7072 4655 -1304 -6067 -4167
3298 -4167 1454 5959 5227 -1636 -6688 -5369 1085 5766 5134 -1277 -5200 -4804 749 6131 4851 -810
3314 -810 -6186 -4903 1302 7418 4309 -1102 -6456 -4815 548 7272 4894 -375 -6397 -4488 1508
3329 1508 5983 4725 -2055 -5512 -4318 1347 5833 5260 -1198 -6136 -5451 2011 6339 4576 -1754
3344 -1754 -5860 -3913 747 6842 4796 -724 -5664 -4623 2133 5636 5008 -859 -5811 -4304 1213
3359 1213 5676 4935 -240 -5179 -4983 828 6009 4439 -822 -6027 -5134 1552 6038 5012 -950 -6011
3375 -6011 -4829 1318 4965 5448 -1223 -5281 -4104 1330 6419 5245 -1069 -5804 -4296 866 5180
3390 5180 4889 -844 -6582 -5039 641 6571 4246 -1841 -5439 -5212 1858 6740 5087 -994 -5045
3405 -5045 -4639 1223 5461 3947 -1225 -5078 -4191 922 5830 4491 -373 -6271 -4292 1074 5438
3420 5438 4052 -317 -5533 -4775 1101 5152 3956 -917 -4238 -3966 306 5061 4595 -704 -5858 -4436
3436 -4436 507 4852 4738 -417 -5626 -3960 931 4277 4735 -1322 -4906 -4450 1714 4918 4433 -1745
3452 -1745 -5533 -4997 1387 5016 3762 -23 -5105 -4582 1074 4460 4646 -695 -5476 -4264 1002 6222
3468 6222 5038 -1134 -5737 -3878 266 4906 3943 -1165 -5013 -4516 1269 5252 4293 -1321 -4646 -3666
3484 -3666 1049 4681 4990 -1551 -4891 -3685 715 5452 3936 -382 -5317 -4067 665 4924 4635
3499 4635 173 -5339 -4189 653 4956 4073 -570 -4481 -3261 553 4395 3920 -1429 -4820 -4211 1203
3515 1203 5058 4200 -680 -5872 -4587 -167 4045 4796 -584 -4739 -4758 1101 4704 3766 -1301 -5321
3531 -5321 -4402 250 5561 3788 -613 -5109 -3618 964 5147 3775 -1305 -4307 -4837 1136 4528
3546 4528 4011 -933 -4517 -4336 832 4551 3443 -316 -5058 -3227 1014 4811 4298 -819 -5060 -4426
3562 -4426 447 4800 3193 -1072 -3389 -3803 614 5071 3221 -966 -4071 -3922 350 4466 3887 -315
3578 -315 -5506 -4193 1525 5052 4216 -991 -4587 -4525 -70 5070 4199 127 -4387 -3188 656 4568
3594 4568 4289 -332 -5031 -4275 1267 3609 4150 -472 -4839 -3416 717 4052 3426 -830 -4772 -3725
3610 -3725 1044 4400 3875 -648 -4226 -3797 756 4023 2689 -1105 -4042 -4014 236 4158 3881 -832
3626 -832 -4790 -3323 958 4416 4368 -451 -4400 -3640 271 3931 3135 -816 -4069 -3561 5 4138
3642 4138 3375 -1502 -4169 -4307 59 4411 3050 161 -4472 -3949 395 3983 2830 -1019 -4145 -3279
3658 -3279 -742 4598 4467 -801 -4399 -3723 1270 5022 3545 -426 -3923 -4256 421 4165 3820 -1605
3674 -1605 -3762 -2998 854 4382 4295 -702 -4160 -3171 1160 4091 3704 -86 -4817 -3537 924 4404
3690 4404 4019 -146 -4058 -3714 639 4994 2957 -910 -3642 -2939 513 3412 4141 -382 -3784 -3078
3706 -3078 716 4202 3376 -381 -3642 -3308 139 3231 4392 -411 -3631 -3587 1008 4138 2830 -839
3722 -839 -3672 -4134 405 4105 3623 -1138 -3761 -3177 135 4223 2628 -564 -3589 -3284 1411 4409
3738 4409 3762 -171 -5172 -3512 755 2795 3079 268 -3657 -4216 821 3653 3921 -1202 -3471 -3264
3754 -3264 254 4042 2442 -635 -3810 -3351 440 3028 3423 -131 -3893 -3064 535 3869 3336 -116
3770 -116 -3547 -2716 1110 3345 3146 -142 -4132 -2902 20 3604 3540 -347 -3975 -3559 281 4043
3786 4043 3368 -987 -3812 -3297 -91 3807 2616 -1271 -2920 -3583 384 3670 3041 397 -3553 -2863
3802 -2863 541 3855 3660 -463 -2666 -3963 904 3509 3107 272 -2591 -2649 515 3664 3635 -904
3818 -904 -3774 -3206 663 3260 3063 -67 -3856 -3029 304 3666 3036 -306 -3696 -2781 -180 3873
3834 3873 2581 -406 -4081 -1845 675 3824 3185 -1229 -2783 -2757 752 3348 2883 -739 -3989 -3733
3850 -3733 267 3201 3131 -17 -2820 -3069 484 4176 2163 -111 -3557 -3220 973 2282 3301 -643
3866 -643 -4043 -2892 225 3261 2746 -110 -3182 -2020 32 2730 2958 376 -2907 -2494 928 3770
3882 3770 1922 -678 -3447 -3542 307 2773 3486 -458 -3277 -2176 83 2902 2754 576 -3841 -2808
3898 -2808 -89 3400 2418 -1016 -2989 -3153 296 3293 3520 24 -3519 -2149 360 2902 2280 -186
3914 -186 -2217 -2122 1075 3279 2939 432 -3312 -2798 600 2703 2417 -143 -3356 -2534 984 3018 2586
3931 2586 -285 -2848 -3443 853 2926 2801 -679 -3840 -2767 1009 2630 3231 -90 -3726 -3036 824
3947 824 3426 2702 -723 -2591 -3371 330 2714 2433 -447 -3347 -2944 680 3421 3615 -8 -3340
3963 -3340 -3132 -326 2722 2774 -389 -2990 -1708 831 2315 2371 -272 -2277 -2413 7 2493 2549 -673
3980 -673 -2343 -1907 -212 2371 2765 -58 -2843 -2627 56 2579 2645 -156 -2837 -2559 -55 3350 2945
3997 2945 -583 -2094 -2369 162 3028 3295 -243 -3126 -3222 155 2429 1897 -123 -2786 -3119 -4
4013 -4 2298 2083 -54 -2911 -2071 401 3060 2464 -585 -2817 -2634 712 2381 2586 -486 -3187 -2595
4030 -2595 401 2570 1909 -150 -3544 -3087 -203 3126 3421 -929 -2931 -2799 604 3294 2820 -877
4046 -877 -2558 -2992 369 2641 2451 113 -2769 -2570 646 3106 1815 592 -2099 -2421 338 2605
4062 2605 2651 -1428 -2400 -2718 545 2664 2425 343 -2856 -2821 72 2781 2287 65 -3114 -2288 626
4079 626 3037 2554 462 -2621 -1634 162 1696 2432 -47 -3039 -1756 818 1831 2313 -424 -1687
4095 -1687 -2328 86 2572 2824 -41 -2942 -2136 520 3331 2397 -1116 -2933 -2538 8 2279 2737
4111 2737 -326 -2561 -1881 180 2180 1887 -680 -2457 -2052 231 1639 2671 231 -3514 -2696 30
4127 30 2569 2034 -906 -2874 -2516 -386 3365 2390 -428 -2818 -1857 217 2661 2678 -1048 -2830 -2154
4144 -2154 246 2955 1846 -1027 -2036 -1227 318 1853 2562 -448 -2283 -2344 -640 2407 1669 105
4160 105 -3102 -3075 -14 2101 2546 -263 -3258 -2152 265 2110 2240 372 -2469 -1309 566 2363
4176 2363 1831 -281 -1910 -1207 -539 2599 1706 -919 -2177 -2083 369 1943 2872 656 -2065 -1707 204
4193 204 2674 2408 -567 -1897 -3249 -606 2803 2439 -29 -2242 -1490 142 1702 2247 -447 -2327
4209 -2327 -2080 81 2325 1568 -835 -2632 -2179 -23 2069 1272 -228 -2014 -2075 540 2297 1565 -425
4226 -425 -2157 -2238 145 2268 2860 -453 -1577 -2355 -2 2044 2168 256 -2468 -2185 92 2405 2046
4243 2046 240 -1971 -1554 312 2339 2033 343 -1715 -2287 1538 2027 1678 -299 -2916 -2360 131
4259 131 2572 2443 -288 -1019 -1545 -504 2337 2679 -331 -2701 -1804 491 1511 1961 -187 -2250 -1967
4276 -1967 -12 2004 1629 -423 -1933 -1786 270 1838 1889 -455 -1988 -1510 -150 2510 1855 -533
4292 -533 -1773 -1683 -36 2130 1911 -365 -2541 -1908 -73 1573 2017 287 -2089 -1395 269 1996 1841
4309 1841 -867 -2191 -1840 443 2146 1838 -338 -1898 -2467 -487 1573 332 -766 -1656 -2924 464
4325 464 2072 2067 -407 -1813 -1718 130 1440 2132 -162 -1844 -2614 -73 1744 2333 -759 -1903 -1907 59
4343 59 2322 1521 -453 -1343 -1410 -232 2122 2182 8 -1890 -1700 5 1390 1458 -232 -2411 -1081 491
4361 491 1885 2023 -532 -1173 -1695 971 1714 2373 509 -1515 -952 -458 1996 1735 -562 -1803 -1100
4378 -1100 -43 2449 1294 -975 -2541 -1523 1034 2441 2466 533 -2021 -1994 -582 2003 1163 69
4394 69 -2299 -1445 223 1253 2280 -544 -2058 -1428 -128 1795 2173 -488 -1934 -371 -981 1355
4410 1355 2106 -108 -1068 -1285 -53 1562 1480 -323 -1547 -1847 733 1607 791 -775 -519 -1168 -509 1943
4428 1943 468 654 -1470 -1791 92 1692 1195 -46 -917 -844 -215 1086 1521 -239 -630 -1029 802
4445 802 1243 850 705 -1054 -1919 -561 2089 1357 171 -886 -1418 -352 2616 913 625 -1736 -1604
4462 -1604 410 1798 817 -227 -852 -1413 147 2280 1637 -66 -1716 -795 -82 1547 1294 -394 -1588
4479 -1588 -2267 -680 1998 1959 -362 -1576 -885 543 1544 1473 -492 -835 -968 178 839 1758 389
4496 389 -1727 -1777 12 1336 1875 -610 -1715 -1681 -18 2156 1492 -318 -1195 -798 215 1370 833
4513 833 126 -1610 -1901 86 1674 647 94 -1859 -1792 1075 1307 326 -37 -1651 -1137 -52 2101
4530 2101 2140 -758 -2259 -1685 -34 1297 1232 -1130 -686 -1765 220 1519 911 -464 -1590 -1025 20
4547 20 1588 1320 202 -2123 -1109 -363 1387 2157 -627 -1735 -1162 178 978 856 -505 -1220 -711
4564 -711 501 714 1130 625 -1056 -650 -4 1046 926 299 -1981 -2559 -18 834 1209 -211 -1164 -1874
4582 -1874 177 1275 1014 -440 -1854 -842 -112 1757 1640 -553 -888 -1225 38 1176 1748 -511
4598 -511 -1629 -1227 -78 1881 1937 -699 -1546 -559 897 1343 1036 -854 -1463 -538 176 1328 750 845
4616 845 -947 -597 228 1172 2062 33 -1657 -1485 293 1366 101 -72 -1013 -1188 -220 600 2078 -744
4634 -744 -1655 -920 342 774 448 -223 -945 -894 724 1787 1088 -134 -1010 -1463 459 694 719 -205 -2366
4653 -2366 -1489 320 1324 1380 618 -644 -528 -112 1148 719 -234 -1474 -397 -102 909 1836 -389
4670 -389 -1657 -522 -266 1525 1132 -1365 -1127 -1931 364 888 767 -35 -1894 -1188 392 1373 664 -53
4688 -53 -1520 -1308 691 836 114 -723 -1554 -1068 193 1542 1970 -1162 -1637 -798 -381 790 1332 -315
4706 -315 -1097 -1182 269 1375 463 -154 -882 -1515 -671 1712 1534 109 -1555 -571 139 1165 956 -459
4724 -459 -801 -591 -407 928 408 -1236 -1714 -1734 -218 1425 1058 508 -146 -1046 -909 1108 2389 270
4742 270 -632 -1594 -268 1154 1304 565 -1341 -734 1005 908 1647 -927 -1376 -898 -517 39 267 -305 -867
4761 -867 -1268 -4 440 443 365 -1743 -767 444 695 682 -94 -1636 -1596 290 183 692 206 -877 -720 46
4781 46 1086 958 805 -1768 -1136 500 1022 965 -576 -1755 -992 235 412 1252 -24 -770 -1294 -148
4799 -148 661 344 -368 -1600 -1003 346 826 -57 -394 -625 -902 698 895 377 -478 -522 -602 754 714 952
4819 952 202 -614 -696 -114 2216 1305 -741 -1604 -1132 10 350 1533 23 -1344 -401 -12 1247 2
4837 2 -572 -1162 -43 912 753 970 351 -1314 -1389 -364 412 1353 326 -1075 -625 757 1285 607 -86
4856 -86 -186 -583 -638 262 1115 -534 -1124 25 1018 1006 398 181 -1211 -1064 792 819 1105 -106 -1693
4875 -1693 -712 489 1339 220 -653 -637 -709 679 396 826 -623 -1170 -1196 -689 1335 1089 -361 -565 -1613
4894 -1613 1111 1190 939 95 -765 -980 334 580 233 -382 -1518 -885 35 1018 138 -984 -1214 -653 -1002
4913 -1002 589 904 -486 -791 -1567 527 1334 -564 -637 -306 -1447 457 481 955 520 -1068 -651 304
4931 304 1283 -32 -324 -1661 -465 53 1190 673 -474 -1198 -165 795 795 784 -309 -478 -893 461
4949 461 1907 278 -569 -602 45 113 656 791 312 -1496 -1145 97 -170 93 -911 -642 -548 68 447
4968 447 818 85 -1303 75 1189 1230 839 -585 -44 -1308 239 568 730 -146 -284 -904 -41 1354
4986 1354 893 -708 -744 295 -363 1055 -127 665 -748 -905 25 684 211 -505 -940 -938 300 1552
5004 1552 -218 -237 -220 -776 570 1070 -159 -265 -762 -1497 458 763 643 52 -583 -684 970 628 1575
5023 1575 -378 -391 -1030 -234 512 200 -264 -1069 445 638 1288 -53 -105 -1640 -32 1097 1353 731
5041 731 255 -410 36 651 1189 339 -671 -1850 -212 121 1442 714 -1269 -390 -361 268 625 770 394
5060 394 -695 120 -639 343 -125 -511 -875 -773 374 1057 560 -5 -1105 -436 340 804 706 -131 -845
5079 -845 -28 523 -35 218 -1232 -780 132 390 1085 177 335 -888 -326 570 168 592 71 -721 -317
5098 -317 286 1004 -16 -631 -622 781 485 504 -105 -991 -518 -875 158 1027 1349 -82 -615 -502 727
5117 727 137 120 -551 -1187 524 -166 1408 779 417 -1081 527 783 374 493 289 -642 -36 653 911
5136 911 -426 -29 -1273 195 -266 1112 194 4 414 -1069 -22 -51 885 -583 -423 -1318 258 828
5154 828 205 -364 -1091 -522 496 -154 135 -908 -1553 -646 195 715 1190 -449 -183 492 52 791 414
5173 414 -550 -540 -449 -290 450 0 -590 -653 -28 134 815 149 -189 163 -1005 660 680 -514 -1106 -140
5193 -140 737 -29 428 -48 -635 -1226 602 1532 1693 238 343 -1561 -416 36 849 -54 -36 -645 93
5212 93 381 365 -147 -274 -453 70 566 524 283 -153 -565 -653 894 542 -14 388 -383 -75 -405 405 549
5233 549 -468 -1244 -483 622 852 -208 -780 -1808 -736 341 182 118 478 -65 -194 -165 520 -199 -480
5252 -480 -1071 -996 -77 557 -222 -653 -2334 2 245 677 -79 -525 -1520 -387 803 1067 584 -326 -1504
5271 -1504 -396 838 34 86 -277 -809 -672 1285 -407 990 -618 -230 443 277 661 673 -127 272
5289 272 -438 -449 62 -302 -553 -799 -222 -202 1148 427 -865 -1075 -286 812 1015 403 594 -189 -690 1227
5309 1227 755 -257 -586 -660 -365 113 682 -479 847 -1123 -524 1175 419 348 -645 -576 -120 1373 1745
5328 1745 -108 -420 -677 -747 837 626 258 -426 366 -675 702 941 439 -664 -452 -47 459 786
5346 786 1073 -498 -814 593 296 886 73 -888 -1121 231 50 231 100 -120 224 -337 756 1368 -105
5365 -105 -899 94 -174 -112 -111 442 -1454 -544 467 -227 500 17 155 -189 115 317 1025 -233 -17 -6
5385 -6 -119 750 347 190 -144 -642 -65 -151 843 -11 -739 -521 -459 1175 30 552 531 -1173 -58 601
5405 601 494 -325 -533 -301 -606 -21 880 -476 226 -1358 362 780 722 383 -1068 -145 -830 1142 525
5424 525 -330 -518 -471 236 176 1167 1101 -821 -1325 -514 869 389 26 -1055 -448 766 1008 823 -162 -794
5444 -794 -458 -377 1174 -291 -247 -524 -950 -267 657 247 55 -295 -987 -558 733 924 377 -352 -582 -193
5464 -193 547 1042 -329 -1083 -452 -484 1290 -419 405 -604 -558 -551 2037 333 -24 -786 -1018 50 335
5483 335 728 771 -845 15 -396 -636 1044 159 -139 -150 -418 288 1024 -214 -47 -636 -38 -119 -622 210
5503 210 95 -659 -413 433 283 -343 -273 -1230 68 914 772 229 -162 -599 -541 169 1247 768 609 -794
5523 -794 15 566 493 655 -144 -1284 -332 625 -325 98 -283 87 -14 152 0 336 154 -1023 303
5542 303 338 638 25 -39 -132 241 456 -288 104 -969 -798 342 251 317 193 -245 -436 65 932 384 405
5563 405 -340 -593 173 258 835 -581 -335 -1210 163 -136 64 -432 -130 -266 609 393 1083 -254 -429
5582 -429 161 659 485 465 -970 -652 -808 -474 656 1153 420 -807 -716 279 896 129 32 -109 -729 -99
5602 -99 1205 754 614 -677 -957 -337 1029 1271 -255 -719 -863 -413 863 180 -782 -503 -793 -733 -43
5621 -43 293 535 -578 -91 618 590 407 -482 -934 -291 -320 300 253 621 -375 -1296 -245 102 947 -507
5641 -507 -340 -387 75 310 792 14 -176 152 -183 436 423 -113 -129 -924 676 34 139 554 -666 -507
5661 -507 -31 317 530 -180 -750 -263 330 1344 -87 -137 -422 -297 -383 1036 -261 -252 -272 -1528 44 468
5681 468 450 -405 -451 -943 131 1184 333 522 -730 -971 -897 -36 560 -51 372 -251 -127 188 895 197
5701 197 -1018 117 713 896 -40 -71 278 -424 450 759 -1087 -336 84 -2 1474 436 472 -94 -297
5720 -297 -792 -362 1704 670 492 -845 -450 483 738 229 162 -401 -194 427 120 1048 -540 -756 -494
5739 -494 478 820 430 -361 -429 -105 -429 313 1001 260 -916 -581 -501 -57 386 -38 -685 -2244 -77 1713
5759 1713 439 -40 218 -830 -257 1129 508 -443 -856 -415 138 -159 -82 -368 -83 332 187 84 401
5778 401 97 356 -461 -351 -206 -150 123 145 79 66 382 -158 -88 -222 -126 408 423 145 -19 -243 80 -90
5800 -90 540 1113 -632 -920 142 -75 596 -175 15 -172 -102 -504 493 744 -156 -189 192 -441 -269 -104
5820 -104 367 226 -376 -96 700 -67 114 -251 -1204 -209 534 650 90 -383 -123 216 128 -184 -526 -619 -544
5841 -544 -170 1069 -586 -413 115 -569 21 1357 -392 214 -1198 -976 278 552 1086 -726 -375 -1013
5859 -1013 -147 991 -47 -918 -313 -922 -236 295 -324 -553 932 -1155 -225 1031 799 -56 -771 -589
5877 -589 558 -473 1049 401 -315 -655 262 -46 -288 -301 -116 -571 111 593 168 -247 -388 30 445
5896 445 127 451 -423 -502 -168 -260 607 135 359 -586 -314 176 817 818 478 16 -788 -266 1784 456 -53
5917 -53 -491 606 417 379 553 460 -843 -64 360 880 -295 -141 -1079 -773 500 794 -145 -352 -29 -610
5937 -610 -54 226 909 -99 334 -205 -846 -165 941 184 -422 -521 -273 -778 290 -69 -564 -68 -286
5956 -286 707 -543 80 219 -734 79 121 477 -439 -245 -507 286 -357 850 796 -1182 -470 -319 874
5975 874 385 -229 -1022 -697 -1057 430 298 157 -451 -757 -82 191 338 190 -785 -311 -278 255 731 718
5995 718 -91 312 -872 -319 530 928 -831 -947 352 538 726 -362 -235 -960 3 -79 -529 185 -37
6014 -37 -25 336 -118 -217 -241 -520 -502 -71 616 415 90 51 23 505 -7 244 -448 471 -496 870 56 467
6036 467 779 -61 -205 419 1174 597 419 -805 -110 381 -561 -25 189 -552 -316 21 474 -67 482 -93
6056 -93 -512 -553 -228 1451 -18 -79 101 609 734 810 -854 -840 -483 390 537 -59 -572 -441 -479 53 352
6077 352 -80 207 -1499 -223 543 63 -911 -94 -819 10 682 946 -234 554 -969 -380 538 182 46
6096 46 521 179 -506 232 -311 -345 -1166 -471 677 -428 -337 405 549 -303 565 497 708 76 -222 -473 117
6117 117 -551 319 158 682 -303 -774 234 1280 -42 -458 -9 -128 625 88 759 505 -808 -777 369
6136 369 -230 212 -518 -1360 -215 -824 246 1125 -75 -970 -740 1297 -512 -202 -505 -872 -1017 -487
6154 -487 191 676 643 -535 555 -939 102 -520 435 -519 -594 100 727 993 347 -594 -39 281 1261
6173 1261 1179 420 -197 -593 19 454 -150 123 -587 -461 748 659 85 -495 -329 -382 506 -94 255 -476
6193 -476 497 458 -289 359 -388 125 96 -936 1 672 546 -370 -153 -1135 -429 87 232 393 -336 -584
6213 -584 -573 247 -258 46 -1120 476 278 1 635 -45 333 47 421 433 1270 288 -561 -491 347 443 249
6234 249 151 -1125 -10 -45 138 -587 -292 -196 -948 87 490 671 123 -1241 -17 -121 346 384 -105 -186
6254 -186 -244 349 441 269 -594 -1852 -1115 430 1522 248 -683 -689 3 839 305 867 -38 -191 -721 247
6274 247 -327 794 -548 -426 118 -474 129 -224 122 -549 -252 39 -230 1403 386 -914 -240 1173
6292 1173 533 1065 194 -30 -304 203 -407 780 -161 -35 447 -146 415 -764 -783 -636 -234 -342 -412 -220
6312 -220 776 -1268 -335 240 453 302 178 -1476 92 90 337 522 -504 -856 -914 -963 683 10 89 -1063
6332 -1063 -643 446 967 950 -388 -953 117 511 203 396 -238 -248 641 -278 447 716 -393 -865 -685
6351 -685 358 938 -517 -256 -240 224 -94 824 890 554 -60 -625 177 308 -193 -919 -436 -796 538 899
6371 899 103 36 -342 -62 252 563 560 46 -369 51 -61 331 903 467 -657 -217 -612 801 754 280 -526
6392 -526 -194 130 185 943 -180 -395 -841 505 -11 -381 274 -532 -669 -1122 651 -767 307 -631 -359
6411 -359 -657 629 636 -715 45 181 219 -478 237 -360 -264 -57 560 97 140 -144 -499 685 956 269 -192
6432 -192 -592 120 -158 418 -180 -150 1088 -713 477 212 832 -8 93 -930 -572 1220 1248 -484 -179
6451 -179 -663 -503 -240 218 565 111 -188 331 -417 -473 571 190 710 356 510 -69 -252 476 434 168
6471 168 6 767 403 354 624 515 821 -261 399 -600 -136 -136 141 666 -168 -96 -1226 -624 76 82 222
6492 222 -174 -113 211 311 222 -652 -143 -146 261 -682 348 764 -425 -173 126 852 327 397 -75 -495 -415
6513 -415 136 484 1025 -342 146 -253 -103 643 367 -943 -1341 964 1332 -66 124 -508 -419 130 349
6532 349 337 -213 382 -139 226 -406 -1207 152 218 -867 -393 800 153 -399 -1358 228 412 375 665 1245
6552 1245 118 -331 193 272 -314 865 51 -330 -274 -430 41 409 -548 389 670 310 113 210 -322 -447
6572 -447 -393 -128 -308 -413 -669 -245 560 87 -532 -517 -590 -602 -373 -286 533 107 226 -431 -115 -338 -109 466
6594 466 -526 50 247 198 647 -598 -298 -34 81 863 387 624 -174 -336 -776 -701 237 453 146 -542
6614 -542 -705 935 -86 -163 1040 -1292 66 436 432 650 573 -1352 -710 -19 342 1246 715 -1127 -484
6633 -484 -332 817 282 680 -379 -491 -325 836 -290 304 -265 77 764 184 518 102 -302 -361 428
6652 428 205 -399 -692 -539 550 92 35 296 -423 -446 -316 -534 674 699 -679 12 -165 -112 116 -391
6672 -391 269 -440 385 875 -611 -660 624 -491 -108 1156 716 -54 -194 -739 583 460 -71 -478 -430
6691 -430 -108 -81 -686 213 160 -216 -1044 -580 505 570 -334 -14 -250 404 764 183 570 -47 311 109 -161
6712 -161 127 440 -385 651 -76 244 -69 350 -259 -58 647 -123 730 485 636 -230 -753 205 427 -355
6732 -355 -167 -589 -1043 -145 319 686 -470 -603 -130 -547 1001 464 -85 -34 -3 -216 1424 311 -29
6751 -29 -565 -15 -21 146 -83 -238 -421 -662 1058 -464 -40 519 -142 -461 409 432 751 -236 -1097 -261 -349
6772 -349 538 -10 -945 -294 1 515 198 -278 -262 -378 -81 1174 55 205 289 -182 -734 -352 134 110
6792 110 -567 274 -459 -207 579 482 50 -508 -357 530 881 1299 -286 -428 -152 593 321 -538 -486 385
6812 385 -114 736 1106 -171 -165 -1214 -26 -1047 887 1344 -441 42 373 531 101 318 -192 -538 11
6831 11 -513 612 222 13 -317 373 -12 169 -104 -512 -463 1395 357 455 130 228 -445 -410 281 329 -17
6852 -17 -730 -535 -326 183 415 374 -158 -475 153 -183 272 353 639 -1323 -458 975 464 212 -621 -869
6872 -869 -740 438 317 196 334 -387 -480 321 484 50 208 13 602 34 156 270 -67 -283 188 394
6892 394 718 341 133 -298 -972 181 119 51 -339 -138 -663 -4 111 75 -91 -729 -335 -914 971 -312
6912 -312 -13 364 -237 116 687 416 -459 -566 -904 -224 -559 -107 -189 -229 610 -406 -155 171 422 -884
6932 -884 -655 846 827 -593 245 -467 -428 862 222 -162 -775 322 -235 1277 220 441 -627 -903
6950 -903 326 872 588 -315 711 218 -10 -883 367 275 -59 -434 293 676 274 21 -296 -266 196 43
6970 43 629 -571 649 -335 127 -153 -582 -201 -317 -331 -589 954 266 -594 -384 -615 -282 -186 -838 -485
6990 -485 -7 189 715 -439 -121 489 -1365 -1029 -406 303 466 -276 -84 -126 297 780 14 204 423 618
7010 618 687 1074 -631 -702 -141 -202 -339 842 445 411 291 -242 31 -366 682 -233 -503 289 440 -70
7030 -70 -667 173 -275 -210 958 -467 656 -909 163 98 -165 1193 -270 -454 -301 526 -23 214 -122
7049 -122 -508 160 -33 65 320 858 497 -1129 232 -696 -788 902 -241 -656 -539 560 248 -784 411
7068 411 91 -921 686 307 12 157 -717 -586 3 -256 446 -37 29 -431 -788 467 -244 222 -68
7087 -68 -669 -65 -178 1425 -211 96 -8 249 4 474 -255 -711 -25 -600 -718 329 152 -554 -1030
7106 -1030 290 33 -178 48 -627 -542 -852 702 464 230 133 69 743 -736 -276 410 15 652 -434
7125 -434 -253 795 -4 -429 -367 217 -333 -41 -247 -477 103 112 241 383 -542 -38 26 -59 45 485 -444
7146 -444 97 -117 -761 -393 222 400 10 -322 -549 75 -821 334 -256 -92 54 190 590 283 -362 -652
7166 -652 -462 -369 545 169 66 -105 280 175 473 -1293 -1068 40 336 -163 -350 -368 116 139 -385 -195
7186 -195 246 -383 -268 -79 -180 121 -407 849 -29 434 467 582 301 352 -267 194 -619 -21 88 -125
7206 -125 -716 183 300 397 -169 144 991 -575 559 192 750 362 12 -508 -326 502 -25 -52 -1084 -160
7226 -160 674 163 118 242 -744 -402 279 244 606 -149 -275 81 -203 197 252 360 -232 -327 -199 176 384
7247 384 713 374 387 504 119 -1038 -518 -230 -437 -20 402 220 -624 -194 124 -529 61 265 195 464
7267 464 765 -230 -70 743 89 19 -569 -309 40 -281 -406 -69 -8 289 308 410 366 710 -775 404 1240
7288 1240 857 -104 -290 -766 -76 136 715 817 291 -105 -115 80 -584 785 -350 -348 -68 -164 865 -167
7308 -167 -532 359 497 -50 823 764 275 -266 187 448 111 82 -619 -436 -194 -4 -2 -59 -767 213 51 359
7330 359 -21 576 520 -73 -362 73 646 -707 316 -1362 -388 98 286 -156 317 -87 -483 -78 299
7349 299 -254 -676 -423 -688 493 1408 -269 1087 -182 -278 104 548 1004 -511 412 -358 329 617 -182
7368 -182 -385 -250 289 238 77 232 -226 562 1355 -254 -198 89 241 -282 44 187 379 -175 -375 679
7388 679 191 -711 -257 -770 258 109 -558 -646 -305 202 -521 -582 -50 -333 214 611 -56 -400 179 576
7408 576 -588 -337 0 -440 -413 -163 488 25 180 -326 418 153 134 -49 2 684 775 340 -361 368 -862
7429 -862 -824 377 -616 188 -656 20 -1065 16 -110 414 233 -418 341 109 -545 -359 -339 27 -282 -195
7449 -195 150 62 -286 -519 36 145 -52 408 -518 -327 533 -87 54 -260 532 -1316 168 -89 -654 243
7469 243 43 -527 -205 48 -795 217 680 -509 -257 -549 773 424 335 -476 -819 3 1255 940 274
7488 274 26 -370 -2 -213 976 -215 11 -889 -740 -108 731 28 -737 32 -390 -400 -251 654 35 12
7508 12 -1213 1289 -45 433 -199 -544 -817 247 -6 787 74 573 187 -438 113 -62 -159 -957 103
7527 103 550 205 99 -565 -1087 824 -133 253 209 -13 -272 -474 -190 -196 -88 -26 -264 299 -52 289 -329
7548 -329 -571 -427 -525 -95 37 -395 -71 -676 503 -294 -422 533 -109 -52 356 523 499 271 -472 -327 -146
7569 -146 -1256 -180 -172 560 418 339 893 276 -317 -345 192 202 -629 1087 56 173 -905 389 -330 503
7589 503 -90 -766 -943 -699 841 10 -74 -75 279 -224 158 -121 54 64 556 91 848 -31 185 -538 -336
7610 -336 596 -536 -68 -489 -473 27 -167 382 -115 -549 -82 267 351 -844 -317 -458 -67 -352 -394 -844
7630 -844 45 327 323 413 -134 230 91 269 -86 218 237 605 -182 -100 368 -25 -294 -192 -198 888 52 -379
7652 -379 -717 54 243 87 -257 -368 -236 -127 -17 83 -139 18 -485 354 481 759 -247 -511 420 475
7672 475 15 -624 283 -320 -97 156 -408 329 -260 -815 322 132 -438 -131 -989 566 188 2 710
7691 710 -616 -520 -588 42 -144 124 -254 354 -223 83 195 763 1120 386 -429 696 258 -132 7 -306
7711 -306 -75 -32 -680 625 -138 -175 557 942 -135 40 -277 -653 -530 -96 1142 0 -1072 207 -413
7730 -413 38 585 366 178 187 -1665 438 525 541 -352 265 335 -626 -113 221 -715 635 604 -334 -125 -347
7751 -347 125 -321 126 32 1228 794 325 -618 -15 180 131 1239 882 -989 -186 -312 186 -224 -19 127
7771 127 -1145 -922 292 649 373 -731 -408 -224 731 46 56 223 -1221 -522 -120 266 -110 328 889
7790 889 -334 -446 -107 -124 -44 -161 -349 961 29 576 -160 -877 138 511 -94 -201 -1075 -829 -481 282
7810 282 24 -853 -22 -237 -70 -896 -86 837 -497 -699 -144 388 405 -171 -106 -272 413 -571 929 -365
7830 -365 267 -395 -169 373 -403 445 -863 -280 70 359 366 590 -1409 237 -734 45 149 126 -956 441
7850 441 -160 320 -215 -272 543 -997 102 835 477 -125 -608 200 -601 -212 300 -9 -513 37 103 135
7870 135 -567 -609 337 -380 -332 799 219 -198 -646 -1346 -36 -22 -166 -348 44 -517 -86 412 75 -558
7890 -558 -356 -221 -71 358 428 520 -599 -200 623 -169 443 54 -217 -268 -478 -58 1 313 -476 -497 -346
7911 -346 41 -41 1608 -96 92 729 -82 91 -397 678 -646 -1044 161 801 566 -335 -526 114 41
7930 41 -211 -145 -718 41 -751 -517 582 -36 -27 529 712 -316 -926 -366 -306 565 148 -101 -502 -277 -314
7951 -314 -525 401 434 -511 20 247 -15 104 -428 154 226 -619 -257 586 -63 -28 178 -511 -9 -217 1016
7972 1016 808 40 -298 -510 -108 245 389 135 -134 -104 -588 226 686 43 -115 -353 472 627 -166 33
7992 33 265 -966 -274 -96 -340 -798 216 335 -238 -1159 -326 -211 46 -671 244 -380 348 626 -448
8011 -448 473 1284 42 637 1 -406 -119 496 466 446 -99 -566 546 287 -359 1278 -24 -71 456 -694
8031 -694 408 -714 525 -135 62 115 -157 314 10 140 168 27 119 363 -138 -312 -135 -170 605 -157
8051 -157 433 275 -186 -239 57 -205 925 -307 -443 -740 97 969 -514 -1007 -160 -151 25 -259 -936 159
8071 159 159 42 892 397 -259 48 -24 -142 -664 -3 74 -15 343 -487 492 -127 431 284 -275 151 191 119
8093 119 -263 -180 -365 852 220 -96 578 -361 1 -576 170 -292 313 -609 -280 144 -733 9 7 -294 379
8114 379 -179 390 269 1007 -248 -290 -649 296 -1 -608 -757 487 623 -97 160 1105 -145 226 -606
8133 -606 -283 94 -419 -619 452 -49 8 607 -796 -266 403 1180 412 -114 -392 729 -779 126 -225
8152 -225 484 1172 549 -732 382 59 859 -461 451 -50 -424 415 244 1114 -340 -430 314 54 752
8171 752 -828 -499 -706 -566 258 199 84 276 -268 145 -466 -1071 386 -553 15 577 -87 4 -278 754
8191G54
$$ Imaginary data points
##PAGE= N=2
##DATA TABLE= (X++(I..I)), XYDATA
0 0 0 0 0 0 0 0 0 0 0 0 0 0 0 0 0 10 -108 108 -108 108 -108 216 -216 216 -315 324 -352 432 -534 548 -650
31 -650 756 -866 974 -1086 1211 -1390 1532 -1729 1932 -2145 2379 -2647 2923 -3231 3572 -3944
47 -3944 4346 -4791 5274 -5808 6400 -7054 7781 -8596 9510 -10557 11751 -13138 14761
60 14761 -16717 19099 -22096 25987 -31252 38833 -50835 72651 -126068 580398 611780 18001
72 18001 5297 -252715 306563 326758 424019 5528 -294303 -266736 -38613 309800 276122
83 276122 -91569 -384182 -332582 -18904 285751 260508 -84293 -314586 -297444 43153 283260
94 283260 315082 -32258 -293050 -258267 22659 333961 260354 -13814 -320772 -267862 31561
105 31561 272067 272320 -68223 -282147 -287919 22746 281738 245475 -16588 -317076 -246742
116 -246742 16024 286658 253498 -40909 -274757 -264222 32633 260550 242714 -35209
126 -35209 -286504 -257160 8658 263845 231400 -34954 -285489 -248535 14410 259934 235506
137 235506 -34626 -258582 -245132 28017 253786 237302 -18208 -258766 -230472 14576
147 14576 259323 226223 -23229 -254966 -234654 20553 238081 228921 -24598 -246675 -228616
158 -228616 14340 247131 224937 -12528 -241256 -216246 22213 244127 226856 -10181
168 -10181 -224279 -214301 21866 238453 226405 -10321 -228147 -212259 15999 232435 213547
179 213547 -11273 -226276 -211742 12450 222846 214441 -11986 -220085 -211093 12598 222139
190 222139 209977 -9014 -217902 -204508 9696 217217 205932 -8564 -213292 -207256 8499
201 8499 211038 202102 -10491 -212839 -202641 6285 207436 198549 -6702 -205486 -197171
212 -197171 6945 205616 200832 -5005 -202184 -196283 7818 204835 195938 -6182 -199751
223 -199751 -193198 5296 198180 192456 -5795 -197914 -193731 3651 193833 190940 -5915
234 -5915 -195950 -190648 4420 192512 188519 -3671 -191443 -185490 4247 191137 186279 -2644
246 -2644 -188144 -186049 2812 188097 184105 -3704 -187563 -185011 1573 185019 180440 -2129
258 -2129 -184509 -181658 1539 182815 180474 -1738 -181963 -179489 3632 181247 178955 -1126
270 -1126 -178663 -177631 1841 178470 175980 -1391 -177709 -176453 857 176101 174842 -1607
282 -1607 -175730 -174340 2442 174198 172493 -999 -172078 -170771 -176 170941 171803 -415
294 -415 -170593 -170490 1371 171651 169881 -1163 -169494 -167952 473 168243 167513 439
306 439 -167611 -167526 -25 167283 167088 490 -164456 -165659 -985 165250 165296 1470 -163824
319 -163824 -163240 -113 162616 162921 1325 -161266 -161525 -1472 160537 162493 1355 -160931
331 -160931 -161372 -821 159622 160538 145 -157899 -158830 -1613 156765 158876 1944 -156297
343 -156297 -159446 -2796 155853 158345 1108 -155045 -156817 -1170 153722 155186 830
354 830 -152600 -155157 -3523 151339 153902 3664 -151635 -153683 -3035 151775 153729 3133
366 3133 -151201 -152827 -2136 148447 151932 2878 -148428 -151675 -3407 147271 151485 2670
378 2670 -147446 -150809 -3338 146284 148422 2624 -145059 -148202 -3707 143728 147244 3718
390 3718 -143443 -147937 -3784 143011 146768 3348 -143202 -146660 -3875 141679 145545 3483
402 3483 -140074 -145101 -5411 139394 145133 6290 -139541 -143879 -5454 138695 143290 4298
414 4298 -137689 -141250 -4877 137045 140601 5854 -135001 -141082 -5724 135456 141811 5316
426 5316 -134218 -139690 -5188 134284 139680 5550 -132506 -138191 -4556 132066 138545 5581
438 5581 -131577 -137194 -6443 131040 137542 6607 -130706 -136731 -6016 129519 133984 5573
450 5573 -128622 -135324 -6644 127985 133777 6313 -127610 -135022 -6430 126525 132717 6137
462 6137 -126268 -132854 -6635 125349 131290 7139 -125158 -130863 -7516 123228 131350 7781
474 7781 -123357 -130936 -6973 123279 129798 5319 -122412 -128679 -6836 120502 128164 8096
486 8096 -120641 -129317 -7782 120748 127494 6470 -119481 -127432 -7100 119083 126671 7691
498 7691 -117234 -125912 -7272 118078 125402 8488 -116813 -124221 -7771 116512 124856 9088
510 9088 -114998 -123105 -7652 114944 123469 8603 -114867 -121777 -7552 114163 121827 7999
522 7999 -112458 -121921 -8506 112939 121290 9161 -112139 -120754 -9319 112143 120171 8985
534 8985 -111143 -119592 -8387 110028 119594 9428 -109470 -119011 -9772 109144 117395 8703
546 8703 -109577 -117886 -9536 107676 117430 9974 -107076 -116654 -9871 106360 115878 9899
558 9899 -106738 -115866 -9720 106046 115449 9229 -105425 -115054 -9016 104597 113692 9862
570 9862 -104658 -114720 -10254 103752 114386 10507 -103966 -113971 -10121 101924 112519
581 112519 9667 -102556 -111716 -11064 101303 111826 10640 -101762 -112049 -10795 101214
592 101214 112273 9614 -100446 -109921 -10006 99044 108978 11030 -98527 -109219 -11113
603 -11113 98575 109900 11673 -98343 -108781 -9846 98076 108552 10805 -96564 -108244
614 -108244 -11325 95729 107740 11879 -95535 -107314 -12186 95048 107524 11509 -95065
625 -95065 -106027 -11065 94322 104818 11095 -93949 -104904 -11981 92915 105364 12300
636 12300 -93119 -104670 -11584 93749 103298 11940 -93070 -103207 -11480 91107 103203
647 103203 11543 -91468 -102761 -11994 91518 102199 12366 -90131 -101756 -11185 89262
658 89262 102504 12524 -90004 -101862 -12040 87996 101277 11539 -88443 -100208 -11412 87197
670 87197 99983 11980 -87209 -98936 -12040 87671 100186 12587 -86313 -98994 -12226 86105
682 86105 98647 13023 -86166 -98433 -13129 84506 98331 12637 -85171 -97440 -13023 84861
694 84861 97435 12458 -84432 -96338 -12333 83410 96092 12715 -82931 -96440 -12605 83112
706 83112 95528 12447 -83226 -95445 -12665 82586 94974 12558 -81270 -93924 -13038 80754
718 80754 93923 13055 -79637 -94131 -13035 80068 93278 13452 -81087 -92850 -13657 80708
730 80708 93015 12579 -78670 -92208 -14179 78201 91803 12657 -78236 -92258 -13740 78612
742 78612 91812 13608 -78036 -90888 -13553 77297 90529 13314 -76157 -89788 -13046 76563
754 76563 89582 14659 -77020 -89684 -13166 76350 89678 13499 -75217 -87838 -13726 74291
766 74291 89218 13332 -74937 -88239 -13942 74793 88582 13162 -74003 -87318 -12371 73738
778 73738 87073 13123 -73513 -86508 -14612 73494 86180 13414 -72753 -86835 -13976 73323
790 73323 84912 13506 -71953 -84922 -12691 71817 84933 14001 -71385 -84446 -14093 71198
802 71198 85054 13342 -70196 -84231 -13518 71236 83714 13051 -70406 -82480 -13409 69520
814 69520 83384 13978 -69471 -83433 -13736 69619 82454 13506 -69239 -82504 -13514 68266
826 68266 82004 13502 -68060 -81513 -13884 67861 81236 12895 -68926 -81502 -13065 67639
838 67639 80900 13243 -66761 -79477 -13461 67037 80353 13473 -66735 -79845 -14197 65909
850 65909 79754 12792 -65601 -79029 -12116 66294 78672 14456 -65454 -78506 -13297 64499
862 64499 78246 13205 -65388 -78437 -13150 64363 77911 12892 -63411 -76704 -13683 63618
874 63618 76925 13960 -64993 -76307 -12856 63445 77145 13960 -63662 -76233 -12946 62175
886 62175 76469 12758 -62696 -75589 -13647 62338 74702 13810 -61823 -74348 -12776 62153
898 62153 74748 12428 -61911 -74236 -13245 61245 73365 13538 -60258 -73140 -13333 59829
910 59829 74035 12832 -60981 -73865 -12884 59808 72457 13067 -58359 -72974 -13394 60363
922 60363 72652 12629 -59522 -71570 -13165 58385 71490 12838 -58688 -72072 -13363 58462
934 58462 71101 12446 -59174 -70166 -13278 57969 70736 12988 -58052 -70527 -12118 56944
946 56944 70386 12859 -56843 -69839 -13148 56845 69225 13302 -56684 -69233 -13214 56319
958 56319 69282 12731 -56332 -68567 -12209 55733 69325 12917 -56157 -68777 -12544 56095
970 56095 68875 12515 -54963 -67923 -12766 54537 66728 13858 -54424 -67406 -13210 55054
982 55054 67018 12785 -54796 -67212 -12166 53498 66975 12206 -54391 -66235 -12284 53535
994 53535 66247 12911 -53085 -66429 -12770 52438 65464 12427 -53547 -64858 -11981 53171
1006 53171 65166 12667 -52039 -64999 -12735 52288 64454 13438 -51972 -64412 -12486 52532
1018 52532 64236 12961 -52196 -63874 -13613 51620 63906 11817 -51012 -62833 -12627 50059
1030 50059 63329 12696 -50734 -63361 -11779 50321 63686 11796 -50860 -62252 -11764 49483
1042 49483 62595 13531 -49492 -62519 -13429 48944 62658 12074 -50222 -61863 -12368 49356
1054 49356 61814 11590 -50435 -61336 -12312 48204 61766 13181 -48732 -60947 -12649 49196
1066 49196 61730 12336 -48492 -61324 -12441 48137 60585 13018 -47751 -60309 -13496 47853
1078 47853 60210 13460 -47719 -59882 -11494 48363 58713 12282 -47439 -59057 -12576 46299
1090 46299 59014 12700 -46283 -59475 -11761 46328 58053 11609 -46715 -58573 -12623 46297
1102 46297 58032 12387 -45905 -58075 -11991 45278 58478 12173 -46025 -58121 -11437 45265
1114 45265 58562 12109 -45863 -56484 -12726 44650 57533 11699 -44284 -56465 -12188 44744
1126 44744 57065 12756 -44731 -56341 -12328 44225 56206 11971 -44611 -55873 -12396 44477
1138 44477 55933 12430 -44645 -55758 -11887 43642 56676 12093 -43816 -55291 -12180 42788
1150 42788 55245 11644 -43248 -55029 -12205 42545 55287 12005 -42811 -54926 -11500 43595
1162 43595 54220 11325 -42497 -54620 -12336 42440 54572 12250 -41054 -53989 -11442 42401
1174 42401 53011 11518 -41963 -53114 -11732 41964 53263 12307 -41578 -52925 -11674 41590
1186 41590 52499 10798 -40577 -53105 -10609 40939 52369 12470 -40875 -51675 -11602 40792
1198 40792 51851 10868 -40957 -52183 -11349 40249 51593 11745 -39771 -51441 -11239 39379
1210 39379 51422 11862 -40237 -52008 -11525 40025 50957 11453 -39902 -50775 -11862 39467
1222 39467 50128 11959 -40132 -49935 -11331 39294 51390 11645 -39227 -50477 -11244 39174
1234 39174 49418 10815 -39609 -50060 -11662 38690 50074 11364 -38783 -49248 -11182 38647
1246 38647 49584 10788 -39256 -49100 -11342 38429 48814 10783 -38094 -48807 -11283 37915
1258 37915 48776 11554 -38356 -50338 -10657 37033 47962 10373 -37158 -48058 -11923 37464
1270 37464 47999 11362 -36753 -47735 -10128 36798 48218 9538 -37068 -47232 -11329 36795
1282 36795 47688 10410 -36548 -47423 -10884 36020 47164 10046 -36438 -46512 -10133 36381
1294 36381 46674 10996 -36040 -47031 -9942 35536 46748 10756 -36186 -46167 -10504 35223
1306 35223 45630 10603 -35298 -46343 -10684 35446 45001 9807 -34736 -45679 -10135 35107
1318 35107 45374 10724 -35503 -45358 -11265 35111 45172 10297 -34267 -45192 -10793 35069
1330 35069 44645 10538 -35173 -44656 -10232 34831 44717 10381 -34409 -44496 -10966 34006
1342 34006 45056 10765 -34773 -44532 -10023 33697 43837 10159 -33249 -44219 -9937 33348
1354 33348 43989 10696 -33348 -43604 -9902 33641 43439 9628 -33775 -43564 -9152 32565
1366 32565 42904 10381 -32944 -43056 -10045 33018 44000 10868 -33979 -43597 -10004 33319
1378 33319 42985 10518 -33060 -42246 -10359 32684 42779 10316 -31662 -42635 -10313 32562
1390 32562 42463 9755 -32184 -41175 -9524 32021 41996 9867 -32592 -42005 -9766 31966 41322
1403 41322 10148 -32064 -41271 -10507 31803 42299 9324 -31688 -41069 -9781 31438 41374
1415 41374 9011 -31063 -41572 -10462 29906 40537 9772 -30697 -41079 -9779 30621 41178
1427 41178 9931 -31049 -40419 -9496 29847 40640 9416 -30583 -39986 -10574 30674 40591
1439 40591 9152 -29919 -39449 -10156 31098 39253 9124 -30038 -39846 -9589 29958 40033
1451 40033 9598 -29903 -38818 -9367 29524 38705 8653 -28911 -39669 -9574 29299 38291
1463 38291 9664 -28758 -38221 -9214 29799 39245 9611 -29156 -38589 -8629 28676 38067 9532
1476 9532 -28823 -39438 -9686 28872 38579 9660 -28146 -37799 -9791 28637 38632 9548 -28998
1489 -28998 -37655 -8640 28651 38509 9163 -28374 -37439 -9559 28400 37531 8974 -28308 -38901
1502 -38901 -9440 27931 37382 8964 -27792 -37428 -9017 27909 37879 9264 -27744 -37299 -8555
1515 -8555 27929 37275 9122 -26980 -36842 -9244 27914 37348 8649 -27903 -36570 -8732 26789
1528 26789 36361 9248 -27420 -36250 -9072 26455 36631 9488 -27710 -36409 -8695 27395
1540 27395 35844 9107 -28046 -35964 -8775 27346 35833 9095 -26860 -35378 -8543 25998 36717
1553 36717 9236 -27207 -35312 -9057 26907 35206 8760 -26415 -34556 -8053 26334 35674 8680
1566 8680 -26020 -34479 -9211 26464 34105 9280 -25866 -35194 -9089 25803 34238 8729 -26396
1579 -26396 -34318 -9542 26385 35013 8370 -26099 -35232 -8313 26310 34124 8466 -25616 -34368
1592 -34368 -9358 25285 34343 9294 -25136 -34249 -9095 25842 34378 7534 -25349 -33968 -8678
1605 -8678 25325 33900 8353 -24712 -33622 -8944 25099 32915 8597 -24661 -33152 -7925 24343
1618 24343 33402 8477 -24422 -33661 -8304 25151 32938 7992 -24175 -32246 -7940 24620 31967
1631 31967 9074 -24931 -32994 -8508 24522 32090 8273 -25180 -32673 -7710 24105 32213 7857
1644 7857 -23328 -32585 -8466 22852 31992 7951 -24766 -32598 -8346 22922 31928 7963 -23566
1657 -23566 -31811 -8205 23771 31806 7537 -24089 -32770 -8209 24131 30890 8934 -22244 -31492
1670 -31492 -8686 23936 31265 8342 -23528 -31611 -8235 23450 32154 8732 -22195 -31137 -8031
1683 -8031 24151 31894 8239 -22127 -31673 -8346 22801 31234 7652 -23150 -31287 -7242 23194
1696 23194 30432 7850 -23025 -29849 -7547 22829 30617 7317 -22622 -30301 -7034 22072 29927
1709 29927 7431 -22216 -29884 -8131 22021 31136 7095 -22096 -30541 -8154 21858 30198 7392
1722 7392 -22311 -29923 -8447 21776 29889 7208 -21451 -29667 -7854 21591 30159 6918 -21589
1735 -21589 -30430 -7221 21530 29432 7781 -21505 -29059 -7762 20832 28940 7557 -22142 -28712
1748 -28712 -8004 21112 29469 7421 -21936 -28937 -8201 21553 29438 7174 -22329 -28773 -7747
1761 -7747 22182 28677 7491 -22514 -27936 -7468 21018 29147 8231 -21770 -29559 -7077 21352
1774 21352 28293 7728 -21630 -28208 -8099 20882 28599 6851 -21454 -27717 -7318 20294 28443
1787 28443 7509 -20346 -28039 -7589 20741 27490 8161 -20585 -27602 -7494 20792 27307 7688
1800 7688 -20490 -27908 -7596 20964 28124 7665 -20113 -28095 -7591 20098 27255 7569 -19717
1813 -19717 -27651 -7504 20739 28180 7324 -18964 -27491 -7882 19482 26869 7816 -19515 -26377
1826 -26377 -7866 20015 26723 7318 -19569 -27516 -7331 18694 26726 7227 -18811 -27343 -7457
1839 -7457 19120 27022 7174 -19846 -27045 -7864 19115 26788 6965 -19537 -26760 -6840 18946
1852 18946 25963 6949 -19579 -26583 -7728 19276 26637 6463 -18799 -25937 -7202 18802 26641
1865 26641 6835 -18846 -26576 -7825 18352 25816 7146 -18412 -26749 -6882 18945 26193 7070
1878 7070 -18316 -25653 -6725 18377 24976 6645 -17948 -25477 -7537 18458 24697 7185 -19400
1891 -19400 -25538 -7520 18474 25867 6647 -17924 -24693 -6423 18110 25065 7112 -18483 -25252
1904 -25252 -6402 18522 25277 6811 -18341 -25331 -6513 18151 25304 6562 -17760 -24977 -6562
1917 -6562 18078 24755 7019 -18892 -23600 -6899 18444 24137 6589 -17053 -24794 -7165 17180
1930 17180 24314 7122 -18123 -24764 -6829 17795 24751 6911 -17499 -24484 -6887 17695 23966
1943 23966 6593 -18025 -23578 -6955 17147 23806 6489 -17543 -23919 -7217 17795 24453 6126
1956 6126 -17749 -23573 -6301 17288 23786 6507 -17944 -24440 -6579 16518 24083 6066 -17089
1969 -17089 -23628 -6855 16888 23308 6871 -16669 -22662 -7439 16880 23250 6757 -16818 -23906
1982 -23906 -6638 16407 24051 6140 -16980 -23691 -5655 16357 23024 6631 -16177 -23601 -6282
1995 -6282 16907 23568 6317 -16536 -22966 -5971 16997 22887 6238 -16046 -22741 -6628 17160
2008 17160 23038 6280 -16955 -22643 -7013 16226 23379 6469 -16743 -22232 -6511 17273 22383
2021 22383 5974 -16363 -22736 -5820 16121 22202 6536 -16311 -22052 -5822 16269 22817 7584
2034 7584 -15868 -22649 -5984 15894 22115 6165 -15139 -21809 -6802 15929 22106 6440 -16641
2047 -16641 -20786 -5609 15416 22445 6360 -16184 -21551 -6615 15230 20982 5140 -15648 -21917
2060 -21917 -5937 14915 21827 7042 -15724 -21934 -6420 15515 21590 6533 -15598 -20966 -6080
2073 -6080 15431 21570 5908 -15454 -21486 -6653 15380 20961 5484 -15268 -21909 -5848 15600
2086 15600 20564 6767 -15161 -21310 -5425 15204 21422 6171 -14577 -21276 -5706 15137 20212
2099 20212 5956 -15044 -20495 -6542 15334 20658 5886 -15141 -20958 -5699 14539 20797 5963
2112 5963 -14584 -20410 -5790 14548 20270 5792 -14836 -19482 -5604 14187 20649 6063 -13526
2125 -13526 -20743 -4944 14124 20525 6239 -14563 -19617 -6121 15068 20324 5377 -14083 -20021
2138 -20021 -5514 13728 20434 6898 -14261 -20919 -5420 13902 19628 5689 -14305 -19841 -5515
2151 -5515 14697 19418 6010 -13355 -19751 -5200 14180 20273 6159 -14670 -19555 -5679 14299
2164 14299 19317 5833 -13962 -19765 -6078 14300 19000 6132 -14284 -18645 -5260 13389 19556
2177 19556 4826 -14214 -20009 -5196 13644 19379 5182 -13688 -19467 -5021 14316 19251 5920
2190 5920 -13203 -19945 -5482 13389 19756 5392 -13519 -18575 -5572 13876 19911 5399 -14392
2203 -14392 -18822 -6079 13651 18841 5158 -13828 -19435 -6022 12028 19071 5357 -12785 -19776
2216 -19776 -5774 12829 18907 5543 -12788 -18404 -5157 12432 18809 5036 -13521 -18058 -5382
2229 -5382 13026 18143 4762 -12802 -17717 -4893 12329 18122 5207 -12945 -19003 -4899 13214
2242 13214 18160 5130 -12806 -17120 -5731 12466 18129 5994 -12721 -17856 -4671 12702 18432
2255 18432 5002 -12639 -18440 -5545 13186 17192 4797 -12547 -17854 -5044 13152 17847 4328
2268 4328 -12604 -16679 -4772 12137 18441 4855 -12737 -17760 -5122 12978 17905 5292 -12393
2281 -12393 -17103 -5860 11356 17078 5297 -12604 -17272 -5536 12572 18207 4931 -12149 -16794
2294 -16794 -4900 12330 17564 4899 -12100 -17143 -5154 11893 16179 6083 -12037 -18139 -5227
2307 -5227 12526 17635 5541 -12618 -17456 -4905 12432 16534 3740 -12495 -17111 -5121 12112
2320 12112 17259 4947 -12442 -16566 -5481 12048 17291 5343 -13325 -16329 -5003 11620 16793
2333 16793 5505 -11098 -16581 -4875 11125 16540 5638 -11707 -16149 -4772 12010 16152 5716
2346 5716 -11736 -17155 -4649 11408 16481 4763 -11278 -15959 -4097 12244 17335 4471 -11179
2359 -11179 -16555 -4913 11818 16086 4612 -12106 -16823 -4315 11552 16262 4569 -11389 -15833
2372 -15833 -5478 11386 15065 5240 -11478 -16069 -4924 10210 16253 4200 -11738 -15289 -4903
2385 -4903 10734 14980 3774 -11119 -15535 -5027 11392 16024 4990 -10243 -16117 -5736 11363
2398 11363 15797 4006 -11346 -15614 -4534 11304 15899 4589 -10729 -16528 -4899 9832 15759
2411 15759 4741 -11521 -16128 -4597 10242 15778 4871 -11728 -15264 -5074 11323 15734 5031
2424 5031 -11610 -15595 -4322 11018 15431 3897 -10881 -14970 -5004 11065 15363 3861 -10792
2437 -10792 -15588 -5225 10321 14663 4403 -10676 -15301 -4317 10753 15200 3710 -9899 -15544
2450 -15544 -5039 10018 15313 4683 -10565 -15509 -4361 10107 14784 4502 -10217 -14916 -4721
2463 -4721 9826 14236 4281 -10172 -14880 -4190 10303 14895 4104 -9934 -14220 -4805 10656
2476 10656 14707 4185 -9899 -14427 -4790 10027 14283 3719 -9851 -14907 -4208 10304 14990
2489 14990 5122 -9522 -14587 -4217 9298 15266 3636 -10103 -14319 -4330 9866 13957 4554
2502 4554 -9889 -14593 -4212 9936 13064 3745 -9000 -13820 -3995 9769 13888 3862 -10057
2515 -10057 -13706 -4913 9671 13661 3993 -9685 -14172 -4447 10137 14468 4528 -9743 -13841 -4507
2529 -4507 8873 12757 3487 -9261 -13775 -3814 9337 12828 3580 -9721 -13784 -4172 9805 13543
2543 13543 4135 -10100 -13919 -4183 9456 13330 4963 -9230 -13342 -5111 8449 13148 3900 -9354
2557 -9354 -13760 -4183 9391 13674 3714 -9604 -12992 -4936 10112 13985 4258 -9131 -12854 -4079
2571 -4079 9437 12454 3998 -9124 -12986 -3684 9504 13877 2479 -9514 -12803 -4267 9294
2584 9294 13186 3930 -9887 -13300 -4074 9752 13875 3864 -8887 -13692 -4250 8943 13275 4508
2598 4508 -8869 -12562 -4746 8600 12671 3758 -9443 -13417 -3892 8743 12150 3829 -9104 -12966
2612 -12966 -3448 8324 12427 4227 -8705 -11855 -3472 8690 13225 3954 -8724 -12254 -2830 8713
2626 8713 12920 3842 -8615 -11667 -3593 8820 12454 3760 -8856 -12898 -3724 8360 11823 3775
2640 3775 -8796 -12822 -4049 8283 12412 3458 -8532 -12642 -4847 8531 12569 3550 -8492 -11984
2654 -11984 -3628 8107 12081 4129 -8670 -12752 -3775 8072 12238 5003 -8519 -12300 -3864 8585
2668 8585 11760 4165 -8791 -11683 -3960 8415 11355 3576 -7738 -11705 -3348 8132 11558 3676
2682 3676 -8345 -10908 -3512 8879 11967 3685 -7160 -11689 -3704 7911 12634 3472 -7623 -11704
2696 -11704 -3648 7978 11378 3880 -8002 -11722 -3273 7418 11629 3834 -7937 -10810 -4527 7961
2710 7961 11163 2870 -7910 -11554 -3370 7805 11145 2834 -7051 -11781 -3519 8063 12152 3455
2724 3455 -7598 -10740 -3521 7235 10900 3310 -7732 -10785 -4037 7020 10485 3720 -7257 -10709
2738 -10709 -3005 7604 12114 3806 -7730 -10889 -4323 8201 11540 3850 -7761 -10982 -4114 7908
2752 7908 11627 3329 -8153 -11153 -3708 7259 11751 2951 -7508 -11391 -2914 8081 10833 3796
2766 3796 -7205 -10158 -3367 7602 10117 3030 -6795 -10484 -3281 7617 11328 3936 -6643 -10346
2780 -10346 -4010 6428 11708 4486 -7487 -10301 -3796 7553 10883 3323 -7473 -11548 -3281 6534
2794 6534 11132 2658 -7593 -10828 -3094 7241 10700 2683 -5962 -10519 -3117 7094 10004 3783
2808 3783 -6848 -10527 -3408 7212 10656 3419 -7399 -10397 -3243 7393 10829 3074 -6738 -10803
2822 -10803 -3432 7312 9439 4069 -7006 -9682 -2603 7541 10388 3130 -6560 -10469 -3109 7101
2836 7101 10685 3970 -7013 -10265 -3500 7786 9900 3029 -6381 -10501 -3508 7651 10873 4519
2850 4519 -7613 -9663 -3563 6371 10526 2796 -5722 -10387 -3441 6198 10466 4322 -6643 -10094
2864 -10094 -3725 6539 10021 3153 -6216 -9958 -3463 6389 10531 3212 -6833 -8426 -3092 7234
2878 7234 9813 2848 -6728 -9882 -3282 6219 10198 2622 -7271 -9307 -3607 6730 10207 2858 -6755
2893 -6755 -10413 -3323 6630 9207 3463 -6901 -9551 -2581 6029 8942 3519 -6906 -9318 -4130
2907 -4130 6143 9597 2392 -6673 -10243 -2233 6322 10253 3123 -6241 -9804 -2981 6484 9192 3527
2922 3527 -5903 -9187 -2388 6292 10137 3259 -6664 -9438 -2858 6237 9431 3381 -5482 -9250 -3037
2937 -3037 7633 9458 3398 -5582 -8123 -1825 6578 8466 3216 -6576 -9803 -2238 6566 7490 3232
2952 3232 -5228 -8822 -3545 6946 10411 3597 -5930 -10202 -2276 5797 9373 2808 -6228 -9670 -3353
2967 -3353 6374 9594 3277 -5846 -9313 -3691 4759 8469 2981 -6412 -9394 -2408 6395 9477 2357
2982 2357 -6025 -8659 -3495 6273 8416 3291 -6702 -8930 -2981 6044 8500 2925 -5764 -8741 -2670
2997 -2670 6324 9423 3294 -5549 -8854 -3296 5900 9702 2777 -5521 -9236 -2982 5541 8571 2929
3012 2929 -5591 -8686 -3591 5444 8267 3399 -5439 -8289 -3058 5523 7797 2262 -5342 -7773 -3783
3027 -3783 5504 8890 2370 -5198 -8634 -3794 4921 8292 2158 -5985 -8426 -3437 5661 8247 3198
3042 3198 -5740 -7839 -2273 5758 8950 2762 -5987 -8590 -3078 5353 7948 2179 -4731 -8598 -2816
3057 -2816 4713 7880 3786 -5371 -8087 -2873 5514 8631 2331 -5035 -9189 -1955 6089 8354 2646
3072 2646 -5260 -8570 -2155 4785 7023 1868 -5326 -7184 -3161 6330 7727 2083 -5352 -8080 -2245
3087 -2245 5396 7731 2678 -5082 -8060 -2749 4531 7891 2436 -5818 -9340 -2948 5509 8081 3056
3102 3056 -5543 -7756 -2802 4958 7370 2520 -5343 -7403 -3019 4986 7427 2987 -4872 -8224 -2569
3117 -2569 4739 7591 2977 -3880 -7117 -2040 4829 7390 1891 -5156 -8355 -2822 4711 7774 1694
3132 1694 -5607 -7325 -2996 5150 7575 2023 -5046 -7233 -3220 5363 7161 2769 -5202 -6580 -2575
3147 -2575 5351 7749 1291 -4987 -7763 -2053 5349 8648 2795 -5093 -7665 -2516 4473 7284 2696
3162 2696 -4770 -6838 -2924 4571 7547 2162 -5974 -7608 -2588 4752 7166 2837 -4830 -7142 -2272
3177 -2272 4808 7041 2927 -5254 -7852 -1935 4927 7148 2382 -4106 -7680 -2942 4482 7083 2777
3192 2777 -5039 -6621 -3011 4263 6764 3023 -4801 -6850 -3211 4061 6794 2880 -4921 -7374 -2682
3207 -2682 4690 7189 1683 -4716 -7353 -2697 5002 7287 2075 -4450 -6298 -2246 4000 7266 1738
3222 1738 -4254 -6187 -1673 4637 7507 2979 -4818 -6192 -3235 4856 7455 2132 -4244 -6213 -2042
3237 -2042 4038 7444 2351 -3815 -6949 -2839 4218 7411 2084 -4907 -7043 -1333 4496 6894 2335
3252 2335 -4691 -6686 -2236 4898 6900 2073 -4809 -6951 -2809 4777 6063 2552 -4158 -7074 -2631
3267 -2631 4241 6602 2236 -5192 -6556 -3007 4832 6083 1430 -4730 -7270 -1243 4112 7018 2768
3282 2768 -5153 -6740 -2262 4845 6875 2825 -4094 -6000 -1894 4231 6680 1987 -4213 -7468 -2824
3297 -2824 4194 6570 2134 -5410 -6644 -2338 3847 5815 2322 -4109 -6600 -3174 3516 5873 1882
3312 1882 -4123 -6494 -2862 4189 6010 2704 -4129 -6741 -2579 4302 5729 1904 -3782 -7679 -1902
3327 -1902 4849 5989 2470 -4323 -5913 -2152 4804 6109 2341 -3619 -6619 -2216 3025 4918 2196
3342 2196 -3725 -7094 -2079 3674 6566 2785 -4465 -6314 -2429 4420 5743 1963 -3945 -6172 -1446
3357 -1446 4513 6296 1840 -3968 -7100 -1946 4384 5977 2768 -3701 -6039 -2354 3799 6406 2307
3372 2307 -4220 -5850 -2193 4300 5908 956 -4274 -5670 -2419 3460 5601 1125 -3794 -6060 -2089
3387 -2089 3133 5749 2448 -2776 -5930 -1912 3058 6213 1800 -3346 -5508 -2099 3577 5766 1892
3402 1892 -3858 -5475 -2273 3670 5343 1170 -3282 -5784 -2630 3638 6759 2747 -3200 -5499 -1681
3417 -1681 3571 6153 2232 -3991 -5015 -1830 3900 5845 1910 -3937 -5910 -1793 3638 5538 2591
3432 2591 -3606 -6050 -2047 3018 6069 2011 -3574 -5071 -1433 3652 5937 2245 -3250 -5632 -2291
3447 -2291 3722 6329 1242 -3280 -6129 -1870 3026 5865 1649 -2596 -5790 -2800 3540 5279 2415
3462 2415 -3367 -5743 -1808 3739 5565 1778 -3871 -5817 -2140 3684 5938 1702 -3249 -5670 -2205
3477 -2205 2777 5234 2171 -3008 -5616 -2368 3793 5983 2245 -3629 -6439 -2677 3830 5842 2064
3492 2064 -3020 -4690 -1911 3867 5651 1283 -3436 -5782 -2601 3917 4791 2043 -3998 -4380 -2443
3507 -2443 2304 4960 1720 -3615 -6012 -1654 3124 5707 2264 -3661 -4435 -2117 2850 5234 1791
3522 1791 -3186 -5388 -3035 2567 5670 2626 -3940 -6279 -1847 3018 5841 2108 -3725 -5041 -1520
3537 -1520 3953 5810 1749 -2431 -4894 -2583 2782 4750 1745 -2942 -5408 -2235 3214 5623 3040
3552 3040 -3061 -5100 -1475 3393 4528 1704 -2989 -4813 -1551 3117 4750 1594 -2580 -4405 -2014
3567 -2014 3572 4274 1283 -3440 -4858 -1418 4049 5311 1929 -2807 -5200 -1593 2969 4581 1465
3582 1465 -3150 -5618 -2093 2660 5133 1801 -2475 -5037 -1799 2821 5299 1641 -3046 -4896 -1059
3597 -1059 3182 5321 1859 -3568 -4826 -1256 2900 5658 1672 -3307 -4976 -1280 3537 4386 2089
3612 2089 -2941 -5057 -1870 2686 4898 1921 -3110 -4223 -1440 2875 4171 2205 -3237 -4995 -1937
3627 -1937 2341 4359 1983 -3003 -3519 -2175 3555 3968 1722 -2132 -4213 -2495 2434 4369 1003
3642 1003 -2247 -4347 -1483 2053 4984 1531 -3002 -4585 -1570 2090 4860 1387 -2916 -4798 -2010
3657 -2010 2271 4394 1587 -3051 -4566 -2118 1973 4033 1723 -2261 -4301 -2204 3325 4135 2682
3672 2682 -2268 -4323 -1739 3272 4160 2088 -2466 -4296 -1531 2833 4588 1701 -2375 -4019 -1445
3687 -1445 3708 3886 1503 -1815 -3672 -1897 2969 4755 1571 -2830 -4352 -2146 2983 4419 1290
3702 1290 -2795 -4247 -1521 2977 4858 1543 -3217 -4939 -1567 2281 4421 1267 -3477 -4301 -1059
3717 -1059 2169 3807 1347 -2716 -3743 -1460 2403 3999 1889 -1595 -4047 -1895 2209 3392 1419
3732 1419 -1832 -4704 -2155 2193 3691 2313 -3167 -4000 -1373 1894 4084 1454 -2991 -4633 -1130
3747 -1130 2426 4231 1566 -2584 -4432 -1281 2467 3786 1652 -1932 -3138 -1299 2903 4109 2095
3762 2095 -2208 -3932 -901 2200 3774 1439 -1775 -3956 -1221 2270 3728 1076 -2532 -3648 -1735
3777 -1735 2177 4334 1970 -2661 -4067 -1532 3320 4009 1391 -2693 -3945 -1387 2025 4276 1007
3792 1007 -1938 -2820 -938 1990 3315 1407 -3041 -3575 -1435 2562 3904 2034 -1812 -3747 -328
3807 -328 2765 3760 764 -2725 -3753 -1678 1887 3627 1293 -2301 -4437 -1785 2082 4441 1698
3822 1698 -2959 -2881 -2091 2394 3540 1536 -2638 -3524 -1833 2039 4296 1635 -3000 -4241 -1707 2407
3838 2407 4022 915 -1409 -4080 -1788 1682 4483 1227 -2236 -4086 -1527 2604 3765 2014 -1766
3853 -1766 -3955 -943 2975 3430 1378 -2726 -3729 -2026 1654 3172 2412 -2276 -3462 -1095 1875
3868 1875 4746 1106 -1573 -5134 -2054 2613 2690 1452 -2742 -3129 -1436 1901 4321 1794 -2129 -3244
3884 -3244 -1304 2337 4053 1942 -2297 -3666 -2323 2049 3379 1111 -1674 -3910 -1473 2135 3670
3899 3670 1891 -2250 -4529 -1363 2101 3600 1366 -1613 -3717 -1532 2539 2779 2276 -1589 -3959
3914 -3959 -1537 2167 3418 2123 -2560 -3423 -1534 2574 3733 1669 -1302 -3280 -2193 1121 3064
3929 3064 1736 -1687 -3453 -1532 745 3688 931 -2001 -2436 -1474 1497 3389 1492 -1653 -3195
3944 -3195 -1588 1144 3897 1534 -1967 -2131 -392 2111 2657 1643 -3373 -3102 -1661 1873 3168 795
3960 795 -2340 -3922 -1555 1713 2993 1549 -2548 -3923 -1325 1775 4425 927 -1817 -2770 -1184
3975 -1184 2543 3376 1489 -1442 -3363 -841 1900 3879 638 -1777 -2921 -1127 1692 2899 429
3990 429 -1628 -3099 -2348 2236 3038 1361 -1737 -2899 -1213 2640 3413 767 -2264 -2706 -2382 2052
4006 2052 4082 1131 -2219 -2518 -1175 1192 3207 1276 -1711 -3212 -1347 2037 3319 1094 -1699
4021 -1699 -2884 -1059 774 2875 1698 -2453 -2773 -1323 967 3037 1415 -1836 -2545 -1538 1603
4036 1603 2724 657 -2342 -2364 -1093 1897 3096 2037 -2030 -2713 -490 1188 2943 2194 -1844 -3247
4052 -3247 -1666 1238 2993 688 -1348 -2680 -1480 1710 3067 1448 -2281 -3319 -1641 1069 3051
4067 3051 1943 -1627 -3478 -1379 1122 2674 1751 -1926 -3245 -630 1541 3355 1798 -1963 -2950
4082 -2950 -1725 1646 1927 920 -1967 -3139 -178 2100 2727 1753 -2054 -3046 -1173 1245 3207 318
4098 318 -1710 -2745 -684 1410 3272 1582 -1655 -2393 -1506 1330 2988 1931 -1106 -3094 -1485 1601
4114 1601 1862 1828 -1551 -2575 -1190 2254 2262 844 -1162 -2459 -1309 1520 2523 650 -1695 -2855
4130 -2855 -1751 1269 2728 947 -1615 -3022 -1439 1471 2408 411 -1980 -2651 -197 1172 2872
4145 2872 1975 -1820 -1547 -1472 1866 2328 1076 -1687 -2564 -1101 1323 2477 989 -1463 -2624 -1373
4161 -1373 1030 2559 1457 -1654 -1414 -306 1838 2875 390 -1296 -1964 -1214 913 3120 966 -1153
4177 -1153 -2056 -434 1145 2050 1338 -1425 -2438 -782 1025 2180 322 -1821 -2644 -433 1468 3113
4193 3113 1091 -1437 -1786 -759 1101 3167 766 -1750 -1781 -988 1455 1908 1035 -1838 -2755 -926 1193
4210 1193 1718 1252 -1150 -1606 -1044 1419 2200 1212 -2102 -2079 -694 1180 1694 705 -1883 -2512 -1113 502
4228 502 1828 1883 -1712 -2214 -861 1189 2179 888 -1476 -3113 -890 1595 2733 1461 -1527 -2110
4244 -2110 -239 1444 2256 1596 -1020 -2196 -1240 918 2739 -29 -1270 -1884 -639 998 2320 1363
4260 1363 -1837 -2454 -1057 1411 2798 687 -1403 -1387 -35 1230 2320 1072 -1526 -2546 -946 1405
4276 1405 2791 1320 -866 -2571 -1430 783 2280 1414 -832 -3352 -788 917 2333 1560 -1259
4291 -1259 -2233 -1261 118 1655 431 -1853 -2722 -603 587 2155 1906 -1106 -2339 -433 2028 2891
4307 2891 390 -1504 -2140 -18 255 2395 1211 -1250 -1634 -633 945 1957 1526 -1207 -2372 -621
4323 -621 436 2327 1507 -1355 -1893 -328 1523 1868 1041 -1260 -1502 -1714 1871 1924 831 -2676 -1319
4340 -1319 -352 916 2417 1500 -239 -1416 -1009 383 1806 1117 -1275 -1825 -1663 2006 1823 764 -1008
4357 -1008 -1777 -836 1039 1799 913 -998 -1626 -871 317 1924 194 -1521 -2076 -2025 1865 1965 1549 -1325
4375 -1325 -1644 -1040 667 1905 1585 -550 -2330 -496 952 1615 975 -1225 -1108 -573 1403 2332 325
4392 325 -748 -1838 269 1511 1594 442 -1826 -1633 -1605 316 1691 1134 -402 -2305 -817 1095 2874
4409 2874 92 -1222 -998 -1126 703 1978 944 -1747 -2322 -678 1787 2168 1059 -1541 -2166 -454
4425 -454 1220 850 893 -1661 -2594 -824 730 2137 434 -1151 -2508 -788 774 1171 1099 -1230 -1035
4442 -1035 -995 1057 1745 861 -389 -1618 -457 15 1333 -127 -619 -2143 -1395 346 1740 1049 -1612
4459 -1612 -1586 -619 763 1794 561 -1245 -984 -1000 1842 1907 1124 -794 -1008 -1014 1206 1065 679 -758 -1949
4478 -1949 -847 910 1477 -331 -1702 -1553 -117 959 1816 1274 -898 -1726 -999 919 1801 621 -1175
4495 -1175 -1729 140 1298 885 -278 -921 -2135 407 620 2769 994 -471 -1287 -509 655 1023 505
4512 505 -1806 -701 -1406 1133 945 998 -518 -2351 489 470 1849 516 -1297 -1528 -570 608 1164
4529 1164 653 -1538 -1365 -1029 1927 1090 -129 -396 -1122 -724 1251 1994 755 -1331 -1374 -842 566 1744
4547 1744 -12 -979 -2089 -1472 860 1031 861 -234 -1804 -471 737 1178 252 -765 -1580 -177 1910
4564 1910 1291 504 -1118 -1719 -854 1023 1021 893 -614 -1666 211 1298 1595 729 -959 -1587 -321 1268
4582 1268 689 1011 -914 -1952 -1204 1276 2397 1356 -1525 -1596 -480 907 1920 262 -1433 -823
4598 -823 259 202 1250 695 -1164 -1245 -1092 683 1269 691 -102 -1126 -931 874 418 391 -1454 -1064 -920
4617 -920 866 1059 591 57 -1641 -426 699 1314 1192 -1047 -1520 -916 268 1758 289 -152 -1329
4634 -1329 145 1376 1220 371 -1327 -1938 -1715 388 1599 -13 -583 -773 -505 1005 1831 475 -856
4651 -856 -1041 -585 478 1514 919 -533 -1519 -240 447 1502 158 -1581 -1170 -872 210 1483 713
4668 713 -540 -1026 -579 1658 1764 475 -695 -987 -254 1388 1925 745 -443 -246 493 103 1585
4685 1585 1093 -1295 -850 -828 567 2012 385 -940 -925 -1371 772 714 1369 -919 -1143 -624 -201 1203
4703 1203 -799 -692 -1549 -525 597 636 368 -551 -674 -426 837 487 1084 -956 -1349 88 976 1521
4721 1521 -54 -1408 -776 -81 802 1806 691 -888 -1579 -526 471 1879 131 -1369 -1067 -435 1067
4738 1067 1236 598 -1025 -1070 -982 76 1544 888 -1183 -709 35 22 662 912 -1237 -1018 -1070 906 1237
4757 1237 526 -300 -1215 67 174 652 79 -405 -746 -454 1706 1339 -108 -230 -216 -1114 1170 1341 105
4776 105 -436 -478 -1375 793 1512 624 -897 -1298 110 1312 722 -731 -266 -229 -385 486 1237 1067 -973
4795 -973 -867 -619 888 1026 620 243 -680 -864 133 844 147 -604 -940 -418 537 1252 -81 -1023 -1047 -486
4815 -486 -12 1081 691 -917 -761 -81 678 1317 508 -941 -995 154 869 2130 19 -209 -595 -376
4833 -376 1525 1083 -121 -492 -2011 -137 851 338 493 -824 -460 -1166 760 176 997 -619 -951 -143
4851 -143 730 1101 865 -430 -685 -79 250 1180 -173 -750 -921 138 193 717 334 -1102 -1210 -80 1204
4870 1204 1147 478 -2131 153 -681 1411 880 -629 -719 -898 -360 907 1425 68 -1093 -1524 174 684
4888 684 533 297 -813 -1636 -307 1122 965 -287 -1582 -1082 -123 1396 30 207 331 -1085 349
4905 349 622 760 -213 -59 -753 -414 939 1445 1480 -858 -664 -734 466 330 -591 -350 -636 -548 407 787
4925 787 -239 -1365 -1711 -898 261 980 -307 -673 67 -835 970 -57 -615 -967 -391 -796 413 553
4943 553 360 -793 189 52 -68 1025 126 -48 -24 -878 1059 1268 -251 -636 -1116 -484 571 -123 448
4962 448 -1071 -1023 855 1315 706 413 -834 -829 -160 -563 1159 19 -746 -1112 -469 992 1483 617 -1218
4981 -1218 -1085 -142 -68 912 -250 121 -613 247 504 780 926 -658 -539 500 994 1058 557 -925 -699
5000 -699 130 963 680 554 -297 -530 -708 1301 541 441 -1008 -816 -602 1077 1131 252 -798 -723 -21
5019 -21 507 876 -94 -827 -718 -373 332 302 -322 -755 -1246 123 958 1024 -148 -439 -1177 102 540 1132
5039 1132 553 -29 -517 -293 355 919 -328 -1290 -741 -379 483 -120 -566 -720 -798 558 1202 739 -691
5058 -691 -904 -760 262 481 288 675 -415 -1359 -316 752 243 -607 -1127 -566 541 694 951 -7
5076 -7 -716 -1224 92 572 1109 832 -542 -71 -331 218 1131 142 -619 135 -586 1052 78 20 -1274 -1494
5096 -1494 -181 283 363 748 -479 -575 -421 929 891 -230 -728 -30 -101 956 646 428 -1407 -966 432
5115 432 270 1068 271 -110 -947 59 -38 772 605 60 -213 143 1955 1105 -319 -256 -223 -265 337 1097
5135 1097 24 -785 -32 607 411 718 58 -782 -1523 244 -135 1011 -9 -806 388 96 353 913
5153 913 -363 -315 88 175 -80 -200 304 -9 -405 -456 1002 1158 -250 -737 -92 375 589 745 477 -151
5173 -151 -718 413 1154 309 544 -774 125 -214 1398 884 -591 73 541 1204 304 893 386 -1024
5191 -1024 -1085 -238 598 653 -450 -1459 -939 -1023 516 472 -770 -198 168 901 931 509 -42 -730 -785 -350
5211 -350 283 789 446 -722 131 451 296 1035 -548 -532 -698 -526 928 257 -348 -573 -911 -301 285
5230 285 1078 420 -677 73 -475 843 1849 715 -190 -580 -366 953 90 -19 250 -1037 373 559
5248 559 699 638 -1012 -676 79 842 1122 128 -858 -945 -174 717 429 -77 -568 -787 172 297 744 392
5268 392 -173 -376 168 900 258 519 -1373 -278 531 1221 -187 669 -582 63 329 718 1269 -568
5286 -568 -982 378 -479 -42 329 -173 -909 -925 -608 340 -18 -402 -846 -945 -752 -186 -387 -630 14 398
5306 398 164 962 1174 -242 -1306 -725 726 789 491 -88 -889 -1399 -353 729 706 -1458 376 -289
5324 -289 357 953 123 -597 -798 532 392 551 1116 -68 -1116 -408 108 1269 515 545 -522 -834 344
5343 344 1222 1149 -122 -875 -702 649 447 616 45 -1295 -871 1400 684 1297 -139 -1435 295 248
5361 248 286 351 -811 -400 -573 -210 1111 287 -393 -596 -681 166 768 351 -90 -1954 246 -12 442 54
5381 54 135 -943 -924 -373 433 -41 137 -1212 -598 425 415 811 -790 -699 -1273 990 655 295 225 -269
5401 -269 -468 -400 221 -199 -321 -253 464 457 260 174 -490 -300 -1061 -253 394 -472 -475 -730 0 -126 967 113
5423 113 -256 -1125 -46 234 662 120 38 167 -907 551 566 838 -264 -777 -1424 961 230 225 302 -533
5443 -533 -495 -41 781 218 -1 -682 152 202 -463 234 464 -448 -556 582 489 -97 -239 -302 124 -390 1702
5464 1702 655 164 132 -304 564 325 139 112 -591 -624 162 53 -482 378 238 264 313 700 298 278 -1173
5485 -1173 -677 1154 503 283 260 -478 -514 279 144 -102 -276 -276 -413 -155 950 722 438 74 -185 365
5505 365 1180 -79 555 -59 -158 -176 825 -370 -536 507 -188 124 -61 539 -726 -1020 -351 -149 979
5524 979 -176 -9 -1449 -53 -67 403 645 -543 -1332 139 44 553 784 -649 -252 -753 662 1667
5542 1667 62 99 -417 436 162 327 -356 -70 -696 -286 280 675 77 -180 73 692 665 -108 127 237
5562 237 24 -418 1331 35 -104 -197 -595 -229 842 1079 195 -580 -857 -513 230 -95 64 118 336 -614
5582 -614 -242 -514 152 -3 -880 507 983 195 -201 -675 -146 -434 -731 333 551 -187 -504 -1232 12
5601 12 1589 505 -693 -686 -75 181 1401 317 500 -300 -1274 -74 664 -354 -366 -895 -507 -239 415
5620 415 763 -732 -124 -433 504 1203 516 336 -643 567 -356 727 1348 375 72 463 763 -395 -216
5639 -216 -707 -404 84 -294 461 81 -384 -813 -674 -55 399 1381 -702 -570 -173 -234 408 -1365 -462 550
5659 550 -811 -377 660 668 486 -606 -369 113 116 1190 123 -525 -982 142 270 165 -267 -820 402
5678 402 -443 1200 -535 317 -198 -280 1416 647 358 -397 -618 -350 320 1065 1219 -548 -996 -541 261
5697 261 1459 749 -337 -893 -349 34 187 700 195 -1197 177 76 1228 340 37 -367 -431 530 859
5716 859 -23 -820 -310 -789 582 400 755 -929 -551 -399 -156 795 684 -920 -987 -79 747 1295 637
5735 637 -410 -1606 -53 334 -392 531 30 -173 155 -44 1544 393 -186 -571 -235 533 150 595
5753 595 -353 109 186 -337 113 220 840 -439 -738 1171 326 273 94 -885 -995 -465 368 377 -805 166
5773 166 150 -247 346 206 -121 -1215 -260 110 -357 -238 -880 -307 492 507 354 -682 -263 -375 -648 342
5793 342 -416 296 -144 190 71 372 501 790 271 -784 -1137 45 879 147 -130 -413 148 -77 813
5812 813 481 -161 -1297 -182 143 -92 912 504 257 -505 72 951 445 -55 -150 319 793 33 278
5831 278 -1051 -515 1122 945 264 -135 -34 252 -781 275 271 664 -236 -1060 551 549 1612 -398 -987
5850 -987 835 -875 72 703 84 -580 -94 -710 597 -162 -615 115 608 201 242 1141 280 -637 102
5869 102 321 377 676 -392 -483 -570 339 713 -74 37 -523 78 -678 -250 420 22 -439 -526 -413 5 -492
5890 -492 86 -431 -1134 276 1147 745 89 -272 -865 -492 125 825 296 -64 -565 -1305 375 187 90 -261
5910 -261 -92 -949 646 -57 304 -64 -499 15 299 759 -541 -128 -531 141 -738 1032 338 -732 -558
5929 -558 -170 487 587 513 -268 -472 -392 110 434 312 -1590 -593 -114 672 248 289 -566 -712 325 1362
5949 1362 528 129 -569 -909 -131 113 844 77 -307 -248 -333 680 354 -1065 -1079 -850 31 525 779 1112
5969 1112 -355 -278 109 284 881 202 0 -1186 -168 -125 366 -41 225 131 -251 67 300 -89 -534 -1021
5989 -1021 -356 295 742 -532 877 86 -1527 70 -573 92 -306 -561 633 514 -92 1057 -469
6006 -469 -942 533 399 866 813 -110 -200 306 -1 603 37 -537 -69 -134 310 350 134 -831 -1455 -709 305
6027 305 203 -35 -705 -649 -470 -284 692 -489 13 -1086 745 97 867 -93 -567 -1078 45 387 -297
6046 -297 434 552 -496 -516 1691 30 -283 -458 -68 -700 831 475 -223 18 -591 163 831 576 64
6065 64 -617 -719 -198 687 -442 205 -759 -541 -289 352 -166 1051 806 40 -446 150 -60 -38 -384 -551
6085 -551 -366 80 924 488 -411 -974 277 -262 732 481 106 337 -1100 -157 501 449 -208 -490 -284 508
6105 508 1108 -852 -358 404 -122 302 185 -1311 -158 -197 88 771 706 -173 -1180 -150 457 455 242 333
6125 333 262 -720 -384 -414 -381 1223 176 -935 -374 689 208 976 -433 -488 -93 525 742 28 405 174
6145 174 -70 365 955 -96 -451 -374 -496 134 6 128 207 -420 29 371 -345 921 174 -1182 -101
6164 -101 1277 380 1280 -1079 -771 -460 999 472 -360 -389 -1039 164 942 301 -109 -174 -1383 127 -110
6183 -110 1278 -50 -799 -606 384 547 345 536 -874 -707 -546 347 -467 -445 478 445 -472 -71 -485 373
6203 373 -358 -1124 -886 378 763 -324 -9 -486 -71 358 169 330 -337 54 14 -656 -370 -423 588 -669
6223 -669 -1110 204 1376 -149 -600 555 -397 934 586 -176 -365 -1763 272 -50 -563 -516 27 216
6241 216 48 -214 686 563 -88 -891 -482 620 545 509 -35 -539 -393 -93 384 221 503 -184 -542 107
6261 107 19 -705 -404 -748 -17 -562 469 184 23 -304 218 -55 1341 834 -537 40 -663 179 -84
6280 -84 -393 -185 102 -458 68 820 194 -1026 -1026 -41 550 1177 -227 63 -569 -1229 520 270 446 -716
6300 -716 -458 290 220 -72 -104 -261 -357 155 756 765 -55 -358 475 -344 400 229 -178 -322 -707 230 -195 261
6322 261 1074 -91 -770 -488 764 538 769 -338 -45 -453 880 133 331 -126 -280 397 -47 8 -86
6341 -86 454 -151 -572 124 -97 -630 -97 -925 -491 51 423 -155 -279 -96 114 -29 869 316 -1169 -652
6361 -652 301 137 568 25 -621 -344 -900 209 894 -4 -211 880 514 -9 375 -442 -827 -444 -388 -303
6381 -303 559 321 -381 -123 408 781 120 436 172 -912 -141 198 110 738 841 168 -360 299 -113 302
6401 302 -592 -437 131 -11 337 -150 -419 -75 389 277 122 689 -797 -310 -441 129 217 -374 334 -574
6421 -574 95 49 1191 494 -63 226 -617 -509 450 -10 -506 -275 -597 -674 696 912 -600 -672 -1219 -726
6441 -726 -363 -265 -10 38 -786 632 405 727 382 -629 152 -584 272 -460 -309 143 1002 799 944 970
6461 970 -851 -494 -124 195 -198 550 -712 -295 -377 884 -123 -148 -282 -120 -478 120 1030 -645 -110
6480 -110 794 -6 512 -129 -146 -596 -541 -185 40 871 130 521 -382 -401 -528 -4 -341 56 -194 -424 67
6501 67 533 -598 -354 -749 -384 -964 381 -240 109 586 -1103 -756 1464 1139 -442 -783 205 299 -202
6520 -202 -368 -400 -657 -22 329 165 -156 -449 -425 -303 105 -5 -822 654 -231 -673 -359 1017 26 -528
6540 -528 -78 39 192 -119 -337 -1180 -735 -811 106 207 -472 97 -849 -536 508 320 292 -952 -713 449
6560 449 389 709 166 114 -832 216 641 -751 218 284 -893 300 962 570 262 -359 -1177 4 390
6579 390 176 -110 -300 277 -234 1143 -564 140 430 -367 15 -279 77 202 -91 -567 537 -364 -256
6598 -256 613 102 -21 -159 175 1376 521 163 -186 304 225 727 -377 -98 -335 -704 173 -159 53 94
6618 94 -498 650 793 170 640 -1264 -217 -301 597 -43 -588 -1315 249 -546 388 216 70 40 157 76
6638 76 -54 -92 -155 -1888 -162 507 501 -391 758 -850 -175 -244 231 1205 -489 -151 139 -1151 -235 -78
6658 -78 -384 -292 -127 -626 747 695 502 -400 171 71 169 -1383 305 -716 5 378 -528 125 1224 183
6678 183 -48 425 192 493 -131 -745 -270 -381 220 -252 647 124 159 868 848 282 703 -557 -222 249
6698 249 720 -362 44 -120 186 382 374 443 126 -58 -342 312 652 312 181 -629 -584 -143 -761 814 48
6719 48 -388 -90 345 380 -319 221 -519 493 -66 583 -342 -207 41 -347 -711 862 -325 -253 -159 -161 308
6740 308 29 -338 -362 249 -189 -618 119 -107 -328 3 -31 -2 283 -611 716 26 213 -228 647 -484
6760 -484 -966 -295 -319 -68 1329 418 24 -242 -138 -174 -488 733 -71 -55 -618 266 981 549 437 -650
6780 -650 -279 -126 -146 1043 20 -761 -37 -122 356 542 -907 -106 -790 -1022 458 -219 267 449 -766
6799 -766 -306 23 160 -843 -764 -113 404 617 816 -95 607 88 -90 153 820 105 300 -340 -562 -379
6819 -379 606 59 -616 -46 968 349 283 -41 -140 -810 -217 1023 86 25 -972 -889 -290 124 129 544 248
6840 248 -370 -87 811 585 -300 -236 -55 169 -78 -43 565 -1361 -1285 -325 210 397 392 -446 -56 -395 -87
6861 -87 210 -101 51 -672 -165 -203 178 78 -857 -476 953 1154 576 249 -805 554 -349 -589 -443 -239
6881 -239 -811 -453 -284 -94 329 -287 139 -368 993 689 282 -391 795 395 -74 86 555 -737 -872
6900 -872 -286 -146 -668 -4 605 -283 -224 -126 -144 352 281 -611 -612 -519 -252 116 0 -378 -331 139 615 68 -656
6923 -656 -54 213 -518 860 -796 -126 749 -656 172 -499 648 -202 -60 -115 468 673 669 -1348 -257
6942 -257 467 -282 -170 788 -374 -172 -538 -402 381 -995 316 -308 -846 78 495 -362 526 -361 -493
6961 -493 -388 128 336 -564 -222 -1121 -264 272 -47 -355 -1562 197 989 976 842 71 -14 627 -414 -936
6981 -936 208 -225 -758 -402 285 -758 -38 400 -538 237 156 388 -357 268 -396 -507 -262 -475 431 406
7001 406 505 -893 153 534 702 -408 396 -293 -311 544 279 33 -328 -339 66 565 916 -314 370 49
7021 49 503 -448 -525 167 -556 -875 -575 504 153 -53 -513 -390 360 -606 -700 260 -153 -1325 -696 971
7041 971 -299 -95 -368 -517 -320 1395 -137 -194 895 -487 449 301 455 713 -970 -1124 -324 379
7059 379 -170 -431 -1357 -546 -347 489 709 627 161 -528 -8 -513 -20 347 484 -55 -1302 712 1621 258
7079 258 438 -128 -280 484 -287 55 -969 -150 179 -259 -418 -1002 -246 -1298 439 89 77 1140 -19
7098 -19 -45 709 934 -425 408 -82 629 -478 -254 -775 115 316 -1206 232 376 308 -491 -249 339 -103
7118 -103 237 -762 -506 -459 245 10 157 -32 242 11 -81 367 244 6 -211 345 -318 -328 741 -833
7138 -833 -12 -380 -1107 194 314 1484 -550 -40 -388 -176 16 303 44 -393 -514 643 -410 573
7156 573 853 -485 173 543 100 419 -1025 -345 -62 -178 550 128 574 -954 -299 382 549 190 1151
7175 1151 -252 -253 -238 8 -267 734 17 -351 52 712 -468 -838 -82 -402 263 736 213 -1699 -300
7194 -300 -311 -505 93 -133 -335 -148 -3 120 630 165 -241 535 -112 -252 113 5 -644 57 481 605
7214 605 178 269 427 -776 338 316 893 431 -614 21 -396 -560 764 558 -571 54 389 -120 939
7233 939 355 192 -398 190 -295 205 1111 137 163 21 414 -262 441 131 269 -336 33 -183 -618 486
7253 486 -1421 -804 327 257 -398 -105 -244 -351 -476 -341 329 31 -556 167 210 -253 276 -290 -175 -169 -276
7274 -276 680 297 -327 -1052 -680 -257 523 714 777 -818 111 120 1012 961 -152 -485 229 839 104 601 70
7295 70 -66 537 410 28 -332 -449 -110 -353 -666 234 -164 -522 -426 790 14 411 149 249 101 -616
7315 -616 412 -953 395 -614 -538 545 -731 -365 621 -139 -563 -269 -90 -280 -181 -788 -761 -846 800
7334 800 209 502 162 -996 193 213 92 1591 52 -1130 -236 -106 1150 39 -413 287 203 146 -185
7353 -185 156 6 -856 392 -183 -50 520 63 57 -291 -36 347 -415 77 111 -30 664 328 240 -315 -50
7374 -50 607 -249 636 681 67 -1166 433 228 -340 316 1009 106 303 230 117 -103 -736 -805 -788 407 721
7395 721 55 -425 262 -1344 -392 800 555 -386 -117 305 -196 1341 108 -157 -639 -199 301 1190 60
7414 60 -725 -353 509 432 253 611 -469 -759 349 740 108 -415 -512 -257 271 -466 285 -266 521 583 -730
$$ [...]
8191E80
##END NTUPLES=NMR FID
##END=
