##TITLE=1H_SA_59.233
 DMSO-d6, 108 sc, 
 2.9.2020
##JCAMPDX= 6.0         $$ Bruker NMR JCAMP-DX V2.0
##DATA TYPE= NMR FID
##DATA CLASS= NTUPLES
##ORIGIN= UXNMR, Bruker Analytische Messtechnik GmbH
##OWNER= root
$$ XWIN-NMR		Version 3.5
$$ Wed Sep  2 08:49:17 2020 Russian Standard Time (UT+4h)  she@DPX200
##.OBSERVE FREQUENCY= 200.1315066352
##.OBSERVE NUCLEUS= ^1H
##.DELAY= (6, 6)
##.ACQUISITION MODE= SIMULTANEOUS
##.ACQUISITION SCHEME= undefined
##.AVERAGES= 108
##.DIGITISER RES= 18
##SPECTROMETER/DATA SYSTEM= spect
##.PULSE SEQUENCE= zg30
##.SOLVENT NAME= DMSO
##.SHIFT REFERENCE= (INTERNAL, DMSO, 0, 15.7039)
##AUDIT TRAIL= $$ (NUMBER, WHEN, WHO, WHERE, WHAT)
$$ ##TITLE= Audit trail, XWIN-NMR		Version 3.5
$$ ##JCAMPDX= 5.01
$$ ##ORIGIN= Bruker BioSpin GmbH
$$ ##OWNER= she
$$ F:/spectra/data/she/nmr/H-F/1/audita.txt
$$ ##AUDIT TRAIL=  $$ (NUMBER, WHEN, WHO, WHERE, WHAT)
(   1,<2020-09-02 08:45:56.82 +0400>,<she>,<DPX200>,
      <continue with go, POWCHK disabled, PULCHK disabled
       configuration hash MD5:
       00 E9 B6 7A A2 85 ED C7 34 08 36 98 17 FE 4E 26
       data hash MD5: 16K
       AD 68 F1 03 1E 0D 6E 92 A2 73 1C B8 C1 BA 19 82>)
$$ ##END=
$$ 
$$ hash MD5
$$ 6B D1 94 00 8E 65 02 39 83 EB 9E CE 9E 08 26 77
##$RELAX= 
##$RELAX= 
##$RELAX= 
##$RELAX= 
##$RELAX= 
##$RELAX= 
$$ Bruker specific parameters
$$ --------------------------
##$DU= <F:/spectra>
##$EXPNO= 1
##$NAME= <H-F>
##$PROCNO= 1
##$TYPE= <nmr>
##$USER= <she>
##$AMP= (0..31)
100 100 100 100 100 100 100 100 100 100 100 100 100 100 100 100 100 100 
100 100 100 100 100 100 100 100 100 100 100 100 100 100 
##$AQSEQ= 0
##$AQ_mod= 1
##$AUNM= <au_zg>
##$AUTOPOS= <>
##$BF1= 200.13
##$BF2= 200.13
##$BF3= 200.13
##$BF4= 200.13
##$BF5= 200.13
##$BF6= 200.13
##$BF7= 200.13
##$BF8= 200.13
##$BYTORDA= 1
##$CFDGTYP= 0
##$CFRGTYP= 5
##$CHEMSTR= <none>
##$CNST= (0..31)
1 1 145 1 1 1 1 1 1 1 1 1 1 1 1 1 1 1 1 1 1 1 1 1 1 1 1 1 1 1 1 1 
##$CPDPRG= <>
##$CPDPRG1= <>
##$CPDPRG2= <>
##$CPDPRG3= <>
##$CPDPRG4= <mlev>
##$CPDPRG5= <mlev>
##$CPDPRG6= <mlev>
##$CPDPRG7= <mlev>
##$CPDPRG8= <mlev>
##$CPDPRGB= <>
##$CPDPRGT= <>
##$D= (0..31)
0 1.2 0 0 0 0 0 0 0 0.06 0 0.03 0 0 0 0 0.0002 0 0 0 0 0 0 0 0 0 0 0 0 
0 0 0 
##$DATE= 1599021555
##$DBL= (0..7)
120 120 120 120 120 120 120 120 
##$DBP= (0..7)
150 150 150 150 150 150 150 150 
##$DBP07= 0
##$DBPNAM0= <>
##$DBPNAM1= <>
##$DBPNAM2= <>
##$DBPNAM3= <>
##$DBPNAM4= <>
##$DBPNAM5= <>
##$DBPNAM6= <>
##$DBPNAM7= <>
##$DBPOAL= (0..7)
0.5 0.5 0.5 0.5 0.5 0.5 0.5 0.5 
##$DBPOFFS= (0..7)
0 0 0 0 0 0 0 0 
##$DE= 6
##$DECBNUC= <off>
##$DECIM= 32
##$DECNUC= <off>
##$DECSTAT= 4
##$DIGMOD= 1
##$DIGTYP= 9
##$DL= (0..7)
0 120 120 120 120 120 120 120 
##$DP= (0..7)
150 150 150 150 150 150 150 150 
##$DP07= 0
##$DPNAME0= <>
##$DPNAME1= <>
##$DPNAME2= <>
##$DPNAME3= <>
##$DPNAME4= <>
##$DPNAME5= <>
##$DPNAME6= <>
##$DPNAME7= <>
##$DPOAL= (0..7)
0.5 0.5 0.5 0.5 0.5 0.5 0.5 0.5 
##$DPOFFS= (0..7)
0 0 0 0 0 0 0 0 
##$DQDMODE= 0
##$DR= 18
##$DS= 0
$$ [...]
##$SUBNAM2= <"">
##$SUBNAM3= <"">
##$SUBNAM4= <"">
##$SUBNAM5= <"">
##$SUBNAM6= <"">
##$SUBNAM7= <"">
##$SUBNAM8= <"">
##$SUBNAM9= <"">
##$SW= 16.880792210976
##$SWIBOX= (0..15)
0 0 2 0 0 0 0 0 0 0 0 0 0 0 0 0 
##$SW_h= 3378.37837837838
##$TD= 16384
##$TD0= 1
##$TE= 0
##$TE2= 300
##$TE3= 300
##$TEG= 300
##$TL= (0..7)
0 120 120 120 120 120 120 120 
##$TP= (0..7)
150 150 150 150 150 150 150 150 
##$TP07= 0
##$TPNAME0= <>
##$TPNAME1= <>
##$TPNAME2= <>
##$TPNAME3= <>
##$TPNAME4= <>
##$TPNAME5= <>
##$TPNAME6= <>
##$TPNAME7= <>
##$TPOAL= (0..7)
0.5 0.5 0.5 0.5 0.5 0.5 0.5 0.5 
##$TPOFFS= (0..7)
0 0 0 0 0 0 0 0 
##$TUNHIN= 0
##$TUNHOUT= 0
##$TUNXOUT= 0
##$USERA1= <user>
##$USERA2= <user>
##$USERA3= <user>
##$USERA4= <user>
##$USERA5= <user>
##$V9= 5
##$VALIST= <valist>
##$VCLIST= <CCCCCCCCCCCCCCC>
##$VD= 0
##$VDLIST= <DDDDDDDDDDDDDDD>
##$VPLIST= <PPPPPPPPPPPPPPP>
##$VTLIST= <TTTTTTTTTTTTTTT>
##$WBST= 1024
##$WBSW= 4
##$XGAIN= (0..3)
0 0 0 0 
##$XL= 0
##$YL= 0
##$YMAX_a= 705366
##$YMIN_a= -764679
##$ZGOPTNS= <>
##$ZL1= 120
##$ZL2= 120
##$ZL3= 120
##$ZL4= 120
##$ABSF1= 10
##$ABSF2= 0
##$ABSG= 5
##$ABSL= 3
##$ALPHA= 0
##$AQORDER= 0
##$ASSFAC= 0
##$ASSFACI= 0
##$ASSFACX= 0
##$ASSWID= 0
##$AUNMP= <proc_1d>
##$AZFE= 0.1
##$AZFW= 0.1
##$BCFW= 1
##$BC_mod= 2
##$BYTORDP= 1
##$COROFFS= 0
##$CY= 11.3945322036743
##$DATMOD= 1
##$DC= 2
##$DFILT= <>
##$DTYPP= 0
##$F1P= 16.9975609425685
##$F2P= -3.02152046262296
##$FCOR= 0.5
##$FTSIZE= 0
##$FT_mod= 4
##$GAMMA= 1
##$GB= 0.15
##$INTBC= 1
##$INTSCL= 1
##$ISEN= 128
##$LB= 0.24
##$LEV0= 0
##$LPBIN= 0
##$MAXI= 10000
##$MC2= 0
##$MEAN= 0
##$ME_mod= 0
##$MI= 1.114404
##$NCOEF= 0
##$NC_proc= 0
##$NLEV= 6
##$NOISF1= 3.799351
##$NOISF2= 2.8
##$NSP= 1
##$NTH_PI= 0
##$NZP= 0
##$OFFSET= 15.70392
##$PC= 1
##$PHC0= -9969.722
##$PHC1= 3.600903
##$PH_mod= 1
##$PKNL= yes
##$PPARMOD= 0
##$PSCAL= 0
##$PSIGN= 0
##$REVERSE= no
##$SF= 200.130013532006
##$SI= 16384
##$SIGF1= 3
##$SIGF2= 2
##$SINO= 400
##$SIOLD= 16384
##$SREGLST= <1H.CDCl3>
##$SSB= 0
##$STSI= 0
##$STSR= 0
##$SW_p= 3612.71676300578
##$SYMM= 0
##$S_DEV= 0
##$TDeff= 0
##$TDoff= 0
##$TI= <>
##$TILT= no
##$TM1= 0
##$TM2= 0
##$TOPLEV= 0
##$USERP1= <user>
##$USERP2= <user>
##$USERP3= <user>
##$USERP4= <user>
##$USERP5= <user>
##$WDW= 1
##$XDIM= 8192
##$YMAX_p= 0
##$YMIN_p= 0
$$ End of Bruker specific parameters
$$ ---------------------------------
##NTUPLES= NMR FID
##VAR_NAME=  TIME,          FID/REAL,        FID/IMAG
##SYMBOL=    X,             R,               I
##VAR_TYPE=  INDEPENDENT,   DEPENDENT,       DEPENDENT
##VAR_FORM=  AFFN,          ASDF,            ASDF
##VAR_DIM=   8192,          8192,            8192
##UNITS=     SECONDS,       ARBITRARY UNITS, ARBITRARY UNITS
##FACTOR=    0.000296,      1,               1
##FIRST=     0,             0,               0
##LAST=      2.424536,      0,               0
##MIN=       0,             -764679,         0
##MAX=       2.424536,      705366,          0
$$ Real data points
##PAGE= N=1
##DATA TABLE= (X++(R..R)), XYDATA
$$ [...]
$$ plain form
2624 -164 222 -385 502 434 -107 -71 141 346 15 191 -120 -386 -833 664 630 273 -18 208 494 -657
2644 -657 -76 528 554 68 396 -664 -270 434 396 19 31 -71 -176 226 195 581 -93 225 -176 -731 138
2665 138 394 142 89 1407 175 -646 522 665 191 -587 -301 -106 489 26 -142 -434 -424 -74 -449 -172
2685 -172 684 -261 366 300 291 -1123 740 -546 -437 200 -372 115 -432 695 -217 -306 365 711 283 370
2705 370 276 -982 39 647 -355 -565 645 -443 244 -313 538 246 -250 -617 105 -417 644 102
2723 102 385 82 549 -744 14 485 -949 -262 86 -305 -114 428 630 1035 252 -284 -225 -758 140 -127
2743 -127 -156 -227 1757 -5 -87 -649 750 366 -607 209 359 334 160 194 -179 -1102 1102 -905 -52 -433
2763 -433 -1189 -96 13 -452 136 190 -365 -149 -895 129 394 -547 -68 129 356 -853 841 -579 -364
$$ packed form
2624a64L86o07Q87o8n41L6K12K05l31J76l11k66m47J497l4l57k91K26K86j151
2644f57N81O04K6m86L28j060L94P04l8l77J2j02j05M02l1L86o74L18m01n55Q69
2665A38K56k52n3J318j232q21J168J43m74p78K86J95N95m63j68k92J0L50l75K77
2685a72Q56r45O27o6rj414J863j286J09O37n72M87n47J127r12q9O71L46m28Q7
2705C70r4j258J021O08j002k10J210j088O87n57Q51k92m96l67P22n22J061n42
2723A02K83l03M67j293P58M71j434O87L48l91J91N42K02M05p83n36N9n33Q98k67
2743a27k9p1J984j762q2n62J399l84r73Q16J50k5j74L4l73r23K204k007Q53l81
2763d33p56J093J09m65N88N4n55K16p46J024K65r41M79J97K27j209J694j420K15
$$ plain form
2782 -364 227 -820 303 348 1083 -192 -342 -516 442 -138 -325 -456 216 -46 85 430 83 -317 0
2801 0 20 351 195 -664 478 1072 -799 -244 -530 -196 -568 174 165 49 501 -35 228 -504 -115 417 -427
2822 -427 236 47 48 -82 -22 -236 -497 -18 131 223 998 510 -1169 -107 338 112 50 -100 -504 61 -211
2843 -211 -364 -512 -1104 125 -733 93 146 151 577 150 53 491 80 -213 -111 -111 -245 -768 -418 -268 809
2864 809 -403 -670 -32 426 -506 263 -187 277 238 474 815 120 343 566 510 -657 -44 -1077 -434 807
2884 807 -754 -656 -998 -130 -20 -68 -693 225 193 319 332 -584 -87 -438 824 383 -582 -10 189 867 261
2905 261 436 -37 22 222 56 758 43 -55 -508 934 -1054 -717 88 648 191 225 701 -51 352 -617
2925 -617 -447 2 350 -180 -474 -188 -436 9 13 -282 -542 -278 301 -283 -68 -255 -48 386 495 834 421
$$ packed form
2782c64N91j047J123M5P35j275j50j74R58n80j87j31O72k62J31L45l47m00L17
2801@K0L31j56q59J142N94j871N55k86L34l72P42rj16M52n36K63p32L89N32q44
2822d27O63j89Jj30O0k14k61M79J49R2P75m88j679J062M45k26o2j50m04N65k72
2843b11j53j48n92J229q58Q26N3NM26m27r7M38m11k93J02%j34n23L50J50J077
2864H09j212k67O38M58r32P69m50M64l9K36L41o95K23K23n6j167O13j033O43J241
2884H07j561R8l42Q68J10m8o25R18l2J26J3r16M97l51J262m41r65N72J99O78o06
2905B61J75m73N9K00j66P02p15r8m53J442j988L37Q05N60m57L4M76p52M03r69
2925f17J70M49L48n30k94K86k48M45Mk95k60K64N79n84K15j87K07M34J09L39m13
$$ plain form
2946 421 -871 3 1071 45 443 -575 -3 -151 496 -13 392 -387 337 253 135 234 -353 -323 -8 -45
2966 -45 -478 -766 314 -627 -118 465 -204 481 62 195 439 220 392 -68 195 385 -425 -65 -221 -548
2986 -548 202 -136 799 -777 150 -285 -626 992 -188 -717 -271 -186 -810 -340 -761 -283 -31 -312 156
3005 156 -229 -476 -377 880 821 -63 498 217 -188 -114 241 -20 28 -359 355 577 134 256 332 869 -51
3026 -51 -173 -330 -588 -397 -142 723 -726 -240 -426 -412 -926 174 1084 -536 478 -171 935 -673 340
3045 340 182 -345 274 34 -234 -970 -499 719 20 771 519 669 -258 -151 -159 -504 -596 214 -1014 931
3065 931 938 654 -167 -407 -391 -348 332 586 81 -750 -724 411 399 426 32 -308 -682 93 -260 -658 -39 -780
3087 -780 710 -543 867 -384 566 48 540 608 -219 -117 -205 623 939 230 384 -239 408 813 84
$$ packed form
2946D21j292Q74J068j026L98j018N72j48O47n09M05p79P24q4j18R9n87L0L15l7
2966d5m33k88J080r41N09N83o69O85m19J33K44k19J72m60K63J90q10L60j56l27
2986e48P50l38R35j576R27m35l41J618j180n29M46Q5o24M70m21M78K52k81M68
3005A56l85k47R9J257n9q84N61k81m05P4L55k61M8l87P14K22m43J22P6N37r20
3026e1j22j57k58J91K55Q65j449M86j86J4n14J100R10j620J014o49J106j608J013
3045C40j58n27O19k40k68p36M71J218o99P51k52J50r27J07ql45r2Q10j228J945
3065I31Pk84q21k40J6M3O80K54n05q31K6J135j2K7l94l40l74P75l53l98O19p41
3087g80J490j253J410j251R50n18M92O8q27J02q8Q28L16p09J54o23O47M05p29
$$ plain form
3106 84 98 -534 -32 255 -278 -1143 549 22 -72 -424 491 -154 -49 65 150 23 -339 300 328 360 349 464
3128 464 -314 166 -1 -176 -647 571 -582 157 25 -2 -101 -150 -809 130 -768 639 -842 -253 717 179
3148 179 -296 -1295 564 -649 -210 458 600 -1066 469 572 -363 -322 649 249 -182 450 434 -987 -263
3167 -263 77 216 -654 319 -268 -757 510 -10 -650 -377 1160 -69 286 290 -120 -684 83 505 -539
3186 -539 160 119 95 -354 -182 223 -738 -89 230 -1552 -392 -115 71 -714 -412 1097 316 137 243 -243
3206 -243 -375 230 118 400 -69 1132 -579 271 -123 211 -417 384 157 -685 714 -170 165 -873 411
3225 411 -173 -510 229 820 -408 380 984 -614 -666 -504 295 -1746 -73 690 -635 -527 163 483 198
3244 198 222 -138 232 182 54 -249 -376 414 594 -895 178 1021 -293 369 1130 -27 764 515 549 -116
$$ packed form
3106H4J4o32N02K87n33q65J692n27r4l52R15o45J05J14Q5j27l62O39K8L2j1J15
3128D64p78M80j67j75m71J218j153P39j32k7r9m9o59R39q98J407j481N89R70n38
3148A79m75r99J859j213M39O68J42j666J535J03r35M1R71m00m31O32j6j421P24
3167b63L40J39q70R73n87m89J267n20o40K73J537j229L55Mm10n64P67M22j044
3186e39O99m1k4m49J72M05r61O49L19j782J160K77J86p85L02J509p81j79J06m86
3206b43j32O05j12K82m69J201j711Q50l94L34o28Q01k27q42J399q84L35j038J284
3225D11n84l37P39N91j228P88O04j598n2J62P99k041J673P63j325J08O90L20k85
3244A98K4l60L70n0j28l03j27P90J80j489J073Q43j314O62P61j157P91k49L4o65
$$ plain form
3264 -116 6 472 -967 557 1033 -173 -205 590 463 -829 224 778 -666 -1071 248 -281 -278 -231 181
3283 181 -457 -215 1355 -668 -219 1195 -128 -611 -265 504 -272 -490 963 806 -1268 265 172 -659
3301 -659 202 711 -116 -463 758 -374 -5 706 606 -1297 -124 1008 -851 -676 630 -92 -902 607
3319 607 1022 -1516 -736 646 -111 -1314 771 835 -1171 -401 -87 -108 -577 1246 -1076 -514 438 210
3337 210 -988 -632 600 -794 -509 469 -215 78 202 629 -364 -211 498 37 -646 1031 756 -1282
3355 -1282 624 194 -65 -741 1130 -357 -714 1189 1126 -1359 -373 609 -650 -659 1778 837 -1786 833
3373 833 482 -991 289 2192 78 -1043 900 934 -1616 985 1013 -490 140 1689 648 -506 1528
3390 1528 228 -675 65 700 -675 -716 230 -72 -427 1277 170 -903 -115 1040 -1637 -329 1156
$$ packed form
3264a16J22M66j439J524M76j206l2P95j27j292J053N54j444m05J319n29LM7M12
3283A81o38K42J570k023M49J414j323m83L46P69p76k18J453j57k074J533r3q31
3301f59Q61N09q27l47J221j132L69P11j00j903J173J132j859J75J306p22q10J509
3319F07M15k538P80J382p57j203K085O4k006P70L14k1m69J823k322N62R52k28
3337B10j198L56J232j394K85R78o84K93J24M27r93J53P09m61o83J677k75k038
3355a282J906m30k59o76J871j487l57J903o3k485R86R82j259rK437r41k623K619
3373H33l51j473J280J903k114j121J943L4k550K601K8j503O30J549j041j154K034
3390A528j300r03P40O35j375m1R46l02l55J704j107j073P88J155k677J308J485
$$ plain form
3407 1156 -111 -1615 563 850 -871 -362 885 -439 -1457 817 470 -832 -70 1182 -71 -132
3423 -132 1437 143 -1425 1007 796 -1016 -518 1248 -385 -1117 791 -872 -1051 401 1638 -511
3439 -511 -1146 965 -501 -1062 1467 768 -1167 1292 962 -563 64 1601 202 -1675 558 574 -871
3456 -871 672 978 26 -1271 2078 -217 -1601 905 655 -1231 -961 1063 178 -1361 777 -255
3472 -255 -1257 140 1772 -945 -365 1286 250 -1097 1105 377 -1069 -568 1289 -1035 -1531 1082
3488 1082 69 -2011 1181 951 -1393 238 1477 -286 -584 1058 1545 -1579 1037 1189 -1927 -21
3504 -21 1144 256 -1776 551 1288 -1629 692 1877 -850 -1400 376 104 -597 1018 1413 -829 74
3521 74 1226 -581 -1400 1066 155 -960 356 602 -923 -491 1875 -496 -1802 565 200 -1866 -277
$$ packed form
3407A156j267j504K178K87j721N09J247j324j018K274l47j302P62J252j253o1
3423a32J569j294j568K432k11j812M98J766j633p32J908j663j79J452J237k149
3439e11o35K111j466n61K529o99j935K459l30j525O27J537j399j877K233J6j445
3456h71J543L06r52j297L349k295j384K506k50j886K70K024q85j539K138j032
3472b55j002J397J632k717N80J651j036j347K202p28j446N01J857k324m96K613
3488A082j013k080L192k30k344J631J239j763k98J642M87l124K616J52l116J906
3504b1J165q88k032K327P37k917K321J185k727n50J776k72p01J615L95k242R03
3521G4J152j807q19K466r11j115J316K46j525M32K366k371j306K367l65k066J589
$$ plain form
3538 -277 889 -1217 -1307 1032 164 -1018 760 1406 -1101 37 1454 -1087 -765 1724 876 -1543 857
3555 857 1120 106 86 1975 -440 -1361 1881 827 -1631 39 1414 -329 -1063 603 454 -1260 1186
3572 1186 1028 -496 -1210 2549 -853 -1474 1667 1158 -679 954 1849 -1539 -152 1180 -68 -1208
3588 -1208 757 269 -1239 114 1333 -944 -920 1482 -763 -1465 941 1421 -1606 -407 1909 -1509
3604 -1509 -1649 950 879 -1457 1034 980 -1908 -722 543 -874 -1013 1556 393 -1890 408 1741
3620 1741 -150 -866 2011 -482 -1246 1293 423 -1338 -339 858 -611 -1252 1182 -137 -726 1582
3636 1582 1631 -812 -166 1361 -442 -1564 1828 -390 -1949 664 1909 -1099 -1061 1820 -215 -1389
3652 -1389 151 939 -1447 -835 1077 -193 -1683 1479 690 -1400 844 1076 -1875 469 2364 -190
$$ packed form
3538b77J166k106r0K339q68j182J778O46k507J138J417k541L22K489q48k419K400
3555H57K63j014k0J889k415r21L242j054k458J670J375j743p34J666j49j714K446
3572A186j58j524p14L759l402o21L141n09j837J633Q95l388J387J332j248j140
3588a208J965m88j508J353J219k277K4K402k245p02K406M80l027J199K316l418
3604a509j40K599p1k336K491n4k888J186J265j417j39K569j163k283K298J333
3620A741j891p16K877k493p64K539q70j761R99J197j469o41K434j319n89K308
3636A582M9k443O46J527j803j122L392k218j559K613J245l008L8K881k035j174
3652a389J540P88k386O12J912j270j490L162p89k090K244K32k951K344J895k554
$$ plain form
3668 -190 -1902 1919 1138 -1676 -168 939 -918 -604 2332 -124 -945 1276 421 -1373 67 1585
3684 1585 -745 -1461 2010 378 -1736 990 1102 -1169 -555 1230 135 -2093 1822 951 -2539 17
3700 17 2097 -919 -897 1451 61 -1209 731 813 -566 -424 747 -950 -1336 810 271 -1373 17
3717 17 1143 -114 -568 982 4 -1249 1748 1107 -1177 353 2011 -105 -832 1970 499 -1460
3733 -1460 942 -32 -895 75 2114 -711 -938 1616 -148 -1203 653 913 -1893 296 1520 -154
3749 -154 -1403 933 382 -1099 -63 921 -688 -441 1302 90 -1524 720 1197 -1054 680 1954
3765 1954 -397 -769 1086 316 -2168 482 1318 -1098 -442 155 -30 -426 1089 827 -1141 -126 2138
3782 2138 -1087 -437 1146 -746 -1235 832 888 -1026 478 782 -1399 -124 662 548 -639 369 1284
$$ packed form
3668a90j712L821p81k814J508J107j857L14K936k456q21K221q55j794J440J518
3684A585k330p16L471j632k114K726J12k271O14J785j095k228L915q71l490K556
3700A7K080l016K2K348j390j270J940Q2j379J42J171j697l86K146n39j644J390
3717A7J126j257m54J550r78j253K997o41k284J530J658k116p27K802j471j959
3733a460K402r74q63R70K039k825k27K554j764j055J856K60k806K189J224j674
3749a54j249K336n51j481J036R84j609K47J743j212j614K244M77k251J734J274
3765A954k351l72J855p70k484K650Q36k416O56N97j85l96J515k62j968J015K264
3782B138l225O50J583j892m89K067N6j914J504L04k181J275P86j14j187J008R15
$$ plain form
3799 1284 -1029 -784 1444 -287 -641 1082 342 -1014 289 1790 -1474 86 1868 -264 -1307 601
3815 601 642 -987 -355 1327 -45 -1556 919 -114 -1159 898 649 -1845 829 1185 -660 -807 628
3832 628 638 -867 -306 953 -1093 -1015 -148 -136 17 -189 1324 -734 247 574 -668 -1262 1562 852 -2150
3851 -2150 1334 606 -1656 -436 1554 -597 -340 1235 693 -535 859 727 -687 -968 1643 -252
3867 -252 -494 882 305 -1194 -275 1471 -601 -564 -68 -18 -105 1191 709 -917 -528 543 -328 -374 628
3886 628 948 -1002 16 1651 -1055 -831 1249 -991 -324 983 571 -680 670 1043 433 -705 569
3903 569 -232 -271 703 710 -1039 -290 840 -1070 -942 1303 233 -552 753 174 -512 -80 284 966 -699
3922 -699 103 886 388 551 -740 -961 -419 98 -377 -1933 605 145 -366 -958 581 -615 -854 586
$$ packed form
3799A284k313K45K228j731l54J723p40j356J303J501l264J560J782k132j043J908
3815F01M1j629O32J682j372j511K475j033j045K057k49k494K674L56j845j47J435
3832F28J0j505N61J259k046P8Q67J2J53k06J513k058R81L27j242n94K824p10l002
3851b150L484p28k262J220J990k151K57J575n42j228J394j32j414k81K611j895
3867b52k42J376n77j499R19J746k072L7M96N0q7J296m82j626L89J071q71m6J002
3886F28L20j950J018J635k706K24K080k240O67J307m12j251J350L73o10j138J274
3903E69q01l9R74Pj749P49J130j910J28K245j070p85J305n79o86M32L64O82j665
3922f99Q02P83m98J63j291k21N42N17m75j556K538m60n11n92J539j196k39J440
$$ plain form
3940 586 -299 -828 230 458 -713 28 -97 -254 237 147 436 -916 -406 1021 -507 -1113 338 333 -599
3959 -599 1177 130 64 -739 2011 -933 -969 1018 -16 -130 244 321 -559 -155 911 222 399 156 190
3978 190 655 -156 553 -130 -495 -80 317 -720 355 -182 -899 598 1164 803 -825 669 655 -443
3996 -443 -778 812 157 -501 550 -323 196 683 -35 -1 -146 171 -562 -982 934 178 77 391 1416
4015 1416 -300 -108 180 459 167 107 -43 -151 -575 392 356 -122 104 335 737 1087 244 -156 507 917
4035 917 -270 250 572 204 -76 558 -151 -397 466 37 11 150 275 416 -57 73 286 -771 252
4054 252 -310 101 -1073 -206 -291 828 -168 -87 -899 -5 94 -298 -58 286 -187 -248 -1049 298 218 -368 448
4075 448 124 -1347 -10 -213 -615 -551 81 -480 335 -9 256 -15 -44 581 -292 -190 454 261 -777 209
$$ packed form
3940E86q85n29J058K28j171P41j25j57M91r0K89j352N10J427j528o06J451nr32
3959e99J776j047o6q03K750k944l6J987j034j14L74P7q80M04J066o89J77k43L4
3978A90M65q11P09o83l65M15L97j037J075n37p17J497N66l61j628J494j4j098
3996d43l35J590o55o58J051q73N19M87p18L4j45L17p33m20J916p56j01L14J025
4015A416j716J92K88K79k92o0j50j08m24R67l6m78K26K31M02L50q43m00O63M10
4035I17j187N20L22l68k80O34p09k46Q63m29k6J39J25J41m73J30K13j057J023
4054B52n62M11j174Q67q5J119r96Q1q12Q94R9l92K40L44m73o1q01J347q0n86Q16
4075D48l24j471J337k03m02O4O32n61Q15l44K65k71k9O25q73J02O44j93j038R86
$$ plain form
4095 209 573 101 -719 967 224 1004 211 287 267 692 -609 744 -51 531 -536 -250 171 348 209
4114 209 -459 486 -296 -96 -246 -567 -536 514 184 -176 29 -367 26 51 547 -42 -532 192 -231 184
4134 184 -193 666 -1023 -197 -103 351 -44 -181 219 223 701 -500 383 -315 -409 80 107 -147 310 330 179
4155 179 -140 67 1 211 -417 126 -506 1035 -525 -899 88 -271 -52 -745 133 -409 129 533 592 -649
4175 -649 379 1 -1090 430 183 -112 -201 412 52 -445 -522 1171 276 -404 -527 -233 288 97 683
4194 683 568 -157 2 -328 68 795 -684 -462 -760 -250 429 -681 -458 -298 -162 926 -656 194 -222
4213 -222 -149 762 117 77 56 -598 92 182 -330 870 -1008 -392 -610 -1010 -386 -714 176 -159 194 -599 356
4234 356 -297 -59 231 -391 577 -513 -273 1006 -1089 1101 -173 -628 997 -1052 -155 -403 -738 499
$$ packed form
4095B09L64m72q20J686p43P80p93P6k0M25j301J353p95N82j067K86M21J77j39
4114B09o68R45p82K00j50l21L1J050l30l60K05l96L93K5M96n89m90P24m23M15
4134A84l77Q59j689Q26R4M54l95j37M00MM78j201Q83o98r4M89K7k54M57K0j51
4155A79l19K07o6K10o28N43o32J541j560l74R87l59K19o93Q78n42N38M04N9j241
4175f49J028l78j091J520k47k95q9O13l60m97p7J693q95o80j23K94N21j91N86
4194F83j15p25J59l30L96P27j479K22k98N10O79j110K23J60J36J088j582Q50m16
4213b22P3R11o45m0k1o54O90R0n12J200j878O16k18m00O24l28Q90l35L53p93R55
4234C56o53K38K90o22R68j090K40J279k095K190j274m55J625k049Q97k48l35J237
$$ plain form
4252 499 -172 469 43 -433 71 -462 -100 344 85 -363 -44 -168 -683 213 -112 -598 -218 278 -792 733
4272 733 -497 -23 818 -122 -702 -418 157 244 -293 -852 324 664 -195 -1177 94 335 920 324 -247
4291 -247 125 1177 960 36 416 228 -98 -326 199 -1040 -214 -169 415 -188 -70 -318 -7 -32 662 -180
4311 -180 -175 863 361 164 366 -252 600 402 -764 1015 -1191 -284 -841 -737 -439 328 70 196 410
4330 410 -193 -520 -738 256 67 -234 -312 -131 188 -262 47 174 87 -1071 -137 894 -501 -505 -20 226
4350 226 -69 -290 -262 753 -879 -405 -197 238 368 -96 -105 417 -259 317 52 575 -119 119 -247 -581
4370 -581 -695 378 -536 -94 111 -404 -428 -412 108 185 -615 -312 79 291 238 11 362 -191 -558 69 334
4391 334 147 45 -671 -400 842 -286 -33 342 999 -164 -271 -802 998 1379 375 -687 -539 114
$$ packed form
4252D99o71O41m26m76N04n33L62M44k59m48L19j24n15Q96l25m86L80M96j070J525
4272G33j230M74Q41r40n80K84N75Q7n37n59J176L40q59r82J271K41N85n96n71
4291b47L72J052k17r24L80j88l26k28N25j239Q26M5N84o03J18k48L11k5O94q42
4311a80NJ038n02j97K02o18Q52j98j166J779k206R07n57J04K98P67k58J26K14
4330D10o03l27k18R94j89l01p8J81L19m50L09J27q7j158R34J031j395mM85K46
4350B26k95k21K8J015j632M74K08M35J30m64rN22o76N76k65N23o94K38l66l34
4370e81j14J073r14M42K05n15k4J6N20P7q00L03L91K12n3k27L51n53l67O27K65
4391C34j87j02p16K71J242j128K53L75O57j163j07n31J800L81j004j062J48O53
$$ plain form
4409 114 1412 53 -447 -232 -427 713 -183 146 -768 91 -246 -664 -305 -321 52 -625 -248 -285 -177 -113
4429 -113 -141 -137 -208 300 135 -331 100 181 614 122 -486 27 -261 46 201 -605 510 -341 -195 531 542 -347
4451 -347 -803 -406 -165 -269 378 283 320 619 -216 15 154 -369 295 446 -478 375 -48 10 148 -361 -208
4472 -208 114 416 -273 76 725 689 -31 694 358 -14 224 -1028 482 108 44 765 -27 -362 -189 428
4492 428 -538 -216 30 -609 -1053 50 101 1070 7 -161 202 -299 -337 590 -466 -128 -278 223 113 -91
4512 -91 377 -249 377 -322 53 -562 -28 -75 946 -160 -96 259 -10 262 245 -349 -193 -9 178 -167 -14
4533 -14 180 -284 -355 116 -915 -316 48 -43 -390 -418 307 252 483 -180 -706 -255 -940 -811 -174 -373 -449 354
4555 354 423 772 -539 -32 -110 -848 -213 -242 356 158 537 -303 -341 -156 304 -115 -56 452 907 -270 1007
$$ packed form
4409A14J298j359n00K15j95J140q96L29r14Q59l37m18L59j6L73o77L77l7J08O4
4429a13k8Mp1N08j65m66M31Q1M33m92o08N13k88L07J55q06J115q51J46P26J1q89
4451c47m56L97K41j04O47r5L7K99q35K31J39n23O64J51r24Q53m23N8J38n09J53
4472b08L22L02o89L49O49l6p20P25l36l72K38j252J510l74o4P21p92l35J73O17
4492D28r66L22K46o39m44J103N1R69j063j68L63n01l8R27j056L38j50N01j10k04
4512i1M68o26O26o99L75o15N34m7J021j106O4L55k69K72j7n94J56J84J87l45J53
4533a4J94m64p1M71j031N99L64r1l47k8P25n5K31o63n26M51o85J29O37j99p6Q03
4555C54O9L49j311N07p8p38O35k9N98j98L79q40l8J85M60m19N9N08M55j177J277
$$ plain form
4576 1007 -246 -151 -86 65 125 -929 -258 247 71 -76 529 273 -345 793 151 739 -304 412 -734
4595 -734 -37 131 -299 502 -341 400 324 802 -384 114 -290 571 1027 -313 26 -368 56 -189 -170 -1401
4615 -1401 181 220 -151 582 461 -777 230 296 787 507 -296 -358 563 207 863 -500 285 -331 245
4634 245 612 -254 713 520 184 -219 513 -52 175 1111 -255 -9 394 -407 -189 125 -137 523 22 336
4654 336 -254 6 56 438 -573 304 -214 731 366 -298 -104 -894 -60 557 -266 -27 25 212 508 -445
4674 -445 -147 -986 -278 -267 641 -876 -60 318 334 267 -746 -439 426 -1027 305 -758 1005 -725 413
4693 413 -509 85 62 631 -419 -209 -54 -502 -854 276 -238 -532 31 366 -479 547 496 -7 113 505
4713 505 671 -193 -248 -205 350 -617 129 871 -190 -148 -330 -46 263 -315 496 -533 -138 -1069 319 644
$$ packed form
4576A007j253R5O5J51O0j054O71N05j76j47O05k56o18J138o42N88j043P16j146
4595g34O97J68m30Q01q43P41p6M78j186M98m04Q61M56j340L39l94M24k45J9j231
4615a401J582L9l71P33j21j238J007O6M91k80q03o2R21l56O56j363P85o16N76
4634B45L67q66R67j93l36m03P32n65K27R36j366K46M03q01K18L14k62O60n01L14
4654C36n90K60N0L82j011Q77n18R45l65o64J94p90Q34O17q23K39N2J87K96r53
4674d45K98q39P08J1R08j517Q16L78J6o7j013L07Q65j453J332j063J763j730J138
4693D13r22N94k3N69j050K10J55m48l52J130n14k94N63L35q45J026n1n03J20L92
4713E05J66q64n5M3N55r67P46P42j061M2j82K84L09n78Q11j029L95r31J388L25
$$ plain form
4733 644 11 224 755 -148 193 -360 244 -398 -532 215 763 -44 -288 342 -500 -458 -421 90 -250 -276 -8
4754 -8 -1323 -305 51 251 675 -106 -698 143 544 266 332 68 1373 -581 -57 -164 524 916 -170
4773 -170 -627 762 311 59 418 853 612 -266 32 461 -407 -406 -702 708 177 228 -297 -622 -441 144
4793 144 448 121 667 -409 138 29 -281 -544 -912 -240 -648 344 6 -269 -300 -141 -398 -97 261 -868
4813 -868 -614 195 -417 -416 -70 764 519 156 -679 162 235 169 80 -1072 536 27 827 -134 -558 -641 -260
4834 -260 -488 220 150 -108 -556 76 141 34 444 418 323 880 -87 244 300 182 -266 -891 369 -1290 -161
4855 -161 228 -296 286 243 255 263 -662 377 179 111 -114 -1302 -294 -48 -784 678 -88 -418 950 435
4875 435 -634 -362 -743 -213 620 721 -850 -381 539 217 70 -561 744 99 -287 481 153 460 524
$$ packed form
4733F44o33K13N31r03L41n53O04o42j34P47N48q07k44O30q42M2L7N11l40k6K68
4754hj315J018L56K00M24p81n92Q41M01k78O6k64J305j954N24j07O88L92j086
4773a70m57J389m51k52L59M35k41q78K98M29q68Jk96J410n31N1n25l25J81N85
4793A44L04l27N46j076N47j09l10k63l68O72m08R92l38k75l1J59k57L01L58j129
4813h68K54Q09o12JL46Q34k45l63q35Q41P3o6q9j152J608n09Q00r61m24q3L81
4834b60k28P08p0k58m48O32O5j07M10k6r5N57r67L31N6j18m48o25J260j659J129
4855a61L89n24N82m3J2Qr25J039j98o8k25j188J008K46p36J462p66l30J368n15
4875D35j069K72l81N30Q33J01j571M69R20l22j47o31J305o45l86P68l28L07O4
$$ plain form
4894 524 643 -526 98 86 -130 -61 365 41 666 -315 -399 27 -355 -390 -580 -28 327 -121 -376 441 345
4915 345 -222 247 -168 599 -207 -274 -213 -295 -500 -780 627 -543 11 367 736 -437 383 714 -457 -367
4935 -367 -990 357 344 643 -98 496 -508 1015 -277 -786 85 33 -1032 84 244 -857 -64 -97 -337
4954 -337 54 164 -105 306 -856 -445 -19 762 -111 -282 876 220 146 293 223 -150 347 -166 252 -128
4974 -128 -308 -451 -389 -35 537 236 415 -742 -324 781 324 379 573 552 -316 -363 310 -598 458 401 -270
4995 -270 358 393 694 307 424 -159 -81 258 -539 -69 105 -41 -560 -182 -312 -31 783 -1089 -30 146
5015 146 293 -165 389 -68 -527 41 -302 140 826 -544 424 -567 779 -383 383 -667 -880 -103 -202
5034 -202 -862 295 174 -156 192 -45 -259 -369 -510 326 -83 214 -770 -587 583 -33 556 -313 47
$$ packed form
4894E24J19j169O24j2k16O9M26l24O25r81q4M26l82l5j90N52L55m48k55Q17r6
4915C45n67M69m15P67q06o7O1q2k05k80J407j170N54L56L69j173Q20L31j171R0
4935c67o23J347j3K99p41N94j004J523j292n09Q71n2j065J116J60j101P93l3k40
4954c37L91J10k69M11j162M11M26P81q73j71J158o56p4J47p0l73M97n13M18l80
4974a28j80j43O2L54N72l01J79j157M18J105m57N5J94k1q68m7O73r08J056n7o71
4995b70O28L5L01l87J17n83P8L39p97M70J74j46n19L78j30K81Q14j872J059J76
5015A46J47m58N54m57m59N68l43M42O86j370R68r91J346j162P66j050k13P77r9
5034b02o60J157j21l30L48k37k14j10j41Q36m09K97r84J83J170o16N89q69L60
$$ plain form
5053 47 82 204 390 -533 777 -1460 -312 870 -933 -23 556 260 -156 264 -537 -134 489 -138 644
5072 644 62 -34 -317 -364 268 -121 -195 362 -391 -112 268 301 443 -489 -244 800 908 794 449 -201 238
5093 238 -405 -614 173 -536 -317 55 968 132 366 279 221 -182 -816 520 -50 284 96 -229 464 -303
5113 -303 16 -89 -623 207 124 -376 -696 523 -294 -284 -860 279 302 160 -135 209 -114 491 355 18
5133 18 67 259 -780 -1008 -1003 -122 656 14 -403 253 823 516 -70 -490 591 -630 425 -12 78 -306
5153 -306 -464 -425 -221 66 -278 -360 247 -122 -690 -879 -10 0 -43 -309 40 33 124 -2 -8 95 895 -921 699
5176 699 1054 828 -17 18 809 -177 -291 -148 -573 1276 -597 379 -791 -564 -899 238 -1411 13
5194 13 524 414 -442 1127 478 -509 892 -374 -372 -187 -262 -540 78 447 -625 -264 363 -544 790 -22
$$ packed form
5053D7L5J22J86r23J310k237J148J182j803R10N79k96m16M20q01M03O23o27P82
5072F44n82r6k83m7O32l89p4N57p53K79L80L3J42r32K45J044J08j14l45o50M39
5093B38o43k09P87p09K19L72R13q36K34q7n8m03o34J336n70L34j88l25O93p67
5113c03L19j05n34Q30q3n00l20J219q17J0n76J139K3j42k95L44l23O05j36l37
5133A8M9J92j039k28NQ81P78o42m17O56N70l07n86m20J081j221J055m37R0l84
5153c06j58L9K04K87l44q2O07l69n68j89Q69J0m3k66L49pR1j26oJ03Q00j816J620
5176F99L55k26q45L5P91r86j14J43m25J849j873R76j170K27l35J137j649J424
5194A3N11j10q56J569o49r87J401j266KJ85p5k78O18L69j072L61O27r07J334q12
$$ plain form
5214 -22 350 113 224 350 79 37 -363 267 -840 -805 686 -248 -591 188 344 675 -189 -18 -399 10
5234 10 259 -57 114 -1396 276 410 -391 -86 587 -156 664 48 -203 415 -174 505 -292 526 910 -181
5254 -181 106 -102 10 142 -233 848 254 -605 1066 215 -180 409 305 599 471 159 807 490 683
5273 683 -141 231 -114 216 -264 -538 262 50 457 133 752 1170 796 -342 58 -20 -707 -67 501 182
5293 182 -781 343 -75 7 453 -1459 526 425 -136 543 -1080 -257 1663 479 108 211 -885 114
5311 114 111 1214 177 -817 469 605 -356 -290 -655 -98 349 135 -559 861 436 -16 150 -124 -889 58
5331 58 363 278 418 -1204 483 -377 -150 -159 39 556 -299 122 260 -98 -198 -177 -618 467 -74 -761 -648
5352 -648 -384 36 -813 -287 612 -784 101 254 875 798 102 -290 -723 347 503 1092 110 -64 -427 271
$$ packed form
5214b2L72k37J11J26k71m2m00O30j107L5J491r34l43P79J56L31q64J71l81M09
5234A0K49l16J71j510J672J34q01L05O73p43Q20o16k51O18n89O79p97Q18L84j091
5254a81K87k08J12J32l75J081n94q59J671q51l95N89j04K94j28l12O48l17J93
5273F83q24L72l45L30m80k74Q00k12M07l24O19M18l74j138M00p8o87O40N68l19
5293A82r63J124m18Q2M46j912J985j01n61O79j623Q23J920j184l71J03j096R99
5311A14lJ103j037r94J286J36r61O6l65N57M47k14o94J420m25m52J66k74p65R47
5331E8L05q5J40j622J687q60K27rJ98N17q55M21J38l58j00K1m41J085n41o87J13
5352f48K64M20q49N26Q99j396Q85J53O21p7o96l92m33J070J56N89r82j74l63O98
$$ plain form
5372 271 -123 856 175 656 718 273 310 -25 1203 -31 -131 -707 -523 -153 321 -5 -172 -156 674 -368
5392 -368 -765 -143 -488 504 -288 -760 550 -281 -139 835 32 -611 -30 -736 -142 95 -347 -205 1031
5411 1031 -11 970 19 -578 254 145 -167 177 873 -945 104 -112 806 -411 -379 -193 -65 722 439
5430 439 185 -66 -413 401 779 -451 -176 -187 230 642 -385 40 282 399 -140 19 687 -423 -161
5449 -161 169 162 -621 -211 397 -205 -272 -116 400 8 315 905 925 -239 -734 174 205 71 103 -244 -689 188
5471 188 -59 -286 -21 660 148 -74 313 -419 -213 250 -457 -495 -690 596 1118 497 -285 -329 -475 -120
5491 -120 -531 755 612 -683 -6 65 219 -374 20 10 73 347 262 214 658 -100 -125 393 84 -121 -25 344
5513 344 1132 -777 -108 -282 239 600 -596 492 352 -494 373 395 134 -1146 -358 302 -203 273 -184
$$ packed form
5372B71l94R79o81M81O2m45L7l35J228j234j00n76J84L70M74l26j67J6Q30j042
5392c68l97O22l45R92p92m72J310q31J42R74q03o43N81p06N94K37m42J42J236
5411A031j042R81r51n97Q32j09l12L44O96j818J049k16R18j217L2J86J28P87k83
5430D39k54k51l47Q14L78j230K75j1M17M12j027M25K42J17n39J59O68j110K62
5449a61L30pp83M10O08o02o7J56N16l92L07N90K0j164m95R08L1j34L2l47m45Q77
5471A88k47k27K65O81n12k22L87p32K06M63p07l8j95J286N22o21p82m4j46L55
5491a20m11J286j43j295O77P1J54n93L94j0O3K74q5m8M44p58k5N18l09k05R6L69
5513C44P88j909O69j74N21L61j196J088j40q46Q67K2k61j280P88O60n05M76m57
$$ plain form
5532 -184 -287 -13 379 -330 -839 266 957 -868 359 547 648 -577 -613 -619 236 -959 91 -277 -102
5551 -102 181 563 319 -2 474 -187 63 713 -353 -622 92 149 838 871 111 -51 667 -97 -191 -440 606
5572 606 65 -183 -74 -82 -228 -604 284 -394 -444 726 644 184 126 319 63 -880 -311 402 -161 -286 205
5593 205 98 731 -851 -376 -435 1078 191 -108 -459 909 6 -274 -115 -90 -167 -335 -207 191 -247 -259
5613 -259 -115 116 700 -396 -473 -136 47 -404 221 773 -186 -515 -811 596 175 -604 51 -772 -155 335
5633 335 516 -423 523 346 155 925 -115 -27 -258 -272 -884 -257 441 97 -356 -216 814 -511 771
5652 771 1266 108 105 90 149 -510 -512 -655 121 822 104 -303 -377 178 -154 254 11 40 384 -409 412 -716
5674 -716 43 239 629 30 -467 878 -93 -426 -335 -11 514 1242 -149 -183 137 -304 183 437 246 -578
$$ packed form
5532a84j03K74L92p09n09J105O91j825J227J88J01j225l6oQ55j195J050l68J75
5551a02K83L82k44l21M76o61K50O50j066k69P14N7O89L3p60j62P18p64r4k49J046
5572F06n41k48J09qj46l76Q88o78n0J170q2m60n8J93k56r43N69P13n63j25M91
5593B05j07O33j582M75n9J513q87k99l51J368r03k80J59K5p7j68J28L98m38j2
5613b59J44K31N84j096p7L37J83m51O25N52r59l29k96J407m21p79O55q23O17M90
5633C35J81r39R46j77j91P70j040Q8k31j4o12O27O98l44m53J40J030j325J282
5652G71M95j158lj5N9o59kj43P76P01p18m07p4N55l32M08k43K9L44p93Q21j128
5674g16P59J96L90n99m97J345r71l33R1L24N25P28j391l4L20m41M87K54j91q24
$$ plain form
5694 -578 -390 -90 303 283 600 -317 -413 -454 -732 395 261 187 -353 345 92 51 118 -78 235 -457 -334 -548
5716 -548 333 138 97 -313 -35 298 339 184 -388 -59 194 39 -681 -498 -522 444 -889 106 -40 -231 -225
5737 -225 56 -840 -1077 238 63 28 90 -501 -182 -147 1307 -1133 148 102 -880 -192 31 569 -477 15
5757 15 -493 410 -389 43 437 443 202 -17 -393 -199 492 -152 725 185 -162 299 -120 -801 -164 -1052 668
5778 668 99 69 30 -151 324 -17 135 -520 -38 -394 407 -80 725 1000 -479 746 -122 -19 27 333
5798 333 464 -387 517 -571 603 154 862 -396 -54 188 -179 -373 392 153 -369 404 198 -575 500
5817 500 -361 -297 -499 -30 203 -154 353 -184 -230 163 -174 -242 -265 -381 -627 172 -289 -339 -920 600 -49
5838 -49 541 156 13 616 199 326 345 -297 -513 823 344 751 211 -71 552 667 670 616 -305 -62 543
$$ packed form
5694e78J88L00L93k0L17r17r6m1k78J127j34p4n40O98k53m1O7j96L13o92J23k14
5716e48Q81j95m1m10K78L33M1j55n72L29K53j55p20J83k4R66j333R95j46j91O
5737b25K81q96k37J315j75l5O2n91L19L5J454k440J281m6r82O88K23N38j046M92
5757A5n08R03p99M32L94Ok41k19l76J94O91o44Q77n40l47M61m19o81O37q88J720
5778F68n69l0l9j81M75l41J52o55M82l56Q01m87Q05K75j479J225q68J03M6L06
5798C33J31q51R04j088J174m49P08j258L42K42l67j94P65k39n22P73k06p73J075
5817E00q61O4k02M69K33l57N07n37m6L93l37o8k3j16k46P99m61n0n81J520o49
5838d9N90l85j43O03m17J27J9o42k16J336m79M07n40k82O23J15Ln4r21K43O05
$$ plain form
5859 543 -1005 718 243 -114 350 -621 198 817 127 681 227 325 51 -152 753 403 596 203 126 281
5879 281 -525 -367 -30 1178 143 -432 644 156 -384 88 328 -564 290 -654 -315 -248 -310 -1915 485
5898 485 331 306 504 -221 -755 -436 550 -132 -531 449 252 181 449 -434 687 20 1264 59 1082
5917 1082 472 627 783 -268 382 -37 -232 663 259 -206 -383 -421 -192 -906 117 -182 -789 352 676
5936 676 -430 251 559 -310 -6 358 122 -252 -327 -103 220 85 -38 -211 400 -950 -165 -220 203 -238
5956 -238 404 -56 3 -197 421 -1247 -483 76 -909 909 -200 -444 -778 -656 -702 489 760 190 -23
5975 -23 19 297 254 -369 -325 -221 -322 48 -20 -85 509 16 -44 30 473 470 230 -617 -84 231 -894 -298 -598
5998 -598 101 -181 682 256 -91 376 -139 136 -116 129 -170 -927 -179 -236 -406 -526 107 113 -15 -208 -335
$$ packed form
5859E43j548J723m75l57M64r71Q19O19o90N54m54R8k74k03R05l50J93l93p7J55
5879B81q06J58L37J208j035n75J076m88n40M72K40q92Q54r44L39O7o2j605K400
5898D85j54k5J98p25n34L19R86o82l99R80j97p1K68q83J121o67J244j205J023
5917A082o10J55J56j051O50m19j95Q95m04m65j77l8K29p14J023k99o07J141L24
5936F76j106O81L08q69L04L64k36l74p5K24L23j35j23j73O11j350P85n5M23m41
5956b38O42m60N9k00O18j668P64N59r85J818j109k44l34J22m6J191K71n70k13
5975b3M2K78m3o23M4J04j01L70o8o5N94m93o0P4M43lk40q47N33L15j125N96l00
5998e98O99k82Q63m26l47M67n15K75k52K45k99p57P48n7j70j20O33Oj28j93j27
$$ plain form
6019 -335 436 -1206 161 315 147 151 -105 -694 325 472 17 386 187 280 847 74 -77 599 -456 171
6039 171 -114 562 -441 367 -75 501 144 -116 182 -160 -344 700 93 -903 -585 -450 12 -35 -337 3
6059 3 -43 13 -397 56 161 506 83 -131 671 108 442 516 79 329 185 -608 -431 -1241 203 162 -624 -164
6081 -164 -802 -510 141 425 627 -763 303 276 -84 332 -282 792 364 -593 -1235 -585 641 -200 274
6100 274 -282 -215 261 792 -50 -754 -1034 -49 851 66 -74 727 955 -1501 -402 16 304 616 -363 -189
6120 -189 -711 414 -584 -272 -631 308 -121 275 797 446 53 -408 447 412 -187 -417 458 -43 453 -447
6140 -447 544 -361 537 -167 -678 -165 -212 816 -177 -46 48 -50 -96 314 297 -290 290 267 -27 -670 -249 301
6162 301 -6 701 578 492 -692 921 230 -512 -275 -265 -220 -197 -84 40 495 -655 431 401 -104 165
$$ packed form
6019c35P71j642J367J54j68Mk56n89J019J47m55L69j99R3N67p73j51O76j055O27
6039A71k85O76j003Q08m42N76l57k60K98l42j84J044o07r96L18J35M62m7l02L40
6059Cm6N6m10M53J05L45m23k14Q02n63L34P4m37K50j44p93J77q10J444m1p86M60
6081a64o38K92O51K84K02j390J066k7l60M16o14J074m28r57o42O50J226q41M74
6100B74n56O7M76N31q42p04k80R85R00p85j40Q01K28k456J099M18K88L12r79J74
6120a89n22J125r98L12l59R39m29L96N22l51l93m61Q55l5n99k30Q75n01M96r00
6140d47R91r05Q98p04n11N13m7J028r93J31R4r8m6M10j7n87N80k3k94o43M21N50
6162C01l07P07j23q6j184J613o91p42K37J0M5K3J13J24M55j150J086l0n05K69
$$ plain form
6182 165 206 -383 273 -161 404 -601 -23 -329 593 774 -747 542 17 236 -62 -475 242 -138 1881
6201 1881 -569 -590 -571 207 523 1349 -582 1001 -603 -87 1131 764 -600 78 106 151 -374 328 -498
6220 -498 -15 -75 -250 552 -1292 -454 -309 724 107 259 -503 -149 512 -392 213 -81 -480 376 2 248
6240 248 -65 -398 -596 -6 -296 -47 -210 -161 143 -139 -77 223 -572 -920 -494 -505 937 480 -485 -328 -94
6261 -94 58 165 255 -579 523 329 -534 -511 -325 7 -340 -13 -142 -408 217 646 -6 -83 441 121 240
6282 240 741 341 505 -227 -608 -439 38 -235 -407 -388 774 -576 -64 -14 584 -139 -88 440 -49 566
6302 566 -22 250 224 -252 -162 389 -4 -44 -697 363 212 462 -426 366 -329 -499 699 -8 633 462
6322 462 434 186 -314 208 -118 -561 556 -545 -335 112 697 650 68 450 -143 879 469 -180 366 -293
$$ packed form
6182A65M1n89O56m34N65j005N78l06R22J81j521J289n25K19k98m13P17l80K019
6201A881k450k1J9P78L16Q26j931J583j604N16J218l67j364O78K8M5n25P02q26
6220d98M83o0j75Q02j844Q38J45J033o17J52p62L54O61r04O05k94l99Q56l74K46
6240B48l13l33j98N90k90K49j63M9L04k82O2L00p95l48M26j1J442m57r65J57K34
6261i4J52J07R0q34J102j94q63K3J86L32l47L27j29k66O25M29o52p7N24l20J19
6282B40N01m00J64p32l81J69M77k73j72J9J162j350N12N0N98p23N1N28m89O15
6302E66n88K72k6m76R0N51l93m0o53J060j51K50q88P92o95j70J198p07O41j71
6322D62k8k48n00N22l26m43J117j101K10M47N85m7n82L82n93J022m10o49N46o59
$$ plain form
6342 -293 789 1099 126 -933 -31 -62 311 551 413 295 78 540 481 117 -1216 -251 86 73 -62 -556
6362 -556 974 -819 -278 -685 -413 -722 837 1 -698 957 -163 -650 676 619 -292 536 67 -800
6380 -800 -339 -306 -711 339 316 -1045 -627 46 518 201 448 -167 58 -794 588 -876 -686 20 47 1130
6400 1130 -323 504 152 -482 -636 199 698 -316 55 -293 -519 298 111 254 267 -119 342 -16 -253
6419 -253 -231 619 606 -158 646 -183 -1179 459 -52 -600 223 184 53 232 652 -431 581 915 -56 479
6439 479 331 826 -370 -654 508 -20 -380 -532 703 -278 557 -146 -239 -262 75 -3 -198 57 -492 -131
6459 -131 234 -51 439 337 -794 -466 727 306 -512 504 397 302 226 -195 -186 -115 -742 -386 239 -218 196
6480 196 695 -928 369 452 -257 -163 -343 115 -590 -409 690 -222 324 -31 -40 274 322 570 -260 -690 16
$$ packed form
6342b93J082L10r73j059R02l1L73K40j38j18k17M62n9l64j333R65L37j3j35m94
6362e56J530j793N41m07K72l09J559q36o99J655j120m87J326n7r11Q28m69q67
6380h00M61L3m05J050k3j361M18O73M72l17K47o15K25q52J382j464J90P06K7J083
6400A130j453Q27l52o34j54Q35M99j014L71l48k26Q17j87J43J3l86M61l58k37
6419b53K2Q50j3p64Q04q29r96J638n11n48Q23l9j31J79M20j083J012L34r71N35
6439D79j48M95j196k84J162n28l60j52J235r81Q35p03r3k3L37p8j95K55n49L61
6459a31L65k85M90j02j131L28J193m21q18J016j07r5p6m21RP1o27L56O25m57M14
6480A96M99j623J297Q3p09R4j80M58p05J81J099r12N46l55rL14M8K48q30m30P06
$$ plain form
6501 16 203 -1083 -414 -597 -15 439 -2 -888 223 38 597 231 -293 683 -483 54 -101 -218 1355
6520 1355 215 -251 -2 -900 193 302 321 -205 -41 226 -496 880 -72 -205 104 347 225 -220 66
6539 66 -3 -107 -357 376 -467 -323 -413 1381 85 416 460 447 334 -150 -383 257 9 328 99 -85 117
6560 117 -387 -99 -894 -93 768 44 162 266 223 -737 -369 290 299 -51 -628 321 -365 642 -244 -1292
6580 -1292 -300 -55 214 -87 279 404 -32 -607 75 -798 147 -272 -110 862 381 -275 3 -153 187 -51
6600 -51 497 1168 -8 123 -424 902 -850 116 -332 7 51 79 113 315 -339 -440 -600 -477 179 -519
6620 -519 227 -1265 340 350 -202 -1103 2 -185 353 283 835 117 -873 -48 426 -326 -389 130 512 -507
6640 -507 -158 280 428 116 310 240 -473 -471 -375 397 629 430 336 327 299 -173 963 -685 -347 376 -309 720
$$ packed form
6501A6J87j286O69j83N82M54m41q86J111j85N59l66n24R76j166N37j55j17J573
6520A355j140m66K49q98J093J09J9n26J64K67p22J376r52j33L09K43j22m45K86
6539F6o9j04k50P33q43J44r0J794j296L31M4j3j13m84k33O40k48L19k29j84K02
6560A17n04K88p95Q01Q61p24J18J04m3r60L68O59Rl50n77R49o86J007q86j048
6580a292R92K45K69l01L66J25m36n75O82q73R45m19J62R72m81o56K78j56L40k38
6600e1N48O71j176J31n47J326j752R66m48L39M4K8L4K02o54j01j60J23O56o98
6620e19P46j492J605J0n52r01J105j87N38p0N52p18r90Q25M74p52o3N19L82j019
6640e07L49M38J48l12J94p0p13KR6P72K32j99r4rk8m72J136j648L38P23o85J029
$$ plain form
6662 720 -194 -367 29 242 -165 -143 -205 637 371 -265 138 -119 -604 590 -154 568 -307 348 508 -394
6682 -394 -717 -288 545 145 166 -560 358 -29 80 -558 -184 -418 102 -188 674 94 226 -27 502 909
6702 909 -346 619 60 1420 272 -802 -84 -827 208 967 242 314 252 -53 365 -387 -114 -469 -637
6721 -637 152 57 536 -41 260 -598 364 446 306 -560 412 314 434 -559 -338 880 -56 202 -529 535
6741 535 125 -613 -630 581 264 90 -782 39 -154 -557 678 -25 312 1426 -75 9 51 -425 382 113
6761 113 -188 56 -1093 -33 -240 -334 -173 -235 100 127 -47 -633 -36 33 983 -25 491 796 171 489
6781 489 -622 -339 -740 175 358 1163 -35 73 -585 838 256 391 428 -173 69 -387 125 -339 453
6800 453 401 -297 -68 -29 -129 434 -673 -108 75 421 -250 525 158 -762 9 340 42 280 -220 547
$$ packed form
6662G20r14j73L96K13m07K2o2Q42k66o36M03k57m85J194p44P22q75O55J60r02
6682c94l23M29Q33m00K1p26R18l87J09o38L74k34N20k90Q62n80J32k53N29M07
6702I09j255R65n59J360j148j074P18p43J035P59p25P2o2l05M18p52K73l55j68
6721f37P89r5M79n77L01q58R62Q2j40q66R72r8J20r93K21J218r36K58p31J064
6741E35m10p38j7J211l17j74q72Q21j93m03J235p03L37J114j501Q4M2m76Q07k69
6761A13l01K44j149J060k07r4J61o2L35K7j74n86N97O9R50j008N16L05o25L18
6781D89j111K83m01R15J83Q05j198J08o58J423n82J35L7o01K42m56N12m64P92
6800D53n2o98K29L9j00N63j107N65J83L46o71P75l67r20P71L31k98K38n00P67
$$ plain form
6820 547 -300 414 264 -275 -270 637 -166 468 525 -479 452 214 275 506 -811 226 185 -1174 13 -300
6840 -300 -359 377 341 94 -196 -209 610 381 255 489 256 -169 398 -240 218 21 -580 -271 559 366 233
6861 233 -698 1063 153 85 331 191 574 160 350 474 -145 803 106 234 107 146 -42 474 813 118
6881 118 363 -244 -336 -872 -218 -566 -511 -668 681 -702 -697 791 -418 360 -98 -391 -165 -668 -325 -201
6901 -201 889 -267 -806 -549 -175 468 299 -611 -230 -383 -249 -155 -414 599 -387 -226 -303 526 291 285
6921 285 159 166 -180 -145 100 -301 -309 509 -496 1143 17 -705 38 22 96 552 -111 45 151 -302 -222 -145
6943 -145 407 64 136 1624 -349 -333 -193 155 636 -180 814 57 -180 -65 -473 -658 267 -233 153 -647
6963 -647 187 -165 -134 1094 -77 -716 0 -462 -706 43 -511 -187 629 -32 -748 -128 -665 -601 -220 883
$$ packed form
6820E47q47P14j50n39NR07q03O34N7j004R31k38O1K31j317J037m1j359J187l13
6840c00n9P36l6k47k90j3Q19k29j26K34k33m25N67o38M58j97o01L09Q30j93j33
6861B33r31J761r10o8K46j40L83m14J90J24o19R48o97J28j27L9j88N16L39o95
6881A18K45o07r2n36O54l48N5j57J349j383NJ488j209P78m58k93K26n03L43J24
6901b01J090j156n39K57L74O43j69r10L81j53J34R4k59J013r86J61p7Q29k35o
6921B85j26Pl46L5K45m01qQ18j005J639j126p22P43j6P4M56o63J56J06m53Q0P7
6943a45N52l43P2J488j973J6J40L48M81q16R94p57k37J15m08j85R25n00L86q00
6963f47Q34l52L1J228j171o39P16m62k44P49n54L24Q16o61p16O20n37O4L81J103
$$ plain form
6983 883 437 102 -292 -225 -61 505 -361 -850 -316 -322 196 -164 -167 -356 1075 564 172 484 0 1144 408
7004 408 202 148 727 -236 -174 -501 836 -964 -753 112 35 458 9 -373 -570 180 59 -328 117 694
7024 694 -794 120 203 447 -103 -23 365 -258 -360 -563 -105 131 360 -1144 158 -409 -76 330 -21 490
7044 490 -27 639 372 -111 -339 216 -110 -76 -243 5 1002 -957 -57 278 497 -304 -1145 -59 -5 100
7064 100 384 -335 -177 -380 -567 -28 187 56 -578 693 -373 294 -476 -2 236 399 -286 -903 -114
7083 -114 -141 -304 78 452 -288 -375 609 437 403 485 -823 758 331 -64 -301 -261 693 161 323 -9 -33
7104 -33 -225 73 60 172 -89 104 274 132 -474 291 543 -124 9 205 -221 218 -102 -217 183 51 208
7125 208 -250 372 71 369 -97 -50 -254 300 -379 -357 62 -794 -486 484 -116 -330 320 919 88 -29 -246
$$ packed form
6983H83m46l35l94O7J64N66q66m89N34oN18l60lj89J431n11l92L12m84J144p36
7004D08k06n4N79r63O2l27J337j800K11Q65p7M23m49l82j97P50j21l87M45N77
7024F94j488R14Q3K44n50Q0L88o23j02k03M58K36K29j504J302n67L33M06l51N11
7044D90n17O66k67m83k28N55l26L4j67K48R97j959R00L35K19q01q41J086N4J05
7064A00K84p19J58k03j87N39K15j31o34J271j066O67p70M74K38J63o85o17P89
7083a14k7j63L82L74p40q7R84j72l4Q2j308J581m27l95k37M0R54n32J62l32k4
7104c3j92K98j3J12k61J93J70j42o06P65K52o67J33J96m26M39l20j15M00j32J57
7125B08m58O22l01K98m66M7k04N54o79K2M19q56L08R70o00k14O50N99q31j17k17
$$ plain form
7146 -246 308 -286 -751 -132 -840 -158 447 774 -219 936 63 -241 124 -360 523 -539 297 156 -170
7165 -170 1251 -253 -59 391 -784 510 14 -811 522 -1126 -257 655 176 363 188 233 -692 396
7183 396 -654 659 -849 -615 116 -909 -135 -211 9 17 -19 480 -405 667 -148 343 388 -650 1034
7202 1034 -163 794 -994 763 608 1074 -104 27 -729 91 -40 -198 563 196 155 -229 412 -431 -218
7221 -218 -419 -508 -91 -257 202 282 -223 -685 73 56 164 -340 -743 291 234 -404 353 -596 -123 290 -494
7242 -494 -278 9 401 -92 -193 12 -843 863 -119 -397 280 -45 247 328 1033 1421 406 -197 -151 467
7262 467 -841 320 339 136 -154 -175 3 -250 337 937 453 -672 37 -200 -51 228 721 -80 -745 -320
7282 -320 1112 -287 -537 -308 309 58 -44 -29 184 491 690 -482 443 159 207 -353 573 -578 -697
$$ packed form
7146b46N54n94m65O19p08O82O05L27r93J155q73l04L65m84Q83j062Q36j41l26
7165a70J421j504J94M50j175J294m96q25J333j648Q69R12m79J87j75M5r25J088
7183C96j050J313j508K34P31j025P74p6K20Ql6M99q85J072q15M91M5j038J684
7202A034j197R57j788J757j55M66j178J31p56Q20j31j58P61l67m1l84O41q43K13
7221b18k01q9M17j66M59Q0n05m62P58j7J08n04m03J034n7o38P57r49M73M13p84
7242d94K16K87L92m93j01K05q55J706r82k78O77l25K92Q1P05L88j015o03M6O18
7262D67j308J161J9k03k90k1J78k53N87O00m84j125P09k37J49K79M93q01o65M25
7282c20J432j399k50K29O17k51j02J5K13L07J99j172R25k84M8n60R26j151j19
$$ plain form
7301 -697 1046 356 -427 188 255 76 736 871 672 775 -181 -91 -173 423 615 845 -355 416 -328 -691
7321 -691 195 226 22 -797 429 -527 -278 506 570 -803 200 1169 -27 -341 -722 1 -382 -69 -18 535
7341 535 -510 -344 -223 -110 -332 -75 -77 414 -314 -425 -348 55 -79 -1090 232 -105 446 146 -550 361
7361 361 31 -214 -1216 -292 -638 188 -505 -6 662 130 -126 44 -73 519 299 -1060 478 -95 -21
7380 -21 196 -666 133 496 315 193 -698 42 15 -371 437 86 -129 -273 298 -213 187 776 -61 1229
7400 1229 594 -165 -358 30 385 579 37 -709 -397 -587 242 529 401 195 569 -363 234 -182 -338 -105
7420 -105 1006 55 -745 152 591 179 533 -74 37 450 -351 -857 -557 36 -73 130 185 316 234 237 157
7441 157 359 811 -137 -295 250 193 6 -289 -481 321 214 -747 -721 99 -383 -67 -234 13 355 -204 664
$$ packed form
7301f97J743o90p83O15O7j79O60J35j99J03r56R0q2N96J92K30j200P71p44l63
7321f91Q86L1k04q19J226r56K49P84O4j373J003R69j196l14l81P23l83L13N1N53
7341E35j045J66J21J13k22K57kM91p28j11P7M03j34j011J322l37N51l00o96R11
7361C61l30k45j002R24l46Q26o93M99O68n32k56J70j17N92k20j359J538n73P4
7380b1K17q62P99L63j81j22q91P40k7l86Q08l51k15j44N71n11M00N89q37J290
7400A229o35p59j93L88L55J94n42p46L12j90Q29K87j28k06L74r32N97m16j56K33
7420a05J111r51q00Q97M39m12L54o07J11M13q01n06L00N93j09K03N5J31q2Lq0
7441A57K02M52r48j58N45n7j87k95j92Q02j07r61K6Q20m82L16j67K47L42n59Q68
$$ plain form
7462 664 -36 1141 245 170 102 -237 193 -3 673 -432 -786 -240 53 -346 143 272 234 97 223 673
7482 673 -115 612 694 -274 500 245 -455 430 75 371 -224 357 480 -643 250 -506 179 860 277 617
7502 617 -503 -873 779 49 455 -362 686 638 202 -438 532 677 459 -38 -474 240 189 -224 -439 -345
7522 -345 -47 -56 296 -188 587 -675 48 -375 224 217 -698 905 -937 831 406 151 1659 -75 -454
7541 -454 -329 825 336 467 62 523 -313 232 -1234 1173 -308 -178 -90 -93 974 662 -486 -98 977
7560 977 52 -465 426 -213 138 903 -84 -870 825 -540 -358 -111 -443 -47 -894 -184 -580 -498 162 87
7580 87 211 91 543 -841 8 -396 -228 40 -811 286 -732 228 -1097 -207 459 245 159 29 247
7599 247 277 589 322 -252 347 -52 283 -435 -859 -521 10 348 389 435 -508 -177 195 -177 81 67 168
$$ packed form
7462F64p00J177q96p5o8l39M30j96O76j105l54N46K93l99M89J29l8j37J26M50
7482F73p88P27Q2r68P74k55p00Q85l55K96n95N81J23j123Q93p56O85O81n83L40
7502F17j120l70J652p30M06q17J048m8m36o40R70J45k18m97m36P14n1m13k15R4
7522c45K98rL52m84P75j262P23m23N99pr15J603j842J768m25k55J508j734l79
7541d54J25J154m89J31m05M61q36N45j466K407j481J30Q8lJ067l12j148L88J075
7560I77r25n17Q91o39L51P65r87p86J695j365J82K47l32L96q47P10l96Q2O60p5
7580H7J24j20M52j384Q49m04J68K68q51J097j018R60j325Q90O66k14q6j30K18
7599B47L0L12k67n74N99l99L35p18m24L38N31L38M1M6r43L31L72l72K58j4J01
$$ plain form
7620 168 178 577 -49 -500 261 -464 -687 320 45 -273 336 -9 176 -25 -56 -786 361 137 -434 85
7640 85 148 -877 346 -411 1 965 138 709 -294 176 -245 -240 29 218 -40 446 -116 530 295 -281
7660 -281 971 -149 86 -7 -240 452 379 804 -288 -507 607 -174 132 -43 89 380 1431 -15 189
7679 189 0 -527 -177 -13 1082 104 208 8 136 121 -235 -464 312 565 526 -115 983 -41 203 262
7699 262 -300 -553 568 -715 228 -57 -118 -216 -269 -34 -439 -257 -139 369 -34 770 163 -233 -55 -424
7719 -424 -172 -350 479 -710 -395 371 -539 268 -373 225 -556 -912 199 905 -961 770 934 -106
7737 -106 176 571 283 316 -214 -670 83 -316 990 885 383 206 -188 305 204 171 -361 -1023 333 300
7757 300 -348 -685 1000 -172 -125 353 -179 -327 279 -305 23 265 -286 342 -270 -27 171 8 626 90
$$ packed form
7620A68J0L99o26m51P61p25k23J007k75l18O09l45J85k01l1p30J147k24n71N19
7640H5O3j025J223p57M12R64q27N71j003M70m21NK69J89k58M86n62O46k35n76
7660b81J252j120K35r3k33O92p3M25j092k19J114p81L06j75J32K91J051j446K04
7679A89j89n27L50J64J095r78J04k00J28j5l56k29P76K53l9o41J098j024K44N9
7699B62n62k53J121j283R43k85o1r8n3K35m05J82J18N08m03Q04o07l96J78l69
7719d24K52j78Q29j189L15P66r10Q07o41N98p81l56J111P06j866J731J64j040
7737a06K82L95k88L3n30m56P53l99J306j05n02j77l94M93j01l3n32o62J356l3
7757C00o48l37J685j172M7M78n32j48O06n84L28K42n51O28o12K43J98j63O18n36
$$ plain form
7777 90 -728 -690 -615 -195 -694 -222 -123 54 -104 298 -230 606 1026 -268 -282 -99 -188 311 299 86 581 -379
7799 -379 -570 -270 307 577 315 94 439 490 499 -192 -528 1339 -705 -937 401 607 530 -833 -7 199
7819 199 642 -1154 -33 1370 696 -55 367 103 721 279 -611 -674 -314 361 -478 336 -599 -513 540
7838 540 -68 340 276 -581 -254 -561 -293 -66 -431 35 393 109 951 583 242 141 341 -187 -114 -546 125
7859 125 547 -258 -615 142 -545 24 -1084 -215 214 -497 256 -639 50 193 517 510 -350 132 498 222
7879 222 -526 -596 -587 326 -45 -419 -182 -727 -436 -546 251 466 400 -524 -780 19 -99 194 -567 326 -257
7900 -257 -251 268 -688 -312 909 865 -68 194 237 60 -167 -80 -62 -1003 -207 -32 30 354 -304 352 -477 -315
7922 -315 -186 -39 -500 259 -212 -689 -378 -498 -168 835 650 178 -46 -396 -446 384 -128 327 634 -681
$$ packed form
7777I0q18L8P5M20m99M72R9J77j58M02n28Q36M20j294j4J83q9M99j2k13M95r60
7799c79j91L00N77K70k62k21L45N1Ro91l36J867k044k32J338K06p7j363Q26K06
7819A99M43j796J121J403o74p51M22k64O18m42q90o3L60O75q39Q14r35Q6J053
7838E40o08M08o4q57L27l07K68K27l65M66L58k84Q42l68l41j01K00n28P3m32O71
7859A25M22q05l57P57o87N69j108Q69M29p11P53q95O89J43L24pq60M82L66k76
7879B22p48p0RR13l71l74K37n45K91j10P97K15o6r24k56P99j18K93p61Q93n83
7900b57ON19r56L76J221m4r33K62M3j77k27Q7J8r41P96J75O2L24o58O56q29J62
7922c15J29J47m61P59m71m77L11j20L30J003j85m72k24l50n0Q30n12M55L07j315
$$ plain form
7942 -681 254 -550 -413 375 -22 -371 -335 194 -43 472 190 -54 64 -84 -112 -45 136 654 -19 450 -172
7963 -172 -1015 184 794 347 1062 -167 295 -330 -250 1177 -511 -286 -1049 378 506 522 379 -794 143
7982 143 701 26 722 -768 -176 336 -307 456 -243 40 592 199 345 22 407 442 -19 234 545 25
8002 25 340 -892 295 6 -293 560 -782 46 817 1596 293 400 -290 109 -246 389 264 -967 21
8021 21 413 225 -200 -635 -62 25 -282 266 -351 -332 -155 -235 92 261 -52 332 520 774 239 -471 64
8042 64 -198 177 472 -976 -521 -310 515 -96 -23 432 314 -116 -1322 -124 76 -165 -893 541 -696
8061 -696 760 -10 -534 214 404 -56 -467 -524 133 346 -127 -465 629 74 -125 -79 454 388 693 -637
8081 -637 -56 708 276 -299 -652 -310 -128 -146 334 450 -164 165 -809 -16 -660 1175 -12 32 536 -266
$$ packed form
7942f81R35q04J37P88l97l49L6N29k37N15k82k44J18j48k8O7J81N18o73M69o22
7963a72q43J199O10m47P15j229M62o25Q0J427j688K25p63J427J28J6j43j173R37
7982A43N58o75O96j490N92N12o43P63o99K83N52l93J46l23L85L5m61K53L11n20
8002B5L15j232J187k89k99Q53j342Q28P71P79j303J07o90L99l55O35j25j231R88
8021B1L92j88m25m35N73Q7l07N48o17J9J77q0L27J69l13L84J88K54n35p10N35
8042F4k62L75K95j448M55K11Q25o11P3M55j18m30j206J198K00k41p28J434j237
8061f96J456p70n24P48J90m60m11n7O57K13m73l38J094n55j99M6N33o6L05j330
8081f37N81P64m32n75l53L42J82j8M80J16o14L29r74P93o44J835j187M4N04q02
$$ plain form
8101 -266 43 261 413 -53 86 867 61 -392 -74 1059 117 1142 477 -728 -488 12 112 -581 0
8120 0 -33 582 -18 560 -416 -636 771 -365 -556 487 -295 -389 -576 1 370 384 232 -244 277 13 583
8141 583 -185 -203 -415 -368 -359 -259 -598 309 -639 -351 -799 -847 -241 60 -744 -41 425 -24 219 -205 -312 378
8163 378 783 0 662 795 1194 -477 -178 799 137 -696 -381 111 328 -178 576 -131 563 890 406 416
8183 416 340 -593 264 4 -570 -163 489 270
$$ packed form
8101b66L09K18J52m66J39P81q06m53L18J133r42J025o65j205K40N00J00o93N81
8120@l3O15o00N78r76k20J407j136j91J043p82r4j87N77L69J4j52m76N21k64N70
8141E83p68j8k12M7RJ00l39R07r48K88m48m8O06L01q04P03M66m49K43m24j07O90
8163C78M05p83O62J33L99j671K99R77o62q33L15M92K17n06P54p07O94L27m84J0
8183D16p6r33Q57k60n74M07O52k19
8191B70
$$ Imaginary data points
##PAGE= N=2
##DATA TABLE= (X++(I..I)), XYDATA
$$ plain form
0 0 0 0 0 0 0 0 0 0 0 0 0 0 0 0 0 6 -19 108 -108 108 -111 117 -129 219 -223 235 -330 341 -380 454 -525 577
32 577 -681 773 -851 956 -1080 1216 -1356 1504 -1684 1868 -2063 2289 -2528 2791 -3084 3403
48 3403 -3743 4121 -4542 5006 -5517 6081 -6727 7447 -8282 9225 -10330 11628 -13201
61 -13201 15128 -17562 20742 -25114 31504 -41679 60586 -107194 496126 253414 -764679
72 -764679 325171 526371 -535841 -228432 705366 -188422 -550575 496513 280629 -665315
82 -665315 132792 570705 -450261 -309182 628987 -48605 -595611 393746 375693 -610483
92 -610483 -7835 602841 -326463 -408125 562793 78009 -591964 261185 445603 -513886
102 -513886 -137672 601118 -203368 -466070 477436 207668 -580272 138528 520032 -423662
$$ packed form
0@%%%%%%%%%%%%%%%Ok5J27k16K16k19K28k46L48m42M58n65O71p21Q34r79J102
32E77j258J454j624J807k036K296k572K860l188L552l931M352m817N319n875O487
48C403p146P864q663R548j0523J1598j2808J4174j5729J7507j9555K1958k4829
61a3201K8329l2690L8304m5856N6618p3183J02265j67780O03320k42712j018093
72g64679J089850K01200j062212L07409R33798q93788l62153J047088k15884r45944
82f65315P98107M37913j020966J41079R38169o77592n47006R89357j8053r86176
92f10483O02648O10676r29304q1662R70918m84784o69973Q53149J84418r59489
102e13886L76214P38790q04486k62702R43506k69768p87940P18800L81504r43694
$$ plain form
112 -423662 -251901 577961 -65818 -521163 378002 302726 -540486 14092 527664 -317157
122 -317157 -349569 516443 37430 -537635 256936 374630 -471012 -118832 527894 -191475
132 -191475 -415618 416683 167007 -512016 128102 422692 -373231 -201355 477114 -71225
142 -71225 -441192 330216 247383 -470575 27915 453539 -276606 -289061 448106 43211
152 43211 -456009 223733 339793 -406107 -91023 469475 -174268 -347946 377529 139137
162 139137 -451506 124800 382254 -346400 -180325 446072 -74065 -403089 302241 222919
172 222919 -423828 16893 404679 -245103 -263885 396475 28103 -404196 205484 282070
182 282070 -359874 -72255 402786 -157347 -304330 330599 120850 -393313 109510 330948
$$ packed form
112d23662J71761Q29862o43779m55345Q99165p5276q43212N54578N13572q44821
122c17157l2412Q66012m79013n75065P94571J17694q45642L52180O46726p19369
132a91475k24143Q32301k49676o79023O40118K94590p95923J71876O78469n48339
142g1225l69967P71408q2833p17958M98490M25624p30145j2455P37167m04895
152D3211m99220O79742J16060p45900L15084N60498o43743j73678P25475k38392
162A39137n90643N76306K57454p28654J66075O26397n20137l29024P05330p9322
172B22919o46747M40721L87786o49782j8782O60360l68372m32299O09680P6586
182B82070o41944K87619M75041n60133j46983O34929k09749n14163N02823K21438
$$ plain form
192 330948 -290406 -151468 376054 -53376 -336043 258394 191236 -357300 24614 346222
202 346222 -217321 -218704 349906 18758 -356547 183722 252863 -330211 -66914 361737
212 361737 -146155 -274252 293024 104522 -354547 98237 290575 -268988 -132352 339420
222 339420 -63137 -303565 237041 161920 -328148 23199 309811 -197664 -197802 309018 15040
233 15040 -309854 158767 213087 -275765 -52436 304743 -123710 -226036 252435 81784
243 81784 -301006 94574 245507 -235277 -107041 292419 -55875 -262892 205809 140390
253 140390 -285089 21706 265530 -175177 -166666 270088 2442 -268302 148455 182107
263 182107 -254583 -36537 275871 -125551 -200583 234424 68141 -273480 88341 216930
$$ packed form
192C30948o21354J38938N27522m29430k82667N94437o7158n48536L81914L21608
202C46222n63543j383N68610l31148l75305N40269O9141n83074K63297M28651
212C61737n07892j28097N67276j88502m59069M52784J92338n59563J36636M71772
222C39420m02557k40428N40606p5121m90068L51347K86612n07475j38N06820k93978
233A5040l24894M68621N4320m88852K23329L57179m28453j02326M78471j70651
243H1784l82790L95580J50933m80784J28236L99460l48294k07017M68701o5419
253A40390m25479L06795K43824m40707Q511M36754k67646k70744M16757L3652
263A82107m36690K18046L12408m01422p5032M35007j66283l41621L61821J28589
$$ plain form
273 216930 -210576 -92808 256544 -51922 -225088 183203 113176 -244322 29945 224795
283 224795 -156629 -133304 234677 -3036 -227566 131301 153056 -215543 -29102 232402
293 232402 -103780 -165299 194985 53248 -223273 78044 175610 -179335 -69918 216844
303 216844 -53806 -189021 165699 91678 -216754 32277 195840 -141424 -116458 206946
313 206946 -5131 -198715 116248 129470 -189289 -18577 198134 -99093 -136195 172391
323 172391 36369 -194555 74552 149618 -159178 -56316 189201 -48454 -160217 140889
333 140889 74337 -176767 27359 158224 -113931 -90347 168077 -9369 -156958 100451
343 100451 99818 -157251 -7265 162698 -85121 -111012 146115 30677 -163593 63437 122836
$$ packed form
273B16930m27506J17768L49352l08466j73166M08291p0027l57498K74267J94850
283B24795l81424K3325L67981k37713k24530L58867K1755l68599J86441K61504
293B32402l36182o1519L60284j41737k76521L01317R7566l54945J09417K86762
303B16844k70650j35215L54720p4021l08432K49031J63563l37264K4966L23404
313B06946k12077j93584L14963J3222l18759J70712K16711k97227l7102L08586
323A72391j36022k30924K69107P5066l08796J02862K45517k37655j11763L01106
333A40889o6552k51104K04126J30865k72155K3584K58424j77446j47589K57409
343A00451o33k57069J49986J69963k47819k5891K57127j15438j94270K27030N9399
$$ plain form
354 122836 -133454 -44052 154849 -44242 -129386 119532 55304 -150263 30761 130494 -106718
365 -106718 -71483 146645 -16185 -136364 90281 83301 -137205 -6197 135133 -73393
375 -73393 -91370 119271 21959 -131034 54668 96682 -109293 -27527 125212 -40530 -100505
386 -100505 101210 41910 -121201 25459 105718 -83502 -59819 116950 -13117 -106114 67384
397 67384 61954 -106094 -3525 103819 -62358 -69484 97823 12353 -109964 50015 75040
408 75040 -95470 -24101 101864 -35404 -86917 80934 33421 -101731 21066 81955 -71540
419 -71540 -42400 92179 -15659 -81898 58649 48855 -89510 2135 86890 -53307 -52446 79692
431 79692 9652 -83908 36635 60022 -70010 -18711 75899 -27129 -62690 62521 19332
$$ packed form
354A22836k56290Q9402J98901j99091q5144K48918o4228k05567J81024R9733k37212
365a06718L5235K18128j62830j20179K26645o980k20506J31008J41330k08526
375g3393j7977K10641r7312j52993J85702M2014k05975Q1766J52739j65742n9975
386a00505K01715n9300j63111J46660Q0259j89220K3683J76769j30067r2997J73498
397F7384n430j68048J02569J07344j66177p126J67307q5470j22317J59979K5025
408G5040j70510P1369J25965j37268n1513J67851m7513j35152J22797O0889j53495
419g1540K9140J34579j07838o6239J40547r794j38365R1645Q4755j40197Q61J32138
431G9692p0040r3560J20543K3387j30032N1299R4610j03028l5561J25211m3189
$$ plain form
442 19332 -75067 18999 61145 -57158 -30848 75423 -16000 -64324 47831 37216 -68068
453 -68068 -84 64224 -39908 -42025 59350 5093 -65250 33131 41562 -55960 -8987 59030
465 59030 -24467 -48099 55568 16790 -60692 19907 49904 -44462 -22298 55992 -9149 -45917
477 -45917 33944 27931 -49838 3498 45814 -33555 -25471 43771 548 -47372 23975 32714 -43394
490 -43394 -7435 47156 -17981 -34892 37758 10539 -39448 10777 31227 -30800 -16385 40681
502 40681 -12420 -32458 28726 15439 -39337 3782 36825 -25004 -21759 35875 3832 -36782
514 -36782 20904 22947 -29730 -3373 29169 -11858 -22429 27587 4489 -30535 10957 22867
526 22867 -25419 -8929 29459 -9030 -24497 18021 15291 -28892 1989 25514 -16117 -11002
$$ packed form
442A9332r4399R4066M2146j18303K6310J06271r1423m8324J12155j0615j05284
453f8068O7984O4308j04132k117J01375n4257p0343R8381Q431r7522M6973O8017
465E9030q3497k3632J03667l8778p7482Q0599K9997r4366K2164P8290o5141l6768
477d5917P9861o013p7769N3336M2316p9369Q084O9242m3223m7920P1347Q739p6108
490d3394L5959N4591o5137j6911P2650k7219m9987N0225K0450o2027J4415N7066
502D0681n3101k0038O1184j3287n4776M3119L3043o1829L245N7634l2043m0614
514c6782N7686K043n2677K6357L2542m1027j0571N0016k3098l5024M1492J1910
526B2867m8286J6490L8388l8489j5467M2518k730m4183L0881K3525m1631N115
$$ plain form
538 -11002 19646 888 -21332 12910 12077 -21897 -1177 20312 -13217 -16502 21291 2449 -20493
551 -20493 5810 17406 -15345 -8813 21776 -5037 -13273 14103 6260 -15779 4385 14502 -12029
564 -12029 -6436 15923 -1718 -16884 12109 7860 -15189 -1163 12880 -4333 -11778 12614 3798
577 3798 -11432 5285 8305 -10114 -886 11557 -5601 -6267 8569 3929 -13310 4180 11527
590 11527 -9655 -3837 8320 1102 -9933 4775 6117 -6346 -447 7074 -3447 -4113 8719
603 8719 -1570 -5774 5125 5766 -6994 -1221 10036 -4083 -5476 4528 3445 -6734 536 4857
617 4857 -3672 -1271 3487 582 -4252 5994 513 -4694 2172 4186 -1965 -3644 6694 -157 -4347
632 -4347 1405 4143 -2926 -2346 2964 -836 322 -538 1555 -2288 2497 2150 -3841 1991 2568 306
$$ packed form
538a1002L0648j8758k2220L4242q33l3974K0720K1489l3529l285L7793j8842k2942
551b0493K6303J1596l2751O532L0589k6813q236K7376p843k2039K0164J0117k6531
564a2029N593K2359j7641j5166K8993m249k3049J4026J4043j7213p445K4392q816
577C798j5230J6717L020j8419R228J2443j7158o66J4836m640j7239J7490P347
590A1527k1182N818J2157p218j1035J4708J342j2463N899P521j0521o66J2832
603H719j0289m204J0899O41j2760N773J1257j4119j393J0004j083j0179P270M321
617D857q529K401M758k905m834J0246n481n207O866K014o151j679J0338o851m190
632d347N752K738p069N80N310l800J158q60K093l843M785l47n991N832N77k262
$$ plain form
648 306 -2958 3165 1345 -2269 30 2667 253 -2527 2264 67 2599 -1360 262 -617 787 2270
664 2270 -3441 807 1686 249 -1774 1580 1884 -149 -821 551 2605 -1956 -17 -545 409 361 -1794
681 -1794 296 859 566 -1395 640 473 -181 -1385 -97 1967 -1201 -380 -1196 3565 -575 -337 -365
698 -365 336 1590 -2154 1057 122 847 -1906 -211 1006 -339 -1018 -1489 2813 -594 -368 -1433 1866
715 1866 810 -1096 198 -629 1210 -2481 -7 -183 920 -1576 -1646 1270 -651 595 -3007 1686
731 1686 482 287 -1657 1012 1733 -2222 69 -488 2021 -2244 1302 1320 650 939 -1991 866 -102
748 -102 1312 -2448 63 914 -923 -790 -243 2415 -1949 801 -255 -151 130 -514 497 -150 2270
765 2270 -1843 -824 970 1930 -868 -418 2966 -793 -870 -545 3208 -1436 -769 580 -249 493 -442
$$ packed form
648C06l264O123j820l614K299K637k414k780M791k197K532l959J622q79J404J483
664B270n711M248Q79j437k023L354L04k033o72J372K054m561J939n28R54m8k155
681a794K090N63k93j961K035j67o54j204J288K064l168Q21q16M761m140K38k8
698c65P01J254l744L211r35P25k753J695J217j345o79m71M302l407K26j065L299
715A866j056j906J294q27J839l691K474j76J103k496p0K916j921J246l602M693
731A686j204j95j944K669P21l955K291n57K509m265L546J8o70K89k930K857r68
748a02J414l760K511Q51j837J33N47K658m364K750j056J04K81o44J011o47K420
765B270m113J019J794R60k798M50L384l759p7L25L753m644O67J349q29P42r35
$$ plain form
782 -442 838 -1471 3323 -1166 -1699 273 2367 -801 -2910 3382 267 -874 -738 2942 -1488 -1959
798 -1959 914 -949 193 -355 1515 -3472 1949 1853 -3149 -411 3249 -143 -4199 2663 1590 -1478
814 -1478 -729 3547 -703 -3223 3032 -187 -1641 -114 895 -3617 -1049 3508 -3208 -2574 3115 2082
830 2082 -4687 1299 2902 -1993 -1733 1863 399 -4204 1828 1055 -2442 -93 1639 -2207 -3346 4428
846 4428 -1121 -2661 2048 3961 -4553 27 6092 -1216 -3244 2488 3081 -4962 2030 3635 -3119
861 -3119 -949 3299 -566 -5031 3724 331 -5641 944 4926 -3805 -3155 4847 -107 -4784 1026
876 1026 3823 -4335 -1557 4558 -2635 -2306 2946 -368 -6314 2767 3087 -4339 -701 5123 -691 -6244
892 -6244 5789 2458 -3701 652 4443 -908 -3916 5984 -65 -3747 2542 2503 -6285 277 4297
$$ packed form
782d42J280k309M794m489n33J972K094l168k109O292l115j141J36L680m430m71
798a959K873j863J142n48J870m987N421r6n002K738L660l392m056O862j073l068
814a478P49M276m250k520O255l219j454J527J009m512K568M557o716O34N689j033
830B082o769N986J603m895K60L596j464m603O032p73l497K349J732l846j139P774
846D428n549j540M709J913q514M580O065p308k028N732N93q043O992J605o754
861c119K170M248l865m465Q755l393n972O585L982q731O50Q002m954m677N810
876A026K797q158K778O115p193L29N252l314n946R081L20p426L638N824n814n553
892f244J2033l331o159M353L791n351l008R900o049l682O289l9q788O562M020
$$ plain form
907 4297 -4602 -2424 4523 2450 -7029 2506 4649 -5045 -1643 4311 -97 -4725 4542 1818 -4598
922 -4598 640 4945 -4891 -3074 6672 -2126 -4834 2227 4561 -6432 -771 6950 -3358 -3576 4142
937 4142 1865 -5342 2219 4457 -4016 -730 5763 -1511 -5477 6689 -537 -5704 1283 4862 -4027
952 -4027 -5029 6323 -961 -5807 2020 2776 -5725 888 4581 -4150 -2256 3637 317 -7333 4323
967 4323 3990 -6324 -1285 5098 -1044 -6895 4745 2114 -5113 -507 4893 -4216 -2562 6082 -2047
982 -2047 -3434 2741 2877 -6761 1214 6185 -5460 -3403 4972 733 -7341 1913 3241 -4435 -2083
997 -2083 4834 -2810 -5968 5153 -396 -4986 1634 3793 -5906 -1449 7034 -2375 -5060 4780 2856
1012 2856 -6120 1040 5173 -3314 -2630 3808 1170 -5194 4082 2313 -4632 1406 4789 -2333 -3947
$$ packed form
907D297q899K178O947k073r479R535K143r694L402N954m408m628R267k724o416
922d598N238M305r836J817R746q798k708P061K334j0993N661P721j0308k18P718
937D142k277p207P561K238q473L286O493p274l966J2166p226n167O987L579q889
952d027j002J1352p284m846P827P56q501O613L693q731J894N893l320p650J1656
967D323l33j0314N039O383o142n851J1640k631p227M606N400r109J654Q644q129
982b047j387O175J36r638P975M971j1645K057Q375m239q074R254J328p676K352
997b083O917p644l158J1121n549m590O620K159r699M457Q483r409k685R840j924
1012B856q976P160M133q487O84O438k638o364R276j769o945O038L383p122j614
$$ plain form
1027 -3947 6218 1582 -4779 900 4710 -3781 -2923 6029 -1345 -2923 2065 2055 -5341 -5 4159
1042 4159 -4034 -1473 3875 -586 -5440 3733 2130 -4989 -1478 5177 -2271 -4989 5138 970 -3366
1057 -3366 -75 3468 -2867 -628 4374 -2005 -2542 3105 1657 -5835 2015 3774 -3856 -1699 4884
1072 4884 1946 -5858 3026 1668 -3165 -134 3159 -1416 -2963 2843 -1936 -2147 1471 3074 -4127
1087 -4127 -879 4167 -4508 -2078 2454 1599 -4987 972 3060 -2317 -1248 1698 244 -3062 2586
1102 2586 439 -2814 844 4362 -1797 -3426 5112 -454 -2885 1077 3098 -2644 -1263 3051 -997
1117 -997 -1857 1197 788 -3230 903 1191 -2697 -25 2063 -12 -3960 2844 600 -3108 -49 2466
1133 2466 -1293 -2691 2140 530 -955 670 1661 -3487 45 2389 -2045 -32 1502 1133 -2561
$$ packed form
1027c947J0165m636o361N679L810q491Q58Q952p374j578M988j0p396N336M164
1042D159q193K561N348m461m854R173j603p119L511O655p448k718J0127m168m336
1057c366L291L543o335K239N002o379n37N647j448p492P850J759p630K157O583
1072D884k938p804Q884j358m833L031L293m575j547N806m779k11L618J603p201
1087d127L248N046q675K430M532q55o586N959K088n377J069K946j454l306N648
1102B586k147l253L658L518o159j629Q538n566k431L962K021n742J381M314m048
1117i97q60L054m09m018M133K88l888K672K088k075l948O804k244l708L059K515
1133B466l759j398M831j610j485J625R91n148L532K344m434K013J534l69l694
$$ plain form
1148 -2561 1207 2199 -2549 -1217 2519 1128 -2729 1237 885 -957 -76 1816 -284 -1171 1703 -1674
1164 -1674 2 5 -121 -2831 250 1644 -1277 -811 1186 1250 -1650 473 494 -1003 773 948 -82
1181 -82 -1826 1732 -46 -1493 1209 911 -1055 -1296 1773 -786 -1262 10 1361 -829 -333 418 -1025
1198 -1025 226 -1027 1594 -715 1507 244 -633 549 590 229 -1426 1875 -37 361 -1087 525
1214 525 413 -348 426 -313 441 13 -241 -679 91 1272 -1443 280 -374 227 -1031 615 438 -54
1232 -54 -411 -376 1096 -1060 -517 -140 1382 184 -646 -97 161 1571 -2104 189 102 97 -855 -748 271
1251 271 249 543 -229 203 359 81 -74 251 656 -945 -294 -143 763 -503 -206 413 374 -615 -1236 951
1271 951 -715 -690 -856 547 -1202 -221 -49 -78 193 -383 175 -356 849 -645 -595 -163 -117 893 -1698
$$ packed form
1148b561L768R92m748J332L736j391l857L966l52j842Q81J892k100q87K874l377
1164a674J676Lj26k710L081J394k921M66J997O4k900K123K1j497J776J75j030
1181h2j744L558j778j447K702k98j966k41L069k559m76J272J351k190M96P51j443
1198a025J251j253K621k309K222j263q77J182M1l61j655L301j912L98j448J612
1214E25j12p61P74p39P54m28k54m38P70J181k715J723o54O01j258J646j77m92
1232e4l57L5J472k156N43L77J522j198q30N49K58J410l675K293q7nr52J07J019
1251B71k2K94p72M32J56k78j55L25M05j601O51J51R06j266K97O19l9r89o21K187
1271I51j666K5j66J403j749R81J72k9K71n76N58n31J205j494N0M32M6J010k591
$$ plain form
1290 -1698 1317 -595 414 -1312 563 488 -696 176 456 922 -1108 448 -653 1111 774 -365
1306 -365 293 -432 736 -1404 190 1400 39 -524 -175 726 -522 540 -92 1426 -717 911 -322
1323 -322 -285 911 -497 284 -118 251 -323 -312 1265 -642 -417 135 1839 -880 -104 698 -353 309
1341 309 234 870 -745 1551 135 -339 416 1447 -832 -1317 1590 -209 -1051 -1016 1063 -684 744
1358 744 869 -726 370 151 1573 -1734 1623 830 -997 -137 1593 -363 -1708 2600 -364 -952
1374 -952 -607 1796 -785 -1850 2087 -435 -1467 111 2052 -2259 323 2378 -947 -1044 1533 771
1390 771 -4149 1097 3024 -1986 -1419 2264 -368 -2885 2126 886 -2853 184 2136 -2138 -1740 3577
1406 3577 -766 -2027 1373 3918 -4413 -172 3507 -2032 -1412 2349 996 -4093 1658 2925 -2533
$$ packed form
1290a698L015j912J009j726J875p5j184Q72K80M66k030J556j101J764l37j139
1306c65O58p25J168k140J594J210j361n63L49R01j248J062o32J518k143J628j233
1323c22L7J196j408P81m02L69n74J1J577j907K25N52J704k719P76Q02j051O62
1341C09p5O36j615K296j416m74P55J031k279m85K907j799q42L5K079j747J428
1358G44J25j595J096k19J422l307L357p93j827Q60J730j956j345M308k964n88
1374i52L45K403k581j065L937k522j032J578J941m311K582K055l325r7K577p62
1390G71m920N246J927n010N67L683k632k517N011j240l739L037J952m274L98N317
1406C577m343j261L400K545q331M241L679n539O20L761j353n089N751J267n458
$$ plain form
1421 -2533 -233 3601 -1910 -2462 3936 1120 -4671 436 4728 -2897 -2770 5051 -374 -3062 1892
1436 1892 3119 -4743 339 4157 -2420 -2586 3411 892 -5461 4305 3433 -5690 -514 5416 -1604
1451 -1604 -4817 5273 1144 -5407 641 4060 -3760 -3224 5575 -1209 -4181 3153 3159 -6774 858 5545
1467 5545 -4472 -3775 5269 1252 -7616 3588 3851 -5930 -1769 6047 -2678 -5172 5998 1288 -5806
1482 -5806 2373 5561 -6610 -2800 7237 -2742 -6442 6092 3512 -8265 821 8228 -4589 -4856
1496 -4856 7747 1068 -8208 4983 4601 -7192 -807 8480 -4162 -7072 7007 1265 -9227 3031
1510 3031 7415 -8017 -4427 9376 -2470 -7789 6546 4389 -9849 1511 7850 -6805 -5186
1523 -5186 8867 -509 -10025 6471 4899 -10515 -1039 10734 -4727 -8339 9412 1285 -10850
$$ packed form
1421b533K300L834n511n52O398k816n791N107M292p625J27P821n425k688M954
1436A892J227p862N082L818o577j66N997k519o353R766q72r123N176N930p020
1451a604l213J0090m129o551O048L419p820N36Q799o784k972P334Or933P632M687
1467E545j0017O97R044m017q868J1204K63r781M161P816q725k494J1170m710p094
1482e806Q179L188j2171L810J0037r979l700J2534k580j1777R086P407j2817k67
1496d856J2603o679r276J3191l82j1793O385R287j2642k910J4079n742j0492J2258
1510C031M384j5432L590J3803j1846n319J4335k157j4238J1360O339j4655J619
1523e186J4053r376r516J6496j572j5414R476J1773j5461l612J7751q127j2135
$$ plain form
1536 -10850 3685 8261 -9194 -2675 10505 -4709 -7303 7647 3859 -12297 2357 10459 -7839
1549 -7839 -5436 11888 -1087 -11357 7502 6075 -11136 -1191 11235 -6299 -7662 11543 1600
1562 1600 -11078 4840 9849 -10986 -3214 13470 -3981 -11043 9018 5327 -13752 2384 11596
1575 11596 -9666 -7275 12748 -29 -12399 8450 7423 -13087 299 13771 -8626 -9539 13391
1588 13391 1733 -14003 6703 11148 -12614 -3811 16287 -4376 -10966 11360 5029 -16047 3711
1601 3711 13310 -11574 -6128 14867 -2937 -14388 11093 7563 -15159 -1035 15093 -8491 -9714
1614 -9714 15562 1940 -15352 6411 11300 -14530 -3961 15608 -5419 -12884 13294 5685 -17146
1627 -17146 5143 14448 -14007 -7173 16253 -1607 -16784 12706 9349 -16597 519 16785
$$ packed form
1536a0850J4535M576j7455O519J3180j5214k594J4950l788j6156J4654Q102j8298
1549g839K403J7324j2975j0270J8859j427j7211R945J2426j7534j363J9205r943
1562A600j2678J5918N009k0835P772J6684j7451p062K0061l691j9079J6136R212
1575A1596k1262K391K0023j2777j2370K0849j027k0510J3386J3472k2397r13K2930
1588A3391j1658j5736K0706M445k3762Q803K0098k0663o590K2326o331k1076J9758
1601C711R599k4884N446K0995j7804j1451K5481l530k2722J4124J6128k3584j223
1614i714K5276j3622j7292K1763M889k5830J0569J9569k1027p465K6178p609k2831
1627a7146K2289R305k8455O834K3426j7860j5177K9490l357k5946J7116J6266
$$ plain form
1639 16785 -10815 -10350 16544 -428 -16814 9318 12838 -16493 -2838 18615 -8344 -14873 15653
1652 15653 5773 -19029 5820 15272 -14456 -8060 18465 -2543 -16986 14078 7946 -18477 1443
1665 1443 17678 -10583 -12854 18578 1370 -18930 9955 13489 -18333 -4003 19587 -8344
1677 -8344 -13548 15753 5181 -20482 6022 16351 -15069 -7053 19882 -4780 -18938 15079
1689 15079 8581 -20810 1510 19380 -12865 -11918 18683 -677 -20139 9768 13553 -19384 -1767
1702 -1767 20201 -10045 -15686 17950 4948 -21692 7489 16896 -17046 -7369 21134 -4044 -19761
1715 -19761 15936 8654 -20921 1930 19752 -13685 -12034 21593 -675 -20773 12232 14525
1727 14525 -21195 -2321 21300 -10194 -15637 19265 4981 -22201 8564 18052 -17631 -8302
$$ packed form
1639A6785k7600M65K6894j6972j6386K6132L520k9331J3655K1453k6959o529L0526
1652A5653r880k4802K4849R452k9728O396K6525k1008j4443L1064o132k6423J9920
1665A443J6235k8261k271L1432j7208k0300K8885L534l1822J4330K3590k7931
1677h344n204K9301j0572k5663K6504J0329l1420Q016K6935k4662j4158L4017
1689A5079o498k9391K2320J7870l2245R47L0601j9360j9462K9907L785l2937J7617
1702a767K1968l0246n641L3636j3002k6640K9181R407l3942R677K8503k5178j5717
1715a9761L5697p282k9575K2851J7822l3437J651L3627k2268k0098L3005K293
1727A4525l5720J8874K3621l1494n443L4902j4284k7182L0765R488l5683R329
$$ plain form
1739 -8302 21869 -5475 -20143 17666 8623 -22886 3242 19987 -16046 -12076 21876 -2201
1751 -2201 -21265 12528 14840 -20796 -1761 22342 -10525 -15555 19480 4889 -23198 8822
1763 8822 17692 -18607 -6791 23199 -5883 -19319 17526 9478 -23300 2348 21293 -13980
1775 -13980 -13183 22492 -898 -21314 13981 14784 -21822 -1039 23048 -12428 -15791 20879 4131
1788 4131 -23552 10310 17437 -20253 -6144 23479 -7004 -20272 19127 7931 -22230 3931
1800 3931 20721 -16353 -10899 24141 -1135 -21294 12761 14916 -23366 -1287 23285 -11644
1812 -11644 -15605 20915 3332 -23119 9832 16789 -18662 -7079 22662 -6827 -19215 19153
1824 19153 8992 -22935 3594 21440 -16220 -11491 23272 -1688 -21966 13989 14777 -22355
$$ packed form
1739h302L0171k7344j4668L7809r043l1509K6128J6745l6033L970L3952k4077
1751b201j9064L3793K312l5636J9035K4103l2867n030L5035j4591k8087L2020
1763H822Q870l6299J1816K9990k9082j3436L6845q048l2778K5648J8945l5273
1775a3980P97L5675k3390k0416L5295Q03l6606K0783K4087l5476l363L6670j6748
1788D131k7683L3862P127l7690J4109K9623l0483j3268L9399j1196l0161K6161
1800C931J6790l7074N454L5040k5276k0159L4055K155l8282K2079K4572l4929
1812a1644l961L6520j7583k6451L2951O957l5451J1583K9741k9489j2388L8368
1824A9153j0161l1927K6529J7846l7660M729L4763k4960k0278L5955P88l7132
$$ plain form
1836 -22355 -394 22332 -12405 -15040 21106 3568 -23232 10193 16591 -20660 -5421 23232
1848 23232 -7384 -20053 18608 7757 -23454 5235 19903 -16828 -11368 23006 -2387 -21679
1860 -21679 13574 12654 -22179 -707 21647 -12951 -15481 20522 3600 -23166 8695 16459 -19143
1873 -19143 -5943 23125 -7450 -18378 17884 8264 -21323 5147 20522 -17125 -10510 22603
1885 22603 -2959 -20819 14250 13314 -22241 270 20928 -12292 -13815 20167 2578 -21264
1897 -21264 11086 16243 -18623 -4365 21717 -7756 -17871 17857 6498 -21882 4632 19413
1909 19413 -16593 -10455 21524 -2921 -19220 12918 12316 -20425 574 20614 -10886 -12823 18969
1922 18969 2326 -19946 10691 15081 -18575 -4561 21400 -7828 -16139 17142 6674 -20365
$$ packed form
1836b2355K1961K2726l4737k635L6146j7538k6800L3425O398l7251J5239K8653
1848B3232l0616j2669L8661j0851l1211K8689J4668l6731N460L4374k5393j9292
1860b1679L5253r20l4833K1472K2354l4598k530L6003j6922k6766L1861P764l5602
1873a9143J3200K9068l0575j0928L6262r620k9587K6470J5375l7647O615L3113
1885B2603k5562j7860L5069r36l5555K2511K0658l3220j523L3982j7589k3842
1897b1264L2350N157l4866J4258K6082k9473j0115L5728j1359k8380K6514J4781
1909A9413l6006O138L1979k4445j6299L2138o02l2741K0999K0040l1500j937L1792
1922A8969j6643k2272L0637M390l3656J4014K5961k9228q311L3281j0468k7039
$$ plain form
1934 -20365 4355 18196 -15721 -8155 20903 -3564 -18097 13805 10626 -20215 1795 19119
1946 19119 -12673 -11916 19076 1515 -19913 10528 14689 -16789 -3642 19549 -7578 -14716 15773
1959 15773 5763 -18235 4142 16450 -14100 -7771 20431 -2928 -17728 12442 10880 -18591
1971 -18591 259 17939 -10735 -12016 16531 1748 -18094 9298 12076 -16289 -2592 18278
1983 18278 -6941 -13817 15513 4843 -18035 4896 14978 -13850 -7677 17971 -4145 -15947
1995 -15947 12291 9178 -17555 1126 15955 -10430 -10265 16594 751 -17319 9888 11569 -14700
2008 -14700 -2686 17905 -6894 -13064 14738 4756 -16552 4304 14027 -12555 -6323 15602 -2686
2021 -2686 -14470 10580 8421 -16172 1100 14840 -9406 -9852 14818 1589 -16039 7719 9952
$$ packed form
1934b0365K4720J3841l3917P566K9058k4467j4533L1902l179l0841K2010J7324
1946A9119l1792P57L0992j7561k1428L0441M161l1478J3147K3191k7127p138L0489
1959A5773j0010k3998K2377J2308l0550O329K8202k3359j4800L0170j562k9471
1971a8591J8850J7680k8674j281K8547j4783j9842K7392K778k8365J3697K0870
1983A8278k5219o876K9330j0670k2878K2931J0082k8828O173K5648k2116j1802
1995a5947K8238l113k6733J8681J4829k6385J65K6859j5843j8070K7207J681k6269
2008a4700J2014K0591k4799o170K7802r982k1308K0856R723k6582O232K1925j8288
2021b686j1784K5050k159k4593J7272J3740k4246m46K4670j3229j7628K3758K233
$$ plain form
2034 9952 -13705 -3143 15572 -6588 -10954 13163 3656 -14600 4853 11965 -11150 -4403 15539
2047 15539 -3846 -12807 9676 6950 -14595 1635 13936 -8377 -8241 12274 1145 -13836 7752
2060 7752 8120 -11644 -2429 13338 -5455 -10504 11121 3333 -12793 3812 11125 -10491 -4614
2073 -4614 13234 -2202 -11592 8268 5851 -12754 1661 11832 -8404 -6616 11968 -418 -12431
2086 -12431 7209 7886 -10854 -1993 12747 -4812 -8627 10432 1508 -10928 3233 9420 -8121
2099 -8121 -3585 11806 -2765 -9022 8812 4859 -10906 2343 10575 -6418 -5847 10872 191
2112 191 -10980 6112 6222 -9464 -1101 10407 -4826 -6993 9001 1520 -9869 3647 7713
2125 7713 -9139 -2258 9106 -2646 -7786 7255 3154 -9399 1344 8592 -6323 -5021 8236
$$ packed form
2034I952k3657J0562J8715k2160m366K4117r507j8256J9453P112k3115O747J9942
2047A5539j9385q961K2483k726k1545J6230J2301k2313J36K0515j1129j4981K1588
2060G752L68j9764R215J5767j8793n049K1625p788j6126J6605P313k1616N877
2073d614J7848j5436r390J9860k417j8605J4415J0171k0236J788J8584j2386j2013
2086a2431J9640O77j8740Q861J4740j7559l815J9059q924j2436J4161O187j7541
2099h121M536J5391j4571o257J7834l953j5765J3249Q232j6993N71J6719j0681
2112A91j1171J7092J10j5686Q363J1508j5233k167J5994p481j1389J3516M066
2125G713j6852O881J1364j1752n140J5041m101j2553J0743P248j4915J302J3257
$$ plain form
2138 8236 -27 -8757 5176 5400 -7692 -714 8920 -4505 -6457 7943 1534 -8916 2559 6589
2152 6589 -7138 -2274 7969 -2175 -7073 5726 4034 -7960 1822 6952 -5694 -4175 7204
2165 7204 -723 -7467 5365 4806 -7706 -1433 8009 -3034 -5237 6762 2244 -6144 2856 5545
2179 5545 -6056 -1628 7214 -2539 -5450 4023 2852 -6376 1024 6055 -4527 -2993 5758 92
2193 92 -6101 3990 2686 -5414 -1722 7382 -3500 -4036 5479 781 -5297 2092 4246 -4780 -1406
2208 -1406 6268 -2294 -4514 4218 2081 -5794 935 5157 -3489 -3230 4490 45 -5250 3208 2418
2223 2418 -4274 1 5014 -3364 -3477 4861 1200 -4297 1193 4187 -4743 -1340 4778 -1470 -3296
2238 -3296 3558 1714 -4773 1085 3733 -3346 -2433 4582 -158 -3866 2728 2240 -3521 -788 4496
$$ packed form
2138H236q263q730J3933K24j3092O978R634j3425j952J4400o409j0450J1475M030
2152F589j3727M864J0243j0144m898J2799j692j1994R782N130j2646J519J1379
2165G204p927o744J2832n59j2512O273R442j1043k203J1999m518q388R000K689
2179E545j1601M428Q842r753k911R473j171r228P400N031j0582J534Q751n666
2193I2o193J0091j304q100L692R104j0882n36R515m698o078P389K154r026L374
2208a406P674q562k220Q732k137p875O729M222q646K59P720m445n295Q458p90
2223B418o692M275N013q378j13Q338l661n497N490K994q930L403O118o248j826
2238c296O854j844o487N858K648p079R13P015m740l708O594m88n761K733N284
$$ plain form
2253 4496 -1481 -2583 3697 -36 -3118 484 2732 -3356 -873 2863 -238 -2736 2697 1259 -4514
2268 -4514 -18 2488 -1809 -1754 3568 143 -3606 1177 1370 -2309 -124 3521 -1952 -2812 2170 482
2284 482 -3021 598 1812 -2640 -921 2613 -972 -2322 1943 1394 -3476 859 2290 -2349 -1346
2299 -1346 3182 -107 -2518 2040 1439 -1561 487 2752 -1388 -1725 2583 -256 -2193 880 1379 -2306
2315 -2306 -1 1824 -1272 -1260 509 1245 -2395 709 568 -1126 -1341 1801 -293 -1878 1424 428
2331 428 -1759 92 1453 -1108 -928 1797 675 -1940 309 1408 -1652 320 1210 -888 -736 1464
2347 1464 411 -2184 1372 273 -536 -865 832 -416 -1269 2140 258 -700 -1006 239 -595 -626 743
2364 743 -541 -1040 606 1800 -953 -1440 924 15 -255 939 -130 -1241 -158 786 -690 -299 570
$$ packed form
2253D496n977j102O280l733l082L602K248o088K483L736l101k498N433j438n773
2268d514M496K506m297N5N322l425l749M783J93l679K185L645n473q60M982j688
2284D82l503L619J214m452J719L534l585j350M265n49m870M335J431m639J003
2299a346M528l289k411M558o01l000K048K265m140l37M308k839j937L073M99l685
2315b306K305J825l096J2J769P36l640L104j41j694k15L142k094j585L302r96
2331D28k187J851J361k561J80K725j122k615K249J099l060J972Q90k098J52K200
2347A464j053k595L556j099q09l29J697j248q53L409j882r58l06J245q34l1J369
2364G43j284m99J646J194k753m87K364r09k70J194j069j111J083R44j476L91Q69
$$ plain form
2381 570 -1000 -923 851 -289 -89 71 336 -838 -557 758 -311 -16 315 851 -1625 374 1048 -647
2399 -647 170 486 212 -982 586 236 -497 666 495 -629 -78 1299 207 -796 382 577 226
2416 226 -1131 863 -794 -872 -884 -32 -412 -111 563 -494 -299 318 168 -422 -109 43 -609 -314 842
2435 842 308 -3 112 -234 -279 -553 191 -834 -207 565 -626 17 520 985 -668 356 41 97 344
2454 344 -52 1008 -423 826 -19 481 -227 347 -776 -170 592 -958 593 526 119 -938 -211 -296
2472 -296 -310 -203 808 1116 -652 210 -155 -318 -480 168 344 144 -378 -254 1373 -524 966 -528
2490 -528 203 517 -250 1053 -293 955 -561 -429 226 -16 29 609 676 570 685 -657 826 -170 -479
2509 -479 283 -400 465 93 558 -310 -3 -261 -253 1042 -69 -428 -699 388 333 320 -306 -470 270 -400
$$ packed form
2381E70j570P7J774j140K00J60K65j174K81J315j069K95L31N36k476J999O74j695
2399f47Q17L16k74j194J568l50p33J163j71j124N51J377j092j003J178J95l51
2416B26j357J994j657p8j2Q52l80L01O74j057J95O17j50n90L13J52o52K95J156
2435H42n34l11J15l46m5k74P44j025O27P72j191O43N03M65j653J024l15N6K47
2454C44l96J060j431J249q45N00p08N74j123O06P62j550J551o7m07j057P27q5
2472b96j4J07J011L08j768Q62l65j63j62O48J76k00n22J24J627j897J490j494
2490e28P31L14p67J303j346J248j516J32O55k42M5N80O7j06J15j342J483r96l09
2509d79P62o83Q65l72M65q68L07k58QJ295j111l59k71J087n5j3o26j64P40o70
$$ plain form
2529 -400 -89 51 570 -183 497 -810 -882 -146 361 -443 -405 101 -711 266 360 -339 284 -231 326 353 182
2550 182 128 436 -735 -83 257 92 319 360 312 257 -58 -131 567 611 -469 409 87 76 -329 552 -153 -101
2572 -101 -77 38 -125 349 241 -7 -938 700 899 557 -275 341 -525 81 48 -528 -43 -54 -158 87 361
2593 361 -236 568 -250 403 -607 107 -15 -4 -555 -37 67 45 447 -263 457 609 819 6 -114 -320
2613 -320 149 192 -595 -210 372 391 155 -290 -285 -488 -501 151 59 1211 -101 187 -367 -187 -114 18 409 927
2635 927 10 -289 62 -1070 -89 271 -77 295 -57 -322 54 560 223 63 -383 1111 -532 -958 455
2654 455 438 153 165 818 -234 1092 -424 392 226 821 -493 79 959 -1358 -8 -575 207 -629 -206
2673 -206 290 410 159 -283 470 166 -879 -534 -355 -143 -459 1118 -375 219 -18 282 -615 756 941
$$ packed form
2529d00L11J40N19p53O80j307p2P36N07q04L8N06q12R77R4o99O23n15N57K7j71
2550A82n4L08j171O52L40j65K27M1m8n5l15p3O98M4j080Q78l22j1m05Q81p05N2
2572a01K4J15j63M74j08k48r31J638J99l42q32O16q66O06l3n76M85j1j04K45K74
2593C61n97Q04q18O53j010P14j22J1n51N18J04k2M02p10P20J52K10q13j20k06
2613c20M69M3p87L85N82J9k36m45Nk03j3O52r2J152j312K88n54J80P3J32L91N18
2635I27r17k99L51j132R81L60l48L72l52k65L76N06l37j60m46J494j643m26J413
2654D55j7k85J2O53j052J326j516Q16j66N95j314N72Q80k317J350n67P82q36M23
2673b06M96J20k51m42P53l04j045L45J79K12l16J577j493N94k37L00q97J371J85
$$ plain form
2692 941 522 -409 -258 289 71 13 -159 -297 -80 -268 436 317 811 -284 -520 590 -110 -79 -396 207
2712 207 -619 -284 -162 -126 -132 -468 205 -763 -272 -324 -1003 424 -208 -40 491 1265 -69 266 101 893 -670
2733 -670 -657 -427 503 -600 56 -246 179 530 -576 266 -952 -14 244 -159 -645 284 18 392 591
2752 591 578 -193 219 -253 -238 -433 -66 587 -130 350 306 -577 -379 -756 -286 609 -4 -456 -708 -45 434
2773 434 -428 -131 194 680 -484 164 723 -837 -585 290 314 -1168 699 -113 -17 165 265 -235 654
2792 654 372 -695 -608 181 557 -305 150 -254 -117 -1 -586 -79 641 561 307 -178 190 -99 -100 -185 555
2813 555 375 26 -291 537 83 -694 828 243 736 -524 873 -539 -372 1059 -66 235 -81 713
2831 713 -215 281 455 -799 140 -416 -198 -204 455 -967 -176 -761 -120 -274 -433 -419 -973 319 235 -262
$$ packed form
2692I41m19r31J51N47k18n8j72j38K17j88P04j19M94j095k36J110p00L1l17O03
2712B07q26L35J22L6ol36O73r68M91n2o79J427o32J68N31P74j334L35j65P92j563
2733f70J3K30R30j103O56l02M25L51j106Q42j218R38K58m03m86R29k66L74J99
2752E91j3p71M12m72J5j95L67O53p17M80m4q83J98l77M70Q95o13m52k52O63M79
2773D34q62K97L25M86j164O48N59j560K52Q75K4j482J867q12R6J82J00n00Q89
2792F54k82j067Q7P89L76q62M55m04J37J16n85N07P20q0k54m85L68k89jq5P40
2813E55j80l49l17Q28m54p77J522n85M93j260J397j412J67J431j125L01l16P94
2831G13r28M96J74j254R39n56K18oO59j422P91n85O41j54j59J4n54J292q4m97
$$ plain form
2851 -262 -725 570 344 -7 -609 259 628 -238 14 -128 -38 -101 -79 751 675 648 -521 -546 993 -1012 266
2872 266 681 576 -296 -564 -517 -399 -323 -404 54 -11 314 -1347 426 -377 -267 156 482 -1250 -368 -163
2892 -163 -617 347 12 460 194 669 452 400 -1151 -594 -100 -243 743 -730 32 -780 -539 -703 438
2911 438 824 -179 409 166 -171 -518 -546 -60 -615 -223 -597 780 267 -13 -368 -340 512 572 637 -59 568
2932 568 -158 -44 335 211 314 -425 289 -471 -219 -368 -594 412 -454 507 22 59 -128 -394 -82 410
2952 410 46 -767 -39 55 -553 195 499 -533 141 80 172 454 -205 -193 30 974 288 820 30 -1069 80
2973 80 -505 630 -918 -71 -208 -852 184 -719 99 -620 223 -47 -989 -266 402 -102 -976 -658 457
2992 457 -347 -535 722 -650 -319 -566 -223 501 367 585 449 120 -775 505 94 181 157 -541 552
$$ packed form
2851b62m63J295k26l51o02Q68L69q66K52j42R0o3K2Q30p6k7j169k5J539k005J278
2872B66M15j05q72k68M7J18P6q1M58o5L25j661J773q03J10M23L26j732Q82K05
2892a63m54R64l35M48k66M75k17n2j551N57M94j43R86j473P62q12K41j64J141
2911D38L86j003N88k43l37l47k8M86n55L92l74J377n13k80l55K8Q52O0O5o96O27
2932E68p26J14L79j24J03p39P14p60K52j49k26J006q66R61m85L7j87k66L12M92
2952D10l64q13P28R4o08P48L04j032O74o1R2K82o59J2K23R44o86N32p90j099J149
2973H0n85J135j548Q47j37o44J036r03Q18p19Q43k70r42P23O68n04q74L18J115
2992D57q04j88J257j372L31k47L43P24j34K18j36l29q95J280m11Q7k4o98J093
$$ plain form
3011 552 -270 105 -338 367 904 -56 -66 -128 -747 23 551 -342 478 615 318 483 356 172 -1112 768
3031 768 1216 1063 -692 -197 74 970 507 -830 517 -454 671 653 -160 73 320 -255 -392 123 486
3050 486 212 1066 424 -221 402 -16 -1284 -22 27 -269 -213 -757 -398 200 -84 179 -205 32 -19 205
3070 205 38 362 -85 -373 -658 524 -7 165 192 -38 774 -188 -45 49 -253 -472 -141 630 696 -615
3090 -615 760 -586 -632 -80 -285 145 -74 781 -232 -555 -230 -170 -162 -487 448 -279 392 233 138 -204 -353
3111 -353 3 135 -18 672 36 -48 -598 370 -458 766 -463 29 105 -937 141 -248 -680 -504 632
3130 632 -47 788 978 -674 -252 -42 439 -171 -381 86 -653 -493 285 -63 -82 -209 252 -52 157 -40
3150 -40 -251 -161 538 -291 319 -301 700 -195 -466 -987 130 468 -31 -204 -433 -442 -649 648 -471 575
$$ packed form
3011E52q22L75m43P05N37r60j0o2o19P70N28q93Q20J37k97J65j27j84j284J880
3031G68M48j53j755M95K71Q96m63j337J347r71J125j8q13K33K47n75j37N15L63
3050D86k74Q54o42o45O23m18j268J262M9k96N6n44L59N98k84K63l84K37n1K24
3070B05j67L24m47k88k85J182n31J72K7k30Q12r62J43R4l02k19L31P71O6j311
3090f15J375j346m6N52k05M30k19Q55j013l23L25O0Ql25R35p27O71j59r5l42j49
3111c53L56J32j53O90o36q4n50R68q28J224j229M92P6j042J078l89m32J76J136
3130F32o79Q35J90j652M22K10M81o10k10M67p39J60P78l48j9j27M61l04K09j97
3150d0k11R0O99q29O10o20J001q95k71n21J117L38m99j73k29rk07J297j119J046
$$ plain form
3170 575 391 -425 -419 476 2 -408 -522 437 93 -168 290 -994 40 385 -360 -194 152 217 -652 581
3190 581 467 -813 -291 105 354 -985 672 1083 -1032 910 -291 46 -510 39 -3 -327 1199 655
3208 655 950 -45 541 -616 363 929 -395 -356 -478 536 -1306 974 78 112 -108 618 580 -501 391
3227 391 550 -480 21 347 96 -1722 319 543 -786 842 1572 253 -264 715 597 -1309 -282
3244 -282 520 -668 256 250 218 -758 339 93 -246 385 -279 -757 -1167 762 420 -22 -314 -261 -498 -152
3264 -152 1364 -783 -210 -7 384 -912 296 793 -575 -1365 885 20 -1117 142 -192 112 586
3281 586 451 -485 -366 326 1092 -920 1148 -428 -517 498 1372 -702 -829 298 -285 -1193 520 -26
3299 -26 -865 313 112 254 -1279 1021 1340 -855 1267 711 -77 256 670 443 -1530 670 308 161
$$ packed form
3170E75j84q16OQ95m74m10j14R59l44k61M58j284J034L45p45J66L46O5q69J233
3190E81j14j280N22L96K49j339J657M11k115J942j201L37n56N49m2l24J526n44
3208F55K95r95N86j157R79N66j324L9j22J014j842K280q96L4k20P26l8j081Q92
3227C91J59j030N01L26k51j818K041K24j329J628P30j319n17R79j18j906J027
3244b82Q02j188R24ol2r76J097k46l39O31o64m78m10J929l42m42k92N3k37L46
3264a52J516k147N73K03L91j296J208M97j368p90K250q65j137J259l34L04M74
3281E86j35r36J19O92P66k012K068j576q9J015Q74k074j27J127n83r08J713n46
3299b6q39J178k01J42j533K300L19k195K122n56p88L33M14k27j973K200l62j47
$$ plain form
3317 161 29 78 -216 -455 1426 500 -850 839 589 -1103 -565 1701 -510 -590 72 -112 -295 577 990
3336 990 -467 -710 1535 -834 -628 429 -550 -1030 337 716 -846 -428 437 307 -702 820 514
3353 514 -507 -71 1729 -8 -911 1086 -273 -935 230 -85 -1029 427 1114 102 -1647 1583 779
3370 779 -1573 -49 565 -574 343 858 -1430 -1290 1256 1336 150 747 1130 -1021 -508 1440 -116
3387 -116 -1555 638 1387 -1042 -153 1931 -2 -1823 1137 757 -807 915 550 -1567 -717 1260
3403 1260 136 -798 396 503 -1242 358 1010 -511 -1115 760 59 -998 861 654 -1048 -680 2201
3420 2201 -414 -480 1237 -836 -619 1303 1700 -1076 519 1120 -176 -1897 735 1177 -680 1012
3436 1012 1696 -891 -1015 1438 -1243 -758 737 1055 -1748 -994 1143 -513 -639 1851 537 -1200
$$ packed form
3317A61j32M9k94k39J881r26j350J689k50j692N38K266k211q0O62j84j83Q72M13
3336I90j457k43K245k369K06J057r79m80J367L79j562M18Q65j30j009J522l06
3353E14j021M36J800j737r03J997j359o62J165l15r44J456O87j012j749L230q04
3370G79k352J524O14j139R17N15k288J40K546Q0j186N97L83k151N13J948j556
3387a16j439K193P49k429Q89K084j933j821K960l80j564J722l65k117Q50J977
3403A260j124r34J194J07j745J600O52j521o04J875p01j057J859k07j702L68K881
3420B201k615o6J717k073K17J922L97k776J595O01j296j721K632M42j857J692
3436A012O84k587j24K453k681M85J495L18k803P54K137j656j26K490j314j737
$$ plain form
3452 -1200 727 1170 -1233 -454 1281 428 -725 1337 148 -1799 245 1585 -1051 -711 2276 1299
3468 1299 -1496 848 962 -1046 320 1689 -560 -1851 1239 311 -1335 660 1340 -1097 -962 911
3484 911 -909 -1762 908 561 -1541 -136 1304 -702 -1176 1333 -109 -2110 706 834 -2175 -705
3500 -705 978 -863 -695 1746 8 -1684 212 1161 -1605 399 905 -353 -1093 1659 874 -1296
3516 -1296 884 767 -817 -680 1448 255 -705 846 905 -1183 -214 1648 -594 -1196 1146 383 -1725
3533 -1725 1090 1276 -2273 -405 753 -417 -1766 641 181 -1382 882 1181 -910 150 1659 186
3549 186 -792 1160 1377 -1798 901 2261 -1006 -795 1569 602 -1086 1060 476 -850 -48 1681 -410
3566 -410 -1102 1427 534 -1438 -266 1274 -576 -198 1114 -420 -1100 879 705 -1816 -260 1044
$$ packed form
3452a200J927M43k403P79J735q53j153K062j189j947K044J340k636L40K987r77
3468A299k795K344J14k008J366J369k249j291L090r28j646J995O80k437J35J873
3484I11j820q53K670l47k102J405J440k006m74K509j442k001K816J28l009J470
3500g05J683j841J68K441j738j692J896R49k766K004N06j258p40K752p85k170
3516a296K180j17j584J37K128j193r60J551N9k088R69J862k242o02K342p63k108
3533a725K815J86l549J868J158j170j349K407m60j563K264K99k091J060J509j473
3549A86r78J952K17l175K699J360l267K11K364r67j688K146n84j326Q02J729k091
3566d10o92K529q93j972J172J540j850L78J312j534o80J979j74k521J556J304
$$ plain form
3582 1044 -1008 -880 1245 109 -1220 456 474 -2110 100 2371 290 -1132 1834 144 -1359 1115
3598 1115 1433 -615 -529 1837 108 -1075 228 1190 -1828 622 1183 -362 -792 1281 64 -1345
3614 -1345 1394 2059 -1887 -605 1607 3 -858 1317 627 -1755 493 1101 -972 -379 1910 -75
3630 -75 -1961 809 187 -1677 -57 1763 -1298 -1050 2809 -68 -1617 45 733 -2029 -494 1524
3646 1524 -219 -690 1314 -319 -1151 505 898 -1126 -772 1505 -303 -1571 714 30 -1779 354
3662 354 1991 -790 -1069 1556 476 -971 365 1374 -2073 -483 1334 -882 -1408 1734 716 -1573
3678 -1573 341 1302 -1708 -1277 1824 -165 -1189 1621 1404 -1358 681 1354 -929 -919 1462 626 -606
3695 -606 1046 1526 -2056 -538 742 -696 -1708 1243 450 -995 812 1135 -1747 -294 1563 -1208
$$ packed form
3582A044k052J28K125j136j329J676J8k584K210K271k081j422K966j690j503K474
3598A115L18k048Q6K366j729j183J303R62l018K450N61j545m30K073j217j409
3614a345K739O65l946J282K212j604q61K175o90k382K248O08k073N93K289j985
3630g5j886K770o22j864J620J820l061K48L859k877j549J662O88k762J535K018
3646A524j743m71K004j633q32J656L93k024L54K277j808j268K285o84j809K133
3662C54J637k781k79K625j080j447J336J009l447J590J817k216n26L142j018k289
3678a573J914R61l010M31L101j989j024K810k17k762K039O73k283J0K381q36j232
3695f06J652M80l582J518J280j438j012K951p93j445J807L23k882J453J857k771
$$ plain form
3711 -1208 -1355 635 1432 -1322 649 912 -1334 -616 1322 376 -802 859 425 -1357 246 1744
3727 1744 -564 -1513 705 -192 -894 671 1418 -475 -599 1001 -702 -596 989 966 -833 -46 1710
3744 1710 -791 -1106 1161 -592 -1832 954 1000 -1625 335 1281 -663 -697 2040 306 -2109 76
3760 76 255 -1558 625 1841 762 -994 777 -64 -1901 -87 1590 -639 -834 1214 251 -364 1239
3777 1239 1419 -1620 474 1151 -76 -324 2098 -256 -1179 383 23 -1470 -428 1923 -144 -562
3793 -562 1149 507 -943 278 -342 -1509 -1016 964 -401 -1625 875 -342 -726 388 1026 -1518
3809 -1518 -1110 1944 734 -1983 875 863 -568 -1337 1726 -23 -563 1252 839 -418 540 1207 -1445
3826 -1445 -836 1166 -750 -44 1288 813 -1267 -449 939 4 -766 1442 -162 -579 1437 626 -864
$$ packed form
3711a208j47J990P97k754J971K63k246P18J938r46j178J661m34j782J603J498
3727A744k308r49K218q97p02J565P47j893j24J600j703J06J585k3j799P87J756
3744A710k501l15K267j753j240K786M6k625J960R46j944l4K737j734k415K185
3760G6J79j813K183J216j079j756J771q41j837J814J677k229j95K048r63o15J603
3777A239J80l039K094O77j227k48K422k354r23J562l60j493J042K351k067m18
3793e62J711o42j450J221o20j167M93J980j365j224K500j217l84J114O38k544
3809a518M08L054j210k717K858j2j431p69L063j749n40J815m13j257R58O67k652
3826a445O09K002j916P06J332m75k080Q18J388r35p70K208j604m17K016q11j490
$$ plain form
3843 -864 -417 254 -168 -1013 1311 809 -1730 -223 1389 -1326 -60 629 -437 -1325 18 199 -1603
3860 -1603 604 186 -661 -652 892 906 -464 -237 992 -64 -82 637 -452 -1065 1155 596 -831 -496
3878 -496 970 -1359 407 415 -87 -1800 1230 468 -1079 311 522 -425 -997 1980 187 -764 607
3895 607 1455 -470 62 426 -527 -632 403 205 -657 -89 796 -517 277 437 523 -677 948 123 -578
3914 -578 -118 610 -432 -578 181 385 -928 233 499 -1500 -359 -230 -46 713 799 140 -943 -397
3932 -397 -135 -629 -775 793 -158 -1387 48 -694 -635 248 25 -46 39 209 -333 -283 -46 125 -133 294
3952 294 368 -920 -559 263 329 -325 -146 70 -581 -594 223 -185 -690 358 -56 -448 -422 703 -278 32
3972 32 1080 -82 141 466 598 268 -256 1079 511 -985 348 693 -713 -197 -196 -805 278 320 387
$$ packed form
3843h64M47O71m22q45K324n02k539J507J612k715J266O89j066q88J343J81j802
3860a603K207m18q47RJ544J4j370K27J229j056j8P19j089o13K220n59j427L35
3878d96J466k329J766Qn02j713L030p62j547J390K11r47n72K977j793r51J371
3895F07Q48j925N32L64r53j05J035j98q62N68Q85j313P94J60Q6j200J625q25p01
3914e78M60P28j042j46P59K04j313J161K66j999J141J29J84P59Q6o59j083N46
3932c97K62m94j46J568r51j229J435p42N9Q83k23p1Q5J70n42N0K37J71k58M27
3952B94P4j288L61Q22O6o54J79K16o51j3Q17m08n05J048m14l92K6J125r81L10
3972C2J048j162K23L25J32l30n24J335n68j496J333L45j406N16Jo09J083M2O7
$$ plain form
3991 387 16 -737 371 -184 422 848 97 -285 -174 19 -231 -364 707 -517 61 802 -947 -103 -80
4010 -80 -228 -65 420 664 -84 -475 8 -170 -84 352 135 -1255 162 179 -310 168 380 -416 -276 976
4030 976 443 533 146 598 309 240 420 -707 -362 -228 1376 -1537 -623 373 -31 -348 -351 569 -528 81
4050 81 926 -58 -817 495 24 134 248 426 277 -3 660 -165 -1433 -773 -111 -404 687 267 58
4069 58 -23 409 -935 -15 -270 460 -32 -394 364 -656 804 622 438 -536 -44 -237 -608 -68 659 570
4089 570 -898 587 -471 -220 -523 762 -309 -67 4 15 -435 -486 61 84 311 190 -451 -319 290 286
4109 286 -619 64 132 -93 -479 201 577 -961 -384 -182 722 -270 336 124 733 189 3 43 -187 203
4129 203 -1241 -353 -255 410 -677 -73 -184 248 525 -340 912 -315 522 939 -4 269 74 -233 -179
$$ packed form
3991C87l71p53J108n55O06M26p51l82J11J93k50j33J071j224N78P41j749Q44K3
4010h0j48J63M85K44p48l91M83j78Q6M36k17j390J417J7m89M78K12p96J40J252
4030I76n33R0l87M52k89o9J80j127L45J34J604k913R14R96m04l17lR20j097O09
4050H1Q45r84p59J312m71J10J14J78j49k80O63q25j268O60O62k93J091m20k09
4069E8q1M32j344R20k55P30m92l62P58j020J460j82j84r74M92j93l71N40P27q9
4089E70j468J485j058K51l03J285j071K42P1J1m50n1N47K3K27j21o41J32O09m
4109B86r05O83O8k25l86O80L76j538N77K02R04r92O06k12O09n44j86M0k30L90
4129B03j444Q88R8O65j087O04j11M32K77q65J252j227Q37M17r43K73j95l07N4
$$ plain form
4148 -179 1003 319 288 187 450 -454 423 -187 -1079 144 9 -333 96 269 142 -57 -495 -93 229 -218
4168 -218 509 623 24 64 955 630 823 -71 -405 375 104 -688 472 87 -504 190 -32 176 -572 126
4188 126 -801 -641 849 273 1271 -338 -204 17 777 438 -32 122 518 781 -393 305 486 458 1197
4207 1197 -279 -50 391 -407 -156 206 73 -218 997 -429 -160 200 -55 -424 85 -260 -414 678
4225 678 -31 -156 -494 -43 608 721 125 81 494 87 -628 613 -797 -448 -323 468 6 -564 633
4244 633 109 294 -1334 -802 -34 184 -169 -171 577 -700 -259 868 -156 427 144 -288 -240 998 623
4263 623 -572 -847 -339 292 -594 367 432 628 -845 82 696 -110 -677 840 -196 206 -1019 895
4281 895 -204 69 381 -481 -271 -373 -106 91 86 212 -231 -200 -235 783 114 -400 341 495 673 1026 700
$$ packed form
4148a79J182o84l1j01K63r04Q77o10q92J223j35l42M29J73j27j99m38M02L22m47
4168b18P27J14n99M0Q91l25J93q94l34P80k71p92J160l85n91O94k22K08p48O98
4188A26r27J60J490n76R98j609J34K21P60l39m70J54L96K63j174O98J81k8P39
4207A197j476K29M41p98K51L62j33k91J215j426K69L60k55l69N09l45j54J092
4225F78p09j25l38M51O51J13n96m4M13m07p15J241j410L49J25P91m62n70J197
4244F33n24J85j628N32P68K18l53kP48j277M41J127j024N83k83m32M8J238l75
4263F23j195k75N08O31q86R61O5J96j473R27O14q06n67J517j036M02j225J914
4281H95j099K73L12q62K10j02K67J97nJ26m43L1l5J018o69n14P41J54J78L53l26
$$ plain form
4302 700 -353 395 -627 145 175 689 -28 -292 444 -325 -29 -115 472 -972 -479 -48 9 109 343 -661
4322 -661 -158 -35 -259 418 504 -541 -82 -205 -375 -548 -314 -264 293 275 -141 118 -537 658 82 66 549
4343 549 -447 -109 345 331 211 -714 -57 362 390 250 293 -619 -327 -239 268 -344 -378 -433 275 -555 677 -356
4365 -356 -483 272 181 39 -384 277 -6 97 -537 94 -18 -139 820 -165 -26 -347 610 -460 -347 483
4385 483 322 -205 240 -105 174 -270 269 257 439 -723 -399 397 -149 -259 939 -410 147 -28 -282
4404 -282 348 147 2 -933 1007 -189 -973 -416 -579 754 -36 631 214 -288 -280 -279 -522 181 43 -254
4424 -254 -305 -449 461 246 -305 577 98 622 426 566 771 -422 -317 -351 432 376 -558 -1490 -307 247
4444 247 253 99 273 -778 240 -986 -326 -368 -671 2 -468 -357 10 717 76 -1177 371 432 789 382
$$ packed form
4302G00j053P48j022P72L0N14p17k64P36p69K96q6N87j444M93M31N7J00K34j004
4322f61N03J23k24O77Q6j045M59j23j70j73K34N0N57j8m16K59o55J195n76j6M83
4343E49r96L38M54j4j20r25O57M19K8j40M3r12K92Q8N07o12l4n5P08q30J232j033
4365c56j27P55r1j42m23O61k83J03o34O31j12j21R59r85J39l21R57j070J13Q30
4385D83j61n27M45l45K79m44N39j2J82j162L24P96n46j10J198j349N57j75k54
4404b82O30k01j45r35J940j196p84N57j63J333p90O67m17n02QJk43P03j38k97
4424b54n1j44R10k15n51Q82m79N24j96J40K05j193J05l4P83n6r34r32J183N54
4444B47Oj54J74j051J018j226O60m2l03O73m70J11L67P07o41j253J548O1L57m07
$$ plain form
4464 382 148 -439 329 -256 100 -165 -90 460 252 -242 579 213 -328 -1335 -369 519 740 405 -90 -241
4484 -241 -464 934 -115 265 -387 161 315 -484 -637 1116 323 -221 -347 333 177 -456 -254 -197 7
4503 7 -49 -471 -144 -432 41 353 676 95 604 497 -237 -422 124 -566 54 290 311 -388 66 429 -586
4524 -586 79 347 -211 271 491 490 -489 336 656 -713 -53 -1261 -77 272 71 -190 -1116 -343 595 117
4544 117 -86 -525 -224 609 97 -296 245 -253 -557 517 423 -198 529 -142 354 -28 59 1004 151 -736
4564 -736 286 -278 105 -97 1176 -35 -577 528 12 -332 461 -235 -472 98 -455 78 188 -1109
4582 -1109 645 403 -152 -44 -753 -1154 -31 -111 311 -41 135 827 -347 -431 -7 209 -268 469 -323
4601 -323 394 -337 -204 -426 442 -341 244 -25 18 255 265 554 -852 -78 606 -531 -450 -256 691 655 235
$$ packed form
4464C82k34n87P68n85L56k65P5N50k08m94Q21l66n41j007R66Q88K21l35m95j51
4484b41k23J398j049L80o52N48J54p99j53J753p93n44j26O80j56o33K02N7K04
4503Gn6m22L27k88M73L12L23n81N09j07p34j85N46o90O20K36K1o99M54L63j015
4524e86O65K68n58M82K20jr79Q25L20j369O60j208J184L49k01k61r26P73R38m78
4544A17k03m39L01Q33n12l93N41m98l04J074r4o21P27o71M96l82Q7R45q53q87
4564g36J022n64L83k02J273j211n42J105n16l44P93o96k37N70n53N33J10j297
4582a109J754k42n55J08p09m01J123q0M22l52J76O92j174q4M24K16m77P37p92
4601c23P17p31J33k22Q68p83N85k69M3K37J0K89j406P74O84j137Q1J94R47l6m20
$$ plain form
4622 235 -297 -495 -273 529 500 -130 346 151 569 -211 -81 785 206 -218 324 382 1070 -305 -1033 -384
4642 -384 -422 -67 543 184 186 -119 -453 165 -514 -372 182 133 434 496 -69 127 213 145 -474 663 -165 609
4664 609 -523 -411 -42 123 437 -88 387 -288 -792 240 -507 53 -705 -495 189 -805 24 530 -588
$$ packed form
4622B35n32j98K22Q02k9o30M76j95M18p80J30Q66n79m24N42N8O88j375p28O49
4642c84l8L55O10l59Kl05l34O18o79J42N54m9L01O2n65J96Q6o8o19J137q28P74
4664F09j132J12L69J65L14n25M75o75n04J032p47N60p58K10O84r94Q29N06j118
$$ [...]
8191a84
##END NTUPLES=NMR FID
##END=
