##TITLE=1H_SA_59.228
 D2O, 8 sc, 
 2.9.2020
##JCAMPDX= 6.0         $$ Bruker NMR JCAMP-DX V2.0
##DATA TYPE= NMR FID
##DATA CLASS= NTUPLES
##ORIGIN= UXNMR, Bruker Analytische Messtechnik GmbH
##OWNER= root
$$ XWIN-NMR		Version 3.5
$$ Wed Sep  2 08:35:13 2020 Russian Standard Time (UT+4h)  she@DPX200
##.OBSERVE FREQUENCY= 200.1315066352
##.OBSERVE NUCLEUS= ^1H
##.DELAY= (6, 6)
##.ACQUISITION MODE= SIMULTANEOUS
##.ACQUISITION SCHEME= undefined
##.AVERAGES= 8
##.DIGITISER RES= 18
##SPECTROMETER/DATA SYSTEM= spect
##.PULSE SEQUENCE= zg30
##.SOLVENT NAME= D2O
##.SHIFT REFERENCE= (INTERNAL, D2O, 0, 15.7039)
##AUDIT TRAIL= $$ (NUMBER, WHEN, WHO, WHERE, WHAT)
$$ ##TITLE= Audit trail, XWIN-NMR		Version 3.5
$$ ##JCAMPDX= 5.01
$$ ##ORIGIN= Bruker BioSpin GmbH
$$ ##OWNER= she
$$ F:/spectra/data/she/nmr/H-F/1/audita.txt
$$ ##AUDIT TRAIL=  $$ (NUMBER, WHEN, WHO, WHERE, WHAT)
(   1,<2020-09-02 08:34:07.59 +0400>,<she>,<DPX200>,
      <created by zg, POWCHK disabled, PULCHK disabled
       configuration hash MD5:
       00 E9 B6 7A A2 85 ED C7 34 08 36 98 17 FE 4E 26
       data hash MD5: 16K
       10 B9 DC 4C 1B B9 2B B3 F1 6A 4F 2A C6 32 23 62>)
$$ ##END=
$$ 
$$ hash MD5
$$ 94 A0 83 42 78 EF C7 2F 2D E1 30 D8 56 85 14 6C
##$RELAX= 
##$RELAX= 
##$RELAX= 
##$RELAX= 
##$RELAX= 
##$RELAX= 
$$ Bruker specific parameters
$$ --------------------------
##$DU= <F:/spectra>
##$EXPNO= 1
##$NAME= <H-F>
##$PROCNO= 1
##$TYPE= <nmr>
##$USER= <she>
##$AMP= (0..31)
100 100 100 100 100 100 100 100 100 100 100 100 100 100 100 100 100 100 
100 100 100 100 100 100 100 100 100 100 100 100 100 100 
##$AQSEQ= 0
##$AQ_mod= 1
##$AUNM= <au_zg>
##$AUTOPOS= <>
##$BF1= 200.13
##$BF2= 200.13
##$BF3= 200.13
##$BF4= 200.13
##$BF5= 200.13
##$BF6= 200.13
##$BF7= 200.13
##$BF8= 200.13
##$BYTORDA= 1
##$CFDGTYP= 0
##$CFRGTYP= 5
##$CHEMSTR= <none>
##$CNST= (0..31)
1 1 145 1 1 1 1 1 1 1 1 1 1 1 1 1 1 1 1 1 1 1 1 1 1 1 1 1 1 1 1 1 
##$CPDPRG= <>
##$CPDPRG1= <>
##$CPDPRG2= <>
##$CPDPRG3= <>
##$CPDPRG4= <mlev>
##$CPDPRG5= <mlev>
##$CPDPRG6= <mlev>
##$CPDPRG7= <mlev>
##$CPDPRG8= <mlev>
##$CPDPRGB= <>
##$CPDPRGT= <>
##$D= (0..31)
0 1.2 0 0 0 0 0 0 0 0.06 0 0.03 0 0 0 0 0.0002 0 0 0 0 0 0 0 0 0 0 0 0 
0 0 0 
##$DATE= 1599021247
##$DBL= (0..7)
120 120 120 120 120 120 120 120 
##$DBP= (0..7)
150 150 150 150 150 150 150 150 
##$DBP07= 0
##$DBPNAM0= <>
##$DBPNAM1= <>
##$DBPNAM2= <>
##$DBPNAM3= <>
##$DBPNAM4= <>
##$DBPNAM5= <>
##$DBPNAM6= <>
##$DBPNAM7= <>
##$DBPOAL= (0..7)
0.5 0.5 0.5 0.5 0.5 0.5 0.5 0.5 
##$DBPOFFS= (0..7)
0 0 0 0 0 0 0 0 
##$DE= 6
##$DECBNUC= <off>
##$DECIM= 32
##$DECNUC= <off>
##$DECSTAT= 4
##$DIGMOD= 1
##$DIGTYP= 9
##$DL= (0..7)
0 120 120 120 120 120 120 120 
##$DP= (0..7)
150 150 150 150 150 150 150 150 
##$DP07= 0
##$DPNAME0= <>
##$DPNAME1= <>
##$DPNAME2= <>
##$DPNAME3= <>
##$DPNAME4= <>
##$DPNAME5= <>
##$DPNAME6= <>
##$DPNAME7= <>
##$DPOAL= (0..7)
0.5 0.5 0.5 0.5 0.5 0.5 0.5 0.5 
##$DPOFFS= (0..7)
0 0 0 0 0 0 0 0 
##$DQDMODE= 0
##$DR= 18
##$DS= 0
##$DSLIST= <SSSSSSSSSSSSSSS>
$$ [...]
##$SUBNAM2= <"">
##$SUBNAM3= <"">
##$SUBNAM4= <"">
##$SUBNAM5= <"">
##$SUBNAM6= <"">
##$SUBNAM7= <"">
##$SUBNAM8= <"">
##$SUBNAM9= <"">
##$SW= 16.880792210976
##$SWIBOX= (0..15)
0 0 2 0 0 0 0 0 0 0 0 0 0 0 0 0 
##$SW_h= 3378.37837837838
##$TD= 16384
##$TD0= 1
##$TE= 0
##$TE2= 300
##$TE3= 300
##$TEG= 300
##$TL= (0..7)
0 120 120 120 120 120 120 120 
##$TP= (0..7)
150 150 150 150 150 150 150 150 
##$TP07= 0
##$TPNAME0= <>
##$TPNAME1= <>
##$TPNAME2= <>
##$TPNAME3= <>
##$TPNAME4= <>
##$TPNAME5= <>
##$TPNAME6= <>
##$TPNAME7= <>
##$TPOAL= (0..7)
0.5 0.5 0.5 0.5 0.5 0.5 0.5 0.5 
##$TPOFFS= (0..7)
0 0 0 0 0 0 0 0 
##$TUNHIN= 0
##$TUNHOUT= 0
##$TUNXOUT= 0
##$USERA1= <user>
##$USERA2= <user>
##$USERA3= <user>
##$USERA4= <user>
##$USERA5= <user>
##$V9= 5
##$VALIST= <valist>
##$VCLIST= <CCCCCCCCCCCCCCC>
##$VD= 0
##$VDLIST= <DDDDDDDDDDDDDDD>
##$VPLIST= <PPPPPPPPPPPPPPP>
##$VTLIST= <TTTTTTTTTTTTTTT>
##$WBST= 1024
##$WBSW= 4
##$XGAIN= (0..3)
0 0 0 0 
##$XL= 0
##$YL= 0
##$YMAX_a= 96373
##$YMIN_a= -101093
##$ZGOPTNS= <>
##$ZL1= 120
##$ZL2= 120
##$ZL3= 120
##$ZL4= 120
##$ABSF1= 10
##$ABSF2= 0
##$ABSG= 5
##$ABSL= 3
##$ALPHA= 0
##$AQORDER= 0
##$ASSFAC= 0
##$ASSFACI= 0
##$ASSFACX= 0
##$ASSWID= 0
##$AUNMP= <proc_1d>
##$AZFE= 0.1
##$AZFW= 0.1
##$BCFW= 1
##$BC_mod= 2
##$BYTORDP= 1
##$COROFFS= 0
##$CY= 11.3945322036743
##$DATMOD= 1
##$DC= 2
##$DFILT= <>
##$DTYPP= 0
##$F1P= 16.9975609425685
##$F2P= -3.02152046262296
##$FCOR= 0.5
##$FTSIZE= 0
##$FT_mod= 4
##$GAMMA= 1
##$GB= 0.15
##$INTBC= 1
##$INTSCL= 1
##$ISEN= 128
##$LB= 0.24
##$LEV0= 0
##$LPBIN= 0
##$MAXI= 10000
##$MC2= 0
##$MEAN= 0
##$ME_mod= 0
##$MI= 1.114404
##$NCOEF= 0
##$NC_proc= 0
##$NLEV= 6
##$NOISF1= 3.799351
##$NOISF2= 2.8
##$NSP= 1
##$NTH_PI= 0
##$NZP= 0
##$OFFSET= 15.70392
##$PC= 1
##$PHC0= -9980.939
##$PHC1= 15.4009
##$PH_mod= 1
##$PKNL= yes
##$PPARMOD= 0
##$PSCAL= 0
##$PSIGN= 0
##$REVERSE= no
##$SF= 200.130013532006
##$SI= 16384
##$SIGF1= 3
##$SIGF2= 2
##$SINO= 400
##$SIOLD= 16384
##$SREGLST= <1H.CDCl3>
##$SSB= 0
##$STSI= 0
##$STSR= 0
##$SW_p= 3612.71676300578
##$SYMM= 0
##$S_DEV= 0
##$TDeff= 0
##$TDoff= 0
##$TI= <>
##$TILT= no
##$TM1= 0
##$TM2= 0
##$TOPLEV= 0
##$USERP1= <user>
##$USERP2= <user>
##$USERP3= <user>
##$USERP4= <user>
##$USERP5= <user>
##$WDW= 1
##$XDIM= 8192
##$YMAX_p= 0
##$YMIN_p= 0
$$ End of Bruker specific parameters
$$ ---------------------------------
##NTUPLES= NMR FID
##VAR_NAME=  TIME,          FID/REAL,        FID/IMAG
##SYMBOL=    X,             R,               I
##VAR_TYPE=  INDEPENDENT,   DEPENDENT,       DEPENDENT
##VAR_FORM=  AFFN,          ASDF,            ASDF
##VAR_DIM=   8192,          8192,            8192
##UNITS=     SECONDS,       ARBITRARY UNITS, ARBITRARY UNITS
##FACTOR=    0.000296,      1,               1
##FIRST=     0,             0,               0
##LAST=      2.424536,      0,               0
##MIN=       0,             -101093,         0
##MAX=       2.424536,      96373,           0
$$ Real data points
##PAGE= N=1
##DATA TABLE= (X++(R..R)), XYDATA
$$ [...]
2238c835J403L484K753j367l862k349J271L759K753j528l860k353J190M131K175
2253C765j325l835k522J478L711K536j363l808k432J175M040K356j286l867k353
2268c730J245L640K638j486l535k532J280L754K442j053l910k230J120L390K895
2283C928j515l498k487J010L753K390r76l802k344J006L450K720j064l582k708
2298c719J037L680K630j101l694k480J045L758K172r24l442k613J054L669K392
2313C464r86l551k366R90L382K610j108l482k301P46L425K575p89l452k556R13
2329b486L121K800p49l597k480O96L615K237n77l173k747Q86L306K436p02l419
2345h33k488Q36L284K668j025l003k726Q29L223K415o35l303k774J148K991K758
$$ y = [-3835, -2432, 1052, 3805, 2438, -1424, -3773, -2502, 1257, 4010, 2482, -1378, -3731, -2541, 1590, 3765, 2440, -1395, -3917, -2439, 1272, 3808, 2445, -1363, -3795, -2620, 1420, 3776, 2490, -1377, -3730, -2485, 1155, 3793, 2307, -1228, -3760, -2480, 1274, 3716, 2663, -1247, -3477, -2357, 1033, 3928, 2413, -1085, -3572, -2562, 1191, 3581, 2605, -1197, -3541, -2535, 915, 3635, 2571, -1011, -3719, -2682, 998, 3628, 2527, -1167, -3647, -2602, 1156, 3328, 2404, -1038, -3651, -2597, 1072, 3464, 2478, -1073, -3439, -2449, 933, 3543, 2435, -1047, -3348, -2602, 823, 3398, 2609, -843, -3399, -2486, 635, 3435, 2686, -911, -3391, -2695, 920, 3157, 2580, -593, -3340, -2454, 852, 3288, 2586, -833, -3321, -2485, 799, 3467, 2442, -561, -3287, -2458, 765, 3180, 2545, -758, -3532, -2384, 607, 3365]
2361C365r47l202k282K91L535K524o29l260k421L94L244K641o14l421k339O45
2377b476L138K448o18k846k934N40L413K335n69l019k604O23L054K592k69l226
2393d18k545N04K918K680m58l217k479N34L073K532m05l120k700O96K890K711
2409C196n66l129k637O39K818K746p07k942k345J86K936K495l87k617k633L72
2425b575K902K717m83k879k597M28K728K617n23k693k576L36K726K662j45l112
2441d67k409N52K880J993J16l075k435J66K809K817m37k819k420P0K750K582j76
2458B497k816k596M45K960K075n0k815k366J93K614K672l14k736k456K00K440
2474e3K840j73k872k578J04K895K623k91k730k541K48K552K763l68k427k536n7
$$ y = [3365, 2418, -784, -3066, -2775, 760, 3284, 2655, -605, -3026, -2632, 612, 3253, 2639, -782, -3121, -2476, 662, 3110, 2492, -354, -3288, -2748, 665, 3000, 2431, -588, -3192, -2569, 485, 3077, 2808, -418, -2963, -2459, 459, 3139, 2681, -536, -3015, -2481, 592, 3124, 2719, -401, -3101, -2405, 485, 3196, 2630, -499, -3136, -2497, 321, 3067, 2360, -582, -2927, -2741, 195, 2690, 2303, -314, -2947, -2575, 327, 3044, 2561, -318, -2915, -2487, 241, 2858, 2335, -358, -2934, -2598, 128, 2790, 2645, -467, -2876, -2324, 556, 2549, 2665, -410, -2845, -2679, 130, 2947, 2510, -309, -2729, -2659, 91, 2673, 2497, -319, -2915, -2470, 490, 2565, 2515, -300, -2666, -2473, 141, 2813, 2499, -237, -2693, -2493, -53, 2787, 2614, -258, -2836, -2732, 163, 2786, 2495, -235, -2776, -2528, 24, 2787, 2419, -8, -2544, -2601]
2491b601K579K787k25k592k285p5K284K783n8k480k603k02K827K421p8k528k429
2508b475R4K391K528J18k707k320k79K608K370J76k585k452K62K312K667j11k549
2525D8k682L05K455K371r9k241k474j98K549K312J5k481k229k3K336K287K95k525
2543B1k375j41K491K342J8k227k444j32K341K490J17k440k365K6K306K315l2k006
2561C05k605k9K167K537J74k165k702K9K095K597p1j834k636l58K408K248M24
2578B584k254k591J3K174K288K09k297k414l31K387K386R1j986k439k47K384K052
2595B009K60k033k271m58K332K133L34j866k460m65K074K498M39k211k346k37
2611b268K036K285L28k306k028p16K196K481K87j999k453l22K054K674r1j978
$$ y = [-2601, -22, 2765, 2540, -52, -2337, -2412, -128, 2655, 2597, 117, -2486, -2688, 139, 2560, 2482, -46, -2475, -2381, 10, 2538, 2656, -51, -2371, -2650, -42, 2328, 2504, -81, -2533, -2271, 41, 2708, 2597, 48, -2634, -2329, 126, 2497, 2398, 157, -2317, -2515, 34, 2346, 2361, -120, -2349, -2372, -36, 2251, 2546, 21, -2354, -2495, -4, 2338, 2356, 129, -2315, -2447, -106, 2384, 2501, 61, -2304, -2278, 28, 2343, 2311, 305, -2300, -2329, -162, 2375, 2549, 384, -2318, -2289, -194, 2403, 2332, 498, -2138, -2496, -88, 2160, 2584, 330, -2261, -2248, -74, 2214, 2423, 126, -2288, -2619, -232, 2154, 2245, 259, -2180, -2427, -43, 2009, 2269, 236, -2035, -2493, -161, 1972, 2306, 440, -2020, -2485, -411, 2087, 2526, 315, -2031, -2268, -232, 2053, 2381, 75, -1953, -2669, -473, 2008, 2295, 296, -2157, -2479, -425, 2249, 2158, 180]
2627A80k211R3J594K414N52k046k758j06J769K418N06j922k280p03K296K229L2
2644B057j652j999p11J626K575K32j698k147o12J797K408N37k175k116k81J434
2660g25K466N08j545k710l79J811K523K36j999j884m10J489K370P91k295k186
2676a939m48J923K001R63k019k313k15J492K129O40j695k274l89J523K418L95
2692B192j662k129p24J745K080Q12j657k467m83J639K216O43j530k422n73J748
2708e72K157O98j583k260p88J644K328L76j197k388n11J565K072O01j376k290
2724a524n77J416K346O72j608k037o99J302K349N48j518k155r55J718K285O33
2740B196j596k036p14J411K076R72j826k047o29J257K371Q60j695k076o27J610
$$ y = [180, -2031, -1938, -344, 2070, 2622, 576, -2182, -2288, -519, 1899, 2405, 483, -1797, -2500, -204, 2025, 2057, 405, -1594, -2305, -679, 1896, 2128, 430, -1717, -2329, -532, 1876, 2413, 238, -1878, -2159, -725, 1741, 2249, 704, -2006, -2385, -574, 1949, 2185, 186, -1698, -2108, -619, 1751, 2542, 247, -1939, -2387, -464, 1537, 2500, 481, -1832, -2047, -555, 1574, 2214, 519, -1755, -2144, -621, 1797, 2192, 530, -1599, -2323, -578, 1502, 2314, 657, -1810, -2293, -654, 1562, 2205, 675, -1747, -2320, -572, 1585, 2283, 700, -1560, -2348, -704, 1624, 2000, 803, -1585, -2096, -531, 1541, 2142, 766, -1524, -2101, -685, 1661, 2333, 725, -1312, -2011, -709, 1640, 2188, 670, -1485, -2440, -722, 1563, 2196, 600, -1436, -2150, -739, 1337, 2309, 483, -1564, -2193, -936, 1435, 2295, 600, -1476, -2103, -493]
2756d93J874P19j416k108o34J365K140P24j416k268q23J530K327O37j509j896
2772a247j031J500J980Q22j284k257p28J444K103M87j059k025o63J255J882R44
2788B123j295k159o98J220K116O48j470j611r22J297K046P51j357j812q00J056
2804h67J948J092j353j926j036J257K306O66j375k000p49J190K208M78j114j780
2820a055q36J279K105M63j186k008n72P05K405R68j374j945r33J129K071O62j177
2837G01j690q11J022K116O12j174k152n61J107J914P64j192j601q38R90J741J153
2854B101j068k093q13R63J824J055j047k098q51J437J655R75j407j493j055J189
2870g26J698P93j046j662p71J075J691P32p71j895j182J089J781R17q51j853p60
$$ y = [-493, 1381, 2100, 684, -1424, -2058, -693, 1447, 2171, 755, -1513, -2336, -806, 1521, 2158, 649, -1247, -2278, -778, 1202, 2024, 740, -1517, -2245, -801, 1302, 1789, 730, -1295, -1958, -703, 1179, 2123, 828, -1331, -2029, -809, 1307, 1955, 485, -1126, -2048, -751, 1295, 2046, 689, -1123, -1923, -867, 1081, 2173, 820, -1106, -2142, -885, 1421, 2087, 712, -1288, -2037, -847, 1361, 1839, 725, -1055, -1891, -612, 1493, 1956, 770, -1238, -1810, -1105, 1300, 2268, 894, -1051, -1984, -855, 1216, 1878, 701, -989, -1800, -778, 1338, 1950, 776, -1376, -1937, -830, 1084, 1848, 656, -945, -1783, -793, 948, 2101, 1033, -1060, -1873, -910, 914, 1969, 922, -1176, -2027, -590, 1065, 2040, 633, -860, -1915, -726, 972, 1765, 719, -943, -1714, -639, 1052, 1784, 1013, -882, -2064, -975, 806, 1723, 872, -981, -1741]
2887a741O95K097Q05p93k114r06J110J653R99o02k388o36J127J423J234r43j696
2904f76j308J213J897O08q27j847q47P45K092Q02j123j345j106Q73J565J067r74
2921H09j795q72R63J486J239q17j989q75Q93J900P02o36j909q98P85J703J033
2938A722p71j835r19P86J939Q17p35j857j017R89J638R24n44j626j408R68J792
2955H63N73o25j860o81Q22J845P53p89j804p49N95J745J108r15j623r12P71J546
2973F63R71o83j458j454J106J556R03n94j795q68P19J560J141p53j637j033Q50
2990h06J418R52o99j614q53M48J797J050q88j541q18Q28J273Q98k66j959p41M42
3008a079J463J142o06j413j128O06J658Q14l61j853j022R08J584J051q61j674
$$ y = [-1741, -1046, 1051, 1856, 1063, -1051, -1957, -847, 806, 1805, 1203, -1185, -1821, -694, 729, 1963, 1020, -676, -1984, -771, 1126, 1734, 907, -940, -1787, -1042, 1050, 1852, 729, -616, -1722, -849, 716, 1783, 809, -986, -1858, -895, 591, 1830, 1013, -976, -1851, -958, 942, 1644, 1008, -901, -1799, -1014, 689, 1722, 951, -884, -1803, -1017, 922, 1739, 1004, -853, -1870, -881, 757, 1681, 1137, -489, -1897, -929, 863, 1436, 811, -1049, -1730, -908, 937, 1690, 901, -903, -1652, -1057, 688, 1796, 881, -742, -1654, -883, 663, 1634, 951, -507, -1961, -855, 701, 1604, 1010, -785, -1653, -934, 626, 1767, 1014, -623, -1656, -806, 612, 1564, 865, -749, -1602, -1154, 643, 1693, 805, -736, -1554, -726, 547, 1445, 1179, -780, -1521, -1079, 384, 1526, 920, -493, -1621, -1015, 643, 1457, 1096, -757, -1779, -871, 713, 1764, 903, -771]
3024g71o52K09J891R24n47j454j142O60J279J103l72j789q91P48J377R72l69j529
3042c53j196L87J724P74m31j201j167L85J594P98l28j355j054K66J739R24o01
3059I05j356j104N68J275J004k54j457j107N01J380J220n14j252j450N92J632
3075E83R16n56j170j304M43J575Q36n31j416p82K85J348J169k44j533j141M22
3092a100J500J038n03j266j255M11J544J139k58j434j178K69J489Q04k24j376
3108d00q72K31J654R11m63j348j166N6J581J319k60j473j068L08J344P56l1j371
3126b92r14K35J393P77j54j167j302M66J292J012n03j094j072L53J220J123l94
3143I79j356o85R6J312J043l76j194j296N43J230J063m79j161j078J50J597R43
$$ y = [-771, -1423, -1214, 677, 1601, 1054, -400, -1542, -882, 397, 1500, 1128, -661, -1552, -804, 573, 1545, 1176, -353, -1549, -1162, 562, 1336, 905, -296, -1463, -1078, 516, 1314, 986, -369, -1423, -1157, 582, 1506, 905, -451, -1555, -987, 288, 1292, 1038, -419, -1526, -1025, 355, 1575, 1061, -191, -1641, -1049, 583, 1499, 943, -227, -1531, -1088, 487, 1323, 792, -624, -1406, -1121, 227, 1396, 1152, -381, -1522, -1100, 400, 1438, 935, -331, -1586, -1175, 369, 1508, 1250, -184, -1362, -1093, 396, 1200, 976, -400, -1272, -1041, 613, 1524, 1061, -287, -1453, -1397, 184, 1503, 1243, -230, -1298, -990, 354, 1110, 1079, -292, -1206, -971, 422, 1199, 1045, -122, -1424, -958, 334, 1346, 843, -251, -1323, -970, 250, 1373, 979, -377, -1062, -966, 346, 1389, 1013, -181, -1477, -934, 296, 1359, 880, -281, -1359, -1209, 388, 1331]
3160A331l50j270r50K38J348Q13k17j187r47L01J211Q98n4j342j100L20J117J032
3178A192k84j337p36P9J451N93R0j415q71J22J414J023k74j115r34p7J254J026
3196A201k76j157q14k91J285J292l50j187p98K4J386P95k94q22j312J45J272R25
3214A024jj109q62M3J034J080M5j465j140J17J212J115j49r91j147J44J109J118
3232A177j84j152r77Q2R16J257k86j192r02K69Q98J466l22j175r46R3Q77J094
3250I93j2j087r37K18Q88Q67J14j107q66j52J164J272m09r46j078K63N67J202
3268I54N4j059o24k26P03J193J76j400p28m3R24J080J6q73j106j81J027Q29M15
3287A131j048j114J06R45R76J41j074j108L3J118O71L7p00j170J40J180P04k0
$$ y = [1331, 981, -289, -1239, -1001, 347, 1160, 943, -244, -1191, -890, 321, 1219, 1165, -177, -1277, -957, 160, 1192, 908, -429, -1165, -1086, 365, 958, 1048, -367, -1238, -1116, 298, 1321, 1047, -68, -1002, -1079, 175, 1201, 925, -232, -1046, -1337, -52, 1240, 890, -297, -1095, -1071, 315, 1110, 816, -6, -1318, -1173, 99, 1024, 1023, -86, -948, -905, 129, 1209, 1254, -211, -1351, -1234, -22, 1093, 944, -47, -1194, -1050, 59, 1177, 993, -159, -1136, -1054, -138, 1119, 833, -359, -1261, -992, -94, 1372, 1050, -125, -1071, -978, -101, 993, 981, -106, -1043, -825, 63, 930, 1044, -63, -929, -1081, 83, 1355, 946, 0, -1078, -815, -248, 954, 1008, -51, -675, -901, -198, 995, 1171, -229, -957, -1000, -76, 1004, 1020, 147, -959, -1140, -113, 716, 1131, 83, -1031, -925, 20, 996, 1137, 63, -1045, -1012, 106, 777, 814, 114, -1056, -916, 264, 968, 948]
3305I48q94r81j65J125O50K61r35j098J36Q96J235j64j029o79n53J265Q94L7r16
3324C3j011K9R86Q97K13r26j415M33O71R90Q4j147q52M9R88O48M19j040j085j05
3344a141J039R64L6o99j104J09P08P91K66j040n63l31J066P19L09q65j069j59
3362i64N82R98K78q93j153m9J117Q13j8p29q63n1P03J013P9n11j112k11J126N79
3382G34K06r66p19J39O20P86K65q65j046n4M72J393o3o97j096p8Q23O75L63o38
3402B54j000n71J316O88M37j228o92j73Q81R78K9j028o99j89O00J313J82r04q94
3421g00l39R78P81O1p75o50l34P93J192K5q36r84q9P33O98K38o11o96j75N51R87
3442H48K2p77o61o51J336N48K37q38r29j64P39R72q1m35r86j89O86J081J33l76
$$ y = [948, 54, -927, -1092, 33, 683, 944, 9, -1089, -953, -57, 1178, 1014, -15, -694, -1247, 18, 912, 949, 33, -978, -949, 37, 934, 1147, 221, -1194, -761, -90, 900, 984, -163, -1015, -966, 22, 670, 1089, 49, -1036, -1141, -102, 862, 898, 199, -905, -796, -88, 703, 969, -71, -634, -965, 101, 820, 1129, 264, -805, -964, -382, 616, 894, 1, -1152, -1201, -84, 729, 711, -18, -881, -932, -229, 784, 863, 352, -760, -971, 155, 734, 940, -26, -745, -606, 14, 800, 1065, 200, -846, -900, -428, 965, 902, 205, -891, -969, -146, 529, 892, 254, -746, -1317, -1, 687, 1124, -104, -796, -969, -88, 890, 919, -109, -808, -997, -397, 916, 1098, 194, -700, -1039, -61, 720, 781, 6, -644, -978, -185, 1007, 1032, 196, -788, -877, -144, 554, 792, 181, -515, -690, -139, 848, 870, 93, -568, -1219, 117, 665, 902, 64, -865, -1029, -290, 682, 601, 166, -820, -1009, -323, 758, 891, 515]
3462E15j313j14P11P96K63q98n66j85O61P51J43l75j121l7P20R62j84l80r17m57
3482a025R21Q05J95p24p28l76O96J132J14n82j023k09M94R50J23n23o63o62Q99
3501a86Q77N6m30j033q9N91O47M06p66m99n59P69R24J62o71r74O6L67Q26L21n36
3522B69p86l22P86P23Q0n81q34J04K03O35P15q27q22n76Q85J235N9o41r16k49
3542h60M86R10L06n92q72k42N46R20K12m57p77n30P19N57L31m35r37l0N41P54
3562E50L29n75q70l48N90P85L40l60p83o17O75O77N05p43p02k62M58P79L58o34
3582A52q52j71K62J062K40n27n90l21K97P38M97l55q81n61M81R24K56m15o00l34
3602f98K83P94M88k36r76m30N81O15L66n07o24l88L17J071J4j60j007n1K21Q97
$$ y = [515, -798, -912, -201, 595, 858, -40, -606, -791, -130, 621, 764, 389, -732, -769, -49, 913, 729, 349, -568, -1025, -104, 701, 896, 172, -556, -932, -236, 896, 1010, 428, -595, -804, -310, 640, 763, 240, -423, -1085, -186, 691, 747, 317, -716, -805, -214, 433, 839, 73, -426, -985, -216, 708, 870, 199, -775, -709, -342, 484, 805, 269, -517, -839, -53, 670, 750, 169, -665, -561, -358, 277, 992, 165, -657, -1233, -348, 887, 946, 305, -611, -860, -374, 536, 842, 250, -622, -864, -318, 602, 814, 357, -420, -950, -231, 326, 657, 222, -715, -745, -204, 550, 879, 304, -566, -914, -324, 461, 801, 441, -342, -959, -284, 393, 898, 155, -547, -809, -351, 428, 786, 152, -700, -871, -609, 453, 693, 166, -424, -745, -448, 290, 787, 432, -449, -1010, -529, 395, 651, 236, -364, -698, -415, 379, 867, 631, -345, -775, -194, 421, 787, 280, -344, -732, -415, 656, 670, 510, -497, -548, -327, 570]
3622E70L39n40p40k53P4R82O7k70q18j1J82O46O21o03n12n53M93M90N67l99r92
3643f60n6K80R18K73m02q33j65K68P39L57n12p32l67P62M99K87l71n16l71K76
3663c26Q76J99n36q04r6M16O47M98p01l49n38K99Q71L27l25q44k65M08P02K75
3683G34k20r38m01M41Q58K18j58r70k88K39J005K48l32p80n24O24M23M55p3j002
3703d41l55M51P15K45j64p79m32M35O40L75j60r14l80L54Q08J95q9o58o69N00
3723c23L69P71n67p31j09N28K59M87k86r01k20L39P01M51n62n79k16K16O10L28
3743E65k63n68l84L00M67N51m13m91l87K25O54O48o46m62l14J92N64L59j26p32
3763b61k69J76O97L08j74r81j55K92M40M76l61l48l83K94O48K01k49n58l29J11
$$ y = [570, 909, 369, -371, -624, -550, 432, 499, 229, -589, -600, -418, 228, 849, 246, -266, -819, -326, 164, 731, 332, -660, -716, -436, 482, 755, 353, -480, -645, -377, 362, 719, 207, -525, -892, -130, 369, 656, 285, -231, -602, -326, 550, 749, 213, -591, -687, -271, 376, 874, 173, -176, -714, -415, 456, 783, 458, -386, -651, -243, 459, 734, 514, -424, -825, -384, 474, 692, 534, -436, -724, -485, 520, 768, 436, -344, -868, -244, 179, 634, 561, -441, -796, -345, 370, 615, 451, -328, -760, -325, 315, 690, 530, -384, -764, -410, 398, 593, 504, -154, -823, -323, 46, 817, 250, -481, -590, -62, 197, 684, 398, -503, -723, -384, 317, 768, 206, -373, -589, -373, 237, 565, 302, -266, -650, -350, 117, 668, 255, -236, -623, -398, 256, 904, 258, -204, -518, -326, 238, 597, 471, -261, -530, -354, 343, 651, 477, -504, -659, -367, 73, 549, 188, -160, -543, -249, 399, 600, 351, -207, -536, -425]
3783d25N37L28J00r08k61J02O08O63k30o64k45O9N67M61l67o06o43J86P89M31
3803D92j06p05K2q1N89K57l00j96n35J85P02K45L7r37m23N02M85K69j00o51l35
3824e84K45M11N29k33n52j06j62N49N01k47n24j60K34L12M73j74q02m57M41L70
3844F4N22j89m84l47M5P88K20J2r03m31L23L48L78k00l15l96K30N97L33j63o13
3865a81l86M12L12M40j16n72l20m0P13J01p2n56m39J52N60L95J56q02l00J4M25
3886a04O60J10p48m47N1O97L65j96n94j51L6L54N94k03m91n98K03N06N01j49m94
3907i8m70J7O77L83j76m07l10J26K97O45l48l97k82M7M1P15q7m12m87K36K70N45
3929E25j84k62n07Q8M74K82n4m02l95o4Q37J90j5p26j72r4M26N32q8o79rj55N13
$$ y = [-425, 112, 440, 540, -368, -629, -527, 81, 744, 514, -150, -395, -326, 241, 702, 335, -271, -914, -728, 61, 492, 386, -319, -297, -378, 211, 468, 168, -28, -563, -378, 324, 569, 606, -331, -754, -252, 233, 502, 402, -249, -584, -339, 72, 601, 368, -184, -290, -452, 97, 598, 351, -173, -333, -99, 213, 686, 512, -290, -747, -306, 64, 586, 397, -87, -434, -389, 399, 619, 631, -272, -703, -380, -32, 346, 146, -169, -565, -335, 262, 595, 432, -181, -567, -155, 157, 597, 481, -91, -411, -451, 262, 363, 291, -265, -704, -552, 8, 403, 559, -243, -543, -529, -104, 556, 666, -82, -529, -478, 219, 584, 388, -206, -357, -321, 33, 627, 424, -67, -665, -462, 44, 545, 396, -98, -568, -551, 126, 509, 333, -74, -384, -258, 39, 684, 336, -61, -343, -296, -255, 460, 373, -39, -526, -290, -20, 525, 341, 79, -428, -340, 134, 416, 362, -40, -435, -499, 338, 528, 513, -213, -385, -479, -53, 479, 391, -288, -297, -452, 61]
3952F1L01l7k90o91L73M08M27j51m32n71M13M02L40j41l93n07P8L21N78k73l7
3973A79n91l9M50M79R3o85j60k79O37M43J13n19n02L04J5M68r7m72j83J16J25
3994a05N57n9k45p05K21M42R6L79n58l35%M52J80R0m54k56m5K73L19J09l75l76
4016c95j29M13P75l83j77m42k43M90O08k07k44n46p0M75O57l88n23kj34M80L61
4037C76j3n67j53j82O67J13J18k50m22j27L63N99j89l74m75J26N77M9L2l16l04
4058c52k0M17K32J29k31m11j56M74M19p6l60n17L0N58K36J05o81j54m7M09M58
4079D62j9n14m03K32K44L43K76p87l71R2N70L53j84l17n09J69L35N21k43l08m38
4100d96J33M04K02O1l44j35l95N52M40q5m37l53J49K88L45N0n26m81L94M81J13
$$ y = [61, 362, 325, 35, -656, -283, 125, 552, 401, -31, -602, -189, 213, 553, 412, 19, -488, -410, -89, 489, 216, 179, -412, -451, -1, 478, 571, -114, -274, -553, 84, 527, 640, 121, -381, -77, -62, 406, 309, -163, -346, -230, -105, 452, 393, 148, -557, -336, 106, 202, 581, 23, -312, -312, 140, 320, 410, -44, -300, -345, -72, 247, 356, -19, -395, -524, -111, 664, 281, 104, -338, -581, -91, 517, 310, 66, -480, -550, -75, 582, 194, -329, -331, -465, 15, 376, 363, -204, -357, -539, 128, 241, 359, 109, -313, -440, -77, 522, 333, -41, -516, -390, 187, 236, 268, -48, -352, -372, 45, 277, 406, 175, -236, -392, 82, 501, 425, 65, -452, -422, 136, 372, 477, -204, -358, -405, 4, 462, 443, -71, -474, -242, 2, 345, 621, -166, -537, -445, 125, 478, 294, -23, -532, -363, -28, 493, 250, -58, -496, -363, 41, 243, 304, -40, -175, -570, -18, 422, 337, -100, -453, -304, -16, 329, 379, -147, -628, -234, 247, 360]
4121C60r4n29j43K19J62M85j57k02m52j71K85M81K15m08l67J93r0N53j4j74k04
4142e2l01J76O61J79q43k86K01L62J88K89o08l72l15O14L84qj37o56M5L90K84
4163A95J34l72j57j72J45O27R7n17k11j92J66O66j35m01k08j26J90N63J7k57k92
4184b40l15L20N16n9l26l19J32KN71Nl42j15j34K26N11j46j19n76J29K24N33j38
4206C40l39j32j19Q0K86L72p28o7l2J26N41J22l57k40k76P9O28J8j49k65k62L74
4228@J11K82k41l95j2J34M62J19n63l8k62K68N03Q6k07m12l07M20M87j31j28n00
4250c24k02M28L83k7n6m31k52K28L44K60m05l02P7K34L43k02Q3l83k32M36L79
4271C79k8j86l00k80K36N39J59m65k93j27L27K53K92m78l50N2K77K61J72j73o05
$$ y = [360, 266, -263, -406, -187, -25, 460, 303, 101, -351, -522, -237, 244, 459, 51, -316, -123, -213, 340, 326, 152, -52, -353, -177, 484, 663, -180, -466, -265, 97, 285, 574, -34, -406, -721, -107, 277, 269, 132, -524, -479, -89, 195, 329, -43, -200, -372, -227, 400, 497, -20, -231, -423, -257, 409, 274, -127, -335, -461, -271, 292, 309, 52, -240, -555, -235, 281, 222, -104, -423, -291, -289, 282, 287, -55, -170, -304, -78, 433, 287, 168, -408, -279, -55, 478, 340, 1, -131, -250, -170, 116, 488, -240, -307, -339, -213, 328, 450, 93, -147, -423, -344, 284, 302, 153, -112, -374, 0, 111, 393, 152, -243, -255, -121, 341, 460, -103, -141, -403, -135, 368, 454, 247, -165, -472, -52, 435, 304, 176, -324, -526, -98, 285, 258, 202, -229, -481, -253, 91, 351, -54, -356, -279, -45, 298, 96, 179, -204, -436, 0, 379, 351, 165, -135, -415, -179, 360, 519, 54, -239, -366, -39, 214, 506, 28, -322, -270, 7, 268, 440, 267, -338]
4292c38J18k47Q58r1k10l44o7L32J73K25l51Mk69J40K74K85n33j21k26J74J75
4313c9L58j51m07k30L18M74J68n30l03J47K37M08k81Q2n98N5L80k3L85k71l66
4334a87m9K35N36j67j64n02k04L64M07m2j07k97j59L60K86k5l62K32n13l0O62
4355B74K6p1l84k57K96M26J62m10k83J7J75j9M64k18n25lL56J60K39j84l05n09
4377e73L33M96P4j10k90l79J62M88J00l50l31M8J93R0M83l85n62Q3rM52K63k50
4399B6k67j46J74K81L04k1p15j03K55N34k12R1m01q3K04K24J99j56l21k23J52
4420b04L50Rj08l50q5L94L61j66q0l88K23l00K79N45l97l15pK97K30R9l28J2m03
4443c32K10K79J98k43l06j36K30L86P5k92j39l1Q6J21K16j04j96k87J31M16J66
$$ y = [-338, -220, -467, 391, 300, 90, -254, -321, 11, 184, 409, 58, 62, -207, -67, 207, 492, -41, -162, -388, -214, -39, 319, 168, -239, -469, -151, 323, 491, -39, -342, -195, 42, 450, 169, 251, -347, -292, 88, 65, 450, 179, -187, -236, -1, 535, 368, 204, -298, -502, -138, 269, 227, 120, -177, -336, 24, 310, 285, -77, 155, -358, -388, 274, 300, 229, -155, -412, -116, 310, 472, 62, -221, -204, -29, -48, 416, 198, -327, -330, 26, 186, 425, 241, -64, -573, -240, 256, 330, 220, -70, -449, -287, 201, 301, -49, -380, -332, -139, -49, 434, 49, -513, -430, -439, 13, 276, 26, -241, -387, -213, 68, 372, 351, -364, -467, -212, 322, 110, 201, -200, -283, -79, 145, 344, 188, -133, -356, -204, 146, 155, 47, -303, -388, 6, 367, 201, 121, -267, -44, -344, -65, 480, 83, -232, -239, 58, 288, 387, 59, 71, -332, -122, 157, 355, 112, -194, -330, -100, 286, 361, 69, -70, -101, -15, 106, 322, 218, 22, -265, -134, 282, 448]
4464D48j97n84j14K41K85J59k65n6k37K36K57M4L4l43j70J84J55K86j02l02l23
4485c64J21M38J22j92j79j12K65J12J17m16Jm5J45L9L07j65j67p4k24M26J76q2
4507B49l42j45n1L67K53l1k34j06K01o2Q4l16J07j53K1L94N3k88k90k43K52L79
4529I9J53Jn33k44L03K93J37Ql47K8J10J58M9J9k16j44o7J22L69j21r9l32J42
4552a12Q5L08l3k84k55j58N06J70J1k22L0p1J02J41j59m6j04m8K47R6k02o6j02
4575a66J2N0L99q0j68k27J37k4M01K1m53k2J39P0N2p1K8l35pj05O81k0l80k17
4599b85J06L90Q8k7m31P1l5J7M98j80j45m98K41Q6M1J05j9l08j26M59K17r0l97
4622b22l6l9K47J84K28l91j42N1L89%k24j04k87K09P0L72k15j70k0k07K00M12
$$ y = [448, 251, -333, -447, -206, 79, 238, -27, -83, -320, -84, 173, 217, 251, -92, -262, -78, 77, 363, 261, -41, -364, -243, 195, 317, 125, -54, -166, 99, 211, 328, -88, -87, -132, 13, 52, 359, 194, 27, -47, -271, 155, 331, 249, -93, -238, -289, 78, 331, 300, 66, -40, 161, 99, 183, -133, -26, -179, -158, 236, 289, 1, -289, -532, -280, 99, 252, 253, -280, -524, -221, 72, 209, 217, -130, -102, 8, 166, 215, 234, 18, -126, -193, -71, 298, 177, 78, -254, -112, -27, 281, 248, -36, -291, -449, 57, 227, 238, 16, 46, -25, 77, 218, 59, 13, -91, -139, 108, 204, 2, -64, -166, -154, -104, 295, 215, 47, -180, -43, -67, 334, 355, -98, -120, 19, 89, 141, 70, 98, -237, -244, -349, 332, 312, -68, -285, -179, 211, 299, 272, -159, -88, -123, -106, 392, 212, 67, -431, -190, -104, -63, 42, 23, -285, -411, 48, 265, 175, -222, -258, -297, -50, 134, 362, -29, -171, -120, 269, 269, 45, -59, -346, -137, -67, 305, 90, -80, -100, -307, -107, 305]
4644C05j30j51k24m9K66K95l65o3o7L0K21K90j79j65n8j20K09L7rk54k32K84K43
4667A14O3k2k70k08J50K05k0J94k62o7J47m4L84j19l74j92J68K28J69l53M6L1
4689c2k10K27J25L3k95p8j77L52J03L3j65j45LJ32L47l3l19k0j3J17K08K31n57
4712a33j39j15L29J53J64m57p7N6O4L69Rk01j16j35L98q4K4n9j71rj02O12k77
4735A03p7l15L60J4R2J23k00l61J36J43J16m51M96l64k7Q8R1K11l40q5p5M23j05
4758dK60o2m13R0L1K67J70j88l14O9J04l3O5p1j23j95K81K95o5L2k66k46L18L39
4782C41r1j95k92l1K41P4J5p8Q1k36K33Q9q1k56j24K39K29k3l9p5k98K20K84M9
4806B76ll41j42O7J2K04J10m30K2P8R6K04R3m7l14o7m8M11p1K1j49m1K19J36m6
$$ y = [305, 175, 24, -200, -249, 17, 312, -53, -116, -183, -153, 68, 358, 179, 14, -44, -164, 45, 82, 73, -181, -413, -129, 114, 177, 155, -115, -323, -173, 32, 12, 206, -56, -123, 24, -20, 364, 245, -129, -321, -153, 75, 244, -109, -63, -32, -242, -15, 110, 143, -152, -230, -407, -55, 48, 81, -84, -229, -226, -94, 253, 220, -99, -119, -132, -15, 193, 424, -133, -272, -387, -58, 95, 259, -198, -275, -219, -155, 214, 223, 22, -94, -229, 169, 85, 109, 50, -121, -130, -232, 380, 103, 26, -289, 71, 85, 177, 300, 100, -261, -125, 18, 134, -317, 179, -185, -212, -124, -33, 178, -162, -247, -322, 101, -4, 256, 194, -219, -129, -98, 169, 339, 151, -163, -94, 10, -23, 42, -29, -152, -347, -66, 229, 164, 196, -70, -316, 2, 341, 250, 55, -237, -268, -27, 47, 62, -16, 65, -171, 62, 151, 70, -186, -310, -71, 158, 135, 96, 21, -277, -57, 227, 276, 273, -68, -210, -143, -131, 73, 183, -247, -225, -147, -51, 153, 246, 199, -115, -182, -230, 181, 110, 131, -18, -59, 160, 296, 250]
4831B50l69n4R2J88J75l19K00m05N7M2P02l95k84o8J98Q2L6j06J15m29K58J91
4853A57l9q6L1k39L5K75K7R6j59k85n2K62K39j94q3P8k30P9K75J55l27j5j31M6
4877h5J69Nj50J7o4J73J37p8M7k42o5K16N7J45l97k47J46J17J03J29o6l65L70
4900G2j75J78R2J5k73j07K37R1J45r8k82j72J39K75j7pk66M6p3M28m9k33j83l
4924b20K37K66p7k28Q8k52J54J95J03J1l67K0Q6L1J46l79N9N5J08J64j01j37n4
4947i2Q0kK09j2q3k55J36k50K02M06j61l39J37J0L04r3j06l51J67J53j61K57l8
4970A18k61n4K86p4J50K4k85q8L04j36L23j03m23j36J09J11K76J7k75n9K72RJ47
4993B52l30j4j26K12O0nK8k99j93K35L51k83J66l25J29Q7J84Q7l29J15j13J3M7
$$ y = [250, -119, -173, -81, 107, 282, -37, 163, -242, -185, -143, 559, 164, -120, -188, 10, 92, 128, 22, 137, -292, -34, 157, 118, 32, 63, -176, -141, 134, 161, 257, 98, -187, -239, 23, 262, 68, -15, 63, -167, -88, 187, 342, 15, 0, -131, -85, 84, 89, -61, -44, -108, 65, 202, 124, 171, -71, -136, 80, 137, 282, -115, -362, -216, -99, 4, 133, 67, -298, 72, -103, 75, 167, 182, -91, -198, 39, 130, 275, 177, -105, -277, -138, 137, 120, 113, -153, -107, -180, 248, 199, -34, -217, -220, 17, 283, 206, -22, 66, -186, -32, 163, 266, 277, -90, -70, 16, 47, 193, -186, -127, -72, 36, 200, 99, -38, -92, -12, -14, 195, 183, 100, -155, -19, -269, -67, 339, 178, -161, -24, -14, 290, 197, 91, -260, -93, 60, -101, 156, 118, -143, -197, 89, 15, 165, 189, -96, -184, 120, -16, 307, 204, -219, -355, -246, -135, 141, 158, -117, -176, 96, 105, 252, -78, -92, -218, -6, 54, 49, 77, -222, -415, -180, 171, -112, 54, -271, -142, -55, 129, 216, -113, 2, -111, -98, -51]
5016e1k5M9j11n8J2J91k17K87m40J32M96j83J55m36J27M6P8p0J60j45O0k52l9
5039b34K75J62j25m0q7j86J29K92j20j94p7J76L45o5j81p6j08k6J67L93n25O9
5061c6k44J52Q3L38l17p8q3KN10k07j40j47K79j75J49K25k14k47L5k2J95K2Q1
5084A61l1l86P6M41l3K3k89j59O7o5L48P8n23J30J6M8L35l33J62j69q5J54J95
5107A61N6l50k5K4R9L16k77k06K8J87J50J10n0j95l98J43J51J51rk78N8L30MP0
5131B50l33M3k27K55O0J56R1m70K4j17L17K6J06j49j28n5J66J25k2k23k8k13L36
5154a0RQ1J35m68K5J41J87k23J84j26j3NK46k65J47k75K92K93n8j39j89l59M91
5177A11o1K79l11o9O2J33J69m7k72k68j8K36J10J74K6j15l64K31J4M9R9j80j84
$$ y = [-51, -76, -27, -138, -196, -184, 7, -210, 77, -363, -231, 265, 82, 237, -199, -72, -26, 52, -18, 142, -3, 57, -195, -234, 41, 203, 78, 38, -49, -235, -106, 186, 66, -128, -205, -29, 316, 251, 70, -6, -114, -140, 27, 420, -105, -36, -280, -128, -45, 293, -24, -102, -185, -183, 327, 120, -20, -167, 112, -63, 86, 311, 97, -150, -115, -137, 58, 80, 161, 130, -256, -180, 261, 228, 251, -38, -197, -130, -195, 153, 231, -292, -162, -146, -98, 237, -96, 66, -103, -188, -34, 161, 217, -133, -158, -134, -35, 281, 4, -202, -174, 13, 163, 273, 223, 28, -370, -227, -76, 75, 66, -212, -154, 176, 180, 250, -83, -40, -267, -12, 48, 204, 295, -175, -151, -268, 49, 75, 181, 32, -96, -151, 15, 140, 118, -105, -133, -346, -10, -1, 80, 215, -253, -228, -87, 100, -123, 61, -65, -78, -73, 173, -92, 55, -220, 72, 365, 307, 168, -21, -380, 111, 50, 329, 18, -51, 11, 144, 313, 266, -6, -274, -292, -56, 54, 228, 254, 139, -225, 6, 20, 69, 168, -12, -196]
5200a96R6L60j43R3k50j62M24j45OPM0k47p3M23j05j55j98L28k77P2K22j3j74
5223f7j40K32Q8J43l56k34J42L95j21P2k58nl1q7M02k58K81m12l02M53J3K47o3
5246A34l26M5N2L02O9j39l06Q1l1K88l5M07n07k60J71k6J59j15J08j42K4K02M
5269A59O7k20k44L30k85L08n9j57O3L4j77L91j93j87om3J51J40Q6P1m35J16K33
5292A43o2j44J48j79k2R2K5J25l75J89k7L64k69K45k07k59J92l3k33M33j23q9
5314f6q3L05K12k40p1j27k05L77K66j55q1l56L4L00J67j16k83j74K28K96j83n9
5336a4j99j5K44J29m7J25l85K28l02K08M4r7O5j2o9J21Q8j36j09j7J18L9j07L31
5360B31k68j77l6L73m3j68Q4l15L64r0n5J25J0k0k45J55K57J9k13q7l9J37k3J00
$$ y = [-196, -100, 260, 117, 210, -40, -202, 222, 77, 83, 90, 130, -117, -190, 233, 128, -27, -225, 103, -174, -102, 120, 107, -67, -207, 25, 113, 256, -100, -334, -192, 203, 82, 154, -104, -109, -140, -227, 175, -83, 198, -214, -516, -63, -50, 197, 134, -192, -147, -95, 207, 276, 137, -169, -88, -119, 169, 134, 541, 34, -226, -55, -81, 78, -37, 71, -71, -47, 155, 159, 226, 6, -238, 92, -193, 115, 56, -101, -38, -4, -181, 210, 17, -170, -176, -219, -68, 72, 158, 229, -206, -90, 143, 81, -63, 85, -94, -116, -24, 1, 126, -249, -60, -87, 277, 8, 253, 46, -213, -21, -54, -287, 146, 23, -66, -149, 156, 368, 128, 57, -70, -275, 102, 368, 213, 132, -224, -190, 110, 277, 161, -122, -296, -68, 228, 45, -14, -213, -228, 16, 145, 98, 223, -162, 66, -236, -28, 16, -81, -16, -28, -97, 24, 112, -24, -133, -150, -32, 7, -100, 231, -37, -214, -250, 123, 80, -88, -4, -319, 45, -45, -100, 25, 35, 15, -230, -75, 182, 201, -12, -99, -138, -1, -24, 76]
5384G6Oll82M04M0M7j85k23L52j29J85j88j13J23j40J45J93j60j54J54r1j5J13
5407E5Q0j93J2L7P5J5J44Ll40J44Q1K36m23o7J91j39j15K29M0o8n8j00K03K96
5431C38k26p1k66j97N46J53J1j99j3j2j69J52m6O3n39M39k8Q2J30j96q4Q4O5n4
5455c7l5o8J89Q0q7K8m6j98k8P5Q9L0K18j43j58M6N9J0j00J08k54L67p2m1K27
5480B59l05j05j2L06j60N9p2l9j16J97rK62k97o3j24J11PK22k28R1k2k42M56j82
5504fRK6L6k73L36o3j49o3Lm7K45Q1j42M7j47Q8oO1k75NK82j65qL09l06L4nJ19
5532B6J59k26J24k01J9J31j45J05K2j48R5j18K97L6j16o2j61N5Q9J87k53J05r5
5555g5j01L27j46K04l98OL40j80L83p0k76j47P4n2Q4J39p5K1K80k08M9r7k87K1
$$ y = [76, 82, 79, -303, 101, 141, 188, 3, -220, 132, 3, 188, 0, -113, 10, -130, 15, 208, 48, -106, 48, -43, -58, 55, 135, -58, -46, -9, 66, 81, 225, 228, -112, 32, 113, 349, -74, -141, 50, -89, -204, 25, 65, -3, -61, -161, 42, 338, 112, 41, -225, -422, 124, 277, 288, 89, 76, 64, -105, 47, 1, 64, -475, -36, -64, 18, 148, -48, -132, -48, 17, -37, -72, -140, 49, 129, 42, 70, 24, -174, -202, -127, -38, -8, 210, 67, -91, -45, 14, 24, -76, 32, -222, 145, 73, 32, 259, -46, -151, -163, 143, -17, 42, -30, -69, -185, 12, 3, 265, -32, -95, -219, -108, -101, 121, -107, -16, -38, -280, 176, -6, 3, 29, 65, -208, 128, 65, -84, -147, -144, -191, 54, 135, -7, 40, -107, -19, -25, 36, -239, -234, 48, -117, -125, 184, -122, -88, -93, 26, 185, -41, 83, -118, -99, 32, -113, -8, 14, -134, -39, -157, 140, 176, 60, -2, -163, -108, -19, 168, -85, 20, -75, -176, 151, 5, 209, -189, -183, 157, -23, 360, 290, 14, -133, -59, -111, -27, 112, 37, 58, 338, 130, 179, 82, -205, -184]
5579a84K21J32j07J3l03q1K07P6m8K27k90J29p4K66Lj49rk49J40m9L24k68P1j1
5603a3j73K51k0j57r9Q8Q6J89Q7l6k94J31j73J67J00L3r9k40J70O7L41n13K07
5626A00j19M2R5j85J58K0Kj41K08j64K33k67q8q1K75l7r4j15j00o1L92R5l16K70
5650A22k03j42L14Q0Rj6k85L9L3L56l1j10l97p6L81J12k36k9J11N7Q6j34R1k05
5674g3Q9m5N9O7j43mk22K86k6l5PL7Pl6K17P9p9j39R3m15N47j52k39J22j05Q5
5700a8J20L7j70K05k50L0M7J56K9l19m0K16J03j39K34j20l69J44K50k69K28k31
5722a26k4J71R1k26J52j06j09J85J14q6K2P2l3k62N8K20j48j65J58k18L94j62
5744b8M5J3j19K45j73J15M0k60l4j9R5K80k63Q4j33Q5Q8L3r4l58L56n10N10J25
$$ y = [-184, 37, 169, 62, 75, -228, -309, -102, -26, -74, 153, -137, -8, -82, 184, 187, 38, 29, -220, -80, -129, 195, -73, -2, -13, -186, 65, 45, -112, -211, -123, -37, 152, 239, 203, -91, 40, -133, 34, 134, 167, 68, -172, -2, 65, 406, -107, 100, -19, 23, 118, -67, 91, 111, 113, -28, 180, 16, 249, -18, -106, -187, 88, 51, -43, -158, -258, -319, 73, 168, -148, 122, -81, -223, 91, 171, 180, 164, -121, -82, -49, 307, 276, 166, -231, -307, 74, 186, -50, -79, 32, 89, 175, 41, 132, -73, 16, -29, 30, 97, -46, -50, -272, 14, -12, -47, -40, -3, 4, -32, 185, 264, 185, 46, 139, -276, 271, 119, -120, 2, -103, -18, 102, 139, -31, 174, -76, -46, 1, 157, 186, -133, -173, 43, 146, 7, 241, 121, -248, -104, 146, -123, 105, -126, -150, 21, 112, -114, 38, -68, -177, 8, 122, 36, 58, 130, 97, -165, -107, 113, -35, -200, -42, -260, 134, -28, 17, 30, -89, 156, -17, 98, 138, -122, -156, -175, -80, 200, -63, 21, -112, -27, 61, 94, 0, -358, -2, -512, -2, 123]
5768A23M8l21J23j82L5L60k02%l00L25o5P7K08j8l64J56j38L46k26o6Q9j29P2
5791d9l2J40j08j44L23l96L70J28j86j28j77O0L81M0mk31j68J38L33k18j08J5
5813b1l0Q7J5j05O7j20L3J1m4K33k15K59k36L6l7J35n0j15j07N8L36j21k27n8
5837b16K67j12L37k0j04j87M8K19j22j01N5j44o6M5L06p0p9j10n9J5J58l8R8l84
5861b64J02K64m6J88l60J84j8OP0j18M2r9p5K13j13N9o5L0q4K11k6k56J40J68
5885A53j74J16q4L8K8k00L25j91j0J2j02K88j99l4J11M2k5m2o3Q9J10o1j68J99
5909A58o3j62Q3J15j95Q7P0k13J98M1l6k3Jk14K16L5j44Q0k03K40j01J12k40P8
5933h0O0J9K1J22r2m9k00M66k16J10p7j0K65k21j35P1p9J91k46K93j57l9j11J02
$$ y = [123, 171, -150, -27, -209, -174, 186, -16, -16, -316, 9, -56, 21, 229, 211, -153, 3, -135, 211, -15, -81, 8, -121, -49, -81, 59, -49, -193, 130, -266, 104, 232, 46, -82, -259, -199, 182, 222, 218, -13, -181, -43, 290, 72, -36, -21, -51, 36, 51, -54, 13, -107, -74, -63, -107, 126, -89, 170, -66, -30, -67, 68, 18, -97, -204, -146, 190, 69, -158, -216, 51, -61, 276, 256, 152, -35, 13, 232, 110, 9, 64, -80, -146, -101, 205, 135, 56, -54, -113, -98, 60, 22, 120, -264, -162, 102, 56, 244, -116, 68, 50, 56, 126, 8, 50, -49, -124, 89, -24, 35, -30, 0, -84, 127, 101, -155, -15, 153, -21, 95, 11, 49, 77, -123, 202, 11, 1, 13, -89, 199, 0, -34, 77, 119, 94, 52, -11, 78, 188, 127, -41, 158, 95, -67, 16, 131, -64, 23, 93, -120, 78, 119, 83, 60, 61, -153, 63, 98, -46, 34, -169, 71, -30, 82, -158, -80, -20, -1, 20, 142, 50, 1, -199, 267, 51, 161, 84, 74, 339, 118, -17, 54, -25, 166, -80, 213, 56, 17, -94, 8]
5957Hj3O7K9j07J75L9k53M7K31l42J69q6j69J31J01J7J05j36J24j81m3j90L34
5980E7j19L2J34Q1k21J31K9m60M93q6Q9l13J54J01J1j24n7L7O0k59K46J62j24
6003E4j45J45q1j70O04l51m1q9K51n8rq0l5mo7Mj72K62N0N9l4k92J34K11j95k1
6029g0j12N4J34P1J42j63p4J66l52K33K25k39R8J7l9M4k64J49j47M5j09K22Lm7
6053a3k4J92L2l12K18L6k58K37l11L77q9j1p1q8k5J92l79N41j76K42j37l53J35
6076d5M7O5k2R8j7l69L15j21k5J11Oj99K63Km10M51k33K4j00j07K54J52k41P9
6100b2k4J00k2j22L19j19m9L0j53J79j49jJ01P9k84q4J50K41M6j99m5l0K22j74
6124a0q6K17r5q0K79l13K45j28n6q8j1L2K3J85L3l00N5J08R8j44K16j93m8K95
$$ y = [8, -5, 62, 91, -16, 159, 198, -55, -8, 223, -119, 50, -36, -205, -74, 27, 44, 149, 13, 137, -44, -87, -277, 57, -62, -30, 104, 185, -36, 95, 124, -336, 157, 71, 160, -153, 1, 102, 113, -11, -68, -31, 29, -230, 16, 178, 54, -91, 54, -27, -197, 407, 56, 15, -74, 177, 119, 110, 30, -5, -9, -76, -72, -244, 18, 68, 127, 93, -199, -65, 146, -49, -70, -182, -128, 6, 77, 219, 56, -18, 148, -204, 29, 254, 15, 113, 130, 91, 135, -129, 20, -127, -82, -191, 31, 34, -13, -37, 155, 187, -125, 93, 129, -129, 108, -203, 174, 85, 74, 3, -85, -110, 82, -297, 244, 68, 310, 173, -180, -45, 2, 67, 45, 143, 126, -243, 72, -49, -74, 37, 43, -156, 107, 109, -301, 150, -83, -59, -159, -266, -12, 140, -101, -22, -46, 54, 32, -90, 229, 110, 61, 91, -62, 117, -32, -33, 68, 147, -137, -221, -71, 170, 216, 17, -28, -58, 164, -10, -96, 121, 26, -54, 225, -88, 157, 29, -27, -115, -126, -94, -71, 114, 147, -153, -98, 10, 108, -36, 180, -13, -61, 234]
6148B34l69n9l5M09j32r2P4j11M4J06m5K58k77M0q4j6n3J05m23J47L5K97j00l8
6172h5n7J61l8n8O2r2K03l45J49J02L5j63K02j34pJ17R3k09K3q2K00k08L90l01
6196d2j93J49J12mJ64j17r8n3J38n7N6J64k71j75K28M1J25m2M1k93qL04j55q2
6220f8L2j96K97M1k76K17l3K24k40j37L88l22J78o7r0j71L80k95J95l8n4rM3N
6244Dm6O4l09M46j96J19j44k4J50m3j19K76m3j51j70K70J57k49O9j59K68Lj88
6267a5mj1Jj6J9M9j22m0L18k98l5L03j25J65l70O0M07m65L37r0j47J50k29M21
6291B63m36J88M2k03J87M1L7m3n3M1j0k5j64M4L40j34k25J04K20j29l9j6j95K49
6315H4j27KJ6K73k80Q9J09k36m0Q3K03l17K71j73K02j21j8J80k41O5N7k40J28
$$ y = [234, -135, -194, -229, 180, 48, -44, 30, -81, -37, 69, 24, 282, 5, 45, -39, -55, -108, -3, -426, -279, -244, 53, -47, -85, -142, 19, -19, -77, -15, -107, 96, -249, -100, 2, 37, -126, 76, -58, -65, 52, 145, -64, -41, -123, 77, -131, 259, -42, -235, -86, 26, 22, 186, 69, -29, -82, 56, -1, 55, 219, -52, -227, 1, 42, 167, 125, 166, -127, -135, 169, 14, -68, -36, -232, 65, 106, -170, 47, 14, 238, -2, -139, 249, -73, 105, 38, -52, -223, 157, -138, 57, 19, -35, -44, -1, 4, -42, 22, -287, 159, -37, 82, -62, -86, 64, 21, -98, 178, 135, -16, -186, 84, 241, -8, 61, -98, 170, 173, -15, -19, -30, -29, -45, -26, 23, -99, -139, 179, -119, -154, 149, 24, 189, -181, -121, 286, -179, 158, 68, -79, 71, -158, 263, -173, 15, 57, -146, 41, 82, 119, 76, 23, 64, 54, 29, -135, -91, 249, 115, -110, -6, 214, 85, 46, 30, -165, 84, -43, -41, -25, 248, -32, 57, 166, -70, -110, -27, 176, -141, 130, -43, 159, 38, 20, 200, -41, 24, 81, -159, -31]
6338c1K04r0n8l97L16j29L28k90k08J26L17r4n0J0J44j87J41P9o4j96J78j2p8
6361d1J53P2k31j69J61o8qJ99L9j45Kl1j63K17J01j03k7j31J10J75P1j66L3M9
6385I9K3K0l29M32k95K55J9j97P1P1k51j39ML02J19l95J43k48L68P6K04n45L15
6408A22k32J40l12N57l10k00K72R6%j29l1k0N4j28J73j15J50k62j90L50n4j47
6430b16J95q1P6j22K07J33j63J4j04k5K02j38k3j12J18P7j14J98l2N7k97l8K89
6453A01k45K08k89J09J86J49n8mj02k3j13R3J52j57n2j60K94j70O3k13K05Q7k9
6476C2J03j84K81l59J43K20j64N5j08p0J9k1j57K74o3j13P1N8k4o2K65l85P3L12
6500A96k92J50n4q2L46j95J32j37j58l0Q6k3K24J67k79k61M68l88j04M52m26O4
$$ y = [-31, 173, 83, 25, -372, -56, -185, 143, -147, -355, -229, 88, -6, -56, -46, 98, -89, 52, 131, 67, -129, 49, 37, -41, 112, 184, -47, -216, -55, -123, -131, 68, 107, -38, -36, -67, -230, -13, 88, -15, -42, -173, -63, 112, 183, 17, 50, 99, 122, 142, -187, 245, -50, 205, 224, 27, 98, 169, -82, -221, -217, 85, 204, -191, -48, -296, 72, 148, 352, -193, 122, -110, 30, -282, 275, -35, -235, 37, 133, 133, 4, -27, -47, 7, -121, 52, -63, 87, -175, -365, -15, -69, -216, -21, -102, -26, -148, 59, 192, 29, 43, -61, -86, 116, -22, -45, -157, -39, 38, -76, 122, 90, 147, -150, -188, 101, -144, 64, -225, -116, 70, 219, 161, 157, 55, 32, -81, 12, 164, 7, -45, -205, 89, -81, -18, -231, -26, 61, 32, 135, -49, 232, -127, 16, 236, 72, 127, 19, -51, -32, -53, -210, 64, 1, -112, -41, 17, -7, -69, 196, -189, -116, 196, -96, 54, 0, -82, 264, 69, 201, 64, -94, -124, -38, -61, 163, 330, 51, -210, 258, -130, -234, 218, -208, -144]
6522a44k13R4M31q4l05K23k6o4P8J46n1r2J33J69q5j31jk03m3J85K00j65l9N1
6546F4k43K44k66K97M0k72l04L68J44J63k98m7J45j34N8M7J82k78N3OK43k97J67
6569H2q0P3j90K88m3L2L2k65J10L5R1j02qJ67j61j96J85k06k6l7J46Qj94K95k3
6594A3K38l76K68p3J05l93J31M4Q6j04J20q4N2j8O1J92k10l8k37K1L25P7k92K4
6618f8pJ68j75J31l5j97K62O2j53J63j04j92K45j25L8M56o64J87q2J97k27K04
6640H4M0j23J36l3q6k1j09K0j43L18r1J10j42l34L04m9J53j10J36o0k62N83k60
6663F1m0Q4j08r4M1K17n0j57j31Q7J11k4J68k8k00m7o5J55K18j81n5m6P9o5K72
6688B02j11p0Mm1O4J9k77L05j94m6J27m7k47J59J92l06L58O3j69M7j57K0J72Q1
$$ y = [-144, -357, -263, 168, 84, -221, 2, -24, -88, -10, 136, 85, -7, 126, 295, 210, 79, 78, -125, -168, 17, 217, 52, 13, 64, -179, 65, -201, 96, 136, -136, -440, -72, 72, 235, -63, -110, 35, -99, -41, 6, 188, -90, -37, -31, 212, -85, 82, 2, 75, -115, 173, 130, 162, 194, -71, 39, 74, 165, 63, 55, 222, 61, -135, 50, -156, -182, -219, -73, -65, -259, 36, 13, 251, -125, 143, 70, 175, -218, -87, -43, 43, -61, 59, -25, 27, 9, 70, 262, 52, 14, -223, -202, 123, 200, -92, -68, -75, 93, -82, 49, 14, -183, 79, 141, -12, 151, 47, -145, 100, -25, 13, 469, -195, -8, -90, 107, -120, 84, 124, 1, 137, 104, 18, -3, -112, -92, -235, 83, -8, 102, -40, -374, -70, -119, 34, -76, 60, 0, -262, 321, 61, 21, 105, -3, -97, -56, 161, 111, -46, -177, -90, 21, -3, 165, 137, -63, -110, -175, -20, 198, 17, -38, -84, -5, -70, 202, 91, 21, 25, -16, 48, 67, -210, 95, -99, -145, -18, -65, -312, -153, 39, -267, 91, 154, -15, 32, -125, -105, 67, 148]
6712A48j8l22K30j69K71J0n8k44K00q6J51K71k93j66J7J98k01Q6P1j80L7k63M19
6735A09j0k39L0R4J54k65K63P3l43n8R4M4K11o6n9O2q1k6J77p9L61m67j50L18
6759A47j05j8J60q0l8j85O8K06p4k61J66R6Q8j57k44L35k67K14j62J62j10J7J00
6782E8J65P9l46j52K24J84p3j1k9j00P5o4O2rj82N5J35o5P7j51k16L97k51J62
6806B4j22J51j40j45J59J08J55k80K14j98k8R7K41l43K71j32Q5k12Q9K7m7N0j74
6829a50L56j0k69j12K42k07J97J11j02j95K3J35K8j65J6K12p8Ro9K24j78l4o4
6852h0k0R8j81J77j46J12M8K15q2j16M9lj62l6L35n6j07Q9Q0jk74J34j45J95k71
6877a48K35k19L63k42p1j7J82K3p9J07j98j26K86J54m4K8k69N1l0J36l03L44l20
$$ y = [148, 130, -192, 38, -131, 140, 150, 92, -152, 48, -38, 113, 384, 91, -75, -58, 140, -61, 25, 96, -84, -47, -310, 109, 99, -140, -110, -16, 138, -127, 136, 209, -134, -192, -98, -54, 157, 91, 32, 94, 13, -13, 164, 85, 446, -21, -171, 147, 42, 24, 184, 104, 66, -119, -51, 155, 81, -180, -14, 82, 170, 13, -231, 104, -163, 51, -111, 51, -59, -42, 58, 223, 302, -44, -196, 28, 212, 139, 128, 99, -1, 74, 10, 72, 63, -119, -64, 71, 6, 83, -68, -284, 113, -138, 24, -98, 53, -87, -232, -73, 35, 190, -90, 124, -74, -102, -5, 236, -107, 164, 32, 117, -95, -6, 21, -26, 24, -150, 206, 196, -73, -185, 57, -150, 47, 158, 56, -139, -116, 19, 47, -118, -102, 110, 32, 41, -28, 196, 18, -16, -80, -100, -2, -183, -6, -152, -40, 8, 223, 141, 25, 74, 71, -91, -127, 208, 152, 45, 134, 214, 213, -61, 73, -72, 123, -148, 87, -132, 231, -11, -82, -99, 83, 106, 27, 134, -64, -190, 96, 250, 206, 234, -35, 16, -14, 122, -181, 163, -157]
6900a57K4L8O6Qj8J03n2k63J01Q8M3nL6j2Lj4k58K47k32L65j43J07J15k44j66
6925b20K48p3J54Qj43j04L63j84L6j3k49J68j47L89j30j71K52l09j36J27K30Q5
6947A81l52RL10K5L1j92O8p8j60k2J56J90J3k72M2K79k25j48K37j97K73j77L1
6970B2L6k01L06q7O1l7J14J1j93J19No9j16J44j86J71q7k14L06k70K04m1J73j48
6994B3n5M2N8mj55R2J2M3K6k98J15M18n01j4N5L11l8%k77J76j62J57J65o3k43
7019a17J20N8j59Q8qk64J80Rj40P6K61M9M6n06L01j25J01P1n8l9Rj46J33J23M9
7044A12o5l51r1L36K55m18K93k8K68k70J24l2j48Po9J85J7l6m8J25k13K8J41j7
7068A05k02pr6K68o5j00J6P3n2M86k52l43L27k46MN1K59j85q6N8n7O5M3j77n7
$$ y = [-157, -133, -95, -29, -21, -39, 64, 12, -251, -150, -62, -19, -24, 12, 0, 3, -11, -269, -22, -254, 111, -32, 75, 190, -54, -220, 28, -45, 109, 117, -26, -130, 233, 49, 85, 72, -177, -9, -156, 233, 103, -68, 184, -125, -261, -134, 96, 181, -171, -162, 148, 173, 204, 12, 80, 2, -158, -180, -24, 166, 179, -93, -51, 228, 3, -145, 92, -105, 168, -9, 22, 58, -143, 163, 76, 137, 100, 214, 225, 32, 151, 156, 87, -29, 115, -71, 100, 13, -201, 105, -165, 39, -2, 171, 23, -32, 10, 68, 64, -91, 1, 13, 56, 82, -216, -101, 317, -184, -198, -143, 168, 130, 130, -147, 29, -133, 24, 189, 126, -117, 3, 61, -98, -10, -18, -282, -102, -93, -233, -157, 104, 153, 199, -307, -6, -131, -30, 41, -17, -56, -47, -193, -60, 63, 112, 47, -304, -395, -59, 196, -222, 71, 43, 311, 41, 165, 133, -15, -8, -77, 108, 125, 89, 41, 166, -47, -19, 122, 105, -97, -104, -200, 68, 3, -97, -81, -8, -60, 426, 174, -169, 158, -88, -84, -33, 226, 41, -45, 13, -44, 21, 64, -113, -170]
7093a70J95lQ8k1k8o8k9mk2J73j45jp1K08k6j87M1L8K14k51K74j83M5j46K75k22
7119b6L12k39j45Q0j65K63l16J13L04j98J11j77J69n6j87M3K27k70K62Rj0l24
7141b20M2oJ41N0m9Pn9J13m9n5K09m4m10K82L1P4k01Q5J78o2J32j60q1K18j80
7166a4J66j15j06j9M6j48J54P4M25m11j1j58J45J46k72M5O6j51J07R9r3m5J42
7189G2l32L77k17M7J35j10j06J14r7K88r1j01j15J44O8P6m18N4P9K41jr9Pj77
7213a62K85j14k43J79O9j28J34j50L16r3R7k06J80l03r8K24Q4l9n5P5r9R8Q2j94
7237f1J94j33N4j76K19J65j64l37J96j04q5J97k15L64k41J96r7n3P0l3R3L2r7
7260a6j34j69J62J19R9K05l24Q2k15K18L42k10k64J83p1l0k37J12L17j14Mk72
$$ y = [-170, 25, 22, 110, 89, 61, -7, -36, -40, -62, 111, -34, -35, -106, 102, 76, -111, -70, -32, 182, -69, 205, 22, 67, -79, 196, -26, 286, 47, -98, -18, -183, 80, -236, -123, 181, -17, 94, -83, 86, 30, -157, -114, 113, -157, 105, 114, 104, -220, -178, -184, -43, 7, -42, -35, -94, 19, -30, -85, 124, 80, -330, -48, -17, 57, -144, -59, 119, 57, 189, 29, -52, 166, -14, 152, 37, -69, -88, -42, -190, -36, 38, 463, 52, 41, -117, 28, 174, -98, -53, 13, -138, -31, 68, -25, -70, 72, -260, 117, -100, -53, 82, -28, -134, -20, -117, 171, 80, -21, -136, 8, 76, 152, -266, -212, -133, 108, 107, 8, 15, -162, 123, 9, -234, -55, 14, -114, 20, -130, 186, 93, 190, -16, 164, -139, -237, -13, 71, 32, -23, 52, -47, 51, 133, -61, 133, 0, 54, -122, 97, 262, 98, -239, -43, -147, -232, -35, -250, 114, -127, 69, -28, -81, -11, -44, 49, 81, -16, -150, -319, -157, -38, 61, 266, -58, 24, -191, 27, 369, 159, -105, 78, 7, -23, -260, -148, 169, 55, 59, -213]
7282b13L42K55k81k17j53K59M9j70R6L8K58q7k97Q8K07k13P0j06L47k47k20K17
7304B2Q0j70J71m0RO8r8J5K95j56k36n1m3q8L34L1Nm05Q8Q3J5L2R3K1O6j44L39
7331C36l88j37p4M31k24J38k9j30RJ33J70k44N4r0j16M46j71j14j07K11k33J31
7353BJ76j24JK52m24O5L2J86n4k07J57k9J32o7r7k5N1n0j77K64k56N2P1J69j49
7378d9P8P8k19O9q2Q1N1K6q3J77l52o8L70j80MK55k70K13j4m8J0j06J60k33K42
7403A10J8k67J74m7j01J85Q7k51K23Q3j39L0j70J67k30J96q8P4l4p5K46j4k35
7426e8K25n2n6k13K48k01K88k46L3R1l03J97J00j03L4Pr4K54M3O1k22l18J91m8
7450a42Q7Q6j89K63q2j17km0J32j52J6J93K6l82L94r6pJ25l57K51k38L8K49p4
$$ y = [-213, 129, 384, 103, -114, -267, -8, 41, -129, -33, 5, 263, 176, -121, -33, 174, -39, 31, -75, 272, 25, -195, 22, 102, -68, 103, 63, 72, 140, 42, 57, 352, 196, -40, -91, -134, -222, 112, 143, 148, -257, -169, -86, -71, -39, 54, 75, 141, -3, 336, -52, -189, -263, 168, -56, 82, 53, -77, -68, 65, 235, -9, 45, -45, -161, 285, 114, 0, -107, 104, -129, 2, 178, 54, 55, 307, -117, -52, -20, 166, 112, -95, 62, 33, 165, 98, 1, -24, 27, -23, -200, 64, -192, -140, -69, 100, -49, 29, 107, -112, -43, -125, -44, 7, 33, -50, 127, -225, -293, 77, -103, -99, 156, -114, 99, 85, 37, 47, -59, 101, -132, 110, 128, -139, 35, -12, -113, 72, 159, -92, 131, 214, 75, 105, -65, 102, -128, 68, -20, 54, 20, -55, 191, 177, -58, 167, 115, 59, -154, 94, -107, 181, -65, -32, 59, -244, -47, 53, -50, -16, -9, -103, 151, 194, 255, 33, -285, -94, -142, -55, 31, -158, 105, 23, -94, -96, -136, -4, -156, -140, 53, 79, -303, 91, -5, -12, 113, -244, 7, -231, -193, 56, -18]
7474a8K5j03P6O1l2K19j44M1j2m6j39J21r2J55P1l98K05j59J1R3J79k65K29k79
7498b01J99K9Q5m3k67J82L13k16r2j9m4J31Kj39N9L70n22K01j72n1L33l5J39k14
7522B8j9J43l12K68k73K61j17J4Q0L2l01K46R0j05M0l38L05L0p3J26N5k46K54
7545A88j47o4K58m9k45K0l4j8m8J45l5Q2J44r3q0j32J95K6k74J63j2P4l23L78
7569A19n2j06K58l54L03j62J7r3L16l67J49j96J56J84j27O4j32P9p4J83k44J76
7591I7j69LO1o5j20K64q2q0p5K15J75n7j93j29k6O8K9J58P9r7l16L66q1j47OJ22
7617FL4r2R0o6k60K90p2R6j16O7K1L5j39L3K94J9l89K32k27l2L60j68j3N2o6L09
7643B98l38m8P4j31nJ21o1J52j83J32j02j6J64r1j09J58m6P9R5l15K21n1j14O4
$$ y = [-18, 7, -96, -20, 41, 9, 228, 84, 125, 113, 67, -72, 49, -43, 112, 183, -215, -10, -169, -158, -65, 114, -151, 78, -201, -2, 27, 112, 69, -198, -16, 297, 81, -11, -30, -74, 57, 59, -80, -21, 349, -173, 28, -144, -195, 138, 103, 242, 28, 9, 152, -160, 108, -165, 96, -21, -7, 73, 105, -196, 50, 140, 35, 75, -263, 42, 72, -1, 125, 180, -66, 188, 41, -23, 235, 186, -59, -39, -73, -91, -139, 6, -29, 53, 197, 104, 24, -108, 87, 113, -161, 2, -10, 64, -259, 119, 67, -39, 219, -135, 168, 6, 23, -70, 246, -121, 28, -168, -12, 172, 45, 109, -23, 56, -18, 165, -79, 97, -72, -69, -8, -73, -193, 71, -11, -91, -166, 49, 224, 167, -26, -155, -181, -113, -84, 74, 153, 56, -260, 106, 25, -122, -116, 6, 40, -52, 38, -28, -288, 2, -70, 26, -90, -23, -2, 33, -106, -73, 221, 240, -149, 83, -144, -176, 184, 16, 3, 55, -11, 298, -40, -88, -14, -145, -150, -29, -90, 62, -121, 11, -91, -107, 57, -34, -143, 15, -31, 48, 143, -172, 49, -2, -116, -52]
7667e2j21j7J59NN7j97K44m3M0k61L5O4n4P4J58l91L74k1J5k62L53j90Q0Q6j03
7692C2J7p2J2j09J6J44K3k9J1m52N87n0K4j21k72K51j73K14J51k65J23j54K54
7715A62l24R4K4p9J77N3L9m63O08j90k26K04k05K93l83K35Q3j16nL83j72k74P3
7738iOJ7p4j83R6M6l4K59j05j69j2R7K94j61j04J91k47K03n0k6K1Q3Q6k47N8J30
7764A66j88j04J70L0n2Lk6M5p7M4O6O5j13n6j06J10l1J59j3j2R1o5J34k08j81
7789a49m4J80M1Lm03N05j91j08J60k7M0J78k04j42M9O1l6J3K58j35n6L9p4k08
7813b50J92J72j80o5J22j38J47J9j27j57J61K14j87O9j66K66j95J23N8o7p5p7
7835a41P2J87r5m8o6Q7J26k63O1J71J84k11J7r1J52j71j08K42k45K5J10J2K8j4
$$ y = [-52, -173, -190, -31, -26, 31, -166, 78, 35, 75, -186, -151, -87, -141, -67, 91, -300, 74, 53, 68, -194, 159, -31, 49, 135, 32, 49, -23, -11, -120, -104, 40, 63, 34, 45, -407, 180, 130, 154, 33, -239, 12, -161, 53, 204, -61, 62, -92, 162, -162, -68, -44, -123, 54, 107, 146, -317, 291, 101, -125, 79, -126, 167, -216, 19, 102, -14, -19, 364, 192, -82, -9, -3, 14, -60, -243, -147, -101, -135, 124, 19, -150, -162, -65, 229, 68, -36, 155, -92, 111, 61, 35, 56, 139, 225, -22, 36, 166, -22, -126, 44, 74, 22, 25, -1, 44, -33, 11, 77, 142, 29, -27, -133, -23, -54, 105, 92, 80, 171, 106, 240, 32, -149, -193, -13, 28, 31, -372, 133, -58, -166, -6, -33, 7, 185, -19, -161, -112, -51, -87, -74, 184, 49, -7, 32, -42, -250, -58, 114, -66, -131, -9, -147, 0, 19, -108, -265, -104, 110, -77, -8, -174, 92, -103, 20, 78, 11, -64, -141, -69, 118, 23, -25, -91, -4, 122, -141, -80, 91, 275, 64, 81, -10, 142, -29, -137, 105, -140, -115, -5, 7, 35, 21]
7859B1N7q4Kj21P4J61j84J0K43k23k78L91M2j39j39J63J28k76L16k95K83j33j84
7882a65N9L3p1J48l7r8K34j30J87n1k41j6J98j08l1j18J65K1p6QK1J58k38OK74
7907A32q1k33K10Q8M3J90l97K94k49R5P0l8ll8k03J65Lj69J15p9l6J66J19k69
7931a05j27L39J43j8j60j50K30j25k5j69J73O8jJ24j16K0k41L24j35Q9l5k47j8
7954a62K99lj52J13j20K61j23m4L9r0j70K79j15J61k0j60J9o9J22l9n3N1K75m84
7978a85L10q5R4k84m3J24J29R3k16K3j8J09j01R7P3j71J1Q4r0J20jj73M9%k16
8003b67J88J72k3j07q3k51O7K56j1q3k6K44m2P9O3k53K09j85K65J6m03L57k30
8026d8kJ79m13K84j64J70j04J28m2rn0J57j25r5J01R0p8JJ13j03J58k8nl15LL63
$$ y = [21, 78, -6, -4, -125, -51, 110, -74, -64, 179, -44, -322, 69, 111, -28, -167, -4, 124, -152, 164, -131, 152, 19, -165, -106, -73, -144, 4, -33, -131, 103, -27, 160, 109, -132, -148, 50, -58, -89, -207, -42, -21, -97, -89, -68, 90, -148, -142, 132, 51, -182, 28, 116, 159, 349, -48, 246, -3, 92, 162, 124, 121, 83, -120, 45, 48, -121, -6, -85, -121, 45, 164, -105, -232, 107, 250, 232, 72, -78, 152, 27, 2, -167, 6, 74, 73, 197, 81, 101, -140, 184, 49, 138, 103, -144, -162, 137, 134, -18, 95, -25, 236, 113, 69, 108, 18, -152, 127, 12, 173, 153, -7, 12, -57, 65, 26, -27, 24, 299, -185, 125, 40, 134, -150, -193, -69, 60, 153, -63, -40, -58, 51, -50, 47, 120, -51, -40, 44, -46, 74, 73, -100, -51, -51, -267, -79, 93, 70, -37, -120, -371, -304, -48, -59, -142, -168, 76, 34, 113, 176, -77, 132, -53, 212, 228, -175, 182, -48, -50, 129, -284, 0, -164, 6, -98, 30, -12, -21, -71, 86, -39, -134, -33, 57, -21, -20, 93, -10, 148, 120, 115, -200, -197, 166]
8052A66j31M8j75M28k61J17j00k9k11M8K57m3j29N7j14n6L07l30L4N0K71k69L49
8075B84j78k18J02k4Q2k7k10K80j16L6O5R3k66K50o2nj21P4J26k30J52m50K95
8098f8K08n9l7j59q0K88J5j54J62k76J86k76K92k38J22O6l27K18J60Q4m7qk12
8121a40J75j58L31p7j60lJ63r4k05J52n1p0j8NK11R7k85l10K35L19r0P5j36j97
8145b31k02N11l2p6P9l93L45j77J37L0L3j26J08j72P0J24jl9k68M23q2j87K48
8168A22j48M4p4J87k17J40o0n3l9J3K92r9j29K1J17j07N4R9l11J97J22r4j8
$$ y = [166, 35, 83, -92, 336, 75, 192, 92, 63, -148, -100, 157, 114, -15, 42, -72, -128, 179, -151, -117, -67, 204, -65, 284, 106, -112, -10, -34, 48, 21, -189, 91, -25, 11, 76, 169, -97, 153, 91, 86, -35, 39, 165, -65, 87, -363, -68, 140, 81, 44, -115, -195, 93, 108, -46, 116, -160, 26, -250, 42, -196, -74, -8, -335, -117, 43, 127, 80, 72, -140, 35, -123, 208, 131, -29, -32, 131, 37, -168, -16, -67, -137, -155, -150, 61, 158, -127, -437, -202, 117, 27, 102, -34, -231, -433, 78, 46, -30, 49, -344, 1, -176, -39, -9, 24, -102, 6, -166, -96, 28, 27, -12, -280, 143, 61, -126, 122, -26, 18, -56, 131, -86, 54, -6, -59, -98, -85, 207, 108, -21, 0, 117, 10, 64, 163, -148, 49, 171, 77, 59]
8191E9
$$ Imaginary data points
##PAGE= N=2
##DATA TABLE= (X++(I..I)), XYDATA
0@%%%%%%%%%%%%%%%Qj6J6j6J6j8K6l2L4m2N0n9P0p9R2j08J23j38J56j75J96k22
37a18K48k76L09l43L84m28M73n24N80o39P02p77Q58r45J042j147J264j396J544
56H11j713J906k129K392k704L083l558M172m998O177q014J1291j8929P2748L5838
71I6373j11342n6025l599R5709O7379p376q4349p8997Q865Q8189P4652j2484q8334
84a1339o3344Q5Q6098P6341j4763p6468p7944J0424Q8508O1208m561p8478p3252
97g7485Q715P7921P3712j2691p8118o7385O079Q0491O1380l036p2932p7340J5047
110f5642P3740O4669l946p8160o1268M159P0035P0069p278p1896o8901R711P1053
123F345N8915J72p2635o4351O494O4186P0551q764p0111n7285L91O7954O2583
$$ y = [0, 0, 0, 0, 0, 0, 0, 0, 0, 0, 0, 0, 0, 0, 0, 0, 8, -8, 8, -8, 8, -10, 16, -16, 18, -24, 26, -33, 37, -42, 50, -58, 65, -73, 83, -92, 104, -118, 130, -146, 163, -180, 204, -224, 249, -275, 305, -334, 368, -409, 449, -496, 546, -601, 663, -733, 811, -902, 1004, -1125, 1267, -1437, 1646, -1912, 2260, -2738, 3439, -4575, 6716, -12213, 60535, 96373, -14969, -70994, -74593, 21116, 88495, 81119, -3230, -82227, -73362, 14827, 89479, 76995, -11339, -74683, -74598, 11500, 87841, 73078, -3390, -81334, -70910, 17598, 78806, 74245, -4233, -77485, -68770, 9151, 82863, 70172, -7946, -75331, -69252, 11239, 72619, 69583, -3349, -80689, -65642, 8098, 72767, 68821, -9339, -70607, -66448, 3587, 73656, 66378, -5518, -74419, -64708, 6345, 65260, 65432, -7203, -71554, -65060, -874, 69677, 60913, -9198, -66483, -66092, 1862, 64445]
136F4445k686o4103o6442O465O5157O1974k888o5968n6660k155O2936O5397o219
149E9253o0251o2901J416O4503N5471J743o0365o2488J367N8921O2479k830n9384
162c066n6395l070O0650N7245K117n5664o2833K453N7017N6229L294n7538n5907
175e5468l441N4958N9892N17n4287n8115j303N4851N4057N666n3732n7427j762
188e5594N1087N8275K799n3237n3283n823N2240N5257M603n0798n6653l190N0159
201d158N4054N396n0960n3161o008M8654N6234L684m8007n3790n858M9006N2377
214D7463P272m7606n3862n575M6383N4094N870m6855n1669q103M6354N2813O823
227E3402m5289n3406o664M4799N1537Q232m4777n1623q416M3657N2517P323m2868
$$ y = [64445, 61759, -2344, -68786, -62321, 2836, 64810, 61922, -4046, -60706, -62861, 75, 65472, 59253, -998, -63899, -62483, 2020, 57491, 59234, -1131, -63619, -62252, -3331, 59148, 56318, -3066, -59461, -62531, -1881, 55364, 57481, 1817, -61016, -58563, -1546, 54683, 57977, 439, -55468, -58909, -3951, 55941, 56458, 2171, -55944, -57247, -2396, 51661, 57327, 3595, -53832, -55594, -4507, 53768, 56567, 3330, -49953, -55776, -3536, 51721, 56324, 5526, -51127, -54317, -4158, 49896, 55292, 4332, -48829, -54837, -6183, 50051, 53735, 5728, -48062, -53920, -4914, 47463, 54735, 7129, -46733, -52308, -5925, 48169, 54039, 7184, -44485, -52588, -6234, 46579, 53402, 8113, -45293, -51957, -7158, 44379, 52611, 7834, -43789, -52205, -8548, 43969, 51292, 8424]
240H424n1644q635M3524N0689Q983m2318n1363q646M1795N1110Q904m1616n0146
253d0939r813M1583N0122R143m0246n0348r230M0199M9548J0027l9961m9682j0083
266d9680L9391M9477J0068l8612m9678j0290L8949M8654J0579l7804m9154j0661
278d8761L7603M8815J0792l7583m8339j1180L7225M8287J0845l6564m8312j1093
290d8265L6795M7615J1153l6037m7858j1152L5691M7406J1781l5458m7152j1533
302d7014L5424M6470J1993l4660m6741j1861L4514M6171J2175l3875m6415j2035
314d5854L3410M6044J2288l3263m5930j2549L2967M5263J3241l2951m5380j2978
326d5692L2427M5120J3170l2210m4851j3694L2204M4607J3516l1119m4995j3291
$$ y = [8424, -43220, -51855, -8331, 42358, 51341, 9023, -42340, -50986, -9191, 41919, 50823, 9207, -40939, -50752, -9169, 40953, 50096, 9850, -40498, -49728, -9529, 40019, 50046, 10085, -39597, -49680, -10289, 39188, 49256, 10644, -39034, -49324, -10375, 38279, 48858, 11054, -38100, -48761, -11158, 37657, 48449, 10866, -37473, -48653, -11428, 36859, 47704, 11140, -37172, -48265, -11470, 36145, 47298, 11261, -36597, -47749, -12058, 35348, 47129, 11671, -35481, -47014, -11590, 34880, 46873, 12213, -34528, -46389, -11875, 34296, 46471, 12596, -33819, -45854, -12444, 33600, 45888, 12625, -33305, -45854, -12887, 32376, 45617, 12666, -32714, -45692, -13265, 31855, 45025, 12815, -32036, -45730, -13526, 31081, 44597, 13478, -31517, -44808]
338d4808L0524M4557J3809l0241m4078j4302L0190M4221J3940k9734m4112j4035
350d4069K9701M3510J4541k9240m3262j4467K8641M3895J4230k8535m2960j4927
362d2942K8438M2561J4949k8164m2800j4864K7456M2563J4782k7411m1834j5936
374d3202K7287M2669J4720k6262m2342j4673K6513M1259J6304k6629m1454j5532
386d1342K6152M1861J4547k5237m0814j6526K6130M0276J6290k5458m1249j5208
398d0578K4340M0567J5811k4452l9786j7178K4800M0713J5581k2951m1092j5458
410c9683K3676L8972J7412k3703l9788j6516K2588M0391J5612k2152l8872j7806
422c9869K3323L8323J8074k2581l9577j5339K0693L9266J7698k2125l7142j9121
$$ y = [-44808, -14284, 30273, 44082, 13841, -30237, -44539, -14349, 29872, 43812, 14078, -30034, -44069, -14368, 29142, 43683, 14443, -28819, -43286, -14645, 29250, 43480, 14945, -28015, -42942, -14504, 28057, 43006, 14842, -27958, -42822, -15366, 27197, 41979, 14568, -27266, -43202, -15915, 26754, 41474, 15212, -27130, -41803, -15290, 25969, 42273, 15644, -25810, -41342, -15190, 26671, 41218, 15981, -24833, -41359, -15229, 25047, 41337, 15879, -25370, -40578, -16238, 24329, 40140, 15688, -24098, -41276, -16476, 24237, 39818, 16867, -24225, -39683, -16007, 22965, 40377, 16674, -23114, -39630, -17042, 23349, 38961, 16809, -22063, -39869, -16546, 21777, 39851, 17270, -22307, -37646, -16953, 22313, 40011, 17886, -19256, -38377]
434c8377K1987L9365J6150k0301l8682j6972K0311L6906J9216k1797l7868j7493
446c7555J9353L8989J5937j9216l6327j9783K0935L6696J8113j8532l8480j6500
458c6370J8766L6484J8451j8818l6130j9631J9576L7004J6306j6688l7635j7645
470c6330J8629L4137K0454j8897l6791j7032J6701L6446J7236j6677l5256j9331
482c6711J8480L4138J9581j7349l6856j5647J5169L4687J9817j8096l3504j9777
494c6068J6039L6310J6653j5190l4499j7957J5220L3609K0685j7170l3660j7787
506c3815J3835L6193J7010j4585l1944k1387J6254L3555J8276j3951l4466j7850
518c2875J3015L3144J9460j4871l1993k1007J4888L3825J6682j1715l3229j9346
$$ y = [-38377, -16390, 22975, 39125, 18824, -19858, -36830, -16519, 20387, 39603, 17806, -20062, -37555, -18202, 20787, 36724, 17508, -18819, -38602, -17667, 19029, 37142, 18610, -19870, -36370, -17604, 18880, 37331, 18513, -17617, -37248, -17672, 19332, 35638, 18950, -18685, -36330, -17701, 16436, 36890, 17993, -18798, -35830, -19129, 17317, 34553, 17876, -17380, -36711, -18231, 15907, 35488, 18139, -18717, -34364, -19195, 15492, 35309, 17213, -16291, -36068, -20029, 16281, 32934, 17744, -16755, -34712, -19492, 14117, 34802, 17632, -16028, -33815, -19980, 16213, 33223, 18638, -13306, -34693, -18439, 15116, 33392, 19441, -15025, -32875, -19860, 13284, 32744, 17873, -14120, -35127, -20239, 13586, 30268, 18553, -14676, -34022]
530c4022J3964L1179K0709j3304l3145j8025J2433L2580J8293j1618l1652k0615
542c3223J4004L0723J9494j1722l3180j7162J0730L0710K1091j3030l0485j9912
554c1962J1773L1732J8264j0387l1123j9482J1613K9600K1229j2019l0743j8109
566b9614R178L1358J9045j0979k8755k1108J1499K9894J9060r473l0564j8243
578b8702R143K9266K0638j0513k8332k0287R931L0070J8076q158k9162k0451J0233
591a8248K7915K0493r329k9360j8976Q139K8913J9195q518k8127k0669R502K7649
604H579J9618p592k9129j8756P676K7437K0894q930k6898k0070P805K7511J9533
617B7678p192k7186k0395P813K6365K0742p426k7491j8994N937K7410J9826o943
$$ y = [-34022, -20058, 11121, 31830, 18526, -14619, -32644, -20211, 12369, 30662, 19044, -12608, -33223, -19219, 11504, 30998, 19276, -13904, -31066, -20336, 10374, 31465, 18435, -12050, -31962, -20189, 11543, 29807, 19420, -11703, -31185, -19572, 10028, 31257, 19238, -11505, -29614, -20436, 10922, 29967, 18988, -9767, -30875, -19376, 10518, 29578, 20105, -10459, -28702, -19559, 9707, 30345, 19832, -8500, -28787, -18856, 11214, 29290, 21132, -8030, -28481, -18248, 9667, 30160, 20831, -8529, -27505, -19366, 9547, 28742, 20224, -7903, -28572, -19070, 8579, 28197, 20605, -8524, -27280, -19604, 7833, 28727, 19797, -7101, -27171, -19366, 8145, 27678, 20486, -6700, -27095, -19282, 7083, 27825, 20399, -7092, -26086, -20149, 7261, 27087, 20144]
630B0144k6187k0847P340K6578J9261n928k6870j9429O407K5818K0394p004k5243
643e566j9996N514K6176J9415n600k5667k0120O107K5119J9972n513k5870j9125
656b5154N279K5540J9622n637k4419k0223N303K4903J9534m693k5083j9734N009
669a9753K4560J9828n239k3951k0051M512K4777J8904l994k4280j9524M259K3771
682C819J9797l869k4202j9251L654K3771J9876m078k3229k0001L804K3570J9308
695B2969l210k3413j9552L564K2607K0117l451k2746j9694K859K2898J9853l081
708A9720k2619j9845L274K2200J9481k590k2481j9353K700K2197J9411k898k1256
721b059j9852K411K1865J9659k662k1644j9465K290K1322J9572j827k1606j9364
$$ y = [20144, -6043, -26890, -19550, 7028, 26289, 20361, -6509, -25938, -19531, 6287, 26681, 19677, -5566, -25562, -20048, 6128, 25543, 19943, -5724, -25844, -19737, 5382, 25354, 19841, -6029, -25154, -19875, 5665, 25287, 19650, -4769, -24992, -19689, 5214, 24748, 20055, -5028, -24762, -19753, 4807, 24635, 19396, -4555, -24606, -20094, 4683, 23587, 19593, -4687, -24211, -19952, 3819, 23616, 19747, -4455, -23706, -20052, 3719, 23595, 19517, -3712, -23713, -19909, 3661, 22969, 19759, -3654, -23206, -19642, 2965, 23082, 19631, -3115, -22809, -19950, 2948, 22801, 19720, -2899, -22744, -19470, 2730, 22211, 19621, -2860, -22213, -19513, 2684, 22095, 19197, -2059, -21911, -19500, 2365, 22024, 19362, -2282, -21747, -19457, 1865, 21437, 19610, -1996, -21360]
734b1360J602K1540J9444j981k0915j9355J657K0711J9449j396k1226j8861R68
747a9723K0942J9535j476k0437j9031R89K0497J9513j400k0357j9436J317K0072
760A005J9208j220j9819j9110R78J9666J9094q73j9803j8946Q58J9494J8880l50
774A9062j9210j9099J70J9210J9039l15j8818j9061K0J9280J8577k7j8882j8769
788a8823J57J8279J8908K80j8646j8681j10J8457J8538M28j8450j8589k78J8094
802d36J9138L59j8335j8364r25J7906J8673M47j7276j8861q95J7454J8457J178
816A8520j7602j8686j146J7327J8936R45j7148j8050j617J7391J8234J311j6830
829A585j8457j273J6832J8079J911j7220j7598k078J6554J8214J348j6246j8421
$$ y = [-21360, -19758, 1782, 21226, 19245, -1670, -21025, -19368, 1343, 20792, 19396, -1830, -20691, -19723, 1219, 20754, 19278, -1159, -20190, -19201, 1296, 20809, 19409, -948, -20384, -19067, 1005, 20213, 18993, -826, -19936, -18958, 708, 19802, 18929, -874, -19820, -18962, 532, 19412, 19062, -148, -19247, -19077, 133, 19172, 18857, 39, -19022, -19002, 278, 18855, 18828, -54, -18823, -18666, -387, 18521, 18801, 155, -18526, -18636, -179, 18359, 18787, 337, -18252, -18530, -436, 18702, 19061, 726, -17638, -18563, -657, 18016, 18463, 1187, -17674, -18569, -1115, 17342, 18520, 918, -17768, -18914, -1587, 17349, 18294, 1146, -16904, -18521, -1130, 17104, 18415, 1585, -16872, -18145, -1313, 16766, 18677, 1457, -16141, -18219, -1665, 16549, 17897, 1651, -16770]
842a6770j493J6110J7875K260j6430j8059j817J5932J8255J959j5847j8027k212
855a8264J6129J7658K228j5741j8042j866J5295J7953K502j5766j7373k868J5587
868b568J7938K153j4979j7662k743J5539J7427L049j5079j8060k254J4399J8024
881A5184K749j4672j7365l439J4876J7520K773j4313j8086k415J4046J7246L297
894A7401j4623j6904l470J4001J7866K522j3332j7276l316J3800J6898M283j4023
907C827j7378l345J3272J7689K960j3403j6636m306J3626J6707M115j3444j7333
920a3649l251J2525J7377L960j3356j6484m378J3236J7199L277j2366j7107l863
933a6880J2930J6264M804j2945j6785m078J1971J7483L718j2428j6029m950J2947
$$ y = [-16770, -18263, -2153, 15722, 17982, 1552, -16507, -18324, -2392, 15863, 17822, 1975, -16052, -18264, -2135, 15523, 17751, 2010, -16032, -17898, -2603, 15350, 17852, 2086, -15287, -18155, -2568, 15370, 17523, 2544, -15118, -17861, -2322, 15105, 18154, 3075, -14985, -17239, -2840, 15184, 17933, 3261, -14104, -17543, -2667, 14853, 17626, 3313, -14773, -17188, -3142, 14104, 17401, 2778, -14126, -17596, -3595, 14271, 16793, 3461, -13815, -17131, -3331, 13567, 17850, 3827, -13551, -16896, -3624, 14065, 17025, 3622, -13014, -17320, -3694, 13013, 17128, 3684, -13649, -16900, -4375, 13002, 16962, 3606, -12878, -17256, -4020, 13179, 16456, 4090, -13017, -16880, -3950, 12314, 17118, 4173, -12612, -16690, -4719, 12764, 16482, 4054, -11975, -16925, -3978]
946c978J6102M337j1715j6855l911J1922J6330M918j2282j6335m711J1575J7142
959A2539L858j1268j6664m573J1856J5583N341j2001j6677l918J0681J6563M635
972A5955j1186j5981n041J1399J6026M913j0872j6594m249J0614J5971N318j1364
985D909j5540n281J0834J6117M466j0287j5746n240J0604J5255N778j0737j5813
998a0681m974R841J6248M906j0228j5160n804J0848J5455M763r648j5674n281
1011a5389R973J5159N989j0338j5138n709R790J5749M977r519j5434n386R744
1024e532J5130O024r837j5450n100Q999J5386N850r536j5148o120R868J4962N385
1038A4881q753j5645n304R047J4630O259r523j4489o265R107J4918N654q657j4752
$$ y = [-3978, 12124, 16461, 4746, -12109, -16020, -4098, 12232, 17150, 4868, -11467, -16178, -4603, 12539, 16397, 5129, -11535, -16108, -4252, 11331, 16672, 4671, -12006, -15924, -5243, 11320, 15955, 4769, -11212, -16253, -4854, 11172, 16085, 5213, -11381, -15630, -5016, 10955, 16273, 4909, -10631, -15912, -5078, 11039, 15505, 5218, -10528, -15768, -5164, 10091, 15869, 5132, -10681, -15655, -5814, 10434, 15340, 5112, -10048, -15852, -5004, 10451, 15214, 5566, -10108, -15389, -5416, 9743, 15732, 5394, -9744, -15453, -5663, 10086, 15063, 5544, -9890, -15276, -5532, 9598, 15622, 5785, -9665, -14765, -5766, 9620, 15470, 5934, -9214, -15334, -5466, 9496, 14881, 6128, -9517, -14821, -5774, 8856, 15115, 5592, -8897, -15162, -6055, 8863, 14517, 5860, -8892]
1052h892n906Q927J4212O335q779j4956n353Q009J5075N832q561j4346o478Q938
1066e943J4271O024p908j5120o137Q444J4225O561q526j4102o079P687J4906N688
1080A3991p818j4236o383Q246J3863O619p757j4594n887P409J4037O428p779j3786
1094g647o672P853J4014O189p229j4275o080P461J3677O636p645j3415o472O785
1108f820J4290O364p220j3605p015P559J3418O818o848j4163o330O807J3686O702
1122A3643o889j3490o952P045J3387O507o510j3378o790O724J3255O878o514j3624
1136f708o461O469J3365O675o434j3431o646O482J2950O827n986j3364o695N994
1150f963J2896P092n867j3084p036N994J2922P083o168j2955p121O015J2602P194
$$ y = [-8892, -14798, -5871, 8341, 14676, 5897, -9059, -14412, -6403, 8672, 14504, 5943, -8403, -14881, -5943, 8328, 14352, 6444, -8676, -14813, -6369, 7856, 14417, 5891, -8211, -14290, -6603, 8303, 13991, 6173, -8063, -14446, -6200, 7663, 14282, 6525, -8069, -13956, -6547, 7490, 13918, 6139, -7647, -14319, -6466, 7548, 13737, 6508, -7767, -13847, -6386, 7291, 13927, 6282, -7133, -13605, -6820, 7470, 13834, 6614, -6991, -14006, -6447, 6971, 13789, 6941, -7222, -13552, -6745, 6941, 13643, 6754, -6736, -13688, -6643, 6744, 13251, 6741, -6637, -13427, -6703, 6552, 13430, 6916, -6708, -13169, -6700, 6665, 13340, 6906, -6525, -13171, -6689, 6261, 13088, 7102, -6262, -12957, -6963, 5933, 13025, 7158, -5926, -12962, -6968, 5954, 13037, 6869, -6086, -13207, -7192, 5410, 12604]
1164A2604n741j2635p013N557J2965P280n782j2831o952N544J2529P199n530j2913
1178e719o975N532J2561P129n684j2148p320N143J2554P126m924j2721o925N331
1192g040J2203P159n050j2180p334N026J2151P414m916j2277p332M821J1988P428
1206A2061m532j2226p381M571J2179P402m500j1986p683M694J2093P259m686j1756
1220d491p442M656J1858P336m394j1721p133L821J1838P749m654j1410p810M499
1234g298J1372P480m002j1648p511L948J1711P202l526j1397p727L941J1564P682
1248A1791m095j1472p532L933J1031P599l571j1304p648L688J1192P723l672j1097
1262c434p732L502J1127P748l525j1099p593L480J0686Q009l396j0897p930L680
$$ y = [12604, 6863, -5772, -12785, -7228, 5737, 13017, 7235, -5596, -12548, -7004, 5525, 12724, 7194, -5719, -12694, -7162, 5399, 12528, 6844, -5304, -12624, -7481, 5073, 12199, 7275, -5446, -12371, -7040, 5163, 12322, 7272, -4908, -12242, -7216, 4935, 12349, 7433, -4844, -12176, -7355, 4633, 12061, 7529, -4697, -12078, -7507, 4672, 12074, 7574, -4412, -12095, -7401, 4692, 11951, 7265, -4491, -11933, -7277, 4581, 11917, 7523, -4198, -11331, -7510, 4328, 12077, 7423, -3987, -11797, -7298, 4074, 11554, 7552, -4096, -11607, -7659, 4052, 11254, 7728, -3669, -11396, -7455, 4109, 11791, 7696, -3776, -11308, -7375, 3656, 11255, 7684, -3620, -11268, -7580, 3612, 11335, 7663, -3434, -11166, -7664, 3463, 11211, 7686, -3413, -11006, -7526, 3160, 11169, 7773, -3124, -11054, -7374]
1276g374J0796P474k887j1108p864L514J0410P933l357j0549p743L138J0560P893
1290A0836l318j0703p761K948J0650P885k794j0563p523K700J0290P719k593j0371
1304b598p709K415J0566P488k401j0371p683K490J0182P954k372j0424p609K248
1318g824J0033P857k163j0044q044K436J0223P379j785j0142p888K257R903P887
1332A0085k193r846p874J759R881P903j912r664q117J822R953P988k186r764p547
1347i712J795R883P695j810r436q033J805R482P705j431r597p998J728R238Q200
1362I514j886r270p910J549R491P558j226r319q063J477R421P956j507r384p271
1377h870N88R289Q167j379q915q006J302Q829P956q34r453p505Q33Q945Q232j185
$$ y = [-7374, 3422, 10896, 8009, -3099, -10963, -7449, 2961, 10894, 7537, -3012, -10755, -7617, 2943, 10836, 7518, -3185, -10946, -7998, 2652, 10537, 7743, -2820, -10343, -7643, 2647, 10366, 7773, -2598, -10307, -7892, 2674, 10162, 7761, -2610, -10293, -7803, 2379, 10333, 7961, -2463, -10072, -7824, 2209, 10066, 7903, -2141, -10185, -7749, 2474, 9853, 8068, -2074, -9962, -7705, 2198, 10085, 7892, -1954, -9828, -8069, 1812, 9715, 7803, -1861, -9978, -8156, 1797, 9785, 7599, -2165, -9712, -7917, 1966, 9661, 7851, -1585, -9618, -7813, 1669, 9374, 7943, -1654, -9652, -7924, 1314, 9514, 7628, -1642, -9552, -8003, 1488, 9046, 7820, -1499, -9562, -8085, 1336, 9292, 7785, -1599, -8870, -8282, 1007, 9174, 7795, -1120, -9126, -7824, 1005, 8961, 8127, -1326, -8831, -7998, 947, 9179, 7994]
1393G994r080p870Q76R278P786o72r157q202J184Q913Q046j054q667p878M83R143
1409A123P566o84q779p935O82Q825P970o71q933p713M62Q404Q302p27q011q159
1425h278N91Q414P835m66q472p818N69P958P997j90q490p873K00Q597P753l73
1441G954q421p790M52P964P881k92q051p620Q4P966P766k5p853q162J48Q088P792
1458G881J13p957p765j83P762Q227j71p771p849j90P820P878r7p370q121L0P771
1475HP714J54p713p901j10P526Q007j2p406p667m59P640P556P40p668q034q4P220
1493d89P856M39p316p595j103P624Q058K14p065q101k61P289P534P81p446p512
1509g093o46P181P788M29o936p607j030P217P745M98o967p603p00O793Q015M85
$$ y = [7994, -1086, -8956, -8080, 1198, 8984, 8312, -845, -9047, -7863, 1050, 9096, 8042, -625, -8503, -8020, 1123, 8689, 8005, -774, -8709, -8027, 798, 8768, 8097, -836, -8549, -8087, 317, 8619, 7892, -119, -8278, -7687, 727, 8562, 8096, -376, -8194, -7625, 333, 8330, 8140, -350, -8223, -8023, 574, 8327, 7954, -467, -8257, -7805, 159, 8040, 7748, -303, -7923, -7839, 127, 7893, 7868, 15, -8147, -7999, 89, 7881, 7994, 37, -7728, -7911, -149, 8078, 7907, 136, -7713, -7903, -83, 7795, 7698, 328, -7793, -7763, 8, 7722, 7876, 163, -7738, -7848, -322, 7685, 7673, 267, -7400, -7859, -219, 7337, 8077, 409, -7625, -7709, -489, 7367, 7806, 490, -7105, -8208, -584, 7474, 7688, 623, -7478, -7739, -450, 7084, 7865, 419, -7093, -7739, -558, 7230, 7659, 723, -6884, -7914, -697, 7048, 7546, 579, -7024, -7724, -931, 7084, 7569]
1525G569o959p477q55O963P801M36o526q030o93O928P625J321o909q087o63O727
1541h29P518J006o427q053r88O703P621J209o481p758r66O453P617R43o409p879
1557f720j005O405P926J309o682p463j303O162P665J390o494p370j465O265P726
1572F346J216o222p431j781O283P801J386n973p957j426O030P921J448o290p455
1587f104j504O012P671J467n741p693j781O261P424J368n520p786j681N764P565
1602E722J596n726p674j541N743P521J966n950p497j700N524P529J911n741p371
1617e688j975N693P635J575n350p553j648N346P416K022n444p424k201N569P286
1632E259K203n548p420j699N092P337J917m871p637k016N256P312K240n254p462
$$ y = [7569, 610, -6867, -7722, -759, 7042, 7478, 952, -7078, -7771, -843, 6782, 8103, 1194, -6893, -7556, -829, 6689, 7695, 1268, -6785, -7773, -1070, 6551, 7760, 1279, -6479, -7445, -992, 6625, 7568, 1159, -6720, -7725, -1320, 6606, 7915, 1233, -6230, -7533, -1371, 6294, 7684, 1190, -6180, -7645, -1380, 6346, 7562, 1340, -6091, -7872, -1589, 6212, 7598, 1625, -6332, -7758, -1728, 6193, 7641, 1351, -6104, -7608, -1596, 6075, 7542, 1801, -5892, -7673, -1412, 6012, 7380, 1860, -5926, -7607, -1843, 5722, 7318, 1592, -6082, -7623, -1880, 5641, 7607, 1657, -5840, -7540, -2016, 5513, 7424, 1683, -5688, -7663, -1970, 5665, 7240, 1890, -5663, -7311, -1965, 5451, 7473, 2029, -5395, -7596, -2027, 5259, 7462, 1914, -5506, -7205, -2113, 5224, 7141, 2270, -5367, -7383, -2127, 5185, 7425, 2171, -5291]
1647e291j905N032P028K468n281p449j893M867P426K471n264p348k108N165P076
1662D994K020m734p015k636N126P117K350m990p093k340M764P380K106m703o957
1677d611k420M425P294K314m671p068k455M895O759K657m730p182j922M355O774
1692D414K453m371o862k695M650O749L007m756o873k683M223P143K469m333o915
1707d380k523M330O895K585l999p174k395L968O963K643m209o794k661L974P203
1722D426K660m372o687l089M407O867K655m075o982k491L792O783K673l770o725
1737c928k957L899O927K826l708p026k820M017O431L069l870o928k282L415O685
1752C750L066l809o555l406L884O712K804l476o749k714L754O018L258l421o799
$$ y = [-5291, -7196, -2164, 4864, 7332, 2051, -5398, -7291, -2424, 5002, 7473, 2209, -5139, -7247, -2082, 4994, 7014, 2280, -4735, -7371, -2245, 4872, 7222, 2232, -4861, -7201, -2437, 4943, 7049, 2346, -4611, -7031, -2606, 4688, 7002, 2331, -4737, -7192, -2297, 4462, 7119, 2389, -4793, -6715, -2360, 4414, 6867, 2496, -4366, -7061, -2411, 4338, 7345, 2589, -4284, -6967, -2744, 4399, 6868, 2535, -4380, -6903, -2573, 4322, 6907, 2908, -4266, -6661, -2693, 4270, 6913, 2704, -4090, -6751, -2777, 4426, 7086, 2714, -3973, -7062, -2655, 4212, 6867, 2792, -4190, -6681, -2889, 3894, 6567, 2797, -3928, -6885, -2986, 3941, 6767, 3059, -3967, -6787, -2770, 3661, 6730, 2860, -4068, -6350, -2935, 3750, 6816, 3007, -3548, -6954, -3070, 3642, 6446, 2970, -3779, -6493, -2739, 3279, 6537, 3116, -3683]
1767c683k748L427O651K875l467o351l400L722O538K889l401o471k944L649O457
1782C743K890l446o546l138L292O501L206l136o549k837K806O508L103l175o253
1797c031l247L017O427L161l038o392l245L237O135L272l097o313l363L233O246
1812C002L382l226o281l118K798O172L453l009o432k932K970O069L347k896o205
1827b906l168K864O000L468k898o106l342K616O042L320k570o190k948K532O087
1842B801L363k892n828l332K692O066K982k129o187l366K330O015L304k464n889
1857b534l485K509N993L434k419o009l488K339N837L690k351n977l358K246N900
1872B327L513k387n699l677K408N744L381k072n837l328J683O002L629k398n646
$$ y = [-3683, -6431, -3004, 3647, 6522, 3055, -3296, -6696, -2974, 3564, 6453, 3052, -3419, -6363, -2714, 3743, 6633, 3187, -3359, -6497, -3205, 3296, 6502, 3366, -3183, -6020, -3214, 3294, 6397, 3222, -3031, -6278, -3261, 3166, 6327, 3289, -3103, -6348, -3111, 3024, 6296, 3199, -3114, -6477, -3244, 3002, 6384, 3158, -3123, -6241, -3443, 2729, 6182, 3173, -3259, -6191, -3221, 2848, 6195, 3299, -2906, -6074, -3210, 2790, 6258, 3360, -2746, -6088, -3472, 2570, 5890, 3320, -2870, -5818, -3286, 2801, 6164, 3272, -2556, -5888, -3196, 2870, 5852, 3723, -2464, -5830, -3500, 2515, 5819, 3355, -2534, -6019, -3510, 2483, 5917, 3498, -2511, -5999, -3660, 2177, 5867, 3516, -2461, -5819, -3573, 2327, 5840, 3453, -2246, -5923, -3515, 2229, 5610, 3538, -2299, -5627, -3944, 2058, 5687, 3289, -2357]
1887b357l322J805O185L216j909n750l576K085N633L771j969o077l155J767N793
1902B140L350j932n715l539K191N693L217j624n772l442J688N724L823k268n488
1917a954l631J829N792L281j551n376l841J982N245L644j867n428l557J840N384
1932A792L766j871n628l315J725N157L829j550n466l796J884N239L547j754n371
1947a812l248J307N495L610j495n075l996J481M903M230j643n180l700J213N112
1962A202M104j542n221l854J776N056L461j270n168l598J263N126L765j454m839
1977a193l822J323N098L553j254n046l721J537M646L992j262n188l676J202N196
1992A385L573j145m950l963J249M957L705j156n024l548R10N050L849j168m576
$$ y = [-2357, -5679, -3874, 2311, 5527, 3618, -2132, -5708, -3623, 2010, 5781, 3812, -2265, -5420, -3653, 2140, 5490, 3558, -2157, -5696, -3505, 2188, 5405, 3781, -1991, -5433, -3745, 1979, 5802, 3534, -1954, -5585, -3756, 2036, 5317, 3766, -1610, -5451, -3469, 1776, 5420, 3553, -1875, -5432, -3592, 1792, 5558, 3687, -1941, -5256, -3531, 1626, 5455, 3905, -1561, -5357, -3473, 1766, 5313, 3559, -1812, -5060, -3753, 1742, 5352, 3857, -1218, -5214, -3733, 1170, 5400, 3757, -1423, -5123, -3910, 1202, 5306, 3764, -1457, -5311, -3535, 1521, 4982, 3712, -1456, -5054, -3791, 1335, 5100, 3646, -1193, -5015, -3692, 1406, 4959, 3705, -1341, -5062, -3525, 1121, 5113, 3851, -1337, -5013, -3811, 1385, 4958, 3813, -1137, -5100, -3851, 1106, 4811, 3655, -1369, -4917, -4007, 1043, 4892, 3724, -852]
2007h52m058J009M920L627r86m737l835J125M787L749j171m697l793J106M606
2022H00L967r61m592m005Q60M793L896r53m570l812P98M725L637o99m661l932
2038d709R93M593L738q41m454l963Q85M180L880m43m650l733P37M407L913p94
2054C739m438l694N03M855L705p34m656l794Q97M344L802j067l912l949P39L982
2070C22M239r80m125l737N45M301L660l77m250l701M24M281L939o57m386l830
2086d332P42M166L634l48m225l663M31M003L659j14m263l700J94M349L543l61
2102C715l784m217N19L939L918m26l895l873L01M003L809l55l968l619J64M146
2118C77L747l30l799m016L2L833M068l06l764l669M1L768L923j93l855l716j70
$$ y = [-852, -4910, -3901, 1019, 4646, 3660, -1077, -4912, -3787, 1000, 4749, 3578, -1119, -4912, -3806, 800, 4767, 3806, -786, -4791, -3931, 862, 4758, 3805, -765, -4577, -3779, 946, 4583, 3884, -777, -4709, -3716, 877, 4615, 3774, -680, -4643, -3758, 422, 4302, 3859, -791, -4524, -3787, 620, 4533, 3739, -699, -4393, -3890, 965, 4670, 3936, -720, -4514, -3617, 727, 4529, 3462, -450, -4399, -3660, 322, 4561, 3581, -544, -4281, -3736, 565, 4225, 3848, -402, -4103, -3679, 602, 4541, 3884, -502, -4332, -3590, 576, 4210, 3862, -363, -4026, -3595, 408, 4067, 3953, -310, -4010, -3816, 533, 4076, 3715, -69, -4286, -3767, 172, 4090, 3664, -231, -4104, -3803, 200, 4009, 3654, -314, -3933, -3769, 377, 4124, 3794, -5, -4021, -3989, -156, 3912, 3606, -158, -3827, -3786, -18, 3905, 3712, -143, -3859, -4029]
2135d029M212L796j19m241l701J49L870L844k6l755l658O3L784L534k84l352l793
2152c706K35L415L976j33l804l570k01L590L710K57l780l684j91L570L866j0l322
2169B18l897O7L342L707K76l620l528l37L488L659M28l734l377o17L519L905m5
2186C454l478l369l41L288M000m9l054l883j71L262L722L37l537l481k97L151
2202d46L827J85l101l851j3K886M051K38l424l742l05L279L805K43l231l597m47
2219c643L308L637L49l393l248o82L211L794K39l149l592n08L240L694N37l274
2235E20l720j24K984L357O32l164l522n20K940L735O92l266l587m62K727L648
2251B870O77k968l429p33K776L701N53k830l509o88K940L596N24k795l859l90
$$ y = [-4029, 183, 3979, 3860, -381, -4082, -3933, -63, 3781, 3755, 0, -3658, -3595, 189, 3723, 3439, 87, -3706, -3471, -56, 3920, 3787, -17, -3587, -3788, -198, 3512, 3769, -11, -3695, -3886, -316, 3550, 3540, 218, -3679, -3612, -270, 3437, 3713, 93, -3435, -3772, -284, 3375, 3803, 69, -3308, -3925, -406, 3499, 3454, -24, -3393, -3734, -446, 3554, 3505, 451, -3432, -3603, -341, 3381, 3718, 181, -3300, -3597, -446, 3381, 3566, 465, -3386, -3399, -513, 3538, 3776, 352, -3390, -3695, -416, 3389, 3632, 401, -3196, -3643, -335, 3302, 3651, 258, -2990, -3672, -461, 3333, 3572, 423, -3169, -3677, -437, 3257, 3794, 520, -3200, -3324, -340, 3017, 3649, 485, -3037, -3557, -617, 3118, 3810, 544, -3043, -3505, -778, 2870, 3547, 579, -2850, -3583, -807, 2894, 3447, 617, -2892, -3580, -640, 2956, 3480, 685, -3174, -3564]
2267c564K848L809M28l021l343q33K822L640O32k896l333q39L074L303P64k948
2283E43l424o92K745L626Q46k899l555q86K794L519J073k969l342q58K706L574
2299B801O19k513l538n64K233L474J085k773l510p97K496L694Q29k598l415p46
2315c223K349L328P94k355l361j027K762L385N32k280l533q67K606L452Q24k441
2331I45l491r23K265L707R56k571l286r64K380L446Q98k527l335j063K473L267
2347B177J087k465l174j126K486L129J093k345l226j124K632L201J076k278l522
2362b379j072K411L271J243k185l542j079K115L281J317k268l395r52K005L436
2377B207J207k339l050j368K307L344R30k200l122j487K419L277J349k412l022
$$ y = [-3564, -716, 3093, 3521, 500, -2843, -3676, -854, 2786, 3418, 522, -2811, -3650, -576, 2727, 3491, 543, -2881, -3573, -828, 2798, 3644, 745, -2810, -3696, -902, 2617, 3690, 721, -2621, -3479, -773, 2801, 3420, 907, -2631, -3195, -962, 2512, 3597, 824, -2686, -3483, -987, 2707, 3536, 938, -2477, -3223, -874, 2454, 3248, 893, -2468, -3495, -733, 2652, 3184, 904, -2629, -3496, -890, 2562, 3386, 945, -2546, -3469, -1204, 2503, 3459, 888, -2398, -3362, -982, 2464, 3362, 835, -2500, -3563, -1090, 2177, 3264, 799, -2375, -3501, -1015, 2114, 3207, 862, -2364, -3488, -856, 2345, 3421, 1143, -2379, -3451, -1040, 2231, 3474, 1289, -2253, -3332, -1217, 2064, 3381, 1113, -2282, -3234, -1229, 2207, 3414, 1075, -1975, -3343, -1036, 2308, 3238, 1038, -2084, -3571, -1152, 2125, 3474, 1062, -1960]
2392a960j502K337L304R99j930l172j388J955L419R88j991l165j173K032L216
2407A969J322k288l175j165J906L477J033j771l375j258K188L065J324j967l277
2422a992j151J942L277J033j920l156j343K055L260J116j814l139j340J909L232
2437A969J059j779l167j004J556L249J214j713l196j540K119L080J151j644l087
2452a733j241J761L052J463k109l035j342J836L190J175j534l297j338J748L068
2467A664J442j597l211j115J455L126J133j591k995j293J588L330J171j752k925
2482a570j415J523L108J391j654l015j210J498K879J368j657k709j655J937K685
2497A504J596j828k734j525J792K689J551j413l075j415J477K730J607j536l030
$$ y = [-1960, -3462, -1125, 2179, 3178, 1248, -1924, -3312, -1357, 2062, 3050, 1059, -2106, -3279, -1247, 1969, 3291, 1003, -2172, -3337, -1431, 2046, 3079, 1308, -2067, -3325, -1137, 1928, 3252, 1285, -1992, -3143, -1201, 2076, 3109, 1189, -1967, -3310, -1255, 2005, 3121, 1307, -1832, -3172, -1263, 1969, 3028, 1249, -1918, -2922, -1366, 1883, 3097, 1384, -1812, -3352, -1233, 1847, 2998, 1354, -1733, -2974, -1213, 1839, 3302, 1193, -1842, -3184, -1348, 1842, 3017, 1483, -1814, -3152, -1404, 1664, 3106, 1509, -1702, -2817, -1362, 1764, 2897, 1306, -1689, -2982, -1394, 1936, 3107, 1355, -1570, -2985, -1462, 1646, 3037, 1383, -1632, -2842, -1344, 1535, 2903, 1246, -1463, -3118, -1181, 1504, 3100, 1272, -1462, -2987, -1195, 1494, 3045, 1632, -1443, -2858, -1381, 1349, 2956, 1420, -1610]
2512a610j339J381K893J582j554k953j284J326K937J496j389k944j515J508K842
2527A377J550j509k792j555J411L038J541j767k680j292J109L033J200j340k777
2542a453j568J586K737J331j189k600j646J241K768J749j683k531j513J276K714
2557A219J423j286k548j440J111K532J729j083k676j918J402K880J510j091l082
2572a318j371J089K757J502j073k651j819J343K883J330j341k585j575J294K825
2587A290J556j253k538j642J196K563J362r54k732j520J126K744J377r16k785
2602a126j333J036K586J542j236k568j561J163K444J638r02l046j174Q35K727
2617A025J719j131k372j800R36K491J817j195k407j568Q55K341J835r75k742j415
$$ y = [-1610, -2949, -1568, 1325, 2907, 1353, -1600, -2884, -1558, 1379, 2875, 1486, -1458, -2973, -1465, 1377, 2927, 1418, -1374, -2929, -1518, 1520, 3061, 1294, -1386, -2678, -1569, 1464, 2664, 1324, -1453, -3021, -1435, 1302, 2633, 1444, -1156, -2802, -1561, 1207, 2956, 1273, -1258, -2771, -1495, 1219, 2642, 1356, -1192, -2632, -1521, 1011, 2740, 1657, -1019, -2937, -1535, 1345, 2855, 1764, -1318, -2689, -1600, 1157, 2659, 1586, -1065, -2884, -1541, 1342, 2672, 1331, -1254, -2829, -1535, 1290, 2846, 1593, -945, -2587, -1391, 1172, 2534, 1580, -1152, -2672, -1546, 1198, 2575, 1659, -1126, -2459, -1423, 1163, 2705, 1469, -1099, -2660, -1497, 947, 2585, 1683, -1363, -2537, -1702, 1025, 2744, 1613, -759, -2559, -1623, 868, 2685, 1490, -917, -2485, -1630, 711, 2546, 1571, -1171, -2586]
2633b586Q51K643J401o84k399j711Q13K604J360q19k291j678Q79K847J010n60
2649A680k290j919J015K129J725o24k347j674N78K533J465p36k149j724Q57K356
2665H75J780j114k245j562M69K738J624r40k359j685Q53K441J589r50k257j499
2681b242L33K440J737n84k192j814P09K290J575n90k441j260L85K389J484p35
2697A484k253j732P97K233J705m73k354j600N90K177J553m83k187j658N92K080
2713D71J637o20j926j694N75K028J797n48k174j516L58K231J489n82k263j307
2729b044K93K385J513n24k271j454L98K129J765m45k200j690M90K168J386n92
2745A307j972j487L11K485J062m8k273j555O00J987J918q00k106j508O64J976
$$ y = [-2586, -1735, 908, 2309, 1625, -774, -2485, -1672, 932, 2292, 1473, -818, -2496, -1617, 1230, 2240, 1680, -610, -2529, -1514, 615, 2340, 1716, -631, -2305, -1727, 806, 2271, 1535, -614, -2338, -1481, 875, 2655, 1541, -704, -2266, -1797, 941, 2565, 1625, -734, -2419, -1566, 875, 2464, 1514, -743, -2242, -1909, 531, 2268, 1684, -508, -2322, -1613, 677, 2252, 1662, -779, -2039, -1654, 735, 2219, 1484, -769, -2501, -1704, 529, 2234, 1761, -593, -2193, -1603, 574, 2127, 1644, -543, -2201, -1609, 471, 2108, 1488, -438, -2132, -1557, 471, 2268, 1720, -454, -1970, -1612, 619, 2108, 1526, -737, -2044, -1751, 634, 2147, 1623, -648, -2102, -1704, 425, 2190, 1745, -455, -2145, -1655, 513, 1899, 1307, -665, -2152, -1841, 644, 1706, 1658, -615, -2170, -1570, 417, 2335, 1535, -571, -2079, -1415, 561]
2761E61J715p64k021j598N49J877J662n44j800j394j2K052J664l87j941j592M80
2778a493J833J611k49k272j338P20J768J383n64j590j765M66J693J674l52k111
2794e86j324K11K032J673m16j886j680L31K011J597n95j436j931N63J884J446
2810A894l35j720j726L38J796J425o4j901j694O66J377J721j4k092j301m1J939
2827B68J610rk312j410K06K020J454m53j295j829P0J886J591j09j941j553K70
2844a536J587J649r4j964j197j40K051J345J77j916j922N20J516J778k87j717
2860a50j518J97J616J395n1j612j816L05J969J328r2j717j336j70J726J645j50
2877A569j576j831K21J560J659M4j626j441o9J473J543K9j677j365n3J804J481
$$ y = [561, 2276, 1512, -509, -2107, -1558, 319, 1981, 1437, -363, -1757, -1769, 283, 1947, 1560, -381, -1973, -1493, 340, 1951, 1702, -570, -1908, -1188, 580, 1963, 1399, -191, -1956, -1490, 203, 1877, 1525, -586, -1910, -1699, 333, 2006, 1590, -296, -1976, -1645, 366, 1963, 1368, -68, -1999, -1436, 448, 1894, 1559, -161, -1887, -1549, 247, 1672, 1608, -293, -1987, -1321, 56, 1777, 1763, -329, -1630, -1671, 268, 1878, 1869, -443, -1853, -1647, 373, 1827, 1374, 79, -1750, -1680, 206, 1797, 1688, -253, -1806, -1536, 51, 1700, 1606, -358, -1555, -1695, 356, 1701, 1878, -38, -1960, -1440, 76, 1854, 1567, -150, -1668, -1471, 145, 1540, 1489, -123, -1939, -1634, 335, 1663, 1571, -146, -1482, -1652, 74, 1719, 1569, -7, -1838, -1617, -57, 1602, 1646, 20, -1421, -1490, -17, 1526, 1555, -122, -1487, -1540, 264, 1745]
2894A745j01j557j643l0J671J519r3j482j601n0J733J391Nj600j499n3J487J612
2912A454P8j595j301q3J436J368pj515j495J9J796J362J35j684j650p6J658J344
2930A244M21j482j760K62J333J146K18j425j515P0J262J579K11j375j711j05J390
2947b37J465L74j624j202n06J518J833j33j246j740j76J486J464Q8j149j689r8
2964a572J600J236J65j238j681L5J179J440M48j488j482k00J323J783j51j043
2980C54j679j66J278J419L0j095j544j25J423J404m1j066j543q7J260J573J15
2997A510j315j558k65J242J541L30j298j289m86J336J526K68j307j445l29J317
3013b22J502J64j177j558K2J035J709P3j416j449R5Q56J380N02j172j627m04J516
$$ y = [1745, 1644, 87, -1556, -1586, 85, 1604, 1511, 29, -1572, -1622, 111, 1502, 1507, -93, -1592, -1645, -158, 1454, 1532, -63, -1364, -1447, -11, 1357, 1350, -165, -1660, -1641, 155, 1517, 1652, -32, -1682, -1758, -100, 1244, 1665, 183, -1577, -1315, 18, 1164, 1382, -43, -1558, -1488, -226, 1353, 1564, 189, -1522, -1627, -237, 1228, 1602, -22, -1224, -1730, -212, 1621, 1488, 242, -1498, -1674, -188, 1276, 1364, 215, -1474, -1572, 28, 1264, 1429, 191, -1490, -1455, -276, 1164, 1612, 124, -1358, -1558, -235, 1548, 1397, 354, -1325, -1491, -213, 1206, 1236, 141, -1403, -1528, -105, 1299, 1258, 192, -1351, -1438, -178, 1395, 1510, 195, -1363, -1628, -386, 1155, 1485, 187, -1102, -1588, -252, 1274, 1542, 235, -1210, -1539, -222, 1280, 1444, 267, -1291, -1269, -234, 1475, 1548, 132, -1317, -1222, -366, 1014, 1516, 344, -1283, -1687, -171]
3031a71J415K62j345j144l78J305J095N32r84j647j11R93J289K98j250j257l36
3048a434J190J193O40j160j704k88J307J374M6r24j336m50J311J356J20n93j692
3065a044n46J372J320M82j467j234l21J211J160N69j228j295l89Q87J788n2q35
3082C78j566k82J232J168O43j176j691j89J064J651K07r50j463m20J007J510L70
3099A493r77j313n60R90J752J2q80j357n80R58J507O89j430j315l73Q91J570L23
3117A400j051j265l58Q90J189N02j160j050k93O92J575M16j281r16o63Q91J333
3134H51M18o35j566n11J145J470Q6r97j025n88J043J234L88q65j364n63Q25J515
3152H61M33r16j225m60O37J584J81o04j427m61Q37J417N52r40j346m94P56J175
$$ y = [-171, 1244, 1506, 161, -983, -1361, -56, 1039, 1571, 587, -1060, -1171, -178, 1111, 1409, 159, -1098, -1434, -244, 949, 1589, 429, -1275, -1563, -256, 1118, 1164, 240, -1096, -1546, -235, 1121, 1241, 648, -1044, -1590, -218, 1102, 1584, 117, -1117, -1438, -227, 933, 1502, 274, -1021, -1410, -523, 1265, 1213, 378, -1188, -1470, -238, 930, 1573, 397, -1294, -1483, -419, 1232, 1439, 489, -974, -1394, -387, 1123, 1493, 516, -797, -1357, -367, 1385, 1397, 517, -840, -1420, -462, 1045, 1734, 304, -1011, -1384, -493, 1077, 1400, 349, -916, -1274, -384, 805, 1307, 147, -903, -1196, -504, 1071, 1487, 206, -710, -1373, -482, 851, 1269, 634, -932, -1443, -298, 1172, 1258, 261, -764, -1352, -309, 925, 1313, 448, -916, -1479, -654, 861, 1294, 378, -847, -1307, -670, 914, 1095, 491, -936, -1397, -560, 857, 1409, 469, -877, -1371, -615, 560]
3170E60N59q25j010n87Q47J365J66l77j499q30J264J162N53j002j151k82N77J469
3188I59L57q16j303m47P37J432K95p51j235n62R49Q17P60p98j272j28O79Q73N38
3207A084o49j258m92R69J054O45q92j264m00M91J789L13r26j312n00R55J111M94
3225A212q53r54m18N06J243J11j72j356m46L70J519M26p72j021n79P19J083Q56
3243A474r15j223l95K77J398N94p00j171m78P61R55O95q42j085m37P14R69P33
3261A324p47j075n69K75J110J069q16r64o46L94J257N81o20j315n85O99J320O22
3279A314q96r06m93K58J060R62n36j425o38N75R90P47o41j083l88M43J009O99
3297A051m41j102n56M14J198N99n63j319l36M28J222N42n72r71q19O17Q16O59
$$ y = [560, 1119, 294, -716, -1303, -456, 909, 1075, 698, -801, -1631, -367, 795, 1348, 346, -805, -1087, -510, 959, 1316, 500, -803, -1250, -513, 919, 1214, 463, -772, -1334, -385, 432, 1192, 394, -878, -1006, -327, 546, 1084, 435, -823, -1315, -346, 708, 1353, 461, -803, -1203, -712, 1077, 1390, 464, -848, -1348, -393, 718, 1212, 359, -595, -1013, -507, 736, 847, 675, -681, -1127, -757, 762, 1188, 416, -605, -1184, -465, 618, 1474, 559, -664, -1059, -782, 616, 1210, 510, -661, -1139, -378, 577, 1272, 430, -655, -1092, -378, 591, 1324, 577, -498, -1067, -792, 318, 1387, 571, -393, -1039, -645, 612, 1193, 573, -742, -1327, -628, 692, 1314, 418, -488, -981, -723, 337, 1299, 763, -662, -1300, -725, 265, 1012, 371, -712, -1100, -657, 352, 1051, 610, -492, -1048, -634, 564, 1163, 600, -719, -1055, -627, 595, 1137, 565, -406, -1225, -608, 208, 867]
3315H67j69j394n91O20J232N94n17j101o33M64J060O28l46j156n92O99M78J008
3333A151l43j349p47Q52Q98P67p89r72m11L93J044M41j79j148n14K70J203K87
3351H54j60j124p25N82J102M59m47j160m14M90J185L41n33p49n25J31J003N84
3369H94m43q69o04L50R75P49l84r87o96K87J186N71k14r31r44M22R05O89k07q26
3389g7o69o2J230O91n40p82o56M3J368M12m74p37p16M91R45O98n03j060o22L15
3409g05J120L41j58j068k59K94O78O53k44r11p41N13Q80M80k25r43p28N90P24
3428B91O60l06r83n51J31J014N58l87o01q55L83R76M12l97p15n97Q2J183N47k20
3448F25j039k80k93J449N43m06r24n13J45R69M14P3j038q55M43Q07R10n10o88
$$ y = [867, 698, -696, -1287, -667, 565, 1159, 642, -459, -1092, -628, 432, 1060, 714, -442, -1034, -335, 143, 1151, 808, -541, -1288, -436, 462, 1229, 440, -532, -943, -550, 494, 935, 756, -392, -906, -636, 567, 854, 694, -430, -1155, -573, 529, 988, 541, -619, -1033, -543, 642, 983, 450, -299, -824, -693, 310, 894, 451, -418, -1022, -672, 303, 1052, 668, -319, -1015, -728, 458, 1029, 815, -116, -1060, -638, 267, 956, 749, -77, -746, -808, 422, 1113, 573, -209, -865, -822, 546, 958, 484, -253, -969, -478, 467, 1165, 662, -398, -1020, -705, 415, 756, 598, -470, -729, -435, 243, 896, 652, -259, -1000, -487, 393, 873, 648, -295, -1023, -433, 291, 951, 645, -338, -889, -758, 256, 814, 427, -174, -1029, -646, 330, 742, 345, -370, -967, -885, 298, 845, 625, -414, -694, -987, 462, 1005, 599, -325, -838, -693, 276, 690, 763, -275, -1130, -687, 120, 1030, 520, -168]
3467a68o14O6Q09O49J1q58q20L81O62O69j80p49o05R1Q77O26k32r78n73L52Q46
3488B62N11r9q30q03M01Q26O62k53q86o89J43R30O59J47j270n34J26R01P90m96
3508D98q10m27l7R21O62j86r34l36j67J157P58n47p53o67K22Q03P75k32q51o91
3528h42L18O84O17j05j040l82k3Q29Q00m21n18p40p6J093O38q5r31n37j7Q47Q45
3549I54j92p15p53J14R25K62n9q56n58K62Q46N70l1r61m51l39J087O60j07p55
3569i7o38N6P71O99M8q98n57k2N39Q25O1p01r06J5J059N53k53q11m03J37P88O25
3591H90j36q37o53J24N30R01k51n71q94J43N53O68K75j060j51J1L97P76J38r88
3611a35m59J47M24J130n06n53o82J3O19Q16k10p36m10M7M92N69J75p31m21k96
$$ y = [-168, -782, -716, 93, 742, 753, -105, -925, -544, 118, 787, 607, -142, -747, -656, 221, 847, 615, -363, -936, -584, 262, 773, 674, -156, -959, -558, 268, 930, 677, -209, -898, -755, 175, 834, 981, -289, -823, -697, 204, 994, 498, -312, -739, -776, 145, 807, 621, -313, -649, -816, 341, 1099, 552, -201, -868, -646, 157, 932, 700, -151, -842, -524, 160, 777, 672, -368, -750, -773, 56, 856, 435, -83, -823, -899, 194, 832, 747, -184, -721, -738, 109, 954, 762, 47, -706, -592, 333, 595, 536, -320, -878, -616, 230, 800, 769, -192, -643, -982, 105, 765, 658, -97, -735, -679, 92, 791, 839, -59, -616, -638, -99, 726, 787, 86, -820, -805, 254, 807, 554, -257, -660, -523, 265, 890, 754, -83, -736, -612, -82, 819, 568, -3, -897, -754, -201, 467, 742, -318, -469, -458, -61, 715, 853, -135, -594, -447, -23, 1107, 601, 48, -634, -621, -2, 814, 604, -132, -542, -495, -3, 566, 741, 10, -411, -707]
3631g07Q16O90k2o05p79n3P82O62K12j010o70k44R07P12o9n70o38r6Q13O22j14
3652F39p72l79R5M21Q69r7n48r35L8N75O87Ql49o78j77N52O30Nn78p05Q6O94N50
3675F31l4o34p35K51O29L99O5p05n15J40N75N58K19r32o00J22O16N78om99q92
3696g69j0P73P22q1p22o50K58L87O80j65n33m99O3L32O59K1m25p69M5O77M38L07
3718G39p70o24l6O73N12J39n52o51n3N23O48J88r14k61k84R26K87J22n78m24m05
3739g95O26P27K27o71m46m31N20Q25K43o10p85k0M50P00Q4l44q38m2N48O00R6
3760F64n73p73J7N62R02k8o97p29J52N66K45M5k70n36j10M30L62M1Kr36k2N61
3782a25Q90mq38l72qM77N53l6m63l51l18N54N96q9l45o73m36P95N56J43o40k44
$$ y = [-707, 109, 799, 777, 172, -607, -660, 122, 784, 996, -14, -684, -928, -21, 691, 622, 52, -586, -682, 131, 753, 639, -133, -512, -417, 4, 873, 776, 228, -707, -669, -94, 593, 601, 252, -426, -603, -51, 579, 584, 6, -699, -613, 81, 631, 597, -37, -772, -521, 108, 507, 572, -133, -648, -508, 67, 625, 844, -88, -688, -566, 50, 628, 622, 123, -769, -779, -6, 716, 635, -87, -737, -479, -92, 588, 423, -110, -609, -546, -214, 445, 466, 41, -728, -683, -6, 432, 739, -31, -655, -691, -18, 494, 633, 81, -570, -623, -100, 548, 736, -178, -439, -723, 203, 490, 612, 34, -390, -795, -169, 558, 785, 114, -332, -763, -243, 582, 825, 215, -570, -590, -140, 560, 644, 300, -538, -580, -32, 568, 664, 91, -682, -665, -103, 799, 771, 74, -655, -503, 63, 308, 353, 83, -453, -563, -133, 229, 270, 272, -664, -686, -125, 765, 761, -77, -449, -457, 20, 573, 537, 74, -277, -595, -41, 555, 466, 121, -552, -988, -193, 363, 506, -134, -378]
3804c78L2Q0P71J40m58q56n2M29P66J03m73o18j3O05L51J00k80o37j50K71O69
3825D02Q4m95l66l7L10O02j44j68o95JN14N08k47j93l86l8L03M15P2j97o82q5
3847e22M74K44L06n92m35j20O79J52L12l05p97j6N17L58J56j51o73k7K04M91M82
3868G37p55m06j38L50Q77j11k01p83k3J89O66J88n13n95Q4Q0Q54J42n77m97k57
3889f89M33N08K16j83p49M7k0P28K99j05j060R5K49M99J79k81m50k71K29P75J42
3910E91m55o95K46K21O87l1l45o88k07P76l9M18j18o89m43N97M51J66k20n50n27
3931h54O29M89L07l69o59j44L09O26M06p63k36j93K29N80Q4k60o72p9L10O70K56
3952F66m20n98k33K20P57J51l73n12k82L17O44L27n95m10j06M03L48M03l47p11
$$ y = [-378, -346, -266, 505, 645, 187, -669, -721, -292, 474, 577, 104, -514, -527, 78, 429, 529, 249, -388, -538, -267, 402, 486, -9, -375, -412, -102, 500, 356, 188, -507, -506, 8, 516, 269, 76, -310, -348, -45, 370, 442, 245, -437, -522, -48, 196, 502, -90, -525, -645, 34, 186, 498, 193, -604, -620, -103, 255, 411, 260, -413, -440, -236, 255, 737, -18, -424, -562, -212, 665, 554, 353, -430, -453, -264, 402, 590, 77, -518, -434, -354, 500, 642, 65, -432, -689, -256, 252, 468, 285, -464, -417, -437, 291, 590, 485, -575, -480, -231, 268, 447, 166, -284, -555, -326, 449, 591, 136, -559, -313, -92, 595, 564, 219, -469, -676, 100, 61, 479, 361, -328, -771, -174, 277, 443, 223, -327, -854, -225, 264, 571, 202, -457, -601, -292, 334, 740, -23, -259, -452, -223, 357, 441, 181, -491, -570, -260, 410, 666, 246, -352, -585, -365, 392, 543, 170, -342, -624, -307, 337, 664, 69, -341, -447, -44, 304, 707, 360, -351]
3972c51k09M79N25K6j25n33n05M54N77p0K04p65j96J23O76K50m50m63k56L14M49
3993A54L62l28l90n20M85M33K47k21o48K9L35L79K41l18n09l04P35M1L29l4o61
4014a63l58K64N29J84k79n65r6L63K87N8J34m76l27J13M77L33k66l97l33M21J70
4035G3L90j88o02j61R0P94k43m7k52k37L31L15K85m9r59P0J95M02N33m88m59l45
4057e52L04O69L9k14l84k25l2M99O44m60l66l68P6N28J37k18k23l7l3M99M47m95
4079B35l14l49L0N15L76k21m15j34J23L78J45o6k94k64o2N42L06k0o05m08M53
4100d9K44K18j97l36l74K57M00M13l44l44l16K2O02M38k70m19m25K26L58K79k84
4121I9l14k51L25N27j47J04n73L6J2L02J05j16l92k57K69M92J39j22m23k99Q4
$$ y = [-351, -560, -81, 444, 470, 345, -188, -693, -239, 338, 268, 472, -293, -489, -366, 310, 560, 110, -353, -609, -295, 154, 516, 188, -202, -722, -237, 196, 443, 222, -426, -397, -62, 317, 558, 240, -269, -573, 162, 203, 532, 498, -163, -521, -257, 272, 456, 177, -388, -484, -121, 166, 224, 358, -118, -445, -332, 145, 478, 212, -185, -518, -97, 73, 463, 275, -327, -488, -398, 396, 153, 106, -146, -383, -52, 263, 548, 499, -460, -390, -195, 207, 740, 252, -207, -552, -248, 421, 460, 246, -138, -363, -395, 104, 748, 288, -78, -446, -370, 158, 295, 77, -146, -183, -216, 283, 730, 235, -79, -428, -398, 117, 493, 272, -143, -277, -154, 224, 369, 303, 9, -255, -317, 225, 531, 511, -94, -502, -49, 195, 413, 216, -120, -494, -237, 163, 576, 232, -112, -428, -406, 196, 634, 364, -55, -480, -254, 104, 383, 99, -215, -466, -141, 386, 239, 343, -230, -194, -182, 120, 225, 109, -283, -540, -271, 221, 360, 238, -185, -484, -400]
4142d00M24M89l22n05J3K67J9J90r5k08k64K37K59J92K6o14r7J07M86K41l74l87
4164c16O3j08O97Q5j10l10o08M56J79M41k47k91m08J46N75K25l23l74j52J08L59
4185H7L88j67l20l83O7M82L89l44j96j80n9J61J99J36m34j67K30L82oQ0n74j25
4207c54J88K49M39r4n01k27r7O27k7kk84l95L77j2N49k29m92j18J41O88J5k44
4229A97k77l03O5M89N7j30k73Q9o8J63K73m4l56l88K25K79K53o9k80k77o1O18
4251A82j4L5l83k07K99R1L66l03l2k65k00L83L12p3n9n03J80N11k0J7n50l19M74
4274g8K3N60p8o14l19L32L98L6Rm56k00J75K22J87J59l31o25M52L05J63Q2n90
4296a88j03J73L07J76j56k88k53N3L51N15k61k47m24J54K71M25k08n28j35M5M16
$$ y = [-400, 24, 513, 191, -314, -301, -34, -15, 175, 80, -128, -392, -155, 104, 296, 322, -292, -389, -282, 204, 445, 71, -316, -253, -361, 336, 421, 311, 1, -607, -151, 28, 469, 222, -69, -477, -331, 244, 469, 146, -228, -380, -272, 87, 475, 308, -12, -395, -328, 154, 543, 199, 3, -177, -236, -75, 124, 260, -174, -341, -111, 271, 265, 345, -229, -354, -166, 83, 522, 428, -73, -300, -397, 230, 203, 201, -83, -478, -101, -113, 436, 207, -285, -403, -262, 426, 441, 197, -80, -383, -318, 171, 228, 98, -175, -86, -154, 9, 282, 238, -118, -506, -281, -2, 251, 182, -98, -375, -436, 182, 168, 203, -180, -387, -88, 3, 369, 66, 34, -231, -431, -48, 264, 191, 132, -371, -191, 320, 300, 317, -233, -552, -78, -55, 505, 427, -187, -506, -174, 224, 260, 269, -187, -387, -212, 10, 197, 356, 25, -600, -148, 157, 320, 402, -188, -291, -118, 189, 365, 209, -79, -332, -279, 72, 587, 326, 79, -345, -191, 80, 505, 297, -231, -366, -321, 95]
4317I5L26j45k93k95J10K34L43J5l56r1l49N17J99m2o69N4R5L40J87l6m73p9R8
4340b15J18L57j03k62k85o7M16K30j12j09l43Q5M56P9j25j45j00k29K06K73R5
4361B20j70l47j14L07L20j6j31k82PL31K09Ol51o7k2L62J40l24k59k28J71O19
4383C81j67m9j33k05l28N20L59m53J40m05J6K95N74k18k39l63J32L01j4J8j75
4404a3m43K64J75M26l49R5n30l5L10K44K5l0l18J04J49p7J96k54j86J54K21J88
4426C16Q4n39k3j9L38K6K56k93l25LJ83K46m0l87m7J35j63L67K43p7n71M5R7J02
4450d3J82k20j26qQ0L85l2j38k06k8K11L06j34k03l66Q3J82L48k18l4m31K25M5
4473a40K72J5j13l41J10nM30K21m12k79j08L19L11m2k50l07P5M99j1Ok15l12j36
$$ y = [95, 421, 276, -17, -312, -202, 32, 375, 390, 34, -57, -406, 111, 310, 268, -401, -347, -252, 88, 275, 239, -234, -313, -215, -97, 260, 157, -105, -390, -457, -41, 189, 77, -32, -375, -290, 166, 245, 120, -25, -125, -354, -148, 125, 220, 50, -297, -411, -104, 216, 200, 69, -213, -206, 125, 334, 340, -11, -78, -100, 262, 402, 78, -181, -409, -238, 381, 214, 165, 32, -173, -501, 19, 378, -75, 65, -340, -324, -29, 545, 327, 88, -275, -143, 158, 144, 162, -13, -456, -192, -17, 409, 60, 155, -375, -410, -100, 144, 169, 139, -179, -75, 74, -3, 193, -61, -247, -93, 128, 316, 400, -139, -162, -181, 157, 183, 439, 146, -179, -176, 7, 253, 213, -174, -221, -86, -249, 118, 361, 284, -287, -242, -145, -43, 139, -81, -207, -215, -135, 250, 218, 80, -126, -154, 57, 363, 229, 26, -340, -257, -75, 273, 55, 21, -410, -185, -140, 132, 147, 34, -307, -197, -202, 228, 449, 37, -242, -350, -31, 280, 238, -12, -319, -244, 255, 244, 250, 35, -277, -413]
4496d13L37Q3J93l76m6J09j4M50p5j19o14K39K47n4L55l77r1j2M8N62k85j22l7
4519a2m80M64K85J76m03k32J3L02k3M4l26l9Q4l0K92M9j64l86PK02O23k22n29
4542c05J39J67K6J19J42j70k62j8P4M08k49k32j19J47o2N01j12j27m28J54J79
4563b8J60K16p45K37m8J08K07J13k1m84k44N02J13J30l82N5r5J12M39m6p4l51
4585a26j6J57L1J42j0m91j9J72K87n3l8q8j71l1M20M5j99lk91J22K46M7k9k8k61
4610a85oJ71L44k52l36N3K27J42lj32n7l82K2N11J42l19n1j66J37K69J76m36L8
4633i3l81K64M57J5j03k09l57R1N08q3j75l5J17k75L16M3Q4j71k57L26L14j57
4655B39k39j5k12K33K00J33k24l92K0J00J19K29k2l88Nn9L85J63j49l63O3J75
$$ y = [-413, -76, 7, 200, -176, -222, -113, -127, 323, 248, 129, -485, -246, 1, -53, 302, -75, -166, -178, -130, 432, 147, 25, -12, -492, -28, 257, 433, 30, -202, -189, 113, 90, 134, -192, -231, -147, -177, 115, 164, 0, -386, -379, -177, 446, 224, -305, -166, 1, 27, 146, 288, 118, -144, -162, -88, 320, 71, -161, -280, -133, -195, 306, 194, 67, -361, -207, -28, 132, 348, -397, -160, -208, -100, 107, 220, 199, -285, -529, -27, 86, 216, -166, -111, -206, -94, 345, 299, 225, -126, -142, 15, 46, 188, 178, -313, -332, -160, 127, 74, 36, -52, -223, -254, 166, 211, 12, 9, -282, -160, 86, 133, 104, 76, -185, -191, -20, 324, 72, -264, -211, 16, 158, 155, 23, -34, -416, -394, 117, 259, -60, -111, -277, -140, 129, 305, -131, -93, -474, -210, 247, 262, 159, -50, -407, -316, 192, 109, -66, -101, 16, -259, 57, 100, 184, 13, -244, 82, 396, 239, 0, -15, -227, 6, 206, 339, 115, -277, -257, -157, -38, 191, 169, -219, -214, -273, 112, 275, 126, -237, -174, 1]
4677AL03j22j3m17r2R3M28L01l56m30R1K70R3m3K6k26k15M08J13n1k3k10l03M06
4701C2K90Ll13k37J12MK43pj52m11L69J19p1M33k59k07l66L43M41p4m7m23J22
$$ y = [1, 304, 182, 169, -248, -340, -247, 181, 482, 126, -304, -213, 57, 150, 107, 133, -93, -308, 100, 213, 162, 139, -71, -374, 32, 322, 325, 12, -225, -113, -109, 134, 127, -25, -436, -67, 52, -19, 414, 155, -52, -418, -75, 366, 292, 245, -178, -56]
$$ [...]
8191a64
##END NTUPLES=NMR FID
##END=
