##TITLE=1H_SA_58.232
 DMSO-d6, 108 sc, 
 2.9.2020
##JCAMPDX= 6.0         $$ Bruker NMR JCAMP-DX V2.0
##DATA TYPE= NMR FID
##DATA CLASS= NTUPLES
##ORIGIN= UXNMR, Bruker Analytische Messtechnik GmbH
##OWNER= root
$$ XWIN-NMR		Version 3.5
$$ Wed Sep  2 09:30:28 2020 Russian Standard Time (UT+4h)  she@DPX200
##.OBSERVE FREQUENCY= 200.1315066352
##.OBSERVE NUCLEUS= ^1H
##.DELAY= (6, 6)
##.ACQUISITION MODE= SIMULTANEOUS
##.ACQUISITION SCHEME= undefined
##.AVERAGES= 108
##.DIGITISER RES= 18
##SPECTROMETER/DATA SYSTEM= spect
##.PULSE SEQUENCE= zg30
##.SOLVENT NAME= DMSO
##.SHIFT REFERENCE= (INTERNAL, DMSO, 0, 15.7039)
##AUDIT TRAIL= $$ (NUMBER, WHEN, WHO, WHERE, WHAT)
$$ ##TITLE= Audit trail, XWIN-NMR		Version 3.5
$$ ##JCAMPDX= 5.01
$$ ##ORIGIN= Bruker BioSpin GmbH
$$ ##OWNER= she
$$ F:/spectra/data/she/nmr/H-F/1/audita.txt
$$ ##AUDIT TRAIL=  $$ (NUMBER, WHEN, WHO, WHERE, WHAT)
(   1,<2020-09-02 09:29:06.32 +0400>,<she>,<DPX200>,
      <continue with go, POWCHK disabled, PULCHK disabled
       configuration hash MD5:
       00 E9 B6 7A A2 85 ED C7 34 08 36 98 17 FE 4E 26
       data hash MD5: 16K
       A1 3F 58 32 E6 76 18 45 1B DA 6C E9 3F 84 91 2B>)
$$ ##END=
$$ 
$$ hash MD5
$$ BA 1E 43 66 32 68 82 C1 12 83 8E 6A F8 E3 CD 19
##$RELAX= 
##$RELAX= 
##$RELAX= 
##$RELAX= 
##$RELAX= 
##$RELAX= 
$$ Bruker specific parameters
$$ --------------------------
##$DU= <F:/spectra>
##$EXPNO= 1
##$NAME= <H-F>
##$PROCNO= 1
##$TYPE= <nmr>
##$USER= <she>
##$AMP= (0..31)
100 100 100 100 100 100 100 100 100 100 100 100 100 100 100 100 100 100 
100 100 100 100 100 100 100 100 100 100 100 100 100 100 
##$AQSEQ= 0
##$AQ_mod= 1
##$AUNM= <au_zg>
##$AUTOPOS= <>
##$BF1= 200.13
##$BF2= 200.13
##$BF3= 200.13
##$BF4= 200.13
##$BF5= 200.13
##$BF6= 200.13
##$BF7= 200.13
##$BF8= 200.13
##$BYTORDA= 1
##$CFDGTYP= 0
##$CFRGTYP= 5
##$CHEMSTR= <none>
##$CNST= (0..31)
1 1 145 1 1 1 1 1 1 1 1 1 1 1 1 1 1 1 1 1 1 1 1 1 1 1 1 1 1 1 1 1 
##$CPDPRG= <>
##$CPDPRG1= <>
##$CPDPRG2= <>
##$CPDPRG3= <>
##$CPDPRG4= <mlev>
##$CPDPRG5= <mlev>
##$CPDPRG6= <mlev>
##$CPDPRG7= <mlev>
##$CPDPRG8= <mlev>
##$CPDPRGB= <>
##$CPDPRGT= <>
##$D= (0..31)
0 1.2 0 0 0 0 0 0 0 0.06 0 0.03 0 0 0 0 0.0002 0 0 0 0 0 0 0 0 0 0 0 0 
0 0 0 
##$DATE= 1599024161
##$DBL= (0..7)
120 120 120 120 120 120 120 120 
##$DBP= (0..7)
150 150 150 150 150 150 150 150 
##$DBP07= 0
##$DBPNAM0= <>
##$DBPNAM1= <>
##$DBPNAM2= <>
##$DBPNAM3= <>
##$DBPNAM4= <>
##$DBPNAM5= <>
##$DBPNAM6= <>
##$DBPNAM7= <>
##$DBPOAL= (0..7)
0.5 0.5 0.5 0.5 0.5 0.5 0.5 0.5 
##$DBPOFFS= (0..7)
0 0 0 0 0 0 0 0 
##$DE= 6
##$DECBNUC= <off>
##$DECIM= 32
##$DECNUC= <off>
##$DECSTAT= 4
##$DIGMOD= 1
##$DIGTYP= 9
##$DL= (0..7)
0 120 120 120 120 120 120 120 
##$DP= (0..7)
150 150 150 150 150 150 150 150 
##$DP07= 0
##$DPNAME0= <>
##$DPNAME1= <>
##$DPNAME2= <>
##$DPNAME3= <>
##$DPNAME4= <>
##$DPNAME5= <>
##$DPNAME6= <>
##$DPNAME7= <>
##$DPOAL= (0..7)
0.5 0.5 0.5 0.5 0.5 0.5 0.5 0.5 
##$DPOFFS= (0..7)
0 0 0 0 0 0 0 0 
##$DQDMODE= 0
##$DR= 18
##$DS= 0
$$ [...]
##$SUBNAM2= <"">
##$SUBNAM3= <"">
##$SUBNAM4= <"">
##$SUBNAM5= <"">
##$SUBNAM6= <"">
##$SUBNAM7= <"">
##$SUBNAM8= <"">
##$SUBNAM9= <"">
##$SW= 16.880792210976
##$SWIBOX= (0..15)
0 0 2 0 0 0 0 0 0 0 0 0 0 0 0 0 
##$SW_h= 3378.37837837838
##$TD= 16384
##$TD0= 1
##$TE= 0
##$TE2= 300
##$TE3= 300
##$TEG= 300
##$TL= (0..7)
0 120 120 120 120 120 120 120 
##$TP= (0..7)
150 150 150 150 150 150 150 150 
##$TP07= 0
##$TPNAME0= <>
##$TPNAME1= <>
##$TPNAME2= <>
##$TPNAME3= <>
##$TPNAME4= <>
##$TPNAME5= <>
##$TPNAME6= <>
##$TPNAME7= <>
##$TPOAL= (0..7)
0.5 0.5 0.5 0.5 0.5 0.5 0.5 0.5 
##$TPOFFS= (0..7)
0 0 0 0 0 0 0 0 
##$TUNHIN= 0
##$TUNHOUT= 0
##$TUNXOUT= 0
##$USERA1= <user>
##$USERA2= <user>
##$USERA3= <user>
##$USERA4= <user>
##$USERA5= <user>
##$V9= 5
##$VALIST= <valist>
##$VCLIST= <CCCCCCCCCCCCCCC>
##$VD= 0
##$VDLIST= <DDDDDDDDDDDDDDD>
##$VPLIST= <PPPPPPPPPPPPPPP>
##$VTLIST= <TTTTTTTTTTTTTTT>
##$WBST= 1024
##$WBSW= 4
##$XGAIN= (0..3)
0 0 0 0 
##$XL= 0
##$YL= 0
##$YMAX_a= 958092
##$YMIN_a= -1049838
##$ZGOPTNS= <>
##$ZL1= 120
##$ZL2= 120
##$ZL3= 120
##$ZL4= 120
##$ABSF1= 10
##$ABSF2= 0
##$ABSG= 5
##$ABSL= 3
##$ALPHA= 0
##$AQORDER= 0
##$ASSFAC= 0
##$ASSFACI= 0
##$ASSFACX= 0
##$ASSWID= 0
##$AUNMP= <proc_1d>
##$AZFE= 0.1
##$AZFW= 0.1
##$BCFW= 1
##$BC_mod= 2
##$BYTORDP= 1
##$COROFFS= 0
##$CY= 11.3945322036743
##$DATMOD= 1
##$DC= 2
##$DFILT= <>
##$DTYPP= 0
##$F1P= 16.9975609425685
##$F2P= -3.02152046262296
##$FCOR= 0.5
##$FTSIZE= 0
##$FT_mod= 4
##$GAMMA= 1
##$GB= 0.15
##$INTBC= 1
##$INTSCL= 1
##$ISEN= 128
##$LB= 0.24
##$LEV0= 0
##$LPBIN= 0
##$MAXI= 10000
##$MC2= 0
##$MEAN= 0
##$ME_mod= 0
##$MI= 1.114404
##$NCOEF= 0
##$NC_proc= 0
##$NLEV= 6
##$NOISF1= 3.799351
##$NOISF2= 2.8
##$NSP= 1
##$NTH_PI= 0
##$NZP= 0
##$OFFSET= 15.70392
##$PC= 1
##$PHC0= -9989.636
##$PHC1= 30.2009
##$PH_mod= 1
##$PKNL= yes
##$PPARMOD= 0
##$PSCAL= 0
##$PSIGN= 0
##$REVERSE= no
##$SF= 200.130013532006
##$SI= 16384
##$SIGF1= 3
##$SIGF2= 2
##$SINO= 400
##$SIOLD= 16384
##$SREGLST= <1H.CDCl3>
##$SSB= 0
##$STSI= 0
##$STSR= 0
##$SW_p= 3612.71676300578
##$SYMM= 0
##$S_DEV= 0
##$TDeff= 0
##$TDoff= 0
##$TI= <>
##$TILT= no
##$TM1= 0
##$TM2= 0
##$TOPLEV= 0
##$USERP1= <user>
##$USERP2= <user>
##$USERP3= <user>
##$USERP4= <user>
##$USERP5= <user>
##$WDW= 1
##$XDIM= 8192
##$YMAX_p= 0
##$YMIN_p= 0
$$ End of Bruker specific parameters
$$ ---------------------------------
##NTUPLES= NMR FID
##VAR_NAME=  TIME,          FID/REAL,        FID/IMAG
##SYMBOL=    X,             R,               I
##VAR_TYPE=  INDEPENDENT,   DEPENDENT,       DEPENDENT
##VAR_FORM=  AFFN,          ASDF,            ASDF
##VAR_DIM=   8192,          8192,            8192
##UNITS=     SECONDS,       ARBITRARY UNITS, ARBITRARY UNITS
##FACTOR=    0.000296,      1,               1
##FIRST=     0,             0,               0
##LAST=      2.424536,      0,               0
##MIN=       0,             -1049838,        0
##MAX=       2.424536,      958092,          0
$$ Real data points
##PAGE= N=1
##DATA TABLE= (X++(R..R)), XYDATA
$$ [...]
2675c78L33k285J966O94K71o46K13K375r83L0r20K334j873k005m69J373r79j264
2693b213M12N83j15L76j276J997N09J7J32J508J24q06MO9J355k568r17n48J383
2712B6j497k47J25Q84M21j933K037J73R26M2J089J83p77L68j824K047j893q35
2730f85j71J079j698m20M24P5N32j988K140J83J30R1L25Q58J89R33j724Q60L5
2749A168q69j016K79P72k243Q16m91R95r07M6R33P17m48p4J571n86R43J40n54
2768A192O81j171l74m01J389k619o25M72J404j878K4P37P38N18k28J559l41J195
2786B272j095M7J043o47j688P1R56j472Qj727J143j10o48R20n02J123L83K33j35
2805A75K100q29j380J700N68j270r42L38L61k812N25N07L24j361Q87K62O61l38
$$ y = [-378, -45, -2330, -364, 330, 601, -45, 168, 2543, 1560, 1590, 670, 3004, 1131, -874, -1343, 30, -949, -2213, -1801, -1218, -1333, -957, -2233, -236, 273, 290, 422, 1930, 2054, 1248, 1252, 1321, 2676, 108, -809, -1357, 26, -1471, -1718, -1593, -709, -288, -2221, -184, -11, 915, 957, 2046, 2229, 1452, 1820, -4, 2043, 150, -685, -856, 223, -1475, -1895, -1471, -1396, -864, -2852, -712, -529, -399, -308, 17, 875, 1064, 1997, 273, 1133, 1168, 299, -717, -438, 334, -1909, -1093, -1584, -589, -1496, -1450, -517, 200, -248, -322, 1249, 663, 1606, 1746, 1192, 1873, 702, 328, -73, 1316, -1303, -1928, -1456, -52, -1930, -1906, -1169, -431, 87, -141, 1418, 1077, 2272, 1177, 1224, 2267, 1620, -68, 3, 959, -513, -505, -2232, -1089, -1199, -1847, -927, -1429, -306, 77, 310, 175, 2275, 1446, 66, 1766, 2334, 1064, 122, 460, 821, -1991, -1466, -959, -635, -1996, -1109, -847, -186, -524]
2823e24M20q65J596R68l63n69J523N07k410K66j20o71k23q72J702k492N74o64
2841b217J747k20m89J708J45P72k054K110j2l36l10l74J321j221j003p08J89O64
2859b88j354N10j58Q12j410J170O20J414m10n29J192M56q66r49J529j181o97m76
2877f15L39l75o95K35j040J536j62L89p42J154L94p19J856K70j97j190J039n28
2895I49R32k675J79L64r21K52r37R18r62J254k21R22Q25n26N00O39K61n49k41
2914I63%p02o43j85R76j170m28j772K086l30l0M8J205L37j98k27M47J671l33m86
2934A229n07N44k53j328J396j921m31N9n33J694j702J056K79K29O7M35r34J499
2952H78P99j074Q43n9K75j284o78K38J12j560J47J156j778N54J09J292j90k9O32
$$ y = [-524, -104, -969, 627, 1595, 1232, 663, 2186, 2693, 283, 549, 429, -242, -465, -1337, 365, -2127, -1553, -2217, -470, -690, -1179, 529, 674, 1446, -608, 1502, 1490, 1154, 844, 470, 1791, 570, -433, -1141, -952, -288, -1642, -1132, -1290, -478, -1888, -718, -98, 1316, 906, 377, 1569, 2025, 1159, 210, 1739, 558, -139, -615, -276, -651, -1346, -1111, -2151, -615, -777, -388, -1130, 24, 418, -301, 1555, 1825, 1628, 438, 1477, 949, 1881, -794, -615, -251, -1172, -920, -1857, -939, -1901, -647, -868, 54, 879, 353, 853, 1492, 1753, 1204, 963, 963, 261, -382, -567, 409, -761, -1189, -2961, -875, -1205, -1235, -1187, 18, 355, 157, -70, 377, 2048, 1715, 1229, 722, 1266, 1013, -315, 1081, -840, -1271, -1212, -1745, -51, -1753, -697, -418, -189, -122, 313, -621, 878, 1677, 603, 1446, 1387, 1662, 378, -300, -62, 50, -1510, -1363, -207, -1985, -1431, -1322, -30, -220, -249, 383]
2971C83J034j79r61J338p13Q79k053n3R90j895R69j560J564j049j44M27m25J394
2989e4j039M37J158M22l35O85p53Q95M7j477J062j226N76j768M03j52k04o43L51
3008a615J948j159J580m92J279k74p96Q45K15J25m48n64j52m69p62M2lk06O01
3027c05j411N30O35m5p29J720N48N34n47P39O64j796m39J284k73o03j565J042
3045a7j044L85j828J751l54N83L78L30P71j000J292n82J969k182k69K28k73R96
3063A134m78p40j026q9M2L10M65m91R33j265J374O4m79R25J655j661k05K83n45
3082B06N90o61k01m96l22O3j405J465n72K45N10L60O03r66R40L18P94j195R49
3101A225l53J045k459M16Q48p70j251mM45p98O03N04J1N36J132o70l29J622l82
$$ y = [383, 1417, 1238, 277, 1615, 902, 1781, -272, -325, 665, -1230, -261, -1821, -257, -1306, -1450, -1023, -1448, -54, -1093, -656, 502, 924, 589, 1274, 521, 1416, 1463, -14, 1048, -178, 398, -1370, -967, -1119, -1323, -1966, -1615, 333, -826, 754, 262, 1541, 1267, 471, 1316, 1531, 1656, 1208, 644, 492, 23, -739, -697, -700, -906, -305, -1716, -1186, -551, -596, -1325, 395, 943, 1477, 930, 1669, 2333, 537, 98, 1382, 1109, 506, -1059, -17, -1061, -676, -2504, -753, -1107, -524, -146, 184, 955, -45, 1247, 665, 2634, 452, 183, 411, 138, 1134, 656, -84, -1110, -1199, -1157, -847, -382, -873, 60, -1205, 169, 233, -246, 679, 2334, 673, 468, 751, 206, 796, 135, -66, -562, -884, -821, -2226, -761, -1333, -1088, -578, -218, 385, -581, 359, 677, 1471, 276, 1225, 872, 1917, -542, -126, 722, -48, -1299, -1303, -858, -1656, -1053, -549, -538, -2, 1130, 460, 131, 1753, 1371]
3120A371N7j672J217j123L81L53j392O19j274K97J032j055L24j188J288P22M05
3137C62J21O84M3m23o20L26O48j442R77l16o57R5r07N25k61O19j978R75P95J219
3157G85n33P5J298j529J143n06j71J87k99o5l05L0j805J531K17q49k08J25N50
3176c29l90J060l86Q05K70l34M42M8o46k30Q40n58j032j401J110M28m79n34K30
3195a086M12J060L19j069J098j0j71r04J421l20n93O95n87K18j525J90n74M17
3213a009K00j1Q65j556J048m80R17Q56m55l26L99O47k66O58j429j76r0j16k84
3232f08o16M59j069N94L99R12o78L52L97O49q55P68j39L91j43n43J185j813L56
3251bj80j261K42K58k00L97N66J98p56K80J611j27r00N39k06N52o66K16k11o40
$$ y = [1371, 1428, -244, 973, -150, 231, 584, -808, -189, -1463, -1166, -134, -1189, -865, -2053, -765, -43, 362, 483, 1167, 1210, 787, 167, 493, 1141, -301, 676, 360, -297, -202, -1109, -584, -845, -226, -2204, -1229, -434, 785, 252, 327, 1625, 96, 1239, 733, 562, 749, 450, 385, 80, 110, -1695, -164, 53, -796, -1004, -879, -329, -719, 341, -45, 760, 1030, 696, 1138, 1186, 540, 310, 1150, 592, -440, -1841, -731, -303, -782, -1316, -1086, -674, 386, 705, -364, 734, 724, 553, -351, 1070, 750, 157, 852, 265, 483, -1042, -852, -1426, -1009, -809, -820, 45, -1511, -463, -943, -26, 830, 375, 49, 448, 1095, 829, 1487, 58, -118, -208, -324, -608, -1224, -765, -1834, -1240, -841, 71, -607, -255, 142, 791, -64, 704, 565, 956, 813, 270, 1455, -358, -2, -182, -1443, -1201, -943, -1143, -746, -180, 18, -738, -458, 1153, 1026, 126, 665, 459, 1011, 345, 561, 350, -290]
3271b90L81p04K06q20Q6p27Q12j95n26J340J76R23p03J040N28l04j67N39j149
3290D46j027J521j700R52j097l47j177J365J136o42l49O27J97o28Q76J383o51
3307H85L21J07m79jr02Qj018R05j099J29L05J58j79n89K199j040j79J198j2o24
3327I3L57O14Q00j302n1M10j822J176k78j246p58J957r91o8M41R63m98m72J617
3346I42l06M79J75O00j713j72J198j493N36M45m73j602J513n78p98J37N22R1k73
3365g70Q65m85J057N03o06l27m3J853j372q14K21L44j395O70R74k648N34J248
3383a91R15q14j06J285j122O05j43K1J07N94o33q83J096n82o85l61J447j101k09
3402g60m67P04o75J062L36L7O34l54L12p35J182j107p38O88L42r30N7Q87j590
$$ y = [-290, 91, -613, -407, -1227, -1141, -1868, -1056, -1251, -1777, -437, -261, 662, -41, 999, 1527, 1223, 1056, 1595, 446, -581, 940, -760, 192, -905, -1252, -2429, -1064, 72, -570, -919, -292, -95, -723, 153, 1536, 885, 1206, 1313, 834, 833, -69, -61, -1079, -174, -1273, -1144, -839, -681, -860, -1449, 750, -290, -469, 729, 717, 93, 450, 1064, 1864, 562, 511, 921, -901, 275, -3, -1249, -2007, -50, -1041, -1109, -668, 295, -203, -675, 942, 636, 1115, 1290, 1890, 177, 5, 1203, -290, 246, 691, 218, -1384, 129, -449, -1247, -1110, -588, -497, -770, 95, -390, 667, 1170, 564, 237, 194, 2047, 675, -139, 82, 426, -969, -299, 675, -1973, -1439, -191, 724, -90, -196, 1089, -33, 572, 429, 450, 557, 1151, 518, -365, 731, 149, -536, -897, 550, -551, -760, -1227, -523, -1198, -136, 200, 237, 871, 517, 829, 94, 1276, 169, -569, 119, 461, -469, -412, 475, -1115]
3421a115j26k41Q24j68j24J94j41J034K38j84M58j76J135p65r05J664o02k063
3439a063R99n29j310K052j235K93m19J120j61J54L21R33l68k67J321j585J26M82
3457H64k27r54j34Q81k374L90L47O11o10O13K43q5Q13L7j138J054J752j821j77
3476H5N50L2p81o64J344j181l03K82O35q87L38R08j016r2J499j033L59J328j121
3495B82n29P11O86j85j184Q37j522n24J052m03q27P35J002k56o95J071P87p31
3513C07N44M48j233J60P19L04j751J374n28j526k88R92k71j213K276q79q90J192
3531b63J701j959Q01L83m80m93J355k03k107J809M87k749J716o35p86p60J678
3548e05j53k49J335o30j55m02K333j566N18O19K45j278Q37K57p05n61o73J199
$$ y = [-1115, -1241, -1482, -658, -826, -950, -756, -897, 137, 375, 191, 649, 473, 1608, 843, -62, 1602, 1000, -1063, -64, -593, -1903, 149, -1086, -793, -1212, -92, -253, -99, 222, 1155, 787, 520, 1841, 256, 382, 864, 637, -317, -451, 430, -1944, -1554, -1207, -596, -1206, -593, -350, -435, 378, 415, -723, 331, 2083, 262, 85, 635, 667, -114, -778, 566, -615, -918, -636, -1, -888, -550, 358, -658, -750, 749, -284, 75, 1403, 282, -247, 464, 1150, 965, -219, 618, -904, -1428, -376, -779, -1606, -871, 131, -125, -820, 251, 1038, 307, 851, 1299, 66, 226, 945, 1249, -502, 872, 344, -1182, -1470, -478, -749, -1962, 314, -565, -1455, -263, 1438, -521, 280, 663, 183, -310, 1045, 842, -1265, 544, 1031, -1718, -2, -637, -1423, -2183, -505, -658, -907, 428, -202, -357, -759, 1574, 8, 526, 1145, 1390, 112, 949, 1206, 501, -60, -733, 466]
3566D66k465J404m9K09l23K413j852q42K760q35q70R53L65j478j04J309nk019
3584i63J038k16r08L09J251j922R9J073O18j730J357J361j336J7J962j362k67
3601C81J76o98m99O98k60p66n11J534j263l12R99Q54o8k77P72K71k251K639m14
3620A005j642J041n6k15j74J454j404j434J334rj978K198o3j263oJ424j94R8P96
3639I12M07n47j68J168k721J783O8n79q93M43J50j500J451L03o08o86J546q8j571
3658a130J805J16O3j050J273m57p70J350j148r64M24M06j240Q46Lp19m83J268
3676d07P60o75O74K59j231N58M51K85j541R91Q45r04j201J980k030L4J653p08
3694b07o89N20J011j444Q24O82K86j489J878j125O6n33J209q21q70J010j031l32
$$ y = [466, -1999, -595, -644, -435, -758, 1655, -197, -1039, 1721, 886, 16, 969, 1334, -144, -248, 1061, 1056, -963, 75, -141, -1049, -740, 511, -1411, -1312, -239, 379, -1351, 6, 1367, 31, 48, 2010, 648, 381, 557, -141, -640, 58, -202, -968, -1479, 55, -1208, -1520, -521, 333, 265, -12, 760, 1031, -1220, 1419, 1005, -637, 404, 348, 133, -41, 1413, 9, -1425, -91, -100, -2078, 120, 57, -1206, -1212, 212, 18, 116, 912, 1319, 772, 604, 1772, -949, 834, 902, 323, -570, -127, 23, -1477, -26, 277, -331, -1017, 529, 441, -1130, 675, 791, 854, -196, 1077, 620, -150, 1200, 52, -912, -488, -82, -1322, -476, -473, -1192, -1675, -407, 353, -322, 352, 611, -620, -62, 389, 674, -867, 124, 969, 65, -1136, 844, -1186, -1152, 501, -207, -896, -376, 635, -809, 15, 697, 983, -506, 1372, 247, 313, -220, 989, 168, -702, 308, -723, -1055]
3712a055J41L81L31j032K059j385J115q3o77k29P22R68q56M72j20n15j201J306
3730C42q4p01NJ042j224j255L141j464j127J741L82n75K30P43q82l21P47k68p4
3749C98n01L30j135Q63p41R3q47J429J28p60Q62K89M04k5J00l19m74Q01l6q02
3769E7L82j56j041R04o33J152l074J107Q40j141Q76J568r95K1J019p53j2o3J289
3788A347r06j3p0J88m97n44O16P2r75O03N2k41P62J30j172J386l86j43R71K45
3808A425p78p29M44m40r56J183L54p42l42J74N9n46J664p24n40L26M70n73J131
3827H60m45j38m37N52J575j670j163Q68J75p19O56l97p43J693p71m3m31J512l32
3846F02k30L34l5j153J007J43p36q41M33M0n1r73J479m22n42k77L72J683o87O33
$$ y = [-1055, -914, -533, -202, -1234, 825, -560, 555, 472, -205, -434, 288, 1256, 400, 872, 752, 237, -964, 342, 258, -443, -438, 604, -620, -1875, 1266, -198, -1325, 416, 798, 223, 453, 1196, 314, -7, 740, 472, 398, -103, 227, -908, -45, -786, -693, -1540, -111, 17, -743, 119, 408, 812, 787, 887, 568, 94, 895, 859, 57, 439, 283, -758, 146, -487, 665, -2409, -1302, -462, -1603, -727, 841, -154, -133, 886, 133, 121, 58, 1347, 441, 428, 358, 546, 49, -495, 121, 193, -782, -179, -127, -368, 394, 524, -648, 738, 352, 209, 1180, 1425, 647, -82, 362, -78, -1034, 149, 503, -239, -581, -407, -348, -894, 770, 46, -494, -168, 302, -271, 860, 415, 277, -160, 392, 1967, 297, -866, 2, 177, -542, 114, -283, -1026, 667, -104, -147, -578, 934, 602, 372, 706, 671, -482, 525, 668, -68, -909, -476, -436, -487, -1460, 19, -403, -945, -1222, -850, 833, 146, 779]
3866G79q0M89r29K92j110J458j86l25K86O45k604J142n59M55r8qO16j395J636
3885E04K26J10o8J0q4j182J084J38m10l5N09l61q86j58J73k14j96J043o79M04
3905g2K28o26N00L70J016r36N4M36m52l6k24j033n2K4k32l94J021j08k9k20Q32
3926F7P10j567J181m80P45j32J63o49M98l46k18q35J023j53j293O85o3p9n95J390
3946E2o94L61K68p4j13J53J21l29L48K8L34j814J855m46p08P79j032O17j91N78
3966I3j57M34K84p4j047J003L2q79P63n81O33K90K3j244J16J4p92M21L29K41J79
3987H1n93J551j327J622j707J176l51q58R73p16Q47n27l2l68j39o32k69M26m86
4006a329J152n35K58K02k76j57J175q75L04P95K4M91j612J89P1R66r10j97L92
$$ y = [779, 699, 1188, 259, 551, -559, 899, 713, 388, 674, 1319, -1285, -143, -702, -247, -345, -353, 263, -1132, 504, 730, 840, 772, 782, 698, -484, 600, 738, 328, 293, 802, 441, -445, -603, -430, -644, -840, 203, -476, -72, 156, -470, 30, 400, 1416, 480, 534, 970, 518, 482, 258, -775, -827, -803, -1035, -1429, -408, -516, -545, -765, 67, 777, -790, 391, -89, 656, 524, 687, 38, 536, 190, -28, -863, 160, 7, -1286, -601, -664, -743, -1338, 52, -642, -281, -13, -87, -200, -47, 74, -255, 93, 121, 455, -1359, 496, 50, -658, 121, -911, -294, -485, 93, -64, 370, 654, 580, -467, 536, 568, -311, 452, -129, 504, 794, 817, -427, -311, -297, -1089, -668, -339, -98, 81, -512, 1039, -288, 1334, -373, 803, 452, -406, 567, -149, 698, 171, 139, -229, -368, -1000, -1269, -843, -1329, -177, -712, -454, -252, -528, -685, 490, -385, -81, 714, 738, 1229, -383, -194, -123, 843, -67, -264, 128]
4025A28j194J168K28m04j18M29j007O20P66l96M66p89J291j720J278j05o08r40
4043i07M82L12m15l79J199o62m68l65J873j924J866l9k24l01R96p89J95m22l27
4062b99l37J312j084j357J697j10p39P76l86P47n34K33K23p65J625n10o11j60
4080b79P27l11k58J194o07n96K28k53K29j123M32J192k39j121J139l5l22l80J046
4099F63k32j91l56j5K50kl04o83NN28M55K29K88n24p2p59R41k06q48J330o92O06
4121D11N48j06j113o16J310p24n62J31M92J369j606M50n55P52p42Q07N04p08J79
4140B21ko61J270r45N24k83J68j005Q95p15p3R7l05J334j128N46j51K91j59N5
4160b6J33P20o66N43o92J031j371O4Q42n49P30r46J43j156J198O0J0k29O73k21
$$ y = [128, -1066, 102, 330, -74, -192, 237, -770, -150, 616, 220, 686, -103, 1188, -532, 746, 641, 33, -907, -425, -113, -528, -907, 292, -370, -838, -1203, 670, -1254, 612, 573, 349, 48, 1044, 255, 450, 28, -299, -636, 676, -408, -1765, -68, -178, -917, -141, -527, 220, -314, -81, 142, -623, 1002, 492, -119, -279, 448, 137, -121, 1073, 466, -130, 98, -155, 74, -1049, -617, 575, 336, -785, 354, 319, -3, -383, 663, 431, 240, -116, -131, 119, 117, -187, -870, -865, -337, 118, 347, 635, 111, 39, -720, 221, 15, -833, 497, -195, 411, 959, 853, -260, -876, 434, -290, -852, -721, -229, 1140, -466, -16, -571, 181, -561, 246, 750, 42, 221, 219, -442, 828, -117, 407, 124, 292, -713, 182, -533, -606, -509, -814, 520, -608, -62, -213, 78, -81, -26, 107, 827, 161, 704, 12, 1043, -328, -264, 578, 29, 759, -187, -44, -1200, -2, 58, 68, -161, 512, 291]
4180B91M62L6r63J2p99J457k94k26L30l09q16L81J87p2M04m31n9J115k12k70R6
4201C20j98M85r27j19P12m88J09L59J95n29J44n45J264j223K5L44l5m36R10J32
4221D99r11O81l2K2m84R27q57J07J50j472J368l51m91N47L51j09J89L81j63l32
4241B0M50o29L27L92j126O96oK41M73n69k44r69M63N8l7L19O06l39K5O09n90M95
4263F65q72Q06j35p82R88r25M04M53r2k34p79K88n29J557j350P37n42P64k05n50
4283c33L63R98m14j292M09q06K147j412P03p53m7R75J05P7j270L02l84m95J358
4302B31J77K66J55q48K84O52p61o86P80p3j626J712O80j672N24n58n1O29n64n27
4322a276Q23J122l34n8K97n25j40M44J78j26r28J066j092J437q32l80P7M38j000
$$ y = [291, 753, 789, -174, -162, -961, 496, 202, -24, 306, -3, -819, -438, -251, -323, 81, -350, -409, 706, 494, 224, 320, 122, 607, -320, -439, 273, -215, -106, 253, 448, -81, 63, -482, 782, -441, -416, -72, -107, -543, 367, 499, -412, 269, 237, 259, -225, 702, -155, -48, 102, -1370, -2, -353, -844, -297, 54, -55, 134, 515, 352, 20, 470, -159, 168, 560, -566, 130, 124, 365, 838, 269, 25, -944, -481, -423, -460, -141, 465, 126, 151, 760, 170, 665, -207, 599, 464, -318, 670, -255, 149, 602, 510, 276, -503, -215, -744, 813, -537, 200, -342, 422, 217, -333, 30, 1028, 614, -678, -269, -1075, 1072, -340, 363, -390, -437, 538, 643, 720, -550, -248, -632, -1127, 231, 408, 674, 829, -19, 265, 917, 156, -530, 250, 177, -1449, 263, 943, -729, -205, -763, -814, -185, -749, -1276, -453, 669, 335, 277, 574, 49, -91, 353, 531, 405, -523, 543, -549, 888, 56, -324, -247, 191, -809]
4341h09P38Q6j31J99n78R19o37J40j83N61o73q0J024q67n8O24j244J129o74j7
4361e31J56J32N05j49l68L53m67J081m83k23M61q5p03k06Q21o99Ll72k1N45m56
4382g06O24J92Q25o22L96n08N93j227o5K61L5l84Q14O1k05J56k04j87r44J174
4402G9j046N88k09K80Q17n73J7M96j72p3l93j46O13Q12j867Q31m4j64K77l61J070
4423H32J4J21j048J81k42l80J484j055J0K2M97l64J11o14M62m74N02P2r09J82
4443e96K34Q08q19M17j15l89L56M10q53R88m64M25n98N54Q7j080J098Q31j496
4462b02m10p5L12P47l38j63L24K5m66Q03j58p96M43J240k031O9J192j27n70K0
4482a61P13j040j19k21J476p51L86r77J084M22n22n51L49J32r96O45O20n21K12
$$ y = [-809, -71, 15, -116, 83, -495, 424, -213, -73, -256, 305, -368, -448, 576, -291, -349, 275, -969, 160, -514, -531, -375, -243, 262, 113, -255, 98, -369, 712, 229, 6, 467, 382, -321, -527, 294, -405, -402, -774, -795, -250, -706, -82, 110, 935, 313, 709, 201, 794, -433, -498, -237, -202, -586, 228, 289, 84, 240, 36, -151, -1095, 79, -967, -379, -588, -308, 509, -64, -47, 449, 277, 204, -189, -335, 278, 1090, -777, 54, 10, -154, 123, -238, 832, 846, 967, -81, 100, -142, -522, 962, -93, -83, -61, 436, 72, 183, -431, 31, -443, 59, 131, -778, -596, -362, 446, -373, 44, -71, -460, -104, 306, -547, 441, -23, 402, -196, 358, 445, -635, 463, 1294, -202, -612, -687, -375, 372, 34, -129, 195, 220, -246, 557, 399, -397, 46, 1286, -745, -676, 516, 389, -181, -161, 552, -488, -607, -828, 648, -103, 283, -694, 390, 812, 290, -261, 88, 220, -776, -131, 489, -32, 180]
4501A80R8j347J026o87O6J107j082L66K25l23N12L48r75Q41o47M89n12L75O92
4520G52l38l09k23J44J01J238j755kL2l04j9M68M68L69q04J16LK17k00O43q01
4541b04J2k65p6M98l57J99M2M60l3m22K57M58l7o05J059j53j268O36Q5r04Q6Q06
4563B74j39q22M25m43M94l92Q3L94Q0M04k94l12Q97K62q14Lj11J50k71k44M7j80
4585e09M09m81M01k32j44P46O5J11j019P86k30J72J68Q0n36J22N18R9j62L75j07
4606F32J06j526R91r26K99j65j4k35Q92N26K2k32K95p7n77L50n42M24p74k22R0
4627f63P78o96P65q30O06k61P43m99P06p67M33l24M7L10l35P79j342R57p47R75
4647F35o49KJ23L62j654J126K58K25m17k99n47J301k02j007J413r11P51N49q91
$$ y = [180, 278, -1069, -43, -730, -664, 443, -639, -273, -48, -371, 141, 489, -486, 355, -292, 197, -315, 60, 752, 414, 105, -118, 26, 127, 1365, -390, -392, -360, -664, -683, -215, 253, 622, -182, -66, -63, 154, -46, 597, -204, -192, -457, -533, -35, -392, -193, -151, 309, 276, -146, 111, 569, 532, -73, 986, 833, -435, 201, 286, -618, -532, 274, 135, -687, -262, -705, -211, -603, -520, -126, -46, 358, 64, -248, 649, 911, 97, 100, -11, 139, -132, -376, -329, -509, -100, -581, -180, -412, -556, 190, 255, 366, -653, 133, -97, 75, 243, 323, -213, -91, 427, 526, 364, 739, 632, 738, -788, 203, -723, -424, -589, -603, -838, 54, 580, 602, 370, 665, 588, 11, 361, -181, 243, -531, -753, -663, 115, -581, 184, -646, -40, -301, 442, -57, 649, -118, 315, -9, 38, 348, 13, 792, -550, 407, -340, 635, -14, -12, 111, 473, -1181, -55, 203, 428, 11, -288, -835, 466, 264, -743, 670, -241, 510, 1059, 168]
4666A68m89O02j69p5m94K14r44J390n27j40O83Q9L63p84Q66m75k6j8pk6m38R61
4688G24o84k4M10p11k80M27j82m74K72N83m05L13JN42o91M39o7m29K58q41J475
4709F56j059k19Q90j581P67R15O73r35j058N49J141j083N65K61N34o47m68J36
4727C7o58Q61o73j4R0j84N98o90O18J13K69m56M52n2j89O17q16j17J260j228J501
4748A339j377k84J018j600J005n99O03m58K49N01j89j257R14l20P56j16K60k14
4766B31o90J083k11O85j186l59J08J036p26J04o10M94O9m96O48o16J035m85l69
4785b55L01J76q40P29j4o72P47k16K84M5j003J31K75j464K671j129n12P37n61
4804e70N24J8j19K85j93J046m97l17J98j010O77o47k5M11M96L26m86K97j46j3
$$ y = [168, -321, 281, 112, 37, -457, -243, -1187, 203, -324, -464, 219, 308, 671, -113, 753, 278, 252, 234, 227, 201, -237, 724, 40, 16, 426, -285, -565, -138, -320, -794, -522, 61, -344, -31, -30, 512, -179, 260, 193, -236, 22, -819, 656, -403, -622, 268, -1313, -546, 369, 1042, 107, -951, -402, 739, -344, 221, 482, 1016, 369, -99, 37, -621, 240, -433, -447, -357, -541, 57, -633, -15, 98, 367, -89, 363, 311, 122, 739, -77, -194, 1066, -162, 1339, -38, -322, 696, -904, 101, -498, 105, -353, -104, 397, 208, -1049, -135, -455, 301, 185, 445, 231, -459, 624, 413, 1098, -88, -447, -339, 697, -29, 75, -535, -41, 28, -468, 180, -436, 599, 114, -255, 46, 222, -618, 111, 97, -575, 172, -44, 240, 285, -718, -587, -312, -1776, 895, -234, -746, -9, -570, -46, -28, -147, 138, -55, 991, 494, 177, 375, -635, 42, -605, -630, -219, 277, 603, 117, 414, 268, 255]
4824B55p97N45J89p6m0M30J89n24J0L29l39n92M15O9j7j03n63O04k60r9o3%K19
4847b19l12P92j66k51J28M3O99m26m18q71J150L25q75j60M59Q3M88p03N40o17
4867c11M61m10P10K14p76J166j398Q47n60J35k6p72M72J033j538J118r06m91J112
4886H0n12J00m13L99m38J547r23J60m6Q38r59M68q3P4O7n07o46L2O59j05K87k95
4908b16p9jM48J52J095j782O17o83K88K60j049M55M05r9N21j030N04M31o86K60
4928a89K29n2M01l15M2k76K55k43J79j24n09J523n57n2p54Q62l68L67l65k47M02
4949B09N81n25n47K23L03O78j110M19n76N58r32K16N37q15N30q8K89l87N86J03
4969B52K99j577J818r11M43m87j58N50q03O87J48L49l78p27M64P88j10j102K93
$$ y = [255, -542, 3, 192, 116, 76, 506, 695, 171, 181, 510, 171, -421, -6, 63, 46, -57, -620, -16, -276, -375, -438, -438, -219, -531, 261, 95, -156, -28, 15, 714, 288, -130, -1001, 149, 474, -401, -561, -102, -19, 469, -234, 306, -311, 150, -260, 450, 664, -112, 1054, -344, 503, -57, 78, 52, -720, -248, 785, -753, 365, -541, -1032, 80, -432, -332, -745, -346, -784, 763, -160, 0, -46, 792, -167, 301, 218, 292, 359, -148, -794, -762, -103, -208, 79, -216, -295, -296, 152, 304, 1399, -383, 234, -449, -161, 99, -950, -495, -90, -189, 332, -698, -194, 237, -449, -189, 40, -12, 389, 74, 116, -160, 95, -148, 31, -93, -602, 921, 364, 312, -442, 420, 52, 419, 54, -193, 209, 790, 265, -282, -59, 244, 922, -188, 231, -345, 213, -719, -503, 34, -781, -251, -339, -50, -437, 149, 252, 551, -1026, 792, -119, 324, -163, -321, 229, -574, 113, 261, 610, 232, -495, -31, 757, 647, -455, -162]
4988a62R38o41m58J003k71N92p15k1J83o63M04l26l86j63O00o75O68l70K52M04
5008A93n53P97J12o36J247j734J014J4m11m34R65N20j920J142j96n18J052o50
5026DJ0m44Q49L28n65J3o49Q51l4R3p81L68P86o44n45Q40j242O78OJ63p77J408
5048G16q67p91Q56L50p76P68n50J119j95r2o42L7J94QJ55O65o19l78k44l38J42
5069d82N3K01o00J435n97m39Q37N07j116K46k41p1P44n6p63Q1R81p55l09L46m13
5090d11l25J017n31N3M08p35Q86m21r0m16J52k41J13O02J75k04L68M3q42L88m30
5111d41j2N06M82j427J041k33P02m11n1m63O48r39J149p33M73n86l02M81J04J72
5131A60k7l73O86q68N20N90j178R12L89l24j20k26n92L88m08O99l52K77O79j330
$$ y = [-162, 776, 135, -323, 680, 409, 1001, 286, 265, 448, -215, 189, -137, -523, -686, -86, -761, -93, -463, -211, 193, -360, 437, 549, -87, 1160, -574, 440, 454, 43, -391, 574, 1094, -826, 316, 120, -398, 654, 4, 14, -430, 419, 747, 182, 195, -454, 397, 363, 456, -325, 43, 829, 185, -360, 480, -762, -84, -78, 85, -692, 716, -151, -942, -86, 264, -512, 256, -294, 825, 630, 538, -104, -67, 127, 135, 290, 955, 336, -42, -286, -624, -482, -429, -228, -828, 607, 10, -429, 408, 915, -201, 45, -196, -267, 477, 421, -342, -261, 720, -35, -344, 2, -411, -736, 281, -250, -197, 211, -524, 362, -59, -149, -565, -413, -654, -541, 61, 236, 32, 400, 443, -399, -11, -441, -453, 53, 535, -892, 149, -84, 618, 207, 156, -307, 341, -598, 551, -182, 291, -295, -597, -116, -12, 160, 133, -240, 446, -422, 98, 688, -490, 422, 811, 487, 367, 141, -451, -63, -471, 228, -124, 153, 832, -498]
5151d98O89M23J11q41J36m55N33j072K16Q85O15p25Q5k4J89o52P32j308J591o77
5171d7m17K85N00m12M64o75n12P73L50M82j099j93N4M74m1n16M79N8M53Nk35p53
5193e23l11R62p0q46O62O25O14m86j219N18Q57q93P28q48P62k94L42j6p35o2q19
5214a052J070rm18J37j14O54j027K82m37J107P2J38p73O80M46n48O29k4n46p13
5234d46Q16o29Q68j58n61j38J84J70j54L13m29k66N14q2l26J94M07K73j559M94
5254e15P68p36O98l01K65j53J3l23N76l63p6l90L68Q63j117j86N26L74K45p96
5274b60l06J337j174N15o93O04J25o62O5P28o06k09O81M17l24K95r46J125j270
5293e58J53N58j73K67j79K34r3l0o22n71K31P43K51K92n86J055j132j38P89l73
$$ y = [-498, 191, 614, 725, -116, 20, -435, 98, -974, -758, 127, 742, 17, 102, 78, 267, -385, 347, -961, 630, -47, -464, -179, 321, -91, 373, -302, -814, -41, 309, 791, -308, -501, -447, 27, -14, -530, -51, 7, 460, 465, 230, -523, -834, 128, 58, -788, -126, 499, 1113, 627, -592, -74, 783, -110, 618, -230, 532, 238, 580, 564, -171, -233, -1052, 18, 9, -409, -272, -386, 268, -759, -477, -914, 193, 265, 403, -370, 310, 756, 208, 837, 813, 267, -446, 370, -259, 609, 451, -110, -248, -64, 106, -48, 265, -164, -430, 84, 2, -324, -130, 277, 550, -1009, -515, 253, -483, 215, -86, 179, 26, 39, -284, 292, -71, -147, -537, -169, 694, -423, -609, -83, 291, 536, -260, -566, 771, -403, 112, -581, 23, 148, -514, -449, 279, -327, -536, 145, 562, 238, 533, -413, 712, -558, -405, 153, -20, 247, 68, 302, 209, 179, -443, -1014, -783, -40, 211, 503, -83, 972, -160, -298, 491, 118]
5313A18L87L53j176J43M95lJ93m33p18M57p50J115o8l96L5R23n12n43R05q59P47
5334D13m85N00p02k78L47L7M25j038J951k723Q94Q12L15m99n72K24O16O82K2j452
5354e11K0J471j314P8O20j152J070m17L17M56q18j9Q04p00n18R24n01J010q53
5373c3M08n47J05N99o56m89L00q8O11j90k95m22M50J400j572K73J045r72K10N16
5393F53r54J84J36o2p43J072r06K15J074q48l71K93P74n48l61k29N65M21l90m67
5413d92P64n41N94K09K48j193k29K5N53lk78N64L65m89P06p55k02J99l36L15k86
5434b62pK61l86Q61j6np58O21M8jo02L62R52j750R79m83O53n95l55N28K22o66
5456c99N41q40N16M66l47j80O67Q5on32L20K13l66l92K1J40j44O75m95L32J001
$$ y = [118, 505, 858, -318, -175, 320, 317, 510, 77, -641, -184, -934, 181, 113, -283, -248, 675, 163, -380, 525, -334, 413, -72, 428, -274, -552, -205, -168, 257, -781, 1170, -1553, -659, 153, 468, -31, -603, -379, 237, 919, 941, -511, -491, 980, -334, -256, 364, -788, 282, -135, 182, 638, -180, -199, 605, -95, -613, 311, -190, 820, -33, 375, -172, -67, 532, -124, -613, -313, -401, 210, 20, -275, -697, -247, 1153, -419, -146, 899, -73, 137, 653, -301, -117, 19, -43, -786, 286, -620, -405, 669, -179, -550, -257, 517, -31, -392, -621, -56, 365, -25, -492, 272, -269, 325, 534, 782, -411, -640, -615, -62, -65, -343, 221, 586, 97, 803, 48, -154, 45, -291, 24, -262, -269, -8, -394, 467, 451, 446, -312, 309, 357, 356, -246, 116, 1068, -682, 297, -186, 467, -128, -483, 45, 267, -399, 142, -698, -182, 284, -63, -243, 424, 509, 503, -29, 291, 504, 138, -254, -233, -93, -237, 438, -57, 275, 1276]
5477A276r32K54K53j20l51k97J25k16K8l92J96O69j199J48j09R83n91j35k14O99
5497G5o2o06Q42O07o51k65k46J209o32n43k12N60o60M87K52K19j22L81n10o02
5517d79L95M37j97J25n82Q23q72J32N31m72M16o38N51n92J44L77L79m95p0J83
5537I6O30p08J93l72L78j126O04L55r89P77J03n3M70Q9n53Q50p40J51j047P70
5557a22L32j30l34M03n67j48P34j135J135o24M90o08j03J20K5J481j268J21k51
5576d49k2Q53n42M8j66Q76o00l41m7R98K38j868M27j97J06N17P23j35j51n47n38
5597h17J651j397J062n58Q01m48m12K62M25q59kj67J5J31N22m41j46K04k28R74
5617E72n8P9n19o7k61O0K51L17P4p06r3J058n66r09N15k13J653j010j383J727
$$ y = [1276, 344, 598, 851, 731, 380, 83, 208, -8, 20, -372, -176, 493, -706, -558, -667, 316, -275, -410, -624, 75, 13, -593, 249, 856, 205, -60, -306, 903, 271, -272, -484, 76, -584, -97, 155, 374, 252, 633, 123, -479, -84, 353, 156, 281, -301, 522, -350, -218, 313, -159, 257, -381, 170, -422, -278, 99, 478, -17, -87, 96, 726, 18, 211, -161, 217, -909, -305, 50, -939, -162, -59, -112, 358, 447, -106, 744, 4, 155, -892, -122, 210, 80, -254, 149, -418, -566, 168, -967, 168, -456, 34, -574, -677, -557, -532, 949, -319, -198, -449, -471, 382, -160, -112, -278, 598, -2, -343, -390, 608, 846, -1022, -595, -792, -686, -169, 554, 419, 268, -279, -817, 834, -563, 499, -59, 742, 294, -118, 144, 569, -290, -292, -459, -444, -313, 209, -232, -378, -174, -402, 572, 514, 593, 74, 7, -254, -194, 57, 374, 448, -258, -351, 707, 141, -768, -253, -466, 1187, 177, -1206, 521]
5637E21J67l53J99o25J37m64M21J064j093np1p4j25M45L16n81k69l3L18m1J82
5658C6L34j604O44J314p06N48k01n02M24L02p17R34k41m46j61K81L61n08n3l39
5678c00M78%n58J127j61j059J067m66p4p65R34n89L46K52k4l66j43j12M83j25
5698e5j87Q13m84k55K95k62O8Q56j123j08O9o14O15R31o80k30N14k37R2P1M1J55
5720B85m70L91k51N53q36N68m12j16M89P06l63M44j239M58k62N37o03N49p4j14
5740B40l21J02O71j024n51M61J201j226k53Q44l87N3K52n38P48k14n37k50L54
5759c75J76J31m18M05k91K82j63L9q8Q01L26J0j25q64M36k32J24j45q8m95j75
5780g29J192j135L16J545j840J151q09l49M70j28Q23q46J64K82n74M81n06L44
$$ y = [521, 688, 335, 534, -91, 46, -418, 3, 1067, -26, -31, -102, -176, -301, 144, 460, -121, -390, -423, -105, -146, 36, 370, -1234, -590, 724, 18, 566, 365, -137, 287, 589, -128, 806, 565, 119, -42, 239, 600, 92, 39, -300, 178, 178, -380, 747, 586, -473, 594, 128, 54, -711, 223, -366, -20, 232, 208, -158, -301, -413, 70, -55, -242, 571, 87, -168, 127, -135, -67, 789, -334, -442, -373, -987, -372, 559, -121, -351, 163, -74, 18, 89, 130, 285, -185, 206, -45, 508, -328, 240, -172, -288, 201, 907, 544, 988, -251, 207, -55, 482, -121, 428, 354, 240, -81, 21, 692, -332, -883, -422, 779, -447, -700, 144, -243, -190, 62, -476, 272, 58, -479, -729, -375, -199, -68, -486, -81, -372, -90, -253, -214, -302, 499, 825, 835, 710, -154, 282, 50, 174, 29, -59, -554, -729, 463, -672, -356, 1189, -651, 500, -309, -658, -188, -316, 507, -339, -175, 107, -467, 14, -492, -148]
5798a48M22r84J25K110j027q01M07J301j129k65M38k92Q08q99n30Q77o35m65J16
5817e71N36O84j962N88P06n70Q81M0k8j50k32P06o34j26L47r98N88J17M24J68
5837E14p32J09K82l28n85O99o51Q04N5m05K79j67J09n94Q90K5r45J036n95M18
5857B18O9o0q23Q78l56r34Q82M72n49N53K69L87k36j552N54K2n91R23p5L13o49
5878b85O00K48r59k00L12K15n2O60j425R97K70Q3n13k08K48R16r43n47J697m48
5898F66q97j17P8n26Q15J6M69k55k62O1rQJ26N90n48k47j09O35j76L02m37m00
5920b17K05n2P8k19K07r54J647m06o08k01P42Q8L3p51n50J145P4l66L10K97j84
5941C18J52j41P41j541P5j95p64J493N03p15Q14p09j54M71j041j13O65J02q27
$$ y = [-148, 274, -710, -585, 1525, 498, -303, 104, 1405, 276, 11, 449, 157, 965, 66, -464, 413, -222, -687, -571, -35, 649, -1313, -725, -19, -589, 292, 332, 304, 154, -78, 628, -6, -132, 215, -783, -195, -78, 346, 514, -218, -109, 173, -155, -740, -41, -692, 112, 167, -238, 41, -126, -17, -611, 279, 304, -641, 395, -200, 218, 287, 227, -596, 282, -74, -1008, -126, 346, -203, 350, 619, 1006, 770, -782, -228, -206, -797, 126, 51, 364, -285, 315, 563, -396, -596, -284, -69, -121, 539, -886, 111, 381, 464, -49, -257, -9, 907, -36, -583, 1114, 666, -231, -348, -270, -796, 19, 35, 504, 249, -13, 48, 39, 47, 173, 763, 215, -32, -141, 494, 318, 620, 183, -217, -12, -64, 14, -205, 2, -952, 695, 289, -319, -520, 222, 310, 343, -408, -958, 187, 261, -105, 205, 502, 318, 470, 329, 1070, -471, -396, -591, -1355, 138, 641, -74, 740, 31, -123, 348, -693, -806, -141, -39, -866]
5960h66J070k7j31m42K83J47j00Q48r30o02N01q83J553P44j224J5m63M37n94R62
5980B98r33R48r62M74n40J138j138j44J92J122j41O56p10P97r62J75j65o16J127
5999F16J96M3k34m89L55J21k43l42m85L78j46p58O16K94J30M05n12J120k665R26
6019f74O74L56n93M27k21Q4L91L2j114J255p92l40n22P08J120q73N78J32l12k74
6039D2P71Nk59j18J24j133O04p04P86N43k11M58k87k70k54k38L23M54j441J157
6059C52j057J601j287R71o56M7j33L34K00p34O07m35JM8k88L63m80R39k57j042
6079i06Q15N05P05j040L60q43J196o69n19j98K72k3N86k07lR6j75O92L4l89k7
6100B62M25j845N96M43p42J55L43J493j177q03k21J222j87k84k70NO61j7p46N31
$$ y = [-866, 204, 177, 46, -396, -113, 34, -66, 782, -148, -750, -249, -1132, 421, 1165, -59, -44, -507, -70, -664, 298, -635, 313, -649, -175, -715, 423, -715, -859, -667, 455, 314, 970, 260, 1057, 95, 270, 105, -511, 616, 812, 855, 621, 132, 487, 608, 365, 23, -462, -84, -230, -988, -372, -78, 52, 457, -55, 1065, -1600, -674, 0, 356, -237, 190, -31, 53, 444, 476, -638, 617, -175, -515, -1037, -329, 791, -82, 496, 628, 316, 42, 813, 818, 559, 441, 565, -568, 36, -668, 118, 661, 450, 908, 621, 351, 97, -141, 182, 636, -805, 352, -705, 896, -391, 580, -76, -29, -162, 172, 372, -362, 245, -190, -189, -141, -429, -66, -546, 393, 136, -906, -91, 414, 1119, 79, 439, -404, 792, 123, -396, -594, -322, -345, 241, 34, 31, 127, -48, 644, 678, 289, 262, 687, -1158, -562, -119, -861, -706, -363, 1130, -47, -850, -1071, 151, -36, -320, -590, -585, 76, 59, -687, -156]
6120a56J29K66k83P36m18K60j106O81m71K26k89j8k91J480n34n41L84L2K13j92
6140A08j54L76n95P65k41p06o3l15Q33n08N37j201R96L60p96Q02m62P88J4l51
6160A87J17Po77j2Q55r07J213l29j33n85j80P96lM30j106J011q42J36J45J77k89
6181A1P72l54n88K18P0K89o08l75J045m50M52q57O81p60l07J393l53j069M92Q84
6201E86l76r2l3m22J177j193K52k60P63L45m44k35o0n16M66m75J068j291Q24r27
6221h43J742p55J8k94K36M03l35k88j22j63K90M50o31M94N45p35l39k25N63L66
6241C77j216J199j179P72q8L63k03m10K00M03R0j043J87P64p29Q89j77m34N5M74
6261B94j281J456p42q75J918m35L04p73N57q6J228j897J029o11m17q4O61p69N73
$$ y = [-156, -27, 239, -44, 692, 274, 534, -572, 109, -362, -136, -425, -443, -734, 746, 212, -329, 55, 87, 300, 108, -46, 330, -265, 500, 259, -447, -510, -825, 8, -500, 37, -1164, -168, 192, -604, 198, -264, 524, 538, 187, 304, 311, -366, -378, 477, -430, 783, 454, 321, -264, -444, 352, 349, 779, -327, 684, -158, -22, 123, 300, 11, 783, 429, -159, 59, 129, 418, -190, -565, 480, 30, 482, -375, 306, -454, -761, 632, 279, -790, -298, 586, 210, 118, 85, -337, 840, -353, -101, -361, 402, 747, 303, 68, 8, -508, -42, -517, 551, -740, 84, -843, 899, 144, 162, -132, 104, 507, 172, -116, -238, -401, -111, 339, -292, 202, 747, 12, -327, -552, 11, 377, -839, 360, -819, -47, -135, 228, 25, -385, -185, 218, 308, -735, -548, 216, -513, 376, 199, -235, -180, 294, -987, 469, -273, -1148, 770, 335, 639, -134, 423, 337, 1565, -332, 697, 86, -331, -415, 246, -523, 50]
6280E0o14j74J3P76o52l02Q86k98M25j28J17p23j75J568p57q98N94J35O18q37
6300c76k20Q54q71N72m77M72o00J598o09J58l81l01K04K81O0m81L79M29q74K14
6320C1R9p49J473j299Q08n1J65q64J07N13m41qo41J031j48K35m82o4J63j64M45
6341A59r92K71M83K29k02L06l98Q3L01L95km53K23J89j040Q88p92q38O22M76m06
6362d98O63l0p99M84l07Q41r93P72n80L89l27M08O4k18J155o11L38j107K84N57
6382D85j112oK03p9J368j383J280j93m75P31j170J268q71R72j219m44K50j7P48
6401C36l16o10K02M76m60O58k48j40O74O9p17N94m88M07k76k49n4j28P54n94k98
6422d08M2K61N71l03J36j88j152J093m53M91K58m00J213q84j217J757j485Q94
$$ y = [50, -564, -738, -725, 51, -601, -903, -17, -315, 110, -18, 99, -624, -799, 769, 12, -886, -292, -157, 461, -376, -596, 258, -613, -41, -518, -46, -646, 952, 343, 501, 120, -181, 23, 304, 364, -117, 262, 691, -183, 31, 130, -619, 854, -445, 363, 312, 477, -387, -280, 233, -208, -216, -857, 174, 26, 261, -221, -285, -122, -286, 159, -833, -562, -79, 150, -52, 254, -144, -61, 240, 635, 633, 180, 403, 592, -448, 440, -352, -1190, -568, -92, -498, 165, 135, -664, -180, -487, 354, -639, 133, -447, -58, -385, 23, 87, -131, 1024, 413, 751, -356, -72, 485, -627, -633, -430, -509, 859, -524, 756, 563, 88, 819, -351, 917, 46, 1018, -201, -645, -395, -412, 336, 20, -590, -388, 88, -372, 286, 38, -102, 572, 641, -76, 518, 30, 437, 161, -88, -142, -270, 484, -110, -408, -366, -105, 466, 163, 299, 111, -1041, 52, -401, 90, 348, -52, 1161, 277, -940, 817, -668, 226]
6440B26L32J14q88J205j168N95p63J121q94Q6k1k07k5O78N35j231j37N85p44P07
6460A06l28J83l1K29m79j58R92m10K7L10q54p7L89j91K29M59n67J40K49J50K43
6481F11o60L55m25P9K64p02l59K33R42j064J100q82J587l69m92P0k18r3M23p15
6501c15P50r63L89j32O96o94o04M05o33J179l60r42O04L83K75P34j064j82J376
6520I02p25J20L82j218N83J286j820L16N00m12J28j80P97N1p94M26K29j080O19
6539A10K79q18J164o20k51j15l62J664j396J96L55q16P72M69j267O45Q13p97K90
6558C15j89o2M59Q6K71p81j47j64J63N47l17l26j20K54o46j60N06m3K34n25Q60
6579B15n16K94r8J48m63N68N29l43r82N58o28r5Rj22Q28l47J26P87O5n21l6K7
$$ y = [226, 558, 672, -216, 989, -179, 416, -347, 774, -120, -34, -55, -262, -287, 391, 926, -305, -442, 143, -601, 106, -222, -39, -70, 159, -320, -478, 514, 104, 131, 441, -413, -490, -101, -292, -63, 396, -171, -31, 218, 368, 611, -49, 306, -119, -40, 224, -478, -837, -604, 338, -726, 374, -508, 1079, 710, 218, 288, 70, -23, 400, -315, 435, -528, -139, -271, 425, -269, -873, -468, -1101, 78, -282, -1224, -620, -237, 38, 772, -292, -474, 902, 177, 297, 679, -539, 44, 1330, -490, -174, 326, -86, 42, -138, 659, 710, -84, 342, 571, -509, 110, 389, -429, 735, 115, -136, -251, -613, 1051, -345, -149, 206, -610, 162, 631, -636, 9, 822, 25, 315, 126, 64, 523, 609, 880, 99, -48, -212, -49, 498, 181, -145, -265, -11, -657, -817, -311, -354, -120, -645, 215, -301, -7, -105, 43, -420, 148, 677, 334, -648, -90, -718, -813, -804, -926, -98, -445, -319, 468, 533, 12, -24, 3]
6601Cr36J774p06L40j63j56K53m92Q3n66P39o69p7L20O87L89q85N87r60n37J487
6622E15o47J016j88o68m85k24J359j151K18q8J37J52O82l03n22J003q59L04M46
6641F97m26j2K11m96k62O97j46K16m1Q21j171m14N55K56r99l50J213n32K50k07
6661a40M5J056o99j7L03o04k47l5Q78j077M42r2L46j306Q33O55J75q23n04N45
6681b66m30M26J69L16K96p24o13O89m07J459j708P87K78j047P13j88J060r91o04
6700g85l3M26M13M94j85m18m66J020o04m8K57K8K31q75M29O4k8J84n63P39l21
6721d1k77O0M64q5K78J7p99K82K58j96m37O94m23k78P52j168J130l96K36m58j7
6742d04J077j67m20M05o16L06j2o8L60n91l03N54m0L02j185Q51k85k68J869j466
$$ y = [3, -933, 841, 135, 475, 312, 156, 409, -83, 0, -566, 173, -496, -573, -253, 434, 823, -62, 525, -435, -972, 515, -132, 884, 696, 28, -457, -681, 678, -473, -255, -343, -206, -54, 628, 325, -197, 806, -53, 251, 697, 271, 259, 470, -26, -288, 409, 263, 479, 438, 1259, 88, -326, 229, 485, -514, -864, 349, -183, 67, -140, -95, 961, 262, 245, 548, -56, -303, -338, 540, -537, -95, -187, 159, -1147, -314, 341, 516, -307, -811, -266, -696, -270, -101, 215, 511, -213, -826, -137, -544, 915, -793, -6, 272, -775, -62, -250, 810, -181, -785, -818, -392, 21, 515, 330, -88, -554, 466, -138, -186, 71, 99, 330, -545, -116, -52, -80, 104, -459, 280, -41, -318, -258, 206, 121, 399, 416, -383, -101, 157, -39, -476, 218, -205, -483, 269, -899, 231, -165, 71, -387, -404, 673, 506, 86, 491, -125, 181, 169, 101, 461, -130, -433, 121, 81, 383, -802, 49, -236, -504, 1365, -101]
6762a01j1l20J352j105J06O63J88k046J065P4n68J74N55P26o42o63j32K12L66
6781a07j65J69J90n14J077o60P79j163N04K43Q6J37p51J44R1q06O19o3n15J154
6801D49m60N06j311R11r1P74r66O68l38q39N77O38p31J44nj76k06J6R91r50n3
6822d52O75K22k67q08N4L69K74r38P69K58m2n76P22P08q52q8j185J086k11M36
6842A54m58%N96j101J52R31o58M94J65k36p65Q42j36Q38j34q94K05J68m10m30
6862f77J7K27k28N47l35Q03k74l3Q39L11j375N01j88M64p53N86m13Ml1J83m18
6883b43P50j36l0r61J72K52P71m58N31m52m27J7N81L50n13j073Q54k76o54O99
6903b46l61O44p65O86n15L60l62J166m18K81n09j81o88J496L75j335J049j305
$$ y = [-101, -112, -432, 920, -185, -79, 584, 772, -1274, -209, -135, -703, -529, 26, 752, 110, -553, -685, -473, -107, -272, -103, 87, -427, 650, -10, 769, -394, 110, 353, 439, 576, -175, -31, 60, -746, -127, -190, -705, 449, -11, 495, -816, 95, 4, 778, -188, 480, 142, -697, -120, 518, -213, -69, -74, -250, -456, -440, 551, -399, -452, 223, 445, 178, -630, -576, -207, 67, -871, -102, 156, 114, -462, 260, 968, 116, 28, -1157, -71, -282, 154, -304, -304, 292, -809, -657, 274, -384, 110, 275, 39, -726, 116, -20, 818, 684, -210, -5, 163, -247, -677, -660, -433, -661, -114, -449, 354, 80, 47, 886, 1197, -178, 323, 135, 599, -154, 432, 19, 23, -8, 175, -243, 507, 371, 341, -620, -448, -196, 575, 117, 648, 196, -231, -214, 367, 717, 204, -869, -15, -291, -945, -246, -607, 37, -728, -42, -557, -197, -559, 607, 189, 470, -39, -220, -908, 588, 963, -372, 677, -628]
6921f28K94j57J43j55Q9Q52k72P28n57M21J02p47M57L18r82L63K08p45K57L59
6941C48l3o68o6L82K06P9L88m84O01o72K22j86Q90r30Q74j19j120J445k091J582
6961F48p32N31o90N92j050J50r6P6J6M05k56J036r94K50N79o2k76M88q45M10J5
6982A95q67J013J64q0n64K72m44k6N84J76j162J284j76k79O44n06l70L58K79q45
7002c50J32L20m51R8k4K25k23N75m60k52k9Q38l5j184L76o9J230o90R6K06J99
7023E28o96K43l28q18L40O79N42l71J28n94n4L09m99K08j99M28J13J396j873O76
7043A58j45M36k74j81j61L8K0j32O23n41K28J98n91L27J52l00M97r02Q39r4L19
7064E14p88J148o77k27m4J15L96p02q12J149R4k14Q4J83n7P4K44k10o15J268K1
$$ y = [-628, -334, -491, -348, -503, -414, 438, 166, 894, 337, 758, 860, 113, 570, 888, -94, 269, 477, -268, -11, 348, 315, -353, -419, -37, 169, 248, 636, 152, 753, 81, 303, 117, 1007, 77, 951, 832, -288, 1157, -934, 648, -84, 447, -243, 349, -701, -551, -647, -571, -555, -150, -406, 630, -364, -114, 465, 403, 127, 615, -230, 180, 195, -672, 341, 505, 425, -139, 133, -311, -337, 247, 423, -739, 545, 369, 90, 734, 228, -142, 216, 495, -350, -218, 102, -349, -251, -275, -50, -273, 302, -158, -410, -439, 399, 364, -820, -444, -513, 717, 27, 123, 329, 528, -168, 75, -253, -1071, -731, -52, 490, 119, 247, -347, -401, -92, -591, -383, -582, -154, -41, 1355, -518, 158, 13, 449, 175, -6, -167, -129, -109, -241, 382, -159, 69, 267, -324, 3, 155, -145, 352, -550, 289, 195, 514, -274, 874, 197, -30, -74, 41, 437, -265, -1077, 72, 166, -48, 36, 219, 162, 236, 480, 270, -345, 923, 944]
7085I44j681J112o61j56O50k87m36R66p9k46L46q47K93j92K62j58M84k7j665J230
7105a48L69k37o05K45P42j30o42Q7K76m02M5O47m12K47L84n31J89j063J472P1
7125F04Mj515P32m21j98M09M56n53M94m41Q3P89m82l56M98M26M54j202J344j103
7145B2M50M46q22K51m32J69j35J3o2p09J50J380j135M69P47n40N5k51M02j160
7165f92K11Q68j505J271R93j382j3qL72j198o8Q37N09k69L17j033Q90o3L35l74
7185bP2K78k33O49k51Q27j901K01J19J79M33j058P55k50k87k72j72J566M45j161
7205f3p7N48p83l00Q82q93Q33M31K39n23r12O53p03N6L09O59r22N71J25q21J172
7226D81o37J50L76J29j080J771q70K21q81j85J290m51j327N01M54P5K67j366R36
$$ y = [944, -737, 375, -286, -442, 208, -79, -515, 451, 372, 126, 472, -375, -82, -274, -12, -170, 314, 287, -1378, -148, 221, -16, -621, -376, 366, 236, -406, -319, -43, -445, -400, 247, -165, 82, 466, -65, 124, -939, 533, 604, 608, -907, -175, -596, -794, -385, 71, -482, 12, -429, -346, 443, -39, -395, 103, 529, 983, -219, 1125, 22, 472, 918, 96, 347, -85, 84, -51, -38, -100, -809, -659, 721, -414, 55, 802, 262, 317, 66, 468, -692, -481, 387, -1118, 153, 1146, -236, -249, -257, 115, -1083, -1151, -314, 195, -74, 243, -790, 100, 37, 372, -2, 70, 348, 115, 764, 513, 1340, -561, -360, -241, -62, 371, -687, 68, -182, -469, -741, -913, 653, 1098, -63, -140, 408, -375, -675, 207, -686, 147, 578, 817, 294, -618, 35, -668, -612, -303, 356, -566, 5, 130, -691, 481, -156, -6, 370, 499, -581, 1190, 320, 541, -340, -525, 765, 314, -1013, -512, -58, 17, 284, -1082, -146]
7245a46J64J7J97J94r36R37o30L26k80J82o89m7K69Q69l9p28j31P60q18J214j824
7266a139J099J095o05l69p3M23p07o1O66k40J02K40q09p1J74K87J86nJ65N10m15
7287D53q25L26M69k92j36M92q05M16m89m12J013O48j127K27l15L46r01P50J78
7306A6O5K41j7l39M21o28K44P70k06j146M38O34o66k11L80j89L14n8m89Q33n53
7327a46O82l46k80o82P49P23p11n45P92K5j08o38j25L96n76J528n03q67J67M17
7347d8Q01l88m68K33M10K92p87n7M92p77O74k83j132L56J062r88oQ58k51o6M34
7368C61j83o52n38J475O68o26j63p44m86J038k01L68o35P01j289O40Q64n85r28
7387i15J235J93j14j86k06M07n7o78R88j232K53l23J73N27m40M99N74p45K20R82
$$ y = [-146, 18, 35, 232, 426, -510, 427, -203, 123, -157, 25, -664, -711, -442, 427, 388, -340, -471, 289, -529, 685, -1139, -40, 1055, 450, 81, 8, 431, -276, -337, 329, 89, 191, 431, -378, -449, -275, 12, 198, 193, 358, 868, 453, -372, -46, 423, 131, -5, 487, -318, 98, -391, -803, 210, 858, -269, -42, -357, -11, -912, -162, 16, 81, 322, 305, -34, 387, -241, 3, 773, 567, -579, -141, 493, -173, -384, -4, -193, 121, 63, -426, 407, -146, 536, 190, -90, -772, -23, 700, -11, -556, 236, 261, 153, -485, -610, -214, -790, 738, 235, -632, -465, -48, 753, 365, -103, 130, 540, 832, 45, -12, 480, -297, 377, 94, -1038, -682, 380, -608, -614, 244, -7, -73, 361, 178, -474, -1012, 463, 1131, 505, 342, -402, -888, 150, -51, 317, -318, 383, -906, -266, 598, 13, -915, 320, 513, 399, 213, 7, 414, 357, -321, 667, -565, -312, -635, -462, 65, -375, 124, 698, -47, 173, 1155]
7407A155j575j46N10K03l12M76n14k29J117o17O00k07l36p2N01j022k98L70Q28
7426D32r13K8J73r9M62j000J321j35m75O01o44J022k75Rn32P11m58o92K9P50m76
7447a61J75j86Q2J1L36J09l8M41j536P97p95P57K5P21p11p53R35l12j264J276
7467i1L29q06lQ61r22J181o15K55q71Q18m60M28k63QJ52K72l23q47Q55o74Q64
7488A48n55L11k62k00J092n26L71O6r22J153j209N94N00n28j44L39l77l05M12
7507d2J3L42j020O75O7N2k57K73m84Q99P3n55n7L66j86P6l95o70P61l03L20L29
7529B77p5n45J82L28L08l81P01m00L79l09m55K75L63o20K4M30o28n4J190q65p04
7550e79M00J69J35l78J536j535k93O08j07Q3n80N55p26N08R98q04K58k86J5l3
$$ y = [1155, -420, -566, -56, 147, -165, 311, -203, -432, 685, 68, 668, 461, 125, 53, 554, -468, -766, -396, 432, -481, -453, -280, -379, 83, -917, 404, 269, -206, 395, -249, 773, 498, 507, -25, 686, 228, -464, -435, 315, -161, 14, -172, -90, -79, 257, 366, 328, 769, -767, 30, -765, -8, 17, 738, 27, -726, 209, -103, -1367, -91, 238, -568, -571, 290, -632, 549, -66, 189, -682, 136, -324, 104, -159, -151, 1, 273, -50, -897, -42, -716, 148, -407, -96, -358, -558, 534, 8, 379, 445, -477, 676, -533, 61, 561, 33, -111, 228, -149, -454, -42, -29, 313, -707, -32, 35, 87, -170, 103, -381, 518, 591, 36, -21, 345, 159, 235, -160, -830, -69, -372, -52, 277, 202, -343, -161, 167, 475, 94, 795, 395, 774, 465, 10, 285, 648, 28, 52, 482, -146, -200, 990, 125, -579, -179, -10, 125, -253, 1283, -252, -545, 63, -44, 39, -541, 14, -712, -204, 794, -10, 248, -38, -23, -56]
7570e6O47p15K37K05N7J05M89j567L66L5m72J495j198M89j03J83q50M73l26J97
7590c09Q35p78J35K05P4q41O60M05L76o90m33o6J101n2p52j76R42q93O31l91J32
7611A15J18%j34o66J69N77l89K05j27n68L70K61K92k1M8K43m10o07mN41M38o96
7633b45L3J82N7r95M86R84Pk93j72m67j27K94R10l64Q5j63M00j95j493J392j71
7654A45J28L82q31L4K90q85Q26L07j025J34M12K09N5q75K66J024r58P61j062J51
7674e12K45M47o25m11L22J39N13n68L55l88J85R04m75n0P47j83l37n3n25Qm95
7695g57N96K37o92O60P24l70m65J70K1r00J128K34p20M81j135Q02L31P4o93J06
7715a68O06o80j42R57m70r34J589J08j139M74n86J148q55K8J49J23K98j34p19
$$ y = [-56, 591, -124, 113, 318, 375, 480, 969, -598, -232, -197, -669, 826, -372, 117, 14, 197, -653, -180, -506, -309, 526, -252, -117, 88, 162, -679, -19, 386, 762, 72, -361, -427, 674, 622, -130, -306, 636, -257, 374, -17, 115, 233, 233, 99, -567, -398, 179, -210, -5, -132, -700, -330, -69, 223, 202, 250, 493, 83, -524, -528, 13, 451, -245, -212, -30, 27, -968, -482, 502, 509, 216, 44, -423, -550, -256, 654, 290, 375, 212, 612, 417, -1076, 316, 145, 273, 655, -176, -142, 148, -737, 89, 396, -629, -495, -83, 126, 181, -694, -428, 596, -362, 399, -663, -512, -267, 180, -445, -856, -534, -395, 118, -450, -95, -483, -298, 606, 131, 81, 828, 645, 308, 255, -270, -262, -757, -161, 76, -616, 44, 768, 398, -67, 103, 124, -776, 352, 586, -134, 347, -788, 14, 345, 419, -274, -168, 438, -242, -384, 573, 103, -831, 758, 866, -273, 201, -385, 763, -92, -64, 85, 208, 506, 372, -347]
7734c47P37k21l62K02l57M5N99l28N91l50p8n39J150j74j189j52O98J63M25j6
7754D97j496N25n56R94j46L79p80o66R65Q83m17j31k31O43o17o80P67l27r7O14
7774A23k38M20m39M71m41m70O99p8l31m66R54M21k14k95R66j075M71q2j003n18
7794a125O81L58J53O17n98k92Q6L65m82O21j190P79M52j257R76m49M49l24J32
7813d8O30M08l43m97J37q14J81p23J131j01p37J163p79P3J026r51L59q21K72N02
7833F8O63n40L87p88N16Q8n73K80m13P09p41L93p15N52P90m4o36q3j9m10O96O36
7855H16j84p84L09l10m47Q47m1J46j72j55p61R57m2l60j37J272k58n15k1O6k09
7876A7k13k30M45m01K84k7o34K86L23K97j87L54O0j088M16n47J365m70O2J774
$$ y = [-347, 390, 169, -193, 9, -348, -303, 296, -32, 559, 209, 131, -408, 742, 568, -621, -773, -75, 88, 513, 497, -999, -474, -1030, -36, -182, 197, -583, -1249, -284, 599, 182, 51, -180, 463, -154, -834, -67, -394, -491, 123, -115, 305, -134, 337, -104, -574, 125, 47, -284, -750, 204, 625, 411, 116, 1082, 7, 478, 396, -607, -1125, -444, -86, 67, 684, 86, -206, -120, 245, -237, 384, -806, -27, 425, -832, 144, -305, 144, -180, -48, 582, 990, 647, 150, 287, -527, -346, -1069, 62, -39, -776, 387, -392, -319, 707, -244, 115, -706, -434, 68, 731, 191, 578, -210, 306, 394, -179, 101, -312, 397, -344, 49, -666, -114, 676, 632, -4, -87, -106, -516, 180, 816, 632, -152, 157, -153, -600, 247, 206, 352, 180, 25, -736, 221, 179, -181, -318, 954, 696, 181, 160, 226, 17, -196, -426, 19, -382, -98, -125, -759, -473, -150, 147, -40, 314, 374, -714, -298, -845, 520, 50, 112, 1886]
7896A886j568L74m52N54j579K87Q19q21P88O6j821J250P65r63M69M92p82J72R54
7915H90l30j054O63l68m6J82k73J16L60j54O86n61O00j165P36l59L41k79p82O93
7935a04j155J698r8j461J763p16R43j093M4Q85n72p01J094Jp41Q65j501J216J18
7954D85m2k39L49l99p78M64N76j063l44M25P50M04o21K3p18P06P4P33j138M66
7974A13o54J598j082M0l19P77L29o80J46l4m78j12M77n34O61O5J43p23n7J72L84
7995B32k31m80P29o59J271n00K50n51m88nL49k5n07J371j89j256J212j167O19
8014b5L33J64l91O04L5m97l81p22L62K70L16l23Q59j028J50p91J005m7j13J300
8034A080r33k23J84k13k14N41n26M10k22K18l43Q8o15M05J39L52J77j091MM13
$$ y = [1886, 318, 692, 240, 794, -785, -498, 321, -500, 288, 354, -1467, -217, 548, -415, 54, 546, -236, -64, 890, 560, -494, 169, -199, -245, -63, -336, -220, 140, -14, 672, 111, 711, -454, 282, -77, 264, -15, -797, -104, -1259, 439, 341, -1120, 643, -73, 870, -223, -179, 706, 134, -567, 527, 528, -213, 652, -849, 367, 485, 443, 204, 553, 154, -624, -160, 416, -647, -991, -566, 184, 588, -33, -10, -728, -22, 52, 785, -353, 113, -541, 1057, -25, 15, -304, 473, 802, 122, 268, 234, -244, -356, 121, -413, 248, 313, 456, -267, -324, -152, 232, 1, -479, 250, -409, 862, 362, 612, 61, -427, -432, -83, -108, -615, 756, 567, -689, 523, -644, -25, 308, 472, 81, 685, 720, 223, -158, -880, -518, -248, 68, -255, 604, -424, -274, -1065, -60, -107, -220, 1080, 147, -76, 108, -105, -319, 222, -304, 106, -116, 102, -241, -153, -768, -363, -224, 128, 305, -786, -782, -369]
8054c69R8O63j325J125j92J50p87P11q6Q50j256L33r5K70r58R63J27o44l9p8P30
8075A91j30J004k097K19k81N33J553j520Q10N33L09j389O35J82j450J9J320N0
8093D91j1n77m94J162j166O48k37K18M99n18O41p01p63J333o38k11j11k62J374
8112F77p26K70l77m56K50N23j62M00M06r25k61J251m20l33rj60o64m97J564p14
8132c63J07j74M30p03O53J06j63l57m9M60M47n84Q23p90M76m51r4j131J815j391
8152i33NR72k09J89l87M94j100P59J135k376K449n68j010R36m30R43o72l93n72
8171g68K76O22p9K01Q33j429L53j67m00N53j5J71L83k94M40r17J005n33l82M61
$$ y = [-369, -271, 392, -933, 192, 0, 150, -637, 74, -12, 838, -418, -85, -180, 90, -868, 95, 222, -422, -461, -539, 191, 61, 1065, -1032, -813, -1094, -561, 992, -528, 282, 815, 1124, -265, 370, 552, -898, -879, 441, 491, 480, -97, -591, 571, -595, 53, -184, 34, 533, 15, 656, -45, -808, 525, -113, -324, -435, -697, 677, -49, 221, -156, -612, -362, 161, -1, 399, 805, -120, -381, 870, 450, 117, 108, -52, -716, -1213, 351, -363, -256, -430, 0, -703, -50, 56, -107, -464, -513, -53, 394, -190, 633, -157, 319, -132, -226, -1357, 458, -933, -928, 44, -165, 24, -363, 131, -969, -210, 925, -1451, 998, 430, -580, 356, -74, 869, 197, -196, -768, -492, 130, 51, 252, 1085, -344, 9, -158, -558, -5, -20, 151, 534, 240, 680, -237, 768, 235, -147, 314]
8191C14
$$ Imaginary data points
##PAGE= N=2
##DATA TABLE= (X++(I..I)), XYDATA
0@%%%%%%%%%%%%%%%J08k16K16k16K16k20L28m32M40n48O51p59Q92j001J189j403
31g55J610j817K042k275K544k867L225l610M020m473M974n521O113o759P476q257
47d330R098j0028J1053j2172J3405j4772J6302j8015J9931k2098K4583k7470L0854
60A6341l4880L9793m5943N3869o4525P9726j03317J45005k40300Q76715m3749
71F78735j707584Q47615J069090o03723j031124N69544O92844k38467o72132K436
81c92766O29328L94155q60965n23294J129139N40873j323164m12749J416426K46013
91H42996j415379o0725J220417l9042j020740M8444O76702J48801n02414m14933
101e15873M40952O90873m84866r01065O66969J008441q24091r92373J016160Q46723
$$ y = [0, 0, 0, 0, 0, 0, 0, 0, 0, 0, 0, 0, 0, 0, 0, 0, 108, -108, 108, -108, 108, -112, 216, -216, 224, -324, 327, -432, 460, -541, 648, -755, 855, -962, 1080, -1195, 1349, -1518, 1707, -1903, 2117, -2356, 2618, -2903, 3210, -3549, 3927, -4330, 4768, -5260, 5793, -6379, 7026, -7746, 8556, -9459, 10472, -11626, 12957, -14513, 16341, -18539, 21254, -24689, 29180, -35345, 44381, -58936, 86069, -154231, 722484, 678735, -1028849, -181234, 887856, 284133, -746991, -177447, 515397, 276930, -395202, -392766, 236562, 630717, -230248, -753542, 375597, 916470, -406694, -819443, 596983, 842996, -572383, -633108, 587309, 548267, -472473, -424029, 252673, 401474, -100940, -515873, -74921, 615952, 131086, -769979, -103010, 905431, 81340, -911033, 105127, 951850]
111I51850j090166o05272R54378M41621p82831l61143M89876L87864k54293n46343
121d14459P3823P53289K6091j011819Q6230J171656k22561j180471L82077J113637
131G77493m97671r28354M77840P32458m05992n57004J72911M50185R1955n23172
141b09351k91699O40507M46726q23125m51319R98103L87654j074186k51323J099155
151D71142P1729r44713o71P40766P278n49121j25463L55921L20750l06699n24502
162d83583L09005P23448m24366q20047O08726P93697o98110o88349P69683N29864
172F19968p00947l89541N48207L07930l73310l07124J24532M21839O77n98254
182c46023n9188P64955L1293q93070J00750R27255j87285q81166L10846P57329
$$ y = [951850, -138316, -743588, 210790, 652411, -130420, -491563, -1687, 386177, 131884, -414459, -340636, 412653, 438744, -573075, -486845, 684811, 462250, -718221, -336144, 777493, 279822, -648532, -170692, 561766, 155774, -401230, -228319, 221866, 313821, -209351, -501050, 139457, 586183, -236942, -688261, 309842, 697496, -376690, -628013, 471142, 542871, -401842, -402513, 338253, 345531, -203590, -329053, 26868, 347618, 40919, -483583, -174578, 548870, 124504, -695543, -86817, 706880, 8770, -679579, 90104, 619968, -80979, -470520, 77687, 385617, 12307, -294817, -170285, 251554, 252231, -346023, -405211, 359744, 391037, -502033, -401283, 525972, 338687, -542479, -231633, 525696]
192E25696l32899n69630K36122M39327j08397l62599j04096L66894K60274m63193
202a12501l80957N77442M37777p33804l53767Q10343K60276p93551j34151P26264
212C03371N1946n53362o1793M02909J16020k57549k72363J67764M42127k13338
222A25732n76077K69933O61882l94053o46978M94268N79895n19017m59744N19008
232E4849L32235l81574k68506K36937K65054q9893l35423n1479M54642P7713n78663
243b84108q5717O85258O13p23753J09737O77770j54392n87625K04338M61124j38604
254A64641l41620L4059K77117R8009k66950k61388L33255L29912m33111l74399
264d40475N22429L41436o00990k44871N93462J74740n32704q6822M23692Q6482
$$ y = [525696, 192797, -376833, -140711, 298616, 190219, -172380, -276476, 90418, 350692, -112501, -493458, 83984, 521761, -212043, -565810, 244533, 504809, -288742, -422893, 303371, 355317, -198045, -259838, 143071, 259091, 1542, -270821, -103057, 339070, 125732, -450345, -180412, 481470, 87417, -559561, -65293, 514602, -4415, -464159, 54849, 387084, 5510, -262996, -26059, 238995, 149102, -186321, -237800, 216842, 294555, -284108, -369825, 315433, 316046, -407707, -297970, 379800, 225408, -362217, -157879, 303245, 164641, -176979, -142920, 134197, 232206, -34744, -296132, 37123, 367035, -66076, -440475, 81954, 423390, -177600, -422471, 170991, 345731, -186973, -273795, 149897, 236379]
274B36379k78279j43508J88426K28307j15506l68931J14814M61692j80982n28719
284c86307K41624N34958l33389m65758L53711L95072l29943k97254K73481K35355
294B21550j33991k33701L6179K68309O6743l60399j19048M48661R2260n20429
304b33866o9972N58356k1879n25973P2056M58251q2216l61454P1880K69574L2839
315A67596k16039j17563K04896K23556k37758l12318L11085L12070l76900l13782
325c55157M20647K43786m27937j77473L75151J44097l01617j08858K03573J61392
335A77604j17096k17976P8009K96737n6314l90189R6139M15261j46519m35543
345b99887J88046L91606k28084l21059J93432K75671j54842k08983P5210K06258
$$ y = [236379, -41900, -185408, 3018, 231325, 115819, -253112, -138298, 323394, 142412, -386307, -144683, 390275, 56886, -408872, -55161, 339911, 9968, -287286, -13805, 221550, 87559, -146142, -109963, 158346, 225089, -135310, -254358, 194303, 286563, -233866, -303838, 254518, 232639, -293334, -221278, 236973, 154757, -206697, -134817, 134757, 167596, -48443, -166006, 38890, 262446, 24688, -287630, 23455, 335525, -41375, -355157, 65490, 309276, -118661, -296134, 79017, 223114, -78503, -187361, 16212, 177604, 60508, -157468, -79459, 217278, 160964, -229225, -133086, 282175, 135656, -299887, -111841, 279765, 51681, -269378, -75946, 199725, 44883, -164100, -88890, 117368]
355A17368K6473k31061p8715K78671J33258l54956j23478L92932Q7886m18612
365a70234n9947M03398l333l45820L15K83771J6864k12162o1627J72234J50780
376A74239j61764j95789J71381K68160k16480k88575K61678K59631k86555k44937
386b59011K86316J81699k52580j64043K00222J51576j37080j50456O6275K19395
396A42313l2646k55521K5589L12248l3685l45572O8655L33685q9656l35036J09637
407i9989K75605j06770k31801N6346K04895j3349j76960n3078K08014J01604k22902
418e8385j21844K62840J44532l03143j11809L00654R0658k98567p4515K54361
428H4782N4186k11932q4269J74415R8965j27229j50218J22121K06099j24101k23829
$$ y = [117368, 143841, -87220, -165935, 112736, 245994, -108962, -232440, 160492, 248378, -170234, -230181, 173217, 169884, -175936, -175621, 108150, 125014, -87148, -148775, 23459, 174239, 12475, -183314, -11933, 256227, 39747, -248828, 12850, 272481, -14074, -259011, 27305, 209004, -43576, -207619, -7397, 144179, 7099, -143357, -77082, 142313, 109667, -145854, -120265, 191983, 158298, -187274, -118619, 215066, 125410, -209626, -99989, 175616, 68846, -162955, -106609, 98286, 84937, -92023, -145101, 62913, 164517, -58385, -180229, 82611, 227143, -76000, -187809, 112845, 203503, -95064, -169579, 84782, 138968, -72964, -157233, 17182, 116147, -11082, -161300, -39179, 166920, 42819, -181010]
439a81010J46038K56289j71212k38030J76208K20852j80495k06952J61666J60026
449A43380j18656j72002P6777J70814l3424j93185O335K36979K029k42323o526
460a29802K83098q710k74694K7799K54583k8622k37990K1164J91117O964j87130
471h2223m2511J67785P0562j63195j16325J92654J32941j98155j36064K25052
481E0521J34521k18670j14391K03148J17677j99948j05728J56354J05096j30868
491b288j38907J05393J53769r0659j87438J00252K00105q8957k05138R9500K25682
502A71314j10701j95036J00074J86158q7366j73887N1201J66451l0162j84677
512a06631J1147J71206K1965j97846l1755K18286L3746k16383k7657K27392K3482
$$ y = [-181010, -34972, 221317, 50105, -187925, -11717, 209135, 28640, -178312, -16646, 143380, 24724, -147278, -70501, 100313, 66889, -126296, -119961, 117018, 119047, -123276, -129802, 153296, 144586, -130108, -102309, 152274, 123652, -114338, -93174, 97943, 104907, -82223, -124734, 43051, 113613, -49582, -165907, 26747, 159688, -38467, -174531, 50521, 185042, -33628, -148019, 55129, 172806, -27142, -132870, 23484, 128580, -2288, -141195, -35802, 117967, 27308, -160130, -59878, 140227, 51270, -153868, -54368, 171314, 60613, -134423, -34349, 151809, 64443, -109444, -58243, 108208, 78046, -106631, -95484, 75722, 97687, -100159, -131914, 86372, 120118, -96265, -123922, 103470, 126952]
523A26952k00976l3144J98934L6962j86306m3753J51715P0523j58634r5501J44629
534A1401J11326j54343j26851J60798J27844j44622j37871J64866J33892j44298
544B142j22443J30891J28935j13942j32930Q3873J47629q7643j58038O1821J63875
555A04170n2820j89762O1510J87280n0505j86599O0134J85214m1451j69880K7902
566f4807J79086k5120j63659k936J60427J5629j73825l3815J66844M2310j82847
577h2713m1757J71145N6629j70334n5491J76029N8208j47586o8227J50374P7503
588A23780j34134r3196J27214J02281j31959j12572J08990J25562j22983j31022
598a38039J15545J31849j04382j34946J08936J34694q0409j39738Q4347J43184
$$ y = [126952, -74024, -107168, 91766, 128728, -57578, -101331, 50384, 120907, -37727, -133228, 11401, 122727, -31616, -158467, 2331, 130175, -14447, -152318, 12548, 146440, 2142, -120301, 10590, 139525, 25583, -107347, -23474, 124155, 36512, -121526, -59705, 104170, 51350, -138412, -76902, 110378, 59873, -126726, -66592, 118622, 77171, -92709, -64807, 114279, 89159, -74500, -77436, 82991, 98620, -75205, -109020, 57824, 100134, -82713, -124470, 46675, 103304, -67030, -122521, 53508, 111716, -35870, -104097, 46277, 123780, -10354, -103550, 23664, 125945, -6014, -118586, -9596, 115966, -7017, -138039, -22494, 109355, 4973, -129973, -21037, 113657, 33248, -106490, -22143, 121041]
608A21041o8425j41005M8488J52216n2107j57234L0673J60182l7126j63463K6461
619h0299J55559q101j64200J5597J57877N543j50333r561J55812K2839j45547
630d4814m1202J53633L6380j47773n4231J38176O0642j50926o3444J35188P4699
641I6328j35742p2491J28342Q7777j14439r4062J23757R5190j01793j07630J01720
652F957J09557r7872j19776Q2198J22101r0152j22831O9146J29734o4453j33076
663a08467O4178J32361m3134j34741M7545J36856k7098j40518K3487J42234k2246
674G0457j38362j245J41304m383j44473r000J38874J6066j40716j7498J33578
685D4602L9600j34109l2889J32337M8036j23979n5162J27997N4074j18805p2579
$$ y = [121041, 52616, -88389, -39901, 112315, 60208, -97026, -66353, 93829, 56703, -106760, -80299, 75260, 67159, -97041, -81444, 76433, 81976, -68357, -77918, 77894, 100733, -44814, -86016, 67617, 103997, -43776, -98007, 40169, 100811, -50115, -113559, 21629, 96328, -39414, -111905, 16437, 104214, -10225, -104287, 19470, 114660, 12867, -94763, 6957, 116514, 18642, -101134, -18936, 103165, 13013, -109818, -40672, 89062, 24609, -108467, -44289, 88072, 44938, -89803, -42258, 94598, 67500, -73018, -49531, 92703, 70457, -67905, -69150, 72154, 67771, -76702, -85702, 53172, 69238, -71478, -88976, 44602, 84202, -49907, -82796, 49541, 97577, -26402, -81564, 46433, 100507, -18298, -90877]
696i0877J15062O8246j13760p9821R9910Q7132j05798q3433R3567R9413q6707
707B934r7129Q8522J03413p0535j11186P6476J06689o2607j17375N2569J16921
718H8692n6845j18974L6158J23830m0388j20161K8122J24603j6438j24163K1968
729e3596J23087o87j24603L347J22892O903j23664j8599J21130J4223j17844l5536
741h2947J18311L1172j16587l8463J10666N2859j10003m5260J03857O4747r9809
752a1457o2957J00312O7628r1976q1440R2857P0898q2993q6646P3970Q5289p4641
764a156q7665O2572J00401o3969r0370N5555J04724m5863j03065M7247J03361
775H1772l5202j11215L4654J02302k8604j09497J4650J08795k0026j04464J876
$$ y = [-90877, 24185, 92431, -21329, -101150, -1240, 85892, -19906, -103339, -9772, 89641, 2934, -94195, -5673, 97740, 27205, -83981, -7505, 99184, 36577, -80798, -28229, 88692, 31847, -87127, -50969, 72861, 32473, -87688, -59566, 65037, 48599, -75564, -53596, 69491, 68804, -55799, -52452, 70440, 77343, -46321, -64920, 56210, 70433, -47411, -82947, 35364, 66536, -50051, -88514, 22152, 75011, -34992, -80252, 23605, 88352, -11457, -74414, 25898, 93526, 1550, -79890, 12967, 83865, 872, -85774, -11804, 73485, -1156, -88821, -26249, 74152, 10183, -80187, -24632, 80092, 34229, -68836, -21589, 81772, 46570, -64645, -29991, 72311, 43707, -65790, -51140, 57655, 37629, -66835, -64959]
786f4959J11338N94j04014m409J08039K0652j07803j4037J03334K8984j05799
797b8080l0579J00516K9097r7571m7011R4981L8152q7664n4344Q7654N8547q3802
809b0104n6524P7486P6406p8580o5226P4322P6919p0525p7578O6561P2256n7200
821A8213q8484N4623P7530m8867q5749L7817R1238l7058q7276K8794J01200k6344
833C5637r2366K6550R4573j3353r7715J5929Q8601o220r5034k045Q7850K462r0090
846d5221j9468R4692J3849q4968k4241R1825L2685q8478k5685Q7397L8449q6151
858a5315l3416P5210M2475p7533n0753P0840M3265o2215o3686O4870O0094n9190
870e354o4776O0762P2057n7490o2728N0196P6839m9961o9420M4015O7628l4604
$$ y = [-64959, 46379, 46973, -57041, -61450, 46589, 67241, -40562, -54599, 48735, 77719, -28080, -58659, 41857, 70954, -26617, -73628, 21353, 59505, -28159, -82503, 5151, 63698, -20104, -76628, 858, 77264, -1316, -66542, 7780, 84699, 14174, -63404, 3157, 75413, 18213, -70271, -15648, 61882, 13015, -72734, -34917, 56321, 19263, -68013, -39219, 61981, 35637, -56729, -30179, 64394, 51041, -46674, -30745, 57856, 51636, -43398, -45443, 42407, 44869, -45221, -64689, 30003, 43852, -41116, -65357, 26468, 59153, -29325, -55010, 32387, 70836, -15315, -48731, 26479, 68954, -8579, -59332, 11508, 54773, -7442, -71128, -6258, 53836, -5354, -70130, -9368, 62689, 5199, -57529, -7333, 69506, 19545, -49875, -5860, 61768, 27164]
882B7164p7391K9711O8927k0961q4944J7932Q1423j6482q0975R023R0838j0238
894C4027p9137O988Q5993j579p9085O66P2730J3026q2445j3000O9093J8841p4004
907b7886l1495P5200K7987p2395l6220P9303L3398o5469l4803O9106M3420o5221
919e075l4894N3138M6627n4421n1180M2924N3994m5562o6511M6527N7773l8800
931D540o8457M2589O8784l8483o0565L4849O9567l1112n7344J9154O7158j7957
943C2723o7921J1475O2938n263p7301L380O9822p3p7254J700P3914P61o2465p711
957d1275P2182Q820n8055j2432N9238K1761n7995k8226N2224L4720o5244l5927
969e0209N5629L4969n7457m2423O1852L5939m9323l9168N3586M1421l9018m1576
$$ y = [27164, -50227, -20516, 48411, 27450, -57494, -39562, 41861, 25379, -55596, -46573, 44265, 34027, -45110, -38122, 47871, 46292, -32793, -32127, 40603, 53629, -28816, -41816, 27277, 46118, -27886, -59381, 15819, 43806, -28589, -64809, 14494, 47892, -17577, -52380, 16726, 60146, -5075, -39969, 13169, 59796, 5375, -45805, -2881, 51113, 5551, -60960, -14433, 43340, 4540, -63917, -21328, 47456, 8973, -51592, -16743, 52824, 21712, -35632, -16478, 50680, 32723, -35198, -23723, 39215, 33952, -43349, -39969, 29853, 29780, -47474, -45774, 28140, 28901, -33564, -41275, 30907, 39727, -18328, -30760, 28478, 50239, -7756, -35982, 16242, 50962, -14282, -50209, 5420, 40389, -17068, -59491, 2361, 38300, -11023, -50191, 3395, 44816, 5798, -35778]
981c5778L5368N3714l8277n0403K7648N4711l1672o1868K7942N7232k7309o4326
993e3018L0330N5079j9426n4716J9045N8842j3116m8487L187O0483j535n6286
1005a9618p045O0442O444o7429o937N6195J1382o6256q895N7911J2505n2962j5033
1018c9296N5399J9641m2380k8011N1298L0341m5737l3424M2010L8498n1419l6774
1030c9854M0514L8295m8421l7376M1135L5436l0999m2590L6803M1045k1609m2687
1042c0308K2502N0169k0107m9541J3376N7959k3078n3108J3409N0144j5792n6392
1054d0767J4145M8072m775n1156O697M8099O290m6470o769N4528Q005m7050j5172
1067b6323N3619J1696n3804j6275M7111J4979n3067j4138L8919K2516m1680k2049
$$ y = [-35778, -410, 53304, 15027, -35376, -7728, 46983, 15311, -46557, -18615, 38617, 11308, -53018, -22688, 32391, 12965, -41751, -22706, 36136, 23020, -25467, -22280, 38203, 36668, -19618, -26663, 33779, 40223, -27206, -34143, 22052, 33434, -32822, -41717, 16194, 28699, -24263, -39296, 16103, 35744, -6636, -34647, 16651, 46992, 1255, -32169, 9841, 48339, -3080, -39854, 660, 38955, -9466, -46842, -5707, 29729, -1270, -43860, -7057, 33988, 12379, -30308, -7806, 42363, 22256, -27285, -13909, 44050, 20972, -32136, -18727, 31417, 15625, -40767, -26622, 21450, 16675, -34481, -27784, 20315, 26605, -19865, -26634, 27894, 35899, -11151, -26323, 27296, 38992, -14812, -31087, 16024, 31003, -22064, -36202, 2717, 25233, -16447, -38496]
1079c8496M0828K7445l2098l0746L9829L2364l0619l8763L6017L6952l6268l7216
1091c0771K6380L8402l3733l7178K3232L7466k1025l9622J9293M0890q479m4925
1103c0070J5881M6245q197m5540P317N0145j0968m5611R18M5975o787m4576j795
1116b7063L8064P529m5644l077L8440J6395m1686j1742M5116J6315l8204k0064
1128b5621M4732J6331l8875k2192L6187J9884l9251k2692K7957K7993l3437k5908
1140c4892K6307L4502k5495l2564L0286L4053k0424l6758K6203L4710k0943l7617
1152b2632J7438L5046k1076l5066Q089L8317j2834l7282P384L8474j495m0804
1164b6441P894L9715L218m1269K044M0933O26l7808p783L9544K076l7115j3103
$$ y = [-38496, 2332, 29777, -2321, -33067, 6762, 39126, 8507, -30256, 5761, 42713, 6445, -30771, -4391, 34011, 278, -36900, -13668, 23798, 2773, -36849, -17556, 23334, 14855, -30070, -14189, 32056, 23859, -21681, -14364, 35781, 24813, -20798, -19880, 26095, 19308, -25268, -27063, 11001, 18530, -27114, -30191, 8249, 24644, -17042, -28784, 16332, 32647, -5557, -25621, 19111, 35442, -3433, -25625, 10562, 30446, -8805, -31497, -3540, 24453, -8984, -34892, -8585, 25917, 422, -32142, -1856, 32197, 11773, -24985, 1218, 35928, 14985, -22632, -5194, 29852, 8776, -26290, -18201, 20116, 7282, -30000, -22616, 15858, 14363, -26441, -18547, 21168, 24386, -16883, -14839, 26094, 26720, -11088, -18871, 20673, 22749, -14366, -27469]
1177b7469L5189J1517l6925j2559L2265J9635l4725j4064L3355K2507l0295k1407
1189b2976L4340K0468k6695k6591K8106K1337k6323k8217K0036K8951k5344k6938
1201b9846J7721L2538j9746k9138J8273L4267j1715l3128J7236L1526q153l5793
1213a5958Q762L2530r067l4662K97L5465o506l3491k116L6035J775l3752j180
1226b1868L4082R913l4163l985L3174J1571l2072j3024L1901Q915k9478j9614
1238b4648L0524J3055k8422j9180K5698K1926k8566j6767K4196K5766k4416j8492
1250a9326K1599K5210j6957k8772K1247K2026j5673l0021J4979K5799j7055k8175
1262b5119R834L1252j2713k7225Q673L2731o139k8933P866K9633M33l1907L567
$$ y = [-27469, 7720, 19237, -17688, -30247, 2018, 21653, -13072, -27136, 6219, 28726, -1569, -22976, 11364, 31832, 5137, -21454, 6652, 27989, 1666, -26551, -6515, 22436, -2908, -29846, -12125, 20413, 667, -28471, -10198, 24069, 12354, -20774, -3538, 27988, 19835, -15958, -7196, 25334, 16267, -18395, -18098, 17367, 10861, -22630, -24746, 11289, 13064, -20688, -21868, 12214, 22127, -12036, -16021, 17153, 28724, -3348, -16372, 15529, 24444, -5034, -24648, 5876, 18931, -9491, -28671, -2973, 18953, -9613, -26380, -2184, 23582, -834, -19326, 2273, 27483, 10526, -18246, 3001, 25027, 9354, -20667, -5688, 20111, 3056, -25119, -15285, 15967, 3254, -23971, -15298, 17433, 11294, -17639, -9773, 19860, 20293, -11614, -8047]
1275h047K8263Q07l2600m778L0497r0k8945r075L1437L905k7684q149L0039J2970
1289A8550k6970q025K5629J6562k7255j1955K3053J5106k3228k0993K2282J5236
1301A7992k1118k3783K1850J8945j8744k0077J7088K5655j6761j9961J4732K6935
1313B2753j2272k4235J2438K4707r449k8445R634K2121q395k8732L779K7218n083
1326F039k6128R30L0564k115k4144Q27K8697M604k6833j041K3534P516k9335o607
1340a3492K3673P191k6339j2640K5792O309k1746j3522K5357J1965j8919j2090
1352a8461K0962J8641j9697j3799J6093K0970j8819k0675J6410J7754j5132k5436
1364b1189J5144J9108j3203k4019J3657K1424q932j7816O967K6017o652k0176
$$ y = [-8047, 20216, 21023, -11577, -16355, 14142, 14052, -14893, -23968, 7469, 11374, -16310, -24459, 5580, 18550, -8420, -16445, 9184, 25746, -1509, -13464, 9589, 24695, 1467, -19526, 2756, 17992, -3126, -26909, -5059, 13886, -4858, -24935, -7847, 17808, 1047, -18914, -4182, 22753, 10481, -13754, -1316, 23391, 13942, -14503, -4869, 17252, 8857, -19875, -16096, 11122, 6039, -20089, -19159, 11405, 9290, -14854, -14027, 14670, 19274, -7559, -8600, 14934, 22450, -6885, -13492, 10181, 17372, -8967, -21607, 4185, 10494, -11252, -24774, 583, 12548, -6371, -18461, 2501, 21142, 1445, -12354, 3739, 24709, 5890, -14785, 1625, 19379, 4247, -21189, -6045, 13063, -140, -24159, -10502, 10922, 1990, -15826, -8859, 17158, 10506, -9670]
1376i670M406K4046l019k5092K016K3276k278k8745K379K1645j079k4550k047
1389a8712K4501J880j7882o513K5904O835j8886q105K0867J3630k4846r186J8319
1402G806J1119k3975j2900K0188J0212j9882j2670J8415R519j0442j4475J4322
1414b763J8720j0843j6558J0699K2739j2754k1082J1494K1047j4440k3170J2785
1426d126J4544q711j9933Q487J5091k029j8232K513K2318J323j9416k532K7668
1439A6965L38k4134n39K2692j087k4224R84J5864J076k0073k249J4371O065j2158
1453f109j1266J8788J1106j3080j3786K0598J5834k0607j2480J8012J3484k2498
1465b004r150J2376Q832j2843j2293Q683J1200l658j7667P269K0133l203k0712
$$ y = [-9670, -5264, 18782, 15763, -9329, -7313, 15963, 13685, -15060, -12681, 8964, 7885, -16665, -18712, 5789, 7669, -10213, -16726, 9178, 16013, -2873, -10978, 9889, 23519, -1327, -10513, 7806, 18925, -5050, -17950, 2238, 12450, -7432, -20102, -1687, 7832, -2610, -17085, -2763, 15957, 5114, -11444, -745, 21994, 9240, -11842, -348, 20699, 6259, -16911, -4126, 10418, 1707, -18226, -9739, 5352, 3323, -14909, -12396, 9922, 11245, -8171, -10703, 16965, 17303, -6831, -7370, 15322, 14235, -9989, -9005, 6859, 7935, -12138, -14387, -16, 6049, -6109, -17375, 1413, 12519, -561, -14347, 6251, 22085, 1478, -11002, 7010, 20494, -2004, -11154, 1222, 10054, -2789, -15082, -6399, 4801, 1143, -16524, -9255, 10878, 7675, -13037]
1478a3037P804K6311j1536j9119R216K0013j3365j6162P183J0960m635j4798Q95
1491a0270J0635O019j7028n608K1265O618j9758m701K5286K512k0792p53K2492
1504A5917k783j7624J23Q963L737j2305p758N619J3037j0852j4737J4727J6089
1517A2153j2271j8278K2916J3262j6841j0525J8098Q079j6843m336M969P828o444
1530A767j0571j860J5049O62k1064L237K1490j647k2977R424K3707j0008j6419
1543i210R633J5832j1120p069l59O684J948j0009p816R078J2641j9706r096K0219
1557A650J0977k3443k981K5146j49j6937J825J6063l391p757k476L476M952l946
1571C009j3969J663K0062j2044j8687J3219K0053j6705j5389K1780J0467j3364
$$ y = [-13037, -5233, 21078, 9542, -9577, -361, 19652, 6287, -9875, -2692, 8268, 3633, -11165, -10270, 365, 6384, -10644, -16252, 5013, 11631, -8127, -12828, 12458, 14970, -5822, -6575, 15917, 13134, -4490, -4367, 4596, 8333, -3972, -11730, -6111, 6926, -3926, -18663, -3936, 12153, -118, -18396, 4520, 17782, 941, -9584, 8514, 16593, -250, -4586, 383, 8211, 1767, -8804, -10664, 4385, 5047, -16017, -12780, 8710, 7063, -15914, -6490, 17217, 7209, -9210, 423, 16255, 5135, -1934, -2293, 4391, 6339, -3670, -11486, -2408, 10233, -9473, -18569, 1650, 12627, -10816, -13797, 11349, 11200, -5737, -3912, 12151, 8760, 1003, -1473, 2003, 6955, 3009, -10960, -9297, 10765, -1279, -19966, -6747, 13306, -3399, -18788, 2992, 13459, 95]
1583I5o661J4199K695n995l211l735Q646L213j4018q544K0136K281k6340K949
1597a4290K4185o249k1416J4063J5690q707r393Q706O259k869j358p735N048R384
1611A1318q493j7013J3762J3602k3178r698K2046Q422k5045K873J9449k215j0925
1624e095M579P205j495K300p418j712J1177o4k1320K964K3097j4308k0180J4768
1638e502J8674k1181q107J8879L019q228qO917j086N962n757r625J1605R740j9388
1653d086j0518K4793p74k5872M149K3090j1274j6330J4536P519n708k279M401
1666A647q43P348O47j5053O448J5518j1236k0601J8868J1272k3801p037K2854
1679F031k24j9959P888R739m092j608L467k979O397P973j4351l774J8755K28k7699
$$ y = [95, -6566, 7633, 10328, 4333, 1122, -2613, 6033, 9246, -4772, -13316, 6820, 9101, -17239, -14290, 9895, 3646, -17770, -3707, 11983, 3276, -6117, 2589, 8848, 5979, 4621, -3114, 1934, 11318, 2825, -14188, -426, 13176, -10002, -19700, 2346, 10768, -14277, -11404, 8045, 5830, -5095, -516, 6689, 5194, 7494, 76, -1636, 9541, 9477, -11843, -8879, 14218, -90, -20270, -5502, 13172, -8009, -16116, 2763, 5782, -2446, -2454, 4463, 3377, 9339, 3582, -6043, 5562, 15302, -4086, -14604, 10189, 9415, -16457, -12308, 10782, -492, -16822, -2286, 5233, -475, -2754, 1647, 804, 8152, 8799, -6254, 194, 15712, 4476, -16125, 2743, 14015, -9786, -16823, 6031, 5807, -14152, -6264, 3475, -617, -2225, 1242, -1737, 4660, 12633, -1718, -5492, 13263, 13491, -14208]
1694a4208R494K1914j9206j5952J7174R411j8912P01J1062l018j110M347m711
1707c014J926J5755j1667j3029J7598J1415k6644l207K4297m585k3744Q287J5963
1720I351j4194n798R051o13p97O508n465n135J8689k014j9002R830J9551j6878
1734C084j8110K3633L754k2480J56J6677q064r031Q120j387p20N997q01j1059
1748a0231J5895R092k1229l75K3575n752k4636J4717J4134j8066r409J5627Mj3649
1762a0303Q428j458k974P518K408j2971O838J8936j6955j0654K1017Q190k6920
1775h900K875K1518j1797j4826J0500M735j1328L939J787p382O813Q922j5301
1788h445j569K4190q043j9806J5517J7973k0768r106K1057k239j5639L944Q536
$$ y = [-14208, -4714, 17200, -2006, -17958, -784, 8627, -10285, -9584, 1478, -1540, -2650, 1697, -3014, -1088, 14667, 3000, -10029, 7569, 18984, -7660, -10867, 13430, 8845, -14899, -6612, 9351, -4843, -10641, -1590, -2203, -3000, 3508, -1957, -7092, 11597, 9583, -9419, 411, 19962, 3084, -15026, 8607, 12361, -10119, -9963, 6714, -1350, -10381, -2261, -3648, -4368, 1629, 828, -10231, 5664, 14756, -6473, -6848, 16727, 10975, -13661, 1056, 15190, -2876, -12285, 3342, 3346, -10303, -1875, -3333, -6307, 1211, 3619, -9352, -2514, 16422, -533, -11187, 9830, 18020, -8900, -6025, 15493, 3696, -11130, -630, 4105, -7223, -3284, -1497, -8879, -2066, 6856, -8445, -10014, 14176, 6133, -13673, 1844, 19817, -951, -10057, 11000, 8761, -6878, -2934, 5602]
1801E602j0601R48N069r772K791J2673r898j1162K2626M467k2199N074K2217j1132
1815F703j8413J8795M962j5558p95Q935p721j583P216j0051j845J4481l106j7786
1829a5766J6281J5424k1435m737K4009p27k2289R696J1636j0996n532Q208m543
1842g71m661R614r267p712J5278M297k1183O203K3309j4360j3298J8288J0845
1855A6582k1499P73J5056o461p397O132k173p154J0183m528j2072R922J1500j7422
1869h558n863K4283k280j9343R136J8185j4362p942J5420j769q223L744J170r976
1883f378P349L829j6178L341J6919j0973j5373K1039P066j9089M53J9982o539
1896E448j1638J1201K525p313J978L091j0824O042P986j6036m408J7760j742k0762
$$ y = [5602, -4999, -4051, 1018, -8754, -5963, 6710, -3188, -14350, 8276, 12743, -9456, -4382, 17835, 6703, -11710, 7085, 12047, -3511, -4306, 4629, -3092, -4675, 2541, -7510, -9355, 5126, 2020, -15766, 515, 15939, -5496, -10233, 13776, 13049, -9240, 456, 12092, 1096, -4436, 3772, -771, -5432, 4182, -5085, -12797, 2481, 6778, -14405, -8202, 15107, 747, -12551, 5737, 16582, -4917, -4144, 10912, 4451, -2946, 3186, 1013, -6141, 4042, -486, -12558, -2636, 8864, -8558, -14421, 9862, 7582, -11761, -2625, 15560, 1198, -6744, 8676, 6907, -1316, 2428, 3598, -6378, 971, 4800, -11378, -8037, 8882, -2091, -17464, 3575, 10641, -8448, -7995, 11987, 5448, -6190, 5011, 7536, 223, 2201, 5292, -5532, 510, 8496, -7540, -11948, 5812, 4070, -16692]
1910a6692J1696J6811j4759q324J7768K512j4415Q251M933o228K14M284q459k524
1924d932J4351j1385j1813J5243P297k1178J551K0591p653j3591J1545J0293j2690
1937b371K117P155n549l11O906p935n569J3365m764j5308Q883J2894j4975r623
1951a5085K0156J11j4496M327J3530q272k045Q078m191j346O746l546j1628J3162
1965E501K979j7394L93J6939q235j6086J4770P343j2735j124J3863m852l936Q177
1979E603k697l948P617M28j2944O775J1238j5550p336J6090M92j8789N971J3207
1993F157r180m931R337J376n833P196j483m481O732M757j3034k9J4762r827j3047
2008a1528J0556R869j7002k230J3632k867q406O427M562o613N578K491p014M707
$$ y = [-16692, -4996, 11815, -2944, -11268, 6500, 9012, -5403, 2848, 7781, 1553, 1767, 6051, -2408, -4932, 9419, -1966, -13779, 1464, 8761, -12417, -10866, 9725, 2072, -11519, 26, 10319, -2371, -254, 6901, 1352, 1041, 7947, 12, -5557, 7808, 3044, -12264, -3381, 9513, -5462, -15085, 5071, 5182, -9314, -4987, 8543, 271, -1774, 6304, 2113, 767, 7513, 3967, -7661, 5501, 8480, -8914, -8521, 8418, 183, -15903, -1133, 6210, -6525, -7649, 6214, 1362, -2574, 5603, 2906, -1042, 6575, 7003, -5941, 834, 12072, -3478, -10814, 5276, 5768, -13021, -7050, 6157, -3023, -7954, 1383, 2759, -3074, 4122, 2639, -1842, 4890, 9647, -3387, -3416, 11346, 1519, -11528, -972, 8897, -8105, -10335, 3297, 430, -7976, -1549, 3013, -3600, 1978, 4469, -2545, 2162]
2022B162O739q160p421J5588k064j5154L951J2967j0797q944J1861N21p075K454
2036c372N182m813K222O182p969K609R994m570j2183J1813N010j4064k021J2585
2050F605k627j3834P596M338n837j885O290m066P49P502o101r40Q709J781j3141
2065d861N421J1010j0748p987J0212K250j2727L105N707m003k476M626j848j436
2079c755Q677l831m771P443O203j1803j360J3534n592j0672O245O529j0304k449
2093e906O200k447k330L370r16l092P955m83o619M512Q680p061p219J2775Q19
2108H238j1123J169Q243o638n085L761m23j709J033O22m876O439L595p451J804
2123b401Q800j226j0482P998O576q546k927O387p75o721K028N04k271P46J588
$$ y = [2162, 8901, 741, -6680, 8908, 6844, -8310, -4359, 8608, -2189, -11133, 728, 1249, -5826, -3372, 1810, -3003, -781, 5401, -2568, 41, 10035, 5465, -6718, 5095, 10105, -3959, -5980, 6605, 3978, -9856, -2260, 2078, -3759, -5644, 646, -3420, -2671, 4831, -1270, -2210, 6499, 8280, -4861, 560, 11570, 822, -7165, 3047, 5297, -7430, -4325, 1382, -2621, -5097, -471, -2319, -3755, 4922, 1091, -3680, 3763, 9966, -1837, -3197, 10337, 4745, -5927, 318, 6847, -3457, -5906, 294, -2153, -4483, -1113, -2029, -5121, 2834, 2351, -4268, 244, 8924, 1863, -5356, 7419, 8238, -2885, -1716, 6527, -111, -5196, -1435, -1858, -3567, -2534, -1912, -6788, -349, 3246, -4205, -2401, 6399, 5173, -5309, 2689, 9265, 719, -2208, 4179, 3404, -3317, -1289, -785, -3056, -2310, -722]
2138g22m882L306O052p029p65Q023K678r842K992Q257m671o010N310K312o323
2153a314m6M85j663O85J737l893l34P317l577m625O127O740p987k768R091m08
2169E567o685J669M233l960j037j31k074k21K687m083k788Q831j639n667K493
2184b805Q699m288n394P512K055l649l085M908k217j939J060l454K63J928j726
2199b132m908O117L305p078l32Q062J548q068M788L267o55m060K528Q33k819J441
2215A837l687K42J038K66o759L645N317m486l636N893M743n668P57N237p81k936
2231A022L75J627k052J210l229j108K360M28n645k12O438k653m198K456O406l663
2247d38j437L566K377j857j786K132q05J095j887k618J902J602m231l640N543
$$ y = [-722, -5604, -2298, 3754, -3275, -4040, 3983, 6661, -3181, -189, 8068, 3397, -2613, 2697, 5009, -1314, -1360, -875, -2538, -1853, -116, -4009, -4343, 2974, -603, -5228, 899, 7639, -348, -3116, 5975, 5567, -1118, 551, 4784, 824, -213, -344, -2418, -2639, 48, -4035, -6823, 2008, 369, -5298, -2805, 5894, 1606, -3788, 3724, 5779, 2130, -955, 3953, 1736, -203, 857, -2597, -2334, -406, -2132, -7040, -923, 2382, -4696, -5028, 3034, 4582, -3486, 1302, 4569, 3914, -146, 2382, 3215, 396, 1837, -1850, -1608, -570, -304, -7063, -3418, 1899, -2587, -6223, -330, 4413, -1255, -498, 4739, 3958, 1022, 1397, 3024, 972, 2182, -1047, -2155, 205, 633, -5012, -5224, 1214, -1439, -5637, -3181, 3225, -438, -1875, 1691, 4068, 2211, 425, 2557, 1752, 2847, 960, -1658, 244, 1846, -2385, -6025, -482]
2262d82R13m658K15O198q40m229K713K402J519k896J752j236K756k289k730R63
2278G1J351j989o018M182L405l372k601N063K161m095N57K714J183j223J040r63
2294A466J027P56k688r46K478m33o084J719L014k399k840J708N123k298j230Q80
2310g47L194N55j830O24O28K988m407k317J916J601m833j712M180k85k846j389
2326d680L530L42o66O42J700K600j376j472O63L106k465k061Q10J789k342l889
2342c769L159Q25j870k284K502J220j058l35L93L222m42m76j720L294J461l990
2358A32J06J795R62n505J240J034q3l607J86L367j294q8n70L089M15O23j825K806
2376B783J769l353q98J647J555n390L69J524L05l328o54J636M35k17j207L157
$$ y = [-482, 431, -4227, -4012, 2186, 1346, -2883, -170, 2232, 3751, 855, 2607, 1371, 4127, 1838, -892, 71, 1422, -567, -6585, -2403, 1002, -2370, -4971, 92, 2253, -1842, -1285, 1429, 2612, 1389, 2429, 1466, 2493, 3249, 561, -385, 2093, 1660, -4424, -2705, 309, -2090, -4930, -3222, 1901, -397, -1627, -747, 2447, 3002, 1172, 1796, 2424, 5412, 1005, -1312, 604, 2205, -2628, -4340, -160, -445, -3291, -4680, -1150, -808, -1474, -832, 868, 3468, 2092, 620, 1283, 4389, 1924, -137, 673, 2462, 120, -3769, -610, 215, -1655, -3939, -1437, -217, -1275, -1610, -1217, 2005, 1563, 1087, -633, 2661, 4122, 132, 238, 2033, 2995, -2510, -1270, -236, -319, -3926, -3740, -373, -1667, -1755, -2325, 764, 1179, 1802, -23, 2783, 4552, 1199, 301, 1948, 3503, -1887, -1518, 6, 311, -3017, -3671, -2035, -1600, -1817, -3024, 133]
2392A33P72M91j467J848J676j821k044R82K009j543k762J425M31q03l309J926
2408b056J064m03j121K11L645N36j224o86M289j256k230l6J871k64l282l23J510
2425B45m59k814P03R6J403j423q8K827K63J78j386K606J021j875n18N90J707k686
2443C90J46j399J922l225q26J462N92l95r09J464N73O43j318J678K265k64j125
2460A674r08K945j645j780k114K013r13k137J174J32M82k756K143J560N10L24
2476G04j154L010K66n40j946K477M30l099n91Q44J114k559j762J403J253k114
2492b264j155J669J871k93j119L105R05j071j036P86J966k138j233n40J359j382
2508e70p45j620K022r1j964J433R16J66j544J842J700M63j452O33K030j259p64
$$ y = [133, 905, 1396, -71, 1777, 3453, 1632, -412, 570, 2579, 1036, -1726, -301, 130, -673, -3982, -2056, -992, -1395, -2516, -2305, 1340, 1876, 652, -34, 4255, 2999, 769, 733, 2604, 2340, -942, -1265, 245, -214, -3028, -2325, -2229, -826, -2249, -2337, 490, 753, 931, -455, 2151, 3172, 1297, 779, 1369, 3076, 390, 536, -863, 1059, -2166, -2992, -1530, -938, -1333, -2242, -778, -205, 438, -880, 798, 3063, 2799, 1674, 766, 3711, 2066, 286, -1828, 185, -728, -2865, -1691, -1559, -1077, -3833, -1690, -130, 380, 704, -450, 2560, 2826, 2286, 340, 2817, 3247, 148, -443, 401, 1515, -1044, -2806, -1403, -150, -2264, -3419, -1750, 121, -172, -1291, 1814, 2719, 1648, 612, 1398, 3364, 1226, -7, -547, 812, -570, -1315, -2935, -913, -1004, -2968, -1535, -619, -453, -1997, -155, 1545, 2008, 556, 1189, 3219, 1960, 1196]
2525A196j206J944k015k400J182P64m44k321J68J761J503j958Q35J813J542p31
2541A633j290K333n23q95o56Q41q10j419q61m13J275j865K93K17K100o86j312
2558b038K088J167L02j637J673J911p41k431O28Q64j965m67j816K875j048j124
2574a759k89L74J552j289J161m28J863q74P51J100N38m44j405J805j677k258q37
2591b116J432Q80l095L23Q73K31p12J12K658O70j182L34J728N21o63j317P89M03
2609A869j267k144O49K078k672q60J15J774q55r97K161J181n58j066K360J360
2625C128P03k294o5Q30j240p74j589R08j482o26M5J410J66j347J732R15m08N12
2643E24J186j85k18l63J73P92Q30k236j329J171m68j113j584P12J083r8k62n45
$$ y = [1196, -10, 1934, -81, -2481, -1299, -535, -979, -3300, -3132, -1371, 132, -1826, -991, 822, 2364, 1633, 343, 2676, 2153, 1258, 602, 1443, 633, -786, -1647, -2060, -785, -2650, -2357, -2140, -40, -726, -2038, 50, 1217, 1519, -118, 1555, 3466, 2725, 294, 922, 1786, -179, -646, -2462, 413, -635, -1759, -2048, -1674, -122, -1411, -250, -678, 1185, 311, 1062, 2162, 2700, 2256, 851, 2656, 979, -1279, -2116, -684, 196, -2899, -2576, -1703, -1472, -2184, -2072, 586, 1256, 74, 408, 2136, 2657, 1994, 677, 1466, 1869, 602, -1542, -893, 1185, -1487, -2347, -2232, -458, -1313, -2310, -149, 1032, 474, -592, 1768, 3128, 3831, 1537, 1472, 2302, 1062, 288, -1301, -393, -1875, -2501, -2456, -1046, -880, -2227, -495, 420, 12, 524, 1710, 1525, 1307, 944, 1117, 1909, 2739, 503, -826, 345, -123, -1236, -2820, -2108, -1025, -1123, -1385, -1930]
2661a930K605n82Q1P58R20Q48k065O31N64O4k504P56M79j358j810O48J504j706
2679b097k68J35K271L59j367P07M00J556j672M78K085k18j941l64M43q73r81r48
2697b295K373j278r35j1J237P71j155Q18J360N00M28j596K006J12j468j410J368
2714H25j051n4j460J397j280n69J55J231K04r37P26P51J797p64j097K060j13J195
2732C016k629R78k73p72j849N31O46j799J45l43K148q88J12O34J430Q74k294P82
2750D49J777M06k232K58R10j424l66j728J195Q7j411O0J384l13l52L50J336k34
2768A52J114q86J59K222n89j840J692j032K25j931Q43r10l53j326Q73J264q77
2785a200R73m14K371m17j227j7K134j77j205K46L22j316n50J161q95l38j111q76
$$ y = [-1930, 675, 93, 174, 932, 1852, 2700, 635, 1266, 1830, 1894, -610, 146, 625, -733, -2543, -1895, -391, -2097, -2365, -2230, 41, 400, -967, -260, 140, 1696, 24, 502, 2587, 2369, 428, 64, 507, -366, -1347, -2295, 78, -1200, -2135, -2146, -909, -138, -1293, -475, 885, 1385, 1813, 217, 2223, 2335, 867, -543, 825, -226, -280, -1740, -343, -1623, -2192, -2037, -806, -602, -1539, -813, -62, 1735, 971, -126, 1934, 1821, 3016, 387, 1365, 1092, 320, -1529, -998, -352, -2151, -2006, -2349, -201, -1089, -977, -343, 1087, 1961, -333, 449, 2226, 2632, 400, 658, 1568, 144, -222, -1950, -755, -668, -2079, -2019, -635, -948, -1300, -950, 386, 152, 1266, 380, 539, 2761, 2172, 332, 2024, 992, 1217, -714, 129, -781, -1134, -2460, -1587, -323, -1200, -227, -641, 1730, 1313, 86, 69, 2203, 2026, 821, 1067, 1389, 73, -477, 684, -211, -549, -1660, -2536]
2803b536J486j47K6k90K129O6n98o65K239N80r77m89n46J240j679k23j40n65n80
2822a669Q5Q13j096J216j740J312J247n88O78M3K561j912N08j97n8k84r29N58
2840E48p00n26j961J881n90r6p26J83K014P50j508J002K313j085m37M97n9J3j016
2859D97l66j34j63n52q05L62J016j065r30R86J166J63r79K203l50m15N66R4K91
2878A585q64r82R75p35j118n22P86k08k52r37J447m46J135R87q65N69N84P4M91
2897A704Q79j875L02j048O55n96j300L48J28P3q69k3Q52P88o58o89J863O07l34
2916H07q30R63Q91j475rk12O11j747m57L92P14j631J303j62J15O03j843L014P38
2935A785r02o2P14o12N64k54j313J084j041j230Q7P85J23j769J30J428R94j321
$$ y = [-2536, -1050, -1197, -1171, -1461, 668, 734, 136, -529, 1710, 2290, 1313, 824, 278, 1518, -161, -384, -524, -1089, -1669, -1584, -771, -1867, -651, -2391, -1079, 168, -420, 258, 301, 2862, 950, 1458, 1261, 1203, 919, -10, 548, -152, -678, -2639, -758, -1348, -1444, -2170, -1987, 27, 777, -731, 271, 2584, 1499, 1062, 1559, 1500, 1513, 497, 131, -3, -166, -718, -1523, -1161, -145, -1210, -2140, -1154, 12, 175, -804, 1399, 1049, 634, 1200, 1294, 1585, 721, -261, 714, -21, -1139, -1661, -875, -1083, -1335, -2272, -825, -1271, -136, 851, -14, 555, 1139, 1213, 1704, 2583, 708, 1010, -38, 617, 21, -1279, -931, -803, -730, -1599, -1622, -770, 18, -640, -1329, 534, 1141, 807, -23, 940, 1831, 356, 347, 135, 746, -1001, -1458, -1066, -352, -1983, -680, -842, -727, -124, -1967, 1047, 1785, 883, 821, 1535, 923, 1487, 1233, -80, 1004, -37, -1267, -1180, -395, -272, -2041, -1911, -483, 511, -810]
2953h10J016N53j68N63n35J744j085r20L30J361k050n52L56m46M48k184J126N24
2971g29K35m83l31J969q39P65k56Q08k84J28r40N73L69r47Kj389J901k161K51
2990a358K75K64J29j009J702O55N3q22J400O72j139M92J87m1j248k42j01O53j492
3009i70r30J058l29N14p64J185N31M83r67L85J56R88l56j084J584R6r34j85n84
3028a23l67k85q63R47j88j155J431M93l23J387p64P79O95k27l95j76M29j201q67
3047g73j61J052q41j089Q10J35J27o27O73O49n36P47Q05M70o1j149r4K16M36O
3067G95j460Q22l77k78o78J47N52q82Q11j398K562j665J201L31J166r05m42J358
3085A660o61R1j255P37j90k143J144r42M30o7j89N64Q68l22L46J541m03m76n03
$$ y = [-810, 206, 759, 591, 1154, 619, 2363, 1278, 358, 688, 2049, -1, -553, -197, -643, -195, -2379, -1253, -729, -494, -977, -1308, 661, -178, 587, 331, 1139, 855, 983, 43, 616, 985, 38, 40, -1349, 552, -1609, -1358, -1083, -819, -690, -1699, 3, 658, 711, -111, 1289, 1961, 822, 1314, 1501, 1460, 212, -30, -131, 522, -970, -1900, -842, -1171, -657, -1421, -236, 295, 778, -189, 196, 352, 1340, 984, -100, 1484, 1580, 646, 461, -123, -490, -775, -1638, -691, -879, -2034, -603, -110, -433, 954, 190, 969, 1664, 1437, 1042, 866, 1295, 94, -773, -934, 118, -723, -1812, -1002, -867, -740, -1367, -694, -45, -581, 166, 971, 1441, 1380, 231, 137, 353, 789, 795, -665, 157, -220, -498, -1176, -1029, -477, -1359, -548, -1946, 616, -1049, 152, 483, 1649, 744, 302, 1660, 999, 1090, -165, 572, 382, -1761, -617, -1559, -1129, -1196, -1385, -821, 47, -275, 71, 1612, 1209, 733, 230]
3104B30J050Q37r53r62M19j100O36n37l27M89j228P3M97O05K82p88O07R64J104
3123A898j475R12q69J620j203p04K98n00k40j206J264j171n4K24Q02m45J86O09
3141e4k0P99r05L3J170m72m19O44M30o35L71j937p51J071m42L9k43J150n27K09
3161d89L84M55j61L33O55O88p99o94J217r38n28k55j520J002p51M09n39J406j516
3180a641J214n62Q01J454j237K14P25O18o82n61R50q04N88k432J108m74K10j303
3198a814M8J143n81K04R16Q1K5J226L34p25J6L16k07m45Q32j609l31O83l06j888
3218b082Q82J14M17o80R85P45p61O05O09r48J598n15j95K29L18j481N96j309P46
3237a27J9j415K90M02j86l66J022k67J22Q85m00J184r44N35m72J3k41j08m40O69
$$ y = [230, 1280, 2117, 1164, 202, 621, -479, 157, -380, -707, -218, -1446, -1373, -876, -271, 11, -777, -170, 794, 1898, 423, 1335, 466, 2086, 883, 179, 477, -23, -263, -1469, -205, -1376, -1430, -1206, -404, -849, -663, -54, -74, 725, -180, -147, 1023, 551, 132, 776, 1206, 571, 942, -995, -1746, -675, -1117, -1078, -1321, -171, -698, -489, -105, 350, 189, 522, 1177, 1865, 1066, 372, 1589, 651, 123, -132, -1652, -650, -1401, -992, -1531, -125, -1641, -427, -989, -188, 1266, 29, 243, 968, 1586, 904, 343, 1293, 489, 1077, -1355, -247, -721, -511, -1814, -1766, -623, -1204, -1000, -84, -3, 22, 1248, 1582, 857, 873, 1189, 982, 537, 1369, -240, -571, 112, -194, -2082, -1200, -1086, -669, -1349, -364, 381, -380, 225, 834, -114, 1484, 969, 774, 1003, 1321, -160, 436, -873, -127, -108, -1523, -1233, -831, -1017, -1383, -361, -628, -506, 379, -21, 1163, 219, 754, 282, 295, 54, -54, -494, 175]
3257A75m05j184R17o82p67P79P8J123m49N02M88J065n75O07j187M57o91P8j219
3276h90J240L20k154Q10J34k04n82P93N60j162Q06N92O98p48R39p88M49q4k9j058
3296c58p36J621k94j775P06J55m89j64R72r63M55J122l78J17j10P71o63J622J74
3315A785j835l57J184n09k005J420N78j192j442K422p27l61O30N81p58J130K64
3332H08q46J430k05j466N23P50N59k999O36r1m22m49Q56L36n01MJ163j067L44
3351f37J359N12j388J188k62n43j18K24m93q26O35o41q0N82%j099J353k77P11
3370B00r06J283J11j039K042o46p00P65J021j841n62M97o92j78q76J315q94R55
3388a45k9l11o21K190j3j797J528j80L91n22R16k84j315K81J73n94j94R53p66
$$ y = [175, -230, -1414, -497, -1179, -1946, -1167, -1089, 34, -415, 87, 575, 1640, 1065, 1672, 485, 942, 251, 329, -890, 350, 670, -1484, -674, -540, -744, -1326, -533, 27, -1135, -329, 263, 961, 213, 1152, 364, 813, 729, 700, -358, -1094, 527, 233, -1542, -836, -681, -1170, -1334, -362, -1325, -870, 252, -126, -9, -119, 652, -11, 1611, 1785, -50, -407, 777, 268, -1737, -317, 261, -931, -2373, 49, -678, -1039, -409, 172, -586, 544, 808, -38, 1392, 1187, -279, 244, 994, 1553, -1446, -810, -901, -1323, -1772, -916, -580, -1081, -1077, 86, -981, -637, 722, 1234, -154, 1034, 772, 229, 111, 335, -158, -984, -349, -990, -1070, -488, -488, -1587, -234, -511, 200, -706, 577, 688, -351, 1691, 1045, 345, 1110, 2131, 290, -272, 225, -467, -645, -1521, -206, -1100, -145, -174, -485, -1106, 1084, 1071, -726, 802, 622, 1013, 491, 1407, 1123, -192, 89, 262, -332, -526, 427, -339]
3407c39P0l56k77J67O89Q2K21Q64k59m72k90J454j244p78P05q67n6l18J316j774
3427a462L85j63M95k79j2K293j633N64J544j164k08P29N82j131o28j54N79j542
3445a205K47P57o08n18O92L5N4N33J97l50J505p80m17k37J284r0j175J540j053
3464D11n20n34m45l96J647K17j056j054K447j29k133K073J097j121n30J833O8
3481A875j471M01r28o56l00P32p25J45J055j417J67Q46Q81j874J910l46M67r09
3499a47J609n85o93K43M40j074l73M98n90n41N38J52n95K30J489j066R17n09J033
3518I76l41k86O90j111P17K54j86q28M60P78k384N32J94r69K85J434k98o8R11
3537G60n88k16Q70R97j468k13O59N08j773R66l67k74o0Q9j421J27J793j143m8
$$ y = [-339, -269, -625, -902, -735, -46, 36, 257, 1121, 862, 390, 100, 1554, 310, -468, 237, -630, -686, -1004, 312, -1462, -1077, -1240, -745, -1024, -1036, 1257, -376, 188, 1732, 568, 360, 1089, 1671, 540, -88, -242, 337, -1205, -958, -201, -809, -1327, -635, -600, -546, -13, 184, -166, 1339, 559, 142, -95, 1189, 1099, -76, 1464, 411, -109, -643, -1088, -1484, 163, 380, -676, -1730, 717, 588, -1545, 528, 1625, 504, -26, 1807, 1875, 404, 805, -123, -779, -1079, -347, -1072, -927, 128, -1289, -1122, -276, 605, -1269, 641, 295, 762, -147, 1462, 877, 184, 427, 867, -207, -580, -82, -672, -1213, -675, -523, -1118, -888, 601, -465, 452, -57, 976, 635, 349, 1039, -72, 645, 899, 713, -115, 345, 1123, -1261, -729, -535, -1504, -1219, 215, -83, -151, 760, 172, -44, 826, 1823, 355, 142, 801, 1309, -464, 502, 135, -139, -199, -110, -1531, -1404, 389, -754, -802]
3556h02J306k15L52k57Q92n31N13J31m23j065K4M23j072kJ350j331j638J851R33
3575D39j012j45J264o13r25J999M2j925J545J86o09m7M60n1j968P92J77o3q47
3594a301J394j038l29J823r00j8J392K22q51L5K71p00k42J772j284r29J53j11
3612f41p86n09K471m36j007L97P52j144J420J83j066J337R91k025k34J854m9k636
3630a128L59O09o59k62J092m60J72o35J199j809J009J843j463M96J413k12j373
3647A91M36j03p96J22N82l57n96M17N4r36Q4J20R02j156J222k90J63P92M76j133
3667A94j47J333mj039L68k70j619M87J161j177J54K37N68j351Q38O69o16R59L94
3686A139k23NM28j65k043K300r92n46q97K230j350j708J475j65k16J183l14j122
$$ y = [-802, 504, 289, 641, 384, 1276, 745, 1258, 1389, 966, -99, -75, 348, -724, -726, 624, -707, -2345, -494, 439, -573, -718, 546, -67, -992, 1007, 1049, -876, 669, 855, 246, 199, 659, 608, -1360, -568, -391, -454, -1301, 93, -945, -1274, 549, -351, -369, 1023, 1245, 394, 429, 700, 0, -242, 1530, 246, -683, -530, -641, -1427, -1936, 535, 99, -908, -511, 241, -903, 517, 700, -366, 971, 1962, -63, -297, 1557, 1508, -1128, -769, -160, -819, -1081, 11, -449, -277, -912, 287, -1522, -513, 1330, -133, 363, 1776, 1564, 191, 627, 524, -272, -150, 432, 75, -521, -104, -50, -986, -902, -782, 120, -1036, 186, -104, 59, 851, 1327, 194, 47, 1380, 1376, 337, 705, 435, -1184, -697, 464, -713, -559, -322, 246, -1105, -267, 402, -214, 745, 1139, 916, 921, 1349, 1184, -859, 1441, 449, -97, -994, 1236, -114, -1822, -347, -512, -728, 455, 141, -981]
3704i81R43Q33l28j90P90o59n35O02R9j112P29q14l59q21J867r13J51N75L16Q8
3724B81r52J435k68n99J424j09j486N68L72j5p61K72l20q28M17N37q15q15J387
3743b75j26N3P13j07J23N49P36j825RJ060j030p21R80j6j706J063J77M14q06P25
3763a0N79j824J576K15j98k67J352j313j12O97O7n18j72r3M69j173O89k94j290
3782a620J284N63j604J244J370j156N20rN68j928K262On74j112J072j424L8J410
3800I10j382j210K03J517j305M39J110o85J55O03K17p81J420J13j016o48J054
3817G14n89k57K59k64j455J327L48m91n86Q08N36n8j011J998p18L05m52K54q83
3836b15N56p2p59P73o17L77j072J047j47o77o30L26P78k43J087K19o18P78J79
$$ y = [-981, -38, 795, 467, 277, 1067, 408, -127, 475, 574, -538, 191, -623, -982, -1803, 64, -849, -698, -123, 193, 281, -671, 764, 496, -103, 1321, 1212, -274, 294, 666, 651, -110, 162, -158, -986, -569, -32, -847, -1662, -275, -401, -348, 365, 258, 381, 930, 1666, -159, -150, 910, -120, -841, 139, 123, -1583, -520, -343, 71, -735, -10, 569, -1255, 321, 536, 338, 71, 1423, 110, -2, 695, 762, 244, 72, -21, 448, -725, -36, -330, -1620, -336, 227, -1377, -133, 1237, 81, 601, 592, 1160, -768, 1494, 1500, 926, -186, 886, -538, -500, 910, -472, -1682, -1479, 38, -1267, -828, 282, -403, -248, 355, 572, -209, 1211, 1324, 308, -340, 714, 125, -132, 127, -137, -1592, -265, 83, -408, -994, -186, 350, 292, -719, 1279, 561, 866, 414, 668, -215, 341, 269, -490, 283, -334, 43, -1029, 18, -129, -806, -1436, -1110, -332, -575, 512, 731, 113, 891, 1070]
3855A070j352M5J004r42o18J324r68r66L16J63L39j99J090m07j185J729M4M61
3873I48M90J9j553J18K183k023l29M16l87k22O05j95J74q96J272m45j54K69Q7
3892C77k13m8n5j83L55M09j67n05j03J63l33p24J139j310Q29l34k4k90J245k65
3912c7n83M55M95m51K65J183l62j119K76M27m25J60Q86j916J069j174P25P37m76
3931A35Q7m09Q69K38k80k15l0J483k181M05m7l84O35%n86k61J30r16M96O90R49
3952H08j405P86L35O45j138n28J585j425O12O13j121J107o67P44j882Q16o59J235
3970D61j253R26K70LJ06p26R83p02J009O34j316k36L8L96o24Q8P35k90n26n08
3990e32J683j551K2K5O94k46O02p98J018M88l12n07k00o22K85O87o75q65M10q54
$$ y = [1070, -282, -237, 767, -175, -793, 531, -437, -1403, -1087, -924, -585, -784, 306, -101, -1286, 443, 487, 948, 1438, 1457, -96, 22, 2205, 182, -147, 269, -118, -340, 265, 70, 244, -652, 620, 175, 21, 290, 377, 164, 116, 61, -122, 233, 642, 475, -30, -133, 30, -303, -1027, 112, -1198, -369, -703, -727, -1017, 228, -37, -620, -165, 330, -121, 144, 1327, 965, -154, 122, 549, 124, 284, 1170, -746, 323, -851, -126, 611, 135, 222, -187, 682, 920, 640, 425, 395, 1878, -303, 102, 55, -329, 306, 306, -280, -541, -411, -1327, -831, -141, 808, -597, 189, 524, 1169, 31, -497, 1088, -337, 275, 888, -233, 874, 207, 951, -931, -115, -774, 461, -792, 134, 404, 407, 513, -213, 770, 68, 1077, 1711, 395, 159, 197, 593, -31, 57, 792, 502, -24, -532, 1151, -400, -378, -353, 341, 95, 697, -101, 917, 1405, 1093, 586, 386, -236, 49, 736, 61, -804, -394, -1248]
4010a248J087p8k53j7J105n5l92M62L60m37q43J212m21P9J37l55n0m40Q7k33o85
4031i78L86O01q95R14M02l26M49j171J208J67p43M72j299J242N7j98L60J7l73
4050B92J1m21j279J151p77J078l99J606j774Q50K58M2n50J5L1o15J294n82l79
4069a48n88O25r74K56J13J158k94K6l55l17k4J073j025O08j26P4N64J11j609J412
4089E60k41n02o84p4J42p63Q05K50N94p9QP57q6o58k95J892j575O17o18N08k52
4110C06r67K85r80J566j445N37N78l79L09l21K50P44j397J009O91p65M55p55J94
4129h5q59j31J559n02m20k29J89k00K11J280j680J070r4k98J65P17j299j1J221
4148F04j103Q83m98O40o72l01O41J5n90M3M44l67P46o18O23l75l28M46J38P03
$$ y = [-1248, -161, -239, -492, -509, 596, 541, 149, 611, 971, 534, -309, 903, 482, 561, 698, 343, 293, -147, -60, -293, -978, -592, 9, -886, 28, 430, 104, 553, -618, 590, 757, 14, 486, -813, 429, 486, 288, 648, 665, 292, 303, -118, -1397, -246, -1023, 55, -344, 1262, -512, 338, 596, 638, 88, 103, 134, -481, 813, 231, -148, -736, -111, -1085, -829, -716, 442, 148, 174, -181, -498, -522, 551, -474, 134, 8, 82, 646, 757, -852, 560, 319, -183, -867, -941, -799, -1562, -757, -507, 87, 8, 16, 773, 687, 29, -266, 1626, 51, 668, 50, 558, 306, -661, -376, -1356, 210, -1235, -698, -120, -499, -190, -511, -261, 483, -914, 95, 786, 21, 476, -279, -85, -944, -1075, 484, -18, -438, -667, -478, -678, -467, 813, -867, 203, 109, -189, -24, 693, -606, -617, 604, -499, 384, -114, 526, -146, -447, 194, 209, -381, -338, 106, -261, 485, -133, 490, 115, -213, 233, 371, 1074]
4168A074q75L3J37m2n70k79M87M63p37m82N19K1k17J185j190J388j091p7J218
4187I65j024k46K82j2P72j131N07r69J089j246O80J95n20l44N93j33O84m76Q29
4206D95m00oN45j326P13o72J292p25M82q98m83J611j097L32O29n25L77m63k90
4225d09R50J95L9r3k70r55J536r27n32L60j044P5L57K00Lj71M76m45J381o58n56
4246d88P22P9k06L54M73q41K67o21J095q53k34L50r31l05Q37J54n06L34R52q67
4266b35j44O77k7n73Q10K43o85o24J411r53m15N59l30o11M51L40q12N16N29M86
4286F13j198Q35K62P5j215J620j145O06j14Q16r80m06k48l93J083q95L40m50J39
4305f55P51q60P05K52O1L86M08j494J236j90o52p33J813j322L84J77m59j75O54
$$ y = [1074, 199, 232, 369, 327, -243, -522, -35, 428, -309, -791, -272, -251, -468, 717, -473, 915, -176, -253, 965, -59, -305, -23, -35, 737, -394, 113, -856, 233, -1013, -333, -138, -658, -1002, -409, -542, 142, -334, 495, 95, 89, 634, -692, 21, -651, 641, -84, 398, -500, -983, 628, -469, -137, 492, -33, 344, -119, -409, 541, 736, 775, 682, 412, -543, 993, 66, -466, -106, -1150, -1075, -718, -518, -515, -686, -210, -655, 726, 68, -488, 234, 313, 107, 461, 934, 93, 360, -261, 834, -19, -253, 97, -834, -1139, -302, -148, -654, -320, 632, -235, -379, 298, 271, -302, 508, 751, 66, -558, 853, -100, -515, 44, -286, -897, -446, -106, -918, -402, 127, 613, -585, 250, 512, 587, -628, 992, -153, 453, 339, 1155, 175, -231, -479, -872, 211, -684, -344, -794, -655, 96, -764, -59, 193, 254, 640, 1048, -446, 790, 600, -52, -785, 1028, -294, 90, 267, -192, -367, 287]
4324B87k03Rk65K12J10m82J038n15M6L2Q8n39R8n5O71m99k75J188j308j12J51
4345c23L15N02K21p35j070J198O49p93m3P48L6j301N99Q2M46n37q05J068p68N6
4365d55m13Q31L62j285J438L3J7q61J131j139K53P46l59k33j44l19j61R25k52
4384A15k71p8J15L05J0o39M08J48O48q32J12L05k98j41R77j579O40m7q08n3J04
$$ y = [287, 84, 93, -172, 40, 150, -332, 706, 191, 237, 269, 357, -182, -84, -139, 532, 33, -242, 946, -362, -474, -323, -8, 494, 715, -20, -1090, 108, 757, -36, -79, 669, 705, -596, 3, 85, 531, -6, -811, 257, -511, -455, -868, -37, 325, -960, 478, 511, 528, -333, 798, -341, -88, 658, 299, 66, -78, -397, -558, 367, 115, -156, -234, -119, 186, 196, -443, -35, 113, 761, -71, 41, 346, 48, -93, 884, -695, -55, -102, -910, -963, -859]
$$ [...]
8191C73
##END NTUPLES=NMR FID
##END=
