##TITLE=1H_SA_58.227
 D2O, 8 sc, 
 2.9.2020
##JCAMPDX= 6.0         $$ Bruker NMR JCAMP-DX V2.0
##DATA TYPE= NMR FID
##DATA CLASS= NTUPLES
##ORIGIN= UXNMR, Bruker Analytische Messtechnik GmbH
##OWNER= root
$$ XWIN-NMR		Version 3.5
$$ Wed Sep  2 08:25:49 2020 Russian Standard Time (UT+4h)  she@DPX200
##.OBSERVE FREQUENCY= 200.1315066352
##.OBSERVE NUCLEUS= ^1H
##.DELAY= (6, 6)
##.ACQUISITION MODE= SIMULTANEOUS
##.ACQUISITION SCHEME= undefined
##.AVERAGES= 8
##.DIGITISER RES= 18
##SPECTROMETER/DATA SYSTEM= spect
##.PULSE SEQUENCE= zg30
##.SOLVENT NAME= D2O
##.SHIFT REFERENCE= (INTERNAL, D2O, 0, 15.7039)
##AUDIT TRAIL= $$ (NUMBER, WHEN, WHO, WHERE, WHAT)
$$ ##TITLE= Audit trail, XWIN-NMR		Version 3.5
$$ ##JCAMPDX= 5.01
$$ ##ORIGIN= Bruker BioSpin GmbH
$$ ##OWNER= she
$$ F:/spectra/data/she/nmr/H-F/1/audita.txt
$$ ##AUDIT TRAIL=  $$ (NUMBER, WHEN, WHO, WHERE, WHAT)
(   1,<2020-09-02 08:23:47.65 +0400>,<she>,<DPX200>,
      <created by zg, POWCHK disabled, PULCHK disabled
       configuration hash MD5:
       00 E9 B6 7A A2 85 ED C7 34 08 36 98 17 FE 4E 26
       data hash MD5: 16K
       90 BE 33 8B DA 61 01 E3 88 CC 94 8E 14 9E F3 D6>)
$$ ##END=
$$ 
$$ hash MD5
$$ 58 4E F2 31 03 49 80 60 A5 91 87 49 0F 8D 88 51
##$RELAX= 
##$RELAX= 
##$RELAX= 
##$RELAX= 
##$RELAX= 
##$RELAX= 
$$ Bruker specific parameters
$$ --------------------------
##$DU= <F:/spectra>
##$EXPNO= 1
##$NAME= <H-F>
##$PROCNO= 1
##$TYPE= <nmr>
##$USER= <she>
##$AMP= (0..31)
100 100 100 100 100 100 100 100 100 100 100 100 100 100 100 100 100 100 
100 100 100 100 100 100 100 100 100 100 100 100 100 100 
##$AQSEQ= 0
##$AQ_mod= 1
##$AUNM= <au_zg>
##$AUTOPOS= <>
##$BF1= 200.13
##$BF2= 200.13
##$BF3= 200.13
##$BF4= 200.13
##$BF5= 200.13
##$BF6= 200.13
##$BF7= 200.13
##$BF8= 200.13
##$BYTORDA= 1
##$CFDGTYP= 0
##$CFRGTYP= 5
##$CHEMSTR= <none>
##$CNST= (0..31)
1 1 145 1 1 1 1 1 1 1 1 1 1 1 1 1 1 1 1 1 1 1 1 1 1 1 1 1 1 1 1 1 
##$CPDPRG= <>
##$CPDPRG1= <>
##$CPDPRG2= <>
##$CPDPRG3= <>
##$CPDPRG4= <mlev>
##$CPDPRG5= <mlev>
##$CPDPRG6= <mlev>
##$CPDPRG7= <mlev>
##$CPDPRG8= <mlev>
##$CPDPRGB= <>
##$CPDPRGT= <>
##$D= (0..31)
0 1.2 0 0 0 0 0 0 0 0.06 0 0.03 0 0 0 0 0.0002 0 0 0 0 0 0 0 0 0 0 0 0 
0 0 0 
##$DATE= 1599020627
##$DBL= (0..7)
120 120 120 120 120 120 120 120 
##$DBP= (0..7)
150 150 150 150 150 150 150 150 
##$DBP07= 0
##$DBPNAM0= <>
##$DBPNAM1= <>
##$DBPNAM2= <>
##$DBPNAM3= <>
##$DBPNAM4= <>
##$DBPNAM5= <>
##$DBPNAM6= <>
##$DBPNAM7= <>
##$DBPOAL= (0..7)
0.5 0.5 0.5 0.5 0.5 0.5 0.5 0.5 
##$DBPOFFS= (0..7)
0 0 0 0 0 0 0 0 
##$DE= 6
##$DECBNUC= <off>
##$DECIM= 32
##$DECNUC= <off>
##$DECSTAT= 4
##$DIGMOD= 1
##$DIGTYP= 9
##$DL= (0..7)
0 120 120 120 120 120 120 120 
##$DP= (0..7)
150 150 150 150 150 150 150 150 
##$DP07= 0
##$DPNAME0= <>
##$DPNAME1= <>
##$DPNAME2= <>
##$DPNAME3= <>
##$DPNAME4= <>
##$DPNAME5= <>
##$DPNAME6= <>
##$DPNAME7= <>
##$DPOAL= (0..7)
0.5 0.5 0.5 0.5 0.5 0.5 0.5 0.5 
##$DPOFFS= (0..7)
0 0 0 0 0 0 0 0 
##$DQDMODE= 0
##$DR= 18
##$DS= 0
##$DSLIST= <SSSSSSSSSSSSSSS>
$$ [...]
##$SUBNAM2= <"">
##$SUBNAM3= <"">
##$SUBNAM4= <"">
##$SUBNAM5= <"">
##$SUBNAM6= <"">
##$SUBNAM7= <"">
##$SUBNAM8= <"">
##$SUBNAM9= <"">
##$SW= 16.880792210976
##$SWIBOX= (0..15)
0 0 2 0 0 0 0 0 0 0 0 0 0 0 0 0 
##$SW_h= 3378.37837837838
##$TD= 16384
##$TD0= 1
##$TE= 0
##$TE2= 300
##$TE3= 300
##$TEG= 300
##$TL= (0..7)
0 120 120 120 120 120 120 120 
##$TP= (0..7)
150 150 150 150 150 150 150 150 
##$TP07= 0
##$TPNAME0= <>
##$TPNAME1= <>
##$TPNAME2= <>
##$TPNAME3= <>
##$TPNAME4= <>
##$TPNAME5= <>
##$TPNAME6= <>
##$TPNAME7= <>
##$TPOAL= (0..7)
0.5 0.5 0.5 0.5 0.5 0.5 0.5 0.5 
##$TPOFFS= (0..7)
0 0 0 0 0 0 0 0 
##$TUNHIN= 0
##$TUNHOUT= 0
##$TUNXOUT= 0
##$USERA1= <user>
##$USERA2= <user>
##$USERA3= <user>
##$USERA4= <user>
##$USERA5= <user>
##$V9= 5
##$VALIST= <valist>
##$VCLIST= <CCCCCCCCCCCCCCC>
##$VD= 0
##$VDLIST= <DDDDDDDDDDDDDDD>
##$VPLIST= <PPPPPPPPPPPPPPP>
##$VTLIST= <TTTTTTTTTTTTTTT>
##$WBST= 1024
##$WBSW= 4
##$XGAIN= (0..3)
0 0 0 0 
##$XL= 0
##$YL= 0
##$YMAX_a= 56539
##$YMIN_a= -45192
##$ZGOPTNS= <>
##$ZL1= 120
##$ZL2= 120
##$ZL3= 120
##$ZL4= 120
##$ABSF1= 10
##$ABSF2= 0
##$ABSG= 5
##$ABSL= 3
##$ALPHA= 0
##$AQORDER= 0
##$ASSFAC= 0
##$ASSFACI= 0
##$ASSFACX= 0
##$ASSWID= 0
##$AUNMP= <proc_1d>
##$AZFE= 0.1
##$AZFW= 0.1
##$BCFW= 1
##$BC_mod= 2
##$BYTORDP= 1
##$COROFFS= 0
##$CY= 11.3945322036743
##$DATMOD= 1
##$DC= 2
##$DFILT= <>
##$DTYPP= 0
##$F1P= 16.9975609425685
##$F2P= -3.02152046262296
##$FCOR= 0.5
##$FTSIZE= 0
##$FT_mod= 4
##$GAMMA= 1
##$GB= 0.15
##$INTBC= 1
##$INTSCL= 1
##$ISEN= 128
##$LB= 0.24
##$LEV0= 0
##$LPBIN= 0
##$MAXI= 10000
##$MC2= 0
##$MEAN= 0
##$ME_mod= 0
##$MI= 1.114404
##$NCOEF= 0
##$NC_proc= 0
##$NLEV= 6
##$NOISF1= 3.799351
##$NOISF2= 2.8
##$NSP= 1
##$NTH_PI= 0
##$NZP= 0
##$OFFSET= 15.70392
##$PC= 1
##$PHC0= -9975.743
##$PHC1= 13.40091
##$PH_mod= 1
##$PKNL= yes
##$PPARMOD= 0
##$PSCAL= 0
##$PSIGN= 0
##$REVERSE= no
##$SF= 200.130013532006
##$SI= 16384
##$SIGF1= 3
##$SIGF2= 2
##$SINO= 400
##$SIOLD= 16384
##$SREGLST= <1H.CDCl3>
##$SSB= 0
##$STSI= 0
##$STSR= 0
##$SW_p= 3612.71676300578
##$SYMM= 0
##$S_DEV= 0
##$TDeff= 0
##$TDoff= 0
##$TI= <>
##$TILT= no
##$TM1= 0
##$TM2= 0
##$TOPLEV= 0
##$USERP1= <user>
##$USERP2= <user>
##$USERP3= <user>
##$USERP4= <user>
##$USERP5= <user>
##$WDW= 1
##$XDIM= 8192
##$YMAX_p= 0
##$YMIN_p= 0
$$ End of Bruker specific parameters
$$ ---------------------------------
##NTUPLES= NMR FID
##VAR_NAME=  TIME,          FID/REAL,        FID/IMAG
##SYMBOL=    X,             R,               I
##VAR_TYPE=  INDEPENDENT,   DEPENDENT,       DEPENDENT
##VAR_FORM=  AFFN,          ASDF,            ASDF
##VAR_DIM=   8192,          8192,            8192
##UNITS=     SECONDS,       ARBITRARY UNITS, ARBITRARY UNITS
##FACTOR=    0.000296,      1,               1
##FIRST=     0,             0,               0
##LAST=      2.424536,      0,               0
##MIN=       0,             -45192,          0
##MAX=       2.424536,      56539,           0
$$ Real data points
##PAGE= N=1
##DATA TABLE= (X++(R..R)), XYDATA
$$ plain form
0 0 0 0 0 0 0 0 0 0 0 0 0 0 0 0 0 0 0 0 0 0 0 -2 8 -8 8 -8 8 -9 10 -16 16 -17 20 -24 26 -30 34 -38 42 -48 53 -59
42 -59 66 -72 80 -88 97 -107 120 -131 145 -161 178 -195 214 -238 263 -292 325 -365 410 -465 536
63 536 -621 738 -898 1138 -1550 2454 -12624 21227 25195 2198 -23311 -45192 -17511 5695
77 5695 25622 16281 -30370 -41417 -14163 12612 32227 9796 -21466 -28873 -20253 16991 38651
90 38651 9361 -19234 -31323 -14894 21558 27334 13005 -12893 -38505 -13733 22013 28447 14190
103 14190 -19897 -29774 -7617 12930 33460 19175 -20742 -27471 -9883 19238 34087 9315
115 9315 -13905 -24185 -16448 20112 32853 10677 -14796 -29883 -9191 21215 24772 16118 -11773
128 -11773 -30099 -7134 19715 31867 16918 -16559 -20953 -5118 15480 33950 16462 -14128
$$ packed form
0@%%%%%%%%%%%%%%%%%%%%%kJ0j6J6j6J6j7J9k6L2l3L7m4N0n6O4p2Q0r0J01j12
42e9J25j38J52j68J85k04K27k51K76l06L39l73M09m52N01n55O17o90P75q75J001
63E36j157J359j636K036k688M004j5078L3851L968k2997k5509k1881K7681K3206
77E695J9927r341m6651j1047K7254K6775J9615k2431l1262p407Q620L7244K1660
90C8651k9290k8595j2089J6429L6452N776j4329k5898k5612K4772L5746O434j4257
103A4190l4087r877K2157K0547K0530j4285l9917o729J7588K9121J4849k4772
115I315k3220j0280P737L6560J2741k2176k5473j5087K0692L0406L557q654k7891
128a1773j8326K2965K6849J2152j4949l3477m394J5835K0598J8470j7488l0590
$$ plain form
140 -14128 -23126 -10497 19954 29591 8217 -12125 -25285 -14111 16819 25628 11045 -15131 -29297
153 -29297 -7982 16077 23472 14956 -13291 -24673 -7456 15749 30511 13981 -14243 -18920 -7821
166 -7821 16097 29934 12764 -10551 -21999 -10056 18941 26706 10848 -9704 -22884 -8555
178 -8555 16249 25516 14560 -11939 -23060 -5905 15341 25674 14028 -11738 -20900 -8673 13938
191 13938 27138 10825 -12650 -20990 -10342 13842 24184 10033 -11201 -23391 -10275 15174
203 15174 23008 10760 -10828 -22109 -8340 13233 23262 12585 -11869 -21550 -8391 12338
215 12338 22951 10091 -12711 -21756 -11104 11312 22149 8211 -12957 -23043 -11578 11479
227 11479 20239 8514 -12352 -23213 -10545 11509 20510 9403 -12103 -21988 -9424 11061 21244
$$ packed form
140a4128q998J2629L0451R637k1374k0342j3160J1174L0930Q809j4583k6176j4166
153b9297K1315K4059P395q516k8247j1382J7217K3205J4762j6530k8224m677J1099
166g821K3918J3837j7170k3315j1448J1943K8997P765j5858k0552j3180J4329
178h555K4804R267j0956k6499j1121J7155K1246J0333j1646k5766r162J2227K2611
191A3938J3200j6313k3475q340J0648K4184J0342j4151k1234j2190J3116K5449
203A5174P834j2248k1588j1281J3769K1573J0029j0677k4454r681J3159K0729
215A2338J0613j2860k2802r045J0652K2416J0837j3938k1168j0086J1465K3057
227A1479Q760j1725k0866j0861J2668K2054R001j1107k1506r885J2564K0485J0183
$$ plain form
240 21244 10020 -11943 -21073 -9375 11154 21135 9211 -11500 -21180 -10185 11172 20711 8704
253 8704 -11368 -21402 -9659 11262 19892 9123 -11596 -21037 -9559 10594 19968 8959 -11448
266 -11448 -20318 -9298 10284 19745 8686 -11379 -20164 -9715 10451 19608 8893 -11282 -20089
279 -20089 -9225 10401 19263 8817 -10820 -19784 -8718 10777 19270 9036 -10647 -19296 -8253
292 -8253 10750 19572 9034 -10242 -18943 -8469 10429 19254 8627 -10266 -19212 -8665 10141
305 10141 18630 8172 -10723 -19517 -8776 10036 18112 8366 -10715 -19209 -8915 9599 18408
318 18408 8071 -10298 -18283 -8474 10102 18534 8540 -9773 -18022 -8336 10403 18478 8441
331 8441 -9102 -17962 -8194 10007 17974 8316 -9230 -17906 -7852 9821 17962 8953 -9110 -17209
$$ packed form
240B1244j1224k1963r130J1698K0529R981j1924k0711r680J0995K1357R539j2007
253H704k0072j0034J1743K0921Q630j0769k0719r441J1478K0153R374j1009k0407
266a1448q870J1020J9582R461j1059k0065q785J0449K0166R157j0715k0175q807
279b0089J0864J9626Q862j0446j9637q964J1066J9495Q493j0234j9683q649J1043
292h253J9003Q822j0538j9276q701J0474J8898Q825j0627j8893q946J0547J8806
305A0141Q489j0458j8895q794J0741J8812Q076r746j9081q494J0294J8514Q809
318A8408j0337j8369p985R809J8576Q432r994j8313q249R686J8739Q075j0037
331H441j7543q860R768J8201P967r658j7546q676J0054J7673Q141r009j8063q099
$$ plain form
345 -17209 -7497 9870 18781 8544 -9433 -17003 -7691 9699 17979 7779 -9026 -17393 -8553
358 -8553 9642 16896 7637 -9308 -18207 -8208 9243 16852 8788 -8991 -17087 -6790 9547 18011
372 18011 8819 -8811 -15483 -7321 9426 18492 7930 -8790 -16438 -8135 9347 16219 6683 -9068
386 -9068 -17922 -8962 8753 15224 7049 -9490 -17684 -7383 8011 15823 8580 -9180 -16042 -7052
400 -7052 9161 17742 7609 -8639 -14461 -8016 8944 17267 7150 -8092 -16410 -7715 9811
413 9811 14902 7180 -7361 -16847 -7024 8629 15579 8349 -9409 -15583 -6033 6869 15734 7691
427 7691 -9645 -15796 -9185 7236 15679 4220 -9513 -16152 -10062 6904 13603 5458 -8776 -18302
441 -18302 -7790 8139 12879 7175 -7894 -15811 -6536 7166 15687 8356 -9741 -14419 -6496 6241
$$ packed form
345a7209R712J7367Q911j0237j7977p570R312J7390Q280j0200j6805q367Q840
358h553J8195P254r259j6945q899R999J7451P609q064j7779q096J0297J6337Q464
372A8011r192j7630o672Q162J6747R066j0562j6720p648Q303J7482O872r536j5751
386i068q854Q960J7715O471q175j6539q194J0301J5394P812p243j7760o862Q990
400g052J6213Q581j0133j6248n822O445J6960Q323j0117j5242q318Q695J7526
413I811N091p722j4541r486R823J5653O950p230j7758o174R550J2902Q865q043
427G691j7336o151O611J6421Q443j1459j3733o639O090J6966O699q145j4234r526
441a8302J0512J5929M740n704j5069p917R275J3702Q521p331j8097m678P923J2737
$$ plain form
455 6241 15152 6258 -8711 -15295 -9822 7370 14670 3862 -8234 -15864 -8519 7401 12936 7521
469 7521 -7312 -16557 -5558 8886 14400 8609 -6870 -12807 -5118 7415 17605 8654 -7920
482 -7920 -11764 -5615 8530 15968 6850 -5017 -13195 -7414 10314 15347 6834 -5375 -13587 -4692
496 -4692 8567 14020 10032 -6205 -14145 -4015 7914 14945 7522 -7426 -11594 -6972 6033 16042
510 16042 6236 -7548 -12873 -6967 8597 13693 6485 -4059 -13551 -6425 10048 14819 8600 -5190
524 -5190 -12413 -2935 7689 14259 10114 -6314 -12391 -4757 7284 15278 6070 -6767 -10952 -7674
538 -7674 6513 15032 5585 -6015 -13056 -6202 8859 12632 7138 -3834 -13079 -4721 8323 14032
552 14032 8707 -6438 -11399 -3349 6382 14028 8153 -6555 -11707 -6220 7050 14482 5153 -6017
$$ packed form
455F241Q911q894j4969o584N473J7192P300j0808j2096p630P345J5920N535n415
469G521j4833r245J0999J4444N514n791j5479n937P689J2533J0190q951j6574
482g920l844O149J4145P438r118j1867q178N781J7728N033q513j2209q212Q895
496d692J3259N453l988j6237p940J0130J1929P031p423j4948m168M622J3005J0009
510A6042r806j3784n325N906J5564N096p208j0544r492P126J6473M771o219j3790
524e190p223R478J0624O570m145j6428o077P634J2041P994r208j2837m185L278
538g674J4187Q519r447j1600p041O854J5061L773n494j0972r245Q358J3044N709
552A4032n325j5145m961Q050R731P646n875j4708n152N487J3270P432r329j1170
$$ plain form
566 -6017 -11196 -7284 6898 13038 5924 -5796 -13850 -5842 7270 10905 6260 -6316 -13584 -6418
580 -6418 5001 11902 6093 -8801 -13110 -6881 3928 11707 4773 -7348 -13020 -7870 6076 12265
594 12265 4202 -5896 -12572 -6368 6419 11527 6676 -5923 -13419 -5447 6140 11025 6023 -6710
608 -6710 -12186 -6398 4336 12070 5209 -7507 -12384 -6893 4569 11233 4772 -6005 -11873 -6921
622 -6921 6395 11523 5494 -5082 -11926 -5479 5982 11324 6727 -5676 -12062 -4948 5572 11694
636 11694 5927 -6032 -11037 -5825 5410 12264 5737 -5633 -11117 -6153 6044 11500 5595 -4912
650 -4912 -11413 -5775 6188 11033 6049 -5714 -11516 -5499 5173 11054 5934 -5868 -11640 -5631
664 -5631 5292 11525 5615 -5429 -10689 -5540 5548 11544 5919 -4850 -10642 -5310 6065 11303
$$ packed form
566f017n179L912J4182O140p114j1720q054Q008J3112L635m645j2576p268P166
580f418J1419O901n809j4894m309O229J0809P779o934j2121n672N150J3946O189
594A2265q063j0098o676O204J2787N108m851j2599p496P972J1587M885n002j2733
608f710n476N788J0734P734o861j2716m877N491J1462O664o461j0777n868M952
622f921J3316N128o029j0576o844O447J1461N342m597j2403o386P114J0520O122
636A1694n767j1959n005N212J1235O854o527j1370n484M964J2197N456n905j0507
650d912o501N638J1963M845m984j1763n802O017J0672N881n120j1802n772O009
664e631J0923O233n910j1044n260N149J1088N996n625j0769n792N332J1375N238
$$ plain form
678 11303 5581 -4859 -10948 -5270 5537 10788 5852 -5261 -10834 -5202 5207 10873 5339 -5389
692 -5389 -10898 -5815 4871 10648 5163 -5109 -10560 -5542 5330 10875 5146 -5035 -10758 -5184
706 -5184 5080 10351 5717 -5116 -10391 -5309 5076 10515 5620 -5269 -10190 -5051 5033 10459
720 10459 5307 -5337 -10341 -5307 5128 10280 4657 -4861 -10363 -5430 5177 9849 5226 -4861
734 -4861 -10001 -4980 5074 9924 5138 -4955 -10046 -5133 4671 10045 4895 -5338 -10025 -5326
748 -5326 4663 9617 4920 -5094 -9753 -5192 4827 9517 5035 -4935 -9856 -4964 5067 9794
762 9794 5242 -4798 -9789 -4752 4818 9820 5096 -5109 -9599 -4877 4455 9739 4788 -5017 -10036
777 -10036 -5254 4491 9340 4492 -4774 -9712 -4999 4963 9118 5076 -4524 -9524 -4583 4873 9263
$$ packed form
678A1303n722j0440o089N678J0807N251m936j1113n573N632J0409N666n534j0728
692e389n509N083J0686N777n485j0272n451N018J0872N545n729j0181n723N574
706e184J0264N271m634j0833n275N082J0385N439m895j0889m921N139J0084N426
720A0459n152j0644n004N034J0435N152n623r518n502M933J0607M672m623j0087
734d861n140N021J0054M850m786j0093n091M913R804N374n150j0233m687M699
748e326R989M954m697j0014m659M561J0019M690m482r970m921M892J0031M727
762I794m552j0040m991N037R570N002m724j0205m490M722R332N284m951r805n019
777a0036M782R745M849m848r266m938M713R962M155m042r600n000M941R456M390
$$ plain form
792 9263 4865 -4773 -9293 -4832 4616 9054 4414 -4743 -9220 -4913 4543 9279 4280 -4500 -9254
807 -9254 -4979 4645 9232 4743 -4366 -9316 -4548 4380 8874 4617 -4833 -9516 -4763 3937 8705
822 8705 4211 -5095 -9399 -5202 4060 8788 4010 -4570 -8833 -4813 4962 9098 4686 -3299 -8211
837 -8211 -4192 5300 9292 5487 -3724 -8194 -3369 4532 9006 5145 -4160 -8294 -4265 4052 9179
852 9179 4202 -4452 -8164 -4445 4340 9121 4316 -3792 -8563 -4259 4978 8539 4768 -3562 -8544
867 -8544 -3566 4368 8418 4840 -4664 -8540 -3760 3651 8566 4310 -4245 -7918 -4731 4334 9319
882 9319 3788 -3969 -8141 -4323 4703 8205 4250 -3648 -8942 -4054 4468 7707 4181 -4360 -8613
897 -8613 -4243 3085 7959 4158 -5046 -8249 -4321 3745 8621 3775 -3605 -7542 -4270 4750 9106
$$ packed form
792I263m398r638m520M461R448M438m640r157m477M307R456M736m999q780m754
807i254M275R624M587m489r109m950M768Q928M494m257r450m683M753Q700M768
822H705m494r306m304M197R262M728m778q580m263M020R775M136m412p985m912
837h211M019R492L992l805r211m470M825P901M474l861r305m134M029Q317N127
852I179m977q654l712L719Q785M781m805q108m771M304R237L561l771q330m982
867h544M978P934M050l578r504l876M780P411M915m256q555l673L187R065M985
882I319n531p757m172L818R026L502l955p898n294M888Q522L239l526q541m253
897h613M370P328M874l801r204l203L928Q066M876m846p380l937L272R020M356
$$ plain form
912 9106 4210 -2809 -7449 -3360 5008 8025 4945 -3221 -8201 -3300 4039 7637 4270 -4413 -7621
927 -7621 -4383 2857 8193 4006 -4429 -7745 -4617 3750 7831 3119 -3261 -7739 -4830 4273 7578
942 7578 3818 -3961 -8332 -3666 3502 6761 4243 -4147 -8165 -3968 3118 7746 3575 -4606 -7232
957 -7232 -4354 3096 8174 3381 -3730 -7535 -4170 4350 7172 3133 -3100 -7826 -4288 3843 6947
972 6947 3828 -4192 -8063 -3296 3227 6751 4122 -3746 -6904 -3739 3751 8314 3538 -3514 -6060
987 -6060 -3747 4151 8008 4248 -2411 -7215 -3098 4646 7133 3889 -3075 -7479 -3557 3343 6976
1002 6976 3893 -4383 -7725 -3265 2839 6825 3422 -3787 -7042 -4301 3381 7485 2825 -3458 -6903
1017 -6903 -4008 3739 6766 3560 -3193 -7754 -3601 3467 6110 3696 -3411 -7176 -3382 2639 6965
$$ packed form
912I106m896p019m640M089Q368L017l080q166m980M901P339L598l367q683l208
927g621L238P240N336m187q435l316L128Q367M081m712o380m478K909R103L305
942G578l760p779m371M666P168L259k518q390m018M197P086M628m171q181k626
957g232K878P450N078m793p111l805L365Q520K822m039o233m726L538Q131L104
972F947l119q020l871M767O523L524k629p868l158L165P490M563m776p052k546
987f060K313P898L857l760o659m804M117P744K487l244o964m404L922O900L633
1002F976l083q276l342M460O104L986l403p209l255K741P682M104m660o283l445
1017f903K895P747L027l206o753m561M153P068K643k414p107l765L794O021M326
$$ plain form
1032 6965 3535 -4118 -6877 -3336 3022 7021 3000 -3483 -6787 -3897 3445 6771 3003 -3370 -7432
1047 -7432 -3480 3307 6043 3411 -3733 -7440 -3361 3376 6531 3465 -3642 -6499 -3279 2938 7082
1062 7082 3571 -3120 -6360 -3181 3521 7020 3157 -3055 -6531 -3485 3601 6410 3325 -3150 -6727
1077 -6727 -3446 3112 6207 3646 -3523 -6727 -3343 2780 6518 3050 -3617 -6560 -3431 3162 6548
1092 6548 3139 -3307 -6314 -3149 3266 6343 3118 -3109 -6565 -3218 3367 6388 3177 -3341 -6452
1107 -6452 -3000 3067 6320 3533 -3330 -6259 -3015 3372 6701 2645 -3089 -6260 -3186 2932 6170
1122 6170 3016 -3157 -6305 -3130 3198 6036 3123 -3096 -6607 -2979 3209 6020 3075 -3493 -6190
1137 -6190 -3015 2886 6135 2847 -3218 -6139 -3261 3230 5969 2811 -3361 -6073 -2991 3075 6165
$$ packed form
1032F965l430p653k759L541O358L999m021o483l304K890P342L326l768o373m062
1047g432L952O787K736k632p144l707M079O737L155l066p107k857L220O217M144
1062G082l511o691l240L179O702L499l863o212l476L046P086K809l085o475l577
1077f727L281O558L095k561p169l204L384O123L738l468o667k943L129O593L386
1092F548l409o446l007L165O415L077l225o227l456L347O585L021l211o518l111
1107f452L452O067L253k787o863k929L244O387L329m056n734l171L074O118L238
1122F170l154o173l148L175O328K838k913o219l511L628O188K811k945o568k697
1137f190L175N901L249l288o065k921K878O491K739l158o172k712L082O066L090
$$ plain form
1152 6165 2729 -3038 -6185 -3018 2983 5890 2974 -2825 -6181 -3218 2795 5730 2874 -3288 -5971
1167 -5971 -3104 2824 5998 3040 -3074 -5903 -2746 3028 5994 3009 -3049 -6011 -2981 3000 5985
1182 5985 2963 -2942 -5950 -2753 2974 5966 3041 -3079 -5738 -2872 3208 5907 2888 -2980 -5807
1197 -5807 -2822 3129 5963 3142 -2763 -5665 -2679 3134 5905 3151 -2659 -5877 -2791 2996 5748
1212 5748 2944 -2657 -5700 -2769 2721 5672 3063 -2983 -5413 -2786 3033 5975 2968 -2635 -5319
1227 -5319 -2519 3278 5849 3206 -2597 -5716 -2867 3037 5582 2892 -2896 -5559 -2775 2788 5452
1242 5452 2714 -3210 -5593 -2760 2573 5775 2516 -2949 -5498 -2721 2803 5783 2388 -2677 -5427
1257 -5427 -2739 3011 5377 2808 -2736 -5553 -2552 2728 5198 2818 -2771 -5213 -2536 2946 5693
$$ packed form
1152F165l436n767l147L167O001K907k916n799l356K963O013K935k856o162k683
1167e971K867N928L174k958o114k829L157N774K966k985o058k962L030N981K985
1182E985l022n905l008L197N727K992k925o120k659K866O080K699l019n868k827
1197e807K985N951K834k821n905k902K986N813K771k754n810l218L086N787K752
1212E748k804n601l043K931N490K951k609o046k430K627N819K942l007n603k684
1227e319K800N797K571k643n803l119K849N904K545k690n788k663K784N563K664
1242E452k738n924k383K833N333L202l259n465k549K777N524K980l395n065k750
1257e427K688N750K366k569n544k817L001N280K470k380n589k442K677N482K747
$$ plain form
1272 5693 2751 -2735 -5025 -2307 2983 5530 2688 -2216 -5107 -2726 3090 5246 2496 -2506 -5466
1287 -5466 -2552 2762 5137 2786 -2834 -5214 -2428 2310 5209 2955 -2428 -4884 -2381 2810 5783
1302 5783 2629 -2548 -4858 -2479 2894 5488 2544 -2477 -5487 -2486 2814 4941 2187 -2849 -5626
1317 -5626 -2660 2343 4852 2492 -2978 -5324 -2620 2356 5287 2361 -2634 -4750 -2723 2497 5256
1332 5256 2175 -2340 -4893 -2722 2601 4634 2362 -2341 -5485 -1943 2682 4960 2803 -2757 -4953
1347 -4953 -2145 2505 5444 2859 -2428 -4580 -2310 2768 5340 2173 -2275 -4919 -2869 2671 4879
1362 4879 2120 -2748 -5146 -2500 2555 4481 2428 -2559 -5528 -2464 2310 5008 2743 -2815 -4317
1377 -4317 -2309 2265 5071 2374 -2557 -4735 -2669 2832 5050 1931 -2558 -5170 -2525 2263 4056
$$ packed form
1272E693k942n486k290K718N290K547k842m904k891K381N816K156k750n002k960
1287e466K914N314K375k351n620k380K786M738K899k254n383k456K503N191K973
1302E783l154n177k310K379N373K594k944n021l010L001N300K127k754n036k777
1317e626K966N003K509k360n470k346K704M976K931k926m995k116K027N220K759
1332E256l081m515k553K171N323K033k272m703l144L542M625K278k157n560k196
1347d953K808M650K939k585n287k152K270N078K572l167m448k644K050N540K208
1362D879k759m868k398K646N055J926k053m987k969L064M774K698k265n558j502
1377d317K008M574K806k697m931k178K066N501K218l119m489k612K645M788J793
$$ plain form
1392 4056 2225 -2671 -5483 -2368 2184 4415 2387 -2819 -4669 -2512 1907 4864 2346 -2767 -4501
1407 -4501 -2378 2355 4846 2107 -2269 -4864 -2445 2857 4603 2522 -2000 -4598 -2174 2451 4650
1422 4650 2660 -2642 -4698 -1751 2504 4924 2559 -2512 -4247 -2269 2271 5013 2018 -2487 -4562
1437 -4562 -2458 2283 4333 1971 -2383 -4999 -2573 2527 4354 1983 -2438 -4800 -2054 2251 4579
1452 4579 2493 -2680 -4512 -1946 2314 4651 1961 -2594 -4429 -2446 2046 4515 1636 -2675 -4843
1467 -4843 -2108 2500 4153 2133 -2426 -5034 -2233 2452 4276 2364 -2256 -4735 -2077 2231 4606
1482 4606 2302 -2429 -4294 -2229 2285 4566 2059 -2053 -4359 -2118 2421 4693 2244 -1959 -4263
1497 -4263 -1997 2485 4332 2361 -2140 -4409 -1873 2378 4756 2483 -2496 -4238 -2161 2147 4604
$$ packed form
1392D056j831m896k812L115M552K231k028n206j850K157M419K957k518n113j734
1407d501K123M733K491k739m376k595K419N302J746k081m522k598K424M625K199
1422D650j990n302k056K947M255K420k365n071j735J978M540K742k995m505k075
1437d562K104M741K050k362m354k616K426N100J827k371m421k362K746M305K328
1452D579k086n173j832K566M260K337k690m555j835J983M492K469k879m311k168
1467d843K735M608J653k020m559k608K801M685J824j912m620k479K658M308K375
1482D606k304m731j865K065M514K281k507m112k306K241M539K272k449m203k304
1497d263K266M482J847j971m501k269K536M251K378k273m979j742K077M308K457
$$ plain form
1512 4604 2121 -2355 -4381 -2029 2569 4268 1870 -2059 -4448 -2204 2206 4541 2145 -2171 -4216
1527 -4216 -1998 2500 4645 2261 -2174 -3980 -1710 2274 4492 2210 -2262 -3942 -2232 2252 4553
1542 4553 2073 -2124 -4323 -2320 2181 4052 2084 -2033 -4498 -2021 2249 4018 2035 -2196 -4287
1557 -4287 -1949 2072 4353 2134 -2094 -4251 -1787 2209 4286 1882 -2106 -4158 -2076 2014 4118
1572 4118 1892 -2106 -4029 -1934 2316 4020 1918 -2046 -4281 -2105 2284 4161 2096 -2138 -4004
1587 -4004 -1968 2049 4123 1925 -2171 -3929 -2268 1990 4366 1904 -1869 -4058 -1915 1945 3812
1602 3812 1844 -1803 -4031 -1901 2171 3897 2083 -2246 -3908 -1910 2106 4088 2127 -1983 -3670
1617 -3670 -1997 2200 4078 1826 -1786 -3983 -1831 2183 3997 1758 -2020 -3944 -1753 2092 3900
$$ packed form
1512D604k483m476k026K352M598J699k398l929k389K244M410K335k396m316k045
1527d216K218M498K145k384m435j806K270L984K218k282m472j680J710M484K301
1542D553k480m197k199K003M501J871j968m117k465K477M270J769j983m231k091
1557d287K338M021K281k219m228k157K464L996K077k404l988k052K082M090K104
1572D118k226l998j923K095M250J704k102l964k235K176M389J877k065m234j866
1587d004K036M017K074k198m096j758J661M258K376k462l773k189K143L860J867
1602C812j968l647k228K130M072J726j814m329j662J998M016J982j961m110j687
1617c670J673M197J878k252l612k197K152M014J814k239l778j924K191L845J808
$$ plain form
1632 3900 2006 -2180 -3837 -1758 2053 3883 2045 -2088 -3666 -1644 2200 4012 1972 -1977 -3663
1647 -3663 -1992 2374 4242 1778 -1821 -3743 -1887 1960 4102 1871 -1775 -3706 -1456 1821 3979
1662 3979 2126 -1807 -3668 -1599 2072 4077 2095 -1976 -3922 -1963 1794 3853 1666 -1957 -3771
1677 -3771 -2013 1773 3402 1763 -1914 -4012 -1762 2034 3608 2026 -1953 -3956 -1816 1861 3696
1692 3696 1653 -2057 -3694 -2004 1995 3922 1711 -2001 -3659 -1995 1634 3600 1505 -1781 -3884
1707 -3884 -1806 1844 3490 1698 -1943 -3472 -1821 1860 3544 1679 -2103 -3721 -1622 1750 3678
1722 3678 1798 -1968 -3504 -1819 1945 3479 1492 -1757 -3745 -1942 1904 3571 1904 -1873 -3751
1737 -3751 -1761 1984 3596 1761 -1725 -3588 -1636 1555 3638 1784 -2127 -3562 -1701 1715 3588
$$ packed form
1632C900j894m186j657K079L811J830j838m133j578K022L844J812k040l949j686
1647c663J671M366J868k464l599j922J856L847K142k231l646j931K250L277K158
1662C979j853l933j861K069L671K005j982m071j946J959L757K059k187l623j814
1677c771J758L786J629j639l677k098K250L796J574j582l979k003K140L677J835
1692C696k043l710j637J690L999J927k211l712j658J664L629J966k095l286k103
1707c884K078L650J646j792l641j529J651L681J684j865l782j618K099L372J928
1722C678j880l766j536J685L764J534j987l249j988J803L846J667j667l777j878
1737c751J990L745J612j835l486j863J952L191K083j854l911j435J861L416J873
$$ plain form
1752 3588 1196 -2024 -3958 -1992 1858 3323 1267 -1931 -3593 -1877 1885 3330 1639 -2002 -3438
1767 -3438 -1642 1677 3541 1592 -2011 -3358 -1656 1885 3672 1643 -1682 -3324 -1880 1964 3565
1782 3565 1612 -1505 -3532 -1579 1849 3353 1497 -1438 -3382 -1431 1541 3370 1651 -1721 -3323
1797 -3323 -1599 1768 3464 1723 -1584 -3126 -1819 2024 3394 1363 -1558 -3243 -1550 1795 3333
1812 3333 1691 -1415 -3487 -1397 1991 3205 1648 -1751 -3584 -1335 1514 3269 1607 -2341 -3432
1827 -3432 -1809 1465 3378 1431 -1922 -3488 -1642 1930 3162 1317 -1649 -3261 -1704 2017 3410
1842 3410 1787 -1698 -3313 -1367 1745 3298 1678 -1621 -3222 -1522 1729 3550 1649 -1782 -3105
1857 -3105 -1620 1690 3481 1501 -1264 -3157 -1527 2071 3253 1701 -1252 -3184 -1390 1896 3055
$$ packed form
1752C588k392l220j934J966L850J465k056l198j662J716L762J445j691l641j436
1767c438J796L319J864j949l603j347J702L541J787k029l325j642J444L844J601
1782C565j953l117k027J953L428J504j856k935j944J951K972J829j719l372j602
1797c323J724L367J696j741l307j542J307L843J370k031k921j685J693L345J538
1812C333j642l106k072K090L388J214j557l399j833K249K849J755j662l948j091
1827c432J623L274J913j947l353j566J846L572J232j845k966j612J557L721J393
1842C410j623l485j615J946L112J553j620l299j601J700L251J821j901l431j323
1857c105J485L310J791j980k765j893J630L598J182j552k953j932J794L286J159
$$ plain form
1872 3055 1666 -1673 -3342 -1496 1554 3036 1541 -1770 -3091 -1632 1521 3433 1569 -1650 -3111
1887 -3111 -1314 2322 2928 1428 -1497 -3308 -1253 1888 3092 1395 -1689 -3252 -1426 1505 2810
1902 2810 1415 -2033 -3085 -1473 1500 3129 1278 -1894 -3180 -1382 1380 3151 1239 -1784 -3346
1917 -3346 -1541 1824 2945 1382 -1605 -3170 -1194 1497 2915 1437 -1707 -2865 -1326 1407 3171
1932 3171 1216 -1555 -2967 -1319 1699 2958 1249 -1675 -3092 -1704 1653 2945 1454 -1721 -3168
1947 -3168 -1153 1504 2737 1490 -1646 -2986 -1238 1634 3277 1563 -1619 -3059 -1437 1508 2996
1962 2996 1378 -1673 -2891 -1366 1910 3258 968 -1173 -3216 -1153 1757 2864 1385 -1553 -2906
1977 -2906 -1227 1731 2869 1405 -1784 -2860 -1465 1643 2930 1135 -1539 -2826 -1304 1765 2884
$$ packed form
1872C055j389l339j669J846L050J482j495l311j321J459L153J912j864l219j461
1887c111J797L636O06j500k925j811K055L141J204j697l084j563J826K931J305
1902B810j395l448j052J612K973J629j851l172j286J798K762J771j912l023j562
1917c346J805L365J121j563k987j565J976K691J418j478l144j158J539K733J764
1932C171j955k771j412J648L018J259j709k924j417J388L357J292j491l175j447
1947c168K015K657J233j247l136j340J748K872J643j714l182j440J622K945J488
1962B996j618l051j218J525L276J348k290k141k043K063K910J107j479k938j353
1977b906J679K958J138j464l189j076J395L108J287j795k674j287J522L069J119
$$ plain form
1992 2884 1416 -1448 -2940 -1358 1488 2802 1660 -1414 -2791 -1321 1584 2877 1375 -1376 -2698
2007 -2698 -1273 1427 2849 1133 -1557 -2797 -1354 1377 2779 1107 -1678 -2791 -1395 1328 2722
2022 2722 1316 -1702 -2897 -1357 1338 2591 1295 -1611 -2538 -1408 1348 2733 1172 -1635 -2857
2037 -2857 -1571 1401 2611 1136 -1508 -2868 -1581 1259 2658 1096 -1563 -3007 -1491 1331 2610
2052 2610 1157 -1435 -3263 -1301 1183 2807 1133 -1389 -3032 -1513 1486 2642 1518 -1452 -2867
2067 -2867 -1504 1273 2638 1095 -1389 -2709 -1305 1287 2712 1241 -1304 -2553 -1448 1455 2682
2082 2682 1257 -1415 -2366 -1151 1404 2301 1389 -1545 -2721 -1221 1285 3008 1235 -1449 -2572 -1086
2098 -1086 1318 2602 1405 -1259 -2596 -1136 1375 2338 1346 -1330 -2652 -1217 1389 2530 1171
$$ packed form
1992B884j468k864j492J582K846J314j142l074j377J470K905J293j502k751j322
2007b698J425K700J422j716k690j240J443K731J402j672k785j113J396K723J394
2022B722j406l018j195J540K695J253j296k906r27J130K756J385j561k807j222
2037b857J286K972J210j475k644j360J287K840J399j562k659j444J516K822J279
2052B610j453k592j828J962K484J624j674k522j643J519K999J156j124k970j415
2067b867J363K777J365j543k484j320J404K592J425j471k545j249J105K903J227
2082B682j425k672r51J215K555Q97r12k934j176J500K506J723j773k684j123J486
2098a086K404J284j197k664j337J460K511R63r92k676j322J435K606J141j359
$$ plain form
2113 1171 -1433 -2711 -1303 1553 2716 1167 -1384 -2344 -1011 1488 2641 1399 -1430 -2411 -1210
2128 -1210 1365 2525 1209 -1090 -2582 -1096 1363 2565 1265 -1401 -2452 -1053 1443 2526 999
2143 999 -1226 -2233 -1126 1272 2632 1145 -1182 -2544 -1363 1327 2574 1131 -1229 -2507 -1156
2158 -1156 1477 2576 1210 -1204 -2314 -1104 1360 2603 1242 -1315 -2561 -1196 938 2544 1168
2173 1168 -1260 -2611 -1503 1335 2392 916 -1296 -2545 -1271 1513 2125 1170 -1479 -2477 -1297 1411
2189 1411 2280 859 -1336 -2522 -1348 1160 2402 1133 -1273 -2481 -1185 1420 2392 1314 -1413
2204 -1413 -2597 -1344 1280 2277 995 -1404 -2248 -1089 1097 2375 1228 -1304 -2557 -1125 1247
2219 1247 2293 1210 -1080 -2232 -1121 1314 2572 1245 -1066 -2367 -1022 1371 2672 1314 -1301
$$ packed form
2113A171k604j278J408K856J163j549k551r60J333K499J153j242k829r81J201
2128a210K575J160j316k299j492J486K459J202j300k666j051J399K496J083j527
2143I99k225j007J107K398J360j487k327j362J181K690J247j443k360j278J351
2158a156K633J099j366k414j110J210K464J243j361k557j246J365K134J606j376
2173A168k428j351J108K838J057j476k212j249J274K784O12r55k649r98J180K708
2189A411Q69j421k195j186J174K508J242j269k406j208J296K605R72j078k727
2204a413j184J253K624R97j282k399q44J159K186J278j147k532j253J432K372
2219A247J046j083k290j152J111K435J258j327k311j301J345K393J301j358k615
$$ plain form
2234 -1301 -2347 -809 1437 2260 994 -944 -2316 -1070 1464 2211 1197 -1377 -2572 -1051 1251
2249 1251 2296 916 -1278 -2493 -1085 1156 2281 1328 -1151 -2283 -1244 1378 2324 1090 -1062
2264 -1062 -2397 -1063 1226 2163 1225 -1257 -2146 -1079 1087 2245 1028 -1393 -2326 -1273 1375 2583
2280 2583 1183 -1025 -2255 -1358 1163 2223 1182 -1000 -2192 -1139 1361 2121 1179 -1411 -2295 -821
2296 -821 1113 2283 1157 -1112 -2116 -1213 1116 2287 845 -1206 -2133 -1023 1357 2395 909 -947
2312 -947 -2301 -974 1358 2264 805 -1272 -2086 -1073 1347 2150 1175 -1266 -2048 -935 1020 2160
2328 2160 1178 -1235 -2238 -1041 824 2128 914 -1049 -2312 -1068 1175 1955 1018 -1036 -2157 -1022
2344 -1022 1076 2188 809 -1130 -2021 -1073 894 2223 1049 -1246 -2001 -951 1024 2106 605 -1011
$$ packed form
2234a301j046J538K246Q23j266j938j372J246K534P47j014k574j195J521K302
2249A251J045j380k194j215J408K241J125r53k479j132J039K622R46j234k152
2264a062j335J334K289R37r38k482q89J067K166J158j217k421r33J053K648J208
2280B583j400k208j230Q97K521J060j041k182j192J053K500P60r42k590q84J474
2296h21J934J170j126k269j004R03K329J171j442k051r27J110K380J038j486j856
2312i47j354J327K332R06j459k077q14J013K420Q03r75k441p82J113J955J140
2328B160r82k413j003J197J865J304j214j963j263J244K243P80r37k054j121J135
2344a022K098J112j379j939q91R48J967J329j174k295p55J050J975J082j501j616
$$ plain form
2360 -1011 -1920 -1007 1213 2068 845 -973 -2182 -1190 1202 1795 1156 -1009 -2572 -761 898 1881 831
2377 831 -1191 -1914 -1125 983 2111 967 -1290 -2074 -1081 1308 2023 883 -879 -2157 -954 912
2393 912 2081 1049 -1026 -2190 -827 929 2075 1196 -984 -2214 -950 908 2138 957 -1036
2408 -1036 -1996 -915 1084 1930 914 -1100 -1960 -1179 1123 2291 1102 -889 -2249 -772 1268 1772
2424 1772 1172 -823 -1884 -796 1056 2098 946 -831 -1748 -881 868 2038 1080 -825 -1801 -902
2440 -902 1027 2196 894 -836 -2014 -1200 1157 1956 960 -1140 -2036 -1005 1139 1921 1078 -909 -1959
2457 -1959 -766 968 2005 938 -829 -1772 -986 875 2007 867 -1079 -1680 -996 1056 1878 674
2473 674 -948 -1722 -854 1012 1923 912 -1128 -1743 -699 1094 1809 955 -900 -1870 -932 810 1989
$$ packed form
2360a011r09R13K220Q55j223j818j209R92K392N93o39k165j563J811J659R83j050
2377H31k022p23P89K108J128j144k257p84R93K389P15j140j762j278J203J866
2393I12J169j032k075j164J363J756J146q79k180j230J264J858J230j181j993
2408a036r60J081J999Q46j016k014q60P81K302J168j189j991j360J477K040N04
2424A772o00j995j061J088J852J042j152j777r17Q67J749J170r58j905r76Q99
2440i02J929J169j302j730j178Q14K357P99r96k100q96J031K144P82q43j987j050
2457a959J193J734J037j067j767r43P86J861J132j140j946o01O84K052Q22j204
2473F74j622p74Q68J866R11j011k040o15J044J793P15q54j855r70R38J742J179
$$ plain form
2490 1989 879 -976 -1827 -582 859 1940 755 -756 -1724 -854 646 2151 972 -847 -1889 -1038
2506 -1038 965 1782 994 -930 -1660 -960 981 1971 859 -875 -1908 -1100 784 1889 644 -959
2522 -959 -1666 -903 874 1643 937 -851 -1845 -833 704 2008 880 -946 -1688 -846 863 1827 937
2539 937 -945 -1783 -797 791 2007 860 -927 -1902 -953 874 1798 622 -1204 -1750 -753 798 1738
2556 1738 803 -991 -1860 -894 1059 1607 1013 -846 -1879 -1036 965 1859 831 -780 -1870 -974 853
2573 853 1436 669 -905 -1579 -717 822 1607 921 -839 -1520 -787 917 1677 773 -741 -1890 -987 995
2591 995 2024 967 -619 -1631 -894 834 1572 838 -1171 -1632 -927 623 1701 990 -693 -1912 -1036
2608 -1036 803 1684 875 -584 -1756 -816 926 1762 619 -935 -1546 -966 711 1662 685 -892 -1613
$$ packed form
2490A989j110j855q51J245J441J081j185j511r68Q70J500J505j179j819j042Q51
2506a038K003Q17p88j924p30P00J941R90j112j734j033Q08J884J105j245j603
2522i59p07P63J777P69p06j788r94J012J537J304j128j826p42Q42J709R64q90
2539I37j882q38R86J588J216j147j787r75R49J827R24j176j826n46R97J551R40
2556A738r35j794q69R66J953N48n94j859j033Q43K001Q94j028j611j090Q96J827
2573H53N83p67j574o74Q62J539P85o86j760o81P33J704P60r04j514j149R03J982
2591I95J029j057j586j012P37J728P38p34k009m61P05J550J078p11j683j219Q76
2608a036J839Q81q09j459j172R40J742Q36j143j554o11N80J677R51r77j577p21
$$ plain form
2625 -1613 -1005 882 1494 920 -775 -1722 -876 833 1535 529 -712 -1992 -857 705 1343 712 -789
2642 -789 -1813 -1068 699 1716 806 -708 -1820 -877 809 1598 990 -712 -1372 -913 961 1615 809
2659 809 -925 -1516 -708 895 1486 681 -752 -1662 -582 848 1884 847 -555 -1476 -962 942 1952
2676 1952 747 -848 -1546 -911 676 1637 776 -949 -1541 -907 850 1438 919 -693 -1567 -666 840
2693 840 1728 549 -938 -1677 -821 898 1323 719 -787 -1474 -1158 800 1649 907 -826 -1660 -978 733
2711 733 1337 910 -664 -1505 -890 734 1441 690 -674 -1502 -629 855 1740 786 -960 -1617 -692 896
2729 896 1651 609 -774 -1559 -809 777 1440 874 -816 -1668 -688 949 1470 966 -738 -1362 -683 787
2747 787 1491 579 -835 -1421 -770 824 1627 707 -605 -1646 -678 777 1622 708 -690 -1570 -821 573
$$ packed form
2625a613O08J887O12n74j695r47Q46J709P02j006j241j280J135J562O38o31j501
2642g89j024P45J767J017r10j514j112R43J686P89o08j702o60M59J874O54q06
2659H09j734n91Q08J603N91q05j433r10J080J430J036j037j402r21N14J904J010
2676A952j205j595o98O35J587R61q61j725n92O34J757N88n19j612q74R01J506
2693H40Q88j179j487p39Q56J719M25o04j506o87L16J958Q49p42j733q34O82J711
2711G33O04m27j574q41O15J624P07p51j364q28Q73J484Q85r54j746o57R25J588
2729H96P55j042j383p85P50J586O63n66j690q52R80J637N21n04j704o24O79J470
2747G87P04r12j414n86O51J594Q03r20j312j041R68J455Q45r14j398q80P49J394
$$ plain form
2765 573 1544 668 -542 -1488 -673 730 1386 751 -678 -1448 -867 696 1335 805 -667 -1388 -593 626
2783 626 1555 900 -548 -1683 -797 706 1340 700 -520 -1390 -500 691 1475 674 -673 -1434 -621 853
2801 853 1533 621 -583 -1507 -650 839 1419 856 -815 -1362 -807 585 1350 698 -564 -1207 -534 694
2819 694 1174 677 -660 -1342 -713 614 1237 658 -778 -1376 -704 488 1543 482 -741 -1547 -539
2836 -539 990 1471 539 -623 -1336 -797 837 1310 768 -736 -1348 -599 733 1542 812 -616 -1491 -954
2854 -954 623 1633 838 -891 -1183 -752 824 1450 766 -989 -1313 -587 721 1387 763 -616 -1467 -642
2872 -642 565 1327 681 -695 -1501 -502 625 1308 769 -746 -1233 -719 613 1468 564 -745 -1363 -752
2890 -752 699 1490 431 -687 -1057 -684 520 1289 459 -628 -1557 -575 555 1246 789 -519 -1200 -702
$$ packed form
2765E73R71q76j210r46Q15J403O56o35j429p70N81J563O39n30j472p21P95J219
2783F26R29o55j448j135Q86J503O34o40j220q70Q90J191P84q01j347p61Q13J474
2801H53O80r12j204r24Q57J489N80n63j671n47N55J392P65o52j262o43O73J228
2819F94M80m97j337o82O29J327O23n79j436n98O72J192J055j061j223q06J008
2836e39J529M81r32j162p13N39J634M73n42j504o12P49J332Q09p30j428q75N37
2854i54J577J010p95j729k92M31J576O26o84j755l24P26J308O66o24j379q51Q25
2872f42J207P62o46j376q06R99J127O83n39j515m87N14J332Q55r04j309o18O11
2890g52J451P91j059j118l70L73J204P69q30j087r29R82J130O91m57j308o81M98
$$ plain form
2908 -702 719 1130 573 -558 -1182 -602 762 1307 719 -531 -1092 -421 803 1216 755 -719 -1258 -586
2926 -586 736 1177 615 -627 -1236 -570 571 1178 646 -491 -1339 -445 585 1241 497 -604 -1204 -528
2944 -528 484 1591 671 -550 -1361 -586 551 1338 756 -663 -1321 -397 568 1293 663 -529 -1365 -771
2962 -771 592 1123 505 -628 -1205 -631 504 1133 719 -694 -1318 -558 662 1232 420 -782 -1120 -622
2980 -622 315 1177 414 -604 -1134 -679 588 1148 503 -585 -1128 -640 639 1249 521 -625 -1248 -782
2998 -782 611 1170 657 -427 -941 -710 598 1162 471 -465 -1181 -695 371 1269 417 -637 -1287 -667
3016 -667 569 1072 526 -605 -1509 -607 562 1381 223 -412 -1028 -583 336 1113 692 -447 -1204 -441
3034 -441 417 1037 581 -339 -940 -621 627 739 698 -587 -1057 -636 454 1329 571 -549 -1173 -753 707
$$ packed form
2908g02J421M11n57j131o24N80J364N45n88j250n61O71J224M13m61j474n39O72
2926e86J322M41n62j242o09O66J141O07n32j137q48Q94J030O56p44j101o00O76
2944e28J012J107r20j221q11P75J137P87n82j419o58R24R65P25o30j192q36N94
2962g71J363N31o18j133n77N74J135O29m14j413o24P60J220N70q12j202l38M98
2980f22R37Q62p63j018n30M55J267N60o45j088n43M88J279O10p28j146o23M66
2998g82J393N59n13j084n14K31J308N64o91r36p16M86J066Q98q52j054o50O20
3016f67J236N03n46j131r04R02J169Q19j158o35o16M45R19P77m21j139p57P63
3034d41Q58O20m56r20o01L19J248J12m1j285m70M21J090Q75p58j120o24M20J460
$$ plain form
3053 707 1101 526 -415 -1178 -643 546 1411 522 -681 -986 -624 296 1077 703 -552 -1307 -774 583 975
3072 975 316 -610 -1072 -621 699 984 372 -305 -1067 -425 670 1216 456 -645 -1254 -477 558 1175 626
3091 626 -416 -951 -413 443 1244 654 -550 -1035 -474 476 1076 408 -510 -1120 -564 582 999 820 -512
3110 -512 -1096 -656 748 1081 804 -454 -1017 -495 498 1137 479 -405 -918 -491 433 950 554 -710 -1013
3129 -1013 -633 439 1163 387 -500 -1039 -378 472 942 537 -475 -1155 -601 288 966 492 -503 -1008 -483
3148 -483 436 957 481 -482 -944 -292 283 1097 397 -406 -1010 -456 419 863 674 -296 -941 -813 454 812
3168 812 523 -496 -942 -644 335 839 754 -188 -989 -527 353 993 622 -204 -895 -564 507 957 699 -393
3188 -393 -975 -589 475 983 678 -382 -927 -618 414 942 596 -327 -952 -315 275 913 541 -450 -975
$$ packed form
3053G07L94n75r41p63N35J189Q65q89j203l05L62R20P81l74j255p55N33J357L92
3072I75o59r26m62M51J320K85o12o77p62O42J095N46p60j101o09P77J035O17n49
3091F26j042n35N38Q56Q01n90j204m85N61R50O00o68r18o10N56J146M17j79j332
3110e12n84M40J404L33k77j258n63N22R93O39o58q84n13M27R24N17l96j264l03
3129a013L80J072P24p76q87n39O61Q50M70m05j012o80N54Q89O78m74r95n05N25
3148d83R19N21m76r63m62O52N75Q14p00q03o04N54Q75M44j89r70o45J28J267L58
3168H12k89j019m46K98R79N04q5r42q01M62Q80O40l71q26o91L31J071M50k58j092
3188c93n82L86J064N08l05j060n45L09J032N28l46r23o25O37N90O38l72r91n25
$$ plain form
3207 -975 -462 425 785 580 -559 -1008 -335 599 814 542 -367 -928 -389 268 912 647 -384 -894 -625
3226 -625 436 1052 346 -633 -1011 -487 482 942 444 -523 -1125 -490 509 847 472 -377 -1026 -792 876
3245 876 903 527 -602 -935 -603 116 903 490 -366 -1019 -528 331 850 290 -243 -880 -444 423 1020 651
3265 651 -149 -1029 -485 453 1163 755 -403 -892 -414 308 872 607 -329 -1022 -602 607 996 477 -624
3284 -624 -934 -474 351 971 355 -477 -953 -611 417 719 512 -492 -1127 -637 348 856 424 -276 -975
3303 -975 -708 492 818 275 -630 -830 -285 536 809 249 -377 -773 -327 340 1061 243 -676 -769 -316 553
3323 553 984 598 -447 -923 -366 469 1082 508 -316 -924 -456 518 805 383 -484 -731 -536 339 908 447
3343 447 -636 -922 -507 386 815 684 -483 -866 -473 437 849 525 -349 -871 -252 278 983 397 -278
$$ packed form
3207i75N13Q87L60k05j139m49O73R34K15k72r09n61N39O57O44k65j031n10K69
3226f25J061O16p06r79l78N24R69M60m98r67o02O35R99L38l75q49o49K34J668
3245H76K7l76j129l33L32P19P87m13q56o53M91Q59N19n60n33o37M36Q67N97l69
3265F51q00q80N44R38P10m08j158m89M78P22N64k65r36o93M20J209L89n19j101
3284f24l10M60Q25O20o16q32m76L42J028L02k07j004o35M90R85N08m32p00o99
3303i75K67J200L26n43r05k00N45Q21K73n60o26l96M46O67P21q18r19r3M53Q69
3323E53M31l86j045m76N57Q35O13n74q24o08M68R74K87m22q67k47J95Q75N69m61
3343D47j083k86M15Q93M29j31j167l83L93R10M12l24q74n22O19N30P05n86o75
$$ plain form
3362 -278 -830 -380 510 916 267 -307 -946 -384 281 893 451 -473 -831 -481 284 879 313 -333 -941 -435
3382 -435 321 865 576 -334 -796 -697 562 641 362 -336 -788 -463 467 798 430 -486 -791 -430 324 705
3402 705 612 -416 -746 -707 223 1039 433 -314 -680 -733 563 932 496 -439 -898 -370 156 722 505 -334
3422 -334 -610 -452 411 738 262 -290 -923 -451 408 610 540 -191 -1006 -615 439 880 363 -237 -907 -408
3442 -408 295 589 216 -353 -761 -362 32 854 605 -450 -875 -205 378 711 395 -253 -791 -520 434 939
3462 939 514 -245 -686 -448 127 569 238 -448 -736 -372 393 986 423 -340 -552 -367 364 716 610 -240
3482 -240 -843 -546 477 799 416 -280 -905 -378 254 824 317 -275 -879 -406 264 695 248 -167 -629 -565
3502 -565 486 791 519 -81 -606 -323 355 775 485 -143 -692 -467 158 726 405 21 -749 -455 216 849
$$ packed form
3362b78n52M50Q90M06o49n74o39N62O65O12m42r24l58L50P65N95n66o46o08N06
3382d35P56N44k89r10m62R9J259P9k79o98m52L25R30L31l68r16l05L61P54L81
3402G05r3j028l30L9R30Q16o06p47l66n3J296L69m36r35m59N28N26N66k17q39
3422c34k76J58Q63L27m76n52o33M72Q59K02p0p31q15L91J054M41n17o00o70M99
3442d08P03K94l73n69m08L99L94Q22k49j055m25O70N83L33l16o48n38K71R54N05
3462I39m25p59m41K38N75M42l31o86k88L64P65N93n63p63k12J85P31L52j06q50
3482b40o03K97J023L22l83o96o25N27O32N70n07n92o04M73O70M31m47m15m62O4
3502e65J051L05k72o00n25K83O78M20k90o28n49K25O25N68l21l84p70K94O71O33
$$ plain form
3522 849 289 -345 -731 -381 340 630 526 -479 -646 -291 281 488 570 -463 -594 -419 246 753 304 -362
3542 -362 -610 -533 464 773 346 -290 -592 -433 411 958 529 -405 -749 -293 224 710 368 -496 -909 -403
3562 -403 366 671 201 -308 -788 -465 86 769 555 -312 -599 -306 288 736 128 -343 -849 -266 368 696
3582 696 272 -315 -620 -343 395 353 386 -205 -603 -462 486 698 489 -206 -606 -464 233 609 426 -441 -613
3603 -613 -410 177 417 359 -148 -487 -311 184 680 414 5 -827 -432 240 670 511 -468 -724 -274 286
3623 286 559 533 -292 -538 -343 160 670 183 -502 -600 -585 488 701 464 -337 -737 -318 258 616 444 -435
3644 -435 -897 -399 29 750 339 -415 -625 -426 290 429 299 -615 -777 -754 132 687 161 135 -743 -547 207
3665 207 573 346 -140 -708 -297 203 855 293 -518 -542 -552 147 635 466 -351 -549 -357 312 767 230 -328
$$ packed form
3522H49n60o34l86L50P21K90j04j005j67L55N72K07Q2j033j31J75O65N07m49o66
3542c62k48P7R97L09m27o36l02J59Q44N47m29r34l44M56N17M86l42q64m13N06
3562d03P69L05m70n09m80L23N51O83k14q67k87K93N94M48o08m71n06N83O34L28
3582F96m24n87l05K77P38m2L3n91l98J41R48K12k09o95m00J42O97L76j83q67j72
3603f13K03N87K40n8n07l39J76M95M96k66m09q32L95O72M30j59r79k56M50N60
3623B86K73k6q25k46J95N03N10m87o85r8J5J073K13k37q01m00M19N76L58j72q79
3644d35m62M98M28P21m11p54k10J99P16J39j30r14j62K3Q86N55n26k6q78J96P54
3665B07L66k27m86n68M11N00O52n62q11k4j0O99M88j69q17j98J92O69M55n37n58
$$ plain form
3686 -328 -879 -532 290 537 521 -277 -694 -377 250 423 287 -389 -679 -192 200 586 282 -46 -471 -387 291
3707 291 556 255 -246 -445 -136 140 617 319 -153 -749 -435 118 815 279 -271 -648 -489 111 613 527
3727 527 -102 -683 -250 72 732 121 -53 -687 -356 362 774 312 94 -381 -342 195 784 335 -109 -592
3747 -592 -313 214 777 494 -400 -346 -323 303 504 509 -400 -490 -556 33 659 225 -324 -756 -262 335 562 383
3769 383 -431 -610 -360 190 565 374 -273 -692 -426 344 788 213 -259 -528 -176 122 611 279 32 -542
3789 -542 -258 278 709 308 -306 -548 -205 106 564 291 -96 -684 -300 119 517 354 -337 -553 -407 152
3809 152 607 524 -194 -529 -348 240 213 147 -287 -492 -379 232 599 387 -286 -566 -259 373 463 432 -125 -484
3831 -484 -214 194 664 507 -442 -386 -280 118 493 400 -312 -426 -415 -50 300 245 -82 -503 -157 235 631
$$ packed form
3686c28n51L47Q22K47j6p98m17L17O27J73j36o76k90M87L92L86l04l28m25Q4O78
3707B91K65l01n01j99L09K76M77k98m72n96L14N53O97n36n50l77J59O00N02q6
3727E27o29n81M33L22O60o11j74o34L31P18M12m62k18m75L9N37N89m49m44m83
3747e92K79N27N63k83q94N4K3O26K01Nr09r0o6N89O26m34n49m32M94N97K27j79
3769C83q14j79K50N50L75j91o47m19K66P70M44n75m72k69L52K98M89l32k47n74
3789e42K84N36M31m01o14k42L43L11M58k73l87n88L84M19L98j63o91k16J46N59
3809A52M55q3p18l35J81N88k7o6m34k05J13O11L67k12o73k80L07O32R0l1n57l59
3831d84K70M08M70j57r49N6J06L98L75r3p12j14J1L65L50n5l27m21L46L92L96
$$ plain form
3852 631 230 -264 -487 -395 556 283 35 -335 -620 -571 261 640 273 -280 -482 -368 316 463 431 -117 -516
3873 -516 -479 32 430 285 7 -502 -236 273 640 352 -180 -449 -402 21 597 180 -256 -338 -257 172 592
3894 592 190 -279 -562 -245 379 302 167 -29 -328 -258 383 466 28 -273 -649 -416 76 444 371 -454 -345
3915 -345 -140 483 524 56 -275 -396 -195 -35 448 326 -245 -316 -181 106 513 166 -212 -384 -295 65 397
3936 397 436 -78 -656 -318 120 539 420 -212 -372 -303 333 339 305 -35 -355 -132 89 309 337 -183 -444 -426
3958 -426 557 466 408 -216 -307 -380 32 576 495 -121 -511 -317 117 449 165 -212 -604 -48 466 489 92 -109
3980 -109 -601 -142 221 333 196 -196 -480 -383 110 151 209 -332 -373 -359 209 450 380 -235 -346 -101 206 453
4002 453 242 -80 -500 -322 160 447 148 -297 -296 -152 80 615 378 -128 -379 -210 236 308 223 -162 -472
$$ packed form
3852F31m01m94k23R2R51k73k48l70k85M9Q32L79l67n53k02J14O84J47l2n48l99
3873e16L7N11L98j45k78n09K66N09L67k88n32k69M7M23N76m17m36q2Q1M29M20
3894E92m02m69k83L17O24p7j35j96k99P0O41Q3m38l01l76K33M92L68p3q25J09
3915c45K05O23M1m68l31j21K01J60M83j22n71p1J35K87M07l47l78j72Q9L60L32
3936C97L9n14n78L38M38M19j19o32j60O9O36Ol4l40l20K23K21K20K8n20k61J8
3958d26R83r1n8o24r1p3M12N44q1o16l90J94M34L32k84l77l92N56N14K3l97k01
3980a09m92M59L63J12j37l92k84R7M93M1N8n41m1J4N68K41p0o15j11K45L07K47
4002D53k11l22m20J78M82K87k99m45JJ44K32N35k37n06k51J69M46P2q5l85l10
$$ plain form
4023 -472 -238 100 469 348 -154 -410 -49 229 680 238 -107 -244 -360 101 466 197 -153 -306 -114 20
4043 20 499 283 -311 -434 -161 95 310 374 -393 -640 -322 104 407 258 -139 -386 -34 106 422 371 -209
4064 -209 -653 -75 185 423 156 -147 -583 -132 266 222 6 13 -229 -345 271 414 227 -327 -441 -224 129
4085 129 468 409 -184 -455 -317 -2 46 75 -285 -361 -416 153 358 369 -131 -422 -145 131 456 219 -147 -157
4107 -157 -5 81 408 224 -71 -458 -175 234 474 370 -268 -467 -102 -51 347 277 -95 -273 -134 496 503 229
4129 229 -307 -354 -372 7 206 295 -199 -391 -153 213 101 277 -75 -282 -393 -56 461 219 91 -217 -279
4150 -279 119 343 270 48 -435 -326 266 307 225 -67 -285 -240 111 348 124 -42 -410 -291 -40 326 264 162
4172 162 -350 -216 14 376 117 40 -418 -314 148 514 158 37 -477 94 0 284 272 -366 -425 -257 134
$$ packed form
4023d72K34L38L69j21n02k56L61K78M51m42l45j37j16M61L65k69l50j53J92J34
4043B0M79k16n94j23K73K56K15O4p67k47L18M26L03j49l97k47L52J40L16n1n80
4064b09m44N78K60K38k67l03m36M51L98m4k16Pk42j16O16J43j87n54j14K17L53
4085A29L39n9n93k71J38L15M8K9l60p6n5N69K05J1n00k91K77K76L25k37l66j0
4107a57J52Q6L27j84k95l87K83M09K40j04o38j99L65N1L98p0l72j78J39O30Pk74
4129B29n36m7j8L79J99Q9m94j92K38L66j12J76l52k07j11L37N17k42j28l08o2
4150b79L98K24p3k22m83J09N92M1q2k92k18M5L51K37k24j66l68J19K51L66o2j02
4172A62n12J34K30L62k59p7m58J04M62L66l56j21n14N71r4K84j2o38n9J68L91
$$ plain form
4193 134 210 128 -246 -175 -539 352 347 423 28 -210 -506 160 421 151 -152 -277 -215 425 316 391 -220 -187 -256
4216 -256 106 456 44 -122 -337 -326 244 395 209 -69 -424 -294 146 359 209 -211 -254 -139 62 530 144
4237 144 -187 -144 -512 153 479 98 -361 -322 -303 137 418 125 -120 -450 32 10 269 490 -150 -113 -164 60
4259 60 409 211 14 -359 -391 -102 373 190 -188 -355 -61 224 190 332 -352 -125 42 122 294 79 -118
4280 -118 -402 -130 187 520 258 -118 -363 -273 -29 246 32 -205 -568 -385 35 427 0 -125 -246 -79
4300 -79 238 295 186 111 -173 -5 -31 451 181 -74 -299 -165 173 256 165 -135 -374 -152 161 65 195 -185
4322 -185 -368 -375 47 228 109 -157 -190 -101 -93 422 154 -172 -127 -102 55 221 409 168 -214 -144 58 181 375
4345 375 -108 -352 -249 -134 223 212 69 -366 -409 217 318 92 -45 -285 -279 -45 485 47 -103 -378 -345 150
$$ packed form
4193A34P6q2l74P1l64Q91nP6l95k38k96O66K61k70l03j25O2O40j09P5o11L3o9
4216b56L62L50m12j66k15J1N70J51j86k78l55J30M40K13j50m20m3J15K01M68l86
4237A44l31M3l68O65L26l81m59L9J9M40K81k93k45l30M82k2K59K21o40L7n1K24
4259F0L49j98j97l73l2K89M75j83l78j67K94K85l4J42o84K27J67Q0J72k15j97
4280a18k84K72L17L33k62l76k45R0K44K75k14k37l63J83M20L92m27j25j21J67
4300g9L17N7j09p5k84J68k6M82k70k55k25J34L38Q3r1l00k39K22L13r6J30l80
4322a85j83pM22J81j19k66l3Q9QN15k68l26M5K5J57J66J88k41l82P0K02J23J94
4345C75m83k44J03J15L57j1j43m35m3O26J01k26j37k40OK34N30m38j50k75L3M95
$$ plain form
4367 150 350 43 -177 -184 -249 11 232 301 -184 -410 -75 73 321 447 81 -389 -180 290 69 77 21 -51 -198
4390 -198 125 232 -24 -172 -41 -330 -129 368 310 -110 -453 38 -206 57 266 -133 -210 -217 43 368 155
4411 155 100 -9 -274 63 145 28 -39 -337 -72 23 285 208 -45 -128 -283 99 379 118 -11 -151 -220 39
4433 39 338 252 -29 -450 -267 -85 138 -138 -7 -255 -196 143 269 167 48 -242 -350 62 240 372 -169
4454 -169 -465 -332 -4 410 311 -148 -151 12 180 83 86 -161 -379 -172 272 293 226 45 -129 -331 211 247 336
4477 336 -204 -91 -305 175 166 228 -36 -351 -312 44 139 340 95 -161 -152 6 59 329 79 -478 -1 153 335
4500 335 201 -96 -140 -406 70 70 213 -60 -216 -136 136 473 139 -49 -45 -183 231 262 88 -73 -380 -190
4522 -190 -57 407 222 18 -254 -412 -131 249 6 143 -247 -187 189 288 147 -85 -349 81 -122 607 72
$$ packed form
4367A50K00l07k20po5K60K21O9m85k26L35J48K48J26l66m70K09M70k21Qn6p2j47
4390a98L23J07k56j48J31k89K01M97n8m20l43M91k44K63K09l99p7pK60L25k13
4411A55n5j09k65L37Q2j17o7k98K65R5K62p7k53q3j55L82K80k61j29j40o9K59
4433C9K99q6k81m21J83J82K23k76J31k48N9L39J26j02j19k90j08M12J78J32n41
4454a69k96J33L28M14r9m59lJ63J68r7Lk47k18K07M44K1o7j81j74k02N42L6Q9
4477C36n40J13k14M80rO2k64l15L9L56R5K01k45k56RJ58N3K70k50n57M77J54J82
4500C35j34k97m4k66M76%J43k73j56Q0K72L37l34j88Mj38M14L1j74j61l07J90
4522a90J33M64j85k04k72j58K81L80k43J37l90O0L76R9j41k32k64M30k03P29n35
$$ plain form
4543 72 193 -274 -139 116 19 258 69 -202 -178 -119 131 235 -90 -350 -63 -285 325 77 54 -255 -161 162
4565 162 158 417 18 -105 -67 -102 134 -15 -129 -132 -89 94 272 93 -33 -313 -328 102 285 239 -89 -106 -49 -189
4589 -189 131 371 -271 -52 -217 -1 62 165 -101 -309 -51 253 107 281 -29 -327 -361 -80 107 335 -8
4610 -8 -238 -348 -7 207 163 91 -365 -320 147 298 280 22 -523 -233 178 6 185 11 -15 -184 163 199 103
4633 103 79 -227 -418 0 356 -57 11 -98 -209 347 54 228 151 -203 -40 206 338 458 199 -34 -233
4654 -233 -45 223 230 -121 -340 -136 -187 189 335 -81 -227 -199 13 112 361 -109 -273 -18 -152 126 257 12
4676 12 -137 -286 -136 65 140 -196 -234 -90 -130 206 164 97 -32 -185 -141 233 422 -139 -220 -244 138 186 339
4699 339 79 -232 35 170 515 342 -74 -287 -158 264 -30 191 -122 -238 -36 337 357 233 109 -238
$$ packed form
4543G2J21m67J35K55r7K39j89k71K4N9K50J04l25k60K87k22O10k48k3l09R4L23
4565A62mK59l99j23L8l5K36j49j14lM3J83J78j79j26k80j5M30J83m6l28j7N7j40
4589a89L20K40o42K19j65K16O3J03k66k08K58L04j46J74l10k98l4K81J87K28l43
4610hk30j10L41K14m4p2m56M5M67J51j8k58n45K90M11j72J79j74k6j69L47L6r6
4633A03k4l06j91M18L56m13O8j09j11N56k93J74p7l54J63K46J32J20k59k33j99
4654b33J88K68Pl51k19K04n1L76J46m16j46K8K12R9K49m70j64K55j34K78J31k45
4676A2j49j49J50K01P5l36l8J44m0L36m2o7j29j53M4L74J89n61q1k4L82M8J53
4699C39k60l11K67J35L45j73m16k13J29M22k94K21l13j16K02L73K0j24j24l47
$$ plain form
4719 -238 34 169 157 70 97 -384 -466 -91 299 6 83 -282 -206 19 89 250 -67 -44 -218 36 153 240 -102
4742 -102 -126 -171 104 162 -7 -11 -258 -60 -167 115 183 -27 -121 -96 239 -16 279 -258 -227 -191 -68 100 204
4765 204 -75 -146 -6 287 472 118 66 -146 -25 -104 102 279 -108 -117 -297 3 25 166 257 14 -5 -36 148
4788 148 202 -50 -239 -282 0 464 -46 -124 -152 -175 -5 56 -41 -69 23 -153 -44 45 386 -29 -192 -232 151 88
4812 88 76 -112 -66 -182 48 151 -64 -29 -257 -220 -67 -48 150 209 -212 24 366 41 50 -234 -383 -91 203
4835 203 159 195 -37 -338 -233 70 118 -5 -48 -145 -171 127 167 3 -206 -76 -164 52 181 238 22 -288 -274
4858 -274 204 228 223 -55 -164 -251 167 160 -158 -55 -233 -356 113 279 -101 -38 -137 -315 88 210 216 115 -170
4881 -170 -264 99 -239 92 -35 -246 49 7 174 70 32 -255 -106 -54 115 267 -152 -203 -97 61 234 30
$$ packed form
4719b38K72J35j2q7K7m81q2L75L90k93P7l65P6K25P0J61l17K3j74K54J17Q7l42
4742a02k4m5K75N8j69mk47J98j07K82O8k10r4K5L35k55K95n37L1L6J23J68J04
4765B04k79p1J40K93J85l54n2k12J21p9K06J77l87rj80L00K2J41R1k43j9l1J84
4788A48N4k52j89m3K82M64n10p8k8k3J70O1r7k8R2j76J09Q9L41m15j63m0L83o3
4812H8j2j88M6j16K30J03k15L5k28L7J53J9J98N9m21K36L42l25Rk84j49K92K94
4835B03m4L6k32l01J05L03M8j23m3r7k6K98M0j64k09J30q8K16J29N7k16l10J4
4858b74M78K4nk78j09q7M18pl18J03j78j23M69J66l80O3r9j78M03J22Oj01k85
4881a70r4L63l38L31j27k11K95m2J67j04l8k87J49N2J69J52m19n1J06J58J73k04
$$ plain form
4903 30 43 -193 32 101 -132 158 -201 -211 -149 -117 182 106 -64 -356 -484 -76 212 189 -72 -75 -186 -51 46 133
4927 133 -131 -270 -151 48 349 247 21 -334 -239 75 118 88 71 -306 -124 -106 153 151 130 -417 -324 89 242
4950 242 196 -25 -211 123 16 332 236 31 -75 -231 -65 111 60 34 -63 1 141 267 130 24 -163 -362
4972 -362 163 64 216 -74 -346 -132 168 138 12 -231 -225 -174 -38 349 190 -97 -138 -185 118 241 72 41 -30
4995 -30 -206 -87 106 -19 97 -48 9 -30 249 424 -42 -352 -132 39 12 235 -195 -92 59 13 -19 210
5017 210 -17 -171 -130 -13 273 57 213 -237 -147 194 151 104 30 -304 -197 -110 148 -69 -154 -186 45 216 229
5040 229 246 95 -12 -98 215 105 83 4 -11 -72 -30 214 271 109 -85 -190 -108 144 140 57 -109 -53 64 405
5064 405 149 60 -143 -246 211 192 186 -164 -148 -192 32 71 49 -55 28 -211 43 467 154 23 70 -207 -87
$$ packed form
4903C0J3k36K25O9k33K90l59j0O2L2K99p6j70k92j28M08K88k3k61lj11J35R7Q7
4927A33k64j39J19J99L01j02k26l55R5L14M3l0j7l77J82J8K59kk1n47R3M13J53
4950B42m6k21j86L34j07L16r6k05j06j56J66J76n1k6r7O4J40J26j37j06j87j99
4972c62N25r9J52k90k72K14L00l0j26k43ON1J36L87j59k87m1m7L03J23j69l1p1
4995c0j76J19J93j25J16j45N7l9K79J75m66l10K20J71k7K23m30J03J51m6l2K29
5017B10k27j54M1J17K86k16J56m50R0L41m3m7p4l34J07Q7K58k17q5l2K31J71J3
5040B29J7j51j07q6L13j10k2p9j5o1M2K44N7j62j94j05Q2K52mq3j66N6J17L41
5064D05k56q9k03j03M57j9ol50J6m4K24L9k2j04Q3k39K54M24l13j31M7k77J20
$$ plain form
5087 -87 190 126 121 1 -47 42 21 118 -1 44 -141 -99 299 -304 -56 -115 -81 72 135 291 -92 -190 -168 -62 128
5112 128 127 -96 -412 -240 117 277 234 -2 -145 -45 -73 -70 58 90 -185 -188 -67 226 169 48 85 -101 -69 238
5136 238 68 152 -281 89 210 380 188 -162 -72 39 -28 46 337 305 -138 -117 8 199 -117 -32 -254 -273 101
5159 101 178 -11 -26 -193 -124 110 -16 233 53 -449 19 -121 84 302 -332 -322 -188 -102 -66 -123 -275 -264 -277
5182 -277 -51 240 76 -110 -231 -117 -41 237 -204 -29 -72 -84 48 -111 -268 0 -217 -43 74 11 -45 -21
5204 -21 -62 -60 -91 -8 243 4 -168 -72 105 37 138 -170 -435 -265 178 51 176 355 -11 -8 203 20 114 -12
5228 -12 -117 -129 -6 -8 186 44 -277 -94 -206 154 -37 -357 -187 -308 8 359 42 178 162 -239 81 136
5250 136 135 -128 -125 212 164 11 66 3 -260 0 165 262 234 8 -150 -42 145 -18 -177 -27 -244 -295 -102
$$ packed form
5087h7K77o4nj20m8Q9k1R7j19M5j85M2L98o03K48n9L4J53O3J56l83r8K2J06J90
5112A28jk23l16J72L57J60m3k36j43J00k8LJ28L2k75lJ21K93n7j21L7j86L2L07
5136B38j70Q4m33L70J21J70j92l50R0J11o7P4K91l2m43K1J25J91l16Q5k22j9L74
5159A01P7j89j5j67O9K34j26K49j80n02M68j40K05K18o34J0J34Q6L6n7j52J1j3
5182b77K26K91j64j86j21J14P6K78m41J75m3j2J32j59j57K68k17J74J17o3n6K4
5204b1m1Kl1Q3K51k39j72R6J77o8J01l08k65J70M43j27J25J79l66LK11j83R4j26
5228a2j05j2J23kJ94j42l21J83j12L60j91l20J70j21L16L51l17J36j6m01L20N5
5250A36jk63LL37m8j53N5o3k63K60J65R7k8k26j58J08J87j63j59J50k17n1J93
$$ plain form
5273 -102 77 -22 -137 -26 -130 -67 149 138 120 74 137 100 -17 -41 -68 -40 -30 21 4 12 -49 -49 -151 -174 -48 13 8
5300 8 6 -183 -109 353 88 -312 -25 -218 228 45 237 -116 -171 -119 -249 142 -64 -131 -187 -528 221 111 329
5323 329 -9 -27 -240 -58 152 -118 -86 -152 -88 -114 29 12 50 -98 -333 12 219 -107 161 -157 -148 180 89
5346 89 100 84 -133 -75 116 53 208 -159 54 -160 201 -42 -16 58 26 52 -14 240 21 26 -131 -207 132 19
5370 19 197 255 -108 125 62 -189 137 42 -111 -243 -236 141 -10 340 -94 -38 112 -33 140 -83 -101 -22 88
5393 88 282 73 36 138 -129 -122 307 -110 30 -12 161 56 76 -28 -17 33 -189 -98 -19 -198 -322 -27 -75 68
5417 68 225 53 -131 60 3 -160 153 34 109 -160 38 196 -22 249 33 -162 -50 56 63 166 136 -46
5439 -46 -101 -5 83 98 -16 76 -225 -8 212 163 -110 -83 -85 -24 -5 -123 148 126 35 -68 58 -39 -188 75 -393
$$ packed form
5273a02J79r9j15J11j04O3K16j1j8m6O3l7j17k4k7K8J0N1j7Qo1%j02k3J26O1n
5300Hkj89P4M62k65m00K87j93M46j83J92l53n5N2j30L91k06o7n6l41P49j10K18
5323C29l38j8k13J82K10k70L2o6O4k6J43j7L8j48k35L45K07l26K68l18RL28r1
5346H9J1j6k17N8J91o3J55l67K13k14L61k43K6P4l2K6o6K54k19Nj57p6L39j13
5370A9J78N8l63K33o3k51L26r5j53j32PL77j51L50m34N6J50j45J73k23j8P9J10
5393H8J94k09l7J02k67PM29m17J40m2J73j05K0j04J1N0k22R1P9j79j24K95m8J43
5417F8J57j72j84J91n7j63L13j19P5k69J98J58k18K71k16j95J12J06PJ03l0j82
5439d6n5R6Q8J5j14R2l01K17K20m9k73K7kO1J9j18K71k2r1j03J26r7j49K63m68
$$ plain form
5464 -393 176 -93 -99 -144 -8 -108 -61 28 252 -139 -161 147 183 224 38 157 -107 89 62 -67 4 2 7 26 32 -83
5490 -83 98 23 -57 -65 -43 -20 34 106 -49 -274 -37 -59 115 214 -21 -156 -184 179 -77 30 308 -100 -88 184
5514 184 -151 164 -141 -37 -12 296 72 12 -106 84 28 177 181 -249 -199 -211 -27 65 120 -19 2 -131 -56 -49
5538 -49 98 -179 -278 44 -66 10 131 -371 -25 -215 159 -46 57 213 122 -142 55 100 -8 50 -118 19
5560 19 -18 166 145 -27 -125 -142 -185 -41 278 9 64 52 -70 -77 -43 -258 -182 -462 -252 -49 -177 -113 -82 -21 -31
5585 -31 172 361 117 -60 71 150 128 25 -89 -8 -136 -48 72 72 -33 107 80 125 196 -157 -89 -183 -126 -113 298
5610 298 68 10 -56 -135 197 231 163 -95 -265 -63 -202 -36 -43 -27 -119 46 -51 -37 225 -180 -72 -136 23 12
5634 12 65 -97 -107 71 66 -18 128 148 162 -92 -104 154 199 175 197 68 224 -78 -12 58 -106 211 183 63 34
$$ packed form
5464c93N69k69om5J36j00M7Q9K24l91k2L08L6M1j86J19k64J96k7j29P1kNJ9Oj15
5490h3J81p5q0qK2K3N4P2j55k25K37k2J74R9k35j35k8L63k56J07K78m08J2K72
5514A84l35L15l05J04K5L08k24o0j18J90n6J49Mm30N0j2J84R2N5j39K1j33P5P
5538d9J47k77r9L22j10P6J21n02L46j90L74k05J03J56r1k64J97M5j08N8j68J37
5560A9l7J84k1j72r8j7m3J44L19k69N5j2j22pL4k15P6k80K10K03j28O4L1O1j0
5585c1K03J89k44j77J31P9k2j03j14Q1j28Q8J20%j05J40k7M5P1l53O8r4N7J3M11
5610B98k30n8o6p9L32L4o8k58j70K02j39J66pJ6r2J65r7J4K62m05J08o4J59j1
5634A2N3j62j0J78nq4J46K0J4k54j2K58M5k4K2j29J56l02O6P0j64L17k8j20k9
$$ plain form
5659 34 59 42 24 332 -54 -27 -102 -158 -36 9 -22 241 -79 -174 15 -6 -56 128 -199 -45 -33 -10 126 41 128
5684 128 -103 49 99 -105 74 139 -1 -57 247 62 -37 9 -29 112 -146 -180 -45 74 -13 -174 110 25 396
5707 396 -171 -63 -30 119 -190 -12 -84 -26 -50 20 -18 -29 104 -123 66 -78 -116 9 -139 -174 -181 -137 70 165
5731 165 146 -194 169 160 -83 -38 140 -85 -120 152 -132 12 69 51 -89 205 91 -30 -163 -265 21 -252
5753 -252 95 214 -23 41 -82 -143 -120 -224 -109 -120 94 117 -120 -129 62 -5 1 -25 -123 -141 255 72 -54 -35 108
5778 108 -211 198 -255 -17 -172 12 65 -59 -24 121 101 -258 -31 -153 -56 -24 -12 -131 121 45 42 -118 -12
5801 -12 -12 -95 27 117 -23 -169 40 143 157 36 -39 -154 149 102 22 -82 -119 180 -3 -120 -102 -58 -85 192
5825 192 174 -68 -211 -21 96 103 74 218 213 -193 47 -98 154 100 102 65 52 -4 134 -199 -152 -74 26 -254 140
$$ packed form
5659C4K5j7j8L08l86K7p5n6J22M5l1K63l20r5J89k1n0J84l27J54J2K3J36q5Q7
5684A28k31J52N0k04J79O5j40n6L04j85r9M6l8J41k58l4J35J19q7j61K84q5L71
5707C96n67J08L3J49l09J78p2N8k4P0l8j1J33k27J89j44l8J25j48l5pM4K07R5
5731A65j9l40L63rk43M5J78k25l5K72k84J44N7j8j40K94j14j21j33j02K86k73
5753b52L47J19k37O4j23o1K3j04J15j1K14K3k37rJ91o7Ok6r8j8L96j83j26J9J43
5778A08l19M09m53K38j55J84N3j24L5J45k0l59K27j22R7L2J2j19K52p6lj60J06
5801a2%q3J22R0j40j46K09J03J4j21p5j15L03m7q0j04l7K99j83j17J8M4k7K77
5825A92j8k42j43J90J17Pk9J44nm06K40j45K52n4Kl7j3n6J38l33M7P8J00k80L94
$$ plain form
5850 140 -209 -28 49 46 88 99 -128 107 166 25 171 -127 73 -107 -211 -139 78 25 269 128 -109 121 97
5873 97 -96 105 -101 122 246 28 96 166 -27 60 27 -86 73 -320 104 1 17 -105 68 32 -69 -43 -157
5896 -157 -168 -197 -86 72 24 56 11 -155 299 -53 45 10 -162 63 16 -252 99 35 229 26 -140 10 -134
5919 -134 96 3 -240 -32 52 -244 -93 159 146 -159 -208 -130 -119 -87 -131 24 -78 12 -247 155 138 200 146 87
5943 87 -8 -245 -78 -175 13 133 -29 -39 24 170 115 -58 -40 -6 -115 -343 -1 177 77 -5 37 -19 -72 19
5967 19 216 118 68 140 58 60 -113 -1 183 191 -208 -82 -75 -118 -36 -11 69 38 65 12 -17 107 246 103 -36 -100 109
5994 109 -38 21 -148 -41 -335 31 -49 -137 -66 -221 141 0 -24 -225 -23 -19 147 -100 25 62 -140 -51 -34
6017 -34 -237 -121 -28 260 59 86 74 149 -207 -1 -29 -308 -17 78 -218 -127 178 17 -22 231 118 145 -80
$$ packed form
5850A40l49J81P7lM2J1k27K35N9j41J46k98K00j80j04P2K17n3K44j41k37K30k4
5873I7j93K01k06K23J24k18O8P0j93Q7l3j13J59l93M24j03J6j22J73l6j01K6j14
5896a57j1k9J11J58m8L2m5j66M54l52R8l5j72K25m7k68L51o4J94k03j66J50j44
5919a34K30r3k43K08Q4k96J51K52j3l05m9P8J1L2m4J55j02R0k59M02j7O2n4n9
5943H7r5k37J67r7J88J20j62j0O3J46n5j73J8L4j09k28L42J78j00q2M2n6n3R1
5967A9J97r8n0P2q2Kj73J12J84Ql99J26Pm3Q2K5Q0l1K7n3k9J24J39j43j39o4K09
5994A09j47N9j69J07k94L66q0q8P1j55L62j41k4k01K02MJ66k47J25L7k02Q9J7
6017c4k03J16R3K88k01K7j2P5l56K06k8k79K91R5k96R1L05j61l9K53j13K7k25
$$ plain form
6040 -80 -83 51 130 -151 6 300 41 140 107 77 -66 -31 212 -227 22 -34 -96 54 116 73 114 172 -349 124 84
6065 84 -28 33 -69 -100 -129 140 -108 -174 28 154 -219 115 35 -10 -75 72 -23 -31 -56 13 -27 226 62 -192 32
6090 32 -22 -46 67 100 -158 -66 207 -18 71 80 109 -217 -158 177 -73 30 77 -1 72 3 274 -37 -99 -208 -97
6115 -97 92 -131 36 176 193 -230 35 -153 160 146 164 73 -41 184 -91 107 61 -9 178 -69 -126 155 -154
6138 -154 -178 117 -73 -248 167 180 -58 -8 36 51 -113 33 -98 36 -260 -120 -41 -32 -78 -37 173 -172 2
6161 2 -56 55 -6 43 -47 -151 6 -105 32 -46 193 256 -15 -136 -16 -4 -7 125 -128 -130 -29 154 65 -9 -93
6186 -93 126 -30 97 -384 -66 99 4 1 -98 102 78 -173 144 184 28 112 -101 13 25 144 -41 -42 36 -163
6210 -163 235 130 -171 36 -256 53 11 -77 -94 -49 -163 42 -3 -113 170 -83 -7 63 59 149 178 105 -46 -176
$$ packed form
6040h0lJ34P9k81J57K94k59R9l3l0j43L5K43m39K49n6o2J50O2m3M1N8n21M73m0
6065H4j12O1j02l1k9K69k48o6K02J26l73L34q0m5o5J47r5qk5O9m0K53j64k54K24
6090C2n4k4J13L3k58R2K73k25Q9RK9l26N9L35k50J03M7p8P3o9K71l11o2j09J11
6115i7J89k23J67J40J7m23K65j88L13j4J8r1j14K25k75J98m6p0J87k47n7K81l09
6138a54k4K95j90j75M15J3k38N0M4J5j64J46j31J34k96J40P9Rm6M1K10l45J74
6161Bn8J11o1M9r0j04J57j11J37p8K39O3k71j21J20J2lJ32k53kJ01J83q9p4q4
6186i3K19j56J27m81L18J65r5lr9K00k4k51L17M0j56Q4k13J14J2J19j85jP8j99
6210a63L98j05l01K07k92L09m2q8j7M5j14K05m5j10K83k53P6P0mR0K9p3j51j30
$$ plain form
6234 -176 -79 -151 -39 53 -294 -157 211 -218 -15 68 -11 109 215 -142 -112 -28 -59 -69 -74 75 -153 161 233 125
6258 125 -45 -119 239 41 -25 86 19 -82 -51 139 -46 8 175 109 26 -105 -168 154 7 -75 43 13 102 -117
6282 -117 61 -46 174 69 177 -35 81 21 114 85 133 110 -104 -32 158 164 -38 112 -53 33 -186 24 -100
6305 -100 -130 74 -253 -57 -111 43 9 57 -64 -67 -27 -74 152 57 34 -205 208 13 -16 114 -62 20 -122 227
6329 227 -117 -140 -55 -27 -49 -142 19 31 87 -41 151 -180 10 -114 -75 203 140 358 87 57 -80 146 388
6352 388 -195 -138 243 -15 -171 55 63 170 -30 -87 49 175 74 66 85 -81 -57 0 -7 -248 -204 -26 -194 -1
6376 -1 251 83 -63 -158 66 366 -3 7 104 -123 -123 124 110 -80 36 -229 -157 -111 -59 -30 164 -75 -51 126
6400 126 -116 -5 49 235 218 -31 102 -58 -102 -62 92 147 -163 -2 37 -67 148 -38 21 -98 -18 195 -48
$$ packed form
6234a76R7p2J12R2l47J37L68m29K03Q3p9J20J06l57L0Q4l1j0nJ49k28L14P2j08
6258A25j70p4L58j98o6J11o7j01L1J90j85N4J67o6q3j31o3L22j47q2J18l0Q9k19
6282a17J78j07K20j05J08k12J16o0R3k9M8k3k14P2J90Ok02J50j65Q6k19K10j24
6305a00l0K04l27J96n4J54l4M8j21lM0m7K26r5k3k39M13j95k9J30j76Q2j42L49
6329B27l44k3Q5K8k2r3J61J2N6j28J92l31J90j24L9K78o3K18k71l0j37K26K42
6352C88n83N7L81k58j56K26QJ07k00n7J36J26j01qJ9j66K4N7pk41M4J78j68J93
6376aK52j68j46r5K24L00l69J0R7k27%K47j4j90J16k65P2M6N2K9J94k39K4J77
6400A26k42J11N4J86j7k49J33j60m4M0J54N5l10J61L9j04K15j86N9j19Q0K13k43
$$ plain form
6423 -48 213 274 -45 41 145 -49 47 158 48 -158 114 -62 -10 -102 -41 -132 158 -78 107 230 -74 -53 130
6446 130 -125 296 26 -89 -29 -46 231 127 37 -67 171 -135 -43 154 105 -92 26 -206 59 211 -25 -84
6468 -84 -48 128 145 47 32 -318 -3 158 -157 72 -78 14 -65 52 -73 160 203 -199 -151 -221 131 257 115
6491 115 -24 -44 142 -7 -56 327 117 -15 -233 123 222 56 252 136 -98 -106 92 26 -178 102 -92 -100 145
6514 145 -169 -217 -76 237 -218 62 80 -248 -48 -11 46 198 93 -243 -2 -204 -168 127 -220 -26 -73 168
6536 168 299 29 -161 -164 34 127 66 -22 46 -171 158 113 202 -42 286 114 -19 -63 34 -107 113 -62 -52 52
6560 52 103 189 185 -108 -15 72 140 89 -106 -88 46 32 -226 -91 -194 -137 -31 103 340 173 199 -63 -126 -228 -168
6585 -168 106 51 -204 -10 111 -217 110 30 65 -141 -227 38 160 240 -146 -82 -123 76 30 153 -110 130 -103
$$ packed form
6423d8K61O1l19Q6J04j94R6J11j10k06K72j76N2r2O1r1K90k36J85J23l04K1J83
6446A30k55M21k70j15O0j7K77j04r0j04K38l06R2J97m9j97J18k32K65J52k36n9
6468h4L6J76J7r8j5l50L15J61l15K29j50R2p9J17j25K33M3m02M8p0L52J26j42
6491A15j39k0J86j49m9L83k10j32k18L56R9j66J96j16k34qJ98o6k04K80j94qK45
6514A45l14m8J41L13m55K80J8l28K00L7N7J52j05l36K41k02L6K95l47J94m7K41
6536A68J31k70j90lJ98R3o1q8O8k17L29m5Q9k44L28j72j33m4R7j41K20j75J0J04
6560E2N1Q6mk93R3Q7O8n1j95J8J34j4k58J35j03N7J06J34K37j67K6k62o3j02O0
6585a68K74n5k55J94J21l28L27q0L5k06q6K65J22Q0l86O4m1J99m6J23k63K40k33
$$ plain form
6608 -103 -116 -29 104 -32 -182 154 -141 62 -219 -50 31 -223 15 -43 -44 192 -151 -3 161 51 -52 -347
6630 -347 -26 13 94 7 99 46 40 38 254 44 -166 -191 -54 212 14 152 -110 162 0 -99 -12 170 55 -92
6654 -92 113 -9 144 127 89 -114 157 163 -37 45 -48 -4 -103 -40 253 48 -81 -228 -36 -277 183 145 121 -129
6678 -129 -72 -45 188 159 -154 -190 -144 272 -13 284 203 4 -76 -171 72 23 -42 -64 -39 98 31 -98 50 -239
6702 -239 78 107 -80 15 6 -2 -181 -102 102 148 3 -70 -190 117 149 -108 54 -56 -52 69 -228 23 -37 -278
6726 -278 -105 -75 332 -90 -77 -164 -67 -125 -35 307 -77 -125 48 -38 271 -167 113 46 5 -120 42 116 -115 -264
6750 -264 -5 -92 204 81 -324 -94 -97 75 -99 -29 -6 20 82 -119 46 -5 -9 70 25 161 -59 -33 -273 -244 -20
6775 -20 -15 148 134 40 173 26 92 75 173 356 -40 52 88 153 -260 -104 -20 -91 -185 80 133 69 49 -135 -98 182
$$ packed form
6608a03j3Q7J33j36j50L36k95K03k81J69Q1k54K38n8jK36l43J48J64j10j03k95
6630c47L21L9Q1q7R2n3okK16k10k10k5J37K66j98J38k62K72j62r9Q7J82j15j47
6654i2K05j22J53j7l8k03K71Ok00Q2r3M4r9O3K93k05j29j47J92k41M60l8k4k50
6678a29N7K7K33k9l13l6M6M16k85K97q1j99q0r5K43m9o5k2K5J37o7j29J48k89
6702b39L17K9j87R5rqj79P9K04M6j45p3j20L07L2k57J62j10MJ21k97K51o0k41
6726b78J73L0M07m22J3q7R7n8R0L42l84m8J73q6L09m38K80o7m1j25J62P4k31j49
6750b64K59q7K96j23m05K30lJ72j74P0K3K6O2k01J65n1mP9m5J36k20K6k40K9K24
6775b0NJ63j4r4J33j47O6j7R8J83l96R2L6O5m13J56Q4p1r4K65N3o4k0j84L7K80
$$ plain form
6801 182 -170 128 36 -26 -39 49 -47 -49 -98 -254 -117 128 -204 -10 -119 -27 83 11 -111 82 -52 -79 12 89
6825 89 131 -63 85 -33 72 286 71 -154 15 -49 -158 10 22 -223 -180 -96 -13 30 162 -66 83 16 -193
6848 -193 20 -50 140 -26 -60 215 -53 229 77 -149 -205 -50 -101 178 -169 -98 -35 156 -22 142 -3 50
6870 50 -85 83 240 153 33 -84 -122 -51 50 224 -105 -18 66 27 -144 118 313 28 150 -282 120 -134
6892 -134 -101 -101 -75 -180 237 127 -30 54 -251 -48 121 180 56 -77 -237 21 140 -122 205 33 -4 -120
6914 -120 -49 6 64 -22 24 -220 144 42 -27 17 -95 -108 -16 -35 -28 -197 -113 66 -50 143 118 -146 2 -189 23
6939 23 -29 306 -25 -170 35 156 119 201 -66 117 -130 165 241 -49 -124 -117 159 100 132 153 -39 -114 15 -73
6963 -73 -4 -67 -197 -107 203 84 -74 -124 -161 -146 49 -9 -62 -55 46 176 53 87 -144 87 -70 -149 85 138 -7
$$ packed form
6801A82l52K98r2o2j3Q8r6km9j56J37K45l32J94j09R2J10p2j22J93j34k7R1P7
6825H9M2j94J48j18J05K14k15k25J69o4j09J68J2k45M3Q4Q3M3J32k28J49o7k09
6848a93K13p0J90j66l4K75k68K82j52k26n6J55n1K79l47P1O3J91j78J64j45N3
6870E0j35J68J57q7j20j17l8P1J01J74l29Q7Q4l9j71K62J95k85J22m32M02k54
6892a34L3%K6j05M17j10j57Q4l05K03J69N9j24j33j60K58J19k62L27j72l7j16
6914a20P1N5N8q6M6k44L64j02o9M4j12j3R2j9Pj69Q4J79j16J93k5k64J48j91K12
6939B3n2L35l31j45K05J21l7Q2k67J83k47K95P6k90p5PK76n9L2K1j92p5J29q8
6963g3O9o3j30R0L10j19j58n0l7J5J95n8n3PJ01J30j23L4k31K31j57p9K34N3j45
$$ plain form
6988 -7 84 -3 60 45 89 224 -9 167 58 139 -17 -71 -21 7 -119 -13 218 218 -59 -230 -126 -87 99 154 99
7013 99 186 -133 190 229 222 49 -37 110 112 204 137 8 -159 -116 -38 171 221 -35 -12 -337 85 186 69 62 -1 24
7039 24 -77 199 33 133 -115 26 -186 70 179 -212 -36 41 59 236 272 -28 -195 -88 -37 47 79 -213
7061 -213 126 263 212 137 46 75 -153 -180 256 84 164 38 -132 -169 -137 22 -10 133 -121 -219 -29 204 279 34
7085 34 -51 -35 117 -64 -20 113 99 125 -232 174 271 86 -110 -77 90 135 -51 -218 -24 -38 -244 123 -89
7108 -89 43 -194 -144 37 173 -83 95 -291 80 21 251 -73 -151 -142 -92 165 -52 124 -143 -20 -35 -21 130
7131 130 98 -222 -10 40 9 100 274 -21 -115 -133 -81 0 6 76 -6 128 150 97 80 -33 -161 2 -224 -26 117
7156 117 34 11 20 298 4 33 9 -74 -320 -157 264 -38 -46 -44 -257 283 281 163 48 -235 -96 -52 193 -12 -35
$$ packed form
6988gR1q7O3j5M4J35k33J76j09Q1j56n4N0K8j26J06K31%k77j71J04L9J86N5n5
7013I9Q7l19L23L9pj73q6J47KR2o7j29j67M3P8K09N0k56K3l25M22J01j17po3K5
7039B4j01K76j66J00k48J41k12K56J09l91J76P7J8J77L6l00j67J07N1Q4L2k92
7061b13L39J37n1p5r1K9k28k7M36j72Q0j26j70l7L2J59l2J43k54r8J90K33P5k45
7085C4q5J6J52j81M4J33j4K6l57M06R7j85j96L3J67M5j86j67J94j4k06L67k12
7108h9J32k37N0J81J36k56J78l86L71n9K30l24p8RN0K57k17J76k67J23j5J4J51
7131A30l2l20K12N0l1R1J74k95r4j8N2Q1OP0q2J34K2n3j7j13j28J63k26J98J43
7156A17q3k3RK78k94K9k4q3k46J63M21l02qKk13N40kj18j15k83J39M4K45k05k3
$$ plain form
7181 -35 -299 -118 -64 137 -94 -180 56 -219 68 5 96 -266 -142 -77 180 33 -40 74 -15 -272 126 110 -28
7204 -28 170 -103 56 119 -127 70 107 221 -67 -12 150 -138 14 -36 -12 119 81 134 63 24 -117 201 -161
7227 -161 233 152 19 -42 -78 39 -27 179 -104 -306 129 -188 2 -48 -306 0 8 48 136 -156 -63 -153 -35 246
7251 246 -15 110 -139 18 -49 163 -75 -1 83 -221 54 237 50 141 -187 -190 -46 -30 24 38 -156 -174 9
7274 9 -21 40 -131 -209 136 -55 198 97 185 -156 -72 11 241 -45 -42 -66 162 111 -19 265 -227 -93 -213 198
7298 198 122 259 92 -169 -155 -179 167 78 -114 -173 -189 76 240 175 -2 28 120 52 128 62 -149 -55 53 26 17
7323 17 -55 192 -73 100 11 -55 269 -28 170 117 16 -18 179 31 -191 -75 -27 68 0 -136 -207 -286 284 -222
7347 -222 342 29 94 -179 101 188 153 183 -375 -235 62 204 77 -23 -155 21 160 103 118 -113 -132 -195 30
$$ packed form
7181c5k64J81N4K01k31q6K36k75K87o3R1l62J24O5K57j47p3J14q9k57L98j6j38
7204b8J98k73J59O3k46J97L7J14k88N5J62k88J52n0K4J31l8N3p1l9j41L18l62
7227a61L94q1j33o1l6J17o6K06k83k02M35l17J90n0k58L06QM0Q8k92R3r0J18K81
7251B46k61J25k49J57o7K12k38P4Q4l04K75J83j87R1l28lJ44J6N4J4j94j8J83
7274Il0O1j71p8L45j91K53j01Q8l41Q4Q3K30k86Lk4K28n1j30K84m92J34j20M11
7298A98p6J37j67k61J4k4L46q9j92n9j6K65J64o5j77L0R2o8P6o6k11R4J08k7r
7323A7p2K47k65J73q9o6L24k97J98n3j01l4J97j48k22J16M8R5o8j36p1p9N70n06
7347b22N64l13O5k73K80Q7l5L0n58J40K97J42j27j00j32J76J39n7J5k31j9o3K25
$$ plain form
7370 30 259 51 94 108 -46 148 -8 110 40 22 -294 -63 -159 101 40 -11 -45 276 392 237 -25 -50 -65 73
7394 73 257 -6 -56 -200 -215 -96 220 258 141 51 -134 -37 32 -190 -236 124 -24 237 142 274 117 -92 -265
7417 -265 281 -43 120 -155 -87 -142 -128 146 -118 143 -228 -290 -5 227 234 -93 -276 121 66 312 -23 -330
7439 -330 15 -248 -186 143 -109 13 24 -322 -5 145 -36 5 -320 -79 3 -52 -3 -25 -1 -158 -220 -97 260
7462 260 88 -141 11 134 62 123 262 -153 21 189 -16 -59 -25 -316 -198 50 161 -25 -16 -130 -164 -242 -27
7485 -27 202 -12 -164 -193 81 77 111 -237 -12 37 -146 -42 123 65 -270 -95 -120 330 82 59 46 -238 161
7508 161 -27 191 -76 2 105 -170 7 8 -95 -288 -28 52 65 6 -31 81 -112 25 12 -176 31 135 195
7531 195 -76 6 105 -103 -90 7 32 348 153 162 -44 16 225 -108 20 -169 -90 -117 -34 265 62 -150 -30 -367
$$ packed form
7370C0K29k08M3J4j54J94j56J18p0j8l16K31r6K60o1n1l4L21J16j55k62k5j5J38
7394G3J84k63n0j44j5J19L16L8j17r0j85R7O9k22m6L60j48K61r5J32j57k09j73
7417b65N46l24J63k75O8n5J4K74k64K61l71o2K85K32Pl27j83L97n5K46l35l07
7439c30L45k63O2L29k52J22J1l46L17J50j81M1l25K41Q2n5M9k2K4j57o2J23L57
7462B60j72k29J52J23p2O1J39m15J74J68k05m3L4k91J18K48J11j86Rj14l4p8K15
7485b7K29k14j52k9K74mL4l48K25M9j83J04J65n8l35J75k5M50k48k3j3k84L99
7508A61j88K18k67P8J03k75J77Jj03j93K60Q0J3n9l7J12j93J37j3j88K07J04O0
7531A95k71Q2R9k08J3R7K5L16j95Rk06O0K09l33J28j89P9k7Q3K99k03k12J20l37
$$ plain form
7555 -367 148 54 63 -104 -102 -173 273 130 214 95 -204 -54 64 197 221 -26 117 128 146 193 70 -66 -138 -126
7579 -126 -43 193 183 -72 -115 -1 -129 234 55 4 -367 -163 -109 -113 -58 -140 4 -87 109 76 -124 235 -21 297
7603 297 39 -233 96 3 -167 -197 80 96 -59 80 -85 66 -205 347 11 -29 -192 -72 -67 329 191 -139
7625 -139 -8 -112 35 233 161 -104 -282 -9 -137 -110 -35 101 102 -76 245 225 133 -86 16 -217 216 239 133
7648 133 -97 -187 76 -171 258 135 120 -279 -306 -19 339 55 -55 -264 -76 76 453 82 24 63 -344 78
7670 78 214 108 48 -65 4 -13 235 268 -128 -140 -28 73 221 -75 -2 -77 -148 -35 151 111 -12 104 -253
7693 -253 72 106 42 172 -200 -134 -129 343 144 323 14 4 -135 98 300 112 147 -176 158 197 91 195 17
7716 17 -201 -78 -71 132 134 84 -52 187 8 76 107 -168 -75 7 224 195 -307 -74 -142 -181 94 126 -19 -205 142
$$ packed form
7555c67N15r4Rj67Kp1M46j43Q4j19k99J50J18J33K4k47J43J1J8M7j23j36p2J2
7579a26Q3K36j0k55m3J14j28L63j79n1l71K04N4mN5q2J44r1J96l3k00L59k56L18
7603B97k58k72L29r3j70l0K77J6j55J39j65J51k71N52l36m0j63J20NL96j38l30
7625a39J31j04J47J98p2k65j78K73j28K7P5J36Jj78L21k0r2k19J02k33M33K3j06
7648A33k30r0K63k47M29j23j5l99k7K87L58k84j10k09J88J52L77l71n8L9m07M22
7670G8J36j06o0j13O9j7K48L3l96j2J12J01J48k96P3p5p1J13J86m0j23J16l57
7693b53L25L4o4J30l72O6NM72j99J79l09j0j39K33K02j88L5l23L34L9j06J04j78
7716A7k18J23PK03Kn0j36K39j79O8L1k75R3Q2K17k9n02K33o8l9K75L2j45j86L47
$$ plain form
7741 142 -132 190 -9 -43 -206 -114 -103 168 37 91 -66 -87 -77 360 230 -8 -276 -180 -43 76 237 76
7763 76 -194 -76 -76 192 264 -29 -159 -65 -210 120 116 -114 40 -182 146 125 397 -277 -52 9 206 373 -24
7786 -24 166 103 -55 61 136 145 -107 -186 -121 36 218 250 -24 -356 1 99 -59 182 -153 58 -192 67 -194
7809 -194 114 126 100 -216 -135 102 -157 -44 -30 -363 -97 116 250 -4 -178 -204 15 11 32 71 -150 -284 90
7832 90 145 -33 32 -131 -45 5 35 277 -5 -367 49 68 1 120 16 56 -63 -109 84 110 -71 -49 -454 -173
7856 -173 212 -15 -52 -83 -145 42 158 -38 147 -103 -284 77 336 247 -75 -56 -77 -109 60 -68 242 55
7878 55 -154 21 146 96 -149 -106 -36 249 84 73 -79 -203 -185 -144 96 84 -334 -54 -326 45 148 219 126
7901 126 -35 -65 179 -109 141 -102 -152 6 268 17 75 -210 -143 -181 70 121 270 -80 31 -89 195 283
$$ packed form
7741A42k74L22j99l4j63R2J1K71j31N4j57k1J0M37j30k38k68R6J37J19J61j61
7763G6k70J18%K68P2k93j30R4j45L30mk30J54k22L28k1K72o74K25O1J97J67l97
7786b4J90o3j58J16P5Rk52p9O5J57J82L2k74l32L57R8j58K41l35K11k50K59k61
7809a94L08J2k6l16Q1K37k59J13J4l33K66K13J34k54j74k6K19mK1L9k21j34L74
7832I0N5j78O5j63Q6N0L0K42k82l62M16J9o7J19j04M0j19m6J93K6j81K2m05K81
7856a73L85k27l7l1o2J87J16j96J85k50j81L61K59q9l22J9k1l2J69j28L10j87
7878E5k09J75J25n0k45M3P0K85j65j1j52j24J8M1K40j2m18K80k72L71J03P1r3
7901A26j61l0K44k88K50k43n0J58K62k51N8k85O7l8K51N1J49l50J11j20K84Q8
$$ plain form
7923 283 20 183 63 -184 115 -104 153 -56 -417 -246 136 162 37 -115 -24 -53 36 238 100 -99 -66 -148
7945 -148 7 76 133 45 -302 -26 -32 15 -241 56 -187 -2 345 47 26 145 -118 59 -18 -30 195 -27 -341
7968 -341 -104 134 160 132 1 -251 -79 -116 61 37 -139 -135 -320 51 328 385 -69 -99 -93 -30 54 -80 -64 70
7992 70 186 213 152 217 -165 -87 -99 -64 228 87 -53 -415 -36 -38 93 12 194 -227 -266 30 -73 -8 -27 -101 -208
8017 -208 84 514 250 -61 -33 -176 85 28 -241 -38 -63 -141 -71 282 259 107 -32 -317 226 95 -37 94
8039 94 -5 -99 237 215 66 -50 -1 -210 -130 552 254 -82 -68 186 98 203 19 -118 -56 -212 51 -44 -59 -94
8063 -94 -157 -253 131 149 150 -7 -185 -240 -205 12 194 52 -85 -150 -73 15 -150 147 -34 51 147 9 -49 29 -287
8088 -287 -73 -189 100 -3 -227 108 -13 -114 254 208 -70 -43 -80 -149 116 -55 -25 -84 -140 -243 184 25
$$ packed form
7923B83k63J63j20k47K99k19K57k09l61J71L82K6j25j52R1k9Q9K02j38j99L3q2
7945a48J55O9N7q8l47K76oM7k56K97k43J85L47k98k1J19k63J77p7j2K25k22l14
7968c41K37K38K6k8j31k52J72l7J77k4j76Mj85L71K77N7m54l0OO3Q4j34J6J34
7992G0J16K7o1O5l82P8j2L5K92j41j40l62L79kJ31q1J82m21l9K96j03O5j9p4j07
8017b08K92M30k64l11K8j43K61n7k69K03k5p8P0L53k3j52j39k85N43j31j32J31
8039I4r9r4L36k2j49j16M9k09Q0O82k98l36J4K54q8J05j84j37O2j56K63r5j5l5
8063i4o3r6L84J8Jj57j78n5L5K17J82j42j37o5P7Q8j65K97j81Q5R6j38n8P8l16
8088b87K14j16K89j03k24L35j21j01L68m6k78K7l7o9K65j71L0n9n6j03M27j59
$$ plain form
8110 25 35 204 -274 -114 72 58 147 -72 28 -16 179 119 -67 -55 -41 -250 343 306 161 -212 -90 108 165
8133 165 -67 40 -150 -78 15 -38 -52 -314 -326 -177 94 22 -199 8 140 -134 -145 102 139 106 -199 59 100
8156 100 215 159 170 119 -84 57 60 97 -71 -440 -119 -11 181 -52 7 -314 55 -92 93 190 -76 -58 -173
8179 -173 -113 19 156 80 -190 -381 26 122 22 -331 -194 66
$$ packed form
8110B5J0J69m78J60J86j4Q9k19J00m4J95o0j86J2J4k09N93l7j45l73J22J98N7
8133A65k32J07j90P2R3n3j4k62j2J49K71p2k21K07J32k74j1K47L7l3l05K58M1
8156A00J15n6J1n1k03J41LL7j68l69L21J08J92k33N9l21L69j47J85R7k66J8j15
8179a73O0J32J37p6k70j91M07R6j00l53J37K60
8191F6
$$ Imaginary data points
##PAGE= N=2
##DATA TABLE= (X++(I..I)), XYDATA
$$ plain form
0 0 0 0 0 0 0 0 0 0 0 0 0 0 0 0 0 0 -3 8 -8 8 -8 8 -11 16 -16 19 -24 25 -32 34 -40 45 -51 59 -66 75 -83 92
38 92 -103 116 -128 142 -158 176 -194 215 -236 261 -286 317 -349 384 -424 468 -518 573 -635 709
58 709 -793 893 -1012 1158 -1348 1589 -1920 2408 -3192 4658 -8391 43323 56539 -134 -7274
73 -7274 -17894 18376 39600 35067 13507 -24345 -28139 16150 34401 32458 2958 -27130 -18575
86 -18575 5598 30208 39349 -417 -28326 -18672 6499 35144 29465 -1860 -19084 -26916 2268
99 2268 37348 25419 -2728 -26619 -26281 7965 24799 23173 3562 -31869 -26581 6512 25858
112 25858 25918 -5553 -28503 -19074 -1686 25436 27839 -7195 -28035 -25012 738 27798 16929
125 16929 -5722 -24313 -30496 -204 24921 18603 -4168 -30581 -24648 5066 19491 22058 194
$$ packed form
0@%%%%%%%%%%%%%%%%lJ1j6J6j6J6j9K7l2L5m3M9n7O6p4Q5r6J10j25J41j58J75
38I2j95K19k44K70l00L34l70M09m51M97n47O03o66P33q08Q92r86J091j208J344
58G09j502J686j905K170k506K937l509M328n600P850j3049N1714J3216n6673p140
73g274j0620L6270K1224m533k1560l7852l794M4289J8251j943k9500l0088Q555
86a8575K4173K4610R141l9766k7909R654K5171K8645n679l1325j7224p832K9184
99B268L5080j1929k8147k3891L38L4246J6834j626j9611l5431N288L3093J9346
112B5858O0l1471k2950R429J7388K7122K403l5034k0840L023K5750K7060j0869
125A6929k2651j8591o183L0292K5125o318k2771k6413N933K9714J4425K567k1864
$$ plain form
138 194 -28084 -21299 3038 25800 25140 -5473 -22772 -18102 -577 25453 22692 -4308 -24196
151 -24196 -25138 1396 23735 15103 -3723 -24733 -26597 798 19638 18965 -2933 -28239 -20810
164 -20810 2719 18800 21620 -2097 -23725 -19375 287 24267 21864 -4547 -20478 -19305 652
177 652 23156 19684 -869 -21093 -21855 3928 22726 18769 281 -20871 -18856 3693 21617
190 21617 22659 -76 -21194 -16459 2977 21824 21821 -1035 -18961 -18066 957 22649 19620 -1745
204 -1745 -18956 -18801 2068 21403 19036 575 -19034 -18313 3950 21376 20117 869 -18713
217 -18713 -16194 2909 20585 20902 -136 -18898 -16665 1597 20376 18750 -1539 -18776 -18763 382
231 382 19376 17177 -1669 -19338 -19100 959 18379 17173 -1285 -19502 -18033 996 18141
$$ packed form
138A94k8278O785K4337K2762o60l0613j7299M670J7525K6030k761k7000j9888
151b4196r42K6534K2339q632j8826k1010j864K7395J8840o73k1898k5306P429
164b0810K3529J6081K820k3717k1628M350J9662K3980k403k6411j5931J173J9957
177F52K2504l472k0553k0224p62K5783J8798l957j8488k1152K015K2549J7924
190B1617J042k2735k1118M735J9436J8847lk2856j7926Q95J9023K1692l029k1365
204a745j7211J55K0869J9335k367j8461j9609P21K2263J7426j259j9248j9582
217a8713K519J9103J7676L17k1038j8762K233J8262J8779j626k0289j7237J3J9145
231C82J8994k199j8846j7669K38K0059J7420j206j8458j8217J469J9029J7145
$$ plain form
244 18141 17547 -1139 -19023 -17248 748 18468 17518 -1440 -18306 -17548 425 18140 16577 -1371
258 -1371 -18305 -18019 925 18151 16399 -988 -18316 -17498 921 17116 16626 -1533 -18306 -17262
272 -17262 383 17047 16156 -1531 -18198 -17420 245 16941 16000 -1760 -18110 -17442 152 17051
286 17051 15740 -1546 -18231 -17189 376 16604 15825 -1257 -17692 -16740 650 16894 15830
299 15830 -1123 -17296 -15954 910 16703 16100 -1196 -17059 -16025 839 16609 15375 -1260
312 -1260 -16885 -16171 516 15876 14751 -1508 -17698 -16278 38 15555 14791 -1637 -17256
325 -17256 -16099 299 15756 14876 -1556 -16586 -15722 85 15954 14649 -1173 -15936 -15801 378
339 378 15841 14434 -1072 -16411 -15648 596 15469 14901 -786 -16293 -14494 916 15652 15615
$$ packed form
244A8141n94j8686j7884J775J7996J7720r50j8958j6866P58J7973J7715j563j7948
258a371j6934K86J8944J7226j752j7387j7328Q18J8419J6195m90j8159j6773J044
272a7262J7645J6664q91j7687j6667P78J7665J6696r41j7760j6350O68J7594J6899
286A7051j311j7286j6685J042J7565J6228p79j7082j6435R52J7390J6244j064
299A5830j6953j6173J342J6864J5793o03j7296j5863J034J6864J5770j234j6635
312a260j5625P14J6687J5360j125j6259j6190J420J6316J5517p64j6428j5619
325a7256J157J6398J5457q80j6432j5030Q64J5807J5869j305j5822j4763J35J6179
339C78J5463j407j5506j5339P63J6244J4873n68j5687j5507J799J5410J4736l7
$$ plain form
353 15615 -814 -15489 -14056 514 15861 14807 -1261 -15046 -14738 546 15673 13670 -947
366 -947 -15372 -15669 916 15010 13836 -385 -15462 -13747 1285 15171 15983 364 -14387 -12430
380 -12430 1596 16254 15855 35 -12866 -13132 728 16505 14660 -407 -14090 -14392 1396
393 1396 14715 13040 342 -14751 -14700 1407 14245 14423 -3 -14506 -11894 982 14719 15931
407 15931 239 -13072 -12048 1349 16478 14403 -329 -11479 -12786 1407 15919 14237 1091
420 1091 -13033 -12857 3635 14706 14349 2583 -12782 -11373 2645 15107 16389 215 -12900
433 -12900 -10137 734 14406 14563 -707 -12699 -13515 -213 15134 11123 -1437 -12361 -14557
446 -14557 455 12962 12481 1112 -14711 -12749 2456 12534 13371 602 -13367 -11439 -252
$$ packed form
353A5615j6429j4675J433J4570J5347j054j6068j3785L08J5284J5127k003j4617
366i47j4425k97J6585J4094j174j4221j5077J715J5032J3886Q12j5619j4751J957
380a2430J4026J4658l99j5820j2901k66J3860J5777j845j5067j3683l02J5788
393A396J3319j675j2698j5093N1J6107J2838J78j4426j4503K612J2876J3737J212
407A5931j5692j3311J024J3397J5129k075j4732j1150j307J4193J4512j682j3146
420A091j4124J76J6492J1071l57j1766j5365J409J4018J2462J282j6174j3115
433a2900K763J0871J3672J57j5270j1992q16J3302J5347m011j2560j0924k196
446a4557J5012J2507m81j1369j5823J962J5205J0078Q37j2769j3969J928J1187
$$ plain form
459 -252 13630 14387 -2330 -13259 -11977 -1560 12253 10912 -1809 -13310 -15923 -974 12323
472 12323 9164 -1542 -14070 -13817 188 10251 12461 450 -15325 -11895 1278 11471 12869
485 12869 -853 -11895 -11015 -1598 13844 13596 -1949 -11245 -11532 606 13512 11255 1648 -10822
499 -10822 -13253 2698 14048 12317 1446 -11667 -9739 2033 11277 14244 518 -13209 -10452
512 -10452 397 12252 11744 -2062 -11004 -11700 -1692 12936 11249 -1405 -11465 -12464 1406 12275
526 12275 10518 2412 -10970 -11911 2227 12610 12836 715 -11991 -8952 70 10452 13100 -848
540 -848 -12506 -11343 -1006 11991 9987 -2093 -10071 -12529 -1308 11760 10136 158 -11747 -11966
554 -11966 1853 10402 10435 1431 -11523 -10834 458 11132 12570 -759 -11609 -9502 -900 10777
$$ packed form
459b52J3882P57j6717j0929J282J0417J3813j341j2721j1501k613J4949J3297
472A2323l159j0706j2528K53J4005J0063K210j2011j5775L430J3173J0193J398
485A2869j3722j1042Q80R417J5442k48j5545r296k87J2138J2906k257r607j2470
499a0822k431J5951J1350j731j0871j3113J928J1772R244K967j3726j3727K757
512a0452J0849J1855n08j3806q942o96J0008J4628j687j2654j0060r99J3870J0869
526A2275j757q106j3382r41J4138J0383K26j2121j2706L039R022J0382K648j3948
540h48j1658J163J0337J2997k004j2080p978k458J1221J3068j624r978j1905k19
554a1966J3819Q549L3r004j2954O89J1292J0674J438j3329j0850K107Q602J1677
$$ plain form
568 10777 11806 -796 -10554 -11448 -176 12360 9560 -640 -9845 -11662 205 11056 10428 744
582 744 -11902 -11437 832 8873 9819 -233 -12291 -11089 -1959 9236 10306 -2434 -12070 -11241 -2019
597 -2019 9540 9014 -941 -10734 -12455 -319 10678 9096 -171 -10610 -11023 238 9529 10512 32
612 32 -11986 -10478 -415 8929 9948 -1088 -11342 -10908 -1758 9468 9608 -1608 -10540 -10897 -736
627 -736 9846 9167 130 -10068 -10910 369 10083 9681 375 -10361 -9851 119 9417 10851 333
642 333 -10297 -9483 -51 9954 10210 -268 -9328 -9830 -574 10402 9753 59 -9351 -9882 351
657 351 9938 9411 629 -9660 -9943 117 9179 9667 5 -9973 -9383 -522 9098 9868 -171 -9640
673 -9640 -9175 -336 9633 9603 -156 -8702 -9295 140 9894 9588 569 -9217 -9220 466 9678 9746 351 -9018
$$ packed form
568A0777J029j2602r758q94J1272J2536k800j0200r205j817J1867J0851o28r684
582G44j2646M65J2269Q041R46j0052j2058J202R130J1195J070j2740r636Q29R222
597b019J1559n26r955r793j721J2136J0997j582r267j0439m13J1261R291R83j0480
612C2j2018J508J0063R344J019j1036j0254M34R150J1226J40j1216q932l57J0161
627g36J0582o79r037j0198q42J1279R714m02r306j0736N10R970R298J434j0518
642C33j0630Q14R432J0005K56j0478r060n02R256J0976o49r694r410n31J0233
657C51R587n27q782j0289k83J0060R062M88r662r978N90Q861R620P70j0039r469
673i640M65Q839R969l0r759q546n93R435R754l06r019r786lR686R212O8r395r369
$$ plain form
691 -9018 -8943 130 9367 9595 126 -8939 -9080 -163 9139 9337 -9 -9118 -9384 -50 9295 9008 219
708 219 -8865 -9306 126 8998 8889 175 -8764 -8876 157 9095 9149 269 -8831 -8737 -70 8887 8917 114
726 114 -8880 -8772 -5 8939 8839 281 -8704 -8988 219 8807 8735 298 -8426 -8596 306 8525 8908
743 8908 319 -8678 -8435 -45 8821 8777 130 -8856 -8691 -356 8332 8267 -224 -8754 -8774 -235 8291
760 8291 8184 232 -8396 -8566 241 8368 8656 321 -8221 -8137 203 8435 8651 158 -8323 -8301 -118
777 -118 8247 8385 -201 -8385 -8750 -207 8324 7846 -282 -8270 -8925 -136 8223 8052 432 -8210 -8171
794 -8171 -37 8211 8148 253 -7968 -7916 -147 8064 8296 -204 -7972 -8217 -622 8176 7937 128 -7875
811 -7875 -8063 38 8504 8015 202 -7566 -8127 320 7995 7948 379 -8053 -7874 -116 7131 7527 -603
$$ packed form
691i018P5R073R237K28r469r065j41Q917R302J98r346r109k66R334R345k87q789
708B19r084m41R432Q872j09q714q939j12R033Q938N4q880r100R4Q667Q957L0q803
726A14q994J08Q767Q944j00q558q985k84R207Q588p2q437q724j70Q902Q219L83
743H908q589q997K43Q390Q866m4q647q986J65Q335Q688o5q491q530k0Q539Q526
760H291j07p952q628j70Q807Q127K88q335q542Q4Q340Q232K16q493q481K2Q183
777a18Q365J38q586q184l65Q543Q531m78q128p988o55Q789Q359j71p620q642L9
794h171Q134Q248o3p895q221N2P769Q211K32q500p768k45P595Q798k39p809q003
811g875j88Q101Q466m89p813p768n61Q447P675m7p569q432J79P758P247L96q130
$$ plain form
828 -603 -8542 -8412 -1128 7058 7106 -832 -7781 -8083 -849 7574 7337 30 -7416 -7620 815 7999 7668
845 7668 1069 -7142 -7019 454 7650 8155 298 -7567 -6694 107 7338 7855 -193 -7221 -7527 -383
861 -383 8023 7447 -230 -6774 -7234 349 7811 7542 1103 -7294 -7368 1014 7179 7549 738 -7372 -6900
878 -6900 -250 7018 7890 -356 -7347 -6752 -530 7277 7416 116 -6361 -7495 -149 7986 6938 421
894 421 -6718 -7314 276 6758 6751 414 -8170 -7825 -238 5741 6372 -547 -8151 -7350 -1414 6302 6916
911 6916 -1130 -7236 -6969 -556 7141 6538 201 -5850 -7304 582 7771 6877 770 -6446 -6374 662
927 662 6439 7285 776 -7471 -6691 -45 6355 6966 -712 -6499 -6135 -869 6956 6955 -424 -6206 -6809
944 -6809 181 7079 5967 346 -6225 -7251 12 6538 6378 35 -7671 -6350 -210 5494 6732
$$ packed form
828f03p939J30P284Q186M8p938o949l02P234Q423k37p307p446k04Q435P184l31
845G668o599q211J23P473P196N05p857p865Q73O801P231N17q048p028l06P144
861c83Q406n76p677o544m60P583P462k69o439q397p4Q382O165L70o811q110M72
878f900O650P268Q72q246o991N95O222P807J39p300o477j134P346Q135j048o517
894D21p139n96P590O482po337q584L45P587N979O31o919p604Q01N936P716O14
911F916q046o106K67O413P697o03o337o051j454P886P189q94o107p216P2P036
927F62N777Q46o509q247P80O646O400O11p678n787L64N266P825jp379n782o03
944f809O990O898j112n621o571j026P263O526j60o343p706J321O140N704J238
$$ plain form
959 6732 -88 -7167 -6548 -465 6541 6537 -845 -6031 -6636 -615 6488 6086 49 -6638 -7499 321 6012
976 6012 5288 141 -7274 -7407 -752 5371 6159 -659 -7351 -6148 -727 5511 6502 -332 -6155 -6369
992 -6369 -571 7136 6170 -149 -5074 -6114 9 6687 6202 884 -6356 -6466 586 5913 6149 143
1008 143 -6390 -6108 -384 5845 6567 -395 -6517 -5556 -426 5991 6254 -96 -5773 -6463 -57 6615
1024 6615 5704 43 -5756 -6549 -146 5891 5957 530 -6584 -6316 258 5678 6003 99 -6045 -5535 -375
1041 -375 6284 6526 -173 -5536 -5624 -72 6239 5839 230 -5368 -6418 109 6022 5361 93 -5779
1057 -5779 -5905 240 5489 5836 654 -6063 -5566 369 5957 6324 49 -5235 -5458 -131 6320 6208
1073 6208 313 -5203 -5730 462 6129 5867 545 -5341 -5870 434 5891 5754 165 -5987 -5508 78
$$ packed form
959F732o820p079O19O083P006mp382n186o05O021P103m02o037o687q61P820N691
976F012p24n147p415j33O655O123P88o818o692J203N421O238R91o834n823k14
992f369N798P707r66o319m925j040O123O678m85n318p240j10P052N327K36o006
1008A43o533K82N724O229P22o962o122R61N130O417K63o350n677o90O406O672
1024F615r11n661n799p93O403O037O6n427p114K68O574N420L25n904o144N10N160
1041c75O659K42o699n363q8N552O311m00n609n598j050O527N913o61n268n872
1057e779j26O145N249L47n182o717M97N935N588L67o275n284k23N327O451j12
1073F208n895n516n27O192N667k62n322n886n29O304N457j37n589o152M79N586
$$ plain form
1089 78 5327 5969 76 -5869 -5448 53 5805 5909 -180 -5641 -5669 -284 5457 5711 -217 -5607 -5733
1106 -5733 152 5704 5395 78 -5630 -5517 260 5429 5401 -60 -5659 -5251 -257 5456 5492 -189 -5557
1123 -5557 -5329 -62 5421 5572 -264 -5314 -5483 57 5312 5111 16 -5614 -5952 -36 5297 5318 -77
1140 -77 -5549 -5292 -75 5242 5140 -13 -5276 -5255 -187 5462 5236 -232 -5086 -5194 -29 5252 5213
1157 5213 98 -5241 -5327 237 5312 5288 41 -5067 -5080 55 5003 5139 72 -5158 -5089 58 5207
1174 5207 5342 -143 -5123 -4945 226 5414 5453 -147 -4999 -5100 27 5243 5074 179 -5227 -4987 -10
1191 -10 5178 4943 -78 -5052 -4934 129 5063 5080 -254 -5008 -4715 195 5352 5173 124 -4962 -4900
1208 -4900 239 5259 5065 -84 -4873 -4916 -3 4890 4605 -39 -5139 -5052 -95 4872 5055 1 -4973
$$ packed form
1089G8N249O42n893n945M21N501N752J04o089n461k8N385N741K54n928n390j26
1106e733N885N552l09n317n708J13N777N169k8n461n599M08M994N713L6n681n368
1123e557K28N267N483J51n836n050j69N540N255k01n095n630l38N916N333K1n395
1140g7n472K57N217N317j02n153n263K1N068N649k26n468m854j08N165N281l9
1157E213n115n339q6N564N075k4n247n108j3N135M948J36n067n230O9N147N149
1174E207J35n485m980J78N171N188L9n600m852j01N127N216j69m895n406K40M977
1191a0N188k35n021m974J18N063M934J7n334m754K93M910N157j79n049n086O2
1208d900N139N020j94n149m789m3M913M893k85m644n100Q7M957M967J83n054m974
$$ plain form
1225 -4973 -4784 -8 4891 5101 280 -4681 -4716 43 5121 5036 181 -4587 -4547 281 5023 4796 170
1242 170 -5049 -4874 284 4639 4688 -53 -4817 -4891 1 4633 5049 -109 -4938 -4938 -76 4941 4762 -202
1260 -202 -4828 -5032 50 4763 4334 63 -4934 -4950 -98 4252 4457 -42 -4872 -4623 -52 4418 4792
1277 4792 -147 -4807 -4221 -83 5085 4873 -118 -4577 -4517 -23 4887 4619 292 -4346 -4855 16
1293 16 4711 4372 90 -4511 -4769 -115 4379 4593 -91 -4461 -4427 -57 4991 4649 -144 -3934 -4345
1310 -4345 146 5104 4514 270 -4243 -4406 139 4485 4068 233 -4697 -4821 128 4181 4103 -377
1326 -377 -4936 -4415 -516 3956 4341 -346 -4749 -4346 -378 4356 4059 -499 -4562 -4735 -694 4156
1342 4156 3902 -465 -4754 -4839 -53 4156 3765 226 -4663 -4346 42 4387 4505 -201 -4490 -3993 -276
$$ packed form
1225d973J89M776M899K10m821m961l5M759N078q5m855m768M0M828M742k27m626
1242A70n219J75N158M355M9m741m764p4M892M632M16n158m829%M862N017j79m964
1260b02m626k04N082M713m29m271m997j6M852M350K05m499m830K49M571M470L74
1277D792m939m660N86M138N168k12m991m459O0M494M910k68m327m638n09M871
1293A6M695l39m282m601k58M654M494K14m684m370L4M370N048l42m793l790m11
1310d345M491M958n90m244m513j63M545M346m17l835m930j24M949M053p8m480
1326c77m559N21L899M472L85m687m403M03L968M734k97m558m063j73M041M850
1342D156k54m367m289q5M786M209l91l539m889L17M388M345J18m706m289M97L717
$$ plain form
1359 -276 4351 4722 -69 -4158 -4285 103 4520 3881 -178 -4239 -4508 84 4261 4051 -188 -4554
1375 -4554 -4140 425 3866 4206 220 -4214 -3691 29 4409 4838 -255 -3858 -3867 4 4629 4107 -33
1392 -33 -3900 -4614 182 4237 3591 139 -4184 -4523 249 3594 4178 -117 -4609 -3863 -19 4176 4261
1409 4261 -109 -4131 -4014 -267 4564 4117 -492 -4260 -4103 22 4188 3902 271 -4043 -3895 199
1425 199 4171 3911 100 -4041 -3824 584 4280 4568 259 -3953 -3220 320 3969 4418 -70 -3630
1441 -3630 -3778 131 4449 3940 -182 -4025 -4049 -125 3869 3875 155 -3905 -4219 465 3821 4238 -72
1458 -72 -3956 -3490 0 3813 4373 -528 -3947 -3859 -388 4087 3797 -157 -3674 -3945 124 4203 3574
1475 3574 -104 -4003 -3927 -136 3462 3694 81 -4186 -3844 -186 3839 3920 -90 -3929 -3568 -196 3989
$$ packed form
1359b76M627L71m791m089j27M388M417o39m059m061k69M592M177k10m239m366
1375d554M14M565L441L40l986m434N23L720M380M29n093l603rL871M625n22m140
1392c3l867p14M796M055o46l452m323l39M772L345N84m295m492P46L844M195Q5
1409D261m370m022J17L747M831m47m609l768J57M125M166k86l631m314J48M094
1425A99L972k60l811m141K17M408L696K88m309m212P33L540L649M49m488l560
1441c630j48L909M318n09m122l843k4L924L994Ol720m060l14M684L356M17m310
1458g2l884M66L490L813N60m901l419Q8L471M475k90l954l517k71M069M079o29
1475C574l678l899P6L791L598K32l613m267L42L658M025Q1m010l839L61L372M185
$$ plain form
1492 3989 4007 -400 -3747 -3866 -76 4297 3754 2 -3729 -3874 122 3980 3705 88 -3848 -3633 307
1509 307 3636 4087 -54 -3783 -3593 -46 3925 4158 -85 -3759 -3480 84 3920 3414 -117 -3693
1525 -3693 -3685 236 3608 3609 83 -3671 -3671 335 3759 3865 22 -3741 -3663 189 3587 3782 272 -3635
1543 -3635 -3340 56 3821 3597 -22 -3546 -3624 116 3724 3807 -173 -3828 -3611 284 3813 3561 -29
1560 -29 -3690 -3501 -6 3559 3502 -177 -3695 -3397 -375 3726 3457 -176 -3663 -3466 -33 3861 3332
1577 3332 -307 -3661 -3546 -17 3568 3312 -209 -3557 -3696 185 3681 3523 -132 -3590 -3470 85
1593 85 3357 3350 -67 -3652 -3572 -17 3525 3364 -47 -3270 -3651 152 3445 3164 -210 -3685 -3637 78
1611 78 3435 3576 -307 -3468 -3559 100 3373 3504 -286 -3353 -3481 32 3600 3556 -170 -3463 -3406 -31
$$ packed form
1492C989J8m407l347j19L790M373n43l752l731j45L996L858k75l617l936K15L940
1509C07L329M51m141l729J90L547L971K33m243l674K79L564L836n06l531l576
1525c693QL921L372Jl526l754%M006L424J06l843l763P8L852L398J95l510l907
1543c635K95L396L765k24l619l524p8L740L608Q3l980l655K17L895L529k52l590
1560b9l661J89L495L565n7l679l518K98L022M101k69l633l487J97L433L894n29
1577C332l639l354J15L529L585k56l521l348j39L881L496j58l655l458J20L555
1593H5L272pl417l585Q0L555L542j61l411l223l81L803L293k81l374l475M8L715
1611G8L357J41l883l161r1L659L273J31l790l067j28L513L568m4l726l293N7L375
$$ plain form
1629 -31 3366 3257 -133 -3461 -3362 -238 3437 2859 119 -3609 -3496 109 3457 3280 -112 -3626 -3404
1646 -3404 57 3441 3059 -159 -3380 -3414 343 3440 3339 -108 -3369 -3249 271 3337 3273 24 -3399
1663 -3399 -3270 177 3562 3392 125 -3112 -2954 269 3454 3586 -277 -3536 -3171 35 3519 3182
1679 3182 -86 -3181 -3164 -132 3280 2952 -59 -3374 -3279 -120 3254 3102 -467 -3342 -3401 -43 3094
1696 3094 2959 19 -3321 -3337 -381 3036 3213 -407 -3236 -3402 -177 2777 2800 -324 -3529 -3327 141
1713 141 2799 2980 -301 -3358 -3379 -72 2711 3276 -114 -3341 -3045 -182 3215 2796 -247 -3106 -3226
1730 -3226 -235 3076 3124 -64 -3281 -3299 12 3099 3019 -150 -3166 -3119 483 3165 3334 160 -3149
1747 -3149 -2670 -64 3138 3405 24 -3109 -2748 -42 2928 3115 -352 -3138 -3224 -235 3115 2785 -266
$$ packed form
1629c1L397j09l390l328R9L124L675n78k740l728J13L605L348j77l392l514K22
1646c404L461L384l82l218l221l4L757L097j01l447l261J20L520L066o4l249l423
1663c399J29L447L385j70l267l237J58L223L185J32l863l259L65L206L484l37
1679C182l268l095J7L032L412l28l011l315R5L159L374j52l569k875n9L358L137
1696C094j35k940l340j6K956L417J77l620k829j66L225K954K3l124l205K02L468
1713A41K658J81l281l057k1L307K783N65l390l227K96K863L397m19l043k859j20
1730c226K991L311M8l188l217j8L311L087q0l169l016M7L602K682J69l174l309
1747c149M79K606L202K67l381l133L61K706K970J87l467k786q6K989L350l30l051
$$ plain form
1764 -266 -3145 -3270 176 2749 2988 2 -3147 -2989 39 2925 3306 43 -3127 -2992 75 3028
1780 3028 3152 -264 -2988 -2917 252 3012 2915 -165 -3000 -2879 168 3010 2903 -252 -2791 -2661 398
1797 398 3039 2957 98 -2982 -2775 35 3000 3163 81 -2937 -2780 48 3178 3135 -54 -2759 -2864
1814 -2864 200 3496 2586 159 -2694 -2921 332 3119 3115 228 -2893 -2565 456 2975 3152 -139 -2906
1831 -2906 -2784 -46 2978 2972 -408 -3118 -2965 26 2658 2621 -160 -3007 -3081 146 2723 2517 -87
1848 -87 -2972 -2785 121 2455 2833 2 -2956 -2651 58 2753 2844 -239 -3014 -2556 -169 2825 2672
1865 2672 -138 -2893 -2598 -71 2838 2607 148 -2957 -2723 329 2781 2801 -56 -2868 -2821 129 2753
1882 2753 2960 -250 -2974 -2511 -46 2745 2761 -102 -2674 -2690 8 2713 2512 -66 -2707 -2671 184
$$ packed form
1764b66k879j25L446K573K39k986l149J58L028K886L81l263l170J35L067K953
1780C028J24l416k724P1L169K760r7l080k835J21L047K842j07l155k539J30L059
1797C98K641q2k859l080K07K810K965J63l082l018J57K828L130m3l189k705j05
1814b864L064L296r10k427k853k27L253K787mk887l121L28L021K519J77l291k767
1831b906J22K738L024ol380k710J53K991K632l7k781k847p4L227K577k06k604
1848h7k885J87K906K334L78k831k958L05K709K695R1l083k775M58K387K994j53
1865B672k810k755K95K527K909k31k459l105K34L052K452K0k857k812M7K950K624
1882B753K07l210k724M63K465K791J6k863k572j6K698K705k01k578k641L6K855
$$ plain form
1899 184 2728 2409 130 -2896 -2653 52 2552 2705 -174 -3087 -2704 -91 2691 2690 -243 -2941 -2830
1916 -2830 -225 2669 2333 -184 -2676 -2868 151 2402 2547 -67 -2740 -2675 255 2566 2628 -378 -2930
1933 -2930 -2720 225 2658 2670 -324 -2548 -2406 101 2707 2579 -212 -2577 -2564 114 2849 2516 -8
1950 -8 -2709 -2650 52 2603 2340 -82 -2481 -2712 -23 2639 2684 11 -2919 -2654 38 2482 2415 -263
1968 -263 -2631 -2550 2 2550 2592 -55 -2839 -2464 -71 2479 2483 -281 -2710 -2503 172 2526 2301 -206
1986 -206 -2470 -2458 -27 2374 2573 -6 -2493 -2664 -47 2528 2452 -398 -2343 -2483 11 2593 2404
2003 2404 150 -2639 -2232 286 2740 2319 -59 -2622 -2510 69 2654 2399 -166 -2630 -2316 61
2019 61 2424 2398 -164 -2616 -2487 85 2245 2404 -342 -2409 -2397 302 2619 2167 -126 -2542 -2290
$$ packed form
1899A84K544l19k279l026K43K705K500J53k879k913L83K613K782jk933k698J11
1916b830K605K894l36k517k492j92L019K251J45k614k673O5K930K311O2l006k552
1933b930K10K945K433J2k994k224J42K507K606j28k791k365J3K678K735l33k524
1950hk701N9K702K551k63k422k399k31K689K662M5k673k930K65K692K444o7k678
1968b63k368Q1K552K548M2k647k784L75K393K550Mk764k429K07K675K354k25k507
1986b06k264J2K431K401J99k579k487j71K617K575p6k850j945j40K494K582j89
2003B404k254k789M07K518K454m21k378k563J12K579K585k55k565k464L14K377
2019F1K363k6k562k452J29K572K160J59k746k067J2K699K317m52k293k416K52
$$ plain form
2036 -2290 133 2582 2428 180 -2448 -2310 16 2453 2510 -41 -2489 -2430 178 2570 2124 -204 -2325
2053 -2325 -2445 210 2525 2468 11 -2328 -2191 237 2267 2151 -177 -2514 -2029 234 2310 2142 -163
2070 -163 -2333 -2311 171 2442 2168 -271 -2499 -2254 57 2358 2340 -133 -2551 -2394 60 2318 2304
2087 2304 -5 -2350 -2285 178 2305 2244 205 -2493 -2186 5 2318 2355 -154 -2313 -1914 113 2180
2104 2180 2248 -120 -2281 -2063 336 2416 2273 187 -2451 -2142 151 2440 2122 -284 -2358 -2170 194
2121 194 2314 2102 -273 -2336 -1874 63 2142 2134 56 -2289 -2055 159 2280 2401 -10 -2179 -2199
2138 -2199 262 2394 2156 47 -2376 -2395 42 2423 2219 -135 -2021 -2054 118 1981 2071 -228 -2196
2155 -2196 -2103 -1 2405 2245 116 -1908 -2182 238 2451 2116 67 -2104 -2118 149 2097 2072 -47
$$ packed form
2036b290K423K449j54k248k628J38K326K437N7k551k448N9K608K392m46k328k121
2053b325j20K655K315n7k457k339J37K428K030j16k328k337M85K263K076j68k305
2070a63k170K2K482K271k74k439k228K45K311K301j8k473k418J57K454K258j4
2087B304k309k345O5K463K127o1k039k698L07K191K313L7k509k159L99K027K067
2104B180O8k368k161K18K399K080j43k086k638L09K293K289l18k406k074J88K364
2121A94K120k12k375k063M62J937K079qk078k345K34K214K121J21k411k169k0
2138b199K461K132k38k109k423j9K437K381k04k354j886l3K172J863R0k299j968
2155b196R3K102K406j60k129k024k74K420K213l35k049k171j4K267J948k5k119
$$ plain form
2172 -47 -2248 -1794 2 2264 2375 -205 -2088 -2003 274 2169 2163 36 -2059 -1772 254 2136 2102 250
2190 250 -2214 -1881 27 2106 2012 -213 -2112 -2232 70 2118 1880 179 -2209 -2351 99 2073 2068
2207 2068 -86 -2021 -2028 32 2291 2034 -93 -2216 -2164 -54 1921 1976 -87 -2300 -1965 -155 2014
2224 2014 2245 -232 -2265 -2122 -122 1971 2071 -273 -2202 -2085 -5 2363 2381 -385 -2072 -2028 1
2241 1 2051 2068 102 -1985 -1793 143 1914 2035 211 -1997 -1913 181 2055 2069 -106 -1910 -1710 104
2259 104 1981 1996 6 -1859 -1866 283 2020 1671 169 -1935 -1904 87 2031 2149 47 -2093 -1887 138
2277 138 1912 2167 -289 -2069 -2165 -103 1995 2005 -245 -1874 -1967 -226 2137 1606 -174 -1763 -1908
$$ packed form
2172d7k201M54J796K262J11k580j883Q5K277J895ok127k095K87K026J882l4j852
2190B50k464L33J908K079r4k225j899j20K302K048k38j701k388j42K450J974n
2207B068k154j935pK060K259k57k127k123N2K110J975N5k063k213L35J810K169
2224B014K31k477k033J43K000K093J00k344j929J17K080K368J8k766j687M4K029
2241AK050J7j966k087J92J936J771J21j824k208Q4K094J874J4k175j804K00J814
2259A04J877J5j990j865pK149J737l49j502k104L1J991J944J18k102k140K06K025
2277A38J774K55k456j780r6K062K098J0k250j629r3J741K363n31j780j589j45
$$ [...]
8191H7
##END NTUPLES=NMR FID
##END=
