##TITLE=1H_SA_57.231
 DMSO-d6, 108 sc, 
 2.9.2020
##JCAMPDX= 6.0         $$ Bruker NMR JCAMP-DX V2.0
##DATA TYPE= NMR FID
##DATA CLASS= NTUPLES
##ORIGIN= UXNMR, Bruker Analytische Messtechnik GmbH
##OWNER= root
$$ XWIN-NMR		Version 3.5
$$ Wed Sep  2 09:17:15 2020 Russian Standard Time (UT+4h)  she@DPX200
##.OBSERVE FREQUENCY= 200.1315066352
##.OBSERVE NUCLEUS= ^1H
##.DELAY= (6, 6)
##.ACQUISITION MODE= SIMULTANEOUS
##.ACQUISITION SCHEME= undefined
##.AVERAGES= 108
##.DIGITISER RES= 18
##SPECTROMETER/DATA SYSTEM= spect
##.PULSE SEQUENCE= zg30
##.SOLVENT NAME= DMSO
##.SHIFT REFERENCE= (INTERNAL, DMSO, 0, 15.7039)
##AUDIT TRAIL= $$ (NUMBER, WHEN, WHO, WHERE, WHAT)
$$ ##TITLE= Audit trail, XWIN-NMR		Version 3.5
$$ ##JCAMPDX= 5.01
$$ ##ORIGIN= Bruker BioSpin GmbH
$$ ##OWNER= she
$$ F:/spectra/data/she/nmr/H-F/1/audita.txt
$$ ##AUDIT TRAIL=  $$ (NUMBER, WHEN, WHO, WHERE, WHAT)
(   1,<2020-09-02 09:16:03.70 +0400>,<she>,<DPX200>,
      <continue with go, POWCHK disabled, PULCHK disabled
       configuration hash MD5:
       00 E9 B6 7A A2 85 ED C7 34 08 36 98 17 FE 4E 26
       data hash MD5: 16K
       7E E9 F9 5F 31 88 B6 50 B5 0A 29 9B 4C A1 03 7C>)
$$ ##END=
$$ 
$$ hash MD5
$$ 27 72 EE CC 5B 78 3E 7F 74 F8 2C 1F 6C 87 F1 B4
##$RELAX= 
##$RELAX= 
##$RELAX= 
##$RELAX= 
##$RELAX= 
##$RELAX= 
$$ Bruker specific parameters
$$ --------------------------
##$DU= <F:/spectra>
##$EXPNO= 1
##$NAME= <H-F>
##$PROCNO= 1
##$TYPE= <nmr>
##$USER= <she>
##$AMP= (0..31)
100 100 100 100 100 100 100 100 100 100 100 100 100 100 100 100 100 100 
100 100 100 100 100 100 100 100 100 100 100 100 100 100 
##$AQSEQ= 0
##$AQ_mod= 1
##$AUNM= <au_zg>
##$AUTOPOS= <>
##$BF1= 200.13
##$BF2= 200.13
##$BF3= 200.13
##$BF4= 200.13
##$BF5= 200.13
##$BF6= 200.13
##$BF7= 200.13
##$BF8= 200.13
##$BYTORDA= 1
##$CFDGTYP= 0
##$CFRGTYP= 5
##$CHEMSTR= <none>
##$CNST= (0..31)
1 1 145 1 1 1 1 1 1 1 1 1 1 1 1 1 1 1 1 1 1 1 1 1 1 1 1 1 1 1 1 1 
##$CPDPRG= <>
##$CPDPRG1= <>
##$CPDPRG2= <>
##$CPDPRG3= <>
##$CPDPRG4= <mlev>
##$CPDPRG5= <mlev>
##$CPDPRG6= <mlev>
##$CPDPRG7= <mlev>
##$CPDPRG8= <mlev>
##$CPDPRGB= <>
##$CPDPRGT= <>
##$D= (0..31)
0 1.2 0 0 0 0 0 0 0 0.06 0 0.03 0 0 0 0 0.0002 0 0 0 0 0 0 0 0 0 0 0 0 
0 0 0 
##$DATE= 1599023338
##$DBL= (0..7)
120 120 120 120 120 120 120 120 
##$DBP= (0..7)
150 150 150 150 150 150 150 150 
##$DBP07= 0
##$DBPNAM0= <>
##$DBPNAM1= <>
##$DBPNAM2= <>
##$DBPNAM3= <>
##$DBPNAM4= <>
##$DBPNAM5= <>
##$DBPNAM6= <>
##$DBPNAM7= <>
##$DBPOAL= (0..7)
0.5 0.5 0.5 0.5 0.5 0.5 0.5 0.5 
##$DBPOFFS= (0..7)
0 0 0 0 0 0 0 0 
##$DE= 6
##$DECBNUC= <off>
##$DECIM= 32
##$DECNUC= <off>
##$DECSTAT= 4
##$DIGMOD= 1
##$DIGTYP= 9
##$DL= (0..7)
0 120 120 120 120 120 120 120 
##$DP= (0..7)
150 150 150 150 150 150 150 150 
##$DP07= 0
##$DPNAME0= <>
##$DPNAME1= <>
##$DPNAME2= <>
##$DPNAME3= <>
##$DPNAME4= <>
##$DPNAME5= <>
##$DPNAME6= <>
##$DPNAME7= <>
##$DPOAL= (0..7)
0.5 0.5 0.5 0.5 0.5 0.5 0.5 0.5 
##$DPOFFS= (0..7)
0 0 0 0 0 0 0 0 
##$DQDMODE= 0
##$DR= 18
##$DS= 0
$$ [...]
##$SUBNAM2= <"">
##$SUBNAM3= <"">
##$SUBNAM4= <"">
##$SUBNAM5= <"">
##$SUBNAM6= <"">
##$SUBNAM7= <"">
##$SUBNAM8= <"">
##$SUBNAM9= <"">
##$SW= 16.880792210976
##$SWIBOX= (0..15)
0 0 2 0 0 0 0 0 0 0 0 0 0 0 0 0 
##$SW_h= 3378.37837837838
##$TD= 16384
##$TD0= 1
##$TE= 0
##$TE2= 300
##$TE3= 300
##$TEG= 300
##$TL= (0..7)
0 120 120 120 120 120 120 120 
##$TP= (0..7)
150 150 150 150 150 150 150 150 
##$TP07= 0
##$TPNAME0= <>
##$TPNAME1= <>
##$TPNAME2= <>
##$TPNAME3= <>
##$TPNAME4= <>
##$TPNAME5= <>
##$TPNAME6= <>
##$TPNAME7= <>
##$TPOAL= (0..7)
0.5 0.5 0.5 0.5 0.5 0.5 0.5 0.5 
##$TPOFFS= (0..7)
0 0 0 0 0 0 0 0 
##$TUNHIN= 0
##$TUNHOUT= 0
##$TUNXOUT= 0
##$USERA1= <user>
##$USERA2= <user>
##$USERA3= <user>
##$USERA4= <user>
##$USERA5= <user>
##$V9= 5
##$VALIST= <valist>
##$VCLIST= <CCCCCCCCCCCCCCC>
##$VD= 0
##$VDLIST= <DDDDDDDDDDDDDDD>
##$VPLIST= <PPPPPPPPPPPPPPP>
##$VTLIST= <TTTTTTTTTTTTTTT>
##$WBST= 1024
##$WBSW= 4
##$XGAIN= (0..3)
0 0 0 0 
##$XL= 0
##$YL= 0
##$YMAX_a= 1047112
##$YMIN_a= -1164324
##$ZGOPTNS= <>
##$ZL1= 120
##$ZL2= 120
##$ZL3= 120
##$ZL4= 120
##$ABSF1= 10
##$ABSF2= 0
##$ABSG= 5
##$ABSL= 3
##$ALPHA= 0
##$AQORDER= 0
##$ASSFAC= 0
##$ASSFACI= 0
##$ASSFACX= 0
##$ASSWID= 0
##$AUNMP= <proc_1d>
##$AZFE= 0.1
##$AZFW= 0.1
##$BCFW= 1
##$BC_mod= 2
##$BYTORDP= 1
##$COROFFS= 0
##$CY= 11.3945322036743
##$DATMOD= 1
##$DC= 2
##$DFILT= <>
##$DTYPP= 0
##$F1P= 16.9975609425685
##$F2P= -3.02152046262296
##$FCOR= 0.5
##$FTSIZE= 0
##$FT_mod= 4
##$GAMMA= 1
##$GB= 0.15
##$INTBC= 1
##$INTSCL= 1
##$ISEN= 128
##$LB= 0.24
##$LEV0= 0
##$LPBIN= 0
##$MAXI= 10000
##$MC2= 0
##$MEAN= 0
##$ME_mod= 0
##$MI= 1.114404
##$NCOEF= 0
##$NC_proc= 0
##$NLEV= 6
##$NOISF1= 3.799351
##$NOISF2= 2.8
##$NSP= 1
##$NTH_PI= 0
##$NZP= 0
##$OFFSET= 15.70392
##$PC= 1
##$PHC0= -9988.989
##$PHC1= 28.8009
##$PH_mod= 1
##$PKNL= yes
##$PPARMOD= 0
##$PSCAL= 0
##$PSIGN= 0
##$REVERSE= no
##$SF= 200.130013532006
##$SI= 16384
##$SIGF1= 3
##$SIGF2= 2
##$SINO= 400
##$SIOLD= 16384
##$SREGLST= <1H.CDCl3>
##$SSB= 0
##$STSI= 0
##$STSR= 0
##$SW_p= 3612.71676300578
##$SYMM= 0
##$S_DEV= 0
##$TDeff= 0
##$TDoff= 0
##$TI= <>
##$TILT= no
##$TM1= 0
##$TM2= 0
##$TOPLEV= 0
##$USERP1= <user>
##$USERP2= <user>
##$USERP3= <user>
##$USERP4= <user>
##$USERP5= <user>
##$WDW= 1
##$XDIM= 8192
##$YMAX_p= 0
##$YMIN_p= 0
$$ End of Bruker specific parameters
$$ ---------------------------------
##NTUPLES= NMR FID
##VAR_NAME=  TIME,          FID/REAL,        FID/IMAG
##SYMBOL=    X,             R,               I
##VAR_TYPE=  INDEPENDENT,   DEPENDENT,       DEPENDENT
##VAR_FORM=  AFFN,          ASDF,            ASDF
##VAR_DIM=   8192,          8192,            8192
##UNITS=     SECONDS,       ARBITRARY UNITS, ARBITRARY UNITS
##FACTOR=    0.000296,      1,               1
##FIRST=     0,             0,               0
##LAST=      2.424536,      0,               0
##MIN=       0,             -1164324,        0
##MAX=       2.424536,      1047112,         0
$$ Real data points
##PAGE= N=1
##DATA TABLE= (X++(R..R)), XYDATA
0 0 0 0 0 0 0 0 0 0 0 0 0 0 0 0 0 0 0 0 0 -107 108 -108 108 -108 108 -126 216 -216 217 -314 324 -386 432 -493
34 -493 543 -637 707 -780 881 -990 1100 -1226 1368 -1517 1677 -1848 2047 -2260 2493 -2734
50 -2734 3024 -3327 3661 -4038 4457 -4932 5454 -6042 6745 -7534 8481 -9617 11005 -12744
64 -12744 15003 -18066 22424 -29190 40886 -139126 1018936 435056 -1164324 -293871 844197
75 844197 193185 -731167 -238607 451082 379747 -286181 -542808 250204 825787 -256110
85 -256110 -915374 417839 1026431 -538993 -952698 642300 817447 -681774 -665366 567106
95 567106 495870 -416204 -434333 184382 472633 32549 -563519 -127694 780697 220844
105 220844 -881789 -107020 1047112 34602 -1016615 125873 936207 -202019 -782663
114 -782663 171813 580850 -104710 -465138 -93511 378859 288634 -398954 -444775 538569
124 538569 580660 -628661 -531816 793905 498181 -814739 -351820 788870 228608 -686101
134 -686101 -187053 484646 171282 -336556 -290024 193703 439158 -125615 -579743 184251
144 184251 747742 -228113 -754818 383318 763640 -437709 -643267 469315 510392 -421275
154 -421275 -413584 264708 315717 -131798 -356897 -58416 418329 158647 -545792 -190313
164 -190313 691673 180560 -742839 -58100 793063 -7736 -705404 93036 590232 -104843
174 -104843 -469219 10167 314254 72490 -294466 -263779 268905 372526 -350861 -454920
184 -454920 460386 489568 -518916 -401281 605662 348409 -554961 -229740 485833 173233
194 173233 -368266 -191929 204733 216908 -136145 -361671 45565 452605 -74221 -562936
204 -562936 133829 620958 -198037 -578644 294430 538592 -289199 -412052 272607 328448
214 328448 -179491 -275181 39224 249240 58612 -333916 -179547 394001 191762 -501557
224 -501557 -178798 569950 131598 -562897 -29768 554910 5917 -435513 31739 349335
234 349335 24124 -255786 -118028 186587 201826 -210688 -330399 223929 371927 -311363
244 -311363 -396992 376868 368610 -396358 -279825 415227 240810 -325810 -161809 257879
254 257879 169225 -145599 -210312 50052 267689 -29002 -382581 3122 428927 -63324
264 -63324 -480761 114382 473880 -154550 -401433 199700 355986 -142824 -251344 104243
274 104243 228844 -571 -213591 -90639 235196 143773 -318552 -200886 356662 164283
284 164283 -423253 -136241 425784 87474 -384629 -30145 348991 47460 -240939 -45720
294 -45720 195528 127115 -139889 -198259 129073 258548 -173642 -330062 192846 316984
304 316984 -263292 -313820 276097 257334 -266127 -194777 239755 179355 -144418 -145190 96929
315 96929 192797 -16263 -231455 -18975 287135 7756 -359122 -5659 356391 -57915
325 -57915 -370175 73527 324510 -88499 -264428 85846 231205 -15898 -166299 -21315
335 -21315 183779 105952 -187887 -148626 224830 162641 -283581 -178945 288731 126821 -317525
346 -317525 -109656 281067 75992 -233599 -60832 194546 98583 -117850 -113924 110702
356 110702 191082 -81380 -226389 105821 260317 -140423 -280360 151791 244319 -190501
366 -190501 -231963 164489 180753 -138468 -154039 98191 161844 -22081 -149323 5972 212362
377 212362 47406 -227526 -35089 269357 19975 -292104 -13306 263988 -30071 -265014
387 -265014 15129 207248 -15390 -174545 -13244 157022 73769 -126976 -95109 162262
397 162262 151126 -163776 -152753 200041 154859 -219325 -144744 209502 106252 -209324 -105994
408 -105994 159455 88212 -129279 -103770 95126 138558 -54945 -154970 68365 210961
418 210961 -53340 -213706 84201 226566 -97346 -220066 92999 181574 -106271 -179013
428 -179013 60268 139717 -44735 -145372 1554 153792 38102 -159694 -39077 201352
438 201352 64502 -203010 -43982 219957 34171 -218251 -34781 182373 10593 -180052
448 -180052 -44808 131436 47332 -124533 -80604 116644 118633 -106974 -124383 138400 156299
459 156299 -129984 -139115 151497 136666 -148147 -128093 125908 100636 -122792 -119307 70389
470 70389 105183 -65258 -136992 36531 153374 -26407 -164045 40296 193265 -26397
480 -26397 -176473 51624 185137 -43779 -166799 33437 140568 -32741 -148980 -11241
490 -11241 119151 13142 -139587 -48681 141895 63877 -144733 -54388 174619 78043 -152146
501 -152146 -48173 169244 60331 -146271 -55038 124888 53300 -120081 -84251 87551
511 87551 82772 -95525 -113589 85958 125107 -85867 -126354 101300 143278 -87378 -120997
522 -120997 101286 129286 -80008 -114891 67486 110782 -54792 -123872 24300 118143 -25667
533 -25667 -141029 5034 144935 -4906 -146953 14540 163287 5239 -138211 16497
543 16497 150094 8479 -126882 -9484 120451 21211 -123869 -48084 105411 45319 -123698
554 -123698 -70482 117907 72332 -119541 -67111 131154 83509 -107376 -63164 117773 80091
565 80091 -94792 -78641 84277 79525 -83999 -104682 57872 95007 -72014 -120031 55730
576 55730 116129 -59921 -117129 63644 127808 -45102 -106559 54827 121403 -29952 -108279
587 -108279 26771 110983 -17262 -122390 -6071 109334 -6037 -132460 -19599 117708
597 117708 10081 -125184 -16346 127494 27174 -109098 -16742 119939 40240 -99373
607 -99373 -37770 100564 47125 -103740 -66259 83692 55451 -104523 -81886 83505 70497
618 70497 -91908 -78406 87234 85721 -71927 -74072 80743 92354 -58691 -82227 59205
629 59205 92292 -52400 -102119 36333 92290 -48126 -112532 25751 100712 -33247 -108248
640 -108248 24195 109193 -14840 -98946 20503 111452 824 -97490 3559 103480 7616
651 7616 -104853 -21434 92471 14680 -109059 -35659 92500 26370 -101810 -36527 98318
662 98318 44899 -87137 -37051 96592 57936 -76782 -48966 83364 60831 -76825 -67815
673 -67815 65138 61568 -75348 -82647 54962 71186 -64361 -81734 55804 84798 -45437
684 -45437 -75950 53474 93333 -32087 -78420 38955 91006 -27769 -90762 19205 84873
695 84873 -24259 -99615 2684 84682 -11025 -97013 -238 93938 5004 -87367 1193 98149
707 98149 20266 -79814 -11163 91336 25301 -83503 -30686 77085 28739 -87491 -46820
718 -46820 70699 35994 -82942 -50816 72277 51436 -68414 -48214 74471 63473 -54980
729 -54980 -51142 64783 66389 -50710 -65916 46991 65520 -50054 -77854 33193 66850
740 66850 -44044 -82685 31267 77140 -27363 -73674 30727 85187 -12379 -70399 22171
751 22171 84812 -5097 -76643 4282 76534 -5829 -86339 -13139 73397 1480 -85564 -17487
763 -17487 75281 16983 -74157 -16201 79980 31546 -63389 -21422 76412 38256 -63516 -36275
775 -36275 62723 39490 -66428 -50874 52578 40559 -64752 -56773 49410 50363 -50352 -53611
787 -53611 50982 62652 -35463 -53134 45734 68476 -29775 -61303 31387 64300 -31831 -71857
799 -71857 17060 59401 -26634 -75764 9469 64977 -14248 -70462 9718 73927 2244 -61452
811 -61452 7506 76089 9815 -63466 -6214 67572 9035 -69849 -21434 58451 12770 -70119
823 -70119 -29204 56826 24300 -60713 -29459 61315 37437 -51479 -31143 60479 43720 -46871
835 -46871 -38446 50424 42672 -48153 -48767 36886 41773 -44818 -56841 29330 48805 -35774 -56427
848 -56427 30062 59606 -22123 -51640 31275 65116 -14198 -52656 21246 60564 -13937 -59690
860 -59690 3567 53106 -12157 -65613 -5454 53546 -1403 -61553 -6115 60802 12967 -53831
872 -53831 -3467 64692 18527 -50496 -10979 55833 18184 -52862 -25978 43268 19765 -54452
884 -54452 -37155 40328 28699 -48228 -36947 44668 39021 -39165 -32604 46990 45354 -31073 -33178
897 -33178 39325 44243 -27888 -42913 22991 41842 -27081 -54388 13548 44829 -23317 -55961
909 -55961 14460 52189 -13289 -48210 18654 56463 -3289 -43489 12069 51712 566 -46950
921 -46950 -4058 45144 733 -55006 -17107 43922 6901 -54243 -17090 49271 15904 -46008
933 -46008 -11460 51383 23782 -36883 -13977 44980 26469 -35029 -26725 33861 28391 -37870
945 -37870 -38007 28629 31802 -37900 -38749 30621 38553 -29189 -33712 32568 41174 -19905 -31474 25919
959 25919 41127 -12545 -38795 13135 41336 -12416 -50521 2482 40303 -12823 -53015 2545
971 2545 45047 -6033 -42783 7464 46870 5526 -33910 3436 44467 12054 -35162 -11504
983 -11504 37533 12825 -44448 -22543 36233 12465 -46313 -22369 38251 17257 -36996 -16358
995 -16358 38382 25144 -25240 -17416 33722 31349 -21145 -27838 25110 31553 -26681 -39154 18713
1008 18713 30621 -29609 -42524 17729 31733 -22910 -33459 17112 35831 -8507 -28375 13635
1020 13635 40078 -151 -33632 4607 40217 -1155 -43446 -4255 35508 -5833 -46574 -5810
1032 -5810 34188 -544 -36761 -3857 34746 11306 -27559 -6163 35374 19155 -26978 -14839
1044 -14839 33443 20268 -33680 -24176 27330 15990 -37074 -26366 24459 16593 -28218 -21529
1056 -21529 24202 24737 -16918 -20943 21815 32120 -12508 -27253 18309 33743 -15553 -35739
1068 -35739 12309 29341 -19054 -36540 8296 26940 -12787 -32399 6579 30701 -698 -26038
1080 -26038 4496 35881 8331 -27792 -298 36256 5544 -33702 -6726 30241 866 -35905
1092 -35905 -11189 25536 3984 -31396 -10737 25882 14025 -22126 -10873 29148 23461 -18383
1104 -18383 -15469 28020 22590 -23662 -22056 22103 18793 -25698 -26194 14487 15675 -20168 -24685
1117 -24685 12911 24236 -11171 -22138 13710 30966 -4839 -23012 13376 31359 -6010 -28879
1129 -28879 5887 26108 -8839 -31608 -418 20220 -6382 -29965 -3176 24907 3154 -23803
1141 -23803 -1214 30885 10575 -23491 -3668 30794 10711 -25816 -8203 24015 8381 -27485
1153 -27485 -16068 19154 7435 -25700 -16668 17616 15309 -18121 -14530 21643 22514 -13962 -15009
1166 -15009 22379 24318 -12523 -18904 14275 19370 -17445 -25304 7528 17130 -14300 -24149 6372
1179 6372 20955 -6549 -22231 7362 27560 374 -19526 8272 28450 1701 -22044 2457
1191 2457 23864 -1557 -26750 -5904 18777 -1980 -27001 -7489 19835 5574 -22274 -6851
1203 -6851 24681 12373 -16945 -6313 25211 15139 -17966 -10305 21230 12179 -20477 -16239 13303
1216 13303 10428 -21127 -19686 10659 14393 -15433 -17370 13985 21766 -8332 -14487 14522 23932
1229 23932 -5776 -17304 10141 19754 -8637 -22121 3216 16456 -9835 -24838 118 17567
1241 17567 -3875 -21908 1692 22199 2856 -17909 1706 23993 6288 -17203 -1784 21578
1253 21578 4523 -21285 -7758 17121 2641 -22659 -12222 14195 5948 -19126 -11137 16724
1265 16724 13014 -13010 -9794 18848 17180 -10908 -10536 15875 15657 -13415 -15369 9331 11587 -14226
1279 -14226 -19206 4777 12067 -11454 -17777 7315 17973 -2972 -14682 9632 22645 406
1291 406 -16033 7137 21870 -2736 -18135 668 15277 -5387 -21268 -4085 14803 -958
1303 -958 -19719 -3074 16506 4714 -14547 -1688 20665 9756 -12782 -1711 19604 7976
1315 7976 -14369 -7678 13617 6894 -18344 -13547 9679 5327 -15344 -13732 11178 11334 -10447
1328 -10447 -9670 13494 17269 -5178 -9843 12256 17607 -5773 -14004 8136 12632 -8893 -19370
1341 -19370 3239 12102 -7841 -18181 2196 15747 -2333 -14745 5340 19444 2541 -11146
1353 -11146 4371 19553 2494 -14935 -1336 14713 114 -19027 -6208 12591 -831 -18236
1365 -18236 -6976 12601 4911 -13184 -4842 15702 10861 -8225 -4751 15932 10987 -9167 -9206
1378 -9206 11470 9812 -13780 -12900 8140 7860 -12007 -12694 6710 10115 -7089 -9595 8907 16331
1392 16331 -912 -9512 8378 18136 -1388 -12063 4756 14567 -4494 -17027 782 10416 -7681
1405 -7681 -16051 -1699 10756 -2449 -12983 -535 15092 5389 -8368 -168 17027 8197 -12041
1418 -12041 -3733 15962 4004 -15943 -6394 10379 878 -16861 -7366 7711 4955 -9845 -7378
1431 -7378 9693 10275 -4343 -7708 11887 14235 -5585 -9435 12049 12165 -9584 -11668 7400 5476
1445 5476 -10471 -12375 2296 6465 -5078 -9713 1819 12332 1915 -11642 4362 17928 3318
1458 3318 -11485 2780 15182 -1492 -14839 1344 9372 -5805 -12887 -3197 5798 -1190 -10854
1471 -10854 -4204 9402 7841 -8968 -4003 16630 11313 -10792 -3153 15440 6688 -12894 -4458
1484 -4458 7844 -341 -10440 -8130 2731 3004 -5690 -10758 3268 11748 -3247 -10512 9540 17415
1498 17415 -3763 -8919 11074 13029 -7508 -8426 6014 4539 -6701 -9348 -1806 4108 340 -9531
1512 -9531 -3916 10859 4638 -10608 799 17147 2486 -11775 4781 16332 -1308 -8824 2507
1525 2507 6395 -2886 -8816 -5576 1198 2525 -8270 -10209 7513 9744 -9810 -7202 14982 10648
1539 10648 -9194 -1994 14575 4905 -8754 -1505 3882 386 -5281 -7351 -3340 5729 -3851 -14270
1553 -14270 -528 13178 -4024 -12954 9322 15343 -6248 -6701 12091 8692 -5240 -3147 2900
1566 2900 2438 -559 -5695 -6820 3773 2990 -12053 -8452 11478 3921 -15404 38 17208 2204
1580 2204 -9658 6363 11244 -1625 -3446 1045 3069 2470 -2391 -9956 -488 7390 -7785 -14637
1594 -14637 8211 9486 -11966 -7843 14472 6527 -9031 939 11388 2991 -1857 751 675 3190
1608 3190 1057 -9112 -6125 7679 -918 -17065 -1028 12939 -7086 -13474 9527 11647 -6668
1621 -6668 -2120 9123 5878 -967 1421 -188 2620 6278 -5983 -9217 6302 5780 -14320 -8998
1635 -8998 12691 624 -15730 1984 13050 -2547 -5438 6616 5991 1479 2870 -933 -536 7682
1649 7682 499 -11912 2366 10921 -9467 -15095 8615 7112 -13713 -5404 10851 1414 -6238
1662 -6238 4639 4273 1338 4169 472 -3049 7522 4575 -13065 -5469 11574 -3316 -18209 1744
1676 1744 11110 -9761 -10768 8640 4470 -6461 2032 4912 1483 5817 2946 -5082 3400 10639
1690 10639 -7743 -11539 10014 4775 -18136 -4367 11236 -3942 -14114 2893 6834 -5132
1702 -5132 -283 3488 -597 4541 7177 -4802 -845 12551 -1816 -13106 4263 12147 -12099
1715 -12099 -12839 8431 1481 -13806 -2367 5825 -3471 -1924 3069 -1593 2568 9052 -2502 -5162
1729 -5162 12321 6527 -13226 -1871 14659 -4779 -15452 4608 6450 -10721 -5876 5184 -1154
1742 -1154 -1661 4307 -1598 42 11156 1850 -8828 8224 13082 -9714 -7618 12941 2050 -15560
1756 -15560 1 8132 -7488 -7877 3274 -1960 -3214 3843 -1596 -4424 8794 6573 -9033 2149
1770 2149 15984 -3449 -12109 9803 9887 -12856 -5762 7825 -3805 -8993 920 272 -4474 3833
1784 3833 1166 -6859 5437 11346 -7091 -4832 15854 3511 -12771 3971 11933 -7971 -8798
1797 -8798 6276 775 -8852 -685 -449 -6006 2649 2765 -8299 1064 13531 -2808 -9492 11059
1811 11059 10368 -10198 -2739 13296 -1319 -10861 3891 2094 -7317 -2755 77 -7105 -372 5521
1825 5521 -7383 -5187 13338 3383 -10825 6115 15126 -5596 -6758 11614 4532 -9611 437
1838 437 3987 -6809 -2582 1579 -7233 -2962 7297 -5204 -9163 9581 8840 -10494 -1391 15410
1852 15410 227 -9915 7282 8098 -7465 -2966 5000 -3988 -5096 3012 -5404 -6398 5981 -51
1866 -51 -12543 3022 12531 -7019 -6655 12419 6347 -9041 1721 10658 -3758 -4981 4434 -2535
1880 -2535 -5486 3250 -3279 -8738 4307 3523 -11532 -2800 12715 -1586 -10375 8765 10520 -6276
1894 -6276 -1782 10600 407 -3559 3776 840 -5673 2926 777 -10356 746 7631 -9004 -8395
1908 -8395 12019 3858 -11831 2360 13555 -1980 -4781 8002 4324 -3588 2999 862 -5957
1921 -5957 2278 3247 -9143 -4517 8280 -4356 -12105 6184 8543 -8504 -2728 11822 1445
1934 1445 -5554 5176 5263 -2778 1983 3776 -4738 89 5268 -7959 -7346 7952 1358 -13749 418
1949 418 10343 -5805 -6691 8518 5226 -5202 3065 7040 -1592 1080 5205 -3593 -2740 5903 -3178
1964 -3178 -10515 3600 5162 -11438 -5316 9473 -913 -9530 4698 6867 -3600 -185 6532
1977 6532 -89 -349 6396 -1941 -4224 6502 1673 -10869 -232 6651 -7181 -9780 5996 3796
1991 3796 -9209 -1018 7060 -1257 -849 6649 1326 -765 5444 566 -4791 4688 6119 -9066 -5084
2006 -5084 8411 -2747 -10650 1727 5541 -7457 -3294 5904 1323 -2552 4965 2055 -1613 6196
2020 6196 4143 -5000 1808 7798 -5316 -7201 5770 2305 -11573 -2320 6082 -4249 -5310 3142
2034 3142 2832 -2398 3554 3553 -2043 4108 5711 -4812 -1474 7848 -1052 -9117 2146 6096 -6644
2049 -6644 -5763 4396 -337 -6273 867 2919 -2322 1646 3620 -1569 2287 7457 -1588 -4488 6600
2064 6600 3868 -7965 -139 7043 -3616 -7206 2440 2708 -5680 -1817 2488 -1653 278 3910 -1132
2079 -1132 -321 7384 1368 -5025 5012 7077 -6291 -3703 5893 249 -8001 -51 1940 -3492 -1924
2094 -1924 934 -1442 -890 4278 -447 -952 6215 4369 -3973 1172 6957 -2130 -6385 3852 2465
2109 2465 -6553 -3505 2529 -2579 -4018 461 -1366 -1141 3270 1020 -2786 4309 5626 -2427 -882
2124 -882 7795 2034 -5532 1449 4840 -3788 -4189 628 -983 -2721 -980 -1245 -1868 2356 1216 -4476
2140 -4476 1250 6694 184 -1898 4864 5137 -3539 -1136 4347 -662 -4460 967 -202 -3011 -348
2155 -348 -806 -3584 1031 2419 -2622 -349 5966 2210 -2682 2315 5337 -316 -3146 4017 1686
2170 1686 -3024 -648 689 -2208 -678 -1244 -3946 -1229 2057 -2564 -2496 4805 3241 -3176 494 6763
2186 6763 693 -2141 1490 2475 -48 -1841 -562 -1380 -1066 -962 -3485 -1252 2062 -1060 -4227 2174
2202 2174 4520 -2265 -1368 4731 2986 -1790 437 1879 56 -998 -511 -2415 -1104 -966 -2966 -3528
2218 -3528 1417 1 -3776 35 4627 1211 -1877 2855 4608 332 98 2032 1005 -41 -84 -1082
2234 -1082 -1498 -339 -2014 -3580 88 872 -2938 -2283 2689 2574 -1351 1294 4273 1367 -362 1125
2250 1125 1414 649 -771 -1400 -651 -308 -1428 -4157 -1417 1281 -1769 -3507 1106 2915 -1255 -404
2266 -404 3586 2704 1990 1675 2614 942 1064 -508 -1890 554 642 -3415 -2436 641 -735 -4232 -319
2283 -319 2512 104 -317 1631 2551 508 1130 687 1217 2175 25 -2415 -741 136 -2327 -3310 -344
2300 -344 93 -3368 -851 535 176 -154 598 2063 1752 710 1282 1070 1814 106 -1249 124 1135
2317 1135 -1666 -3442 -579 -308 -2394 -3121 478 842 -1054 -715 1155 1294 1200 164 1062 2058 1689
2334 1689 -1512 -1036 1122 -734 -3158 -1610 593 -1611 -2891 -685 988 -102 -1636 -121 1272
2349 1272 2042 1082 970 2686 1945 737 -1237 179 534 -2451 -2147 341 -34 -2755 -2294 137 570
2366 570 -1359 -991 1789 983 1558 -290 1253 2997 826 -840 1307 515 -1436 -2528 -946 133
2382 133 -2684 -2946 -1299 570 -406 -1529 105 1508 1883 392 547 2149 1236 -1006 348 1365
2398 1365 587 -2443 -1192 817 -711 -1712 -1518 -572 -806 -1546 -563 2108 2353 790 718 1718 2222
2415 2222 -65 -281 1822 520 -1776 -2272 -337 -719 -1654 -2387 -1148 -620 -18 -799 1214 2363 113
2432 113 -209 1880 2638 1565 -126 503 1889 -1540 -1180 -1314 -142 -1913 -1797 -1146 -255 -12 -276 -1755
2450 -1755 1115 538 476 1166 2511 972 -148 116 934 457 -1142 -846 -765 -1051 -1912 -2089 -1106 -1123 -2019
2469 -2019 -1509 -172 903 72 294 2532 2349 761 -876 1516 1319 -710 -1755 580 113 -1363
2485 -1363 -1512 -1003 -492 -1157 -2618 -1102 1194 760 -125 1095 1435 1540 -716 508 2164 610 467
2502 467 -316 -335 -1271 -1517 -1351 -87 -585 -1771 -1169 491 767 -907 509 1454 1972 194 423 1950
2520 1950 865 -33 -879 -331 -506 -1976 -1936 -1385 32 -1233 -2160 361 -8 98 376 1192 2041 1112
2538 1112 271 1750 1166 133 -274 -145 1006 -580 -900 -650 -411 -1254 -1101 -1585 276 476 -198 428
2556 428 1944 2027 103 1660 2374 1077 -355 398 1100 -273 -2656 -1117 -660 -1264 -1822 -2443 1456
2573 1456 -339 -751 -393 1182 1085 -66 822 2493 1322 -595 117 735 -212 397 -574 -527 -227 -960
2591 -960 -2503 -324 1347 -77 -988 215 1599 1258 -339 1076 1189 170 456 942 1024 -362 -779
2608 -779 -462 -396 -1214 -2244 -1958 -401 -406 -1779 -676 873 705 117 454 1749 1222 711 323 891 1075
2627 1075 -701 -928 -589 -170 -994 -1441 -925 178 -696 -1272 411 525 501 708 815 1476 1061 553 1186
2646 1186 613 -263 -921 -415 -213 -1092 -1334 -1618 -539 -101 -1316 40 481 303 675 1372 1262 740 1264
2665 1264 357 1096 -681 -249 -118 -705 -995 -1377 -1316 -1210 -799 -1215 -446 283 1608 -1098 232 833 1573
2684 1573 904 362 1714 785 169 191 -304 211 -1085 -1741 -1360 -1507 -380 -1114 -180 864 411 928 1484
2703 1484 1106 971 -251 1213 856 43 -286 -1102 449 -834 -1732 -491 -581 -1573 -386 -1111 -104 -326
2721 -326 593 826 844 645 236 533 1769 1407 462 824 184 686 -1935 -1164 -505 -209 -1605 -1343 -70
2740 -70 -559 -128 836 1261 563 770 180 1104 966 130 -714 1 9 99 -1566 -458 1272 -726 -201 -653
2760 -653 -242 -496 1014 1853 1170 543 -601 839 1246 1481 -1464 300 227 -280 -178 -1314 -526 -1991
2778 -1991 -2291 -956 -637 -1266 -122 -369 176 1562 990 660 1160 2431 -529 -736 693 961 -913
2795 -913 -595 -82 -153 -1488 -675 -1128 -132 265 -742 -133 903 773 376 1153 1523 373 -259 1058 171
2814 171 -312 -760 -758 -667 -883 -1126 54 -1140 -757 -1497 540 898 691 -158 786 1622 796 -349 393 -3
2834 -3 1496 65 -173 -450 -543 -1330 -1272 -613 199 -230 -1300 614 2055 1045 382 2280 1346 943 821
2853 821 395 819 -172 -1006 -296 -1169 -354 -1932 -193 609 -658 -793 -183 193 47 352 1692 1432 1473
2872 1473 1456 444 760 1190 -400 -885 -39 205 -793 -1605 -1003 388 -1152 -159 960 814 360 142
2890 142 1558 674 320 589 1453 241 -342 -316 203 -912 -1948 -1351 -789 -182 -1497 -436 253 -160
2908 -160 -1170 -586 522 748 742 393 263 867 -27 729 -568 -129 -412 -851 -168 -542 -731 -1153 -461 117
2928 117 -202 -50 593 485 141 -4 381 1656 356 339 4 952 -1410 -1018 -630 -84 -380 -284 12 -91
2948 -91 200 -440 -847 -72 1461 456 1532 1174 1065 -288 81 -37 -225 -248 -733 -142 -1154 -2571 -1741
2967 -1741 634 -277 -650 598 580 941 1275 1270 981 25 1707 -544 323 939 333 -240 302 -1153 -377
2986 -377 -1032 -2055 661 -999 -1362 196 664 552 1713 175 -50 1910 820 -87 935 -255 -775
3003 -775 -136 -112 -773 -1396 -752 -939 -52 -1027 -667 121 441 -278 -540 618 1137 879 639 831 -130 120
3023 120 -1050 -333 -776 -826 -689 22 -846 -193 125 642 -528 627 396 1320 1310 508 -355 1254 -436
3042 -436 229 -1328 -487 -920 34 -1233 -1183 230 -798 -1042 173 -394 538 831 910 1173 965 1431 18
3061 18 1306 -213 87 -220 -977 -825 -1093 -959 -31 -700 -379 8 -192 1007 161 560 1022 1063 915 850
3081 850 773 813 154 589 -693 -736 74 -1469 -510 -713 -1295 -1108 -153 123 200 377 177 408 1224 348 564
3102 564 643 93 -773 -627 132 -188 -1173 -416 -169 -404 -383 -1033 -143 -113 558 46 1155 477 361 997 1726
3123 1726 905 337 -949 -562 562 -757 -710 -1221 -1105 -926 -1056 -757 48 -427 -259 144 1008 639 1148
3142 1148 154 509 1003 374 -403 -274 337 -1032 -1620 -858 -1045 -639 -107 -507 -45 718 442 577 -75
3161 -75 772 321 1472 278 -245 116 -217 154 -613 -315 -514 -591 -943 -325 -1653 -386 470 -287 270
3180 270 1229 -574 772 1011 -211 -37 974 557 381 177 74 -367 157 -253 -66 -1515 70 -913
3198 -913 -1590 -1005 1953 2062 108 1115 523 637 -319 736 -111 -329 -119 -905 365 -1206 -326 -941
3216 -941 -556 223 530 -1081 489 1874 693 -456 1657 410 782 655 137 1035 174 -791 -1171 -620
3234 -620 -1342 -1358 -898 -267 -473 -416 159 -446 881 943 1615 407 1351 916 -16 -47 93 592 -356 -381 150
3255 150 -1426 -644 372 -752 -1161 166 141 -669 999 700 1169 189 362 852 519 714 516 -120 -255
3274 -255 -301 -883 -2051 607 281 -547 -889 355 460 82 397 883 1398 271 1089 -844 360 147
3292 147 94 -427 -513 5 -1382 -372 -462 -462 -778 202 15 -862 -87 955 886 117 866 524 1061 1328 564
3313 564 78 -362 -306 -681 -784 -608 -913 -1442 -523 534 -70 608 482 1099 493 426 -6 683 39 825
3333 825 -978 233 534 -173 -686 -47 -474 -1629 -77 1102 229 -738 343 327 -39 764 -103 685
3351 685 689 401 -913 -612 -261 -259 -982 -855 233 -330 -1090 -225 478 -980 565 268 698 612 1451 128
3371 128 809 638 735 -738 171 -148 -613 -342 -169 -764 -1235 85 -358 -572 -345 417 -785 -157 837
3390 837 343 185 1107 366 38 -813 1209 -710 -1385 151 -481 -1373 52 -232 2 -713 -518 849
3408 849 773 989 521 406 -12 489 -470 629 509 -390 -329 527 289 -965 -44 -514 -1201 296 -9 -231
3428 -231 464 1144 496 270 905 267 -433 -1014 904 -146 -1921 -291 -602 -1807 -341 143 216 -388
3446 -388 -475 372 -748 1288 445 -655 433 971 -334 -773 -483 825 -1103 -1368 159 8 -1259
3463 -1259 361 -242 472 631 -1138 -258 872 1262 -12 60 1352 1968 307 754 1252 -464 -164 591
3481 591 452 -1664 -543 1045 -1193 405 579 -29 -778 743 644 -11 1470 1666 227 1094 776 -687
3499 -687 -664 429 442 -1547 -377 -34 -844 -211 -331 -592 -167 714 721 -602 -208 1133 11 -193 1222
3518 1222 623 -513 273 -281 45 674 461 -897 -1074 -116 2 -149 381 792 -222 524 1243 333 3
3537 3 1403 2094 -927 -103 519 -482 -517 -115 -549 -645 -306 233 -763 61 -193 -266 -304 1086 599 -613
3557 -613 1038 1587 153 39 649 -70 -1199 -341 -611 -925 -580 -363 -1019 -479 435 -296 69 -84 1522
3576 1522 95 -711 1820 788 61 240 269 -822 506 264 -1504 -447 801 -1177 -1550 1461 112
3593 112 -483 1554 519 770 517 1322 -229 152 261 1354 -1256 1112 171 -1213 -1128 -354 -532 -1799
3611 -1799 273 -222 -590 -495 1405 511 565 953 237 248 788 405 -685 -120 1067 -710 -1731 -166
3629 -166 179 -889 -513 -209 46 -1657 1065 239 -767 -99 637 -288 732 659 697 398 239 -527 -694
3648 -694 267 -171 -1303 302 142 -1181 -1290 -243 302 -737 551 1354 785 -619 822 -259 -757
3665 -757 1127 705 -564 -1601 195 -1052 -222 -592 634 -1767 169 262 191 -35 1283 1669 -692
3682 -692 91 1020 -809 -142 419 330 357 72 -263 -1253 -326 -466 -1567 -442 175 847 -40 818 624 -436
3702 -436 185 266 108 291 649 -234 33 590 -196 -1078 -241 -901 -1201 -1154 24 -149 -450 1004 969 -620
3722 -620 1700 990 341 -215 1091 470 89 254 11 -1547 -355 -106 -138 -665 388 312 -477 141 642
3741 642 532 477 1236 -102 -248 360 1020 -1029 449 917 106 -1389 962 798 -930 -444 412 -939
3759 -939 -345 115 445 -600 418 -147 -868 502 269 -689 471 -141 -19 -889 531 -425 -1508 -1588
3777 -1588 -710 -678 -319 -23 -181 571 466 1791 -227 203 1271 -89 -216 414 304 -433 469 159 -411
3796 -411 -200 -494 457 -409 -623 230 -626 552 663 247 128 665 351 371 697 -681 448 -520 183
3815 183 -1175 -749 -345 52 -1540 -246 19 -188 451 835 -196 608 788 455 -755 -1234 806 -680
3833 -680 -460 -444 -1090 -1290 -1199 -622 -1156 -756 -29 -455 -1434 -36 751 -630 1108 937 544 68 -80 94
3853 94 -331 435 -890 -562 -790 472 -971 -1146 -65 -340 -341 361 18 1253 1004 477 1279 -822 813
3872 813 -239 157 361 -473 -510 -730 -61 -487 -1230 554 151 -317 -320 791 -353 -222 972 -92 290
3891 290 -281 616 48 -881 -304 -739 -1618 -454 160 -886 -417 323 -1295 -1026 -263 1205 228 -586 415
3910 415 110 535 -30 147 872 89 -361 -144 -438 -645 -807 -1046 -170 -463 -321 207 478 -66 67 1030
3930 1030 397 -218 194 343 551 743 -408 -520 -508 -711 -946 -1210 -843 -1081 -545 333 -389 515 -364 605
3950 605 -348 808 -149 1203 -42 -670 1651 1685 -11 -62 -644 314 36 -221 -683 -743 455 478 384 900
3970 900 63 -401 109 132 927 -576 9 297 -405 -178 -1 -259 -395 -546 -630 -810 380 -401 -178 -523
3990 -523 -362 873 326 -121 490 -446 -235 292 16 -1232 -154 169 -913 -743 -750 -837 -184 -245 412 328
4010 328 691 159 -167 575 -65 402 426 594 -470 453 -581 -313 -589 -363 -1103 152 -561 -513 -948 -776
4030 -776 -92 54 183 387 541 -135 -179 -105 -140 206 -407 87 212 -520 -564 -1048 -344 -601 -847 -773 82 289
4052 289 629 907 -135 -372 -253 1184 1014 145 514 -43 235 -352 -150 -239 -868 -716 -499 -864 -418 224
4072 224 238 701 780 -95 266 1251 -150 359 146 413 -802 210 186 -544 -554 -1159 -465 -693 200 -325
4092 -325 -841 183 1015 -736 913 1188 -289 250 -478 649 37 192 129 212 45 -312 353 -411 -714
4111 -714 -214 -841 -580 255 639 80 914 -454 487 125 327 644 -1559 -792 954 449 -1007 705
4129 705 -677 -83 2 427 -178 369 750 571 -434 75 -45 474 -419 -505 296 -151 102 -1147 -393 -912
4149 -912 -312 -263 -102 -253 -359 -680 375 161 -40 541 409 -10 -570 434 810 581 -422 764 -133
4168 -133 -861 134 -1092 -356 -455 208 -125 441 69 -184 -170 293 358 67 29 911 -80 -610 -145 -658 -414
4189 -414 -13 -200 150 -244 -117 -565 -276 358 533 -331 262 1031 52 268 -542 368 43 -63 120 722
4209 722 -212 -825 -763 198 -1161 -512 -541 -518 256 301 146 227 591 181 126 246 572 -371 294 190 496 -36
4231 -36 -554 -564 -451 -286 363 397 521 917 279 18 283 994 243 534 139 258 431 353 -621 -637 174 -121
4253 -121 114 365 335 -1119 -39 -24 311 287 -127 -508 587 354 -496 -60 129 740 146 -407 -214 -530
4273 -530 -816 100 -743 283 -550 236 -229 -1214 1894 88 -8 912 -216 717 -105 509 -123 -878 333
4292 333 408 -119 342 -653 -160 -77 -119 158 -282 1111 377 992 96 -453 426 -43 119 744 -865 781
4312 781 -850 -274 -1109 -93 -449 -835 292 -1049 66 55 454 -447 -783 54 1204 -242 -44 205
4330 205 183 -615 -374 -829 -114 -1140 775 -725 313 -213 -526 653 -569 846 -101 261 171 -41
4348 -41 120 780 -17 -734 -691 -188 196 -730 327 -267 47 4 -479 -148 325 146 -147 403 -815 345
4368 345 574 -9 107 638 413 486 49 341 -214 -22 211 570 -417 -934 157 438 -601 -97 265 639
4388 639 737 258 1317 289 407 -108 452 376 -715 -1300 -685 -311 1107 -177 246 109 -556 603 36
4407 36 230 249 785 125 -134 -76 -678 352 53 -252 -305 -609 -35 809 -479 -235 -165 -142 177 -48 591
4428 591 -731 397 832 -684 669 373 154 488 690 -1078 -68 -586 -1215 -365 387 710 -509 -19
4446 -19 911 -820 -6 187 147 -492 156 -371 -254 -217 5 506 -608 55 43 -57 538 -69 822 297 -393
4467 -393 19 149 -130 438 422 813 -79 173 -334 -329 182 85 228 141 833 -322 -208 655 774 332 -564
4488 -564 -182 257 118 -902 478 288 -531 655 -371 305 -339 113 -269 -857 -784 -1136 56 6 -121
4507 -121 -465 -134 -167 286 -93 428 -62 -182 799 152 -110 560 216 245 903 -791 -396 -450 86 -491 223
4528 223 680 658 163 -469 -319 546 -263 -349 494 216 425 84 -291 88 27 -342 -205 -481 -202 -768 -527
4549 -527 292 657 -489 -113 -218 704 108 254 637 592 450 -608 -481 -99 -33 692 -274 -212 -419 -408 153
4570 153 -335 -26 -387 -49 333 -72 196 540 -39 398 -437 -291 376 551 83 -736 -193 -166 440 -474
4590 -474 -510 158 -230 -118 683 402 183 -189 619 632 1409 633 391 -134 -391 -427 -686 373 -442 -603 -361
4611 -361 -902 -864 -131 378 399 610 352 56 143 -229 -214 1175 -53 -201 553 -283 -36 137 -550 295 429
4632 429 -657 -508 196 -428 -1016 176 -798 450 -586 5 -484 -283 1051 -653 -573 -864 -599 -429
4650 -429 194 -801 -168 -372 225 78 353 -317 64 538 289 -166 45 744 -238 32 497 -411 109 -909
4670 -909 389 -15 -236 -2 -86 94 -892 257 -179 -283 92 534 -146 459 -569 381 2 1050 -183
4689 -183 473 316 -396 117 -393 -567 -495 804 328 498 786 -325 702 573 1043 299 367 611 -127 -371
4709 -371 191 -3 -952 -409 -834 468 691 6 -1118 86 -342 324 199 197 496 252 269 -380 -239 568
4729 568 -416 -58 -158 -58 -414 -210 721 430 370 1035 -178 -515 138 30 -522 286 1113 -269 -738 -88
4749 -88 64 202 -46 310 426 -627 -158 -18 292 98 -848 -153 231 767 -132 -321 1405 -50 126
4768 126 105 -310 -115 813 9 135 686 -340 -306 -297 1154 -229 -200 421 -375 462 -279 803 702 959
4788 959 687 98 -555 -72 556 77 -396 -432 76 -596 -123 714 1487 510 -422 1118 -465 -136 1027
4807 1027 -229 -431 -173 607 -150 -466 -567 -307 194 -488 -354 -2 -243 588 -807 157 180 283 247 460
4827 460 535 57 343 -213 525 210 43 -917 1126 -434 -436 262 -69 -337 320 -474 -14 375 26 183
4847 183 -114 137 185 -181 889 -294 351 185 -241 -562 29 -842 -365 -10 38 178 -281 -545 382 698
4867 698 296 155 -190 769 101 -241 -485 -674 -756 -1021 -527 -648 287 -512 612 -106 -16 502 -461 300
4887 300 420 498 726 -105 466 108 129 480 -93 -255 73 -774 -240 -544 219 -492 124 1107 -1144 607
4907 607 612 394 74 -94 -1079 -302 -663 107 -683 56 401 44 -717 1113 -557 17 77 1104 -83 -162
4927 -162 465 180 -944 -217 370 33 79 266 -610 -571 494 -650 -136 -668 -264 514 227 23 274 662
4947 662 -377 481 1224 125 57 265 -83 -302 319 817 -675 -31 -115 115 -109 -874 -18 -1 329 630
4967 630 317 150 -91 125 -273 -655 540 -222 512 -129 238 -387 -222 -234 -139 36 -215 -211 -184 -110 552 492
4989 492 661 825 29 987 -751 925 -234 48 172 171 160 -519 -448 143 -281 224 696 667 -526 -47
5009 -47 -631 249 444 215 518 474 -516 -1149 -642 -465 -679 -818 -28 -19 33 -663 -332 -561 -82 109 509 -60
5031 -60 -196 157 1118 -278 438 -491 7 -98 103 1134 -345 -338 -614 131 -806 -411 -662 -263 21 499
5051 499 446 -52 -740 -21 1296 -339 46 254 327 -38 1056 42 182 -104 139 -590 478 -28 -245
5070 -245 -157 892 -5 245 430 340 1097 -498 -147 164 -330 -101 -207 -802 -410 -541 199 12 94 75 265
5091 265 204 446 -451 506 -7 -590 445 323 -413 -573 -748 -38 404 665 -583 269 -669 -581 -264 -252
5111 -252 -295 -20 -737 -72 -606 577 -237 579 132 60 -26 -147 -7 468 316 107 -918 -293 827 -366
5131 -366 -149 -234 420 -475 -257 349 818 607 48 -123 -273 -386 31 -157 -529 -387 -464 102 71 -690 -267
5152 -267 -92 50 38 736 502 668 400 652 191 -421 -388 481 -231 -167 236 172 -631 -482 562 -130 140
5173 140 -83 -104 605 -312 -48 840 714 274 -234 -407 -523 590 1178 -468 -683 -327 -167 112 79 -308
5193 -308 -89 -346 351 892 -448 -294 -602 1064 -90 -232 137 79 -3 -844 -479 246 122 16 212 505
5213 505 -759 -190 200 -36 -143 92 263 777 -521 -30 645 78 -223 385 -419 -1559 -307 -416 277
5232 277 263 692 528 -164 -613 -278 189 353 323 726 -414 982 267 1145 -541 277 761 104 436 -129
5252 -129 -479 -862 -6 336 -107 382 -397 2 -185 -650 468 497 352 -175 -101 74 -420 291 666 457
5272 457 115 -145 -337 -584 676 596 63 -478 218 76 350 40 -105 -133 -487 988 69 1295 524 527
5292 527 -598 282 -192 -1602 -34 197 -493 -351 -162 42 -97 -63 -514 -95 265 137 999 -200 -551
5311 -551 689 378 21 -288 217 210 -42 -80 -645 -594 1009 -1126 116 5 -623 -442 408 -166 -498 -322
5331 -322 866 -752 -109 -76 -301 -449 -344 128 -9 9 947 271 669 342 29 159 92 906 -344 -1038
5351 -1038 -717 90 682 -478 -723 -322 333 -19 613 55 1079 1099 -113 -397 66 -115 372 -423 330
5370 330 -551 26 376 457 275 552 -365 -137 369 -524 150 -157 858 -1204 -506 31 -306 -365 -25 -178
5390 -178 438 -341 543 -431 -904 -145 128 10 -254 187 42 -421 433 343 352 -526 536 318 464 346 -431
5411 -431 -258 244 604 412 545 -298 -21 -436 784 287 -107 149 531 61 -480 -689 -623 439 -215 -272
5431 -272 -649 781 298 -90 -932 285 663 771 48 298 652 -79 700 1031 110 -505 648 56 351
5450 351 -205 -556 174 221 0 -791 -154 -885 -59 -274 44 -399 522 212 580 -253 -200 314 379 -2 463
5471 463 290 -188 -304 20 216 149 423 -612 -20 1044 -639 -319 508 -646 14 515 -121 891 62
5490 62 -321 658 136 -868 28 192 207 12 -456 -2 -216 112 -947 109 -340 538 893 375 -286 273
5510 273 266 442 -371 -520 316 -265 604 -400 -148 -81 38 -192 -489 127 -122 -599 -174 436 -202 481 -131
5531 -131 -40 343 509 179 0 5 625 -493 -1616 230 -723 357 353 -847 -507 860 673 -216 -47 -66
5551 -66 428 594 862 -465 87 -94 717 458 -474 407 -725 347 99 366 -256 156 -218 -58 -865
5570 -865 167 -230 652 29 -382 -1 -452 -87 109 148 -324 -773 -382 -581 -422 203 -239 -675 -87 -113
5590 -113 211 -495 -155 362 318 74 176 -78 306 278 544 -454 389 -172 437 238 -553 187 -254 -43 -373
5611 -373 216 729 43 605 319 544 -283 678 856 177 -396 170 -235 150 535 13 -43 235 122 641
5631 641 490 809 -425 33 228 982 -117 -33 588 63 -447 -280 465 -708 -40 240 592 -135 280
5650 280 -610 367 290 -217 488 -378 17 -488 -282 -189 -507 -712 -478 -707 356 -80 8 -666 990 -376
5670 -376 -652 1189 -47 -843 -47 -427 -414 31 24 36 -488 110 8 -79 -10 -10 -684 892 133 461 284 -188
5692 -188 991 48 -329 -75 599 33 67 310 527 520 223 -36 68 -67 -295 -30 -534 -488 -629 -326 64
5713 64 -525 -661 104 -361 -325 -939 229 -104 296 -464 214 -115 -926 -313 129 165 148 -463 22 -578 40
5734 40 -386 -27 347 620 324 933 -83 -43 113 -651 460 338 -497 187 -351 -963 -144 20 113 191 669
5755 669 641 510 488 419 34 606 -113 -212 16 829 -1378 175 521 -819 -234 -55 187 -55 -249 311
5775 311 -492 218 644 -274 -117 166 -208 -219 -390 427 248 307 -185 431 -149 -134 25 509 328 -685 555
5796 555 614 4 -284 -3 -215 953 -509 -801 248 -232 -1259 381 -72 115 -1009 -382 -587 -137
5814 -137 -27 -664 182 119 -268 -648 -154 468 295 -143 620 236 672 474 -499 743 24 -459 372 -638
5834 -638 695 166 -321 -26 474 -35 -689 -85 360 787 9 -580 -67 401 -24 -128 563 -167 -183 -488
5854 -488 -333 -466 481 406 -226 140 -523 -167 375 183 -403 292 -129 1055 446 -438 89 -955 292
5873 292 104 170 -139 -304 -659 32 181 237 428 -945 -756 -205 -254 -134 -269 -92 57 267 -237 -772 -146
5894 -146 -838 263 -210 -188 126 543 254 -431 -352 118 24 775 -1129 -694 -175 704 -8 -161 -589 234
5914 234 -239 -481 -140 108 900 124 365 64 698 -182 91 93 -831 686 -616 201 245 -459 -207 -191 -608
5935 -608 -360 235 38 -41 -337 -231 305 -395 -274 128 -84 -25 157 335 -662 323 786 -425 -126 69
5955 69 194 243 410 167 145 -164 -19 -766 -53 595 -200 539 -262 219 -26 -223 669 764 134 -386 227
5976 227 -4 42 -423 -621 -723 457 -56 -107 -417 -54 145 539 -116 566 -100 -271 219 253 -142 -158 -85
5997 -85 -516 -347 594 309 112 7 -464 -215 278 -530 -236 407 170 -265 -84 -305 -522 -43 373 633
6017 633 -703 783 -260 295 314 557 757 70 523 -601 -485 110 152 512 27 336 -508 493 -118
6036 -118 102 638 -296 627 -179 -383 190 723 -93 1 507 817 -880 1245 -248 -590 207 -570 -319
6055 -319 559 -294 69 815 -693 124 368 -128 -19 -743 -472 345 58 198 358 300 -424 590 -550
6074 -550 -41 -541 -126 -381 254 269 939 49 290 -232 -320 -43 574 959 582 -359 -489 -4 1033 -635
6094 -635 -248 28 127 -597 8 -74 -544 273 1024 459 217 -645 -94 -377 -41 54 -351 16 -162 -5 86
6115 86 442 -1142 9 -222 39 -396 -409 -250 225 393 -310 -589 310 -70 -469 196 255 364 178 588
6135 588 630 -505 -523 -494 -141 -98 -96 -191 -46 -262 47 570 -141 194 581 -123 304 660 118 -113 513 -259
6157 -259 393 -8 -346 232 -767 -449 348 -79 145 35 80 689 -441 -328 -191 45 -276 -405 -391 104
6177 104 -289 575 -839 -279 617 -227 120 344 -108 -729 -309 267 302 649 -311 63 360 -129 -223 -397
6197 -397 -368 599 241 -538 349 -425 638 -67 -642 -29 -463 619 -256 -1085 251 -336 -462 272 133
6216 133 148 -175 115 421 -148 635 469 57 632 467 532 -42 -718 -85 504 -528 -246 681 -469 214
6236 214 -789 -343 178 288 -87 -237 -202 -594 934 -338 106 -227 -287 -386 -164 -40 405 1222 -98 -748
6256 -748 -128 36 -69 349 249 -50 -80 64 -697 -297 272 -391 123 -730 292 -233 -29 36 -812 -558
6276 -558 -353 -353 -138 -705 -508 -632 748 -185 128 450 -1032 149 164 107 515 442 149 -487 -95 127 1074
6297 1074 -668 -34 -43 -202 250 -529 -553 488 594 -521 -72 -805 237 -356 -187 -393 -4 894 -347
6316 -347 -129 -441 -255 -221 553 -24 1480 189 -596 -160 -259 627 -39 -25 -680 -458 -46 67 -107 1038
6336 1038 189 -7 -21 37 586 337 -537 607 -977 -233 -335 -7 -170 152 -1039 482 -437 50 635
6355 635 -323 39 -55 -98 -799 469 -172 171 -1 551 -265 -462 -228 221 -186 718 -147 1093 1022 88
6375 88 -592 -594 889 -309 -112 -384 -78 252 143 -177 -518 58 -71 391 -130 -1075 492 -544 77 457
6395 457 666 241 -568 8 -151 22 816 44 -575 -590 624 268 506 305 -645 269 -307 -145 -733 374
6415 374 952 -94 83 79 306 255 -218 -261 810 468 96 37 41 1028 -149 44 239 -920 -409 -30 720
6436 720 400 331 -458 450 -1222 500 261 -234 664 -601 314 -382 233 729 -502 -278 88 250 519
6455 519 -402 921 44 516 -227 589 -490 522 -750 73 248 72 -409 118 -375 -1046 -1115 602 126
6474 126 49 726 252 -304 -95 562 -629 65 -172 283 662 -351 49 -47 572 11 -62 -799 1158 -333
6494 -333 188 464 -26 -544 -278 226 210 551 942 429 -795 112 171 1146 -747 -58 347 -20 -281 67
6514 67 -508 85 -122 224 452 294 -129 265 714 -720 292 -336 -405 -373 -80 -283 695 -42 438 -486
6534 -486 299 881 -133 669 -225 490 -418 89 -167 572 -243 431 -350 791 484 121 -405 -756 -313
6553 -313 -210 219 53 111 -112 804 -383 -196 -225 143 121 -29 -32 59 -514 -44 -263 323 -65 -724 141 -13
6575 -13 -532 98 -850 671 268 -414 -547 -168 20 735 -588 222 -622 -197 580 684 518 -99 -210 -710
6595 -710 -1 -616 -418 -44 134 -543 230 697 720 -129 857 286 -232 -376 -380 -151 621 611 -155 -301 1185
6616 1185 -229 -603 184 -889 945 -919 660 594 452 756 171 -1095 -379 222 301 115 1170 -3
6634 -3 260 -222 600 -3 -76 -177 108 -480 154 -95 148 130 -459 408 -400 -399 -63 -197 17 574 84 1112
6656 1112 748 465 265 1542 -482 462 -167 276 131 137 324 -535 -440 149 719 -386 -42 620 317 258
6676 258 -772 411 582 -31 500 215 -830 639 -889 -68 237 -115 -478 70 -83 -34 1084 -408
6694 -408 -758 612 -265 -956 63 272 -134 105 88 -221 -864 183 -522 -21 342 261 499 -348 -477 361
6714 361 213 -249 203 302 -407 769 -227 -56 1295 -665 36 350 10 -634 -395 765 604 784 -1289
6733 -1289 845 194 320 -392 456 -619 93 721 259 680 -618 -122 -429 424 -525 -194 337 512 287
6752 287 148 -416 233 -225 29 103 88 -202 113 -117 -63 -279 -846 -342 -496 272 450 102 233 -96 -711
6773 -711 708 -133 -311 995 -501 -732 -125 643 657 651 588 617 -154 -644 -838 -307 -533 -1115 62 619
6793 619 -271 26 341 -4 250 -512 -461 -323 -1110 295 706 293 -422 745 31 363 -259 -502 -351 -232
6813 -232 285 -879 -277 553 548 -511 -638 -384 -364 -172 -325 616 1059 -191 -307 390 450 -662 -120 -567
6833 -567 185 1611 965 -63 582 -283 326 -497 -547 -3 -282 621 -208 -38 334 -210 -280 -279 682 -773
6853 -773 -142 48 865 -234 -473 412 311 -330 -481 -781 443 468 640 258 -87 13 -179 -33 307 424
6873 424 -385 -642 771 -464 1180 -107 -550 66 -342 103 -658 77 92 287 -379 -594 -502 397 -100
6892 -100 502 244 616 364 -79 -435 490 267 343 -320 -372 -344 -403 172 330 218 -217 -251 218 -254 267 450
6914 450 -361 -751 -468 -395 683 323 89 40 371 -275 179 1027 -547 -463 239 216 314 341 -901 681 635
6935 635 178 -975 -440 65 -557 -213 115 -535 389 -406 -527 479 -859 745 288 -293 -373 -233 -570
6954 -570 216 178 -206 -771 -265 182 -25 205 -365 276 -503 -98 66 381 58 127 -276 214 -871 248
6974 248 360 -315 -229 -107 63 -269 206 152 291 662 303 94 695 -75 -140 -432 733 219 -265 -52 108
6995 108 57 530 322 -411 -546 -496 -797 -337 -666 343 -386 728 -268 -813 -264 414 541 -601 -226 -326
7015 -326 -591 -272 293 546 644 145 900 198 -152 57 195 807 613 107 1214 189 86 -181 -260 -241
7035 -241 -327 22 -325 684 -105 531 4 84 -533 150 -174 309 617 351 134 -208 70 -782 305 -344
7055 -344 -514 -418 329 171 -129 504 -277 -359 -349 695 -281 -107 565 573 562 -43 -271 -563 494 -314 424
7076 424 -276 805 -197 159 522 86 142 -235 -121 -500 -415 391 441 393 300 -289 -192 152 -41 -832 604
7097 604 123 -39 157 -89 140 -92 -145 -509 766 414 720 704 -89 426 394 1002 376 -271 428 179 18
7118 18 345 149 -425 665 111 -236 7 213 252 882 -730 -215 -658 -443 726 -320 -576 -333 -286 -386
7138 -386 -760 -395 380 218 -7 -402 -143 443 -567 -685 235 322 244 925 1111 -612 652 -448 695
7157 695 304 303 -931 -110 -427 -666 -82 -47 446 539 -333 367 749 656 444 -321 735 -137 249 1149 394
7178 394 -211 759 185 196 -293 -771 507 -523 313 -73 -270 274 411 -355 138 -642 404 -354 744
7197 744 -716 -249 -272 -1250 299 -142 -327 198 453 -140 300 -231 -636 117 992 -207 240 306 740 -250
7217 -250 24 619 103 80 283 -141 -104 286 -181 -787 -279 -434 69 955 131 -553 -648 1064 177 611 263
7238 263 -784 392 -78 -146 6 -455 -635 890 -904 487 -85 -242 -356 179 -83 511 -801 -522
7256 -522 483 344 -577 -263 599 515 95 459 -287 -137 -592 26 251 631 -172 -549 137 -657 -248 -330
7276 -330 -121 250 -138 103 -1121 -274 -359 -228 -347 -1141 -63 -894 517 -273 -4 -400 478 229 -178
7295 -178 307 -530 20 -19 -526 195 -390 215 -21 -80 754 191 63 -150 -445 392 158 242 -270 -107 185
7316 185 376 -570 -686 -920 -1437 459 -199 -440 -121 -707 -150 -957 -343 248 -311 115 -265 -5 375 61
7336 61 750 354 177 293 -1179 -16 264 -384 386 -81 -297 -407 -179 153 -1049 -381 258 759 435
7355 435 -139 132 340 -492 -156 -242 90 -566 -260 -349 -740 158 753 -193 178 185 100 -522 416 -206 -274 -728
7377 -728 -532 -196 -213 -267 -167 -138 -162 389 -490 -874 -135 829 -134 50 -62 516 699 -926 269 73 -840
7398 -840 273 62 117 -218 143 146 -477 21 284 -161 315 -1124 -741 -17 593 232 -207 -197 -597 528
7418 528 -312 201 -297 306 -683 635 -217 -268 -42 -375 -361 732 376 -316 354 -64 -627 -119 419 -358
7438 -358 211 -869 -794 -698 560 374 -258 -396 -87 78 531 -79 133 179 57 125 560 602 -718 577
7458 577 331 -638 -322 -119 774 27 -658 492 -281 115 -688 130 -76 -120 656 481 3 -770 -361 -95
7478 -95 578 996 407 -97 17 271 -175 227 183 -237 -461 -132 26 -265 -200 85 457 -250 584 696 -604
7499 -604 -163 25 -378 1376 46 265 0 -39 438 -793 444 73 63 471 -155 -197 249 -98 156 728
7519 728 -704 -41 -318 -203 -28 -67 249 100 -84 -123 161 -25 172 -655 -301 973 211 -50 -123 -415
7539 -415 -1042 -606 -79 329 467 -80 -537 259 866 -153 7 386 291 -810 54 -358 153 56 800 -183
7559 -183 102 55 928 -486 -157 -212 84 -138 297 -791 412 -54 596 537 -829 819 -415 632 -15
7578 -15 1069 -431 -356 -84 29 131 196 64 -215 -287 -117 737 789 -16 -521 -11 689 541 87 -19 141
7599 141 170 100 -18 932 459 486 324 -663 665 -403 -45 520 118 -200 188 39 415 397 -84 -772 507
7620 507 1062 400 658 -977 -216 -635 518 -345 -571 -311 1309 -141 26 167 -476 -600 587 -6
7638 -6 -744 -154 24 -1010 -218 580 350 16 281 -709 76 235 -159 1061 347 -434 154 -298 386 1040
7658 1040 295 249 -11 157 309 359 -286 -150 -238 707 154 225 -243 -82 1239 339 -530 -65 215 544 -383
7679 -383 -644 -57 -52 -105 366 270 80 543 -24 -439 -332 418 459 258 366 -597 518 606 189 -981 647
7700 647 -184 -154 -105 -1288 759 595 -356 8 -315 146 -34 -759 153 505 496 -416 -51 239 221 -494 678
7721 678 -211 141 256 -106 -725 -327 479 -593 -834 615 162 158 -273 -385 691 -52 -365 -784 509
7740 509 715 -157 198 470 378 249 -144 577 541 -365 246 -247 -34 30 -859 -185 498 708 224 -289 -410
7761 -410 25 -152 128 348 395 -33 30 386 162 236 17 221 -352 496 -676 999 20 -208 -86 -737
7781 -737 252 199 176 256 -939 408 -334 439 -1032 716 -1139 -421 -870 66 880 -10 -18 1114 842 -1074
7801 -1074 -84 -318 1023 108 326 -53 526 472 -353 -844 -234 -76 1225 276 331 -144 1376 -79 -743
7820 -743 302 -428 1262 278 1150 -73 356 144 -774 -101 -616 -524 -702 530 461 772 99 154 240 91
7840 91 -282 188 241 1054 -809 122 54 -99 -436 -144 1217 -441 182 -134 -297 398 77 -88 105 -688
7860 -688 230 -30 204 -141 -252 -36 -205 -34 976 -682 -1017 -860 119 -446 -645 428 -338 -337 264 996
7880 996 282 -595 322 -801 123 208 323 175 -401 -285 -1127 279 656 93 -1103 169 -26 228 308
7899 308 343 250 1042 -685 -918 -32 611 -110 -274 448 278 365 -924 11 85 -605 397 33 -584 -101
7919 -101 16 346 149 -315 -233 1154 -558 142 -601 1219 -31 -441 158 2 -703 -1 655 -418 1019
7938 1019 256 311 -754 -512 1069 -522 305 -463 -390 -385 1294 310 422 449 -847 840 320 1 543
7957 543 115 -59 -922 996 749 -779 -47 140 -324 304 -35 1292 -365 -1280 152 4 580 -547
7975 -547 175 -99 -84 -412 -379 387 -947 -2 -962 -18 166 130 899 -1277 252 -120 473 -18 -183 -664
7995 -664 64 225 -11 616 -250 -31 -585 798 -83 -623 -295 441 -580 -196 -633 213 -787 -276 394
8014 394 -197 -76 -473 -152 99 77 -1002 -647 -613 656 287 161 317 -160 -31 197 -713 -1407 100 377
8034 377 232 -238 577 514 468 297 139 -839 -485 -193 284 813 -90 -1081 -457 26 474 -88 -259 475 238
8055 238 -265 -177 118 649 -517 121 82 385 -326 -812 105 -315 -64 533 621 44 -697 -409 -545 521
8075 521 447 387 618 103 123 -1047 529 -79 -409 -4 326 -328 143 856 243 534 -871 -452 -133 -371
8095 -371 14 -464 -357 -780 -233 -50 -354 -823 -143 141 132 -408 341 -440 -200 -670 548 -193 -386 30
8115 30 -577 715 -577 1115 -189 -17 262 576 -281 -515 418 -354 386 59 565 -1089 677 -50
8133 -50 621 -614 496 -47 -76 -48 -865 84 494 -281 402 431 156 506 -370 -571 592 -697 -425 296
8153 296 267 101 251 133 1184 293 668 -751 -1190 472 143 152 -379 -248 -471 1035 -413 653 537
8172 537 586 7 54 -122 -163 -264 -707 141 253 -102 260 -405 17 -718 188 533 975 209 597
8191E97
$$ Imaginary data points
##PAGE= N=2
##DATA TABLE= (X++(I..I)), XYDATA
0 0 0 0 0 0 0 0 0 0 0 0 0 0 0 0 0 108 -108 108 -108 108 -158 216 -216 307 -324 349 -432 540 -544 649 -757
31 -757 865 -975 1089 -1268 1408 -1593 1772 -1979 2208 -2460 2735 -3037 3354 -3709 4100 -4527
47 -4527 4983 -5492 6052 -6670 7343 -8096 8934 -9879 10932 -12143 13541 -15165 17083
60 17083 -19388 22234 -25838 30557 -37051 46571 -61934 90706 -163152 762148 736098
71 736098 -1161321 -235588 992366 287744 -821567 -184289 552010 301168 -389924 -448018
81 -448018 237832 708308 -234027 -843834 357436 1032994 -440281 -948648 637105 938483
91 938483 -645303 -710942 651039 588448 -503947 -455584 287406 428197 -88430 -523149
101 -523149 -105899 662549 184071 -828149 -161901 995376 103783 -1011704 86453
110 86453 1028881 -136907 -830843 224652 701258 -139841 -515154 4499 395181 168895
120 168895 -402503 -397738 441420 509349 -590363 -565521 728550 542969 -789538 -399216
130 -399216 843373 314023 -722992 -182996 596172 168354 -418438 -238525 233746 334777
140 334777 -175548 -535958 124471 656074 -207867 -761597 313723 784129 -396172 -687125
150 -687125 488571 602020 -431590 -437483 364385 361957 -199745 -333567 18620 362198
160 362198 94746 -504008 -209959 600239 176632 -736669 -127526 781401 34129 -740266
170 -740266 81078 679250 -81472 -504731 87171 402076 32871 -297056 -177095 256551
180 256551 299987 -330356 -448901 379033 458313 -509119 -460400 569230 386504 -572776
190 -572776 -263933 555196 223420 -402072 -148340 305205 211030 -158216 -285328 76240
200 76240 393648 -70095 -533118 78568 582251 -181179 -617932 247097 566240 -290452
210 -290452 -462370 306731 389116 -208144 -272295 132936 271146 24233 -278738 -124999
220 -124999 355272 181788 -465859 -210280 520154 140977 -588116 -90710 561611 15880
230 15880 -490054 34411 411949 12806 -275223 -43370 235463 174606 -182873 -264970
240 -264970 209481 346140 -279380 -408453 327505 369724 -408163 -338696 404717 258430
250 258430 -370323 -186626 311673 178410 -179219 -161755 113684 252612 -22277 -319972
260 -319972 11673 402303 -40399 -474994 69583 463106 -155957 -458081 170469 373677
270 373677 -178761 -296944 137864 251164 -35367 -195874 -26855 238661 137506 -263957
280 -263957 -172692 336700 179315 -406111 -169214 411313 91690 -429676 -72617 359458
290 359458 27701 -296959 -37163 225360 97004 -146282 -143175 149051 247599 -134323
300 -134323 -289650 185564 325324 -235720 -331188 257530 269501 -294857 -243060 241888
310 241888 173749 -200209 -159014 125015 175433 -38771 -191687 13356 277955 33516
320 33516 -312912 -1985 362865 -28918 -376850 54185 333012 -103098 -313326 74611
330 74611 234074 -60143 -197961 2150 179635 78168 -167845 -111338 223681 176557
340 176557 -240654 -164119 292400 154068 -312935 -128582 288773 74238 -277570 -82214
350 -82214 200019 64971 -162058 -106623 113832 159301 -81712 -195870 106880 263382
360 263382 -106901 -260923 156551 269846 -173192 -244452 171008 191155 -170110 -182734
370 -182734 101859 137638 -72923 -161422 9783 181445 31193 -206479 -28744 268384
380 268384 47952 -266439 -3017 290891 -6694 -268107 18339 222368 -32481 -208950
390 -208950 -15183 146639 28305 -150844 -91485 141606 127388 -156436 -144668 195360
400 195360 168678 -199135 -140209 224962 130517 -211278 -108683 178720 84475 -158326 -108434
411 -108434 95611 104306 -84345 -156867 53026 181934 -56477 -208365 78261 235190
421 235190 -77934 -210415 107602 211552 -95476 -178844 82003 151059 -65242 -155611
431 -155611 6569 130904 2929 -169349 -48829 176087 53473 -198668 -46754 224848
441 224848 53528 -206980 -21585 210743 26315 -180495 -30167 146483 31897 -142412
451 -142412 -79893 101715 84765 -122384 -131931 116826 141560 -131311 -141364 153652 152939
462 152939 -136945 -119158 152009 124895 -117131 -104865 97274 106667 -75033 -131532 36314
473 36314 129635 -44745 -172274 21476 172075 -34254 -186212 45070 191957 -34687
483 -34687 -161251 54487 169041 -22195 -134692 15198 131918 6121 -139371 -44844
493 -44844 124991 40525 -159268 -74426 151662 61720 -163593 -58269 171021 66800 -143414
504 -143414 -40936 151842 67446 -111156 -59770 106810 82950 -95837 -105719 80410 109169
515 109169 -97033 -136546 85376 129873 -97904 -132009 99790 129857 -82284 -110823 84379
526 84379 123056 -51995 -109830 43392 121128 -26259 -134757 5706 131983 -18318 -159734
537 -159734 -3964 144432 -12789 -156095 5440 147910 1703 -128815 2543 136446
547 136446 26528 -110998 -27808 117224 46842 -119671 -65694 109404 58366 -132669 -83031
558 -83031 113971 66611 -125446 -74107 117042 76370 -97630 -68991 102120 89556 -74792
569 -74792 -85097 73707 98769 -69451 -115389 53333 105271 -72111 -132769 47795 110647
580 110647 -63485 -122963 48087 114652 -38413 -108660 37579 119436 -12058 -105510 14163
591 14163 120021 2788 -122077 -12995 116528 3694 -135382 -27057 113672 9269
601 9269 -127284 -27565 113330 31722 -103683 -29851 111855 54402 -88950 -46174 102755
612 102755 64198 -93019 -71609 87591 67181 -99009 -86517 77368 69912 -89098 -86057
623 -86057 73400 83435 -66243 -81069 67555 98029 -44015 -85017 54059 104647 -36861
634 -36861 -100351 35224 102021 -37661 -114466 19715 97989 -29892 -111563 12572 104056
645 104056 -8414 -100174 9083 109308 12967 -92297 -4103 107729 24094 -99228 -24074
656 -24074 98978 24193 -106412 -42692 88334 30801 -102465 -48350 88155 47248 -83871
667 -83871 -48365 87707 65129 -68466 -53326 81291 72389 -63792 -69980 64410 72818 -67063
679 -67063 -85515 50269 72625 -62346 -88434 43689 81324 -43769 -82961 42012 92458
690 92458 -23496 -80132 32516 97432 -12677 -88015 15789 91609 -11858 -97983 -2659
701 -2659 85195 -9322 -100039 -10222 85716 7588 -89281 -11453 92065 26348 -77284 -17730
713 -17730 90192 38507 -75892 -33476 81286 40548 -81574 -50536 68227 40520 -79740
724 -79740 -58957 62820 49692 -67460 -57939 63569 66049 -49789 -57249 58850 74968 -40250
736 -40250 -64831 44105 73357 -40577 -80871 29837 68617 -39250 -84209 19481 72910
747 72910 -26217 -78549 19834 82137 -6865 -72508 14454 86418 4746 -73796 1497 83217
759 83217 6276 -83553 -15506 71565 6762 -84053 -27154 67433 18372 -75737 -26714 72476
771 72476 35127 -62808 -28594 72335 46468 -56205 -37301 64795 48077 -58251 -51917
782 -51917 51296 45283 -60347 -61301 41543 51038 -49855 -62536 40420 61841 -34102 -58234
794 -58234 39967 72222 -22070 -59429 31132 69568 -21100 -68475 13915 63620 -19032 -76075
806 -76075 916 62797 -11856 -72899 -1651 68146 5649 -63723 124 75220 16743 -59850
818 -59850 -7602 70347 21070 -63110 -22236 59638 20684 -65795 -34771 52899 26782 -61289
830 -61289 -38038 53622 38321 -51041 -36188 55151 48120 -41688 -38730 48406 50194 -37867 -48791
843 -48791 34520 48503 -38066 -60272 23692 48691 -33994 -62167 22105 56794 -22176 -54821
855 -54821 23455 63514 -8542 -51221 17649 64034 -2077 -55995 2361 56169 -2747 -64534
867 -64534 -11064 53159 757 -64812 -12864 56245 11325 -54838 -10036 61519 23186 -45616
879 -45616 -13235 55609 28865 -45301 -26881 45459 28467 -50135 -40992 38116 30269 -50198
891 -50198 -43656 37498 36707 -39923 -38388 38421 45270 -26155 -34875 34608 50458 -18153 -42326
904 -42326 23166 49174 -19593 -54870 12227 46895 -22068 -57965 8791 47278 -13961 -50067
916 -50067 10538 52703 1127 -41340 6046 53729 10613 -43321 -6438 50190 11013 -53228
928 -53228 -17648 44167 8011 -55903 -20293 42981 12316 -47114 -17669 43294 23685 -33394
940 -33394 -19428 40889 33708 -30004 -30482 34742 35989 -34554 -38417 30987 34134 -36996 -41788
953 -41788 25968 32597 -29312 -36095 22506 39445 -13500 -33687 20147 47790 -5083 -39063
965 -39063 11547 48461 -7670 -49026 3258 42230 -13022 -51364 -446 37589 -7021 -44305
977 -44305 -2631 40135 8980 -35553 -5351 44359 19586 -35782 -12451 43343 18940 -43088
989 -43088 -21252 37580 13136 -45308 -24892 30229 13897 -36053 -24074 28616 25667 -23093
1001 -23093 -24128 29653 36819 -17480 -29706 27042 38706 -22275 -37106 20464 31298 -27070
1013 -27070 -39691 12866 27171 -19974 -36517 7405 33226 -6000 -33434 7098 43102 4982
1025 4982 -35222 5144 44411 2492 -40405 -821 37579 -3153 -41675 -8056 29172 375
1037 375 -36725 -13174 29679 13153 -28992 -13535 35236 24709 -26437 -15436 36454 23699
1049 23699 -30349 -20389 30882 17035 -31738 -23876 19800 16180 -25868 -28093 16474 24896 -16414
1062 -16414 -27513 18536 35490 -10173 -28383 20901 37593 -12312 -30241 13807 30446 -13679
1074 -13679 -33650 3185 23736 -9268 -34392 -2096 27927 1188 -31232 -793 36745 9346
1086 9346 -28890 867 38299 8699 -29634 -4930 31141 4854 -31980 -14061 21273 6698
1098 6698 -29904 -18728 21684 15359 -24635 -16913 26487 23449 -19651 -16465 27760 25286 -19026
1111 -19026 -18454 21544 20494 -21297 -24688 10628 17722 -19012 -28790 6404 23030 -12189 -28070
1124 -28070 9972 30405 -4490 -25188 11750 33229 -3090 -25016 8576 27979 -4361 -29618
1136 -29618 -2173 22391 -2792 -30941 -8157 23019 3041 -27575 -6754 27901 10801 -23104
1148 -23104 -3920 30824 13779 -20787 -7961 25274 11740 -23013 -15302 18049 10071 -25055
1160 -25055 -21602 13945 14201 -19914 -19006 18271 22209 -13796 -16294 20859 25631 -9689 -17014 16469
1174 16469 21861 -11418 -22320 7411 18179 -11898 -26733 1038 19280 -8400 -25613 2956
1186 2956 25491 -1196 -22171 5279 29293 4183 -19258 1625 25713 2809 -23762 -6396
1198 -6396 19589 1053 -26992 -10690 17656 4641 -24239 -11717 20402 11248 -18448 -9708
1210 -9708 23812 16395 -14328 -9292 20885 16443 -16227 -15573 13572 12868 -18444 -21681 8028 12965
1224 12965 -15389 -21443 10382 19130 -8956 -17102 12718 24913 -4086 -16625 11335 23175
1236 23175 -4484 -20707 3638 18223 -5677 -24712 -3492 15816 -4184 -23746 -2733 19178
1248 19178 2044 -19790 -1665 23624 7290 -16982 -1654 23053 8230 -19123 -7082 16840
1260 16840 5854 -19992 -12340 12525 6762 -19074 -14414 14898 12067 -14376 -11642 17246 17382
1273 17382 -9418 -9390 18156 17790 -8971 -14033 10340 14418 -11425 -20255 3990 11299 -10751 -20594
1287 -20594 4379 16168 -4987 -18120 6281 22674 419 -14340 7576 22056 1406 -16532
1299 -16532 1998 17701 -424 -20297 -4648 14383 -2008 -20430 -8140 15130 4825 -16974
1311 -16974 -5358 20170 10493 -11173 -3806 18721 12089 -10741 -7136 15835 10075 -15120 -11352
1324 -11352 9904 7216 -15870 -15714 8118 9887 -12472 -13552 10882 16837 -6451 -11751 12122
1337 12122 17656 -4456 -11464 7290 16871 -4844 -17692 2136 11824 -7004 -19906 -2067 13424
1350 13424 -2431 -17471 464 17666 2818 -13121 1640 20550 5988 -13029 -962 17777
1362 17777 3617 -15697 -5689 11248 998 -17660 -9572 10791 4487 -15293 -8683 11783
1374 11783 10302 -11191 -7331 14811 13288 -8943 -7960 13303 11771 -10321 -11612 6508 7351 -11962
1388 -11962 -15254 3092 7558 -8563 -14795 4804 14274 -2511 -12096 7933 19907 98 -11429
1401 -11429 7157 17382 -1619 -13762 1594 10233 -4304 -15990 -4028 7991 -940 -14465
1413 -14465 -5496 13004 4852 -11812 -1520 17459 7817 -10404 -1393 16318 4898 -13188 -6098
1426 -6098 10054 3761 -12727 -10033 4817 4068 -10766 -10409 7191 10253 -8146 -10403 12741 15223
1440 15223 -6129 -7098 12806 12623 -6052 -7469 6445 7007 -6416 -12511 -1668 7299 -4087 -14617
1454 -14617 -204 12618 -560 -13759 3552 16615 1201 -10454 6193 14282 -242 -9471
1466 -9471 2289 8839 -974 -11289 -5279 6251 2234 -14081 -9496 10565 6289 -13141 -6142
1479 -6142 16538 8362 -10034 -616 13902 6507 -7212 -1854 7497 4925 -5392 -9437 294 6491
1493 6491 -7524 -15908 3392 12078 -7681 -12920 11010 14574 -5474 -6690 11919 10023 -2929
1506 -2929 -4969 3129 5302 12 -9876 -5466 6786 111 -15674 -4350 13562 -643 -16510
1519 -16510 1146 15783 101 -8009 5793 12105 554 -3353 124 6127 4599 -7158 -9112
1532 -9112 4603 6403 -11682 -13108 8983 6351 -14503 -6472 14106 5745 -8561 573 11783
1545 11783 5020 -1938 -827 2466 7380 -182 -10709 -2022 10243 -6364 -16936 1936 11262
1558 11262 -9525 -13280 8072 8853 -7175 -2814 8311 6342 1329 -858 -3 5778 4922 -8912
1572 -8912 -6940 10696 2111 -17838 -6155 12628 -3713 -14737 2253 10353 -2185 -4724 5333
1585 5333 5769 3296 870 -2190 2913 10703 -3166 -12231 6801 9774 -13424 -12429 9784 3908
1599 3908 -14443 -4240 9797 1058 -4552 3156 5233 3682 4476 -2024 -906 11247 3720 -13182
1613 -13182 -1268 13441 -5788 -16430 4180 9060 -10795 -9436 7087 2832 -4438 80 2424
1626 2424 4196 6255 -427 -4790 8789 10986 -10497 -7559 13252 2804 -16543 -3451 9720
1639 9720 -6273 -11099 3358 3555 -3861 -106 670 343 7766 4797 -7181 3931 14419 -3383
1653 -3383 -12552 9176 9738 -13769 -9127 10048 -203 -13124 -1105 3788 -2777 243 1318 -2261
1667 -2261 6269 8477 -6251 -2956 15472 3733 -14510 2139 13676 -7546 -13383 7172 4785
1680 4785 -11023 -4752 2369 -2140 -1091 1943 -4167 2067 11206 -2799 -8094 11569 10613 -12034
1694 -12034 -4285 14424 -184 -14409 1976 7036 -7915 -5689 1511 -2448 -1539 2682 -5102 -2009
1708 -2009 12863 4651 -10269 5919 16807 -6150 -9825 12909 6569 -11545 -4164 7271 -4273
1721 -4273 -7153 1121 -2528 -3690 4918 -2719 -7181 9489 9039 -10940 -461 17379 560 -12776
1735 -12776 7932 11974 -8260 -7776 6346 -1215 -7095 662 -2640 -5375 4452 -410 -10398 3651
1749 3651 12173 -6899 -7549 14507 7788 -11209 1501 13651 -2574 -8233 4706 1420 -7154
1762 -7154 -308 -2424 -7166 2701 3438 -10571 -1866 14185 -591 -11563 9936 13584 -8188 -5213
1776 -5213 12806 3037 -8426 2280 3114 -6135 -908 -241 -8665 867 6691 -9162 -9075 11964 5260
1791 5260 -12200 2305 16356 -2307 -7943 9212 6514 -6869 557 3069 -4433 -964 2166
1804 2166 -8755 -4650 8426 -3380 -12823 6033 10321 -10443 -4395 14474 3317 -8744 5496
1817 5496 9523 -4309 -1805 3799 -3686 -2355 4087 -5609 -8104 6476 1566 -14566 -997 13010
1831 13010 -5574 -10863 11426 7712 -7945 946 10788 -809 -2155 5670 -2554 -3865 6234
1844 6234 -3216 -11392 3660 6772 -12353 -6900 11982 301 -12347 5578 11430 -4510 -2797
1857 -2797 9739 2546 -2698 5523 275 -5271 4504 1465 -11887 -1828 9250 -7101 -12499 9355
1871 9355 5993 -11591 -841 10953 -1221 -4986 7790 4176 -2098 5100 1922 -6071 3735 5224
1885 5224 -9592 -5846 9253 -1360 -14123 2485 9622 -9143 -6094 10536 2681 -5634 5037
1898 5037 4814 -2249 4585 4901 -4984 1052 8685 -6593 -10999 7350 2925 -14266 -3002 10152
1912 10152 -4403 -9670 6448 5216 -5077 2426 6195 -1968 2537 7801 -3484 -3554 9098 106
1926 106 -12624 3149 7707 -10321 -9147 9011 -17 -10045 1353 6210 -3831 106 5994
1939 5994 -2419 1203 8702 -1290 -5678 7398 4531 -11757 -2232 10461 -5191 -11524 3570 3878
1953 3878 -8102 -1962 4945 -2141 -1875 6422 27 -1347 9057 3294 -6219 5045 9009 -7709
1967 -7709 -6794 8722 938 -12592 292 5176 -5878 -4945 4107 -892 -2506 5050 199 -3358
1981 -3358 6887 5934 -6005 1485 10313 -2764 -9488 6258 4051 -9423 -3917 5107 -3087 -6505
1995 -6505 2385 305 -3628 4225 3202 -4633 3697 7967 -3855 -2862 10059 2071 -9063 1379
2009 1379 7950 -6138 -7537 4269 -19 -6417 -533 1227 -4328 1787 4131 -2871 412 10334
2023 10334 401 -6012 6758 6792 -7296 -3018 7471 -1701 -7605 1342 772 -5631 -2160 2094 -3258
2038 -3258 869 4980 -2114 -1778 9738 3850 -6343 3905 9541 -3385 -5156 5982 2438 -7844
2052 -7844 -346 2872 -4663 -2693 1331 -3867 -1669 4105 -1690 -4640 5197 6367 -5058 379 9774
2067 9774 581 -6342 4177 4524 -5506 -3108 892 -3651 -3310 1654 -2565 -2939 3744 438 -6203
2082 -6203 3076 7589 -3038 -2285 8083 4383 -5383 988 5944 -2260 -3497 581 -357 -3988 402
2097 402 -2786 -4467 2408 2104 -6160 95 8944 837 -5085 5390 6603 -3097 -444 5436 941
2112 941 -3147 808 -105 -3943 -1077 -1117 -5595 467 4101 -3100 -3493 6627 3377 -4397 2651 8078
2128 8078 -385 -2606 4599 2152 -2113 -219 -693 -2815 -553 -223 -6090 -2041 3627 -2573 -5404
2143 -5404 2604 5208 -3596 -1073 6585 2462 -2748 1654 2976 -946 -85 359 -3344 -1623 966
2158 966 -4653 -4359 3095 -596 -6633 324 5682 -1107 -3245 3711 3941 -1608 177 3278 -117 1201
2174 1201 1475 -2338 -497 1189 -2576 -4700 2049 2024 -4808 -2606 4299 1478 -3320 2614 3957 -471
2190 -471 183 2862 1600 916 1052 -2632 -2405 1351 -615 -5500 -1424 2273 -3231 -4193 2232 2123 -2245
2207 -2245 -9 3563 1756 -695 1650 1356 631 1635 16 -1437 1298 358 -4514 -1835 2191 -1571
2223 -1571 -6102 319 3067 -1238 -1161 2697 2232 -107 1736 1845 904 1266 10 -1941 548 1928
2239 1928 -3137 -3442 1325 695 -4472 -2307 1192 -55 -1750 1089 2336 1471 1023 1426 2048 1851 1169
2256 1169 -1206 376 2173 -1705 -4464 -690 108 -3605 -2767 242 676 -1503 378 2054 819 1190
2272 1190 939 629 2088 1987 -278 -457 2074 1106 -3771 -1794 1200 -1086 -3594 -783 1086 -1389
2288 -1389 -1165 277 1977 1136 1494 262 2276 3470 531 -1211 1540 716 -2044 -2302 340 -1177
2304 -1177 -2759 -2371 -140 -531 -2573 467 1184 1272 1370 277 1044 3472 1201 -1066 1047 2127 -1623
2321 -1623 -2943 -736 303 -2880 -3066 -837 -230 -990 -1128 -295 1230 573 -428 4 2500 1949 -1297
2338 -1297 575 2340 1103 -2617 -1458 -143 -1065 -3391 -1231 -640 -215 -1477 -1043 1016 1576 -103
2354 -103 553 2636 3194 541 -718 2443 1739 -1852 -1250 35 -359 -2026 -2376 -877 -809 -1134 -2200
2371 -2200 -665 1117 1166 -1655 1082 2691 691 -975 2371 2058 49 -1478 -217 652 -1048 -2829
2387 -2829 -1851 191 -1826 -1132 -1210 197 530 -943 779 1609 1653 -607 674 2125 850 -1296 -211
2404 -211 1272 -568 -903 -964 -691 -1443 -1964 -1799 746 850 -127 -452 2161 1752 390 7 1298 2359
2422 2359 209 -399 276 563 -1254 -1848 -984 -272 83 -2581 -1454 714 145 -12 1159 2484 753
2439 753 431 2027 1470 437 -137 276 538 -1559 -1073 -1310 -201 -1210 -1621 -1210 36 -129 -396 -61
2457 -61 1722 896 205 745 1844 1664 -338 -332 344 327 -921 -2207 -465 -872 -1876 -2370 -461 602
2475 602 -925 -482 1010 1703 1329 1435 1571 2209 297 281 650 1015 -282 -1890 -876 -241 -1696 -1941
2493 -1941 -1168 -179 -638 -1193 -93 1707 925 530 200 2532 1191 78 998 1038 -199 -1321 -995 -770
2511 -770 -883 -3320 -2933 379 -557 -1507 -665 1383 1269 794 627 1792 2435 526 1391 1595 338 -959
2529 -959 -1307 -558 -19 -1106 -1855 -1068 -881 -854 -912 -735 1749 -295 -62 2232 2464 1021 306 1053 1254
2548 1254 370 -866 -636 -811 -870 -1588 -832 -1220 -353 -1750 -770 248 564 -165 1209 2190 1920 771
2566 771 1123 1615 1642 -359 -538 46 -872 -1275 -2040 -1438 -542 -1943 -746 -96 1287 569 448 1952 1002
2585 1002 976 -103 1419 1400 631 -640 227 336 -930 -1479 -1727 -434 -1016 -1836 -135 599 -111 -123 770
2604 770 1435 917 695 939 1936 533 407 -1152 679 -54 -1120 -1114 -437 -992 -1869 -1323 -215 298 -601
2623 -601 583 1573 987 462 718 1555 853 176 -653 969 -71 -1568 -1779 -290 -823 -1065 -2257 -636
2641 -636 210 -353 -105 877 1483 1493 1008 1226 1731 818 -440 208 1005 -829 -2171 -160 27 -650 -1948
2660 -1948 -78 321 -656 -277 204 577 817 937 523 1081 1580 706 -186 149 -232 -1617 -783 -978 44
2679 44 -796 -1428 270 -742 -1005 -62 1215 1132 359 712 1866 1859 565 -277 250 976 -604 -1281 -270
2698 -270 -162 -1444 -821 -1840 -626 -484 -783 1224 -408 641 202 896 1691 993 -481 777 -376
2715 -376 -518 -414 -1028 432 -2160 -2201 -214 -720 64 -557 -164 522 1699 -140 -543 1293 263 757
2733 757 519 1684 408 -690 -357 217 -722 -2554 -1996 -780 939 -854 -447 175 842 289 -367 982
2751 982 830 525 -1536 1010 566 803 -519 -33 396 -784 -1951 -496 -168 -858 -285 65 845 1150
2769 1150 -806 -253 2748 953 939 1616 629 -157 102 457 -91 -525 -2057 -270 194 -665 -824 -941
2787 -941 165 -417 457 -577 1404 1804 1258 525 939 460 396 -439 -26 -331 -1475 -2157 -1373 -414 -1006
2806 -1006 -791 692 5 406 1002 1033 1775 1267 -2 311 1194 183 -849 125 -76 -367 -2005 -1713
2824 -1713 -1174 -1014 -755 -1164 71 226 -1104 996 1326 616 716 1859 2112 1676 356 500 150 -202
2842 -202 -1025 -1191 -484 -346 -1438 -319 -126 -1099 -335 -449 425 455 402 516 1203 1755 840 291 314 892
2862 892 -152 -1614 -724 -168 290 -469 -366 479 35 185 -585 1384 -57 717 1035 691 527 -866
2880 -866 1330 164 736 -845 -886 -140 -312 -1803 -405 -454 290 -456 -114 831 421 632 672 2040 1080
2899 1080 227 -382 768 399 -1133 -636 741 -151 -2174 -1207 -339 -182 -686 -128 -142 940 665 -336
2917 -336 1512 1453 506 868 855 620 -1287 -1438 -417 -448 -1234 -1962 734 -1492 -809 -942 -988 1725 528
2936 528 358 292 1357 1738 1037 -160 1177 -927 -1102 -501 -1509 -47 -1483 -1004 239 -170 15 -175
2954 -175 -368 913 -437 533 723 800 99 184 1392 878 -753 554 -320 -355 -878 -1943 -1463 120 -1415
2973 -1415 -461 -484 852 215 106 1051 810 1920 1062 1056 676 -54 -209 953 -710 67 -444 -991 -1951
2992 -1951 -1192 -1540 -263 53 414 138 403 640 1129 715 -112 749 6 -168 30 -498 161 -350 -1835
3011 -1835 -402 -202 -1103 -414 -471 872 226 367 739 1548 1757 767 336 212 48 696 246 -197 -1215
3030 -1215 -571 -1678 -484 -899 -520 1180 96 400 390 -171 274 -450 343 1602 676 291 145 420
3048 420 -102 208 -398 -861 18 -782 -1123 -838 -55 549 -1865 937 1368 667 485 812 840 1056 444 138
3068 138 108 -641 -680 471 -642 5 -1371 -1349 -1393 405 -162 315 644 1940 271 968 1160 -14 607
3087 607 372 305 55 -500 -383 -66 -527 -610 -2102 -1157 -1126 176 47 97 804 188 399 986 1332 891 -245
3108 -245 159 894 -442 -775 -407 -923 -1530 -499 -629 -399 -823 -282 -142 338 1933 636 663 578 1531
3127 1531 901 325 240 -379 -104 -338 -305 -506 -525 -1282 -690 111 -1457 -206 -669 818 457 -51 1104
3146 1104 1141 807 1014 219 1112 418 -154 23 -241 -231 -396 -721 -49 -379 -622 -566 1320 82 -138 -57
3166 -57 963 985 431 935 611 539 851 -946 -363 -456 -507 -672 -1264 -75 -522 -1081 -656 476 219 469
3186 469 1485 1340 17 1004 1006 431 1213 702 -284 811 -257 -1115 -323 -905 -365 480 -1568 561 -39
3205 -39 392 1090 255 1817 845 383 80 243 1134 -18 549 -673 -1299 -1413 65 -497 -1449 -1145 147
3224 147 302 -340 907 363 602 256 832 109 123 99 145 771 358 -365 -1261 -454 303 -693 -1042 -749 201
3245 201 -1087 349 171 431 602 1268 1431 1403 15 374 -579 918 225 -669 -1769 -658 -1272 -142
3263 -142 511 456 212 162 -152 -269 918 1100 454 1721 1228 580 377 -339 -305 -622 -821 182 -496 -701
3283 -701 -1247 -375 -208 -1136 -208 519 52 546 775 353 960 957 134 663 966 -795 -951 -211 -311 -1300
3303 -1300 -1210 -835 -474 -240 -1225 -125 -455 119 808 -236 244 1192 -506 -533 164 475 1461 770 526
3322 526 -610 -655 19 103 310 99 -327 568 -171 122 441 760 1613 302 -521 332 -150 -1425 -932 226
3342 226 -554 -398 -351 50 -1261 744 149 -724 -264 1606 703 38 1666 825 -761 395 506 -413
3360 -413 -663 -468 -721 -599 178 -825 -988 157 315 153 -162 226 283 -68 1338 726 119 99 723 368
3380 368 -1533 799 -622 398 -1067 -516 -636 -438 187 -361 -888 848 617 -688 632 1970 1379
3397 1379 -514 953 412 -530 290 -801 -627 -771 -330 -52 -934 578 80 -621 430 486 -381 464
3415 464 1695 768 -473 255 -17 -67 155 150 -721 -651 -477 -666 -1253 -789 -183 -877 -116 207 -282 -501 944
3436 944 1073 -437 -166 1410 -141 201 1082 -153 -1524 -347 784 -1921 -1228 -1175 -1411 -664 -310 520
3454 520 -282 961 472 501 882 797 1290 972 669 613 -345 -774 222 464 -632 -48 -1487 -514 -358 89
3474 89 -427 124 961 619 -859 564 1746 -817 1246 802 -232 -291 -40 -199 -1299 101 -542 -1085
3492 -1085 801 537 -219 -236 1631 -20 839 1660 752 -348 -177 182 321 -577 -282 -311 -1174 -881 -245
3511 -245 -1358 -929 631 582 -1130 691 935 -1 789 1500 821 53 426 -347 -274 -577 10 -204 -125 -398
3531 -398 -1215 -1016 408 -474 -897 872 528 207 1026 1880 652 430 680 1109 183 373 596 -375 -695
3550 -695 -1144 -684 -1649 113 214 -1537 -763 1028 -535 -715 756 1004 281 1243 881 404 409 714 -1119
3569 -1119 -169 836 -1075 -804 -222 -627 -1900 -863 1253 847 -341 518 1256 -628 739 1189 484
3586 484 -1074 1209 372 -1291 461 622 -1284 -313 350 -927 -1230 635 345 178 141 625 419 863
3604 863 1055 113 475 269 1567 -886 527 356 -1245 -960 784 463 -717 -178 113 -482 -223 996
3622 996 590 230 423 350 -576 936 692 -964 -1195 567 -440 -1609 -323 -121 -1084 -913 63 158 48
3641 48 1127 -586 -345 1314 -80 -507 -19 745 372 -832 421 -496 -1399 250 -475 -1150 -673 1477
3659 1477 -731 -252 601 -146 -781 828 765 221 310 1246 619 -1087 130 135 -864 -18 -131 -495 -475 -465
3679 -465 -646 -560 612 643 -423 48 640 -827 211 1554 999 -295 902 137 -914 -1356 -134 -282
3697 -282 -1737 453 -853 -312 -79 1046 405 24 374 97 -109 482 1386 -305 -5 491 303 -348
3715 -348 462 -273 -1211 -630 -410 -1301 -794 -94 -906 -220 491 329 113 708 1531 167 -372 719 -159
3734 -159 -295 -218 511 -659 -742 149 -1115 128 335 480 -480 -959 1364 -39 1275 1004 1159 566 839
3753 839 444 79 1032 644 355 -1065 212 -508 477 38 -1399 -142 -587 986 -264 -11 962 507
3771 507 -341 275 481 -179 88 -324 416 -435 6 379 -948 -91 207 -77 -990 -27 -330 -882 323
3790 323 980 687 403 714 -275 -516 747 184 -1156 330 -279 -473 -853 332 300 -130 71 893 -1168
3809 -1168 610 842 -218 226 919 -462 -35 66 519 -249 -272 48 -505 440 70 92 -376 -105 1007
3828 1007 -324 -384 -546 1429 -68 677 313 -45 -106 -255 -186 70 226 -1009 37 -183 -186 -2012 425
3847 425 622 421 -599 719 -7 348 1388 380 120 205 541 -334 -286 -266 -509 -389 173 -702 -814 -568
3867 -568 649 -166 57 379 1371 -331 253 1535 546 170 415 -391 -275 -480 359 -1170 -805 229
3885 229 -749 -1732 60 139 -22 -213 84 291 -488 308 180 -140 725 801 -213 7 -264 -117 -1287 732
3905 732 323 -1213 -236 -807 -637 -44 -536 -533 -205 504 -207 63 763 877 48 511 -755 -328 -583 -707
3925 -707 419 -423 -1473 573 399 -757 739 474 376 326 345 335 143 704 400 129 328 -247 36 -125
3945 -125 -765 -613 -255 -1100 27 -705 941 386 33 75 507 531 873 1397 -134 351 370 71 -86 -270
3965 -270 -828 -708 -95 -298 151 286 -487 -522 359 -150 110 819 123 566 710 164 40 -33 644 -449
3985 -449 -33 -324 262 -720 -187 -977 -336 264 -91 -386 793 -336 -314 83 1244 13 498 128 -369
4004 -369 500 967 156 -331 -1035 -885 -647 -931 -373 336 181 547 225 -761 148 279 -23 -204 193 882
4024 882 758 94 600 -915 -1105 362 422 52 34 -223 -1113 28 -196 421 735 172 1025 488 626 1097
4044 1097 -254 -201 454 -800 -424 -67 -931 -630 635 -54 -1339 -1250 210 239 -287 4 223 966 800
4063 800 231 483 -440 -483 223 -343 51 639 -701 -395 -491 -850 360 -593 459 -497 158 502 -95 224
4083 224 398 161 118 423 -312 90 77 -46 658 68 -304 -973 -750 -574 396 512 -145 686 -688 -99
4103 -99 398 227 108 284 56 431 -355 51 -214 -536 -11 -745 -285 669 -127 460 1278 866 30 135
4123 135 -242 280 918 533 148 -444 -127 134 258 534 -487 376 -683 -237 -470 -43 239 -315 351
4142 351 414 443 1026 809 1088 1439 -168 -22 322 10 91 198 -191 -341 -277 -72 316 -382 474 177 724
4163 724 83 567 308 244 -416 87 308 443 -215 -326 -399 -87 -118 553 -219 -990 -344 -415 339 -393 914
4184 914 347 -196 917 110 1382 681 356 -293 -73 -56 -837 -450 -325 -337 345 -195 -417 -34 399 485
4204 485 780 787 561 255 1035 275 -218 176 -554 330 -1220 -490 -418 -626 -627 129 -252 -67 422 161 456
4225 456 510 593 672 -487 -223 516 854 485 263 -482 -130 -475 -602 -451 773 257 -825 -349 -90 -213
4245 -213 419 -457 -417 473 -14 -572 929 -133 628 294 -260 -361 -190 -853 -510 -961 -465 -638 -356 518
4265 518 462 672 380 175 -1 629 297 210 605 288 603 -51 -57 -429 -450 290 -462 737 562 -22 -127
4286 -127 -272 379 -306 764 -57 144 574 222 497 1 -594 -334 -990 -604 -99 -546 -123 -558 100 -22
4306 -22 339 236 188 -145 990 776 623 -213 -180 -26 -387 -483 291 -638 -28 -199 -37 702 478 75 -647
4327 -647 -153 -127 591 517 579 408 -837 115 -565 -348 -1093 -360 162 -953 13 59 -124 -310 -389 -377 43
4348 43 705 -488 337 12 435 -27 105 160 -477 -401 -45 -36 -537 -331 520 -167 -1040 -108 46 -255 -227 1163
4370 1163 -404 379 100 723 69 7 423 -334 444 -273 -397 -222 -91 55 -321 185 -968 -80 -110 -786
4390 -786 720 173 -174 127 934 -288 599 774 -191 22 -769 -1153 -502 -866 65 438 -530 -780 35
4409 35 2 -126 591 -305 400 459 -587 52 193 -98 361 844 -768 -1015 -777 109 310 -1393 108 -488
4429 -488 -46 387 386 -552 -622 -129 668 390 -6 -91 189 208 -1282 -322 -353 273 -552 -26 -606 -531 -296 -762
4451 -762 -153 247 -456 914 185 -124 664 742 -328 593 -617 -139 -24 -301 -695 86 30 -1129 -708
4470 -708 1045 377 -1248 7 500 157 204 112 375 -181 1163 276 940 638 -22 365 261 55 -948
4489 -948 -446 -298 -112 -465 115 531 508 562 69 414 -90 51 -71 -125 475 -148 -541 -394 -936 -984 -112
4510 -112 651 -823 -251 249 7 -548 -213 627 469 233 -692 -665 565 -192 760 -277 357 -464 -571
4529 -571 -436 -57 -430 -498 461 -747 -181 571 690 214 62 -38 -20 443 338 37 -507 -292 -344 -627 195
4550 195 356 -5 459 35 534 -294 -633 458 -421 -833 355 -340 -320 476 536 207 273 -639 431 -51
4570 -51 -529 -353 43 -21 -220 -668 -316 86 1 -110 108 273 20 -60 70 -292 664 -326 -397 -228 -209 522
4592 522 -1082 -513 -284 -233 -3 -404 -141 226 -56 -396 -138 614 -520 216 542 -513 82 214 61
4611 61 -1014 -594 -517 564 847 192 39 572 787 -21 218 931 61 158 271 746 348 301 -1039 -338
4631 -338 -501 1026 -344 93 -807 -101 -41 -1025 204 -807 761 210 422 -215 -479 155 87 186 -58
4650 -58 76 -259 -31 88 92 569 -338 1110 965 379 -749 -776 -110 -382 -32 448 -336 74 231 148 231
4671 231 96 -52 334 -483 -175 314 -350 -478 -104 -334 1067 747 447 268 223 432 217 39 -459 365
4691 365 1111 70 655 660 31 -680 -305 -340 110 -678 -269 920 -455 31 -753 384 417 566 369 -334
4711 -334 -1058 -367 -198 -165 893 -11 407 426 -33 142 -1187 -333 374 716 -137 -287 646 422 -49 -199
4731 -199 4 -60 -488 -400 -43 -11 167 -283 723 148 -249 -44 -284 -250 697 451 -320 316 -3 242 968
4752 968 -137 57 -608 -391 -10 323 -1066 431 -345 100 120 -440 213 966 -113 -248 -478 352 374
4771 374 136 -238 -319 618 -312 324 -446 -88 -132 279 -319 134 143 316 319 -128 -288 80 317 421 412 -223 157
4794 157 344 -16 528 292 -209 261 -518 309 555 -384 361 83 -115 139 -664 1313 227 93 388
4813 388 48 -544 216 156 833 -515 -27 54 -630 -752 2 651 -340 368 -142 129 -130 279 595 -223
4833 -223 1330 39 605 -240 -14 311 -169 497 -40 236 -79 -527 297 -66 323 203 -349 -6 -83 862
4853 862 195 -119 -89 5 535 -262 -53 -296 -70 -36 339 -377 598 -114 -33 -884 383 -166 -561 -21 94
4874 94 38 -895 7 432 761 175 996 247 364 -30 -143 33 -235 -182 -111 223 1182 863 298 555 2
4895 2 -659 -665 402 114 -320 -143 222 197 22 -1113 -479 -483 -580 137 -260 -163 -87 313 389 -111 -249 -118 296
4918 296 367 -186 593 385 -547 -77 -236 -321 186 541 273 210 -340 -174 -489 406 159 -332 337 693 -322
4939 -322 179 -289 -409 -91 -277 -887 -585 523 391 -3 109 -456 936 -386 -1156 579 237 531 -746
4958 -746 -41 -165 237 248 -141 -495 72 -710 321 556 -56 -267 27 -565 19 595 -238 711 -226 92
4978 92 199 289 -209 -342 -46 -269 -747 -286 771 81 436 558 -399 -225 77 -345 465 695 40 -166
4998 -166 -584 268 537 791 -293 110 -311 -670 -507 0 363 -82 729 39 385 -919 273 -853 643
5017 643 -183 287 105 208 91 718 461 -248 401 850 88 -500 196 -445 -150 -221 429 672 298 -373
5037 -373 605 207 641 354 758 220 372 432 477 -921 401 -279 -157 -341 473 931 -517 -951 -84 -587
5057 -587 -713 25 133 338 175 83 -584 -75 437 -370 -98 -184 -271 -314 529 359 -97 541 168 308 3
5078 3 -16 189 -494 61 413 637 356 -971 180 123 440 320 610 173 -128 258 -540 -521 3 43 144
5099 144 -465 285 -324 -402 259 73 -819 983 423 194 46 -202 878 319 539 95 -132 -816 92 747
5119 747 68 -484 176 827 -427 -386 170 712 752 384 -870 -579 25 122 -1016 -805 -213 66 724 -386
5139 -386 16 -1042 -87 -78 1087 470 403 298 -697 -126 328 -839 -578 90 -40 -1101 -573 1 -62 302
5159 302 -181 334 518 653 563 -112 -264 417 -16 -124 -343 -73 -135 -277 -140 -395 164 -200 -327 -154 323
5180 323 -429 211 278 491 -697 -592 -471 526 -55 693 -1066 -653 -104 143 700 51 682 555 -544
5199 -544 152 -81 -255 75 26 995 925 447 -654 -223 -521 1 -578 383 135 -908 -635 -508 -18 117
5219 117 -307 -295 -758 303 36 -857 -743 421 -167 64 644 -296 -867 398 531 483 -439 -53 40 144
5239 144 20 320 339 182 -243 320 142 -252 40 265 103 731 -358 226 319 78 -136 -492 159 -72
5259 -72 38 -842 -428 -486 -175 -694 113 675 602 -611 -1140 80 -69 189 -276 -191 -576 -448 248 -196 547
5280 547 498 125 -329 771 -827 444 -237 -87 676 43 -48 199 492 -292 223 -41 362 154 -618 -53
5300 -53 201 -405 -311 386 545 -570 43 115 601 932 -16 -681 283 -1469 -25 852 -493 -690 -380 85
5320 85 -13 430 -1157 -260 272 786 667 248 -397 -520 -824 652 -141 -1118 241 -357 -86 289 -7 605
5340 605 -44 498 267 265 -612 -244 531 677 537 99 120 754 -358 -17 402 73 -124 42 -581 -75 383
5361 383 -112 581 161 -97 -27 96 28 -161 33 -461 507 551 350 194 -47 275 4 -896 591 -118 -116
5382 -116 -92 -5 453 -645 209 334 583 1456 -478 850 529 526 551 -611 -152 -520 152 -72 -237 -494
5402 -494 -224 -293 -409 -173 -126 -240 -325 -830 -18 276 -447 226 53 1028 -481 -463 -263 193 17 122 -706
5423 -706 -42 -818 -318 -265 -540 -374 146 20 662 222 -264 -99 -452 177 -737 -322 467 980 301 -716
5443 -716 -163 -519 403 977 96 365 -491 -901 252 371 711 -48 456 -161 499 614 -219 427 -262 521
5463 521 211 953 -879 612 -747 -350 539 -308 -317 -312 -515 -1292 -82 -306 153 1 185 -178 -373 -252
5483 -252 776 435 -680 -291 47 1005 -394 402 321 765 721 27 161 9 -164 354 -476 -340 212 655
5503 655 25 435 309 801 870 398 711 -93 -279 492 -428 -149 13 288 66 -29 433 -223 88 -48 -169
5524 -169 -277 -1 -629 -649 -320 -1271 -151 519 -895 537 268 666 -145 483 -25 -368 -270 -237 207 -365
5544 -365 613 -499 497 -165 -958 58 483 -535 -109 237 -307 -416 -53 236 -1149 890 -460 -373
5562 -373 534 -394 292 -627 -182 -17 -125 105 -667 -1019 253 -146 -277 -115 -225 621 -34 92 -937
5581 -937 713 17 690 266 -240 -425 -91 -174 -823 82 106 -922 -72 -95 -655 363 -482 498 157 987
5601 987 -392 251 236 -698 -444 306 -382 951 -344 353 365 -378 -580 -45 613 -66 415 -164 -343 1015
5621 1015 347 160 93 357 925 -210 439 -221 945 -407 644 -183 618 -672 -48 -553 -1106 107
5639 107 266 -97 -160 507 -78 182 -324 -716 -150 -521 821 -258 -792 24 745 51 390 -71 -732 -963
5659 -963 309 41 490 123 770 -580 422 -32 1246 -565 -157 130 -348 -592 -545 -907 -536 -56 -240
5678 -240 -68 -1326 -109 -406 906 -251 363 748 436 -409 -385 -188 1435 -910 434 -192 162 -114
5696 -114 267 -354 -50 317 532 530 -313 -73 132 -1076 -1008 577 27 -384 -911 60 -890 73 -348 -424 546
5717 546 -14 -527 -483 -524 -428 -499 -195 -350 -784 117 -766 -83 585 -2 -425 -197 -420 -247 -378 -162 -56
5738 -56 344 132 -707 148 777 271 151 -1015 305 -443 268 -436 597 1456 376 279 631 520 -218
5757 -218 315 -274 216 -125 -281 -232 583 -348 -118 587 -516 126 -583 -261 268 40 -252 952 -581
5776 -581 763 -177 -245 -33 646 -381 -397 194 -23 263 -790 -276 -344 437 -590 -267 382 242 225 -398
5796 -398 -599 125 -446 -25 65 132 122 343 -630 -890 543 146 -553 -486 389 955 564 208 102 -500 -935
5817 -935 -540 106 -439 190 98 -128 -232 575 389 -510 256 207 -767 726 -150 -551 28 222 -244 -543
5837 -543 -523 567 -515 -485 222 -781 418 -984 -167 -20 -511 823 -491 687 45 -184 -662 -328
5855 -328 -277 -948 -342 29 1155 -536 274 -420 40 -493 30 436 -33 342 281 158 -276 -679 -706 -383
5875 -383 -433 -513 -251 -596 -814 -123 699 -185 -156 81 614 10 -35 254 -642 481 -472 359 -73 69 667
5896 667 -80 360 -107 -283 280 40 -45 22 -12 453 247 775 107 -46 -409 -286 828 751 467 425 -416
5917 -416 157 -87 -578 -113 -109 -441 -1826 -453 -625 36 -272 -93 658 -130 -752 379 200 -925 -153
5936 -153 -370 425 1013 -40 -100 116 -718 69 -97 -80 -550 -4 -338 -558 -489 -378 104 147 -116 -267 976
5957 976 -614 62 299 -259 -229 -25 -448 -295 -16 -378 189 -368 -446 3 242 301 -202 80 -262 149 61
5978 61 1038 -43 -238 438 240 629 -414 274 -335 283 144 -43 -48 88 -449 234 1043 209 -230 1214
5998 1214 403 -680 5 613 -1131 -250 311 489 -92 109 328 -243 728 207 -302 -132 138 -751 405
6017 405 668 -68 -12 -140 615 -3 -94 836 -946 348 -112 -514 242 -221 25 -713 34 19 -824 -286
6037 -286 467 106 -470 -689 3 195 -992 -286 -665 -163 -400 242 1128 -471 -449 -497 96 -993 464
6056 464 -229 308 -619 -120 -145 -75 161 489 828 -85 133 177 272 -192 460 -406 -111 38 151 245 -240 -415
6078 -415 -951 303 143 -424 274 -72 -266 133 742 -445 -279 -515 -319 102 206 -291 286 -348 458
6097 458 -988 144 137 -284 -629 -545 -142 -695 -110 231 127 -2 1084 -736 20 65 -96 -366 191 -173
6117 -173 -160 249 -945 -292 327 202 209 -764 509 -409 -134 179 704 -48 -231 -144 -98 -666 62 -429 -475
6138 -475 673 -167 -612 -1112 -842 97 319 -537 267 -686 -82 584 41 1009 -285 445 136 74 -94 318
6158 318 -813 580 -4 668 433 -576 -457 119 28 -830 -199 23 -357 -270 -698 -19 -4 190 -144 46
6178 46 -517 923 -177 628 624 394 507 680 -537 356 198 520 -43 48 -258 178 387 75 95 -195 845
6199 845 -67 -73 252 -642 746 -216 277 391 -984 -258 -735 -189 -150 140 -181 -104 -275 395 -732 -793 -643
6220 -643 -726 401 -849 740 265 -299 -353 -762 -26 -487 89 937 122 -215 -346 -143 -253 -83 -203 -785
6240 -785 37 699 -392 311 -481 231 605 -454 -9 -134 649 293 243 -883 577 401 -445 -591 555
6259 555 -18 -16 192 258 -61 305 -327 -223 -388 -1078 -621 -5 -418 -860 710 -471 1013 150 190 -447
6279 -447 511 -505 903 -962 -1162 280 -26 123 -495 -54 -127 34 1001 -546 -493 -372 932 -216
6297 -216 139 250 -727 479 -47 -154 263 590 1068 453 643 -223 267 816 -246 563 -503 0 1097
6316 1097 504 -11 41 974 16 -10 441 -192 340 -26 -849 -867 405 301 -358 -64 -576 65 82 -804 281
6337 281 116 248 535 -383 481 -154 -385 -617 486 -234 220 445 -723 582 62 -292 -71 179 -126
6356 -126 -485 88 597 -349 144 -17 -310 237 -576 -109 -89 206 516 -116 380 -542 -220 -311 -159 -412 457
6377 457 -129 -313 -369 -173 -98 125 354 825 -338 -403 290 -564 221 614 -311 628 347 -366 174 223 490
6398 490 674 -907 -1 -166 -516 -15 -544 -338 -272 746 -742 -495 -489 -655 216 -508 175 29 276 257
6418 257 -405 73 -225 -638 766 -719 -21 976 532 765 -146 610 44 -641 -364 -468 535 -457 319
6437 319 791 154 -357 196 -71 -978 23 515 -340 -337 366 -752 84 -49 836 986 361 -215 423 -706
6457 -706 -230 -224 884 -210 -173 134 487 703 -566 -346 470 280 161 544 -914 -356 155 75 454 166
6477 166 -547 63 720 270 -258 -220 139 118 124 -378 488 78 -697 643 158 135 524 581 -239 -233 937 191
6499 191 -1378 355 271 48 306 -556 -29 -529 477 731 220 264 -551 46 609 29 799 141 440 -13
6519 -13 -354 138 321 86 -665 -209 730 753 849 -529 -442 482 121 161 676 -252 201 1400 253 355 -371
6540 -371 -51 646 254 565 13 -533 -580 136 625 -855 462 -390 293 316 175 290 -491 -158 1013 -37
6560 -37 839 389 60 456 -858 -245 583 276 -193 -617 849 336 362 -118 -432 -442 278 -247 -567 -253
6580 -253 512 399 -397 -676 438 -475 -111 -19 622 79 -153 305 67 1083 854 -1309 640 390 337
6599 337 5 -998 -396 347 300 733 114 -700 -199 -311 -199 -712 829 -493 -459 -343 -645 -694 411 -27
6619 -27 -466 392 -527 -155 -181 66 -552 -145 -711 -457 -387 891 -247 -12 -154 40 348 651 -172 465
6639 465 -92 643 -199 35 -114 -509 -866 -217 -112 -390 844 60 -38 86 755 255 5 35 -62 -203 29
6660 29 -929 995 -418 -32 253 891 -293 -650 0 -742 884 391 215 182 -494 -17 -631 -79 126
6679 126 98 76 -9 30 -584 -305 969 318 -263 -146 -322 458 440 864 -84 -622 -231 3 238 336 368 395
6701 395 781 -237 -292 -264 -131 -165 327 -269 -285 244 -73 120 1125 -637 -36 -313 515 -601 285 -244
6721 -244 5 -560 144 330 -410 -72 -311 145 473 344 386 270 -738 -441 125 602 -726 -648 -430 -720
6741 -720 -444 399 379 -834 -576 192 -356 13 -352 -332 -1090 361 -986 500 -383 -53 -1101 523 -546
6760 -546 1091 136 358 24 81 198 90 -316 227 -124 -167 -980 -116 465 -495 -206 172 927 -878 -276
6780 -276 144 232 -284 181 -275 293 926 -264 722 -156 -404 491 -997 -555 603 414 -405 -134 0
6799 0 526 -249 -518 -656 778 -132 387 -590 -155 225 -506 -276 270 -723 -228 598 -614 563 -436 -767
6819 -767 118 -275 75 245 437 -311 -428 1131 341 -990 875 -803 376 -601 412 -172 -287 -306
6837 -306 -316 -660 398 514 40 490 686 -307 483 35 276 446 91 -220 -26 -224 49 294 -119 -245
6857 -245 479 -12 -465 555 -485 178 1120 414 356 170 452 -380 214 63 -30 65 -43 -742 -897 557
6877 557 4 -731 -475 53 271 -211 -206 -224 -158 -192 -204 -331 399 1013 855 -484 -706 788 561 -808 -79
6898 -79 371 -530 -36 -775 81 876 -474 -132 1268 452 121 -651 92 620 -380 121 -234 951 -36
6917 -36 -693 -680 668 296 -19 380 835 -16 -456 -789 -173 304 -129 -204 -1 -182 116 127 -932 -562 -842
6938 -842 -96 -149 -656 -152 -654 478 -7 120 -64 -449 -845 -209 -476 445 -248 277 270 -233 1075 455
6958 455 84 -37 543 -148 -196 -34 520 -782 364 429 121 200 -87 -364 767 -450 237 131 -439 -356
6978 -356 -601 64 -38 -726 -861 -170 5 200 406 -119 755 -56 41 -424 -120 -547 -48 1002 -11 225
6998 225 -627 -121 -645 -238 -269 -85 144 386 -293 -485 103 195 602 -35 -421 -630 -204 -72 696 563 907
7019 907 -222 304 555 310 -247 -396 -435 -876 526 -664 -19 -1071 -453 39 12 -101 -985 -658 29
7038 29 53 308 1299 227 89 853 -67 434 -666 23 541 -344 -207 326 382 484 -70 112 178 -8 -278
7059 -278 -186 665 -260 76 137 332 -113 -540 -613 -490 -417 326 -476 19 212 -928 -200 5 -140 -405 -521
7080 -521 30 28 11 -51 176 -320 16 306 319 -262 -238 320 53 1062 11 -784 -433 692 150 -1190 -111
7101 -111 627 -526 97 169 587 -844 -383 585 -517 -34 203 187 206 165 -500 -201 1220 -292 -555 3
7121 3 -431 -155 -792 330 290 -311 212 143 -194 -1189 288 -511 -267 -23 220 -461 -694 -467 -184 141 167
7142 167 -483 -37 -75 -422 -226 132 337 174 112 -821 -123 -669 230 395 -109 173 499 -306 -723 250 -558
7163 -558 91 4 -474 908 225 -595 -868 277 155 329 -180 -155 -338 -461 -147 -208 48 -339 21 181
7183 181 -962 -42 48 731 179 -294 -178 -650 -412 54 -199 -158 -467 -581 -688 393 -33 -485 33 563
7203 563 128 374 5 -428 879 -842 39 482 192 117 1140 259 140 736 -708 415 37 -366 61
7222 61 257 16 637 232 -378 8 -761 -365 390 -1112 648 -510 283 -264 155 -35 -365 -180 86
7241 86 -656 478 22 -457 -8 -621 1087 723 535 -434 -12 -28 18 -1339 -416 137 518 460 247 -433
7261 -433 -726 -321 -31 33 -220 -3 661 1034 6 -474 399 309 -108 -104 31 -116 -325 395 -18 -610 273
7282 273 517 -250 -171 -72 -40 331 -124 -212 -478 -80 196 -832 17 280 -214 -586 -673 -329 -624 115 195 -463
7304 -463 -766 81 -163 -880 153 -860 599 -112 -596 -1137 -342 76 431 338 6 284 -409 488 -132
7323 -132 -395 135 -225 432 -174 -442 -373 -148 33 452 -434 646 -490 50 -35 -224 435 -821 -380 -243
7343 -243 -325 -184 -593 -158 -163 -515 -178 -305 -69 -749 68 -572 702 120 576 -152 -860 -123 524 -105 371
7364 371 107 161 1014 1074 501 -773 464 -606 758 -223 -425 215 260 546 40 207 82 -268 506 392
7384 392 -231 -67 -616 -1193 -287 500 -454 -392 -102 -67 303 -83 585 39 -280 -705 -862 1067 112 -319
7404 -319 261 356 -223 -328 -35 853 53 558 -197 556 1445 585 650 36 -550 -763 -526 -738 695 -767
7424 -767 -95 -706 234 -266 51 -1066 391 -239 -2 -349 570 776 335 224 -629 550 30 -447 251
7443 251 -229 -473 494 -236 -675 -623 -91 488 385 703 248 -236 -338 72 231 5 658 1160 203 -252
7463 -252 -243 14 5 64 930 133 542 -668 155 -627 138 718 360 -520 -31 57 -33 -184 -1470 -455 1083
7484 1083 299 -459 162 463 -39 196 391 464 -705 -381 -8 -51 134 790 -258 -230 566 -38 -328 -400
7504 -400 296 -529 72 110 260 531 1398 -684 -37 -436 42 -109 -102 305 47 -185 42 -240 333 382 -219
7525 -219 -622 288 71 -364 -227 720 -335 -417 -54 547 -516 -30 33 -588 -108 -319 -263 -553 -143 -223 -711
7546 -711 45 -108 -216 526 178 1058 -261 -410 66 -113 619 -154 -771 -69 -620 -151 39 -81 -676 -150
7566 -150 -305 101 -312 -615 1360 539 -72 374 143 -14 -221 265 -505 622 -709 245 -705 -504 949
7585 949 -247 -568 -206 18 -428 -440 -743 209 50 415 -1017 -267 38 -204 -70 -217 303 697 350 519
7605 519 -848 -593 226 -165 47 -131 -74 -505 507 301 487 140 234 590 535 548 -332 591 -85 77 -888
7626 -888 -179 -144 66 296 148 -7 5 -566 -37 -105 1117 -154 762 29 249 -52 784 -81 487 262
7646 262 -83 -698 -594 1146 -550 -212 -455 316 -151 384 525 -268 -86 -573 -619 425 -530 70 538
7665 538 -452 -388 -309 772 -50 203 -231 279 28 -553 1013 -268 -495 205 -241 225 -342 454 1190 138
7685 138 399 -697 50 250 468 590 -714 -245 606 -295 -313 320 209 145 -266 23 284 -351 -6 758
7705 758 465 -42 -410 467 207 736 -702 -254 187 -556 724 481 505 439 -941 259 -408 -332 -531 244
7725 244 -361 303 418 -53 -137 226 135 -77 -41 416 351 273 -495 -365 558 115 0 -315 -567 -240 109 -181
7747 -181 -117 -188 637 -226 13 249 -303 -18 155 214 -274 723 -709 911 401 283 -241 198 109 -87 443
7768 443 273 -43 -128 -856 -168 -415 -317 55 234 309 -235 290 -300 841 1226 370 -347 -265 61 -11 -32 -458
7790 -458 -200 -78 369 626 -666 278 435 -26 -829 -974 -248 -12 -948 493 14 -833 -130 617 128
7809 128 -654 -696 -529 -397 -1157 -141 266 -399 282 -760 -1001 29 -167 -539 -408 696 -913 -425 -497
7828 -497 495 141 -224 341 -928 692 -118 -383 312 186 -139 -52 220 -215 -819 -788 366 229 303 -373
7848 -373 321 23 -179 747 972 1300 -1362 -399 498 -303 457 -151 -415 783 -246 -67 593 -128 182
7867 182 -70 149 -356 77 -380 444 -609 80 -174 -95 -931 170 -52 49 -268 -458 -759 -225 -444 -481
7887 -481 39 706 111 -314 14 -1373 -236 551 -131 -1033 -623 178 465 -534 609 -416 806 -139
7905 -139 381 871 365 1370 114 -700 758 -259 -330 -435 -607 -214 547 -387 -510 -618 735 -730
7923 -730 -206 313 708 -204 221 468 605 908 -114 762 -205 -216 819 226 100 174 370 440 -590 -1273
7943 -1273 1131 -500 -411 218 391 883 1040 -79 -91 667 -822 24 606 -230 -465 167 -633 -172 -172 -753
7963 -753 -908 114 1148 289 -207 43 -159 351 49 426 -470 482 -39 -197 1 -339 569 -450 -418
7982 -418 -72 -559 -463 404 -253 -720 90 -604 251 249 1045 -266 -197 369 -742 -441 -433 -240 -213 -36 745 246
8004 246 -197 211 72 -200 311 -266 -148 -979 5 437 99 173 57 591 -55 -122 83 235 232 535 537 -433
8026 -433 566 327 661 592 -1186 -210 -282 -708 -236 387 -220 -294 -742 -588 -765 -32 -432 -717 714 -557
8046 -557 697 -461 101 385 404 -526 57 -760 346 -55 -866 78 -648 15 46 715 -485 68 432
8065 432 745 397 -41 302 -542 439 -25 573 -976 114 -1005 -531 797 -404 -798 -1356 -672 -376
8083 -376 -1035 -1100 -1520 -1453 -926 -732 754 -553 -546 765 404 454 100 -1251 -108 -619 283 101 1268 19
8103 19 -85 23 -385 292 128 293 -474 -303 -832 -475 -364 515 1128 -547 431 -839 184 -539 1037
8122 1037 -828 -373 -145 291 312 -880 -1253 -203 46 468 182 -68 -57 -474 284 -1139 -87 544 -100
8141 -100 -253 688 21 -254 691 -430 191 -564 1345 -79 82 785 -153 84 -38 464 834 -1090 414
8160 414 177 -700 -75 -153 777 -146 -218 211 -28 -14 -420 -485 -797 -11 503 -264 362 -73 159 -339 -102
8181 -102 -622 495 371 442 -312 12 97 320 1034 -132
8191a32
##END NTUPLES=NMR FID
##END=
