##TITLE=1H_SA_57.226
 D2O, 8 sc, 
 2.9.2020
##JCAMPDX= 6.0         $$ Bruker NMR JCAMP-DX V2.0
##DATA TYPE= NMR FID
##DATA CLASS= NTUPLES
##ORIGIN= UXNMR, Bruker Analytische Messtechnik GmbH
##OWNER= root
$$ XWIN-NMR		Version 3.5
$$ Wed Sep  2 08:30:36 2020 Russian Standard Time (UT+4h)  she@DPX200
##.OBSERVE FREQUENCY= 200.1315066352
##.OBSERVE NUCLEUS= ^1H
##.DELAY= (6, 6)
##.ACQUISITION MODE= SIMULTANEOUS
##.ACQUISITION SCHEME= undefined
##.AVERAGES= 8
##.DIGITISER RES= 18
##SPECTROMETER/DATA SYSTEM= spect
##.PULSE SEQUENCE= zg30
##.SOLVENT NAME= D2O
##.SHIFT REFERENCE= (INTERNAL, D2O, 0, 15.7039)
##AUDIT TRAIL= $$ (NUMBER, WHEN, WHO, WHERE, WHAT)
$$ ##TITLE= Audit trail, XWIN-NMR		Version 3.5
$$ ##JCAMPDX= 5.01
$$ ##ORIGIN= Bruker BioSpin GmbH
$$ ##OWNER= she
$$ F:/spectra/data/she/nmr/H-F/1/audita.txt
$$ ##AUDIT TRAIL=  $$ (NUMBER, WHEN, WHO, WHERE, WHAT)
(   1,<2020-09-02 08:29:21.48 +0400>,<she>,<DPX200>,
      <created by zg, POWCHK disabled, PULCHK disabled
       configuration hash MD5:
       00 E9 B6 7A A2 85 ED C7 34 08 36 98 17 FE 4E 26
       data hash MD5: 16K
       F7 67 86 6F 8F 58 9E 1A 64 17 73 8D 8C 4F 45 63>)
$$ ##END=
$$ 
$$ hash MD5
$$ C0 90 95 15 C4 58 97 D3 68 C7 E6 33 C7 98 5B 9E
##$RELAX= 
##$RELAX= 
##$RELAX= 
##$RELAX= 
##$RELAX= 
##$RELAX= 
$$ Bruker specific parameters
$$ --------------------------
##$DU= <F:/spectra>
##$EXPNO= 1
##$NAME= <H-F>
##$PROCNO= 1
##$TYPE= <nmr>
##$USER= <she>
##$AMP= (0..31)
100 100 100 100 100 100 100 100 100 100 100 100 100 100 100 100 100 100 
100 100 100 100 100 100 100 100 100 100 100 100 100 100 
##$AQSEQ= 0
##$AQ_mod= 1
##$AUNM= <au_zg>
##$AUTOPOS= <>
##$BF1= 200.13
##$BF2= 200.13
##$BF3= 200.13
##$BF4= 200.13
##$BF5= 200.13
##$BF6= 200.13
##$BF7= 200.13
##$BF8= 200.13
##$BYTORDA= 1
##$CFDGTYP= 0
##$CFRGTYP= 5
##$CHEMSTR= <none>
##$CNST= (0..31)
1 1 145 1 1 1 1 1 1 1 1 1 1 1 1 1 1 1 1 1 1 1 1 1 1 1 1 1 1 1 1 1 
##$CPDPRG= <>
##$CPDPRG1= <>
##$CPDPRG2= <>
##$CPDPRG3= <>
##$CPDPRG4= <mlev>
##$CPDPRG5= <mlev>
##$CPDPRG6= <mlev>
##$CPDPRG7= <mlev>
##$CPDPRG8= <mlev>
##$CPDPRGB= <>
##$CPDPRGT= <>
##$D= (0..31)
0 1.2 0 0 0 0 0 0 0 0.06 0 0.03 0 0 0 0 0.0002 0 0 0 0 0 0 0 0 0 0 0 0 
0 0 0 
##$DATE= 1599020960
##$DBL= (0..7)
120 120 120 120 120 120 120 120 
##$DBP= (0..7)
150 150 150 150 150 150 150 150 
##$DBP07= 0
##$DBPNAM0= <>
##$DBPNAM1= <>
##$DBPNAM2= <>
##$DBPNAM3= <>
##$DBPNAM4= <>
##$DBPNAM5= <>
##$DBPNAM6= <>
##$DBPNAM7= <>
##$DBPOAL= (0..7)
0.5 0.5 0.5 0.5 0.5 0.5 0.5 0.5 
##$DBPOFFS= (0..7)
0 0 0 0 0 0 0 0 
##$DE= 6
##$DECBNUC= <off>
##$DECIM= 32
##$DECNUC= <off>
##$DECSTAT= 4
##$DIGMOD= 1
##$DIGTYP= 9
##$DL= (0..7)
0 120 120 120 120 120 120 120 
##$DP= (0..7)
150 150 150 150 150 150 150 150 
##$DP07= 0
##$DPNAME0= <>
##$DPNAME1= <>
##$DPNAME2= <>
##$DPNAME3= <>
##$DPNAME4= <>
##$DPNAME5= <>
##$DPNAME6= <>
##$DPNAME7= <>
##$DPOAL= (0..7)
0.5 0.5 0.5 0.5 0.5 0.5 0.5 0.5 
##$DPOFFS= (0..7)
0 0 0 0 0 0 0 0 
##$DQDMODE= 0
##$DR= 18
##$DS= 0
##$DSLIST= <SSSSSSSSSSSSSSS>
$$ [...]
##$SUBNAM2= <"">
##$SUBNAM3= <"">
##$SUBNAM4= <"">
##$SUBNAM5= <"">
##$SUBNAM6= <"">
##$SUBNAM7= <"">
##$SUBNAM8= <"">
##$SUBNAM9= <"">
##$SW= 16.880792210976
##$SWIBOX= (0..15)
0 0 2 0 0 0 0 0 0 0 0 0 0 0 0 0 
##$SW_h= 3378.37837837838
##$TD= 16384
##$TD0= 1
##$TE= 0
##$TE2= 300
##$TE3= 300
##$TEG= 300
##$TL= (0..7)
0 120 120 120 120 120 120 120 
##$TP= (0..7)
150 150 150 150 150 150 150 150 
##$TP07= 0
##$TPNAME0= <>
##$TPNAME1= <>
##$TPNAME2= <>
##$TPNAME3= <>
##$TPNAME4= <>
##$TPNAME5= <>
##$TPNAME6= <>
##$TPNAME7= <>
##$TPOAL= (0..7)
0.5 0.5 0.5 0.5 0.5 0.5 0.5 0.5 
##$TPOFFS= (0..7)
0 0 0 0 0 0 0 0 
##$TUNHIN= 0
##$TUNHOUT= 0
##$TUNXOUT= 0
##$USERA1= <user>
##$USERA2= <user>
##$USERA3= <user>
##$USERA4= <user>
##$USERA5= <user>
##$V9= 5
##$VALIST= <valist>
##$VCLIST= <CCCCCCCCCCCCCCC>
##$VD= 0
##$VDLIST= <DDDDDDDDDDDDDDD>
##$VPLIST= <PPPPPPPPPPPPPPP>
##$VTLIST= <TTTTTTTTTTTTTTT>
##$WBST= 1024
##$WBSW= 4
##$XGAIN= (0..3)
0 0 0 0 
##$XL= 0
##$YL= 0
##$YMAX_a= 57406
##$YMIN_a= -45070
##$ZGOPTNS= <>
##$ZL1= 120
##$ZL2= 120
##$ZL3= 120
##$ZL4= 120
##$ABSF1= 10
##$ABSF2= 0
##$ABSG= 5
##$ABSL= 3
##$ALPHA= 0
##$AQORDER= 0
##$ASSFAC= 0
##$ASSFACI= 0
##$ASSFACX= 0
##$ASSWID= 0
##$AUNMP= <proc_1d>
##$AZFE= 0.1
##$AZFW= 0.1
##$BCFW= 1
##$BC_mod= 2
##$BYTORDP= 1
##$COROFFS= 0
##$CY= 11.3945322036743
##$DATMOD= 1
##$DC= 2
##$DFILT= <>
##$DTYPP= 0
##$F1P= 16.9975609425685
##$F2P= -3.02152046262296
##$FCOR= 0.5
##$FTSIZE= 0
##$FT_mod= 4
##$GAMMA= 1
##$GB= 0.15
##$INTBC= 1
##$INTSCL= 1
##$ISEN= 128
##$LB= 0.24
##$LEV0= 0
##$LPBIN= 0
##$MAXI= 10000
##$MC2= 0
##$MEAN= 0
##$ME_mod= 0
##$MI= 1.114404
##$NCOEF= 0
##$NC_proc= 0
##$NLEV= 6
##$NOISF1= 3.799351
##$NOISF2= 2.8
##$NSP= 1
##$NTH_PI= 0
##$NZP= 0
##$OFFSET= 15.70392
##$PC= 1
##$PHC0= -9981.937
##$PHC1= 21.4009
##$PH_mod= 1
##$PKNL= yes
##$PPARMOD= 0
##$PSCAL= 0
##$PSIGN= 0
##$REVERSE= no
##$SF= 200.130013532006
##$SI= 16384
##$SIGF1= 3
##$SIGF2= 2
##$SINO= 400
##$SIOLD= 16384
##$SREGLST= <1H.CDCl3>
##$SSB= 0
##$STSI= 0
##$STSR= 0
##$SW_p= 3612.71676300578
##$SYMM= 0
##$S_DEV= 0
##$TDeff= 0
##$TDoff= 0
##$TI= <>
##$TILT= no
##$TM1= 0
##$TM2= 0
##$TOPLEV= 0
##$USERP1= <user>
##$USERP2= <user>
##$USERP3= <user>
##$USERP4= <user>
##$USERP5= <user>
##$WDW= 1
##$XDIM= 8192
##$YMAX_p= 0
##$YMIN_p= 0
$$ End of Bruker specific parameters
$$ ---------------------------------
##NTUPLES= NMR FID
##VAR_NAME=  TIME,          FID/REAL,        FID/IMAG
##SYMBOL=    X,             R,               I
##VAR_TYPE=  INDEPENDENT,   DEPENDENT,       DEPENDENT
##VAR_FORM=  AFFN,          ASDF,            ASDF
##VAR_DIM=   8192,          8192,            8192
##UNITS=     SECONDS,       ARBITRARY UNITS, ARBITRARY UNITS
##FACTOR=    0.000296,      1,               1
##FIRST=     0,             0,               0
##LAST=      2.424536,      0,               0
##MIN=       0,             -45070,          0
##MAX=       2.424536,      57406,           0
$$ Real data points
##PAGE= N=1
##DATA TABLE= (X++(R..R)), XYDATA
0@%%%%%%%%%%%%%%%%%%%%%jPj4J6j6J6j6J7k2K9l2L3l8M6n0N6o4P1p9Q8j00J12
$$ 0 0 0 0 0 0 0 0 0 0 0 0 0 0 0 0 0 0 0 0 0 0 -1 6 -8 8 -8 8 -8 9 -13 16 -16 17 -21 25 -25 31 -33 38 -41 47 -53 59
43E9j23J36j51J66j82K03k24K45k70K97l29L64m01M44m95N51o16O93p86R00j041
$$ 59 -64 72 -79 87 -95 108 -116 129 -141 156 -173 191 -210 234 -261 290 -326 367 -419 481 -560
64e60J228j487J868k493L774j4781L7580J5034l4849l2162j8222K1812L9435K2241
$$ -560 668 -819 1049 -1444 2330 -12451 25129 40163 5314 -26848 -45070 -23258 16177 38418
78C8418k5087m1350j5556K2761L8456K2889k2509m5224j7262K9721L8368J2579
$$ 38418 13331 -28019 -43575 -20814 17642 40531 18022 -27202 -44464 -14743 23625 36204
90C6204k0106l6969k1207K3604M3418J3253k4787l4500j6538J8977M1078J9207
$$ 36204 16098 -20871 -42078 -18474 24944 38197 13410 -21090 -37628 -18651 22427 41634
102D1634k6234l9684j0071K2205L2945J8747j9609m1067j5393K5838L5508J1755
$$ 41634 15400 -24284 -34355 -12150 20795 39542 19933 -21134 -36527 -10689 24819 36574
114C6574j8518l5388j9298K2720L9746J0786k3304l1302j4533J6761L7342J7667
$$ 36574 18056 -17332 -36630 -13910 25836 36622 13318 -17984 -32517 -15756 21586 39253
126C9253k4358l6392r752K0588L0930J6776j7803l7900j3726K4030L2253J0886
$$ 39253 14895 -21497 -31249 -10661 20269 37045 19242 -18658 -32384 -8354 23899 34785
138C4785j6789l2764j7780K0545L7146J0288k1996k9843j3472J5629L3951J6102
$$ 34785 17996 -14768 -32548 -12003 25143 35431 13435 -16408 -29880 -14251 19700 35802
150C5802k2544l3799r798J8073K8921J5580j6578l5190j3201K1863L0323J0424
$$ 35802 13258 -20541 -30339 -12266 16655 32235 15657 -19533 -32734 -10871 19452 29876
162B9876j5670l0262j6624J8465L4527J0727k0275k7627j2906J4051L2473J5601
$$ 29876 14206 -16056 -32680 -14215 20312 31039 10764 -16863 -29769 -15718 16755 32356
174C2356k0628l1355r275J6605K7144J5525j4914l3163j3336K0717K8417J0428
$$ 32356 11728 -19627 -28902 -12297 14847 30372 15458 -17705 -31041 -10324 18093 28521
186B8521j4237k8321j5825J6707L2067J0706j8228k6221j2706J2603L0438J4908
$$ 28521 14284 -14037 -29862 -13155 18912 29618 11390 -14831 -27537 -14934 15504 30412
198C0412j8957k9643r660J5254K6014J4334j3884l1188j2886J8997K6872J0218
$$ 30412 11455 -18188 -27848 -12594 13420 27754 13870 -17318 -30204 -11207 15665 25883
210B5883j2961k6511j5484J5721L0913J0582j7167k4643j2034J1870K8725J4948
$$ 25883 12922 -13589 -29073 -13352 17561 28143 10976 -13667 -25701 -13831 14894 29842
222B9842j7878k7983r127J4201K4559J4210j3373k9237j2741J7819K5919R596
$$ 29842 11964 -16019 -25146 -10945 13614 27824 14451 -14786 -27527 -9708 16211 25807
234B5807j2090k5436j4768J4792K9050J0129j6561k3396j1368J1240K7089J3867
$$ 25807 13717 -11719 -26487 -11695 17355 27484 10923 -12473 -23841 -12601 14488 28355
246B8355j6206k6992r430J3602K3414J3141j2248k8313j1803J6727K4319R416
$$ 28355 12149 -14843 -24273 -10671 12743 25884 13636 -14677 -26480 -9753 14566 23982
258B3982j1572k4111j4389J4038K7434J0269j5136k2774j1369J1180K5890J3435
$$ 23982 12410 -11701 -26090 -12052 15382 25651 10515 -12259 -23628 -12448 13442 26877
270B6877j5509k5998q670J2901K2360J2905j1795k7024j1689J5911K3219R304
$$ 26877 11368 -14630 -23300 -10399 11961 24866 13071 -13953 -25642 -9731 13488 22792
282B2792j0861k3786j3893J3694K6638R510j4790k1510j0595J0320K4858J3208
$$ 22792 11931 -11855 -25748 -12054 14584 24094 9304 -12206 -22801 -12481 12377 25585
294B5585j5102k4766q699J2617K1353J2738j1620k5723j0928J4583K2592R164
$$ 25585 10483 -14283 -22982 -10365 10988 23726 12106 -13617 -24545 -9962 12630 21794
306B1794j0778k2697j3016J2746K5441R328j3962k1159r909R916K4077J2493j4343
$$ 21794 11016 -11681 -24697 -11951 13490 22818 8856 -12303 -22212 -12296 11781 24274 9931
319I931k3847q157J1938K0841J2218j0997k5110j0526J4474K2005Q237j0092k1748
$$ 9931 -13916 -22073 -10135 10706 22924 11927 -13183 -23709 -9235 12770 21007 10915 -10833
332a0833j2730J2445K4253Q890j3366k0054j0333R731K3285J2167j4075k3112
$$ -10833 -23563 -11118 13135 22025 8659 -11395 -21728 -11997 11288 23455 9380 -13732
344a3732p669J1534K0108J1698j0481k4092j0551J3963K1213Q547j0282k1066
$$ -13732 -21401 -9867 10241 21939 11458 -12634 -23185 -9222 11991 20538 10256 -10810
356a0810j2041J1753K3818Q570j2919j9291j0074R278K2687J1685j3107k2478
$$ -10810 -22851 -11098 12720 21290 8371 -10920 -20994 -11716 10971 22656 9549 -12929
368a2929p456J1339J9401J1349j0005k2751j0408J3299K0299Q586r925k0415j1851
$$ -12929 -20385 -9046 10355 21704 11699 -11052 -21460 -8161 12138 20724 10799 -9616 -21467
381b1467J1152K3063Q493j2982j8753r445Q901K1089J1586j2305k1628p571J0258
$$ -21467 -10315 12748 21241 8259 -10494 -19939 -11038 10051 21637 9332 -12296 -19867 -9609
394i609J9154J1143r372k2774r603J2826J9711Q147r442j9030j1606J0699K1770
$$ -9609 9545 20688 11316 -11458 -21061 -8235 11476 19623 10181 -8849 -20455 -9756 12014
407A2014Q723j1971j8583r442Q872K0916J1083j2398k0751p624J0514J7949J0607
$$ 12014 20737 8766 -9817 -19259 -10387 10529 21612 9214 -11537 -19161 -8647 9302 19909
420A9909q818k1701j0034J2159J9573P496q680j9166j1575J0298K1213Q327j1655
$$ 19909 11091 -10610 -20644 -8485 11088 18584 9904 -9262 -20837 -10539 10674 19001 7346
433G346j7946r166P875J9743J1054j1707k0260p274R877J7340J0749r000k0880
$$ 7346 -10600 -19766 -11891 7852 18906 7199 -13061 -20335 -10458 6882 17631 8631 -12249
446a2249r344J1904J8787P810q431j8038j1151J0183K0664Q290j0924j7386q759
$$ -12249 -21593 -9689 9098 16908 8477 -9561 -20712 -10529 10135 18425 7501 -9885 -18644
459a8644P951J9161J0601j1183j9227p284R300J7111J0080q254k0195r379J1574
$$ -18644 -10693 8468 19069 7886 -11341 -18625 -9325 7786 17866 9612 -10583 -19962 -8388
472h388J7774Q090q505j7331j0973R691K0088Q060j0315j6890q773P300J8870
$$ -8388 9386 17476 8971 -8360 -19333 -9642 10446 18506 8191 -8699 -17472 -10172 8698
485H698J0356j0512j9176p130Q914J6618R908q149j9092r214J0543J7892P509
$$ 8698 19054 8542 -10634 -17764 -8850 7768 17676 9527 -9565 -18779 -8236 9656 17165
498A7165p718j6893j0360R128J9121Q064j0332j6054q591P031J8047R867j0275
$$ 17165 9447 -7446 -17806 -8678 10443 18507 8175 -7879 -16470 -9439 8608 18475 8200
511H200j8542o964Q349J5771R543p925j8775q914J0165J6992P469p527j6367j0141
$$ 8200 -10342 -17306 -8957 6814 16357 8432 -10343 -19257 -9092 7900 15369 7842 -8525 -18666
525a8666Q672J8815P841r637j5829p885O781J7677R702r737j7619o943Q395J5497
$$ -18666 -9994 8821 16662 7025 -8804 -16689 -9908 7769 17471 7734 -9885 -16828 -8433 7064
539G064R078p208j7817q832J0040J6507P056p133j5864r763Q478J8331P374r390
$$ 7064 16142 8934 -8883 -17715 -7675 8832 15888 8755 -7109 -16872 -8394 9937 17311 7921
553G921j4876q214O583J6762R763r523j7177p035P664J5359Q549p018j7415q882
$$ 7921 -6955 -15169 -8586 8176 17939 8416 -8761 -15796 -8132 7227 15776 8758 -8657 -17539
567a7539R563J5655P222o819j5247r662Q242J7552P154q498j4926p631O486J6373
$$ -17539 -7976 7679 14901 8082 -7165 -16827 -8585 8967 16121 7623 -7303 -14934 -8448 7925
581G925R477r125j6451o710P674J4329Q708o711j6951q543Q933J5403O999o751
$$ 7925 17402 8277 -8174 -14884 -7210 7119 15827 9116 -7835 -16378 -7445 7958 14957 8206
595H206j4787r323P590J6860P274q137j4444p783O374J5513R114q474j5900o769
$$ 8206 -6581 -15904 -8314 8546 15820 7683 -6761 -14544 -8170 7343 16457 7983 -7917 -14686
609a4686P394J3838Q713o508j6726p998Q922J4511O948o608j4487q786P603J5911
$$ -14686 -7292 6546 15259 8751 -7975 -15973 -7051 7460 14408 7800 -6687 -15473 -7870 8041
623H041P558q296j3706p556N745J5816Q850q182j5698o425P015J3619Q526o640
$$ 8041 15599 7303 -6403 -13959 -8214 7602 16452 8270 -7428 -13853 -6838 6781 15307 8667
637H667j5860q061Q137J4521O404o275j3877q853O941J5687P243p794j3566p179
$$ 8667 -7193 -15254 -7117 7404 13808 7533 -6344 -15197 -8256 7431 14674 6880 -6686 -13865
651a3865N497J4870R029p985j5514o000O654J3496Q072o080j5402p620Q086J3744
$$ -13865 -8368 6502 15531 7546 -7968 -13968 -7314 6182 14254 8174 -7228 -14848 -6762 6982
665F982O373n890j3361q893O686J5587O831p576j2985o970N529J4520Q215p455
$$ 6982 13355 7465 -5896 -14789 -8103 7484 14315 6739 -6246 -13216 -7687 6833 15048 7593
679G593j4550o215O090J3062Q212n901j4821p722P446J3632O397n768j3205q603
$$ 7593 -6957 -13172 -7082 5980 14192 8291 -6530 -14252 -6806 6826 13223 7455 -5750 -14353
693a4353O489J4945O948p445j2585o951N184J3876Q075o974j4242o142O449J2447
$$ -14353 -7864 7081 14029 6584 -6001 -12952 -7768 6108 14183 7209 -7033 -13175 -6726 5721
707E721P601n166j4837p697Q122J2656O426n690j2774q166O284J4399O595p004
$$ 5721 13322 8156 -6681 -14378 -6256 6400 12826 7136 -5638 -13804 -7520 6879 13474 6470
721F470j2333o524M811J3741P931p299j3645n925O286J2222P315n434j3657p608
$$ 6470 -5863 -12387 -7576 6165 14096 6797 -6848 -12773 -6487 5735 13050 7616 -6041 -13649
735a3649O859J3039O065n252j2477p942O220J3825O575p118j1934o574M882J2818
$$ -13649 -6790 6249 12314 7062 -5415 -13357 -7137 6688 13263 6145 -5789 -12363 -7481 5337
749E337Q058o560j3264o276O034J1720P310n089j3555o844O590J2328O046m924
$$ 5337 13395 6835 -6429 -12705 -6671 5049 12359 7270 -6285 -13129 -6539 5789 11835 6911
763F911j2308p650N683J3806O410o654j1788o391M880J2884P406o704j2734n963
$$ 6911 -5397 -13047 -7364 6442 12852 6198 -5590 -11981 -7101 5783 13189 6485 -6249 -12212
777a2212O016J1344P144m931j3513o781O889J1845O075n208j1853p247N583J3009
$$ -12212 -6196 5148 12292 7361 -6152 -12933 -6044 5801 11876 6668 -5185 -12432 -6849 6160
791F160O250o242j1501o303M629J2687P220o607j2864n254N526J0880P108m899
$$ 6160 12410 6168 -5333 -11636 -7007 5680 12900 6293 -6571 -11825 -6299 4581 11689 6790
805F790j2956o570O443J1694N977m896j1378p402N514J2739O246o323j0993n961
$$ 6790 -6166 -12736 -6293 5401 11378 6482 -4896 -12298 -6784 5955 12201 5878 -5115 -11076
819a1076M450J2018O948n785j2171n473N077J0715O770m829j2335o415O147J1268
$$ -11076 -6626 5392 12340 6555 -5616 -11089 -6012 4703 11473 6644 -5691 -12106 -5959 5309
833E309N776m745j1028p141N397J2345N965n826j0765o018M361J1406P183n947
$$ 5309 11085 6340 -4688 -11829 -6432 5913 11878 6052 -4713 -10731 -6370 5036 12219 6272
847F272j1831n097N103J0203O851m397j2135o640O261J0596N544m392j0534o933
$$ 6272 -5559 -10656 -5553 4650 11501 7104 -5031 -11671 -5410 5186 10730 6338 -4196 -11129
861a1129M938J2062N566n544j0358n889M151J1305O533n307j1303n730M937J0240
$$ -11129 -6191 5871 11437 5893 -4465 -10354 -6203 5102 11635 6328 -4975 -10705 -5768 4472
875D472O341m495j1777o144N337J0954M996m338j0474o891N151J1526N764n756
$$ 4472 10813 6318 -5459 -11603 -6266 4688 9684 5346 -5128 -12019 -6868 4658 10422 4666
889D666r910n494M089J1052O317n095j1346m715M782R880O277m181j1390o096
$$ 4666 -5244 -10738 -6649 4403 10720 5625 -5721 -10436 -5654 4226 10503 6322 -5068 -11164
903a1164N655J0392N035m270j0182o519M817J1277N353n074r960n200M010J0739
$$ -11164 -5509 4883 9918 5648 -4534 -11053 -6236 5041 10394 5320 -4640 -9840 -5830 4909
917D909N977m969j0919n243M920R559O129m183j1137n918N550R477N238l844j0091
$$ 4909 10886 5917 -5002 -10245 -5325 4234 10363 6180 -4957 -10875 -5325 4152 9390 5546 -4545
932d545o438N103J0741N158m957r522n296L460J0851O135n121j0254n025M693
$$ -4545 -10983 -5880 4861 10019 5062 -4460 -9756 -6296 4555 10690 5569 -4685 -9710 -5017
946e017R067O014m028j0438o119N073R819M990l778r645o390M428J0547M907m503
$$ -5017 4050 10064 6036 -4402 -10521 -5448 4371 9361 5583 -4062 -10452 -6024 4523 9430 4927
961D927r375n123L544R892O393m815j0371m680M285R300N533l567j0556n369M809
$$ 4927 -4448 -9571 -6027 3865 10258 5443 -4928 -9608 -5323 3977 9510 5943 -4613 -9982 -5173
976e173R374M949m063r158n964M117J0480M986m473r073n240L600R767N636m219
$$ -5173 4201 9150 5087 -4071 -10035 -5918 4562 9548 5075 -3998 -9238 -5638 4129 9765 5546
991E546r687m766L995R162N618l854r932n778M456R629M719l803r239n606L854
$$ 5546 -4141 -8907 -4912 4250 9868 6014 -3918 -9696 -5240 4389 9108 5305 -3934 -9540 -5686
1006e686J0038M834m557q758n206L437R289O048m533r864m190L798Q891N468l444
$$ -5686 4352 9186 4629 -4129 -9335 -5898 3391 9439 4906 -4958 -9148 -5350 3541 9009 5565
1021E565r741n486M429R110M648l494q427o046L912R490M825m199q450m919L166
$$ 5565 -4176 -9662 -5233 3877 8525 5031 -3396 -9442 -5530 3960 8785 4586 -3864 -8783 -5617
1036e617R336N654m285r589m061L753Q251N618l590r228n143M087Q790M579l217
$$ -5617 3719 9373 5088 -4501 -8562 -4809 3442 9060 5470 -3758 -8901 -4814 3976 8555 5338
1051E338q632n648L717R317M695m325q206m687L127Q752N410l637r107m617L867
$$ 5338 -3294 -8942 -5225 4092 8787 4462 -3744 -8431 -5304 3448 8858 5221 -3886 -8503 -4636
1066d636Q146N426l335r287n089M533Q369M325l283q245n772L852R213M743m407
$$ -4636 3510 8936 5601 -3686 -8775 -4242 4127 8452 5169 -3076 -8848 -4996 4217 8960 4553
1081D553q075m510L222Q625N145l963q954m284L707P864N212l191r063n097M142
$$ 4553 -3522 -8032 -4810 3815 8960 4997 -3957 -8241 -4534 3330 8542 5351 -3712 -8809 -4667
1096d667Q402M292l248p953n268L397Q809M450l862p575m536K629Q643N082m039
$$ -4667 3735 8027 4779 -3174 -8442 -5045 3764 8214 4352 -3223 -7759 -5130 3513 8595 4556
1111D556q545m381M023P568M786k966q654m741L833Q129M219l128p852n076L187
$$ 4556 -3989 -8370 -4347 3221 8007 5041 -3613 -8354 -4521 3608 7827 4699 -3153 -8229 -5042
1126e042Q833M277l659p625m750K886Q218N116l712q329m162L368P438N085l114
$$ -5042 3791 8068 4409 -3216 -7966 -5080 3138 8254 4542 -3787 -7949 -4581 2857 7942 4828
1141D828q554m445L640P931M085k843p678n289L516Q476M229l848p311m374K841
$$ 4828 -3726 -8171 -4531 3400 7485 4642 -3036 -8325 -4809 3667 7896 4048 -3263 -7637 -4796
1156d796P774N093l473q241l719L222P067M834k924q093m802L918P576L986k972
$$ -4796 2978 8071 4598 -3643 -7362 -4140 2927 7761 4837 -3256 -8058 -4140 3436 7422 4450
1171D450p346n045L459Q127M328l727p007m727L002P612N078l780p854l939L152
$$ 4450 -2896 -7941 -4482 3645 7973 4246 -2761 -7488 -4486 3126 8204 4424 -3430 -7369 -4217
1186d217P305M333k491q320m087L398P413L828k785p179n002L340P815M252l588
$$ -4217 3088 7421 4930 -3390 -7477 -4079 3334 7162 4377 -2802 -7804 -4464 3351 7603 4015
1201D015p069m048K576P635M715l441p588l941L192O881M540k621p929m448L708
$$ 4015 -3054 -7102 -4526 3109 7824 4383 -3205 -7146 -3954 2927 7467 4846 -3083 -7531 -3823
1216c823P217L861k967p025m995L038Q177M051l417o978l884K473P199M784l424
$$ -3823 3394 7255 4288 -2737 -7732 -4694 3483 7534 4117 -2861 -6745 -4272 2927 7711 4287
1231D287p488l716K787P040M489k913p731m149L292P147L740k626p008m645K997
$$ 4287 -3201 -6917 -4130 2910 7399 4486 -3245 -7394 -4102 3045 6785 4159 -2849 -7494 -4497
1246d497P571M267l519o964l733K492P267M302l392p160l320K738O655M412k462
$$ -4497 3074 7341 3822 -3142 -6875 -4383 2884 7186 3794 -3366 -6686 -3948 2707 7119 4657
1261D657p410m690L640O714L890k672o838m426K610P729L713l257o384l733K110
$$ 4657 -2753 -7443 -3803 2911 6801 4129 -2709 -7135 -4525 3204 6917 3660 -2724 -6457 -4347
1276d347P094M364l095p153l495L025O390M162k490p124m251L083O901L587k442
$$ -4347 2747 7111 4016 -3137 -6632 -3607 2783 6945 4455 -2669 -6920 -3837 3064 6651 4209
1291D209o517m189K307P037L843l057o373l802K300O791M190k948o546l806L061
$$ 4209 -2308 -6497 -4190 2847 6690 3633 -2740 -6542 -4242 2549 6739 3791 -2755 -6561 -3500
1306c500N947M170k223o832m304L381O358L394k307o685l963K631O702L728l114
$$ -3500 2447 6617 4394 -2438 -6742 -3361 2997 6391 4084 -2601 -6564 -3933 2769 6497 3383
1321C383o294l703K463O447M320k742o595l870K924N992L923k167o803m169L431
$$ 3383 -2911 -6614 -4151 2296 6616 3874 -2721 -6591 -3667 2325 6248 4081 -2722 -6891 -3460
1336c460O099L367k328o068m205K399P235L108k611o224l598K449O175L910k431
$$ -3460 2639 6006 3678 -2390 -6595 -4196 3039 6147 3536 -2688 -6286 -3837 2338 6248 3817
1351C817o847l367K552O502L682k228o692l781K949O103L187k150n996l947K409
$$ 3817 -3030 -6397 -3845 2657 6339 4111 -2581 -6362 -3413 2690 5877 3727 -2269 -6216 -3807
1366c807O511L624k854o020l630K287N812M336k763o451l099K508N561L901k105
$$ -3807 2704 6328 3474 -2546 -6176 -3889 1923 6259 3496 -2955 -6054 -3546 2015 5916 3811
1381C811o450l888K971N825L585k206n607m342K230O414L840k856n899l242K023
$$ 3811 -2639 -6527 -3556 2269 5854 3648 -1959 -6301 -4071 2343 6183 3327 -2572 -5814 -3791
1396c791N914L966k639o043l296K235N574L938j984o218l894K838N922L454k259
$$ -3791 2123 6089 3450 -2593 -5889 -3654 1920 5858 3874 -2344 -6238 -3400 2522 5976 3717
1411C717n571m108K155O643L227k677n917l056J975N824L942k684o062l157K317
$$ 3717 -1854 -5962 -3807 2836 6063 3386 -2531 -5587 -3612 2212 6154 3470 -2592 -5749 -3432
1426c432N412L895k210n971l535K497N888L296k106n608l842K205N935L296k419
$$ -3432 1980 5875 3665 -2306 -5841 -3344 2544 5840 3734 -1874 -5716 -3511 2424 5720 3301
1441C301n389l324J954N692L722k627n843l097K233N185L589j796n941l820K567
$$ 3301 -2088 -5412 -3458 2234 5956 3329 -2514 -5611 -3378 1807 5396 3600 -2341 -6161 -3594
1456c594N841K919j964n431l614J894O285L100k532n042l590K025N761L460k218
$$ -3594 2247 5166 3202 -2229 -5843 -3949 2336 5436 2904 -2138 -5728 -3703 2058 5518 3300
1471C300n777l281K269N384L421j822n781l708K664N285L236j891n413l365J955
$$ 3300 -2477 -5758 -3489 1895 5316 3494 -2287 -5995 -3331 1954 5190 3299 -2114 -5479 -3524
1486c524N811L341k428n068l337J576N523L634k234n490l157K288M782L560j821
$$ -3524 2287 5628 3200 -1868 -5205 -3629 1894 5528 3294 -2196 -5353 -3065 1717 5277 3456
1501C456n815l265K373N478K883j572n404l349J871N475L334k260n211k981J780
$$ 3456 -2359 -5624 -3251 2227 5110 3538 -1866 -5215 -3344 2131 5465 3205 -2006 -4987 -3207
1516c207N455L481k574n351l045K193N099L161j739n370l468K387N383K725j771
$$ -3207 2248 5729 3155 -2196 -5241 -3048 2051 5212 3473 -1897 -5365 -2978 2405 5130 3359
1531C359m880l575J674N892K784k134n102k916J465N282L431j855n609k884J965
$$ 3359 -1521 -5096 -3422 2470 5254 3120 -1982 -4898 -3433 1849 5280 3425 -2184 -5068 -3103
1546c103M921L283j862n241l413K479N127K828k264m707l483K146N340K877k072
$$ -3103 1818 5101 3239 -2002 -5415 -2936 2191 5019 2755 -1952 -5435 -3289 2051 4928 2856
1561B856m914l133J929N323K936j862n076k912J707M827L245j657n011l511J907
$$ 2856 -2058 -5191 -3262 2061 4997 3135 -1941 -4853 -3146 1681 4926 3269 -1742 -5253 -3346
1576c346N402K807j864m524l661J749N612K749k017m974k713J665M954L508k431
$$ -3346 2056 4863 2999 -1525 -5186 -3437 2175 4924 2907 -2067 -4780 -3115 1839 5347 2916
1591B916n005k712J803M697K957j314n523k859K064M912K695j455m740l322J800
$$ 2916 -2089 -4801 -2998 1699 4656 3342 -2181 -5040 -2976 1936 4631 3176 -1564 -4886 -3086
1606c086M893K987k043m528k705J194M951L163j797m809l048K064M730K583j343
$$ -3086 1807 4794 2751 -1777 -4482 -3288 1663 4826 3029 -1780 -4828 -2764 1966 4549 3206
1621C206m846l007J925M748K622j489m800k988J711N004K913j987m577k844J327
$$ 3206 -1640 -4647 -2722 2026 4648 3159 -1641 -4629 -2918 2086 4999 3012 -1565 -4409 -3082
1636c082M952K929j961m861k333J490M608K946j610m855l004K022M549K570j387
$$ -3082 1870 4799 2838 -2023 -4356 -2866 1742 4688 3078 -1777 -4781 -2759 1790 4360 2973
1651B973m477l099J452N097K763k029m337k995J583M979K960j952m763k543J594
$$ 2973 -1504 -4603 -3151 1946 4709 2680 -1657 -4652 -3069 1910 4870 2918 -1845 -4388 -2794
1666b794M106L203j409m863k774J868M717K315j458m210l189J748M418K814j624
$$ -2794 1312 4515 3106 -1757 -4531 -2663 2054 4369 2911 -1299 -4488 -2740 1678 4492 2868
1681B868m328l055J686M375L006j651m959k357J525M577K521j211m543l183K240
$$ 2868 -1460 -4515 -2829 1546 4552 2901 -2058 -4415 -2890 1687 4208 2997 -1546 -4729 -2489
1696b489M385K449j593m065l064J571M555K900j644m462k777J506M536K867j732
$$ -2489 1896 4345 2752 -1313 -4377 -2806 1749 4649 3005 -1457 -4234 -2728 1808 4675 2943
1711B943m322k575J100M345K907j448m730k507J647M287K508j288l900l127J365
$$ 2943 -1379 -3954 -2854 1491 4398 2950 -1780 -4287 -2640 1647 4155 2867 -1033 -4160 -2795
1726b795M770K628k172l882k641J280M366K858j586m530k443J552M023K900j559
$$ -2795 1975 4603 2431 -1451 -4092 -2812 1554 4412 2826 -1704 -4147 -2595 1428 4328 2769
1741B769m468k760J826M157K721j551m245k844J467M397K888j955l866k577J417
$$ 2769 -1699 -4459 -2633 1524 4245 2694 -1551 -4395 -2928 1469 4357 2402 -1464 -4041 -2624
1756b624L808L158j532m707k282J579L966K744j332m390k758J948M061K353j432
$$ -2624 1184 4342 2810 -1897 -4179 -2600 1366 4110 2778 -1612 -4370 -2422 1639 3992 2560
1771B560m061k738J687L865K827j753l745k492J131M441K586j669m170k409J565
$$ 2560 -1501 -4239 -2552 1313 4140 2387 -1358 -3850 -2719 1722 4308 2639 -1531 -3940 -2375
1786b375L877K357j273m186k530J343M403K398j266l946k840J577M009K543j456
$$ -2375 1502 3859 2586 -1600 -4130 -2787 1616 4014 2748 -1198 -4038 -2461 1548 4091 2635
1801B635l813k553J464L692K784j488m101k420J351L965K151j154l895k501J404
$$ 2635 -1178 -3731 -2267 1425 4209 2721 -1380 -3800 -2449 1516 3667 2513 -1382 -3883 -2479
1816b479L942K409j557l512k861J454L892K733j608l740k532J166M198K301j172
$$ -2479 1463 3872 2315 -1197 -4058 -2604 1288 4021 2413 -1327 -3859 -2693 1505 3806 2634
1831B634m621k108J623L704K392j013m122k429J454L853K132j148l560k694J298
$$ 2634 -1987 -4095 -2472 1232 3624 2611 -1511 -3940 -2486 1367 3499 2351 -1209 -3903 -2605
1846b605M228K150j483l656k383J169L948K615j560m060k034J308L778K215j281
$$ -2605 1623 3773 2290 -1366 -3749 -2580 1368 3983 2423 -1637 -3671 -2363 1415 3630 2349
1861B349l910k254J478L633K372j346l593k314R41L931K477j594l428k504J351
$$ 2349 -1561 -3815 -2337 1296 3668 2322 -1271 -3585 -2644 1287 3764 2170 -1258 -3762 -2411
1876b411L633K532j485l628k203J223L390K512j094l712k647J717L332K258j218
$$ -2411 1222 3754 2269 -1359 -3562 -2339 1051 3563 2469 -1243 -3890 -2173 1159 3417 2199
1891B199l568k324J401L826J959j207l540k313J090L568K303q58m010k108J271
$$ 2199 -1369 -3693 -2292 1534 3493 2286 -1254 -3567 -2477 1091 3394 2536 -1474 -3582 -2311
1906b311L362K355q53l808k260J171L569K194j329l323k347Q74L814K425j179
$$ -2311 1051 3406 2553 -1255 -3515 -2344 1225 3419 2090 -1233 -3580 -2706 1108 3533 2354
1921B354l588k288J336L048K772j362l646k131J511L337K277j501l307k181J488
$$ 2354 -1234 -3522 -2186 862 3634 2272 -1374 -3505 -1994 1343 3620 2119 -1188 -3369 -1881
1936a881L193K026j207l236k636J516L469K080r09l879j875J162L594K068j283
$$ -1881 1312 3338 2131 -1105 -3741 -2225 1244 3324 2415 -1464 -3339 -2177 1417 3485 2202
1951B202l466k291J367L461K180j181l368k323J221L608J677q53l024k544J122
$$ 2202 -1264 -3555 -2188 1273 3453 2272 -1096 -3419 -2198 1410 3087 2234 -790 -3334 -2212
1966b212L526K125j167l552k039J205L069K572j251l611k004J324L295K223j342
$$ -2212 1314 3439 2272 -1280 -3319 -2114 955 3527 2276 -1335 -3339 -2015 1280 3503 2161
1981B161l203k086J107L190K142j020l265k213J275L122K119j343l116k034J115
$$ 2161 -1042 -3128 -2021 1169 3311 2291 -974 -3187 -1912 1210 3329 1986 -1130 -3164 -2049
1996b049L296K102j389k968k113J136K935K331j072l385k265J365L575J639j155
$$ -2049 1247 3349 1960 -1008 -3121 -1985 950 3281 2209 -1176 -3441 -2076 1499 3138 1983
2011A983l078k120J061L387J808q83l299j971J010L273J941r04l340k241J388
$$ 1983 -1095 -3215 -2154 1233 3041 2158 -1141 -3112 -2102 1171 3112 2208 -1132 -3373 -1985
2026a985K958K112q44l255k201J217L050J856q09l153k229J318L130J972j197
$$ -1985 973 3085 2241 -1014 -3215 -1998 1052 2908 2099 -1054 -3283 -1965 1165 3137 1940
2041A940l216j662Q55L040K308j017l369j924J177K703K352j052l473j937J556
$$ 1940 -1276 -2938 -2083 957 3265 2248 -1121 -3045 -1868 835 3187 2135 -1338 -3275 -1719
2056a719K935J825j142l042j821J161K709K349j282k957j957R79L300J836j089
$$ -1719 1216 3041 1899 -1143 -2964 -1803 906 3255 1973 -984 -2941 -1962 1338 3174 2085
2071B085l154j682Q61K838J968r38k830k120J062L017J790p68k909k021Q43L217
$$ 2085 -1069 -2751 -1890 948 2916 1978 -852 -2972 -1910 1107 2897 2129 -780 -2801 -1958 1259
2087A259J810j083k957j890J169K932J935j246l067j558J092K509K120j100k941
$$ 1259 3069 1986 -971 -2861 -1692 1240 3175 1929 -1138 -2696 -1604 905 3025 1925 -1016
2102a016j699R81K738J897j188k650j906R45K882J778r74k902j368M42L164J714
$$ -1016 -2715 -1734 1004 2901 1713 -937 -2843 -1898 984 2762 1788 -1114 -2482 -2040 1124 2838
2118B838j149k592j990J095K812J912r72l038j908J178K747J517p13k593j904
$$ 2838 1689 -903 -2893 -1798 1014 2926 1954 -1084 -2992 -1814 933 2450 1737 -856 -2760
2133b760J052K582K004j163k676j717P30K904J798p73l003j628Q73K583J859p39
$$ -2760 -1708 874 2878 1715 -961 -2678 -1948 956 2754 1981 -1022 -2650 -1777 806 2665 1926
2149A926k771j815J129K644J693q09k838j651N85K872J779j033k522j797Q14K756
$$ 1926 -845 -2660 -1531 1113 2806 1997 -841 -2492 -1907 965 2744 1711 -811 -2608 -1794 962
2165I62J875j150k503j801Q50K561J942p27k894j857R31K746J537j003k171j893
$$ 962 2837 1687 -816 -2617 -1767 794 2736 2009 -885 -2742 -1811 935 2472 1469 -702 -2595
2181b595R30K724J426q60k496j768R15K609J800j065k703j556Q60K651J590o50
$$ -2595 -1665 1059 2485 1625 -871 -2639 -1724 885 2685 1620 -1083 -2639 -1779 872 2462 1812
2197A812k465k102J233K437J595r18k368j838Q11K826J596q99k434j693M96K753
$$ 1812 -653 -2755 -1522 915 2510 1592 -776 -2614 -1803 1023 2619 1720 -714 -2407 -1911 842
2213H42J724p70k821j551J185K158J706o54k592k068J184K383J569o46k319j928
$$ 842 2566 1796 -1025 -2576 -1391 767 2473 1819 -773 -2841 -1657 726 2295 1649 -670 -2598
2229b598R16K372J858p99k454j406M46K470J834j043k335j402O36K365J577q32
$$ -2598 -1682 690 2548 1749 -705 -2111 -1665 805 2639 1596 -739 -2141 -1505 860 2437 1605
2245A605k246j590O02K424J471n21k252k111J070K274J531n06k398j793R76K292
$$ 1605 -641 -2231 -1629 795 2266 1745 -507 -2618 -1548 726 2257 1751 -647 -2440 -1464 828
2261H28J592r59k400j328O05K210J583l05k697j499Q89K350J440q36k277j534
$$ 828 2420 1461 -939 -2267 -1662 548 2131 1826 -871 -2370 -1481 869 2309 1473 -804 -2338
2277b338O73K361J844q05k482j538O76K310J494q22k030j739Q16K250J694o83
$$ -2338 -1665 696 2540 1735 -747 -2285 -1609 701 2195 1373 -657 -2396 -1580 670 2364 1681
2293A681k349j754R05K357J563j025k474j036N25K599J278n73k426j511P40K135
$$ 1681 -668 -2422 -1517 840 2403 1378 -1096 -2132 -1607 992 2270 1697 -729 -2240 -1500 635
2309F35J742p95k199j702J089K118J255n09k452j566O96K234J820p89k241j741
$$ 635 2377 1582 -617 -2319 -1230 888 2143 1634 -818 -2384 -1688 546 2366 1577 -664 -2405
2325b405R25K245J422p43k209j663R45K410J311o40k191j765R25K200J358n56
$$ -2405 -1480 765 2187 1444 -765 -2428 -1483 927 2238 1598 -593 -2358 -1433 767 2125 1569
2341A569k320j660R56K300J053n58k098j208N13K194J439p81k301j395J057J922
$$ 1569 -751 -2411 -1455 845 1898 1340 -758 -1966 -1453 741 2180 1399 -902 -2297 -1240 682
2357F82J536p79j916j351L83K073J685q96k310j282Q53K372R80n96k102j462R71
$$ 682 2218 1439 -477 -1828 -1445 628 2313 1417 -893 -2175 -1322 1050 2030 1434 -668 -2130 -1159
2374a159J964J262o20k209j147N42K009J556n53k224j540O65K218J374r17j690
$$ -1159 805 2067 1447 -762 -1909 -1367 642 2198 1645 -579 -2119 -1454 764 2138 1221 -469
2390d69j610O97K021J430m45k186j432O96K042J298n12k470j139P36K125J189
$$ -469 -2079 -1382 639 2069 1624 -562 -1994 -1298 744 2042 1530 -940 -2079 -1343 782 1971
2406A971o41j939j516P52J975J124l10k041j475N81K377J198q07k035j230O22
$$ 1971 1330 -609 -2125 -1373 602 1726 1416 -625 -2100 -1519 858 2056 1249 -786 -2016 -1394
2422a394J973J567p03j950j300N74K091J323q96j941j445O47K198J153o10j994
$$ -1394 579 2146 1443 -507 -1807 -1233 858 2181 1285 -656 -2101 -1454 744 1897 1287 -707
2438g07j468O33K459J062p88j736j404N41J923J540n92k150j312N34K114J369
$$ -707 -2175 -1542 917 1979 1191 -545 -1949 -1408 515 2055 1463 -687 -1999 -1465 649 2018
2454B018p07j943j371R88J538J130l62j920j370Q62J601J604p40j974j462Q97
$$ 2018 1311 -632 -2003 -1015 523 1653 1291 -629 -1999 -1137 464 2068 1328 -646 -2108 -1211
2470a211J777J452n19k213j325Q51K045J288r12j917r50J69J881J574p77j750
$$ -1211 566 2018 1499 -714 -2039 -1188 857 2145 1233 -684 -1634 -1465 416 1990 1213 -537
2486e37j487P61J883J442q21j771j337O55J727J345o28j855j320N59K051J175
$$ -537 -2024 -1263 620 2062 1241 -530 -1867 -1212 515 1860 1232 -623 -1943 -1384 667 1842
2502A842o75j757j209N39J706J322l96k012j122O63J911R79n91j784j254N88J841
$$ 1842 1167 -590 -1799 -1260 446 1768 1372 -640 -1762 -1099 812 1791 1200 -584 -1838 -1250 591
2519E91J391o69j975j086N52J753J316n28k110j242R13K078O89m19j770j355P20
$$ 591 1982 1313 -662 -1748 -1196 557 1873 1345 -765 -2007 -1094 984 1673 1254 -516 -1871 -1151
2536a151J931Q93n80j564j284N31K047R21m18j965j022L48J773J392o88j924j108
$$ -1151 780 1673 1093 -471 -1755 -1224 823 1744 1326 -639 -1661 -1313 460 1852 1164 -760 -1868
2553a868Q66J657J172o71j719j414O72J825J064n34j459j248M08J782J228r80
$$ -1868 -1002 655 1827 1156 -563 -1977 -1305 520 1584 1050 -409 -1657 -1249 533 1761 781
2569G81j395j004L57J653J427o92j725j106M50K021J268p82j743j074M36J418
$$ 781 -614 -1618 -1261 392 1819 1127 -598 -1704 -1254 767 2035 1253 -490 -1564 -1128 290
2585B90J224n91j525j178P60J567J293r83j293j009K92J688J274p22j686j107
$$ 290 1514 923 -602 -1780 -1020 547 1840 857 -436 -1445 -1153 535 1809 1087 -599 -1706
2601a706N77J660J310o06j668j166L89J821J060m11j855j200O96J490J291o78
$$ -1706 -1129 531 1841 1235 -433 -1599 -1210 611 1671 1260 -595 -1795 -1099 391 1682 1004
2617A004j561j280N87J634J356m55j571j372N39J558J092l47j748j261N51J784
$$ 1004 -557 -1837 -1250 384 1740 1285 -286 -1658 -1119 439 1531 1184 -564 -1825 -1274 510
2633E10Q24m83r71j635P17J869P12n35j550q39K37J500J215m96j639j142Q02J170
$$ 510 1334 851 -120 -1755 -1038 831 1543 1008 -542 -1381 -1144 356 1571 1075 -564 -1706 -904 266
2651B66J298n44j502j228O08J586J070m15j630r44M20J661R79n86j669q23K64
$$ 266 1564 1020 -482 -1710 -1102 484 1554 1139 -491 -1435 -1015 646 1625 1039 -630 -1453 -1189
2668a189J712Q70l47j581j150N13J680J013m83j655j064O27J552J235o26j611
$$ -1189 523 1393 1046 -535 -1685 -1172 508 1521 1038 -617 -1681 -1054 498 1733 1107 -504
2684e04r51J82J767J160n00j764j030P76J206J237p62j461p69L54J564J106m25
$$ -504 -1455 -1273 494 1654 1154 -610 -1640 -864 342 1579 817 -644 -1413 -1059 505 1611 1186
2701A186j620r86N77J320J073n56j642p84K99J575J134n89j282j316N24J380J116
$$ 1186 -434 -1420 -843 477 1550 994 -648 -1432 -1133 442 1576 987 -295 -1611 -1087 293 1409
2718A409m66j800n30M44J303J101k97j495j252M72J725J017o52j445j104O05J627
$$ 1409 943 -857 -1387 -943 360 1461 1164 -331 -1583 -1111 614 1631 979 -466 -1570 -965 662
2735F62P48n12j271j282Q66J304Q76l62j560q15L76J571Q12l74j619q14L94J455
$$ 662 1410 898 -373 -1655 -789 515 1391 1029 -531 -1346 -970 601 1413 1039 -580 -1394 -1000 455
2753D55J033m17j526r74L92J542J004n19j597p54O72J140Q38m74j450q12O85J267
$$ 455 1488 1071 -455 -1429 -1037 505 1509 990 -607 -1361 -689 451 1289 815 -635 -1447 -762 505
2771E05J020n51j521j048M84J353J075l78j238j092L77J538J036p64j290r73O36
$$ 505 1525 974 -547 -1595 -1111 242 1317 939 -299 -1391 -1014 524 1560 796 -494 -1467 -831
2788h31J240Q32j29j647q28N36J253R79n50j527q01O79J293Q77m68j323j147O03
$$ -831 409 1241 1112 -535 -1363 -827 426 1405 855 -672 -1473 -794 499 1376 908 -415 -1562 -959
2806i59J573P46m98j249j040M32J497J014m03j275j141N25J152J110n21j344r56
$$ -959 614 1360 862 -387 -1427 -995 502 1516 1113 -162 -1303 -778 374 1484 963 -381 -1337
2823a337L82J483Q34n52j247r87N70J440P56m30j526p35N94J059J353o76j279
$$ -1337 -955 528 1362 810 -437 -1424 -854 586 1342 912 -614 -1349 -755 304 1657 981 -298
2840b98j126N60J213J027l54j561p89M99J329Q98q14q79j116N99J182R39o20j234
$$ -298 -1424 -864 349 1376 1022 -539 -1328 -829 500 1398 584 -295 -1411 -812 370 1309 689 -545
2858e45o50J76J320J105n80j120p80L24J143Q21o20j047j022P76J097J238q45
$$ -545 -1195 -1019 301 1406 826 -294 -1074 -750 393 1214 594 -453 -1475 -699 398 1636 791
2875G91j317r39M61J294P79l96j262o21L38J411P88n89j328o44L47J214J134o94
$$ 791 -526 -1465 -1004 290 1069 673 -589 -1210 -872 539 1327 738 -590 -1234 -887 327 1461 767
2893G67j212j002O04J297N37l54r31q81K29J462P85m28j222q53N08J181R41p44
$$ 767 -445 -1447 -843 454 991 637 -294 -1175 -946 516 1301 873 -349 -1202 -694 487 1428 684
2911F84j039r25N33J157P90k31j395p61L73J430N81l86j100r75N85J269O53m54
$$ 684 -355 -1280 -747 410 1200 969 -426 -1187 -814 616 1197 811 -289 -1264 -679 590 1243 789
2929G89j133q67M28J307P26m99j202o38M64J157O06m22r46q50K48J223P18j28
$$ 789 -344 -1211 -783 524 1250 751 -451 -1089 -625 532 1138 716 -230 -1080 -832 391 1109 981
2947I81j417q18L41J159J035n38q28j024K97J322M18J06j575n25M68J181N40j07
$$ 981 -436 -1254 -913 246 1281 743 -85 -1109 -812 510 928 1034 -541 -1066 -598 583 1123 1016
2965A016j323j019L76J602M78k62j132j001M36J140P72k22j273r92M03J298R33
$$ 1016 -307 -1326 -950 652 1130 868 -264 -1265 -829 311 1083 861 -412 -1404 -1001 297 1230
2982A230o68r56o09M02J179N00n27j025q46O10J085P24n16q14j062P29J186M25
$$ 1230 562 -394 -1003 -601 578 1078 551 -474 -1320 -710 375 1099 583 -231 -1293 -564 622 1047
3000A047l44j178p28L29J392N71k07j393o27M25J052P16l41j200o32L63J129Q07
$$ 1047 703 -475 -1203 -874 518 1089 882 -511 -1138 -713 339 1055 714 -486 -1118 -755 374 1181
3018A181m76j278m68N94R99M73l33j033n81K54J326N87m50j350n99M31R48Q92
$$ 1181 705 -573 -1041 -447 552 1025 692 -341 -922 -668 658 1245 795 -555 -1154 -723 225 1117
3036A117k93j224o52M57Q91P64j86j141q15J79J339P68m59j260n48N33R19P43
$$ 1117 824 -400 -1052 -595 296 1060 874 -267 -1082 -903 436 1204 745 -515 -1063 -530 389 1132
3054A132k29j435n48N48P81R02o14r25p30L65J183Q08m42p93q69J03J052P94l82
$$ 1132 903 -532 -1080 -532 249 1151 537 -388 -1118 -753 430 1238 796 3 -866 -763 289 1083 701
3073G01j088m78J84R64M65J2r82r34M12J051P60k71j185o66K80J032O90l78r18
$$ 701 -387 -865 -681 283 748 760 -222 -1156 -744 307 1067 796 -389 -1055 -775 257 947 569 -349
3092c49q27N00J102O89o28q85o72M24P03R25j45r81r00K07J113P79m77r72n07
$$ -349 -1176 -676 426 1115 487 -398 -1070 -646 57 982 837 -144 -1044 -837 276 1055 578 -394 -901
3111i01K95P47Q93k10j104r07L04J281O19m66q35o96K77J095M29n57q27m71M39
$$ -901 -606 141 1034 824 -280 -1187 -883 398 1017 551 -284 -980 -703 392 821 264 -563 -1034 -595
3130e95Q71Q65n03j184o18N43R90M27j96r46l95J18R33P14m36r71l58K12O95P84
$$ -595 276 1141 638 -546 -1164 -621 369 796 600 -346 -741 -623 310 1024 588 -383 -741 -529 166 950
3150I50o18m92r71L86J028Q63m78q79o51J68J002Q70p42r03n19K34J389M52m58
$$ 950 332 -160 -1131 -745 283 1146 668 -211 -862 -694 308 1178 436 -467 -986 -752 637 1089 631
3169F31j130l39M51O37J045p60j078l78J58J210M98k38q45q21M41Q54P38o61j020
$$ 631 -499 -838 -387 250 1295 535 -543 -921 -763 447 945 707 -138 -959 -518 336 1074 413 -607
3188f07n52O52Q52N62l46r05m44J56Q32N44j88n95j056M52R64O73m67p58p85K63
$$ -607 -1159 -507 345 907 561 -344 -788 -632 200 744 556 -39 -1095 -643 321 994 527 -231 -1016 -753
3208g53R53O51k03r49n99K26Q44P79m52r28n37N06P97N08j96j063n94M17P92O92
$$ -753 200 851 648 -301 -900 -674 170 949 497 -431 -968 -462 335 843 647 -416 -1010 -593 199 891
3228H91j9j412m54K69J081O08j93j122n32L05O96Q04l80p68o26L82P27P82m59
$$ 891 872 -540 -994 -725 356 964 771 -351 -883 -578 118 922 542 -226 -852 -470 257 1039 580
3247E80r70l53J30Q88N25k99p99p58N41Q25O45m21q15p31K87J042O57n29r44j33
$$ 580 -390 -743 -613 275 800 501 -298 -1056 -515 310 955 534 -281 -1012 -725 317 974 445 -499 -632
3267f32J23P64P92m77j052l31L97Q31L66j08r31o85N05Q25M12k74o55q80L05J222
$$ -632 -509 255 1047 570 -482 -813 -416 415 781 673 -258 -943 -438 387 799 525 -130 -1010 -705 517
3287E17N28m21q50n86K50P64O56k44r25n29M20M92P49l44r94j00J8Q84O11k94
$$ 517 1045 624 -226 -812 -562 202 858 614 -311 -840 -420 72 821 477 -517 -617 -599 285 896 602
3307F02r20p92O18P74N27k37p80p23L56R43L58o0r39m56J08P52O18l29p80n43
$$ 602 -318 -1110 -492 282 809 572 -208 -931 -575 368 726 666 -273 -729 -621 131 749 420 -360 -903
3327i03M24R64L79l54q09l35J36Q93M83l24q95l91J11P05P92k50j181m59M31Q55
$$ -903 -479 485 864 510 -299 -634 -498 395 878 554 -341 -732 -621 84 876 626 -555 -1014 -583 272
3347B72N30j31j047m26N46O37L03p3r12m86L30J007K57m10n56n70L73N70N73J64
$$ 272 802 671 -376 -802 -256 381 684 611 -301 -787 -457 550 807 397 -159 -729 -356 214 787 951
3367I51j130p81M92M76Q56l80o60o67L01O34Q33k29j056q65O43R12N31m63p17
$$ 951 -179 -960 -468 8 864 484 -176 -843 -542 92 925 696 -360 -1225 -582 330 861 398 -319
3386c19k69p7J128L93j95r75n26L35Q17M24j71r16m33J79P89O92m70p18l45jJ027
$$ -319 -588 -665 463 856 661 -314 -840 -505 312 736 565 -351 -784 -605 184 876 406 -312 -657 -658 369
3407C69M52n13p12n39L97Q61L98l78q90k40K43O64P11k60q22n72L55N39R46n19
$$ 369 821 308 -404 -943 -546 315 713 335 -555 -795 -552 112 823 563 -259 -831 -476 63 1009 490
3427D90r63m13L53O40O23l01o59n58K98Q04M89k29r37m98L14O90N01j91q22m75
$$ 490 -473 -886 -533 107 730 429 -230 -788 -490 314 803 574 -363 -861 -547 143 644 453 -369 -844
3447h44M11O43N18j57p57m58o9Q10P28l99p29l89J40Q37N07m24n82m95J49O82
$$ -844 -433 210 728 571 -186 -644 -713 97 825 426 -303 -692 -552 285 792 368 -214 -709 -560 122
3467A22N12j05o46o38L12Q82L4j57n60o01L93O21N71l08m93p70K19Q08O88k65
$$ 122 634 529 -117 -755 -443 439 473 316 -244 -845 -452 169 740 432 -61 -831 -612 196 884 619
3487F19p97p04L94Q80K26L5r54k79K7P09M09j86q71q2L16N19O14m56o54p00L99
$$ 619 -178 -882 -488 392 618 653 -301 -580 -553 156 565 379 -492 -574 -258 261 875 419 -235 -935 -536
3508e36R50K71k38n59q95L35J122M48m64o36n50M33N45O31m95p24m67M81J013
$$ -536 414 685 447 -112 -1007 -672 450 898 434 -202 -752 -319 226 857 362 -362 -829 -348 665
3527F65K3l73m67n63L70P86J48j08q83m62K07Q62K79L8j083k44M82N80L16j81
$$ 665 688 315 -152 -715 -345 441 589 481 -402 -864 -657 205 484 522 -561 -805 -323 257 573 392
3547C92n07p34M51O33P14l69o70q58N36P83K95n12k63o55M10M60N87l12o78m83
$$ 392 -115 -849 -398 235 949 580 -90 -948 -412 371 666 154 -109 -764 -354 106 693 381 -297 -780
3567g80N22M73O67o52o16k98K98P35J89j77p90j69K74M37O36n21o04l46M37O53
$$ -780 -258 215 882 230 -386 -684 -386 349 538 361 -429 -598 -324 113 749 228 -376 -722 -285 368
3587C68J89j19p62k21J53M88L86J94r65l42M1P05N67j39p67k98L86M04K75J3r02
$$ 368 557 438 -324 -545 -392 96 482 676 -289 -631 -590 115 682 543 -224 -522 -136 268 543 556 -346
3608c46k98J25Q27K86l03n66o35K15J104L42k45p74k76J51O90J82M5o73m85M22
$$ -346 -644 -519 308 594 291 -275 -910 -695 409 751 506 -268 -544 -393 297 479 524 -149 -634 -212
3628b12L60O04k83o67l25J87P73L02n00n6q52L49M97L74j88m59k85J18N13O29
$$ -212 148 752 469 -198 -523 -336 437 739 239 183 -669 -320 177 551 363 -96 -381 -263 250 879
3648H79n56m95m79J87N91K03O9m69n26N5Q13L79k15q29j48K50N53K35K1o52l51
$$ 879 323 -172 -651 -464 127 330 399 -70 -596 -541 272 651 436 -393 -541 -291 262 497 518 -134 -485
3669d85R6N11M70l51n05l42L41M95K16k01m67l00RO41M90k70l68o04k6J126L4
$$ -485 -389 122 592 241 -264 -606 -265 230 446 245 -222 -522 -513 128 618 348 -20 -624 -650 476 510
3690E10j3p19l42J13P04M58m01n79k86K15N90K19L8p62k46K85N62L33k64q14j63
$$ 510 497 -222 -564 -451 253 711 310 -269 -555 -340 250 469 507 -255 -501 -216 346 679 415 -399 -562
3711e62J07O48L22j21o04m76L57P47L08o98k24l05q9P82K91j03o09j59p7N74N02
$$ -562 -455 193 515 394 -210 -686 -329 418 726 28 -196 -501 -590 192 483 380 -229 -388 -465 109 611
3732F11k73m46m96O2P12L86k35o30l30K33M38N74j77o41m06K88L09O29m69m16
$$ 611 338 -108 -604 -542 170 556 321 -309 -639 -406 32 606 429 -212 -618 -330 -21 608 139 -277
3752b77k50J67P61J46j11o56k57Q1M90L33j59l12o80M03O28L05l62n62qk61Q07
$$ -277 -527 -360 401 547 436 -220 -477 -396 94 427 268 -44 -724 -321 307 612 250 -312 -320 -581 226
3773B26L17j99n64n05L93M39L65p7n42m40L35O11K57l57o86j40L64K91N24l83
$$ 226 543 344 -220 -725 -332 107 472 395 -147 -587 -252 359 616 259 -427 -567 -203 88 612 229
3793B29n52l9pN54K02l8m85l81Q9P01O51o02p29j93L10L06L73j95m91k21K82N03
$$ 229 -323 -362 -369 185 387 349 -136 -517 -428 273 924 322 -407 -600 -290 16 389 194 -297 -518 -236 267
3815B67M35n96j50o16L99M33M55m97n29k18M07O12k0p3n12k07J00M80L83l41k29
$$ 267 702 106 -44 -660 -261 172 627 130 -399 -617 -210 402 382 309 -203 -410 -310 170 553 212 -17
3836a7l93J51M67L78j61n66p06Q11L28L16j49p60j59j44Q14M66l44p03j20J73
$$ -17 -410 -259 208 586 425 -141 -847 -36 292 608 459 -301 -460 -604 210 676 332 -371 -491 -318
3856c18O45J04j4o49l00J32N55N14l23o09l27L80K52P70p87k96l59K77N71K74
$$ -318 327 431 417 -232 -532 -400 155 669 346 -263 -590 -210 42 812 25 -271 -630 -353 218 492
3876D92j14n24j99N9P55j25j18m53n3k35O20M69l88k42l38k3O23L85m76m82j10
$$ 492 378 -146 -345 -286 469 344 226 -227 -280 -515 105 574 186 -56 -394 -417 206 591 115 -367 -477
3897d77L25J98L02o2l97k04K41L04J10j31l06o25N59N24p6Qn74p2J56J15O21k08
$$ -477 -152 46 348 286 -111 -315 -74 230 340 209 -97 -722 -163 361 285 293 -281 -353 -197 -82 539 331
3919C31o64k67L59K46N29k14o26r1J52M36L58l59j80m57J17P02Q5l13n16k79M11
$$ 331 -333 -600 -241 5 534 320 -306 -397 -245 191 549 190 10 -447 -330 372 457 144 -372 -651 -240
3940b40O07J07m12m69j13P7P71L10j55r60K7L88L75j51j37l96K7J21M26J35j3
$$ -240 367 474 62 -407 -520 -443 328 638 483 -477 -450 -62 313 162 25 -371 -344 -223 203 338 325
3961C25m36l88J94N38J56k56n6l82Q2L94L73p9n97l85L88M85J53j29m96l64M35
$$ 325 -111 -499 -305 233 389 133 77 -305 -223 171 544 465 -132 -517 -129 356 509 380 -116 -480 -45
3982d5M86J28l06n51K6m2M60J45l43l55J92l4L74R6J7j85n16L80L83M1j73n60
$$ -45 441 569 263 -288 -262 -304 156 301 -42 -397 -205 -239 135 231 248 63 -453 -73 310 351 178 -382
4004c82O7q2N61N44n28l27qn5N26Qj73m12j57L54M14M3q7m68j45R6L56K94k46
$$ -382 -315 -397 164 708 180 -147 -155 -210 316 324 151 -261 -418 -64 350 393 306 -162 -307 -211 145 439 193
4027A93l26k85L99J82M52l96j85l78L83J31J51l2m24k49N9M38K40J4n83l05J04
$$ 193 -133 -418 -19 163 615 219 34 -344 39 170 321 289 -135 -384 -325 113 353 367 -216 -521 -417
4048d17M68L34k70m35j18J62M79N8j97l01j60K51K43L98k35m19k31N0L73K03K8
$$ -417 51 385 115 -320 -438 -276 203 261 64 -237 -397 -146 97 495 260 -159 -390 -340 33 236 264
4069B64n14j89K18K07K95j02k75k27M0N55J35j29m44k43L09J27L00k96j19n56
$$ 264 -250 -439 -221 -14 281 179 -96 -323 -283 272 407 278 -166 -409 -100 27 327 31 -88 -644
4089f44L54O16R7j61n24OO2L87o5o3m18j40M12L80K52k20o31q1K20M18K75k42
$$ -644 -290 326 423 262 -262 -256 -194 193 128 65 -353 -493 -81 299 551 331 -300 -381 -161 257 532 290
4111B90l17k49J27M47N3k6m47o4m2N16K58l44l63k81K72L54L07k54n62K21j75
$$ 290 -27 -276 -149 298 351 325 -122 -186 -228 288 546 202 -161 -442 -170 184 491 237 -325 -104 -279
4132b79L70K34j87l13k81K99M17j77n1k36l90L82L61K25l23n52J72J40L19M25
$$ -279 91 325 138 -175 -456 -157 260 83 32 -204 -594 -212 149 374 51 -501 -329 -189 130 555
4152E55m80m12M8J22N67J4r9m75p2j78L80L63k55k30l56L19L47L52j64n46l61
$$ 555 75 -337 -289 -167 400 414 315 -160 -232 -410 -30 333 78 -152 -508 -189 158 510 346 -200 -561
4173e61M44J72K85j49l49k16K16M55l0L7n96n0K93L59J60k19l36m17L70L37J78
$$ -561 -117 55 340 191 -158 -374 -158 297 267 304 -292 -342 -49 310 470 251 -85 -502 -132 205 383
4194C83m08j38l01J95N19Q4l11j95j06P5M90J23l59K2n00K19K03K51p6l79j51
$$ 383 -25 -163 -464 -269 250 334 23 -172 -278 -203 287 410 51 73 -427 -208 -5 246 170 -209 -360
4215c60J83M58k3O4p45J65J94M44q8j33l10l85L96L87K78m23m92q3J34O31l1k21
$$ -360 -177 281 258 322 -423 -258 -64 380 292 159 -151 -536 -140 247 525 102 -390 -473 -339 292 261 40
4237D0k58J15J21r9M49j37l79j40J73K87K36j78l43l12L04O9M53l1o58K7O7L12
$$ 40 -218 -103 18 -81 368 231 -148 -288 -115 172 408 230 -113 -425 -121 -52 401 370 -288 -261 -194 118
4259A18L37l06l08j09P2L11L59m41k48j50K22K13N35l32n48J58q9K70N29m51k06
$$ 118 455 149 -159 -268 -196 115 474 33 -215 -365 -143 70 605 273 -275 -117 -206 64 593 142 -64
4280f4k24q6O95N1k92l15k92M09N52j65m9k03l81K38L53J29j43l62j59J09J48
$$ -64 -288 -374 321 372 80 -235 -527 -118 434 269 220 17 -364 -126 227 356 213 -149 -308 -199 -51
4301e1M53l87l05J71R3P5J81j97k7l48K78J95Q0K8m72n5R3M19K22m23l82K69k32
$$ -51 402 15 -290 -119 -26 49 230 33 6 -342 -64 131 211 239 -233 -288 -195 224 446 23 -359 -90 -322
4324c22K38M75l32j38l30L55J45Q8j6l29K6j06M12m3J53m98k77L89K90j8n5k11
$$ -322 -84 391 59 -79 -409 -54 91 179 163 -166 -140 -246 166 123 276 -222 -499 -110 180 162 107 -104
4346a04k12o3O78o4p9m14k6J26L18j03l3j43j62mN00J92n17q6j90M08L12j04Q2
$$ -104 -316 -379 299 235 156 -258 -284 -158 160 57 24 -119 -281 -285 215 407 -110 -196 -386 22 334 230 312
4369C12m57m3p6M70k80K2r7k72K77L12J80l09k89k02L12L86j33M0l24l12M75J35
$$ 312 -145 -188 -264 206 -74 -52 -149 -421 -144 168 348 39 -250 -452 -140 246 113 153 -171 -483 -8 127
4391A27K49k64m59o5K86L42J78l69k76l41K88O56j55J16n91j10n4P29P6l28r2
$$ 127 376 112 -347 -412 -126 216 394 25 -251 -592 -304 352 197 313 -278 -388 -442 287 363 35 -57
4412e7r0p5K28L25k86j04j29K51oK72k22k46j62K2N16j38n9k91j26J05K26J0R6
$$ -57 -147 -222 6 331 45 -59 -188 63 57 329 107 -139 -301 -279 237 99 40 -251 -377 -272 -46 -36 60
4435F0l21J35j52M59K17l66j11k64J72L06Rr5k39j64L58J86K21k95m45J92NJ41
$$ 60 -261 -126 -278 181 398 32 -79 -343 -171 135 144 49 -190 -354 4 190 411 116 -329 -137 -132 9
4457IK64j65l52n4J02K69N61n41j99j3n9N86k23m5j51j54j01N42J12l85j23j38
$$ 9 273 108 -244 -298 -196 73 634 93 -106 -119 -178 408 185 140 -11 -165 -266 276 388 3 -120 -258
4479b58P6L17J12M1o47J33R2L25R3r3l44j77K17K53L52l55n44kL70J02L49m08
$$ -258 -182 135 247 288 -359 -226 -134 191 284 191 -153 -330 -113 140 492 137 -407 -409 -39 63 412 4
4501Dj17k56L45J04J82n9k21k94p2N99J7J74p14J41J38Q3K30k55j27j43L4L61
$$ 4 -113 -369 -24 80 262 203 -18 -312 -384 215 232 406 -308 -167 -29 54 284 29 -98 -241 -207 154
4523A54J67j51n88K07Q0L31j08qj29j29j0K22O0K8j69m16L34L76J63m85k38J02
$$ 154 321 170 -418 -211 -131 200 92 84 -45 -174 -184 38 98 126 -43 -459 -125 251 414 -71 -309 -207
4545b07J76J75K54m27l09m7L37L21j12o5l75K82L8K57Q9l42j21j28M9M69N0j73
$$ -207 -31 144 398 -29 -338 -385 -48 273 161 96 -279 3 41 298 387 45 -76 -204 -155 314 364 191
4567A91k75o8J06K92l5q1k22k13K59K07O9k41j44J2k97O24L8p4j34k78R5L36J08
$$ 191 -84 -152 -46 246 211 130 -92 -305 -46 161 230 -11 -155 -143 -440 184 222 148 14 -264 -169 167 275
4590B75j79k51j26L20K87J76n63j09K03k97J80M38l04p9j65L37j48K84l9n85L05
$$ 275 96 -155 -281 39 326 502 -61 -170 33 -264 -84 354 50 -29 -194 143 -5 279 240 -345 -40
4611d0l01L27J24P9k29j60R3J17K45m07K3RK65K32k73J09k38M4j08J04P6p6j34
$$ -40 -341 -14 110 189 -40 -200 -107 10 255 -152 -129 -120 145 377 104 213 -25 19 -89 15 91 15 -119
4634a19J76j57K74N6k63p1q1J78J21o4J71l99K3N5L28J24n32L23m24K76J74m7
$$ -119 57 -100 174 230 -33 -104 -185 -7 114 50 221 -178 -155 -100 228 352 -180 143 -281 -5 169 122
4656A22n6k38k58K71K70k29K47l67m3K42L14M1m7k96j59J77K22J46m66J05j58
$$ 122 66 -172 -430 -159 111 -118 129 -238 -281 -39 275 316 269 -27 -186 -9 213 359 -107 -2 -160
4677a60P4K74O2l27n1J01MN6M9j02ko2K30k8J15k51j88qO2L63k1k02J36k44l2
$$ -160 -86 188 250 -77 -128 -27 -23 33 82 -20 -22 -84 146 118 233 -18 -206 -214 -152 211 190 -12 124 -120 -152
4702a52J89J73n01J91j59J73P6K33k31m23J57L45r6J99k15k05K2j7N22k9k76o5
$$ -152 37 210 -291 -100 -259 -86 -10 223 -8 -431 -274 71 -25 174 -41 -246 -224 -241 281 252 -24 -89
4724h9j66J49K55J83j75l50o8K10L61k80J27m18J52o2K13M8j6r2q1j8L68n1k06
$$ -89 -255 -106 149 332 157 -193 -261 -51 310 30 157 -261 -109 -171 42 90 74 -18 -99 -117 251 200 -6
4747fj25mm5M37p9j31J4j89NR1K20l15Pj15J94L36j47P0m00l8J77L06O7j47l25
$$ -6 -131 -135 -180 257 178 47 61 -128 -123 -32 188 -127 -120 -235 -41 295 148 218 -182 -220 -43 263 330 183 -142
4772a42j38L17J26j55L0K1l18Q6K62j3K47p07K45J68p1J17j88N1j04LM55j74O
$$ -142 -280 37 163 8 38 59 -259 -173 89 76 323 -384 -139 29 -42 75 -113 -62 -166 -163 292 118 124
4795A24j46m6L4K98L5m02j19LK63pjJ17p3l64J63K38L6j40m8l12J90K23K4N4m40
$$ 124 -22 -68 -34 264 299 -103 -222 -219 44 37 36 153 80 -284 -121 117 153 13 -35 -347 -157 66 90 144 -296
4820b96o1R9M00J24m54r8J15j6L11J95m42J14k18J91K40K73n54j05k33M87k1J4
$$ -296 -357 -258 142 266 -188 -286 -171 -187 124 319 -123 -9 -227 -36 204 477 -77 -182 -415 72 51 65
4842F5J38k90m1K29O5J57k17k91K56j7N8J15k46k38J34l8L25N2j60j28K4J7P0
$$ 65 203 -87 -128 101 166 323 106 -185 71 54 112 227 -19 -257 -123 -161 164 216 56 -72 -48 -31 39
4865C9K62l55j75j79K70K97K45l70j68l4J92J38j32N5m36n1L70L87l01j8n7m4
$$ 39 301 -54 -229 -408 -138 159 404 34 -134 -168 24 162 30 85 -351 -402 -32 355 54 36 -21 -65
4887f5N1N30m99n7j70j74L75j47L95j08m40JJ11L6L78l69j15j05L32K10L0lm8
$$ -65 -14 516 17 -40 -210 -384 -9 -156 239 131 -309 -308 -197 -161 217 -152 -267 -372 -40 170 200 197 149
4910A49m29QK70k2m2k08k6L01K93j5k36k77q1J21L75k07K77m20J40n1L16j05O2
$$ 149 -280 -272 -2 -24 -66 -274 -300 1 294 279 43 -234 -315 -194 181 -26 251 -169 -29 -80 236 131 193
4933A93k86j18k7L64J43j42j27j23K42j68J22l6k48o3K60M8K65l22j0J2J6J06
$$ 193 -93 -211 -238 126 269 127 0 -123 119 -49 73 37 -211 -274 -14 34 299 -23 -33 -21 -5 101
4955A01K23m93k6J44J12m1K46j71k12J9j18L03K6l7j56q9J76J29J73k08k08KL8
$$ 101 324 -169 -195 -51 61 20 266 95 -117 -98 -216 87 113 76 -80 -169 7 136 309 101 -107 -105 -67
4978f7P3L12k52j96k6L26J15j27K35m37m59N96J86p0k40j82L34l98L06K32l49
$$ -67 6 318 66 -130 -156 170 285 158 393 -44 -503 93 279 209 -31 -213 121 -277 29 261 -88
4999h8k47L40p2J96j44K41l60P9l7K71l6Pl48k70Q81l92L09l78l6J16j2K78r7
$$ -88 -335 5 -67 129 -15 226 -134 -55 -92 179 143 150 -198 -468 413 21 330 -48 -84 32 20 298 201
5022B01j78j8k50J10J59Pj79P6o3j03J80M43k48k25q7J55J31M4M2k60k24J54L69
$$ 201 23 5 -245 -135 24 31 -148 -72 -135 -238 -58 385 137 -88 -175 -20 111 155 197 -63 -287 -133 236
5045B36J13k11k84N8Q7K25j12q7j08j14Q2L02j36j22k10O5L37p4r8m9j31J24K7
$$ 236 349 138 -146 -88 -1 224 112 25 -83 -197 -115 187 51 -71 -281 -216 121 47 -51 -100 -231 -107 -80
5068h0M16j67k98r6R3l9J96R5K8j61n4j72K70R8Om3l18M73K6l69J83j92k20J22
$$ -80 336 169 -129 -225 -132 -171 25 120 148 -13 -67 -239 31 129 135 92 -226 247 273 -96 87 -105 -325 -203
5092b03N75j45l34K5M4J35J47o7k89J33l31L43j7n4J70k51K06k49L25Q6j88k36
$$ -203 372 227 -107 -82 -38 97 244 177 -112 21 -310 33 16 -38 132 -119 87 -162 163 249 61 -175
5114a75K66Kl1K72k79j36j57J91J81J00l38q8J91k17L97j58k66j55Q7M13j5J06
$$ -175 91 93 62 334 55 -81 -238 -47 134 234 -104 -192 -1 -218 179 21 -245 -400 -313 100 85 191
5136A91j60j72l85N39J55L8k30j65%J21L1L20k74L6Lq5Q5j54l01L83p9j23L33
$$ 191 31 -141 -526 13 168 206 -24 -189 -189 -68 -37 283 9 45 48 -37 48 -106 -407 -24 -103 -226 107
5159A07j10K19m46j1L10M00k30j45o1m3R3J59j44m8k7q9j50N28o0l12Q8l82N53
$$ 107 -3 216 -230 -241 69 469 239 94 33 -10 83 242 98 50 23 -66 -216 312 252 -60 28 -354 199
5182A99j59Mq9J19J0l98L58k79J44k29M0L90P1j83k75K8J01J66J20Q5k85K7Pj31
$$ 199 40 44 -45 74 84 -314 44 -235 -91 -320 -280 110 181 -2 -277 -249 -148 18 138 223 -62 -35 -28 -159
5206a59J85J17l29K16l6j11K66N1k5l41l4K62Qj29J46k88K3K35O5M7k88k64K79
$$ -159 26 143 -186 30 -6 -117 149 200 175 -166 -200 62 70 -59 87 -201 -178 57 122 169 -119 -383 -104
5229a04K7J81J66k01k91r2K47J63Q4k59m3m8Q6K87j00p6Qj55l8R0K48o5j83j7
$$ -104 -77 104 270 69 -222 -314 -67 96 180 -79 -122 -170 -84 203 103 27 35 -120 -158 -68 180 115 -68 -85
5253h5j64K39l4j1j29j63K52J95%J20l97L5Q4K82l6m81J49r4L06P3j36J34l48
$$ -85 -249 -10 -44 -55 -184 -347 -95 100 100 220 -177 -142 -58 224 188 -293 -144 -238 68 141 5 139 -209
5276b09k3K45M19l98q2O7L5r4N8J05j69O0k49R2L03p5q0p6p3k05L61jj31N3P5
$$ -209 -232 13 432 34 -48 19 54 -40 18 123 -46 14 -235 -143 160 85 5 -71 -144 -349 12 11 -120 -67 8
5301HK20j72O4j85j84p7J54M60j13m4l20J4K22m5J28j83k04jK47N6K27l90R1K
$$ 8 228 56 120 -65 -249 -326 -172 288 175 131 -189 -175 47 2 130 -53 -257 -258 -11 45 272 -118 -27 -25
5325b5R5J21j30J49l09K8l2L60j82J4j37K8p6P3J86j27J9j63LJ95j96J7J41k38
$$ -25 70 191 61 210 -99 -71 -103 257 75 89 -48 -20 -96 -23 163 36 55 -108 -105 90 -106 -89 52 -186
5349a86n7L24o5n7L2o1K43p1j11j61m3J23J47Q2Q1j99l19J58K90R2l3k55j23p8
$$ -186 -243 81 16 -41 -9 -70 173 102 -9 -170 -213 -90 57 139 220 21 -298 -140 150 242 209 -46 -169 -247
5373b47M14l2J64l51j77J97q0J82Q4k25J81l95M53l1j6k72O6R0P6J59j9m21L8
$$ -247 167 135 299 -52 -229 -32 -112 70 154 -71 110 -285 168 137 121 -151 -85 5 81 240 221 -200 -162
5396a62K26L17k04k18o4nJ05r5Q8J09Pk48R0J13o4J60m9j16j91r1O15k23j96j73
$$ -162 64 381 177 -41 -105 -110 -5 -100 -12 97 104 -144 -54 59 -5 155 106 -10 -201 -292 323 100 -96 -269
5420b69P9J57k33M79j31j28k55L60R7k05L8q2J38K1O9P3j55l52M07j06K56R9k89
$$ -269 -190 -33 -266 213 82 -46 -301 59 156 -49 -11 -93 45 66 135 208 53 -299 108 2 258 357 68
5443F8r5r1J94k4o6J26k7k59o1N34k43r8l15M56k59L55M9k35m9j71K66M9r4O7
$$ 68 -27 -118 76 52 -14 112 85 -174 -235 299 56 -42 -357 99 -160 195 244 9 -40 -211 55 104 10 77
5467G7k9j84K54q2j0O9k80K14Q1R4j45J36l07l61O03r0P8q8k1P9j12q4K99l33
$$ 77 48 -136 118 36 26 95 -185 29 110 204 59 195 -112 -473 130 40 118 30 9 88 -24 -108 191 -142
5491a42J47L2K6J82j36O4k49l0K01K22m21n1l0j0J58k9J68j41Nl9J1n4K89l58
$$ -142 5 37 63 245 109 173 -76 -106 95 317 -104 -155 -185 -195 -37 -66 102 -39 -34 -73 -62 -116 173 -185
5515a85j3L5K22J14ok40M8n6J2J96K83m20j44J37PL40k35k99oL37k01J65o7m8
$$ -185 -198 -163 59 173 167 -73 -25 -81 -69 127 410 -10 -154 -17 -10 330 95 -204 -210 127 -74 91 24 -24
5539b4n5J11j56J02j7K01m9l27O4N07k98n4j14O0j2J28q4K6p0LJ34J03k07J76
$$ -24 -79 32 -124 -22 -39 162 113 -214 -150 357 59 5 -109 -49 -61 67 -17 9 -61 -58 76 179 -28 148
5563A48l62L2O0K42k71K31j94r7J92R3P1j10j34K2K32j28K0k22J96Jj38K70k93
$$ 148 -214 -182 -122 120 -151 80 -114 -211 -19 74 145 35 -99 -77 155 27 47 -175 21 22 -116 154 -139
5586a39L04j85j60L92J01k62q9q6K12L1m2j15K2l4j53L13N8l43J96l91K64J53
$$ -139 165 -20 -180 212 313 51 -38 -124 88 119 77 -38 -16 -50 -203 110 168 -175 21 -370 -106 47
5608D7oJ07k18q8Q8J69O9J4k36r5J62j70N0J45r3L0r0J06Q4j26K34k45MK90k23
$$ 47 41 148 -70 -158 -70 99 168 182 -54 -149 13 -157 -107 38 -55 -25 -115 -9 75 -51 183 -62 -58 232 9
5633IJ13k57k27M49k45J43l2K3j06J04Q5J11j54j83m3n3M86j4l06J11j06k30L87
$$ 9 122 -135 -362 87 -158 -15 -47 -24 -130 -26 59 170 16 -167 -210 -263 223 209 -97 14 -92 -322 65
5656F5k41K62k74j65M0R9M38k36n2m9OO0%J09pJ1k19O3J22L7J0k7n4J23J32k78
$$ 65 -176 86 -188 -353 -313 -214 224 -12 -64 -113 -107 -47 -47 62 55 66 -153 -90 32 69 79 52 -2 121 253 -25
5682b5ql10L02L83k45P4j43j36J4K28j64J95m7k60M0Q8J41j17j62K74n8r0J08
$$ -25 -33 -343 -41 342 97 171 28 -108 -94 134 -30 165 118 -142 -102 -14 127 10 -152 122 64 -26 82
5705H2k9j19j67j2K96m7N1J30k96J6K81p7o9J39l77q2L67j9K24l44O2k89J11M47
$$ 82 53 -66 -233 -245 51 4 55 185 -111 -95 186 109 40 179 -198 -280 87 68 292 -52 10 -279 -168 279
5729B79j06Q6m98L41M2K56m91j7J1p5j70K14L7J78k93r6K96O9J16r6o6l9K8LR9
$$ 279 173 259 -239 102 144 400 -91 -108 -97 -172 -342 -128 -91 87 -206 -302 -6 63 179 83 17 -22 6 9 108
5754A08k51J29o8L09r8J21j48pr8k84M57m0K6l12J69n6K2P1oK89k74l6J46L5k69
$$ 108 -143 -14 -82 227 129 250 102 95 -3 -287 170 130 156 -156 13 -43 -21 50 44 333 59 23 169 204 -65
5779f5j73J54K27J13k53l18K21J47j53M03j89j89j62J22o6L42j11J94j94l11L08
$$ -65 -238 -84 143 256 3 -315 -94 53 -100 303 114 -75 -237 -115 -181 161 50 244 50 -261 47
5800D7o9K18k28K74l73J47J85j01k1L0k67J56L09l40J53M8k20J82K6mk51o0K08
$$ 47 -22 196 -32 242 -131 16 201 100 79 109 -158 -2 307 -33 120 168 -52 130 156 152 -99 -159 49
5823D9rk9L7M1j37n2m1J03K00l20J25k93N28J10m01J69j82oL54l59K65o0k25l7
$$ 49 40 11 48 89 -48 -100 -141 -38 162 -158 -33 -326 202 312 -89 80 -102 -108 246 -113 152 92 -133 -170
5847a70K15J75L3k20j81K52q6L05l32j69M0Q6O9j04K65p3k76P5J57K76l03l8j08
$$ -170 45 220 253 33 -148 104 18 323 -9 -178 -138 -52 17 -87 178 105 -171 -96 61 337 34 -4 -112
5870a12r7K63Q1j41k49K08k25J71J50j13l5N0K9M9K19j67j24R3j1j99K39J3j2
$$ -112 -209 54 135 -6 -255 -47 -272 -101 49 -64 -99 -49 -20 29 248 81 -43 50 39 -160 79 92 80
5893H0L8kk08K74rk19Rj3lK57J56m56k40M23Q0j48l40K81N2J90l06N9K47l61J88
$$ 80 118 116 -92 182 173 -46 -37 -50 -53 204 360 -96 -336 87 167 19 -321 -40 12 202 -104 -45 202 -159 29
5918B9M7o4Q6j43N7l1l3l7K7j23M69m18j2L11J0k80J07J66j31L8J91k32k47J58
$$ 29 76 12 98 -45 12 -19 -52 -89 -62 -185 284 -134 -146 165 175 -105 2 168 37 75 266 34 -213 -55
5942e5M5M23l48j47j6Nr7J15L48k64L8j90K15J17o6j75M4k32L34P1mk03K29j96
$$ -55 -10 413 65 -82 -98 -93 -190 -75 273 9 47 -143 72 189 123 -52 -8 -240 94 165 161 -42 187 -9
5966iP8J17J8Nl02q5N5J6L58j83l15J50J58j17K91j76R6q6j02l7M5m0j20JkL47
$$ -9 69 186 204 209 -93 -178 -123 -107 251 68 -247 -97 61 -56 235 59 155 69 -33 -70 -25 -65 -185 -184 -186 161
5992A61n7M0m2p4k28P9J05K03k43m0J61K51l22k7k74M92k61J63j00M91o73O6K62
$$ 161 104 144 102 28 -200 -121 -16 187 -56 -96 65 316 -6 -33 -307 185 -76 87 -13 478 -195 -129 133
6015A33l3J50k92J07j08j30L08J53k76o1J22Q3k37J11L3J66m87L48J40p6Q8q7
$$ 133 100 250 -42 65 -43 -173 135 288 12 -49 73 156 -81 30 63 229 -258 90 230 154 242 155
6037A55J8k65R6J76j85j50J07j15K37k3j87L27j07l97N00m1l92L70J51l63J74
$$ 155 173 -92 4 180 -5 -155 -48 -163 74 51 -136 191 84 -313 187 146 -246 124 275 -88 86
6058H6q9p4K72k41K28j21L3R2k96j2j11J81J80j57J42k69j24J51P0o1J49j65J59
$$ 86 -3 -77 195 -46 182 61 94 186 -110 -122 -233 -52 128 -29 113 -156 -280 -129 -59 -120 29 -136 23
6081B3P4j32J07K1k5%n2o8N1R8l04O2J12J67j97j0j6J97r0J84k18j19l19O11K3
$$ 23 97 -35 72 93 68 68 16 -52 -1 97 -207 -145 -33 134 -63 -73 -89 108 18 202 -16 -135 -454 157 180
6106A80m1j25k6r2q4M92k23k93J04r0J06K33n7K4k45k5J6K32M4q4j74K84j87J56
$$ 180 139 14 -12 -104 -188 304 81 -212 -108 -198 -92 141 84 108 -137 -162 -146 86 130 46 -128 156 -31 125
6130A25Rj63j44J80M7j25J88l36K98J21k21J19L8k14j26J66O6M6n0J29m84M70
$$ 125 134 -29 -173 7 54 -71 117 -219 79 200 -21 98 136 -78 -204 -38 28 74 24 153 -331 139
6152A39l33J44J34Q9l69p6K46n6L38l68J59j89J08K4K21j47l3Q8k43J89o3J28
$$ 139 -194 -50 84 173 -196 -272 -26 -82 256 -112 47 -142 -34 -10 211 64 31 119 -124 65 2 130
6174A30m9M8p0J73l50K01j6m8q2K32Jk51q0J27Q1N1Kr6j59J05J53J53j45j10L9
$$ 130 81 129 59 232 -118 83 67 19 -63 169 170 -81 -161 -34 47 98 100 4 -155 -50 103 256 111 1 40
6199D0k39J66lL1N0K30l05K37j39j29J93k61J14p6M3N5k77K70K54m54K90m7J14
$$ 40 -199 -33 -36 -5 45 275 -30 207 68 -61 132 -129 -15 -91 -48 7 -270 0 254 -200 90 43 157
6222A57l1j15r4J16P5o9k64J61M9J1P7j77O4j7J43K1J0L8j67l2j90J40O4j43k52
$$ 157 126 11 -83 33 108 39 -225 -64 -15 -4 73 -104 -40 -57 86 107 117 155 -12 -44 -234 -94 -30 -173 -425
6247d25N51n7L7l46K16l7N5P4n9Mk42J31j54L45j65J0o4J18nK8K32k56j6j29k6
$$ -425 126 69 106 -240 -24 -61 -6 68 9 13 -229 -98 -252 93 -72 -62 -126 -8 -13 15 247 -9 -25 -154 -180
6272a80J31R5J19l07L70l42J89j22J12n2P7r7q7K82k36%m3J71m8P5j7j10j14M3
$$ -180 -49 46 165 -142 228 -114 75 -47 65 13 90 -7 -94 188 -48 -48 -91 80 32 107 90 -20 -134 -91
6296i1j36M40l85N4m7K87l06M57o2j09lj72R2J05Pk04K38l26K21K33j64r7k02
$$ -91 -227 213 -172 -118 -165 122 -184 273 211 102 99 -73 19 124 131 -73 165 -161 60 293 129 32 -170
6319a70QK63N0l4N2l90K18j08K52k02R9J59n4j10p5J92k3l40L1rL29q8k93J40
$$ -170 -162 101 151 117 169 -221 -3 -111 141 -61 38 197 143 33 -42 150 127 -213 -182 -191 138 50 -243 -103
6343a03r7K91K8K15l16r3j28K16oN9J19o51L50L5M2J29J49k01j09Q5J24O0j88
$$ -103 -200 91 119 334 18 -75 -203 13 7 66 185 -466 -116 -81 -39 90 239 38 -71 14 138 198 10
6366A0L8j07K3K13l19K6j2K05k5j0nk3j16k11R2L51k9j43J5R2N1L4j31j84L3q
$$ 10 48 -59 -36 177 -142 -116 -128 77 52 42 37 14 -102 -313 -221 130 101 -42 -27 65 116 150 19 -165 -132 -140
6392a40K4O6J46j3l1p0o4O6R5l6j10j18K22j6K27j94Kn1J59n1q7j92K71j5j6J5
$$ -140 -116 -50 96 83 52 -18 -82 -16 79 43 -67 -185 37 21 248 54 56 5 164 113 26 -166 105 90 74 89
6418H9P2j96Q2j03K4r2L17l37J74m27L95O2Q6j83K0k0P1L31l20M5j34l7L6J49
$$ 89 161 -35 47 -56 -32 -124 193 -144 30 -397 -2 60 146 -37 -17 -37 34 365 45 90 -44 -81 -45 104
6442A04j67J35j61J10l6l9m2j65N95n49K95n0j4K6m4J44k19J30j45J5L0j0J92
$$ 104 -63 72 -89 21 -15 -54 -96 -261 334 -215 80 30 16 42 -2 142 -77 53 -92 -77 -47 -57 135
6465A35k52J12N5J4j45P4Q4J28k34p7K21k13K91k48K25m26K25J79j49J02p9q7
$$ 135 -117 -5 50 64 -81 -7 77 205 -29 -106 115 -98 193 -55 170 -256 -31 148 -1 101 22 -65
6487f5Lj05N63j33j31n3k65J80M4l9k0k0J5P1J18q4n4m4P2k90M01j55j53P5K7
$$ -65 -62 -167 396 263 132 79 -186 -6 38 -1 -21 -41 -26 45 163 79 25 -19 53 -237 164 9 -144 -69 -42
6512d2J21q1j82l1J38O9k8K78k68m6J19J41p5l59R6K62l99M12j78J55k25K32N9
$$ -42 79 -2 -184 -215 -77 -8 -36 242 -26 -72 47 188 113 -246 -150 112 -287 125 -53 102 -123 109 168
6535A68j07p9q9J01q3P1o1J95p5J00k73J16m0R8K08j59o7q3J0K52j37j98J95k68
$$ 168 61 -18 -107 -6 -89 -18 -79 116 41 141 -132 -16 -56 42 250 91 24 -59 -49 203 66 -132 63 -205
6559b05P6K98j02r5J5j94P0M5K72k84J39j00l9N7K96l10R1k19K14pK53l41J36
$$ -205 -129 169 67 -28 -13 -207 -137 -92 180 -104 35 -65 -104 -47 249 -61 30 -189 25 18 271 -70 66
6582F6j5j47N7J94k14K29Mj50L21k01j17m14L03Ql4J57J1M9k72k2K96j87K20j32
$$ 66 51 -96 -39 155 -59 170 174 24 345 144 27 -387 -84 -76 -110 47 58 107 -165 -187 109 -78 142 10
6606A0k42J61O2p4Q7%m6J5j28L0L04j06P6j63j6J73j03N6j96j02K48K6m8p6p1
$$ 10 -232 -71 -9 -83 4 4 -42 -27 -155 -125 179 73 149 -14 -30 143 40 96 -100 -202 46 72 24 -52 -123
6631a23P0J95q6K0j60p3qJ01J21Q5l45j42M46k20L4K92j46k24j02L95j45K91m65
$$ -123 -53 142 56 76 -84 -157 -165 -64 57 142 -203 -345 101 -119 -85 207 61 -163 -265 130 -15 276 -189
6654a89K4K97j96K11k39k7J28j36J76Q0l4l49M0K62J0J03j88k06J18J48p8L80
$$ -189 -165 132 -64 147 -92 -119 9 -127 49 129 95 -254 -214 48 58 161 -27 -233 -115 33 -45 335
6676C35l29o4j5J08j1L5O7K09k99k64M27%qk92j19L36k05L46l79L45k25q5K19
$$ 335 6 -58 -73 35 24 59 126 335 36 -228 199 199 191 -101 -220 116 -89 257 -122 223 -2 -87 132
6699A32j34J28j91P7J36q3J33j48o8J24j50Q9J40j67J11l32N8J03J9j08O3LP8
$$ 132 -2 126 -65 12 148 65 198 50 -18 106 -44 45 185 18 129 -203 -145 -42 -23 -131 -68 -65 13
6722A3r8n6M8M4j27J54RK2O2j5j84K36j75r7J63N4Jn5K7n6n1J66j02n2J62p4L6
$$ 13 -85 -141 -93 -49 -176 -22 -13 9 71 56 -128 108 -67 -164 -1 53 54 -1 26 -30 -81 85 -17 -69 93 19 55
6749E5j45q9K5L76j27j08J00l5j77J72N5K7k84J10O1J33l81K55j19L5k6p4RJ72
$$ 55 -90 -179 -154 222 95 -13 87 52 -125 47 102 129 -155 -45 16 149 -232 23 -96 -61 -87 -161 -152 20
6773B0j19j9K19J0N3l55J76nQ9J05j46R3j84j09n5K94j55n5l7K25k88L46K6k60
$$ 20 -99 -118 101 111 164 -191 -15 -20 69 174 28 121 -63 -172 -227 67 -88 -143 -180 45 -243 103 129 -131
6797a31N1m5J34N7L1M2p3j45J92k21K02J44k67j10j21M98j29%l3j92J02rPJ79
$$ -131 -80 -125 9 66 97 139 66 -79 113 -108 94 238 -29 -139 -260 238 109 109 76 -116 -14 -23 -16 163
6821A63j20q8O8J89n8M6j71q1j5J3Kq0o8J05J29j49R3K91j31j67l8M5J17K64n18
$$ 163 43 -45 23 212 154 200 29 -52 -67 -54 -52 -132 -200 -95 34 -115 -22 269 138 -29 -67 -22 95 359 -159
6846a59K7P4K25p7L6k4k54jK14J12ON6k12n0M7j9k43J50J22K2k12J33K96l01k
$$ -159 -132 -58 167 90 126 102 -152 -153 61 173 179 235 23 -27 20 1 -242 -92 30 52 -160 -27 269 -32 -34
6871c4J95j86J50k86O7R5o1J78k00n7J28l8j10K87J46m47K36P1J27j95q7N8J62
$$ -34 161 -25 125 -161 -94 1 -60 118 -82 -139 -11 -49 -159 128 274 -173 63 134 261 66 -21 37 199
6894A99j56j97K45oJ36l32j28J21J10J14j86P5p8O4K1J59J90k94K19j59j40K40
$$ 199 43 -154 91 85 221 -111 -239 -118 -8 106 -80 -5 -83 -19 2 161 351 57 276 117 -23 217
6916B17l04j75K9J91o3m3K45k31K78j91q4L5J23M5R2k31k41M36R4p9j3k08RK37
$$ 217 -87 -262 -233 -42 -105 -148 97 -134 144 -47 -131 -96 27 72 164 -67 -308 128 222 143 130 -78 -69 168
6940A68K43p01L64k3O8k04k1J76k41J0Q1J27r9j11K64k52J28K87o12M89j80j46
$$ 168 411 -290 74 51 119 -85 -106 70 -171 -161 -80 47 -52 -163 101 -151 -23 264 -348 141 -39 -185
6962a85L02j05J36k42Q8j15K58k57m9K70K2n15M44P5k02J85o7j80L41j57O7j11
$$ -185 117 12 148 -94 -6 -121 137 -120 -169 101 123 -392 52 127 -75 110 43 -137 204 47 114 3
6984CK10j64J02q9M5k2m52N79j92K6j08l2J08R9O1j92oj45J31k19L89r4J11m1
$$ 3 213 49 151 62 107 85 -367 212 20 46 -62 -94 14 113 174 -18 -24 -169 -38 -257 132 38 149 108
7008A08k79L38j85J5j23l8J39l5L01j45q5j61j0J98J7j0P7n7q9N2k17L64m1j13
$$ 108 -171 167 -18 -3 -126 -164 -25 -60 241 96 11 -150 -160 38 55 45 122 65 -24 28 -189 175 134 21
7032B1q8L62k06P3r0o3m92K90J65MJ62j09Jq5K61l79K19J8j56J8K07k79L00j15
$$ 21 -67 295 89 162 72 9 -483 -193 -28 -24 138 29 30 -55 206 -173 46 64 -92 -74 133 -146 154 39
7056C9k02K86j02L59l10j18qj15O2R0O9j63o2K46j39p7J96p6L2l3J00M7o5m6j
$$ 39 -163 123 21 380 70 -48 -56 -171 -109 -19 50 -113 -175 71 -68 -145 51 -25 7 -26 74 121 56 10 9
7081ILL1l1j60K29n6j18K67k20R5j4L9l4J09n2J44m21K12o4j37L10p9l7J08rL2
$$ 9 12 43 12 -148 81 25 -93 174 -46 49 35 74 40 149 97 241 -180 32 -32 -169 141 62 25 133 124 156
7107A56j00k04K36k69L29J03n41N6L89l84J06M2J14MJ02l24n5K34pR5q6j14p4
$$ 156 56 -148 88 -181 148 251 -290 -234 155 -229 -123 -81 33 37 139 -185 -240 -6 -13 82 -4 -118 -192
7130a92J36p0K5Q6j1J46k06J02K08k37j48L39k01j19M5K20J6m6j90K55j30k18
$$ -192 -56 -126 -101 -15 -26 120 -86 16 224 -13 -161 178 -23 -142 -97 123 139 93 -97 158 28 -190
7152a90j31M24n7Jr8j18J75J01r2j11m8Q0q4J42N3j14J26o5P6J02k65J20j63K33
$$ -190 -321 103 46 47 -51 -169 6 107 15 -96 -144 -64 -148 -6 47 -67 59 -6 70 172 -93 27 -136 97
7176I7k44J28nR3M3m7J74l13P7k41K89P0Mj88K21k00j35K67J0k6K2j55L24l65
$$ 97 -147 -19 -24 69 112 65 239 -74 3 -238 51 121 125 -63 158 -42 -177 90 100 74 96 -59 265 -100
7200a00k2J93J40l81L85m99K34m4j93N00j96l0J19j06J90j79P2j91J25mk14L10
$$ -100 -122 71 211 -170 215 -284 -50 -94 -287 213 17 -13 106 0 190 11 83 -108 17 13 -201 109
7222A09Kn5o2j07r1k0L38rj39N5L3k3p5q8K69l1l5k35L14k6k04M9k1j08M4J06
$$ 109 111 56 -6 -113 -204 -224 114 105 -34 21 54 31 -44 -132 137 106 71 -164 150 124 -80 -31 -52 -160 -116 -10
7248a0J14p0R6k40P0J83j52k26J55J17n0J77l6k21L15j65j38j56J69J03j2M1k5
$$ -10 104 34 130 -110 -40 143 -9 -235 -80 37 -13 164 128 -93 222 57 -81 -237 -68 35 23 64 39
7271C9k47J54P6r6j89K49J7j2k52R9K62n3j71P4o0J39L1k78J92j08K66l9q8j19
$$ 39 -208 -54 22 -74 -263 -14 3 -9 -261 -162 100 47 -124 -50 -110 29 60 -218 -26 -134 132 93 5 -114
7295a14K19q9J33m4J52j75R2k62J0K9k3J15j52O1L4oL0K0R7j28p9k5K15J34l25
$$ -114 105 16 149 105 257 82 174 -88 -78 -49 -72 43 -109 -48 -14 -20 10 30 127 -1 -80 -105 110 244 -81
7320h1J81J94k47Q2j06Q7j1j26J16k47M66k82k7n3J30K3j20j94P2O8q2K3J99l87
$$ -81 100 294 47 129 23 110 99 -27 89 -158 308 26 -1 -54 76 99 -21 -215 -143 -75 -157 -134 65 -322
7344c22L02Q2j87J52J09n4j60k81M01j26k72J87K13k36J71J17M2k50j80K78R8
$$ -322 -20 62 -125 27 136 82 -78 -359 42 -84 -356 -169 44 -192 -21 96 138 -112 -292 -14 84
7365H4j77J67j41j01K29Km8J36j58p9OoK77m9k43r7m3L11j96J71r5j48J09J25
$$ 84 -93 74 -67 -168 61 63 15 151 -7 -86 -80 -86 191 142 -101 -198 -241 70 -126 45 -50 -198 -89 36
7389C6K55j30k74k1J96j16N7o6j24J77J54k19rJ82K6q1L3J4k63l0K20J04l74K66
$$ 36 291 161 -113 -134 62 -54 3 -63 -187 -10 144 -75 -84 98 124 43 76 90 -173 -203 17 121 -253 13
7413A3N9l52J55K31k53K76Q6k9k59K16k72lL5L2R4j84J57l6P6p8n4J25k64K54
$$ 13 72 -280 -125 106 -147 129 215 186 -73 143 -129 -132 -97 -65 29 -155 2 -34 42 -36 -90 35 -229 25
7437B5R2k0n8P0J33p1k51K41r6P7j24m5o9Q1K03k8p7j40J54k14R2j32L44j71R4
$$ 25 117 97 39 109 242 171 -80 161 65 142 18 -27 -96 -15 188 160 83 -57 97 -117 -25 -157 187 16 110
7462A10M8j82k6lJ55j92j32K78J0J87l18K0k2K08j55o3P5K0M8jq9J47r6j00J44
$$ 110 158 -24 -50 -53 102 -90 -222 56 66 253 -65 -45 -67 141 -14 -77 -2 18 66 65 -24 123 27 -73 71
7487G1j22M3J47r8j03m2L0J41m7m3q5K61L8j08r9J15j94J52nj79K49Q4k94J01
$$ 71 -51 -8 139 41 -62 -104 -74 67 20 -23 -108 153 191 83 -16 99 -95 57 52 -127 122 206 -88 13
7511A3l9J95p8LQ4k97J84p4p2N3J29q8k54J07O8P7R9j93R1Kj43L17l14K08k20
$$ 13 -26 169 91 94 178 -119 65 -9 -81 -28 101 13 -241 -134 -66 11 110 -83 8 10 -133 184 -130 78 -142
7536a42Q4r6K39k01K58j68J20P9j01J28L9j34o2Q7ON9r7k33M11k86j43L64k50
$$ -142 -58 -154 85 -116 142 -26 94 173 72 200 239 105 43 130 136 195 98 -135 276 -10 -153 211 -39
7559c9J45k28K15j0j98O7m8J41j33o5P0K06rj47j36J24K18n7Mj97J13j9p7K9R
$$ -39 106 -122 93 83 -115 -48 -96 45 -88 -153 -83 123 114 -33 -169 -45 173 116 120 -77 36 17 -60 -31 -22
7584b2P9k5p6R0J35k22j55L93j60j02K05l41K11P4q3RJ2n1P5o8J16J0k2k08l7
$$ -22 57 32 -44 46 181 -41 -196 197 37 -65 140 -201 10 84 1 10 22 -29 46 -22 94 104 82 -126 -163
7609a63K81J6k9j60j55O3K08QP7j11k26L17Nn6j12J43r0p3q9K48j26k4P2K05J9
$$ -163 118 134 105 -55 -210 -147 61 69 146 35 -191 126 131 75 -37 106 16 -57 -146 102 -24 -48 24 229 248
7634B48k76J07l80K52J42j04J01P1k60K0P8k5l4J91j36k38J76kq5J65k2o8M4M7
$$ 248 -28 79 -301 -49 93 -11 90 161 -99 -79 -1 -26 -60 131 -5 -243 -67 -69 -154 11 -11 -79 -35 12
7658A2O9n3jj22J32qJ4M4k33J83K7J40l50r7K91n7L5j28J55m8J22k36Q0k74L87
$$ 12 81 28 27 -95 37 29 43 87 -146 37 64 204 -146 -243 48 -9 26 -102 53 5 127 -109 -29 -303 84
7683H4q3j56K11k00Q6k26J99J61j75j21K46K33l35J32k68L11j20j34J73K69m05
$$ 84 1 -155 56 -144 -58 -284 -85 76 -99 -220 26 259 -76 56 -212 99 -21 -155 18 287 -118
7704a18m5O8L24k89q9o3L28j86k3j19J10MJ66n1k0J89j8j55k4J22k2q7kj75J66
$$ -118 -163 -95 229 -60 -149 -212 116 -70 -93 -212 -102 -98 68 17 -3 186 168 13 -11 111 89 2 0 -175 -9
7729ij4o6J66j30m1J46j30J37j60o9K92k31M9K20l6p1k6j65J12J85K2j12k48P6
$$ -9 -23 -89 77 -53 -94 52 -78 59 -101 -170 122 -109 -60 160 124 53 27 -138 -26 159 181 69 -179 -103
7753a03R2N8j24J59k80N6J16m4J5K27k18n3J9J54j18P0n7p8M4Q6Mm4j44LN6J06
$$ -103 -11 47 -77 82 -198 -142 -26 -70 -55 172 -46 -99 -80 74 -44 26 -31 -109 -65 21 25 -19 -163 -160 -104 2
7779BJ42r8j61J40j71K41j75J74j33k3J95k46J97j00j42K2J6J00j89J89K0j28
$$ 2 144 46 -115 25 -146 95 -80 94 -39 -62 133 -113 84 -16 -158 -136 -120 -20 -209 -20 0 -128
7801a28R2k26L04L51l96Q9n10M23j9j82J80Q1k74K65k52K95j39M9j03J22J54Q6
$$ -128 -36 -262 42 393 -3 86 -424 -1 -20 -202 -22 59 -215 50 -202 93 -46 3 -100 22 176 262
7823B62j91j55K79l71K01j26K11k31J36j22L02k1m8k07R4j01n5P4j75L88k67O
$$ 262 71 -84 195 -176 25 -101 110 -121 15 -107 195 174 126 -81 13 -88 -143 -69 -244 144 -123 -117
7845a17J40N2j29j51K41N4k2N4j91M9q8q7J25j83K16l0P7J0J7k13L54j55L8J4
$$ -117 23 75 -54 -205 36 90 68 122 -69 -20 -108 -195 -70 -253 -37 -67 10 20 37 -176 178 23 61 75
7869G5k06k2J83n0j83J31k1Qk54K93p6J00R3k0p9p6n0K54Lj63RJ76k99K58p8j33
$$ 75 -131 -153 30 -20 -203 -72 -93 -85 -339 -46 -122 -22 71 51 -28 -104 -154 100 103 -60 -51 125 -174 84 6 -127
7895a27J29j47o3L78l32J84J45P8k77J97r0j15j5O7N1Oo4j18J71n7k3P8l1k40
$$ -127 2 -145 -208 170 -162 22 167 245 -32 165 75 -40 -55 12 63 69 5 -113 58 1 -22 56 25 -215
7919b15K79P5j66J25p1j82J36J83k00j3j51k8k04N86L4j29kj56K62j41M6j79K55
$$ -215 64 139 -27 98 27 -155 -19 164 -36 -49 -200 -228 -432 154 188 59 57 -99 163 22 68 -111 144
7942A44j01O9n0Mj25K05k34R5k24J21K70j54J9l7J48m5k00J33J20k94J7K73K5
$$ 144 43 112 62 66 -59 146 -88 7 -217 -96 174 20 39 2 150 105 -95 38 158 -136 -119 154 179
7965A79k19ok04n0M04k45K9r0K35P2k63J48m3J45PJ28j22j72l9K85jk86J12J49
$$ 179 -40 -46 -250 -300 104 -141 -112 -202 33 105 -158 -10 -53 92 99 227 105 -67 -106 179 178 -108 4 153
7989A53k38j12K10J50k58J81q4Lp6j00K40j74M7j06K84j35J82k11o7Q6m4M4L57
$$ 153 -85 -197 13 163 -95 86 2 5 -71 -171 69 -105 -58 -164 120 -15 167 -44 -111 -25 -69 -25 332
8012C32q9k26m1N4L3j84L32p9j33j58J33j79K34r8N7L9Q1j2k1k31L91On09K04
$$ 332 243 17 -24 30 63 -121 211 132 -1 -159 -26 -205 29 -69 -12 27 108 96 75 -156 235 241 -268 -64
8036f4J82k08J9r4L29j5k52L21j89j63K44j61k51K0O27l38K1j34J05M1j01m1N3
$$ -64 118 -90 -71 -165 164 149 -103 218 29 -134 110 -51 -302 -282 345 7 28 -106 -1 40 -61 -102 -49
8059d9j21K57k77NL62j73l1k66L28KK68m13K9m3j22K94l00M91m31K27Q2j06J54
$$ -49 -170 87 -190 -185 177 4 -27 -293 35 37 305 -108 -79 -122 -244 50 -250 241 -190 37 119 13 167
8082A67k13J51q4J29l76M39k11j61j07J37p1K11J49n3l10K29M5J47j84o8O8J8
$$ 167 -46 105 21 150 -226 213 2 -159 -266 -129 -200 11 160 107 -203 26 71 218 34 -34 34 52
8104E2k23J08L01j76ON9q4q0k42K21p1J94mJ16q0M3r5J54l21j08M45j68n0j34
$$ 52 -171 -63 238 62 68 127 43 -37 -279 -58 -129 65 61 177 97 140 45 199 -122 -230 215 47 -3 -137
8128a37J62j28J49k37K83j19jK94l80K24j98r9J74J52k12J01j13K6j06L62l4j2
$$ -137 25 -103 46 -191 92 -27 -28 266 -114 110 -88 -187 -13 139 -73 28 -85 -59 -165 197 163 151
8150A51l36n6K64n0J01l6p9l93L09O4m9J4J17o3N5m4r2J28p9r1K61n0N1kj52K0
$$ 151 -185 -241 23 -27 74 38 -41 -434 -125 -61 -110 -96 21 -42 13 -31 -123 5 -74 -165 96 46 97 95 -57 -37
8176c7J66j34Kj19K56k02l3L98k35J02l1q6N6k2n4
$$ -37 129 -5 -3 -122 134 -68 -101 297 62 164 133 47 103 81 27
8191B7
$$ Imaginary data points
##PAGE= N=2
##DATA TABLE= (X++(I..I)), XYDATA
0@%%%%%%%%%%%%%%%%%Pj5J6j6J6j6K3l1L2l5M3n1N9o7P5q4R5j10J26j42J58j74
$$ 0 0 0 0 0 0 0 0 0 0 0 0 0 0 0 0 0 0 7 -8 8 -8 8 -8 15 -16 16 -19 24 -27 32 -35 40 -44 51 -59 67 -75 83 -91
39i1J93k17K41k66K96l27L61l99M40m86N35n88O49p18P90q71R65j070J191j331
$$ -91 102 -115 126 -140 156 -171 190 -209 231 -255 280 -308 341 -377 413 -458 507 -563 628 -703
59g03J496j692J929k227K610l125L862n010P061j1857M8098J6964o2716j9473
$$ -703 793 -899 1030 -1197 1413 -1712 2150 -2860 4201 -7656 40442 57406 -5310 -24783
73b4783J073L5842K9247J836m0666l5185L331L7634K9571R70l7075l7654K298
$$ -24783 -23710 12132 41379 43215 2549 -32636 -29305 8329 37900 38870 1795 -35859 -33561
86c3561M3130L1223q634l4418k8391j318L5473L6388n579l9776k7904M198L0627
$$ -33561 9569 40792 32158 -2260 -30651 -31969 3504 39892 34313 -5463 -33367 -29169 1458
99A458L3121n14l8908l3919Q689L5139K5930k009l0887l3909K592L8380K9859
$$ 1458 34579 34065 -4843 -38762 -30073 5066 30996 28987 -1900 -35809 -33217 5163 35022
112C5022p444l1382k7042j18L3748L3418o690l6240k4892M773K7866L0003l31
$$ 35022 27578 -3804 -30846 -30964 2784 36202 29512 -6728 -31620 -26847 1019 31022 30691
125C0691l5574l1100P730L2605K4099k164k8737l1257K924L5304K7205o649k8051
$$ 30691 -4883 -35983 -28253 4352 28451 26287 -2450 -33707 -30783 4521 31726 25077 -2974
138b974k5316J42L1044L1700n235l3313k3358M616K6633K7345k26l2369k8863
$$ -2974 -28290 -28148 2896 34596 29361 -3952 -27310 -22694 3939 31284 31058 -1311 -30174
151c0174O824K9998K2267j479k6572k9567J803L3032K5304o356k6554k3679QK7820
$$ -30174 -23350 6648 28915 27436 864 -28703 -26900 6132 31436 25080 -1474 -25153 -25145 2675
165B675K8946l678l1448k2589L976K4603K5475M46l0318k7479O361K7102K1577
$$ 2675 31621 27943 -3505 -26094 -22118 2485 27960 28406 -1912 -29391 -23030 4072 25649
178B5649o82k4882k7773P78L0735K4470n326k4979k1992o38K6234K7682l257k8693
$$ 25649 24967 85 -27688 -26910 3825 28295 22969 -2010 -24002 -24640 1594 29276 26019 -2674
192b674k1660L332K2738K4736R90k8631k5815N057K5845K0374r66k3260k6315
$$ -2674 -24334 -21002 1736 26472 27462 -1169 -26984 -21927 3918 24292 23326 66 -26249
205b6249N63K8311K3216m812k3308k1646q34K4372K6343k824k7410k0658K914
$$ -26249 -25686 2625 25841 21029 -2279 -23925 -24759 -387 25956 23132 -4278 -24936 -22022
218b2022K1628K3176J380k6439k4500M143K4559J9837l88k1852k4935M16K6928
$$ -22022 -394 22782 24162 -2277 -26777 -22634 1925 21762 21374 -478 -25413 -24997 1931
231A931K2097m017k2396k0192j056K3187K5675k660k6224j9271K473K0609K2490
$$ 1931 24028 20011 -2385 -22577 -23633 -446 25229 22569 -3655 -22926 -20453 156 22646
244B2646J031k4808k3414L775K3423J8982j28k0974k4042M74K5589K1256m203
$$ 22646 23677 -1131 -24545 -20770 2653 21635 21507 533 -23509 -23035 2554 23810 19607
257A9607k1173j9591j258K2385K4120k594k4417j9279K064J9952K1848Q56k3632
$$ 19607 -1566 -21157 -22415 -30 24090 21496 -2921 -22200 -20136 -184 21664 22520 -1112
270a112k2571L586K2725J7927j24j9735k2920N29K4109K0468l508k0149j9160
$$ -1112 -23683 -20097 2628 20555 20431 696 -22224 -21695 2414 22882 19374 -775 -19935
283a9935j223K1279K3145k124k3655j8440J877J8917K0732J269k2516k2104L632
$$ -19935 -21158 121 23266 21142 -2513 -20953 -19076 -159 20573 21842 -674 -22778 -19146
296a9146K1778J7180K59j9387k1907p0K3663J9528l288j9317j8355j656K0667
$$ -19146 2632 19812 20071 684 -21223 -21293 2370 21898 18610 -707 -19062 -20718 -51
309e1K2423k365k2545j7949K201J7838K0071J259k1889k1169L245K0640J7160
$$ -51 22372 20007 -2538 -20487 -18286 -448 19623 20882 -1007 -22176 -18931 1709 18869
322A8869j02j8611k0761O2K2561J9241l600j8778j7382j304J9799K1469k205k1586
$$ 18869 18767 156 -20605 -20543 2018 21259 17659 -1119 -18501 -19805 -6 21463 19258 -2328
336b328j7095J961J7298J9184J271k1446k0281L230J9717J6384J89j7864k0662
$$ -2328 -19423 -17462 -164 19020 20291 -1155 -21436 -18206 1511 17895 18084 220 -20442
349b0442L01K1473J8558l020j8095j6928j085J9170K0076j498k0989j6625J504
$$ -20442 -20141 1332 19890 16870 -1225 -18153 -19238 -68 20008 18510 -2479 -19104 -17600
362a7600J6744J8717J325k1056j9152K920J9296J5781n4j7529j9151L63K0497
$$ -17600 -856 17861 19186 -1870 -21022 -18102 1194 16975 16921 -608 -19759 -19396 1101
375A101J7897k394j7605j6162j330J8606K0005j478k0487j5993J782J6398J7525
$$ 1101 18998 16604 -1001 -17163 -18493 113 20118 18640 -1847 -17840 -16058 340 17865
388A7865J012j9570j8953K590J8207J5348N34j6628j9612l7K0292J7525k613j6920
$$ 17865 18877 -693 -19646 -17056 1151 16499 17033 405 -19207 -19244 1048 18573 15960 -960
402i60j6029q50J7364J9348j193j9338j5706J371J5775J7716J170j9019j8139
$$ -960 -16989 -17839 -475 18873 17680 -1658 -17364 -15993 -218 17498 18668 -351 -18490
415a8490K335J7905J4973J86j5679j8743l05J9531J6813k123j6339j5462q16J6917
$$ -18490 -16155 1750 16723 16909 1230 -17513 -17818 1713 18526 16403 64 -15398 -16214 703
429G03J8589j000j8823j5122J068J4888J6659J401j8382j8125K096J7125J4483
$$ 703 19292 18292 -531 -15653 -14585 303 16962 18363 -19 -18144 -16048 1077 15560
442A5560j00j5558j7834l87J8251J6334k096j5777j5074j406J6581J8026o79j7994
$$ 15560 15460 -98 -17932 -18319 -68 16266 14170 -1607 -16681 -18087 -1506 16520 15841 -2153
456b153j5052J455J4915J5979J185j7228j7124J641J6561J4452K21j4987j7287
$$ -2153 -17205 -15750 -835 15144 16329 -899 -18023 -16382 179 14631 14852 -135 -17422
469a7422o06J8181J5611j692j5226j4335j312J5899J7729j096j6890j4365J031
$$ -17422 -18028 153 15764 14072 -1154 -15489 -16801 -902 16827 15731 -1159 -15524 -14493
482a4493J4036J6269J361j6775j6862J774J6070J3743M36j4524j6929k12J7163
$$ -14493 -457 15812 17173 398 -16464 -14690 1380 15123 15559 1035 -15894 -16106 1057
495A057J5200j662j4333j4138j548J5442J6953p6j6684j3960Q38J3968J5625J747
$$ 1057 16257 14595 262 -13876 -15424 18 16971 16895 211 -13749 -12911 1057 16682 18429
509A8429j6193j6609J851J5100J3583M90j3887j6335r06J6500J4584j529j4515
$$ 18429 2236 -14373 -12522 2578 16161 16651 2764 -13571 -14477 2023 16607 15078 563
522E63j3809j511J4747J6638q86j6345j3240L75J3597J4558J350j5411j5839J598
$$ 563 -13246 -14757 -10 16628 15742 -603 -13843 -13468 129 14687 16037 626 -15213 -13615
536a3615J4719J2985N27j3646j5850o21J5926J4546j496j3889j3407j227J3975
$$ -13615 1104 14089 14616 970 -14880 -15501 425 14971 13475 -414 -13821 -15048 -1073
549a073J6192l98j5578j3049M77J2841J4840J656j5105j5396J390J4472J2827
$$ -1073 15119 14721 -857 -13906 -13429 -588 14252 15908 803 -14593 -13203 1269 14096
562A4096J88j2716j5381q08J5174J4295j481j3314j3394j327J3433J5388k27j4930
$$ 14096 14284 1568 -13813 -14621 553 14848 13367 53 -13341 -14668 -1235 14153 13926 -1004
576a004j3030N09J2651J3846J685j4498j4704J157J4053J2426M56j1960j4887
$$ -1004 -14034 -13525 -874 12972 14657 159 -14545 -13388 665 13091 13547 1587 -13300
589a3300j138J4826J3773r93j2845j2750j420J3120J4835R8j4654j2625N58J2145
$$ -13300 -14438 388 14161 13168 323 -12427 -13847 -727 14108 14206 -448 -13073 -12515 -370
603c70J3629J455j3806j4457Q95J3562J2124Q27j2280j4390j088J4553J3153q26
$$ -370 13259 14714 908 -13549 -12654 908 13032 13859 1579 -12811 -13899 654 13807 12981
617A2981j2338j2608j426J2689J4173R8j3827j2466M58J1583J3222J507j3224
$$ 12981 643 -11965 -13391 -702 13471 13569 -258 -12724 -12266 -683 12539 14046 822
630H22j3940J003J2810J2006P59j1816j3755p65J3865J2634r39j1871j2122j567
$$ 822 -13118 -12115 695 12701 13460 1644 -12111 -12876 989 13623 12684 813 -11309 -12876
644a2876J2210J4103N4j3761j2249M41J1393J2548J675j3027j3876J031J2561
$$ -12876 -666 13437 13491 -270 -12519 -12078 -685 11863 13538 511 -13365 -12334 227
657B27J1371R14j1319j3618r36J3078J2691j028j1312j1800j075J1268J3919K92
$$ 227 11598 12512 1193 -12425 -13361 -283 12408 11380 68 -11732 -12807 -1539 12380 12672
671A2672j3031j1889M5J1176J2196J531j2328j2920L42J1798J1437J017j1043
$$ 12672 -359 -12248 -12203 -1027 11169 12700 372 -12548 -12206 -408 11029 12046 1003
684A003j3116r48J3174J1904n33j1042j1386j607J1218J3339L26j2607j1321L15
$$ 1003 -12113 -13061 113 12017 11484 442 -10944 -12551 -1333 12006 12332 -275 -11596 -11281
698a1281J0221J2199J379j2159j2698N76J1609J0927P72j0626j2820q38J2720
$$ -11281 -1060 11139 12518 359 -12339 -11763 -154 10773 11545 919 -11901 -12739 -19
711a9J1736n20j1031j0950j403J1019J2858L16j1936j1315J03J0110J1921J676
$$ -19 11717 11197 166 -10784 -12187 -1168 11690 12006 70 -11245 -11142 -1032 10889 12565
725A2565j1902j2388M60J1177J0857M50r997j2328j033J2181J1745n62j0586j0928
$$ 12565 663 -11725 -11265 -88 10769 11219 1222 -11106 -12139 42 11787 11225 639 -10289
739a0289j488J0796J2776J85j2030j0478q1R993J1477J409j1464j2151L09J1203
$$ -10289 -11777 -981 11795 11980 -50 -10528 -10609 -616 10861 12270 806 -11345 -11036 167
753A67J0334O95j0025j2092r97J1587J1327n53r980j0636j437J0557J2227M9j1119
$$ 167 10501 11196 1171 -10921 -11918 -331 10996 10443 463 -10173 -11610 -1053 11174 11223 104
768A04j0645l89R957J1064J468j1085j1558M94J0547J0162P52r199j2001j271
$$ 104 -10541 -10930 -973 10091 11559 474 -11084 -10590 -43 10119 10871 1672 -10329 -11600
782a1600J1546J0866l49j0090j0108j477J0492J1444L16j0816j0249k96R278J0921
$$ -11600 -54 10812 10463 373 -9735 -11212 -720 10724 11040 224 -10025 -10321 -1043 9878
796I878J830j1146j1390L38J0482R997Q00r704j1357j112J1065J0550m30r596
$$ 9878 11708 562 -10828 -10490 -8 9989 10789 1085 -10272 -11384 -319 10231 9801 205
810B05j0057j116R480J1766P2j0563j0208N2R155J0666J459j0263j1249N36R970
$$ 205 -9852 -10968 -1488 10278 10350 -213 -10421 -10369 -1214 9452 10911 648 -10601 -10065 -95
825i5R507J005r284j1175j085J0892J0124j13r583r410j389R354J1053L45j0144
$$ -95 9412 10417 1133 -10042 -11127 -235 9889 9776 193 -9217 -10606 -1252 9801 10146 2
840Br761m2Q556J0639J065r863j0531R1R582R255J155q954j0729j002J0285J0097
$$ 2 -9759 -9801 -1245 9394 10459 596 -9935 -9844 -262 8993 10148 1194 -9535 -10537 -252 9845
856I845l71r077r257j454R284J0679K53r609r590J57Q102J0334J379r515j0764
$$ 9845 9474 397 -8860 -10314 -1030 9649 9902 293 -9297 -9140 -1038 9296 10675 1160 -9604
871i604L12R458R334O58q518j0325j132R823R819p0r007r202j425Q646J0259O55
$$ -9604 -9292 166 9500 10158 1640 -8685 -9817 6 9825 9755 748 -8454 -9879 -1233 9026 9681
887I681r763r315j4P968R659J603r317j0589L42R111Q698Q34q320r890j032R816
$$ 9681 -82 -9397 -9411 -1443 8216 9819 502 -10087 -9745 -634 8064 8898 578 -9312 -10344 -528
903e28R323j39q366q800j389Q570R973N26r559q777J23P905R199J487q962j0007
$$ -528 8795 8656 290 -8510 -9899 -1329 8644 9170 -389 -9166 -9043 -1138 8061 9548 586 -9421
919i421L39Q994Q629N65p657r965r99R493R370j30q356q678j297Q181R695O75
$$ -9421 -9082 -88 8541 9106 1449 -8516 -9515 -22 9348 9218 862 -7816 -9113 -932 8763 9438
935I438r092r015m3P561R169J530q862r678L11Q547Q111R87p589r467j095R060
$$ 9438 346 -8669 -8712 -1151 8018 9548 686 -8992 -8681 -134 7977 8964 1375 -8092 -9187 -127
951a27Q926N53q152q830j046P697R842L39q758q418o4P105Q882J234q457r397
$$ -127 8799 9352 1200 -7630 -8676 -979 8863 9202 444 -7974 -8038 -933 7949 9183 726 -8671
967h671k48Q399Q501N00p393r169r96Q682Q497J20p405q194j269P698R425L54
$$ -8671 -8919 -520 7981 8481 1088 -8081 -9077 -395 8102 8222 817 -7377 -8646 -948 8477 8831
983H831q794q156o15P426Q838J435q420q891j72Q030P704J342p482q726r37Q532
$$ 8831 37 -8119 -8734 -1308 7530 8965 545 -8346 -8518 -488 7216 8558 1076 -7650 -8587 -55
999e5Q525L01p808q026j125P504R181M85q281p926o22O912Q663J321q161q866
$$ -55 8470 8771 963 -7063 -8188 -684 8497 8982 701 -7225 -7847 -935 7728 9049 888 -7978
1015g978j89P706P814P55o976q921q42Q111Q299K62p563p809j064P404Q822P64
$$ -7978 -8167 -461 7353 8108 1132 -7789 -8631 -520 7779 8041 478 -7331 -8395 -991 7831 8595
1031H595q382p584l95O589Q458J265p775q591m09P632P614R84o913q481j178Q102
$$ 8595 213 -7371 -7766 -1177 7281 8546 771 -7820 -8229 -597 7017 8001 1088 -7393 -8571 -469
1047d69Q262K77p096p679j535P251Q779Q74q225p223p35O521P887J397p202q581
$$ -469 7793 8070 974 -6705 -8240 -989 7790 8664 439 -6784 -7519 -998 6889 8286 1084 -7497
1063g497o83P591P431Q08o547q265r36P559Q073j95o372p647j034O745Q681L01
$$ -7497 -8180 -589 6842 7650 1103 -7162 -8098 -539 7534 7339 967 -6680 -7714 -969 7712 8013
1079H013p173p929k44O641P697J115p229q363R0O973P057J052o569p987r57P520
$$ 8013 840 -7089 -7333 -692 7005 8120 891 -7472 -7382 -409 6648 7700 1131 -6856 -7813 -293
1095b93P299P6o705o868j093O746Q061O06p536p203l95O457P431J433p249p885
$$ -293 7006 7082 377 -6491 -7584 -838 7223 7829 293 -6910 -7305 -848 6583 8016 767 -7118
1111g118l58P069O815R89o744p391j238P480P270K61o385p050j077O387Q210L62
$$ -7118 -7476 -407 6408 7397 653 -6738 -7976 -496 6774 7035 650 -6400 -7477 -1090 7120 7482
1127G482o915p204l51O020P475J003o544p707m09O840O590R94o166p449j035P011
$$ 7482 567 -6637 -6988 -968 6507 7510 966 -6741 -7150 -310 6280 7274 1108 -6341 -7376 -365
1143c65P170J37o292o651j397O227P691J061p101o932l11N926O890J440o729p572
$$ -365 6805 6942 650 -6001 -7398 -1171 6520 7581 480 -6452 -6763 -837 6053 7493 764 -6808
1159f808j74O589O697P90o067p602p47O718P268J79o041o599j242O193P422P84
$$ -6808 -6982 -393 6304 7094 1027 -6575 -7322 -604 6664 6843 802 -5797 -7039 -846 6576 7360
1175G360p030o745l08N808O891J286o558p280j33O420O361N44n630p053q92O653
$$ 7360 330 -6415 -6723 -915 5976 7262 704 -6576 -6709 -289 6072 6616 986 -6067 -6959 -306
1191c06O708K69o000o512j145O184P182N13o491o621k43N507O699J279o464p150
$$ -306 6402 6671 671 -5841 -6986 -802 6380 6893 402 -6219 -6462 -955 5744 7023 559 -6591
1207f591j56O490O219N88n573o950j122O464O862J73n548o712p28N595O983P34
$$ -6591 -6747 -257 5962 6550 977 -5973 -7095 -631 6231 6404 856 -5856 -6584 -989 5994 6728
1223F728o554o297m40N763O436J365o134o931n21O181O316O28n268o963j023O259
$$ 6728 174 -6123 -6563 -800 5636 7001 867 -6064 -6585 -404 5912 6540 1272 -5691 -6714 -455
1239d55O594J40n678n702j245N532O874M64n981o202p28N411O434J278o159o752
$$ -455 6139 6279 601 -5101 -6346 -814 6060 6524 543 -5659 -6387 -976 5458 6736 577 -6175
1255f175l35N949O027P80n342o758o79N884O511L11n260o404r61N393O785O82
$$ -6175 -6510 -561 5466 6246 904 -5854 -6533 -649 5862 6173 913 -5491 -6452 -1059 5726 6408
1271F408n995o072n64N413O263J152o109o550j74N441O139R20n545o405j032O243
$$ 6408 413 -5659 -6223 -810 5453 6605 496 -6054 -6228 -787 5352 6272 727 -5678 -6710 -467
1287d67O214L35n323o034r65N260O671P53o060n794n86N101O092J065n679o360
$$ -467 5747 6082 759 -5275 -6240 -980 5691 6444 384 -5410 -5996 -895 5197 6262 583 -5777
1303e777l07N489N851Q48n152o368q61N574O259M51n346n547r56M969O317Q10
$$ -5777 -6084 -595 5256 6104 952 -5416 -6277 -703 5556 6007 661 -4886 -5842 -873 5444 6254
1319F254n635n968l87M899N958J239n814o313k76N479N608O31m810o174j267N900
$$ 6254 619 -5349 -5736 -837 5121 6360 546 -5767 -6043 -564 5044 5675 865 -5309 -6576 -676
1335f76N994K11m957n597j333N199O668J50n299n752m14M565O138J041n296o295
$$ -676 5318 5529 572 -5025 -6358 -1159 5509 5659 360 -5392 -5806 -1241 4897 5938 642 -5653
1351e653l27N583N271N50m760n729j139N687N553O75m839n569q29M881O166N61
$$ -5653 -5980 -397 4874 5424 664 -5065 -6204 -517 5036 5711 872 -4697 -5526 -645 5521 6082
1367F082n448n310q67M991N425J337n149n882m88M903N416Q04m712n987q17M994
$$ 6082 634 -4676 -5543 -552 4873 6210 1061 -4821 -5309 -406 5010 5814 1102 -4885 -5702 -708
1383g08N987L4m532n414r51M456N937P00m908n431p15M688N540J184n278n754
$$ -708 5279 5313 781 -4633 -5584 -1128 4809 5509 601 -4830 -5545 -857 4683 5867 589 -5165
1399e165l34M995M956Q36m657n639p97N248N405K35m542n213r06M734N960L65
$$ -5165 -5499 -504 4452 5288 631 -5008 -5805 -557 4848 5083 541 -4672 -5578 -844 5116 5481
1415E481m921n312p38M436N556J325n251n673k82M792M751J029m386n582o71N053
$$ 5481 560 -4752 -5490 -1054 4502 5827 576 -5097 -5379 -587 4164 5193 807 -4775 -5446 -393
1431c93N154N82m907n143o35M403N775N23m838n230l73M542N377O60m817n142
$$ -393 4761 5343 436 -4707 -5342 -939 4836 5359 521 -4709 -5082 -540 4837 5497 680 -4462
1447d462p19M871M976N20m057n562r61N056N181M33m625m856r69M533N307P48
$$ -4462 -5181 -310 4666 5186 1129 -4433 -5394 -338 4843 5276 651 -4205 -5174 -641 4666 5414
1463E414m941m809o12M073N326R57m584n421m19M281N007Q61m053n520j111M924
$$ 5414 473 -4336 -4948 -875 4451 5408 824 -4597 -5016 -735 4272 5133 1080 -4440 -5551 -627
1479f27N093M47m247n092q72M406N335Q24m854m681p10M278M988J017m499n275
$$ -627 4466 4913 666 -4426 -5298 -892 4443 5267 413 -4268 -4978 -700 4288 5305 806 -4469
1495d469k65M280M941P30m008n386r29M467N287K58m259m726r35L899N699O25
$$ -4469 -4734 -454 4487 5217 1209 -4177 -5106 -639 4648 4906 647 -4079 -5014 -1115 4584 5209
1511E209m815m671n41M272M674J006m170n385m66M566M369R67m064n489n51M538
$$ 5209 394 -4277 -4818 -546 4128 5134 964 -4421 -4887 -321 4048 5015 951 -4538 -5089 -551
1527e51M665N80m029m876o22L954N273O81m812m608n7L521M950R62m187m908p02
$$ -551 4114 4694 665 -4211 -4833 -879 4394 5075 263 -4345 -4402 -881 4069 5031 844 -4064 -4766
1544d766M343M532R82m151n036m96L986M527R30m356m312j121M189N088L64m107
$$ -4766 -423 4109 5091 940 -4096 -4592 -606 3921 4851 495 -3817 -4938 -749 4339 4703 596
1560E96m620p87L779M910Q62l907n089n01M364M261O86l675m847q03M225M609
$$ 596 -4024 -4811 -1032 3878 4740 833 -4256 -4757 -393 3868 4554 879 -3968 -4771 -546 4063
1576D063M51m087m094j068L924M765Q91m247m651j11L505M479P89l808m744p94
$$ 4063 4514 427 -3667 -4735 -811 3954 4845 598 -4053 -4164 -659 3820 4609 801 -3943 -4737
1592d737M173M237Q72l566m398j286M178M304Q68m194m071r74L949M630P52m135
$$ -4737 -564 3673 4545 979 -3419 -4705 -527 3777 4645 451 -3620 -4594 -645 3985 4737 602
1608F02m459o08L708M730P79l813m675o62L767M610L35l808m361q03M141M600
$$ 602 -3857 -4465 -757 3973 4752 939 -3736 -4398 -631 3979 4314 506 -3855 -4658 -517 4083
1624D083K72l642m113r63L697M655Q10l835m657m11L561M254Q51l829m864k66
$$ 4083 4355 713 -3400 -4363 -666 3989 4799 964 -3693 -4104 -543 3711 4562 733 -4131 -4397
1640d397M011M236O51l810m404n68L650M489L51l534m115o63L400M337Q71m079
$$ -4397 -386 3850 4501 691 -3713 -4281 -631 3858 4209 675 -3440 -4103 -703 3634 4505 426
1656D26m347k55L511M280J002m134m167l73L387M310L98l063m495j053L888M220
$$ 426 -3921 -4176 -665 3615 4617 483 -3684 -4057 -670 3640 4038 975 -3520 -4573 -685 3535
1672C535N14l398m174q51L561M600N52l756m093n60L086M455Q03l539m355m73
$$ 3535 4049 651 -3523 -4374 -813 3787 4339 583 -3510 -4070 -984 3471 4274 735 -3620 -4093
1688d093L639L668R13l362m436p75L704M488M09l591m103o06L268M439R25l916
$$ -4093 -454 3214 4127 765 -3671 -4446 -742 3746 4155 564 -3539 -4145 -877 3562 4487 571
1704E71m257l87L233M199P66l654l892q25L585M182N89l343m282l52L284L989
$$ 571 -3686 -4073 -840 3359 4125 471 -3421 -4246 -661 3521 4110 767 -3515 -3867 -583 3406
1720C406O00l398l747j051L497M243O42l591l961n38L390M126P94l355m351n21
$$ 3406 4006 608 -3139 -4190 -693 3550 4192 601 -3360 -3898 -508 3618 4412 1057 -3294 -3815
1736c815L283L851Q81l298m202q31L691L855L72l165l906p74L265M129O36l338
$$ -3815 -532 3319 4200 902 -3300 -4131 -440 3415 3787 622 -3284 -4058 -793 3336 3972 634
1752F34m099l28L083L988R18l633l918l73L060L838N09k871m263p30L300M199
$$ 634 -3465 -3793 -710 3278 4196 563 -3355 -3728 -668 3170 3679 808 -3455 -4185 -885 3314
1768C314L72l154l555q04L069M046O69l522l406r05K913L751J077l280l985l59
$$ 3314 3686 532 -3023 -3827 -758 3288 3957 435 -2971 -3876 -963 2788 3865 585 -3400 -3759
1784c759L188L713M99k921l945q45L379L736O52l301l306q79L175L723N87l287
$$ -3759 -571 3142 3641 720 -3225 -4070 -691 3045 3697 396 -2910 -3789 -614 3109 3696 409
1800D09l529n37K938L816O66k871m112m21L150L698N33l040l569j005L442L722
$$ 409 -3120 -3657 -719 3097 3763 892 -3220 -3641 -491 3207 3740 700 -2869 -3874 -432 3290
1816C290M55k809l979m07K989L548N61k911l926l52L030L520P33k939l912l98
$$ 3290 3745 936 -3043 -3450 -461 3087 3648 737 -3189 -3541 -511 3009 3742 803 -3109 -3507
1832c507K992L337O62k859l587n82L098L300N64k864l567p19K699L982L31k856
$$ -3507 -515 2822 3484 625 -2962 -3544 -446 2854 3418 554 -3013 -3732 -1033 2949 3280 424
1848D24l806j01K904L251J106k905m033n62L310L267O04k660l658o83K992L271
$$ 424 -3382 -3483 -579 2672 3778 873 -3160 -3722 -412 2855 3459 799 -2859 -3542 -550 2721
1864B721P12k855l479n60K779L576O72l165l356l70K709L075J009k835l473o32
$$ 2721 3433 578 -2901 -3461 -682 2894 3566 401 -2955 -3325 -616 2459 3468 633 -2840 -3472
1880c472L045L222P00k778l652k08K730L264O24k970l429m27K664L390Q87k984
$$ -3472 -427 2795 3495 717 -2935 -3143 -413 2851 3475 505 -2924 -3351 -687 2703 3590 606
1896F06l352m55K745L238J015k973l562o70K668L646M95k730l374o17K949L234
$$ 606 -2746 -3201 -456 2782 3797 824 -2738 -3408 -740 2906 3401 671 -2703 -3320 -371 2863
1912B863M04k681l276o70K543L701P24l186l220m49K690L088R92k656l674m62
$$ 2863 3267 586 -2690 -3360 -817 2884 3608 422 -2798 -3247 -557 2531 3523 867 -2807 -3269
1928c269K747L338N43k784l281k98K592L238L15k536k986p31K364L514N67k870
$$ -3269 -522 2816 3359 575 -2706 -3004 -412 2826 3141 605 -2381 -3112 -748 2766 3333 463
1944D63l046m40K543L241P21k682l437n82K624L200Q14k562l490m16K702L164
$$ 463 -2583 -3023 -480 2761 3482 800 -2637 -3219 -595 2605 3419 857 -2633 -3049 -347 2817
1960B817L62k590l048o17K307L302Q19k817l126m44K573L055P82k810k917p06
$$ 2817 3179 589 -2459 -3076 -769 2533 3352 535 -2591 -3035 -462 2593 3375 565 -2352 -3058
1976c058K492K978Q94k580l437m57K484L279M98k345l169n84K576L110M22k732
$$ -3058 -566 2412 3306 726 -2711 -3168 -684 2595 3093 748 -2421 -3005 -429 2681 3103 371
1992C71k744m75K360K814R67k803k965n16K735K801M88k387k939p50K299L199
$$ 371 -2373 -2848 -488 2326 3293 490 -2475 -2991 -256 2545 3033 646 -2293 -3043 -744 2455
2008B455N45k356k964n99K403K904O75k590k879m34K345L152M95k444l259k58
$$ 2455 3000 644 -2320 -2919 -516 2388 3063 473 -2406 -2840 -495 2657 3152 708 -2551 -2809
2024b809K404K667M06j981l165p08K780K768N56k500k639p33K195L188O19k633
$$ -2809 -405 2262 2668 687 -2478 -3186 -406 2362 2918 418 -2221 -2954 -759 2429 3048 415
2040D15k903l72K331K800Q23k712k834n86K429L121M74k520k713l98K271K757
$$ 415 -2488 -2860 -529 2271 3094 382 -2452 -3038 -609 2512 2986 466 -2247 -2645 -374 2383
2056B383O08k271l058o20K328K859P42k306k934l21K236K630O45k173l241K7K060
$$ 2383 2991 720 -2338 -2958 -630 2229 2971 665 -2269 -2590 -354 2276 2921 748 -2493 -2466 -406
2073d06K648Q33k502k727p25K406K890L67k167k722p98K296K843P95k601k708
$$ -406 2242 3075 573 -2154 -2879 -473 2417 2784 617 -2105 -2903 -607 2236 3031 430 -2278
2089b278m64K199K600Q01k372k746m40K275K735K25j734l052o95K518K749M21
$$ -2278 -2742 -543 2057 2858 486 -2260 -2700 -425 2310 2535 801 -2251 -2946 -428 2321 2742
2105B742k321k701l19J991K951N77k526k538p30K148K609P91k277k822l29K134
$$ 2742 421 -2280 -2599 -608 2343 2920 394 -2144 -2874 -726 1883 2674 397 -2425 -2754 -620
2121f20K850M14k191k506o32K245K439O13k125k488o19K061K530O86k099k851
$$ -620 2230 2644 453 -2053 -2685 -440 1999 2612 487 -2001 -2620 -559 1971 2657 558 -2293
2137b293l47J951K603O12k118k390n48J904K725L49k098k702m63K232K654J34
$$ -2293 -2640 -689 1914 2526 408 -1982 -2530 -626 2099 2448 350 -2352 -2815 -583 2071 2205
2153B205j831k437p48K231K607L98j959k705k10J869K741N10k276k414m32J893
$$ 2205 374 -2063 -2811 -580 2027 2425 466 -2239 -2449 -580 2161 2671 395 -2019 -2451 -558
$$ [...]
8191B48
##END NTUPLES=NMR FID
##END=
