##TITLE=1H_SA_56.230
 DMSO-d6, 108 sc, 
 2.9.2020
##JCAMPDX= 6.0         $$ Bruker NMR JCAMP-DX V2.0
##DATA TYPE= NMR FID
##DATA CLASS= NTUPLES
##ORIGIN= UXNMR, Bruker Analytische Messtechnik GmbH
##OWNER= root
$$ XWIN-NMR		Version 3.5
$$ Wed Sep  2 09:03:14 2020 Russian Standard Time (UT+4h)  she@DPX200
##.OBSERVE FREQUENCY= 200.1315066352
##.OBSERVE NUCLEUS= ^1H
##.DELAY= (6, 6)
##.ACQUISITION MODE= SIMULTANEOUS
##.ACQUISITION SCHEME= undefined
##.AVERAGES= 108
##.DIGITISER RES= 18
##SPECTROMETER/DATA SYSTEM= spect
##.PULSE SEQUENCE= zg30
##.SOLVENT NAME= DMSO
##.SHIFT REFERENCE= (INTERNAL, DMSO, 0, 15.7039)
##AUDIT TRAIL= $$ (NUMBER, WHEN, WHO, WHERE, WHAT)
$$ ##TITLE= Audit trail, XWIN-NMR		Version 3.5
$$ ##JCAMPDX= 5.01
$$ ##ORIGIN= Bruker BioSpin GmbH
$$ ##OWNER= she
$$ F:/spectra/data/she/nmr/H-F/1/audita.txt
$$ ##AUDIT TRAIL=  $$ (NUMBER, WHEN, WHO, WHERE, WHAT)
(   1,<2020-09-02 09:01:36.89 +0400>,<she>,<DPX200>,
      <continue with go, POWCHK disabled, PULCHK disabled
       configuration hash MD5:
       00 E9 B6 7A A2 85 ED C7 34 08 36 98 17 FE 4E 26
       data hash MD5: 16K
       10 14 5C F4 7C F5 79 A0 D6 5A 82 A8 1E DB 57 AB>)
$$ ##END=
$$ 
$$ hash MD5
$$ BC CC 41 72 FA 51 34 CA B0 C8 5D C0 B7 F8 D4 72
##$RELAX= 
##$RELAX= 
##$RELAX= 
##$RELAX= 
##$RELAX= 
##$RELAX= 
$$ Bruker specific parameters
$$ --------------------------
##$DU= <F:/spectra>
##$EXPNO= 1
##$NAME= <H-F>
##$PROCNO= 1
##$TYPE= <nmr>
##$USER= <she>
##$AMP= (0..31)
100 100 100 100 100 100 100 100 100 100 100 100 100 100 100 100 100 100 
100 100 100 100 100 100 100 100 100 100 100 100 100 100 
##$AQSEQ= 0
##$AQ_mod= 1
##$AUNM= <au_zg>
##$AUTOPOS= <>
##$BF1= 200.13
##$BF2= 200.13
##$BF3= 200.13
##$BF4= 200.13
##$BF5= 200.13
##$BF6= 200.13
##$BF7= 200.13
##$BF8= 200.13
##$BYTORDA= 1
##$CFDGTYP= 0
##$CFRGTYP= 5
##$CHEMSTR= <none>
##$CNST= (0..31)
1 1 145 1 1 1 1 1 1 1 1 1 1 1 1 1 1 1 1 1 1 1 1 1 1 1 1 1 1 1 1 1 
##$CPDPRG= <>
##$CPDPRG1= <>
##$CPDPRG2= <>
##$CPDPRG3= <>
##$CPDPRG4= <mlev>
##$CPDPRG5= <mlev>
##$CPDPRG6= <mlev>
##$CPDPRG7= <mlev>
##$CPDPRG8= <mlev>
##$CPDPRGB= <>
##$CPDPRGT= <>
##$D= (0..31)
0 1.2 0 0 0 0 0 0 0 0.06 0 0.03 0 0 0 0 0.0002 0 0 0 0 0 0 0 0 0 0 0 0 
0 0 0 
##$DATE= 1599022460
##$DBL= (0..7)
120 120 120 120 120 120 120 120 
##$DBP= (0..7)
150 150 150 150 150 150 150 150 
##$DBP07= 0
##$DBPNAM0= <>
##$DBPNAM1= <>
##$DBPNAM2= <>
##$DBPNAM3= <>
##$DBPNAM4= <>
##$DBPNAM5= <>
##$DBPNAM6= <>
##$DBPNAM7= <>
##$DBPOAL= (0..7)
0.5 0.5 0.5 0.5 0.5 0.5 0.5 0.5 
##$DBPOFFS= (0..7)
0 0 0 0 0 0 0 0 
##$DE= 6
##$DECBNUC= <off>
##$DECIM= 32
##$DECNUC= <off>
##$DECSTAT= 4
##$DIGMOD= 1
##$DIGTYP= 9
##$DL= (0..7)
0 120 120 120 120 120 120 120 
##$DP= (0..7)
150 150 150 150 150 150 150 150 
##$DP07= 0
##$DPNAME0= <>
##$DPNAME1= <>
##$DPNAME2= <>
##$DPNAME3= <>
##$DPNAME4= <>
##$DPNAME5= <>
##$DPNAME6= <>
##$DPNAME7= <>
##$DPOAL= (0..7)
0.5 0.5 0.5 0.5 0.5 0.5 0.5 0.5 
##$DPOFFS= (0..7)
0 0 0 0 0 0 0 0 
##$DQDMODE= 0
##$DR= 18
##$DS= 0
$$ [...]
##$SUBNAM2= <"">
##$SUBNAM3= <"">
##$SUBNAM4= <"">
##$SUBNAM5= <"">
##$SUBNAM6= <"">
##$SUBNAM7= <"">
##$SUBNAM8= <"">
##$SUBNAM9= <"">
##$SW= 16.880792210976
##$SWIBOX= (0..15)
0 0 2 0 0 0 0 0 0 0 0 0 0 0 0 0 
##$SW_h= 3378.37837837838
##$TD= 16384
##$TD0= 1
##$TE= 0
##$TE2= 300
##$TE3= 300
##$TEG= 300
##$TL= (0..7)
0 120 120 120 120 120 120 120 
##$TP= (0..7)
150 150 150 150 150 150 150 150 
##$TP07= 0
##$TPNAME0= <>
##$TPNAME1= <>
##$TPNAME2= <>
##$TPNAME3= <>
##$TPNAME4= <>
##$TPNAME5= <>
##$TPNAME6= <>
##$TPNAME7= <>
##$TPOAL= (0..7)
0.5 0.5 0.5 0.5 0.5 0.5 0.5 0.5 
##$TPOFFS= (0..7)
0 0 0 0 0 0 0 0 
##$TUNHIN= 0
##$TUNHOUT= 0
##$TUNXOUT= 0
##$USERA1= <user>
##$USERA2= <user>
##$USERA3= <user>
##$USERA4= <user>
##$USERA5= <user>
##$V9= 5
##$VALIST= <valist>
##$VCLIST= <CCCCCCCCCCCCCCC>
##$VD= 0
##$VDLIST= <DDDDDDDDDDDDDDD>
##$VPLIST= <PPPPPPPPPPPPPPP>
##$VTLIST= <TTTTTTTTTTTTTTT>
##$WBST= 1024
##$WBSW= 4
##$XGAIN= (0..3)
0 0 0 0 
##$XL= 0
##$YL= 0
##$YMAX_a= 1018086
##$YMIN_a= -1049454
##$ZGOPTNS= <>
##$ZL1= 120
##$ZL2= 120
##$ZL3= 120
##$ZL4= 120
##$ABSF1= 10
##$ABSF2= 0
##$ABSG= 5
##$ABSL= 3
##$ALPHA= 0
##$AQORDER= 0
##$ASSFAC= 0
##$ASSFACI= 0
##$ASSFACX= 0
##$ASSWID= 0
##$AUNMP= <proc_1d>
##$AZFE= 0.1
##$AZFW= 0.1
##$BCFW= 1
##$BC_mod= 2
##$BYTORDP= 1
##$COROFFS= 0
##$CY= 11.3945322036743
##$DATMOD= 1
##$DC= 2
##$DFILT= <>
##$DTYPP= 0
##$F1P= 16.9975609425685
##$F2P= -3.02152046262296
##$FCOR= 0.5
##$FTSIZE= 0
##$FT_mod= 4
##$GAMMA= 1
##$GB= 0.15
##$INTBC= 1
##$INTSCL= 1
##$ISEN= 128
##$LB= 0.24
##$LEV0= 0
##$LPBIN= 0
##$MAXI= 10000
##$MC2= 0
##$MEAN= 0
##$ME_mod= 0
##$MI= 1.114404
##$NCOEF= 0
##$NC_proc= 0
##$NLEV= 6
##$NOISF1= 3.799351
##$NOISF2= 2.8
##$NSP= 1
##$NTH_PI= 0
##$NZP= 0
##$OFFSET= 15.70392
##$PC= 1
##$PHC0= -9983.878
##$PHC1= 22.6009
##$PH_mod= 1
##$PKNL= yes
##$PPARMOD= 0
##$PSCAL= 0
##$PSIGN= 0
##$REVERSE= no
##$SF= 200.130013532006
##$SI= 16384
##$SIGF1= 3
##$SIGF2= 2
##$SINO= 400
##$SIOLD= 16384
##$SREGLST= <1H.CDCl3>
##$SSB= 0
##$STSI= 0
##$STSR= 0
##$SW_p= 3612.71676300578
##$SYMM= 0
##$S_DEV= 0
##$TDeff= 0
##$TDoff= 0
##$TI= <>
##$TILT= no
##$TM1= 0
##$TM2= 0
##$TOPLEV= 0
##$USERP1= <user>
##$USERP2= <user>
##$USERP3= <user>
##$USERP4= <user>
##$USERP5= <user>
##$WDW= 1
##$XDIM= 8192
##$YMAX_p= 0
##$YMIN_p= 0
$$ End of Bruker specific parameters
$$ ---------------------------------
##NTUPLES= NMR FID
##VAR_NAME=  TIME,          FID/REAL,        FID/IMAG
##SYMBOL=    X,             R,               I
##VAR_TYPE=  INDEPENDENT,   DEPENDENT,       DEPENDENT
##VAR_FORM=  AFFN,          ASDF,            ASDF
##VAR_DIM=   8192,          8192,            8192
##UNITS=     SECONDS,       ARBITRARY UNITS, ARBITRARY UNITS
##FACTOR=    0.000296,      1,               1
##FIRST=     0,             0,               0
##LAST=      2.424536,      0,               0
##MIN=       0,             -1049454,        0
##MAX=       2.424536,      1018086,         0
$$ Real data points
##PAGE= N=1
##DATA TABLE= (X++(R..R)), XYDATA
$$ [...]
2586b608J717J740j359j80Q78K125p24j214O0J071N7k846Q12R05k85k070m2J397
2604e66J76j736n44L438N69r26k68J341O18j832k85J627j9j091k364K290J89j616
2622i99j344J474J589j883m14Q45J643j015r32J528K333k231k77J67J849n21l013
2639a201P19J973j902j687N16K088j151j727Q09K882j66k599J106J841q2j442
2655b3O62J831o91j456j353J491K14j268j618J578Q86j707j014K328M83p18J34
2672b41pK407j981P8P88j77L64k168J665Q40j946j789O52J424p53j072L55J987
2690D26j415M23r3J861M14j919Q44J507o6k413QJ409J14j687q86J484J15j995
2708a869k52J353N69K66j085J917Q65k572O15J316Q13j956m33M81J294j355o86
$$ y = [-2608, -891, 849, -510, -690, 188, 2313, 1589, 375, 435, 1506, 1563, -1283, -471, 434, 149, -1921, -1963, -566, -390, -2126, -2670, 768, 1337, 411, 143, 1484, 2102, 270, -15, 1612, 1593, 502, -1862, 428, 617, -999, -2343, -869, 720, -1163, -1577, -732, 911, -104, -1036, 492, 2825, 594, 317, 484, 2333, 1812, -1201, -482, 1491, -411, -2098, -1582, 506, -645, -2372, -1563, 1319, 1153, -1446, -340, 1501, 1419, -23, 639, 2470, 1779, 323, -1030, 461, 675, -593, -2211, -633, 253, -1454, -2468, -140, 343, -375, -241, -248, 2159, 178, 256, 1044, 867, 1231, -937, 728, 1568, -378, -2167, -1515, -91, -844, -1916, -1561, 426, -989, -566, -659, 1202, 1616, -303, 541, 2048, 1982, -431, -423, 986, 1100, -587, -1473, 11, 126, -1869, -2121, -768, -199, 67, -1018, 899, 1764, -808, -193, 1123, 1936, -20, -453, 28, 1322, -33, -719]
2725g19J36M82k057O07J039J36j47j0N06J580m95j407J042O34Lj769J385n5m88
2744D03j492n71K175r02j910Q25J979n68r71P11J023O57j449J06J513K62k100
2761c09k78J528M85j633j381J912l74j108l01L19O04q48P37M09J122q60j145J853
2779G32J647j072j665J811P02k334m32j34N04l68j547N86J266L43j782J475J856
2796A588m69j033l57J392Q85k332R04R99n32j471pn62Q48j089K83O86L63q27l02
2815a033J512o09J130r16J420N53j810j98J190L44j191p23M94L62j537j174Q74
2832a312N39J753l052K796M30q52l50K34J334m76j180R09L66k89j968P26P77j103
2850g18r69j94J589M56j662K91J845o3r59L29J252o01J80q60J135j65r81o77O9
$$ y = [-719, -583, -101, -2158, -1551, -512, -376, -523, -533, -27, 1553, 1058, -349, 693, 1327, 1330, -439, 946, 891, 403, -1089, -1660, 515, -387, -2297, -1472, 507, -61, -1032, -321, 702, 1359, -90, 16, 1529, 1791, -309, -587, 941, 1426, -207, -1588, 324, -50, -1158, -1459, -1140, -536, -1384, -647, -238, 884, 24, -1121, 732, 2379, 1307, -358, 1453, 2155, -179, -611, -745, -241, -609, -2156, -1570, -304, 39, -1743, -268, 1588, 1119, 86, -271, 1121, 2006, -326, 578, 1577, 1045, -426, -433, -995, -147, -1236, -953, -267, 96, -731, -1033, 479, -130, 1000, 84, 1504, 2057, 247, 49, 1239, 1583, 392, -331, 163, 525, -1012, -2186, -1312, -773, 980, -2072, 724, 1154, 302, -48, 186, 1520, 1044, -136, 773, 1139, 850, -1118, -392, 385, -718, -1687, -1881, -292, 164, -1498, -1207, 638, 575, -384, -55, 1197, 596, 776, -84, 1051, 886, -95, -772, -703]
2869g03J430k018o66J502R09j540J78J131M58n11p26J724M9k52j883K423Q33j938
2887D00p27M18R79n62k383P19Q03o54l90R73R81q60j033J232J208J22j23n40P36
2906A299O8j766k39J649j235r75l6Q8J328n56j236J321J106j612L28Q90J439l439
2924a578K717L77K26j706L26k19M98n15j547J160M81j103q60J290K29P27j523
2941a020R84M21Q9M0M9L35J78r74N11O04n88j119m40M89m53j86K40N67Q7j365
2961a551J153P28R3j216J630R06j350q5j546K391k9j834j6J068l31j413k02P13
2979h91Q97j230k60K233o3l67j51L57M49Q69k226Q69M63j330o55M34N66r84O3
2998i57m21Q52N26k65o77J840p28o99Q25n8J072j254J68J07p82k57R01p79O65
$$ y = [-703, 727, -1291, -1957, -455, 454, -1086, -908, 223, 681, 170, -556, 1168, 1217, 965, -918, 1505, 2338, 400, -327, 91, 1070, 508, -1875, -1156, -353, -1007, -1397, -424, 557, -303, -1336, -104, 1104, 1226, 1103, 563, 1299, 1367, -399, -638, 1011, -224, -1199, -1235, -1147, 181, -375, -1611, -290, 816, -796, -468, 422, 1861, -1578, 1139, 1516, 1742, 36, 362, 143, 641, 126, -1421, -261, 220, -883, -1743, -453, -224, 503, -1020, -36, 385, 474, 514, 563, 898, 1076, 102, 613, 1217, 629, -490, -930, -441, -894, -1080, -840, -273, -186, -1551, -398, 330, 423, -793, 837, 1743, 393, 308, -1238, 1153, 1124, -710, -726, 342, 11, -1402, -1604, -891, 6, -1224, -1484, 749, 686, 319, 168, 525, 974, 1843, -383, 486, 949, -381, -1036, -602, -36, -1020, -957, -1378, -526, 0, -265, -942, 898, 170, -529, 296, 238, 1310, 56, 224, 331, -451, -708, 193, -586, 79]
3017G9o59p71Q68R33q10r09K003j75l81m42J437O33j219j89j87P01o19j321O98
3036c30j59O37j495O37q54Q24j086J501O38l39k50M0J615n48j089Q38Q32r22j381
3055h91j00J163n47l86L20J77N3j110Q19R33n40O54l61L48J849r51r20l51N48
3074G07k78r78O98M49j396k04P8N54k95J13L1J029l47k68J266p18K16j91k56J526
3094A736j800m65R88l28m37l39Q3j09k02Ql22J522k0m07J87J44K29l08M34M0J74
3115H08n38L95j183P15j763N05O27M46j504L55J87J766o07p35Q52M99O5p20M57
3134F27m90J33J70N92n92m21q87M17m3l2J78j314K279n70q1n44J122J03m82m03
3154b38N50L39l35l90K1m98P59r88j25P72l27k9k48N56kj53J449o86q47R27M30
$$ y = [79, -580, -1351, -483, 450, -360, -1269, 734, 559, 178, -264, 1173, 1806, 587, 398, 211, 912, 293, -1028, -330, -489, 148, -1347, -710, -1564, -740, -1826, -325, 313, -26, -276, -236, 1379, 831, -258, 580, 1412, 490, -891, -991, 172, -375, -761, -441, -264, -211, -1321, -502, 431, -109, 545, 184, 532, 2381, 1430, 510, 159, 707, 429, -549, 149, 598, -798, -1002, -924, -370, -665, -552, -521, 508, 161, -107, 1159, 441, 657, 466, 210, 1736, -64, -529, 459, 131, -306, -645, -562, -671, -873, -865, -1187, 335, 315, -92, 95, 239, 468, 160, 594, 634, 808, 270, 665, -518, 197, -1566, -1061, -434, 12, -1492, -1137, -950, 816, 209, -526, 326, 825, 890, 170, 627, 137, 270, 440, 1032, 440, 19, -868, -451, -494, -526, -348, -1662, 617, 47, -34, -578, 544, 647, 165, -238, 312, 651, 316, -74, -53, -551, 208, -780, -905, -133, -460, -489, -737, -181, -183, -336, 1113, 427, -420, 507, 937]
3175I37n94R32j139J178r42j023K35l49J025j268J13L48P28m61o70J172R51j298
3193a25K55Q87n64j64P75j510J359j553J09j18M13l74o1o19Q18J82n12P55NJ067
3213A025j116O21q40q13K349n63k78l03p46N54N96p31l64k68O95P54q32L22R41
3232A003p37n26L11L81O59J31m96p08J352j396k42K88J88j11j107J10J074q54
3250f80M42l85J437m2l83M56o37J86l98L20n6R50j136l64j91J31j125L36R85L05
3270A51j414J799o61N33k86O67K92n99K4j524J655q8r15R48j256R49p73L45J23
3289c0J75o93R96j153k74R96j89J113m56L87m64r33L36J385j693P61q96k14J87
3308f59K24j08M4r99J499k26M20r33P41J40N64k28j01N01o98l19o83J858j206
$$ y = [937, 343, 1275, 136, 1314, 372, -651, -416, -765, 260, -1008, -895, -547, 181, -280, -950, 222, 1173, -125, 130, 1017, 453, 289, 1064, -446, 913, -640, -531, -649, -236, -610, -671, -1290, -472, -290, -802, -47, -42, 1025, -91, 530, -310, -1123, 1226, 663, 385, 82, -664, -110, 486, -245, -609, -877, -182, 572, -260, 62, 1003, 266, -260, 51, 432, 1091, 1222, 726, 18, 1370, -26, -268, 20, 208, 97, -1010, -900, 174, -680, -238, -623, 814, 772, 389, 845, 208, 394, -4, 316, 260, 1210, 74, -290, -481, -350, -1475, -1139, -154, 151, -1263, 536, -125, 408, 122, 789, 1081, 482, 506, -1018, 637, 549, -366, 582, -674, 275, -498, -153, -30, 145, -548, 448, -705, -979, 17, -172, 941, 485, 872, 408, -525, -189, 1196, -497, 264, -632, -846, -659, -435, -543, -499, -1498, 1, -225, 195, -738, 3, 143, 707, 479, 378, 879, 181, -138, -821, 1037, -169]
3327a69L9p96J594j365J96M10M55k94k31P11p56O87M06j238M27J497j505l31P54
3346D91o5j221J097k17n15l17L71K9K05L1P66o38J175J41l93j188Q23k70q74J70
3366c99P81j587K27N73m3j8m65O69o63P93K46o80P62J584j311j96J065q20q22
3385c04l88L64R32j994R50K55j70J0J67N89m57j18J47L82N21n46o43R08J428j641
3405C92k66L57r08N31q45N93N89o17K88r30K9O30M61j138J393J145k424J588O99
3424A567l16j381J99L54p35O1j86m62O32N85j583J888k46n46p86J480K34K43r43
3443E9N73M17m98q36J214j629O46m46M58p03Q53k90j228J160K21l30j58M79l29
3462c67Q01Q7R42j305j52M48M3p92j28M97j503J825K35j882J073R42j307J73O25
$$ y = [-169, -130, -926, 668, -697, -501, -91, 364, 70, -161, 550, -206, 481, 887, -351, 76, 1573, 68, -263, 491, 426, -795, 302, 85, -430, -747, -376, -347, -142, -111, 655, 17, 1192, 1333, 940, -248, 575, 305, -569, -399, 382, -1205, -978, -405, -448, -466, -931, -262, -925, -132, 114, -566, 196, 1780, 469, 273, 1338, 518, -304, -692, -328, 604, -1390, -440, -185, -355, -345, -178, 411, -46, -164, -17, 365, 886, 340, -303, 605, 2033, 392, 126, 483, -425, 106, -739, -146, 443, -174, 114, -816, -787, -157, 304, -834, 559, 1704, -720, 868, 1567, 1251, -130, 69, 423, -312, -251, -437, -899, -267, 318, -1265, 623, 377, -169, -955, 525, 759, 1002, 59, 632, 1049, 551, -285, 929, -700, -54, -500, -42, -745, 108, -182, -1410, -250, -29, -359, -517, -38, -367, 434, 521, 1463, 158, 6, 454, 497, -295, -423, 74, -1429, 396, 631, -1251, -178, 764, -543, -370, 255]
3481B55J177j895P41P7J99n42M81j57n82k0L43k56j19l6n7k21J5N01m11k91L09
3502d89M5R25M23O8r12K95P99j036P12n28m57j249J470m73o83P40K66j83j43R94
3522E84l24N73j80L80r93n1M55j30P5m23k24L5j42j23j084K009l42j550Q77N62
3542a6M48j334j97J401j15L98l49m45L50J370k45j551J46K1o13j65P46j80o46
3561i76M27Q50p03l7J546r5j614J429O51j425j05l20QO62p86K19k03M4K26J70
3581c2j37N49m09o05L89L68j25l34J362j523J602r43r13P09P31l23j723Q97P20
3600B60j319O05P09l21m89J775o6j482O70k12O18p59J388j687L6N77m12j200L52
3619i57P34q59R28L19L42o60M3j89J73k21J626j884L32O50k50k02K26K17j101
$$ y = [255, 1432, -463, 278, 355, 554, 12, 493, 336, -246, -266, 77, -179, -298, -334, -391, -612, -597, -96, -507, -798, -489, -444, 481, 904, 972, 60, 355, 1154, 118, 830, 302, -155, -1404, 66, -407, -1090, -350, -84, -267, -410, 584, 260, 833, 653, 1033, 40, -11, 444, 314, 389, -34, -258, -223, -365, -488, -1572, 437, 95, -1455, -578, -16, 432, -902, -1099, 302, 187, 585, 236, -209, 141, 1511, 1266, -285, -139, -118, -731, -896, -150, -330, -976, -549, 301, -402, -439, 1107, 1012, -602, 827, 1478, 53, -52, -372, -364, 298, -488, -269, -472, -428, -202, -32, -169, 380, -29, -634, -245, 123, -2, -336, 1026, -497, 1105, 162, -751, -42, 689, 366, -1357, -460, 260, -1059, -454, 255, -66, -555, 1220, 1154, -328, 342, 130, 748, -11, 1377, -310, -274, 303, -109, -1309, -957, -223, -1082, -154, 165, 507, -153, -110, -299, -126, -347, 1279, -605, -273, 377, 127, -75, 151, 368, -733]
3638g33k56J503j662M76J98K37l53J057j13q15K99P87j86J96K42l27j197J633
3656I86J68j813k59N55j4K28j18j43Q13q01N51K08j474J351n99K04l87J196o04
3675D8n09N45j130M45L14l72O36m94J237j054l12Q93j40j12M1Q99j468O62l72
3694b43J165j57l97O69j643K94J1k03Q5k02m11Q34o35O77m1L51M98r01L62K65
3714C78L90o78L25J523k714M68K53ll77Q89k88j19J84O36j048P1Q92k42n59J308
3734A289q04k03qM14j426J66R93n33n75j59J616j388o3P45q88k66J900p3j309
3753e72N99J91r5k08K41R7l12m9q50J289m70Q86j312N70N21p98m10R76J19J16
3773E29l27o0P8O5L17k57q78m12N96N64M58j368q92L51J188m27M84k35O85p49
$$ y = [-733, -989, 514, -1148, -672, -474, -237, -590, 467, 354, -461, -162, 625, 439, 635, 877, 550, -647, 986, 1154, -659, -918, -363, -377, -149, -267, -410, 403, -398, 153, 361, -1113, 238, -361, -157, -544, 652, 48, -461, 84, -1046, -601, -287, -659, -23, -517, 720, -334, -646, 247, 107, -5, 36, 935, -533, 129, -243, 922, 765, 368, 1037, -606, -312, -301, -504, -419, -621, -1032, -198, -833, -156, -197, 154, 652, -249, 113, 378, 768, 90, 415, 1938, -776, -308, -55, -58, -435, 454, 166, 47, 231, 867, -181, -110, 782, 540, -19, 1289, 485, 282, 274, 688, -738, -572, 421, -112, -687, -846, 770, -618, -681, 64, -824, -1090, 810, 737, -572, 27, 218, 123, -85, 156, 253, -59, -108, -958, 331, -139, 747, -565, 5, 526, -272, -682, 294, 413, 529, 202, 142, 220, 285, 602, 345, -533, -945, -349, 215, 673, -695, -1587, -1236, -48, -475, 9, -226, 459, -290]
3793b90K33N86Qj25m6J55r31N92n14N43q30R68p47K51Q61j467m22P86J351j197
3813b35j35L90k20O28K00N82r34p84J159p42m76K49L87q81N68L61j119J506L44
3832H48k91j002M50O16pn51m9j01m61O59P50j523J254n15j69l47K21J70J74l33
3852b07M10m54K25N60L49o75j11k45L40n18P99n37j77O9N44o31J100j701J021
3871A61l04k63L25j85K30R3L33k51Q43r41M13q30O14l86J30p37J45R58j44j261
3891a057J881j33r85q61J320J81L40o38n8k41P03p96O72O9K38j085m3j96M52J2
3911b25j13J53K52j042J064K45p8p88K27R97p68Q91o17l55O1L30l36J3j88M44
3931A67j345J73P94k92j38J504q93M45Q3o61k9M28r4m04o26J348j317O86P87n31
$$ y = [-290, -57, 529, 537, 412, 366, 521, -410, 182, -332, 211, -619, 349, -398, -147, 714, -753, -1175, -389, 962, -235, -370, 20, -200, 428, 628, 1210, 276, -508, 651, -91, -567, -318, 69, -812, -244, 117, -1002, 504, 848, 557, -445, 5, 621, 614, 63, 14, -87, -548, 111, 861, -662, 592, 77, -92, -439, -218, -48, 126, -207, 203, -251, -26, 534, 883, 208, 97, -148, 192, -326, 473, -64, -241, -172, 372, -259, 841, -860, 161, -143, -406, -81, -266, -36, 57, 390, 139, 982, 41, 454, -376, 238, -148, -18, -755, -610, 348, 204, -1057, 824, 691, -294, -1155, 165, 346, 686, 48, -10, -251, 452, -344, 328, 397, 635, -450, -493, -689, -237, -225, -338, -185, 67, -975, 89, 334, 256, -532, -305, 692, -76, 815, 198, -157, -96, 234, -102, -89, -277, 167, -1178, -1005, -211, -503, -641, 863, -30, 415, 498, -163, -192, 236, 142, -262, -888, 460, -857, -171, 616, 85]
3951H5j330J385q36R83Qk42J602k135P46r10N49m00m08J542j94N09j290j74j95
3970g05M91J30n33M03r57J536n12L28m83k90J236k1m10K05q84K15p61J727j127
3989d12L42K98p97K52n5K39o3R1M7j7N88K90r07N30K55m37o83J339o81J92J89
4010F00l46n13O44R0j24k51j05j06j27k99k00L23P21Lj22n79j21J001q7%K76m47
4032B31n60N06M25m73J97L15j424J179q48J423j784J682j12l81k03j18j201J576
4050D30n00k84J72m85M45j25k55N71nk04j82N8l14L90J313n94p04p24J679p34
4070e2r5k39J47m9K66r86J037O34r14p5O22n84m19J087k01L32j072P74L72n76
4090In45J5J108m65J45K00j055M48N65j218J380m33J59r96J512r54j99R57j000
$$ y = [85, -1245, 140, -696, 287, 295, 53, 1655, -480, 266, -644, -95, -495, -903, 639, 445, 954, -336, -510, -705, -214, -84, -617, -214, -1171, 365, -147, 181, -302, -592, 644, 623, 213, 418, -466, -251, -1012, 715, -412, -70, 228, -569, -317, -372, -133, -196, -105, -58, -75, 513, 803, -104, 426, 681, 244, -439, 900, 219, 411, 600, 254, -259, 385, 475, 351, 100, -5, -111, -238, -537, -737, -414, 307, 310, 188, -391, -512, 489, 402, 402, 678, 231, -329, 177, 602, 129, 326, 641, -783, 396, -452, 971, -813, 869, 757, 376, 173, 55, -1146, 430, -70, -354, -182, -667, -222, -347, -602, -31, -36, -240, -422, -364, -678, -288, 1025, 431, -273, -997, 682, -52, -147, -386, -239, -288, -22, -1008, 29, 663, -251, -326, 296, -288, -707, 380, 179, 511, -561, 213, 585, 9, -536, -521, 587, 122, 267, 467, -588, -140, 425, -793, 587, 154, 313, -683, 829, -125, -324, 633, -367]
4109c67L41K22j74r2k79P87J64n28k50j00J00M22p5J9k5j69L23K39L62l28m95
4130I7N06m08k8o39N66J027j001Q0q48Q66p92J207p60k29J49p23J188O6l94K82
4150B12K18m18K37p54K73L51r3K26l07L58o35O78p64K71K80M66N12j806J158l45
4170A18o40K33N13j758J966o29K6M46r45R72j02k92K66O05k47j319R29j052N62
4189c48l27k09P26N52q20Q17r66P80p66L0J180r81j60P44p35p33R48j40l02J057
4209C47N38j38o59j53m63K69N40l68n90K33O63r33M99k61N91l03P18o82R0n27
4229e89k5k38L58J304m49k05l83J45M79n92j43p8K21r9m38J554j160M75n42l74
4249g79J033l9M2j49l6J73m49J079q79J7K34k24l83p57P35M25M84l5j097n3J037
$$ y = [-367, -26, 196, 22, -70, -349, 438, 602, 74, -176, -276, -176, 246, 171, 190, 165, -4, 319, 558, 920, 592, 97, 603, 195, 167, -472, 94, 1121, 120, 200, -648, 218, -574, 633, -127, -356, -207, -930, 258, 324, -70, 212, 430, 12, 249, -505, -232, 119, 26, 252, -55, 303, -332, 346, -418, -147, 133, 599, 1111, -695, 463, 118, -522, -289, 224, -1534, 432, -197, -171, 275, -670, 302, 200, -92, 174, 779, 532, -787, 142, -910, -348, -675, -884, -158, 394, -426, 391, -575, 205, -561, -531, 649, -332, -492, 252, -483, -1216, -268, -408, -710, 347, 885, 747, 88, -65, -528, -259, 281, -87, -677, -444, 219, -714, -215, -476, 115, -188, 530, -152, -62, -589, -614, -852, -494, 810, 361, 156, -227, -82, 397, -195, -338, -416, -195, -294, -732, 822, -338, 137, -405, -779, 254, 215, 257, 108, 72, 245, -204, 875, -4, 13, 247, 23, -360, -1117, -382, 43, 527, 492, -605, -658, 379]
4270C79m6n9p98R60n25K75j27j10O8j60j02J56M54j24o01N20l86M61n02j06P11
4291C38j213J456o28l06J39N27r09P57o62P36j175O6L64M3J071m63N4j18K71q63
4311e15J448j391P63M41n02m17N72l8j88m59J08Q8P26j110J48O02j505J563q83
4330e49j97J92k71J622o67P62j260O97p04P15n65K92m47k23k86L98L4l84P35p6
4350a82L32n93R8N49L39J09o14q15M27O16J70k90j340O88N33K60k20p83P86l18
4370b48O45n92P34l94L92n86L02n48P06n85R4k46K36m57M72L84n08N81N66j087
4390a39L96o83J54N42p17N30L14q18k34J007q07O4J64o04J265P4M4p30j70Q51
4410E03n22l48J48J91k27p10J737l44m48k78J07k69j88L93L06k0k69J0N32o58
$$ y = [379, 333, 274, -524, 436, -89, 186, 59, -51, 17, -143, -245, -89, 365, 241, -360, 160, -226, 235, -267, -373, 338, -875, 581, -47, -353, -214, 313, -596, 161, -501, 235, -940, -874, -510, -467, 604, 141, 195, 77, 348, -515, 933, -458, 305, 746, 244, -173, 399, 361, 173, -286, -178, -90, 636, -474, -326, 276, -1229, 334, -549, -746, -554, -825, 797, 130, 892, -368, 329, -375, 340, -225, 67, -380, -603, -889, -491, -457, -841, -106, -182, 150, -443, -345, 204, 543, 652, 38, -777, -350, 266, 436, 146, -1194, -506, 27, 287, 67, -716, 70, -248, 397, -195, 539, 145, 537, -49, 253, -295, 411, -174, -80, -326, -90, -547, -75, 309, -199, 382, 948, -139, 257, -426, -272, 270, -447, 83, 397, -421, -655, 352, -455, -391, -227, -831, 434, 508, 552, -178, -348, 503, -19, -367, -219, -28, -255, -965, 772, 428, -20, -298, -191, -460, -648, -255, 51, 31, -238, -228, 304, -354]
4430c54L52p8K19k03N80j73NJ42j4j31p34l61J321o57k82K77Q25k32q52J080r16
4451a86m94P50q31J345k61l02N71q95k82J072j32K71l07k42K21P1q01O15N6l41
4471a02j63mk68K46J486r30p62K16N80j41P21j226Q61l52L78p1n45J273j084j405
4491a292Q40L75Q48q22l78k59N12O65l80j096Q86R5q31R94m4L08j301J238j79
4510A79j097J427q94Q01j071N28M94N94j245J48J487p35l81q07K78N12P4m47j2
4529a67K37k42j80M64O8k35p69J740j132k93J145q2n57L49p93j61M93k85M62k08
4549a46m94p59M02l12J403n14M72K87m35L01K98m49k04J55j36p87J381o75NP96
4569E89n03k00K89k42J04L62o7r67M19k6N24o60m01J075j2Q9j075K70N90o45J60
$$ y = [-354, -2, -80, 139, -64, 516, 343, 348, 490, 476, 345, -389, -750, 571, -86, -368, -91, 734, 502, -350, 730, -186, -680, 70, -761, 584, 323, 21, 592, -303, -585, 487, 355, 626, 319, 77, 298, 369, -432, 183, 239, -102, -265, -269, -537, -291, 1195, 265, -497, -281, 299, 158, 879, -347, 514, 162, 540, 469, -76, 1197, 113, -1292, -452, -77, 771, -51, -429, -688, -176, 489, 109, -987, -101, -6, -837, 157, 113, 421, -880, 358, 179, -918, 509, -385, 416, -655, -127, 367, 961, -284, -136, 1351, 616, 235, -572, -294, 218, 292, -155, -167, 70, -172, -352, 112, 180, -55, -824, 916, -216, -509, 636, 554, -3, 346, -447, -608, -115, -400, 62, -146, -640, -1399, -997, -1309, 94, -420, 52, 339, -96, 205, 503, 54, -150, 5, -131, -918, 463, -212, -207, 589, 86, -114, 175, -67, 37, 399, 332, -635, -216, -242, 282, -378, -779, 296, 284, 373, -702, -432, 158, -487, -327]
4590c27l20oR30l43N41k59m14P1N27o88p0L48k5K12j05m86Q29K8q21P01j20M29
4612F32j150M09K6K46m80O01m08PN15o68N24l79K86k25O27p47k19J16K71L03j226
4633i39K306q99j252j71L75j3k11J074p6L94j590J136M13j047M05m38K39K63n26
4652e57K55Q07j86r36Q19p55L96N54q30k06R86N98q29l34P17J21j012k87M37M70
4672B28o61l37J310j95r88J73J536J88j385N07l14k60Q66j700Q46R0l16O05m70
4691b77P05K78m50n37P98p84L80q31J095l15Q29j082o9l16k32J534l52k96j66
4710h8l82M41M13m04M20j24l99NK79n18o1m8M66J86n19L76l00R27o7K89m07k78
4732B07j84p70O95p47J335l81k48O54l44m5K92k04O8l72K66n45j19O34k54q81
$$ y = [-327, -647, -653, 277, -66, 475, 216, -198, -127, 400, -288, -358, -10, -35, 177, 72, -414, 415, 443, -378, 323, 203, 632, -518, -109, -83, 163, -317, 284, -124, -117, 398, -270, 254, -125, 161, -64, 563, -184, -403, -287, -16, 287, -939, 1367, 468, -784, -955, -580, -593, -804, 270, 194, 588, -1002, 134, 547, -500, -95, -533, -294, -31, -557, -302, 505, 319, -617, 202, -553, -157, 397, -433, -639, 347, 945, 116, -218, 499, 620, -392, -679, -242, 228, -433, -770, 540, 345, -643, -470, 1066, 1254, -131, 376, 62, -198, 668, -1032, -186, -96, -412, 193, -277, 428, 706, 256, -281, 517, -267, 113, -718, 377, 62, 891, -191, -260, -576, -808, 726, 374, 78, -88, -470, -29, 384, -20, 400, 276, -123, -118, 161, -357, -418, -466, 0, 186, -333, 43, -257, 670, 603, 892, 485, 207, 23, -747, -52, -799, 536, 155, -93, 561, 217, 172, 464, 260, 328, -44, 222, -323, -442, 192, -62, -943]
4752i43Q47K53l03L3R4k43oN75J62k86l33K64K37j30j046P84P83j06J96j230N02
4773A04j18M7M94m51K21j226J163o03N90O2k13K75n41j56P14k78j1J211j627M17
4793G4j60N97l97r56O72J87L80n36K39J8L6K0n46J07L70J14j6n93J149M51j057
4814A53j9l08K07O06o06O79n55n75P42K68J14j453J202J9o49L36L13O6r46R43
4834E37k68m06P73m58o04J548j682R3O53m81M57m59L20Q21j385J20K87N05L39
4853G10o6j250J65J913j805N39M69o75n73J019m6m99J14n51J72J8O9k71J213m94
4873A71O3r33J724j324P8K18l13N99p87O13K75M4K24j118j27j1O96L54p87J306
4893I65q67m67R60r24j8L35Q39r99M55L03n61k07j063J319M93M37j157k08N59
$$ y = [-943, -96, 157, -146, -113, -19, -262, -268, 307, 469, 183, -150, 114, 351, 221, -825, -41, 742, 636, 832, -398, 104, -14, 33, 527, 76, 297, -929, 234, -369, 221, 283, 70, 345, -196, -352, 362, 84, 73, 1284, -343, 74, -86, 511, 114, -842, -170, 17, 397, -139, 100, 118, 154, 174, -372, -265, 105, 219, 203, -390, 759, 1210, 153, 134, -174, 33, 639, 33, 712, 157, -418, 324, 592, 706, -747, 455, 474, -175, 161, 474, 540, -406, 537, 269, -137, 636, 178, -426, 1122, -560, -467, 186, -295, 162, -297, 23, 844, -541, -421, -134, 371, 710, 644, -606, -441, 1472, -333, 206, 675, 0, -573, 446, 400, -99, 15, -536, -364, -346, -277, -548, 665, 171, 234, -699, 1025, -299, -221, -3, -316, 283, -504, 109, 384, 428, 652, -466, -593, -604, 92, 446, -341, 965, 98, -369, 591, -333, -351, -16, 823, -176, 279, 582, 21, -186, -1249, 70, 563, 1000, -157, -365, 194]
4912A94j195J105J64O8j96l12M85j01p16J13L77J140j161m4k41N23qo03M20k10
4932a98J61p8N9J63O06j425J89L79L52j84m39J46J04o73O72K19n3L00l20m0L0
4953c0K72q1m07k53R73m23j00n44J63n6K92R61j500J193J52j415k69P02l2l44
4973g46O56l32o0K57n11O28m07J56J47M3N16j83J55j40l96K98l12N80o82M72J13
4994B52j69n83P30k96L1k43L32o29O28%p49K18P71M18j303L03M20o64k9N54J77
5015A69J81N54o70L69j559P28P82p86P43j023L92o24M36M36m89J66N60o76J102
5034G91r22Q04j124m7M16N93j489J222n02L73O44r46R26l29m67J31L88l97N05
5053E70k60j287J215K30m72K26p6n15L18O53q21k82l18J460j132m5N17j26l82
$$ y = [194, -1001, 104, 268, 336, 140, -172, 313, 212, -504, -391, -14, 1126, -35, -79, -320, 203, 195, -408, 12, -198, -37, -115, -56, 107, 713, -712, -523, -144, 208, 24, -415, -269, -165, -838, -166, 53, 0, 300, -20, -60, -30, 242, 161, -246, -499, 474, 51, -49, -593, -430, -486, -194, 767, -733, 460, 612, -803, -1072, -370, -402, -746, -90, -422, -482, -225, -736, -108, -515, -359, -212, -169, 347, 164, 319, 179, -217, 81, -231, 349, -333, 139, 252, 83, -500, 230, -66, -35, -278, 54, -575, 53, 53, -696, -478, 293, 711, -592, -289, 131, -533, -562, -8, 169, 350, 904, 234, 603, -956, -228, 554, -232, 511, -512, -120, -744, -308, 128, -361, -195, 365, -311, 791, -131, 673, -451, -498, -82, 511, -978, 244, -258, 115, 759, -187, 739, 410, -57, 74, 462, 65, 570, 310, -977, 238, 468, -4, 222, 146, -369, -51, 602, -219, -501, -819, 641, -491, -536, -19, -145, -527]
5072e27J286J213j619n29l40M48l51J065k94K25m40N08j070J061L02j767J318
5089D89j599J318j59M03M77o23n70J95m09m8K62q54J254O70r38k2l31L30m61L46
5109b70q11R06N05L26j57K02o57l03P5j54J221m99L97j203O79n52o05K50R27n53
5129b76J60k59O04J19k12k18N03N96o69l62M2M94M2j43l25l62Q37k91m83P79l75
5150B01K31j227K26N08O28m15j8j27L56m67m9N28n17M96K03l09j049Q23P31r72
5170b19M40j51Q25j168N44R1j15m31L87PM44k98L0J51o1j11k31J19r69Q05q30
5191g41O05p73J947j788J229m64p21P33P6k7L69p85L88q56N29Q55j328O65K88
5210B01m78M50j047M68K36J65M63L19r31J377j319L38m76L67k61J197j454N72
$$ y = [-527, 759, 1972, 353, -176, -516, -68, -419, 646, 352, 577, 137, 645, -425, 636, 938, -829, 489, -1110, 208, 49, 452, 929, 306, -264, -69, -478, -526, -264, -1118, 136, 806, -132, -154, -485, -155, -616, -270, -1081, -175, 330, 656, 499, 701, 44, -259, -184, -338, 883, 384, 781, -422, 257, -295, -900, -650, 277, -276, -116, -375, 229, 348, 136, -82, 421, 1017, 348, -14, 28, 522, 564, 421, 96, -266, 571, 280, -203, 576, 201, 432, -795, -569, -61, 567, 152, 134, 7, 363, -104, -153, 375, -142, 354, 557, 248, -801, 22, 753, -219, 221, 70, 895, -273, 271, 362, 247, -184, 203, 210, 654, 356, 386, 537, 476, 365, 134, 253, -716, 89, -741, -136, -909, 1038, -750, 479, 15, -706, 27, 103, 76, 445, -340, 48, -808, -279, 576, -752, -87, 201, -277, 173, -874, -406, -170, -5, 458, 777, -154, 1223, -96, 242, -234, 133, -128, 1069, -385, 187]
5228A87r3l26Q76j73j089L67L80q25R12K51m87M84j294P02m63K31L66k2n5j81
5248b52P83j83m35j18k3k47Q11M04j183J19L53J81j014N32N83o00J02r04O09j86
5268f68O77l5o7q59P16k34Q35o85j67J355j15l30j148k86L22N93M80q68L5J015
5288E66r23q00J962q96O03K11j468J349j221J671j722M07o6m34J237N03l95j087
5306e03L44J90L97o16K56l8M21K01j143K88Q95l89K8n90m87J732j080K25j4p30
5326f13J77m69j7J031M0L94j39l30M48N13j964L74J662r85m6N52q99M07k02J91
5346A25O15M8r03k68J11J61L72k24L27l13k61n4P54l6J66k55o02M68k59p08R27
5367A91l54m23K4K0M05k65n61R82K25k88q23J577j93p62P1q0l0O60L97n01m74
$$ y = [187, 94, -232, 644, 471, -618, -251, 129, -696, 216, 467, -20, 464, -830, -128, -591, -360, 6, -16, -71, -252, 531, 348, -87, -205, -228, -475, 336, 740, -443, -324, 29, 210, -804, -272, 311, -289, -187, -1091, -482, -668, 9, -26, -93, -952, -236, -470, 365, -320, -487, 868, 753, 423, -725, -1011, -689, -96, 384, -484, -449, 566, -357, -1157, 805, -91, 512, 723, -745, 604, -617, 1054, -668, -261, -327, -761, 476, 979, 584, -503, -159, 31, 428, -188, 68, 30, 451, 652, -491, -203, 692, 303, 331, -259, -746, 986, -94, 131, 117, -613, -436, -905, -922, 109, 149, 543, 404, 74, 522, 1035, -929, -555, 1107, 122, 76, 628, -271, 136, -66, 125, 740, 788, -115, -383, -272, -111, 261, 37, 364, 51, -210, -264, 490, 454, 620, 365, -237, 231, -28, -736, 191, -163, -586, -562, -542, -137, -402, -963, 19, 244, -44, -867, 710, 517, -245, -174, -254, -284, 376, 773, 272, -202]
5388b02M94r16J524q33R56p96o09L55M84j186k2M65P86j278P16K24k30N69k53
5407B48N32m71Q6p01O25r05M79O32j091k72R96n48N40m48J15K33l76o43K56J304
5427E91N9k76p50J87N59R69j250m59N9P05m90l22j76K24J35J2P52k80l4J23L09
5448F47k67j081J397p34n28P07n83K72M1J57k25L55m14N88j21p48J92J312r73
5467fn39J014p80K92n30N00K52L57l75M46j032K28J159q97j012R32J01k52m11
5486e53M15M70q9m93J05N24j242J268o92Q82j018M22p2p87P15L48j7M18m19k74
5506h9L79n44O29j061N37J00O71j534J974j307l88J307q81k28j74Q75O70r19j42
5525a25L51j104P08K60j83J29Q74m01j378P53k01O29m12J01k46K37N81l95k39
$$ y = [-202, 292, -624, 900, 67, 1023, 227, -382, -27, 457, -729, -751, -286, 500, -778, -62, 162, -68, 501, 248, 780, 309, 395, -306, 319, -586, -107, 525, -566, -838, 158, -390, 150, -298, -183, 50, -326, -969, -713, 591, 650, 374, -376, -189, 370, 1339, 89, -370, -311, 394, -96, -418, -594, -370, -235, -223, 529, 249, 215, 338, 647, 380, -701, 696, -38, -566, 141, -442, -170, -129, 28, -197, 158, -256, 332, 211, -537, -345, 967, -6, -545, 469, -311, -19, -549, -49, 203, 560, 185, 631, -401, -173, 986, 89, -923, 9, 110, -142, -553, -138, 332, 243, -250, -145, 379, -863, 405, -287, 595, -423, -1, -73, -860, -145, 203, 186, 604, 185, -89, 290, -254, 375, -686, -149, -49, 622, -912, 1062, -245, -633, 674, -207, -435, -609, 266, 936, 17, -125, 226, -878, -170, 90, -93, 36, 910, 509, -869, -116, -317, 312, -100, 1, -245, -8, 573, 178, -61]
5544f1q47J036r5P47p70q61O38No08R75K24l63J23q18R44m18O2L6l3K08m7n84
5566e07O96j8p82J333n28N85j013j27J200p79J10l4l80J25J93M80K88j301K10
5585b49R44n68J7p46M68j49p61O02J117j50j46m2m19j75Or47J652p69J98o7l1
5606b15L08p13O02P5K60o4P06k135Q78Q50L36o77P8k71K60m8q74Q88m09N03m40
5627a02K62k71k53N66k65p33J257J13n46L44j677J442q9K53n12n34R78k96K48
5646A85k68O4J44q35O83j8j4P32l47r47Q11n57Q78m98m7L38o53J363p31k87L52
5667C48q37M02p4K88o73O65L49m73L36N90p44l79j35P77O7j128N82J83K91L7j385
5688i13L65N27J092q45j73n73N01q6J027j247J37J94J9O00j313j35Q42N48k53
$$ y = [-61, -908, 128, 33, 780, 10, -851, -213, -208, -816, 159, 383, 20, 143, -675, 269, -149, -87, -51, -84, 124, 77, -507, 189, 171, -611, 722, 194, 779, -234, -361, 839, 60, 170, 136, -244, -119, 74, 554, 842, -459, -249, 695, 127, 144, -602, -134, -283, -1044, -442, 675, 525, 379, 337, -82, -257, -251, -1198, 454, -315, -117, -184, -215, 93, -620, -18, 57, 317, 253, 959, -1176, -298, 552, 888, 211, 289, 18, 278, 230, -644, 244, -165, 338, -102, 160, -111, -364, 202, -63, -796, 461, 574, 28, 372, -1305, 137, 48, 301, -211, -745, 233, -63, 185, -83, -19, 125, -710, -27, -45, -59, 673, 326, -621, 190, -367, 511, 13, -34, 304, -349, 1014, 283, -4, 348, -489, -87, -161, 127, -546, 119, 468, -5, 331, 921, 177, -202, -337, 440, 507, -621, -39, 144, 435, 472, -913, -548, -21, 1071, 226, 53, -520, -19, -105, 922, -325, -188, 6, 25, 625, -688, -823, 19, 567, 314]
5707C14j04no20P34n49N04J53j198N73L23n7K07n08L58n67J152l78P55p85K9l45
5728a4L45jQ81j428R98j103L46m30M48J37N51j345P46n32L51Q75q14j36J032j096
5748a89K88m1l25O31j25KK48R0k22k04o19L58r95J094j11N63j250R57j067J200
5768B83l43n03K31L65k04O15j343N84L35K2p67J039J69l81n39l59M46M02l19P82
5788E15n19K11L53N90o28m52n57Q97L52j391Q43m32j061R46Q59m20N98r43J107
5807H68j415O06K41n29j16O50J37j108J202K73k85r00j21Q17j537J114K36l37
5825b04j27k40R67N9q74k84O59Q9k11l36M13K1p5j89Q57o92K69j61l4j91N55l59
5847h8l03J67M29m56L45j34l33J81J2J12nL12r88N88Q94p60N67q45j82M28J26
$$ y = [314, 210, 205, -415, 319, -230, 274, 427, -771, -198, 125, 68, 275, -233, 125, -442, 710, 332, 1087, 302, 331, -14, 331, 330, 1211, -217, 781, -322, 24, -406, 42, 179, 730, -615, 131, -401, -50, 825, 11, -125, 907, -189, 99, 58, -267, 364, 239, 241, 489, 579, 357, 153, -466, -108, -1103, -9, -120, 443, -807, 150, -917, 283, -60, -563, -332, 33, -171, 444, -899, -315, 20, 42, -725, 314, 483, 102, -437, -796, -350, 52, -267, 515, -4, 207, 560, 1150, 522, 70, -487, 410, 762, -629, 214, -218, -1279, -333, 526, 106, 704, -239, 868, -547, 59, 300, -229, -345, 305, 442, -666, 536, 809, 524, -376, -497, 320, -1217, -103, 133, -204, -331, -571, 396, 455, -419, -703, -44, 45, -166, -502, -89, -68, -143, -332, 525, -167, 102, -59, -93, -284, 271, -88, -391, -224, 205, -251, 94, -40, -373, -192, -180, -68, -73, 239, -749, -161, 733, -27, 540, -305, -487, -59, 67]
5868F7J57r5M9l07O70l97o28J968k103O09N24M37p63n13J011p19L22k34k89O33
5888C99j032m15J763j526J406l4j137K15N27n48P90m95m6J73M49m14P74k020R52
5907b19N41p43O21r59R0N65R0J01L16l28L41O10j315O51j348J370r98J66Q86o58
5927b20K77R5p15j05J467r43K29q21J039m60K68L46P2p05q74N76J457j127N96
5946D52p71M58M76q60M65J84r88Q59K15q33J72n7K37k08K13P56k79K70j54K25
5966H32j351j76J175l35k80R0p49J117n19K91l19R66n14N33l53r29J022m02j17
5985a8K05J35k05N76q48r4l84J471o61Q70j531O00n14R1j65O24p0p96M71o59Q12
6006i0N3L9k88k67M90j85l02J015o83j25L35K5o33MM68P61j099L25m08Q26n29
$$ y = [67, 224, 129, 178, -129, 541, 144, -484, 1484, -619, -10, 514, 951, 188, -325, 686, -33, 289, 55, -234, 399, -633, -1048, 715, -811, 595, 561, -576, -361, 166, -382, 408, -87, -133, 40, 489, 75, 849, -1171, -219, 322, -421, 200, -759, -669, -104, -14, 87, 403, 75, 416, 1026, -289, 362, -986, 384, -614, -448, 438, -220, 57, 152, -563, -668, 799, -144, 85, -736, 303, -157, 111, 457, 529, -176, -1050, -474, 983, -144, 452, -319, 139, 615, -245, 220, 404, -584, 275, 490, -343, -171, -228, 9, -199, 14, 770, 491, 761, 607, 832, -519, -695, 480, 145, -135, -45, -794, 323, -196, 95, -224, 742, 228, 761, 408, -521, 501, 99, -18, 187, 322, 117, 693, -155, -249, -633, 838, 177, 1047, -484, 116, -398, -307, -472, 152, 82, -714, -243, -902, -90, -37, 2, -286, -553, -63, -248, -550, 465, -218, -343, -8, 17, -616, -612, -144, 617, -482, -157, -565, 261, -268]
6027b68o0K59m20J457r10J66o11j15R96n12j63M3n31J165q72K52r24Q69J110j000
6047f9l41J24J055j03r17p15J385q72j5O64o52L94j3M75n40LQ7j48J65j65K09
6068A1p4N30k98q81J210j058P17J86k47n27L89p54O63O83k8l71j55l11J97L65
6088B47q5j71k69K01j42N22L55j437M18lK90Q1J066j237O26n90m0j68o26J300
6108C38l07m69N26q88oJ296p01N1O90l34p6q87N71L22j244K75j12J161K46J00
6128E52p43j74o59J275n84j09O17L60o33j80m69J800k14q99k77L03J71k22j62
6147b47J39k99Q07k36n37J83L82O80j452P93k08l19L33q79R76K45k73K14j039
6166g37M70J067j259O51l30k66J238n45l72l76P37r56J233o16P47j003k00J36
$$ y = [-268, -328, -69, -489, 968, 58, 224, -387, -502, 494, -18, -181, -138, -669, 496, -376, -124, -1048, -179, 931, -69, -410, -286, 769, 666, -251, -966, 419, -453, -468, 196, -456, -62, -75, 400, -140, -137, -50, -198, -33, -198, 11, -63, 467, 169, -712, 498, -560, 157, 343, 96, -431, -42, -796, -133, 550, 522, 151, -4, -315, -118, 247, 162, -9, -278, -77, -219, 303, 658, -779, -361, -364, -74, 7, 1073, -164, 462, -128, -168, -336, -962, 338, 31, -438, 88, -800, -806, 490, -211, -160, 530, 196, 120, -767, -196, 126, -1118, -843, -955, 206, 452, 552, -191, -365, -1024, 251, -333, -442, 175, 535, -98, -278, -747, 1053, 839, -60, -337, -34, 137, -85, -247, -108, -407, 400, 164, -373, -190, 192, 872, -580, 213, 5, -314, 19, -860, 116, 361, 88, 302, -737, -267, 800, -459, 192, -138, -404, 834, 289, -83, -459, 278, -678, 555, -61, 686, -317, -517, -381]
6184c81P98k33m04m04P00R14j379N15o8M84n97k21M05M56j12p17N66r34O80N25
6204E93r93M06O11j018N77k62L65o62O39k98j96P07o67K88n05K97J47J044r41
6223A32q9N4P85j056n14K21J143r79M01Q37j113k81L48K38K1p53Q52r81N38M14
6243B18k34K09j61J35O09j150N9N37j16K8R08q94m28q0L57P1K02q38J80j97K51
6264c34M06l26K5j8K01q4j5K03O36r22k23J154q96Q8L18l35M68m89o69j80P22
6285b70j09j3K4j53Q86n64n61M66P46K31o39k19J41R67j257p0O79J51o29M48l82
6306a27j53o7l81Q00k82L77N35p5p76n05j74Q97m1N97J159j142n05p61N67J27
6326G0L46q85Q9K49o0J080j056J71Q71p14l19R55l67q68M38J90QJ87j88o07J72
$$ y = [-381, 417, 184, -220, -624, 76, 990, -389, 126, 58, 542, -55, -276, 129, 585, 473, -244, 322, -612, 68, 593, -400, 6, 617, -401, 176, -86, 279, -383, 256, -42, -238, 469, -198, 90, -415, -118, 29, 1073, 132, 43, 97, 882, -174, -688, -467, 676, -303, 98, 935, -178, -459, -111, 127, 148, -605, 247, -734, -196, 218, -16, 193, 32, 167, 776, -374, -315, 222, 106, 134, 1042, 148, -280, -360, -3, 68, 270, -568, -388, -585, -334, 72, -254, -229, -247, -46, -130, -145, 58, 694, -228, -451, 703, -193, -105, 213, -122, 346, -143, -812, -992, -270, -379, -392, -368, -521, 365, -199, -760, -294, 452, 683, 44, -175, -34, 933, -324, -394, 285, 436, -193, 255, -127, -280, -347, -728, 72, -210, 167, 702, 627, -149, -654, -828, 69, 28, 625, 1784, 642, 137, -624, -57, 70, 416, -469, -380, -131, -191, 889, -167, 4, 875, 161, -158, 797, 430, -438, 0, 190, 198, 385, 197, -410, -238]
6347b38J009n57J98M60p63N21j017M9J150l73j003K76n59J232N30r29m17M83l97
6366c45J65Q45p88q39J097K97q3M65p38N91m46n61Q61o87J4M88k55j5j092J630
6386F04n77L81l46k94K72L71n30l59M46l63j62R47p32L96J95j059J056j13K78
6405D11K00j168P53N1Qm96L02k18j84k76J353r49j88J71o49M98O65l39J075r31
6425H9n97L80L45j07j04J57l23p03J368J83j192L03q00J227k71O53r47P42l51
6444E2Q51q61Q33j542M58l05L59L59K08j275P85N01j602N21L29K70k64O48J80
6463E05j024J86J161p61R6K08m16L33l38L02m73L57O19k5n21k11L8P85j098M69
6483A92J66n02K51J6J16l78N73L20j074P25r27N9K20n3L2P80p1p38m13N67l68
$$ y = [-238, 771, 214, 412, 872, 109, 630, -387, -338, 812, 439, -564, -288, -847, 385, 915, -14, -431, 52, -345, -180, 665, -123, -962, 135, 432, 349, 814, 76, 667, 221, -340, 521, -166, -152, 336, 81, 66, -1026, 604, 27, 408, 62, -232, 40, 411, -119, -478, -32, -395, -557, 390, -342, 54, 249, -810, 246, 133, 411, 611, -557, 196, 247, 255, -241, 61, -157, -341, -617, 736, -213, -401, -230, -879, -381, 284, -55, 1020, 89, -508, -128, 217, 110, 6, 163, -160, -863, 505, 688, -504, -201, -1001, 226, -45, 608, -339, 403, 52, 903, 42, 875, -667, -209, -514, -155, 204, 412, -863, -78, 423, -1179, -658, -329, -59, -323, 325, 505, -519, -333, 828, 67, 163, 371, -45, 288, -50, 252, -221, 136, 755, 730, 209, -2, 36, 821, -277, 192, 358, -144, 107, 123, 239, -139, 434, 754, -320, 405, -522, -463, -243, -296, -264, 516, 445, -293, -706, -139, -507]
6504e07P45O9p83J77K30M60K44k90m12N7l47M79m08O27J79j65j28o88M27K57o42
6525d19P51J57l28n34L46l9k2M28p90N66l67J050o20q83K07N05P89n66m04m30
6545f03O33n54O3M63o93O88L28n52k85O83l75R76j203J123p51O94n09r9O91j70
6565E48k27p48N73p52L07Q38q77N34m15o40J467K03j317m4P48l63L33J150j010
6584C08l01m1Mm50j05M00L62K51n02l79N82J8j55l05K74Q8j81M11l07p0M14j125
6606h09P5K11M54p2J23j044J259o89R22p18M03j054J027K81l62p11NR81p28M28
6626a8O15j127J570l88r73N45p05J212J65L6o93P61j499N26Q7N94p02q14L26J12
6646c70n0L00o93M81N91n66m91O94P72n14L61k1l37j2m44N11j06K34p25L37k22
$$ y = [-507, 238, 307, -476, -299, -69, 391, 635, 345, -67, -10, -357, 122, -286, 341, 520, 355, 227, -461, -34, 223, -419, 332, 489, 161, -373, -27, -66, -88, 340, -450, 116, -251, 799, 179, -704, -497, 8, 797, 231, -173, -603, 30, -524, -461, 2, -691, -3, 325, -227, -512, 171, -204, 772, -431, 692, -59, 635, 126, 27, 718, 548, 321, -427, 146, -606, -299, 539, -338, 196, -219, -859, 608, 811, -506, -550, 198, -165, 168, 1318, 308, 7, -34, -30, -480, -585, -185, 177, 428, -74, -453, 129, 147, -8, -313, -39, 49, -132, 279, -28, -98, 316, -809, -734, -523, -69, -141, -18, -1062, 197, -492, 430, -288, 115, -939, 88, 369, 7, -704, -699, 282, -446, -18, 597, -530, 1040, 652, -321, 224, -481, 731, 896, 932, 239, 1000, -499, 27, 114, 708, 6, -808, -482, -370, -420, -120, -813, -332, 259, -307, -798, -104, 668, 154, 515, 494, 157, 145, -299, 212, 106, 340, -385, -48, -270]
6667b70O6M86K98o04l95K80J21k89J160j053m33N59K75j11j55L2n23P17r02K46
6687d95O02j00K32k72O75l25j447J080L4N0p32Q10J70l97PNL60ol63N94p43N76
6709C15n33m19J234n06k03q33L32J57O31m2L67l20o37O16l94M54k49L31k65p60
6729g24O35j02K9Q59k73l11m13m0M39j44j28P99p24J1l96M02O51k95P38j785P41
6750c1n15P26M91q10M27p60J011L72j218J51m8l10L89Q82j228J154j042M81m07
6769b85Q46l67k96n8M78N50j561Q36o09j74Q25l56o3k40J82O41j389Q49L82j90
6789AM60p43P3l50J02M83l08N81q67J001j12l82R2M24q81Q97r01j75J6q6O80M01
6811D06L38j846J896l7j25j429N99N70M1j168R35k63K24p44M79m19k82K93P97
$$ y = [-270, -204, 282, 580, -24, -419, -139, -18, -307, 853, -200, -633, -74, 201, 90, -65, -33, -556, 161, -741, -495, 107, 7, 239, -33, 642, 317, -1130, -50, -16, 34, -698, 112, 282, -115, -108, -103, 257, 251, -112, 482, -261, 315, -218, -637, 597, 91, -112, -945, -613, -456, 175, 133, 500, 180, -457, 159, -235, 219, -30, 301, 36, -724, -89, -191, -162, 697, 424, 113, -300, -340, 99, -45, -173, 626, -98, -87, -483, -81, 570, 275, 1013, -772, -31, -546, 180, 671, -139, 288, -472, 539, 911, -307, -156, -204, -514, -125, 757, -471, 683, -359, 122, -285, 561, 194, -102, -160, 318, 868, -693, 143, -466, -640, 185, -171, -234, -474, -292, 349, -1040, -191, 191, 1, 461, -282, -209, -559, -457, 26, -282, 299, -568, 433, 321, -61, 31, 455, -426, 471, -430, -605, -589, -675, 5, 406, 744, -1102, 794, 757, 632, -797, -198, 372, 413, -755, 180, -83, 141, -603, -124, -543, -825, -532, 265]
6830B65n09M03J48j050Q48n54n65Q65q5j27Q99j169J003p39LN03k14L03n65R32
6850E95j035J94j98O33Q9r80N85O47o93N17j124R58J41m52N53j074N42j37N9J84
6870DK95o0j7j41k58NO54p6l02p50R53q61L90J47L4j32j272N98O78L99l05N81
6892E64k80K71j275L17O55k68O3m63N91M24j477K70J037r09Q59m98l80P40N35
6911G76j668N56L45P53p75M59R1K46j372O68r19R23p8m66k74Q29M9k42nL33m9
6932A80l42J23J76J18O8k26Q46q24n48R25j194P10m65K82N39j35K40o47P04l24
6952B06j76K05L97n47r5k52N10m40J05J2p34N4J068n89j9L93q61n0J031j95p44
6973g21L30K8K0O44o7m94J169j069L98k4k54j89J024j055N83m82N17l83O7Q01
$$ y = [265, -244, 159, 307, -743, 105, -449, -1014, -149, -234, -361, 538, -631, 372, -367, -364, 139, -75, 228, -337, 595, -440, -246, -444, 189, 278, -702, -117, 530, -163, 354, -770, 188, 329, -123, 430, -644, -102, -239, -180, 4, 299, 239, 222, 81, -177, -172, 482, 406, 104, -646, 307, -554, -164, -17, 17, -115, -1387, -789, -111, 288, -17, 564, 284, 555, -720, -403, 252, -16, 47, -416, 175, 599, -878, -608, 429, -480, 379, -119, -499, 241, 776, -892, -336, 9, 762, -13, 446, 537, 783, -589, 79, -840, 83, 5, -461, -735, 94, 143, -99, -104, 229, 180, -162, -39, 137, 255, 323, 97, 943, 119, -429, 496, -698, 12, -453, -171, 368, 233, 473, -174, 530, 206, 30, 235, 632, 85, -10, -262, 248, -192, -87, -75, -809, -755, 313, -276, -295, 98, -763, -813, 218, 23, -721, -391, -363, -343, 301, 234, -260, 909, -160, 238, 214, -40, -229, 795, -260, 323, -159, 358, -25, 42, 843]
6993H43r26M41n41K74L63p30M25o2l73J12n68R92p73K6J9O37q64R37M08p97N54
7014C97l73q7j67J01J12P2l48j61Q09n27l72Kn2L72j62j70O22P41j025l4L17J92
7036B59K56q89K69ql69Q86K60l48n8l84Q35l52oo62Q37m52K78k7j475J195l28
7057b83J161r11r7K33r4j11m22P03l52n38n9R81j11K02l56k65O72p05Q5P97l37
7078A93M38j78q68Q94p14M10l00j153J329J84j089O83j95K56L73j18M46k68L19
7097F42m76R4p56M40K74k40P94o28N00m10k64M05k17l60L29M95J45j498R97k75
7117il56N39o32L51R71n90k99j62M84k59L17k01J33j122L64O11j41q02R95M14
7137F06j487J497k94m51j06P21N15j351K60O28j309Q58l72o10M01N96L44q25M55
$$ y = [843, -83, 358, -183, 91, 454, -276, 149, 87, -286, -174, -742, 250, -523, -497, -478, 159, -705, 232, 640, -157, 397, 24, -63, -230, -129, -17, 55, -293, -454, 355, -172, -544, -542, -594, -222, -384, -554, 68, 809, -216, -250, 67, 259, 515, -374, -105, -113, -482, 404, 664, 316, 258, -126, 709, 357, 351, -311, 526, 74, 352, 325, -1150, 45, -283, 878, -33, -130, 103, 9, -102, -524, 179, -173, -711, -770, 211, 100, 302, -54, -319, 353, -352, -267, 530, 193, 631, 453, -415, 479, -235, 175, -125, -1278, 51, 235, -854, -171, -366, -110, 263, 145, 591, 323, 642, 166, 260, -496, -56, 218, -22, 772, 144, 644, 234, -30, 375, 158, -202, 127, 622, 767, -731, 266, -9, -365, 174, -458, -107, 864, 274, -25, -187, 297, 38, 355, 154, 287, -835, -471, 140, -1, -803, 192, 606, -881, 616, 322, -129, -235, 486, 1001, -350, -90, 538, -771, 87, -285, -895, -494, 102, 446, -379, 76]
7156G6j98M0n44Q0L77j68O3k13m1M78Q54j365R54m24M92J38j197k6J013J8k25
7177A82p59K50N30n79J053n03j4p57R92m73p8O90l6m89p1k64O47p53m97J032O99
7198H02j303O88m28Q71q14K3L12l58Q36n60k32O86n06k40K17P00p62k40O74p44
7218c78Q77r20K60j49m53J457r73J055m81O13j049L82m27n08N26K58J37o94Q06
7237C39k89j24L76p13M32Q43q17o39Q09o12J147o21M34o41J288q24P6L73j359
7256e22P88M89j162L95lL89N58j326O40o94J711j055j8l16M71q44P86m17j58M44
7276A56m23l14r1O57k25k11j51P91K49m68O3k77O41m73K54k90N7l45J060m30l18
7297h8L53p13M28o30Q31j63k18R5N92q72K70M64l81L02N47j307K19J17M76j16
$$ y = [76, -122, -82, -626, -546, -169, -337, -274, -487, -528, -50, 804, -561, 393, -31, 461, 599, -598, -624, 389, 407, 182, -577, -327, 203, -376, 677, 174, 160, -597, 395, -78, -156, 534, 498, 9, -62, -326, 321, -432, -929, 103, 802, -501, 187, -241, 630, -184, -161, 151, -207, 629, 69, -163, 523, 17, -223, -6, 694, -68, -308, 366, -378, 499, -421, -161, -310, -763, 694, -279, 776, 295, 908, -141, 241, -186, -694, -168, 90, 227, -467, 339, 50, -74, 302, -411, 21, 864, 47, -592, 217, -395, 752, 131, 565, -76, 1212, 388, 464, 837, -522, 266, 755, -407, -12, -15, 374, 932, -394, 246, -448, 1263, 208, 190, -126, 345, -499, 287, -130, -288, 156, -267, -581, -672, -15, -240, -451, -602, 189, 438, -30, 33, -244, 397, -76, 178, -112, -55, -400, 660, 230, -88, 265, -448, -20, -650, 181, 18, -200, -105, 487, -385, -115, 349, -32, 270, 817, -490, -271, -154, 322, 206]
7317B06K81j067K58J162j4j788J890n57j151J502j248N98r26J389M0J9j287o11
7335a304J373j75Q25m10p86M26j86p3P55j60J27J16n40M98p56j97L25M22n21j12
7355c53k06L12J79Q77l77l59m43Q31p80N10rr43O51N10n18O94j153J174l23R79
7375A253j884J83N31K57k61n68L70k26L92p02Q44k76J48j051J062N8R81r38j048
7394h75J61q4R11j76K86o51M48K05o11L40J56q3k08q38P30J55J75K92J7k80j066
7415i96r9O02J012k49K20j31o47l00J76k64P42M4j76J46K6j98o92J746r70M28
7435D20J11m58m62M36j52L8k37p08R84k89Q32n78M48j54L74N43j257o82Q82p99
7455g08Q64m40N11R87j351K63J34l37K23L6p5j88j82m36J870o48r15J66R4ql60
$$ y = [206, 487, -580, -322, 840, 826, -962, 928, 371, -780, 722, -526, 72, -854, 535, 575, 594, -693, -1304, 69, -106, 719, 309, -477, -51, -237, -310, 445, 285, 412, 528, -12, 486, -270, -467, -142, 280, -241, -353, -559, -247, -68, 809, 432, 73, -370, 461, -319, 191, 182, -761, -110, 400, -118, 576, -577, 597, 274, 1253, -631, -448, 83, 340, 79, -489, -119, -345, 47, -655, 189, -87, 61, -990, 72, 130, 1111, 173, -875, -714, -798, 113, -63, 223, -428, 20, 225, -386, -46, 110, 27, -181, -1019, -289, -134, 41, 333, 350, 70, -996, -1095, -493, 519, 270, 490, 359, -288, -588, -412, -676, 66, 110, -66, 80, 106, -92, -784, 962, -8, 420, 531, 73, -389, 47, -105, -67, -304, -1012, -28, -317, 515, -63, 385, 231, 605, 1148, -109, -791, 91, -708, 156, -284, 227, 1214, -137, 126, 260, -77, 146, 182, 107, -81, -263, -699, 1171, 523, -392, -226, -132, -140, -500]
7476e00P79n05P64q85L04n58j58K69O97L06n55k29K68m91J88j34J18L37R6N58
7496F69n81O08o78P93L0j554N36L91l50j71k92J513o44k40J79M55j538M05J68
7515c01J337l97j331R62n99L62L10k74m35l17L44N61j91J170j483J723j343l06
7533b08R31q30L61P36j111L15o91k82M73O34o69r5L13Q71o88r79J798j011n95
7552g27Q42N71l76p24J59L05K80L73J63r67M13q69Q82m93N16q37O50M10o88n27
7572f44J197p80P61L26n55O9j145P21r74K16J422j245L4O80m6j44J94k01M45k07
7592A24q95L42O71n27L61l1J00k26K7N47j3n17k44L03K99l48l27P70n58M62j123
7613h03J004j089Q67J39r5j25j09L13o8q9l0M22J36p47oN89q92J2n7Q82J96p30
$$ y = [-500, 279, -226, 538, -347, -43, -601, -759, -490, 207, 513, -42, -271, -3, -494, -306, -440, -322, 15, 111, 669, 88, 696, 18, 811, 841, -713, -177, 214, -136, -307, -599, 914, 270, 30, 209, 664, -874, -469, -301, 1036, 639, -692, 270, -329, 33, 343, 69, -366, -683, -339, 222, 31, 1201, -282, 1441, 98, -208, 723, -107, 254, 990, -121, 194, -497, -779, -306, 328, -341, -436, -123, 748, 60, -919, 879, -132, -727, 115, 686, 310, -414, -255, 50, 330, 703, 866, -101, 312, -557, 325, -168, 348, -489, 161, 571, -117, -644, 553, -227, 534, 860, 305, 374, -771, -50, -1024, -808, 614, -631, -597, 83, 37, -107, 87, -114, 331, 124, -771, -429, 242, -285, 76, 45, 145, -81, -54, 493, 480, -37, -281, 22, 321, -27, -354, 416, -142, 320, -803, 201, -888, -21, 118, 23, -102, -211, 102, 34, -55, -85, 337, 473, -274, -280, 309, -583, -571, -628, 254, 450, -280]
7635b80j47K34n20Q62j65L21r99Q77L33l24j36j81L9m47M44q39R03K93q98R58
7655C28o09k65J176k19m06o60O20L12p27Q05N4j261M27p56Q70k2Q66p02n5r44
7675a168J400N00p20k05M74M68n97o12k59N85k1k81Q03m02O70j214J47Q57O0j300
7695h15J038k77K34k82L42P45j319M01J32k46R13p39l81M38K72q67J101j073K12
7714a71M52q10J175q54P37j80m06o40L03l85J21P56n59N81n50M30r3J657k052
7733d88K77r52J462L34N28j008l39Q47j149Q81q23j0N3K84O48k86j126N70K01
7752i6P19l29J51q39j67m1N28o17O10M23r44L53Q69j40l2l26R3J68m47j66N81
7773C51K04l04Q06r56k08N57j140J0L09L80N1j060J067M5j42J85K2n89O58m89
$$ y = [-280, -427, -193, -713, 149, -16, 305, -694, 183, 516, 192, 56, -125, -86, -533, -89, -928, -25, 268, -630, 328, -281, -546, 630, 411, 5, -655, -35, 277, -450, 355, 409, -852, -425, -1181, -311, -333, 533, -169, -224, -1168, 232, 732, 12, -193, 281, 749, 152, -460, -719, -134, -155, -436, 367, -35, 635, -579, -432, 425, 485, -815, 223, -54, 180, -102, 240, 985, -334, 67, 199, -47, 866, 127, -254, 184, 456, -411, 690, -383, -171, 281, -529, 646, -208, 529, 349, -57, -697, -394, -779, -658, 98, -461, 120, -430, 0, -93, 1564, -488, -211, -1163, 299, 633, 1161, 153, -186, 661, -488, 393, -430, -440, -387, -103, 545, 259, -867, -297, -96, 623, 294, 445, -394, -561, -602, -74, -691, -81, 342, -602, -249, 620, 480, 448, 122, 215, 383, -64, -230, 351, 555, 251, 1057, 101, -107, 450, -690, -680, -371, 9, 60, -1000, 67, 112, -30, 155, 177, -412, 246, -243]
7793b43J06J004r97R1l84M78M67j177J37O41J74j34m84R3q18P30O2L70o48J033
7813E01k82j43l1L42o55L60m20j13L96l97O07M23p82M56o29M29j39n15Q70k42
7833C6m5j5m32Q66L98o83j16n95P53q4o98J56M16l75N67k52o8L13k65K8L74k5
7855B54j01m90L37J27M94j083K44j82R34j069P28o15M30L7m11J197p74P1j59L6
7875Ek85J29m67O61O7m46p76M65Q52l11J3p43J191m5L83q5n14o99P65l1R5k40
7897a6j97r1R86k97K76m54k89N0P8k92K95n8K09l17L44j58m50k91J382j825M74
7918f41O67m27J97O2k32k2m7J10K85n3o2L66r1M42L39j377J84P33M34p32q98J794
7940A031o52l42M1r98n4J368o84J86M8J34O24j259O38k84l07N10M77l83n61L86
$$ y = [-243, -137, 867, -130, -39, -423, 55, 522, -655, -518, 123, 297, 163, -321, -228, -1046, -316, -254, 116, -532, 501, 219, 76, 45, 387, -268, 92, -328, -441, -45, -442, 165, 588, -194, 262, -367, 62, -77, -592, 278, 36, -9, -24, -456, 410, 808, 125, 9, -586, 167, 83, -615, -459, -43, -418, 149, -103, -171, 142, -123, -95, 279, 254, 153, -337, 0, 127, 621, -462, -218, -400, 534, -535, 193, -422, 8, 45, -366, 831, 57, 128, -31, 5, -280, -151, -618, 43, 110, -336, -1112, -647, 205, -106, -93, -836, 355, 310, 693, 608, 94, -605, 160, 129, 224, -16, -213, -304, 682, 385, 661, 207, -82, -32, 46, -246, 49, -9, 200, -117, 227, 69, -381, -672, 710, -1115, -641, 26, -401, -204, -142, -374, -396, -443, -333, -48, -101, -163, 203, 112, 554, 893, -484, -300, 433, 867, 135, -763, 1031, 379, 37, 78, -920, -974, 394, -290, -104, -56, 78, 702, -557, 81, -203, -510, 0, 477, 94, -467, -81]
7960h1l07K84l09O10K3N7j065J209n68J229r42n38R57n24j90O50l70j17L20l26
7980Bl70P12q83O01P61m06n75Q74k19j101J125o44K98q15J724j409M12M01n19
7999c1l62L13N98j065J115r14O27l25N35J22K62n51m56J68k93J7R2j000J316j94
8019b6L25n51P15m93K57o40N65j77J59j88O52r04L21p05P03M15k58J33m09j44
8039b50N1L85o67P21n51R55p19m08N50K74P1K19r71j21M78N57j10o67J449j952
8059g06R03K8p94M42N7J58o49O71q42K81N60n81M07J04m40N99q04Q13n46M83q33
8080f89J7P48J28p08M10j60J17j22L30M68p05j14k57J651j211k63M58N26m40j52
8100C2Q98j309j5j88R13l11k22m04O49L5J93M04j050N74m99K03Q29l06P0q48Q40
$$ y = [-81, -388, -104, -413, 197, 220, 277, -788, 421, -147, 1082, 140, -398, 559, 35, -155, 495, 125, 8, 328, 2, -368, 344, -539, 62, 823, 417, -158, 716, 497, -604, 521, -123, 175, -640, 1084, -325, 87, 488, -31, -393, -80, 518, -547, 568, -346, 281, -44, 491, 613, 875, 324, -132, 36, -257, -240, -148, -1148, 168, -26, 299, -252, 463, -30, 227, -413, 152, -25, 134, -54, 598, -306, 15, -690, 13, 428, 170, 303, -106, -250, -199, 186, -481, 240, -311, 644, -75, -483, 67, 341, 412, 631, -340, -461, 17, 574, 464, -203, 1246, -706, 197, 225, -569, -127, -70, 88, -561, 110, -732, -451, 109, -472, -65, 39, -401, 198, -606, 207, -339, 144, -689, -672, 76, 204, -504, -94, -254, -137, -259, 71, 539, -166, -280, -537, 1114, -97, -360, 98, 624, 184, 32, 930, -379, -394, -582, 331, 20, -202, -606, 43, 78, 271, 675, -375, 199, -300, -97, 732, 426, 496, -352, 488]
8121D88j183J416k92l17k38L56j54J76m02M42L2o97K34p32R81N49p25PK16p64
8141f07N87K03l42p21P84K33M21j390J532q69j91O32k56P5q85L56l37Q98P53j535
8161f59L25J27N86m24p3P44j116O62J91mq64L25J97n35K10K48N76L88j010M69
8181C63L99j319JJ141r27P48K2Q0M8o95
$$ y = [488, -695, 721, 429, 112, -126, 230, 76, 252, -150, 292, 324, -373, -139, -871, 110, 659, -66, -59, 157, -607, -20, 183, -159, -880, -96, 137, 558, -832, 700, -169, -360, 272, 16, 91, -794, -438, -775, 123, 876, -659, -334, -207, 379, -45, -118, 626, -490, 172, 363, 359, -505, -180, 17, -518, -308, -60, 516, 904, -106, 363, 762, -557, -556, 585, -342, 406, 428, 508, 556, -139]
8191a39
$$ Imaginary data points
##PAGE= N=2
##DATA TABLE= (X++(I..I)), XYDATA
0@%%%%%%%%%%%%%%j1J19k16K16k16K18l26M32m36N44o50P58q70R80j187J360j516
31h01J726j986K254k514K835l209L581m000M472m971N521o135O797p516Q305r176
47d817J0124j1158J2289j3531J4914j6438J8134k0034K2158k4572K7347l0556
59a6140L4311l8798M4284n1126N9945p1808Q8712j14902J61082k66079R55049
70G84530q3236j746699J006322Q49580m73221r67699L20018R17502k74366q23377
80d90646J82044N05819M20141p63730p11259J267348N72789j489228k15957J290245
90E67566K33267j227945k84118J289430Q4521j177572J31495O59783R2469l49584
100A9312n84695M51649Q42416o68124q06684O67950Q94092o50282j071815R12034
$$ y = [0, 0, 0, 0, 0, 0, 0, 0, 0, 0, 0, 0, 0, 0, 0, -11, 108, -108, 108, -108, 110, -216, 216, -220, 324, -326, 432, -438, 542, -645, 715, -801, 925, -1061, 1193, -1321, 1514, -1695, 1886, -2114, 2358, -2613, 2908, -3227, 3570, -3946, 4359, -4817, 5307, -5851, 6438, -7093, 7821, -8617, 9517, -10517, 11641, -12931, 14416, -16140, 18171, -20627, 23657, -27469, 32476, -39332, 49380, -65522, 95560, -170519, 784530, 701294, -1045405, -39083, 810497, 337276, -630423, -310405, 607097, 332731, -490646, -308602, 197217, 617358, -146372, -857631, 409717, 982506, -506722, -722679, 567566, 800833, -427112, -711230, 578200, 662721, -514851, -383356, 276427, 368896, 19312, -565383, -113734, 728682, 60558, -746126, -78176, 815916, 165634, -906181, 5853]
110E853J012233j147240o15965R82959L48989n91371m41018L46803N96761l03688
120A94316o13959J35934O77634J10203r90116r0806J301073k03490j258947M34341
130c03817J011645l88337q68867K76069Q27261k92081o73442J96575M31157J26762
140C42925m33746m66957O95924N43581r11410m24936R44478L95967r40791l90388
150f45353J029441K46889r91945m6704P14218L3026m17756k71988L01009M85232
160D36069l41705n87053L24501P02642l14076q71013M75779R31584o75530p43876
170f62678P28578N20259n59879m38902L86151M42788k91870m21583J19269M18104
180B40237R6101o00305k13403Q45587J11714r48951N3914Q94082r4640q19622
$$ y = [5853, 1018086, -129154, -745119, 237840, 586829, -4542, -445560, -98757, 498004, 194316, -419643, -283709, 393925, 504128, -485988, -576794, 724279, 520789, -738158, -303817, 707828, 319491, -549376, -273307, 553954, 261873, -411569, -214994, 216163, 342925, -90821, -557778, 138146, 681727, -229683, -654619, 289859, 685826, -254965, -645353, 384088, 630977, -360968, -407672, 306546, 339572, -78184, -350172, -49163, 436069, 94364, -492689, -168188, 534454, 220378, -650635, -174856, 756728, 81198, -662678, 65900, 586159, 26280, -412622, -26471, 416317, 124447, -297136, -177867, 240237, 336338, -263967, -477370, 368217, 479931, -469020, -415106, 478976, 384336, -435286]
190d35286J19297P79641j68544o37076J65497M22002L382l14880k68387L77788
200D3434M05507n03105m49337N58029M82296o24119m99848P41436M10502p77801
210b13006k24585O58493J37693m43223j93025L05167K85927k29607l68574J35907
220a48833M80595q7911o62556J55711P69048l14048p17830M06505N99176l76722
230A03135n07260L30854M46681k71371l51430J47513K89049M5339l62410k02065
240c31965N14318K07746o32152j61128O61470J25259o79609p7129O89046p130
250C08726o01422P9560M33822j1401k89519j38243K57636K61466k82304l49088
260c30767K90781M24758l42486n06564M51077M80069n45390l51091N21335K49334
$$ y = [-435286, -315989, 463652, 295108, -341968, -176471, 245531, 248913, -65967, -334354, 43434, 448941, -54164, -503501, 54528, 536824, -87295, -587143, 154293, 564795, -213006, -437591, 220902, 358595, -84628, -277653, 27514, 313441, 83834, -284740, -148833, 331762, 243851, -418705, -262994, 506054, 192006, -525824, -119319, 479857, 103135, -404125, -73271, 373410, 102039, -249391, -101878, 187171, 232510, -129900, -331965, 182353, 390099, -242053, -403181, 258289, 383548, -296061, -373190, 315856, 308726, -292696, -213136, 220686, 209285, -80234, -218477, 39159, 300625, 18321, -330767, -39986, 384772, 42286, -464278, -13201, 466868, -78522, -429613, 91722, 341056]
270C41056m01570k20348L07524K38573k19063k42535J07187K98384J313m45046
280b34525j6902N70166q2989n99504J54304N49470j74826n09060J81916M70938
290C08988j95077l61211J53594K56034J307k41505j41078L18309K01559l96072
300i5152k16776M26420K26867m80534k28065N36227J43582n25857m5156M12147
310A53703M1490k82894j07694K29151J85951j94926k33207J53913L18486j45165
320A18808m30571K15301M56908l17822m00447L31465L18289k89786k85288K46826
330c6317K64980k00120k11977J12876K11755J7031k87212p2332L95056M4912m42691
341b04039j0597M32799k911m47466J8341M37903p5528l67701Q0926K62750n66
$$ y = [341056, -60514, -280862, 26662, 265235, 46172, -196363, -89176, 209208, 210521, -234525, -251427, 318739, 235750, -363754, -209450, 340020, 165194, -343866, -161950, 308988, 113911, -247300, -93706, 162328, 163635, -77870, -218948, 99361, 300920, -95152, -311928, 114492, 341359, -139175, -367240, 168987, 312569, -213288, -258444, 153703, 195193, -87701, -195395, 33756, 219707, 24781, -208426, -54513, 263973, 118808, -311763, -96462, 360446, 42624, -357823, -26358, 291931, 2145, -283143, -36317, 228663, 28543, -183434, -70558, 141197, 158228, -128984, -201316, 193740, 238652, -204039, -214636, 218163, 215252, -232214, -213873, 224030, 148502, -219199, -138273, 124477, 123911]
352A23911k01744r8568K25977J66912k43050j97360K55213K49187k93016k82295
362b94833L56802K37137l91465j66780L34996J21955k58492j45519K09105J63011
372A65917j60414j74435J01853K34424m8599l17412P2749L78760j31371l67056
382b45584J58187L26942j51603l17489J41272K85789j39508k33360Q6147J91491
392A02284Q687k09592p3559K71702R4898k99621r0265L15009J03815l40150r4223
403b11015L56596M6362l30694k0853K52169M0537k00800r7268J82292J37816j66490
414a1348j68398J56317K23022j57989k65987K06738K68346k40962k28212K24190
424E717J96115j95117j95640J61558J82293j32515j76168P7335J89773j7823k39101
$$ y = [123911, -77833, -176401, 49576, 216488, -26562, -223922, 31291, 280478, -12538, -294833, 61969, 299106, -92359, -259139, 75857, 197812, -60680, -206199, 2906, 165917, 5503, -168932, -67079, 167345, 118746, -198666, -125917, 252843, 121472, -245584, -87397, 239545, 87942, -229547, -88275, 197514, 58006, -175354, -89207, 102284, 110971, -98621, -172180, 99522, 194420, -105201, -195466, 119543, 223358, -116792, -211015, 145581, 191943, -138751, -159604, 92565, 133102, -67698, -164966, 17326, 155142, -11348, -179746, -23429, 199593, 41604, -224383, -17645, 250701, 9739, -218473, 5717, 201832, 6715, -188925, -27367, 154926, 22411, -153757, -76422, 113351, 95528, -143573]
435a43573O503K91512j9060k98042L6154K98130l3701k92511L5407K79550m9025
446A11344k45259K8163J92482K0101j86235p6199J99638J04680k11357j19559
456a82201K22601J45433k32447j50458K61656J33541k55383j05241K18808J00904
466A57213j81156j26106J50777J39620j36710j59570J06229J86764q8505k26891
476a78335J04327K50549j20598k35071J28366K21064j07754k14043R3552K07229
486A49286q4196j90283M7105J75220l505j99039k9246K25378L2032k37559k9036
497a43843K37803M4909k38265m3017K46689L4880k24200l2148J90995N4406j72539
508d4330r1457J64268J08106j67558j24322J55161J46501j55847j66568J73713
$$ y = [-143573, -137070, 154442, 135382, -162660, -126506, 171624, 137923, -154588, -119181, 160369, 111344, -133915, -105752, 86730, 106831, -79404, -155603, 44035, 148715, -62642, -182201, 40400, 185833, -46614, -197072, 64584, 198125, -57258, -162499, 56309, 157213, -23943, -150049, 728, 140348, 3638, -155932, -49703, 137061, 48556, -178335, -74008, 176541, 55943, -179128, -50762, 170302, 62548, -151495, -57943, 149286, 65090, -125193, -78088, 97132, 93627, -105412, -134658, 90720, 122752, -114807, -143843, 93960, 138869, -99396, -142413, 104276, 139156, -85044, -117192, 73803, 128209, -44330, -135787, 28481, 136587, -30971, -155293, -132, 146369, -9478, -176046, -2333]
518b333J69425j74631j50812J63592J46946j34112j55206J18404J59218j05669
528C4822j62709P5869J70046n7184j97236M4243K15914n2271k14625N2389K10757
539A20015l4099k07792L1087K10010k3439j92835J1480J76391J7760j78747m8612
550a18781J86488N3276j94451o5623J85592P8824j88339q7024J95059Q8760j84588
561e0807q0318J69941R4503j46745j10025J41077J22042j36046j31468J16813
571a1033J41172j12807j63143J09165J67477j13143j63108J03038J64935q4277
581C8276j67153P9002J73847o4853j67165N2146J66294k8807j78899J1699J86835
592A01222j4581j91254L217J82140R016j85533j9318J89435K4882j78652k5696
$$ y = [-2333, 167092, -7539, -158351, 5241, 152187, 18075, -137131, -18727, 140491, 34822, -127887, -52018, 118028, 60844, -136392, -92149, 123765, 71494, -143131, -90742, 120015, 85916, -121876, -90789, 119221, 95782, -97053, -85573, 90818, 108578, -70169, -118781, 67707, 120983, -73468, -139091, 46501, 125325, -63014, -150038, 45021, 133781, -50807, -131125, 38816, 133319, -13426, -123451, 17626, 139668, 3622, -127846, -11033, 130139, 17332, -145811, -36646, 130831, 17688, -145420, -42382, 122553, 38276, -128877, -49875, 123972, 59119, -108046, -55900, 110394, 81587, -97312, -85613, 101222, 86641, -104613, -101396, 80744, 89760, -95773, -115091, 74344, 99226, -79426, -105122]
603a05122J68301M9797j60046o4209J64875P1650j60843q1093J48019R0826j47368
614b5213j10515J48068J07969j45386j07012J29525J18416j15725j26361J15079
624a1155J36717j04893j31424Q9337J42758p5534j58053P2355J57973p3994j57987
635a13900N4545J57281m5038j65947L7572J69315l1829j58230K1229J58195M151
646H7344j64212o378J67682J2537j62442k3827J55497L5350j62187m7984J58382
657D9762M7049j53552n7742J43814P1764j37468q0738J42611Q7460j29696q9157
668a05893J22196J03077j16213j12853J12485J12544j09242j18790R3080J22716
678A03107q7452j33613Q1674J36164p4014j33073O3845J41523m8950j42778M6929
$$ y = [-105122, 63179, 112976, -47070, -111279, 53596, 125246, -35597, -116690, 31329, 122155, -25213, -135728, 12340, 120309, -25077, -132089, -2564, 115852, 127, -126234, -11155, 125562, 20669, -110755, -21418, 121340, 45806, -112247, -39892, 118081, 44087, -113900, -59355, 97926, 52888, -113059, -75487, 93828, 61999, -96231, -75002, 83193, 87344, -76868, -83246, 84436, 96973, -65469, -89296, 66201, 101551, -60636, -108620, 49762, 96811, -56741, -114483, 29331, 101095, -36373, -117111, 25500, 112960, -16736, -105893, 16303, 119380, 3167, -109686, 2799, 115343, 6101, -112689, -19609, 103107, 15655, -117958, -36284, 99880, 25866, -107207, -43362, 98161, 49211, -93567, -46638]
689d6638J48248l8028j46624K6998J43741j6589j54560P611J49874n202j48668
700g9837p755J45034J9933j44282k6648J49432L4760j39441l9247J36464N3980
711A02393j33408o1517J30435O3980j27773p2962J14806P9287j12922r2049J09349
722c81R5187j04167r5640R7162J05468q5265j09402Q4849J16993p8291j15226
733h8713O7006J18701o0021j28098N1165J27231n0135j28830L7406J28053k7508
744D6257j30435K0840J36747j2767j29579P092J32849O838j33621j1506J32205
755F4920J5107j30309k6320J21356L3262j24333m4974J22374M6559j16034n2064
766i0456J12451O5049j06417o8690J07642P5822j00600p7267R2491Q4359r0225
$$ y = [-46638, 101610, 63582, -83042, -56044, 87697, 71108, -83452, -75841, 74033, 68831, -79837, -87592, 57442, 77375, -66907, -93555, 55877, 90637, -48804, -88051, 48413, 102393, -31015, -92532, 37903, 101883, -25890, -98852, 15954, 95241, -17681, -109730, -381, 94806, -9361, -105001, -7839, 97629, 12364, -97038, -12189, 104804, 26513, -88713, -21707, 96994, 36973, -91125, -39960, 87271, 37136, -91694, -54288, 73765, 46257, -84178, -63338, 73409, 60642, -68937, -61845, 71004, 77842, -55779, -67285, 64920, 80027, -50282, -76602, 44754, 78016, -46317, -91291, 31083, 77642, -38392, -90456, 21995, 87044, -19373, -88063, 19579, 95401, -5199, -82466, 10025, 94384, 4159]
777D159r1479Q2209R0086p8096r8775O9867J00445o2162j06399N8034J12027n0608
789B9308j08623M5356J15599l5591j15059L1885J15790k6739j16878J5252J13045
800F3345r704j17102j966J15863O208j14201j4018J16331K2317j11958k5492J14708
812D4331L4109j09573l6269J05286M2576j02797n0826R4914N4401r5020o2582
823h1450Q6671O7436q3681p5282Q3266P9821p6106p9942P4694Q6219o5815q5332
835f9501O1156Q9745n6571r2927M6180R1110m1170r7173L0151R8869k7343j03351
847g0825K3742J04119j4832j02922J3885J05558n098j01756K845J00636L485r6473
859c7636j6493R5064J9926r7555k8068R2319L2363r2462l9836R3309M4595r0674
$$ y = [4159, -87320, -5111, 84975, 6879, -91896, -22029, 78416, 16254, -90145, -32111, 79916, 29308, -79315, -33959, 81640, 46049, -69010, -37125, 78665, 51926, -64952, -49700, 63345, 53641, -63461, -65427, 50436, 56644, -57557, -71575, 44756, 67073, -44885, -70377, 44331, 78440, -31133, -67402, 37884, 80460, -22337, -73163, 21751, 76152, -18868, -81450, 5221, 72657, -11024, -86306, -3040, 76781, 675, -79267, -4573, 81646, 15831, -69501, -8345, 81400, 24829, -68098, -21918, 69192, 28022, -69151, -39000, 59869, 32526, -70825, -47083, 57036, 42204, -60718, -46833, 58725, 53627, -48129, -45284, 55352, 58837, -37636, -54129, 40935, 60861, -36694, -64762, 27557, 59920, -32542, -72378, 20931, 65526, -25148]
871b5148m4292Q9240M9868p8612n2234P7052N8188p1427o3724O3011O7086o2184
883F824p5671N4472P8463n5096q1729N0840Q3157m3623q4031M3517Q6231l4747
895B8607q0935K9095Q3885k0834q5546J2140Q6216r890r1869J983Q9896J41r3452
908e0563m052R1560R720q9093r572Q8626J7186q0170k2612Q0665K9141p4949l8288
921e2401P3328M1475p3742n1732P1446N0291p1784n3320O7593N5576o4208n4188
933f1666O0286N9279n0094n8816M6140O4763l8517o9882L3651P3697l4181p7888
945e3228K6601P9712k9874q1144K4523P8484j9711p5573J7934P5336o939p2078
957c5957K855P3675P335p5386j2613P6152J5515p8948k0269P4306J9786p6364
$$ y = [-25148, -69440, 19800, 69668, -8944, -61178, 15874, 74062, 2635, -61089, 1922, 69008, 6824, -68847, -14375, 64088, 8992, -72737, -21897, 61260, 17637, -66394, -22877, 63354, 28607, -52328, -23233, 60652, 39818, -45728, -33588, 52628, 42738, -49131, -47148, 42748, 42889, -50563, -54615, 36945, 46665, -42428, -52000, 36626, 53812, -26358, -48970, 31695, 60836, -14113, -52401, 20927, 62402, -11340, -63072, 8374, 58665, -13119, -66439, 1154, 56730, -7478, -61666, -1380, 57899, 7805, -51011, -4871, 59892, 21375, -48507, -14856, 58841, 24660, -53228, -26627, 53085, 23211, -57933, -33410, 45074, 25363, -50210, -32276, 43060, 36121, -35957, -33102, 40573, 47908, -27478, -40091, 36061, 51576, -27372, -47641, 26665, 46451, -29913]
969b9913k4554P3338K5535o8225k6992O4596L5787n7469l8588N6986M5622n2023
981D100n1038N0760N5530n2532n9966M9034N5274m7616n8643M1037N8935l8667
993F208n7668L3959O1189k4251n9028J9932O6210j3027o9949J1898O9639r516
1005C5596p3108M751P0285o272p0800J806O5587K964o2552q190O2251J6686n9864
1018b0860j8558O2117K6163o0880k9062O1151L1953o1851l5490N8880L0898n5872
1030a1411l7100N0527L7098m5771m0636M1886M6548l5913m7419L5105N5753l2837
1042A5830n5339L1377N7191l0423n9720K7598N5094k5250n7492J7538N5581j4095
1054A7890n4962P178N9127j984n7703O97O1760O819o2715o363O2750Q219o3037
$$ y = [-29913, -54467, 18871, 44406, -23819, -50811, 13785, 49572, -7897, -46485, 10501, 56123, 4100, -46938, 3822, 59352, 6820, -53146, -4112, 51162, 3546, -55097, -14060, 44875, 6208, -51460, -17501, 43688, 19437, -39591, -19659, 46551, 33524, -36425, -24527, 45112, 35596, -37512, -32761, 37524, 31252, -39548, -37742, 27845, 30809, -31743, -39933, 22318, 39004, -20860, -39418, 22699, 48862, -12018, -41080, 20071, 52024, -9827, -45317, 13563, 44461, -11411, -48511, 2016, 39114, -6657, -47293, -5407, 41141, 5228, -42191, -7086, 48667, 15830, -39509, -8132, 49059, 18636, -41084, -13486, 41608, 16358, -41134, -23596, 31985, 17890, -37072, -29894, 29233, 27249, -30454, -29757, 32003, 38822, -23893, -30256, 32494, 40713, -22324]
1067b2324r955N6201J1963n6790j7830N1749J9002m9293k4475M8964L0655m5146
1079g279l2867M7231L9007m5729l7451M4712L9193m3685l9324L6462L9139l5448
1091C961m4104K9674M2812k6172m5909K2565N0358j8604n0583J8066N5192j4117
1103B3139n2630J3792N3376j1135n3387O832M9785o091m9958k955M9323M626n1459
1116b6742p680N0993J1797m7608j4640N1767J9697n0291j8336N0173J9517m6085
1128g438k1935M0560K4714m2359k9154L6667K9630l3963l6697L4446L8846l2123
1140A194l8334L3067M0813k7232m0662K6865M4129k5413m3050K1223M0327j7585
1152A5342m5426J1184M5358j0634m7514P636M6856l798m6962L456M9280J028m6406
$$ y = [-22324, -32279, 23922, 35885, -20905, -38735, 13014, 32016, -17277, -41752, 7212, 37867, -7279, -40146, 7085, 46092, 363, -37088, 7624, 46817, 3132, -36192, 270, 39409, 3961, -40143, -10469, 32343, 6171, -39738, -17173, 33185, 14581, -36002, -17936, 37256, 23139, -29491, -15699, 37677, 26542, -26845, -20013, 29772, 23681, -26277, -29232, 20091, 24717, -26742, -34422, 16571, 28368, -19240, -33880, 17887, 37584, -12707, -31043, 19130, 38647, -7438, -29373, 11187, 35901, -6458, -35612, 1055, 30685, -3278, -39975, -5529, 33317, 1194, -37140, -4073, 36740, 9508, -31154, -4289, 39840, 14427, -28623, -7400, 32927, 15342, -30084, -18900, 26458, 15824, -31690, -24054, 22802, 19004, -27958, -24502, 24778, 25806, -20600]
1165b0600K6M5808N366m4033j0704M4366J0226m5813j4307M0166J7056m1810k2124
1178c6377M1693K2331l8227k3420M0088K6597l4882k6250L3564L1138l2180l1115
1190b7040K7552L3162k7625l6240K2631L5554k3612l8054J9657L9201j6503l9348
1202c0665J6787M1965j2798l9697J1006M3672r135m0678M553M0786k271m3900
1214b0375j966M0214K775m2128o737M0270R726m0853r830M0674J3766l6192j4118
1227b4774L8661J6954l4804k0324L5013K0766l4309k4934L0195K5194l2287k7424
1239c2073K9037K7195k5550k9623K5580L1783k0884l1268K1280L4426j8169l3884
1251b2150J5823L5981j5447l7809J1385L5342j1432l7169O282L6589m427l7727
$$ y = [-20600, -20574, 25234, 30600, -13433, -24137, 20229, 30455, -15358, -29665, 10501, 27557, -14253, -36377, 5316, 27647, -10580, -34000, 6088, 32685, -2197, -28447, 5117, 36255, 4075, -27040, 512, 33674, 6049, -30191, -7560, 27994, 4382, -33672, -14015, 25186, 8683, -30665, -13878, 28087, 15289, -24408, -13402, 30270, 21135, -19543, -14990, 25796, 23525, -20375, -22341, 17873, 20648, -21480, -28217, 12053, 21779, -19074, -28904, 11770, 25536, -10656, -24774, 13887, 30841, -3963, -24287, 10726, 31492, -2817, -27751, 2444, 27638, -4649, -32073, -3036, 24159, -1391, -31014, -5434, 26349, 5465, -25803, -4523, 29903, 11734, -22150, -6327, 29654, 14207, -23602, -12217, 23125, 11693, -25476, -19194, 17395, 12968, -24759]
1263b4759L127L9197Q16l4972k044L8312N759l7788n433L5975O697l4364j3616
1276b3093L4195J2262l5070j6018L1513J7773l2071j8642L1286K1880k8461k0256
1288b4702K7911K3917k3093k5499K3654K7018k3030k9310J9038K8358j9986l1439
1300b7163J5495L2137j5978l1492J4652L2459r957l1784J0025L3062m403l3282
1312a6229M832L3730k353l4640j884L4111N48l5005l661L1280M897l2356o349
1325b3079L2011J0593l0331j0377L0881J5230k8071j6689K8174J8301k8119k0370
1337b1846K6648J8263k6433k2081K3158K2772k3043k4507K1284K5528j7825k4670
1349b2752J6759K9398j4261k7451J3476K9946j3594k9474R319K9852j0929l1182
$$ y = [-24759, -21632, 17565, 18381, -16591, -18635, 19677, 25436, -12352, -17785, 18190, 24887, -9477, -23093, 11102, 23364, -11706, -27724, 3789, 21562, -10509, -29151, 2135, 24015, -4446, -24702, 3209, 27126, 4033, -21466, 2188, 29206, 6176, -23134, -4096, 24262, 4276, -27163, -11668, 20469, 4491, -27001, -12349, 20110, 10153, -21631, -11606, 21456, 17053, -16229, -11397, 22333, 19980, -14660, -16544, 17567, 18115, -16890, -20551, 10729, 15626, -16730, -23079, 8932, 19525, -10806, -21183, 9698, 24928, -3143, -19832, 8342, 26643, -1476, -21846, 4802, 23065, -3368, -25449, -2291, 20481, -2562, -27069, -5785, 19743, 1918, -22752, -5993, 23405, 9144, -18307, -4831, 25115, 11521, -17953, -8634, 21218, 10289, -20893]
1361b0893P788K7728n179k8874K027K9658M87k8710j202L1494N248k9614o315
1374a6357L1298P751l0574r617L0055P212k9485j1066K6794R693k5986j2678K4093
1387A133J5993k1342j7931K2099K2905k1642k0203K0560K3093j9887k3274J8025
1399d71K2394j8589k3932J4482K1066j1697k3650P835K6861p522k5579O260K8481
1412A5939k737k8165N299K9903m448k8830L367K6281l230k6039k134K4303K138
1425A1647k4877n849K3430R894k4217j0108K6577J3695k5880j2444K7566J1890
1437B1324k3461j3728K3972J1355k2762j3304J5917J4156j4932j9842J4856K1442
1449A4993j3781k1392J3217K6927j4104k4435J5946K5204j5021k1710J2240J8724
$$ y = [-20893, -13105, 14623, 9444, -19430, -17403, 12255, 12742, -15968, -17170, 14324, 19572, -10042, -16357, 14941, 22692, -7882, -17499, 12556, 19768, -9717, -20783, 6011, 15704, -10282, -22960, 1133, 17126, -4216, -22147, -48, 22857, 1215, -18988, 1572, 24665, 4778, -18496, -471, 21923, 3334, -20598, -6116, 14950, 3253, -20397, -12562, 14299, 6777, -18802, -12542, 15939, 13202, -14963, -9664, 20239, 15791, -13039, -9672, 16609, 13379, -12660, -14794, 9509, 11647, -13230, -19079, 4351, 14245, -9972, -20080, 6497, 20192, -5688, -18132, 9434, 21324, -2137, -15865, 8107, 19462, -3300, -16604, -687, 13469, -1463, -21305, -6449, 14993, 1212, -20180, -6963, 19964, 5860, -18575, -2629, 22575, 7554, -14156, -1916, 16808]
1461A6808q852k0431L558J9586l092k1764j802K3826L475k6503k920L0941J400
1474A4230k7506L20K7956J611k4815j367K1032K595j8843p894J4899J0879j7681
1487d584j5752J8817J6971k0431j8182K4199J8171k3019j3652K2462J3384j7694
1499F90j1312J4094J2080j0304j5874N185J8052o710k2762N170K4370o958k6064
1512b0343Q878K7550r581k2629J2101K0624q442j5709M283J3800R16j6826n493
1525a0871J6927P783k2710j0650K4628Q893k7310o218K8411M710k3902j998K2375
1538A0068K034j5399l916J1897P631p848j5861O758K0361j2915k3231J4700K2970
1551A7249j8531k1415K0582J8478j9718j0798J6106R957r081q179L800J3081o11
$$ y = [16808, 7956, -12475, -8917, 10669, 7577, -14187, -15989, 7837, 11312, -15191, -18111, 12830, 14230, -13276, -12956, 15000, 16611, -8204, -9571, 11461, 14056, -4787, -12681, 2218, 13097, -4584, -20336, -1519, 15452, -4979, -23161, 1038, 19209, -3810, -17462, 5000, 18384, 690, -10622, 3472, 15552, 5248, -10626, -5441, 12611, 5901, -16861, -11691, 12679, 5721, -20343, -11465, 16085, 6504, -16125, -4024, 16600, 8158, -7551, -3268, 10532, 11448, -5378, -10871, 6056, 13839, -8871, -19521, 5107, 14000, -13310, -19528, 8883, 13593, -10309, -12307, 10068, 12102, -3297, -7213, 4684, 12315, 4467, -11394, -4636, 15725, 2810, -20421, -5721, 17249, -1282, -22697, -2115, 16363, -3355, -14153, 1953, 11910, 2829, -5350, -1550, 11531, 10920]
1564A0920j7219m488K1837J418k7747n0K7431l682k7845Q606K2676p643j6740
1577a2526P588J3673j977q790l817J0008R785j1323j6800J5675J6538k2781j6577
1590b1324K5898J0628k6766n582K2637K471j5821j202J2579L849k685j0125J581
1603c862J7970k997k2019K805K6090j1491k7159J4878K2753j9067j6166J6737
1615a528J0292j1563o414P944N638K697p657o723J3371J1191k0923j0986K5963
1628A1302N146l1199R01K5926n766k2720Q174J4728m459q503J057M441Q691k082
1642E637j5459Q342J9024j1643k2364J8838J8569k5283j3882K4238O061k2049
1654i971j382J4091r89m558k109J386Q066N583j4962m940K2843J615k7448M191
$$ y = [10920, -6299, -10787, 11050, 12468, -15279, -15329, 12102, 8420, -19425, -10819, 11857, 4214, -12526, -4938, 8735, 6758, -2032, -5849, 4159, 13944, 2621, -14179, 1496, 18034, -4747, -21324, 4574, 15202, -11564, -17146, 5491, 7962, -7859, -9061, 3518, 7367, 4682, -5443, -3862, 14108, 11111, -10908, -8103, 17987, 6496, -20663, -5785, 16968, -2099, -18265, -1528, 8764, -2799, -9213, -1269, 4369, 7066, -591, -7314, 6057, 17248, -3675, -14661, 11302, 16448, -14751, -13850, 12076, 6310, -16410, -8236, 6492, 2033, -6470, -5413, -972, 7719, 5637, -9822, -1480, 17544, 5901, -16463, 2375, 20944, -4339, -18221, 6017, 12078, -9971, -11353, 2738, 1749, -2809, -4918, -3532, 4534, 10117, -4845, -9785, 13058, 14673, -12775, -8584]
1668h584K8820j3381k4336J4921J4774j4297r597R707L412j720k511l461L757
1681b496J3951j0415j5625K0563J3895k4479r576K6805L159k8154Q11K2703p174
1694C968j3256M424L392J303J920q534k144J9238j494k2109P876K5692j4041k3154
1708a6919K0583J5771k3124q820J7559J483j2453K20K927L11N309m914j0646J5348
1722B635J1625k2501n538K8779o25k6243O883K2369j1652j7493J1852O434r720
1735c195j099O81j581Q196q42j5696P591K1181j3863j9054K2763J4835k4379o829
1749a1291K4194j576j9494N702P861m881k123l79o610R167P622j6457n135K5786
1763A2386k991k5428J0899K5417j7260j5976J9056P802j6382l125R977k726k662
$$ y = [-8584, 20236, 6855, -17481, -2560, 12214, -2083, -11680, -1973, 1439, -281, -2792, -6253, -2496, 11455, 1040, -14585, 5978, 19873, -4606, -14182, 12623, 15782, -12372, -11561, 11142, 3968, -9288, -4864, -1472, -169, 1751, -6783, -8927, 10311, 8817, -13292, -5416, 20276, 6235, -16919, 3664, 19435, -3689, -12509, 5050, 6533, -5920, -5700, -2773, -2462, 2847, -2067, -12713, 2635, 14260, -8241, -13779, 15000, 14375, -11868, -4985, 17384, 5732, -11761, 91, 6525, -3195, -4294, -3613, -5194, 3002, 2160, -13536, -5945, 15236, 1373, -17681, 5082, 19917, -4462, -11291, 12903, 11327, -8167, -2465, 5396, 515, -1608, -1987, -8597, 570, 8192, -8265, -13400, 12386, 9395, -16033, -5134, 20283, 3023, -12953, 6103, 13905, -2477, -5602, 4375, 1649, -1013]
1776a013J737q818K884J5374j3591j4640K1948J1902k6805k241K7952l928k2773
1789a2012J0245J5582j2013o596Q328l514m6M560j1303l323J7853l547k1507J1415
1803e878K3121j8929j5569K3627Q885k1613M23J6379m525q662M771r79k687Q390
1817F754q515j1529J5155R792k5389Q77K4791n096k2886J3355J8695j7189p312
1830h497J4743J83o946L835l329l223R796l158j5920Q380J6886j7877j2829K3759
1844E803O292k3653J635K1750o354j2902J0081N106o717K477j291p918R361N799
1858I469j9389j351K3369q010k1905J3934J8374j8934r616K0507J952j3856N278
1871a78O856n822K517J206j0396N633J2620j5377j1941K1163M319k4167K629K2500
$$ y = [-1013, 724, -8094, -5210, 10164, -3427, -18067, 3881, 15783, -11022, -13263, 14689, 10761, -12012, -1767, 13815, 1802, -4794, 3534, 20, -26, 4534, -6769, -10092, 7761, 4214, -17293, -5878, 17243, -1686, -17255, 6372, 15257, -6356, -5933, 10446, 5921, -2741, 2030, 1051, -1636, 6754, -1761, -13290, 1865, 11657, -13732, -12855, 11936, 6840, -16046, -2691, 16004, -1185, -8497, 6246, 6429, -517, 3318, -11, -3234, 6562, 3404, -12516, -4136, 12750, -5127, -17956, 5803, 12095, -11558, -9923, 11827, 5473, -7429, 2652, 7758, 1041, 3518, 2227, -5691, 3670, 9469, -9920, -11271, 12098, 4088, -17817, -3883, 14491, -4443, -14059, 6448, 8400, -5456, -178, 6678, 856, 3373, 4579, -5817, -184, 12436, -2941, -14882, 6281, 10600, -13567, -10938, 11562]
1885A1562p896j7357J2790J0313j1409R38N687m717L467M849j1832q54J6969q504
1899D006j9131J4172J4874k0447r010K1768K82j6674M565J3020o368k664N206
1912C599m275K109Q146r296r203J6822J970k1236K649K0863j0379j8110J5220
1925a121J1367j6338j867J1848k147l285M233l935N71J0526m796j4637J2626J0786
1939A3831j8466p474K0683n41j9881M877J4283q294o979P898J596k452M391l143
1953C29l998J0683J599j5835L573J7572j1012j6329J5842R058j8898l623J4613
1966C574j756q974N027K387k462M447m16p787R087Q042j3911m969J8442j472j9620
1981a0361N769J6011j2025r771J0050L241p478P88L329k432N213K077j0104M324
$$ y = [11562, 3666, -13691, -901, 9412, -1997, -1059, 4628, -89, 3378, 8227, -3605, -4459, 12510, 4006, -15125, -953, 13921, -6526, -15536, 6232, 6514, -10160, -5595, 7425, 1057, -1607, 3599, -676, 1433, 9579, 283, -8920, 7902, 9872, -11364, -8715, 12148, 1769, -16341, -1121, 10246, -6092, -7959, 3889, 1742, -1543, 2690, -1245, -674, 9852, 5056, -9581, 3045, 13831, -4635, -12109, 8574, 8033, -11848, -6971, 7312, -982, -7961, -63, 1533, -919, 3472, 329, -3669, 7014, 8613, -7222, -3649, 13923, 2911, -13418, 2424, 11482, -7416, -11039, 3574, 1818, -7156, -2129, 258, -2204, 2243, 1827, -5960, 3127, 11169, -2742, -7711, 10731, 9259, -10361, -4592, 11419, -606, -10377, -327, 2914, -4564, -3776, -447, -2879, 2334, 4411, -5693, -1369]
1995a369J3372r578j2523J5280P819j7715l254J5740m085j2650N720O237o159
2008c165O38J823k862L665O210r555j917J4209j706j5617P882J3696j1992j0815
2022i506J1918M570j3062J100O893l949o75K128m033K172Q208n670q878J3231
2036D447P506j6532j937J7090l484j3978N480R277r220m157N150r08o59K149m944
2051d720j06R579r22j2124P774J1934j0598r034J3704L937j2524l59Q999k849
2065B691o483L329j767n10M676m889m039Q317L820j1165j58J6038m371j3168P578
2080a01R678q782n828Q354j1m937J051j066k84K919k057o732O156R614j0836o201
2096i063J4010M168j3491J560J1231l145q085L930L126m484n7m82k993M361J302
$$ y = [-1369, 12003, 2425, -10098, 5182, 13001, -4714, -7968, 7772, 3687, -8963, -3243, 2994, -3165, -2527, -704, -3566, 99, 6309, -3246, -5163, 9046, 7340, -8277, -395, 13301, 1309, -9506, 2412, 6982, -6080, -4980, 1913, -2036, -2711, -583, -4616, -2444, 5764, 94, -8784, 4447, 11953, -4579, -6516, 10574, 7090, -6888, -1408, 7869, -1351, -5508, -358, -1266, -1925, 224, -4720, -4826, 4753, 3831, -8293, -519, 11415, 817, -8217, 5487, 9424, -3100, -3459, 5540, 2691, -3792, -463, -2230, -2740, 1936, -2953, -6992, 1325, 5145, -6020, -6178, 9860, 5489, -7679, -101, 9577, 795, -5033, 3321, 3310, -1627, -576, -1642, -1926, 993, -1064, -7796, -1640, 7974, -2862, -9063, 4947, 9115, -4376, -2816, 8415, 5270, -2815, 1115, 4241, -243, -300, -782, -3775, 586, 1888]
2111A888q214J513J0947n117r572Q526Q984q997n375J0430J029p946J101M330
2125C527j993j581q31k818L635L681p830l870J0454J339r963K435J0692l799p770
2140d692N833M396l958j810J380k77J684j554m962O18O590m224p421P117N914
2155D634p623m052J0698J661q056J032O385j969k282R43o88K078L32n582j343
2170c832N984M63r513K696Q527m567o920O465N930n609l196O510Q41k063q13q65
2186C8J212J977l980m947O028M068r576j035Q436m25p901J583Q294j711n010L274
2202C25L051j120j325j875Q05M585k211n760K585N818o083n873N939N095p105
2217c149j873N944J361l401O52J308J291M9j341j898N103M86p212m04O548j428
$$ y = [1888, -6326, -4813, 6134, 1017, -8555, -29, 8955, -42, -5417, 5013, 6042, -1904, -803, 3527, 1534, -47, -878, -3696, -61, 3620, -4210, -8080, 2374, 3713, -6250, -3815, 6877, 3078, -4692, 1141, 5537, 1579, -231, 1149, 872, 2556, 1002, -3960, -3342, 3248, -976, -8397, -1280, 4634, -2989, -7041, 3657, 5318, -2738, -1706, 4679, 2710, 428, 1371, 683, 2761, 3093, -2489, -3832, 2152, 2615, -6898, -4202, 4325, -242, -7162, -697, 5233, -376, -3572, 2938, 3779, 1716, 903, 38, 1250, 3227, -753, -5700, 328, 4396, -5180, -6215, 2221, 1796, -6105, -4522, 3772, 2061, -2949, 325, 3376, 2256, 931, -944, -139, 4446, 2235, -3525, -940, 4878, -1205, -7078, -1139, 3956, -3149, -5022, 922, 2283, -1118, -466, 842, 2133, 2182, 841, -1057, 4046, 4532, -2680, -3084, 3464, 2036]
2233B036r147L102O864l493n566M013M503k931j115J976J873J207j667l743M596
2248B508K271m235m723O089J868p319j583O544N82o809Q19M431J060k927j49K126
2264E53K463r08l189P64N055k843m932K118N154m722m805L677L189l734k136L177
2280a119J967j430j683J335K775J520l385j990N407R63n161j355N428j64p948
2295d840J943M076j150l067JK689J713k126j471K461L707k920k864M214K680n587
2311e41k438M922K630o058j485K797Q03l062j436K697J440N2l161J874M164j153
2327B045j698J56N132k922n338K682L339k219l761J498J803q34k642j23L598L90
2343A106l351r7M265K056m662o04M686r2n021R61L056j67l951j195L659q4k207
$$ y = [2036, -7111, -4009, 2855, -638, -6204, -2191, 2312, -619, -1734, 242, 2115, 3322, 1655, -2088, 2508, 4779, 544, -4179, 1910, 3778, -3541, -5124, 1420, 2002, -4807, -3988, 443, 1503, -1424, -1573, 553, 3016, 2108, -1081, -317, 4738, 1895, -3037, -919, 4235, -487, -5292, -1615, 1574, -2160, -4296, -1119, 848, -582, -2265, -930, 1845, 3365, -20, -2010, 3397, 4360, -801, -2156, 3272, 3108, -4840, -2897, 1179, 29, -3038, -3037, -348, 1365, -761, -2232, 229, 3936, 1016, -1848, 2366, 5046, -541, -2979, 1943, 4573, -1485, -2970, -173, 630, -2432, -3868, -1171, 269, 321, -2840, -966, 3198, 2045, 347, 503, 5635, 2713, -2625, 57, 3396, 1177, -2584, -1086, 717, -117, -2759, -2882, 716, 1106, -2245, -2342, 1923, 3979, -683, -1287, 3399, 3307, -1714, -753, 2303, 2136, -1815, -3010, 649, 565, -1642]
2360a642j546K027J853o08k248J893L139j723k559K794K643k992l139L455J970
2375C317l296k232J094K762k562j933Q97K900r85k808J025M292J94l570N66L677
2391C338q59l637O60K486J21m419M00K938j543l103P65K974J562l455j015L477
2407F90P56j750q62L785J106l014k217L191L58k045k154J508J886k053k909K156
2423a568L727l650o51O57L684j157l110K880K742j516l054J320K403j304l484
2438b081P71K642j451l112P90J644J081k868pL546J395l687K21L665o32k197K00
2455h0J907J293m281q7J283J872l535j406K267J809k799j289L040J219j369k235
2471b391L116J995j162j823J073J586j823j489N72K529k207k414O2J932m78j671
$$ y = [-1642, -3188, -1161, 692, 84, -2164, -271, 2868, 1145, -1414, 1380, 4023, 1031, -2108, 1347, 3317, 21, -2211, -1117, 1645, -917, -2850, -1953, 947, -38, -2846, -1821, 2471, 2665, -905, -339, 3338, 2479, -1158, -498, 1988, 2109, -2310, -1910, 1028, -515, -3618, -2853, 121, 1683, -1772, -2787, 690, 1446, -304, -1166, 2619, 3725, 711, -1506, 1685, 2043, -2, -2156, -648, 1238, -815, -3724, -1568, 2159, -1491, -2142, -1485, 2199, 1042, -2068, 812, 3554, 2038, -1016, 304, 2707, 1403, -2081, -1310, 1332, -119, -3231, -2441, -797, 284, -2584, -2591, 955, 2350, -1337, -1116, 2549, 1917, -280, -80, 1827, 3120, -1161, -1248, 35, 1907, -1628, -3034, -767, 1042, -1757, -3046, -6, 1213, -156, -2391, 725, 2720, 1558, -265, 808, 2394, 571, -918, -346, 2183, -24, -2438, -2376, -444, -922, -2593]
2487b593P20L401q40k303J110K430N68k390J19J799l39k504r26K679M42k974r03
2504b504L309j244k440L32L115J187k368o55J877K328k769kJ143J531l097j542
2520a799K085J441k957j790J561J932r25k414J097L316r60j713R72L583j570k652
2536g93J831J567p03k927j82K367r99l091J212J909l47k388N39J458R71j656n79
2553a811K593N87p22j359K440O87k775M53J358m23k935p14K018Q37j260k193J960
2570a259J068j199o03J576L556l092l63J159K294k167j464n09K653j789k017J495
2586f61Q39p96j834K82K750r11j339J807J033P82j976O33J246O8k116q8J679J30
2604A528j961j695J924J55k463J51K903j196l69J47Q61J420q58j076J760J267
$$ y = [-2593, -1873, 1528, 688, -1615, -505, 1925, 2493, 103, 222, 2021, 1682, -822, -1748, 931, 1373, -1601, -2504, 805, -439, -2879, -2547, 568, 1755, -613, -1268, 609, 2937, 168, 166, 1309, 2840, -257, -1799, 286, 1727, -1230, -3020, -1459, 473, -452, -2866, -1769, 1547, 587, -1126, -154, 3429, 1859, -793, 1038, 2605, 1902, -1025, -1207, 1160, 161, -2930, -1718, 191, -156, -2544, -2005, -547, 424, -1232, -1811, 782, 1369, 647, -712, 1728, 2415, -360, 93, 1451, 1028, -1907, -2621, -603, 234, -1026, -3219, -1259, -191, -1390, -1993, -417, 3139, 47, -316, 843, 3137, 970, -494, -1003, 1650, -139, -2156, -661, 178, -618, -2452, -2170, 580, -331, -1670, 137, 1170, 1952, -24, 609, 1855, 1923, -193, -281, 1398, 1528, -433, -2128, -204, -49, -2512, -2361, 542, -654, -1023, -876, -15, 1405, 547, -529, 1231, 2498]
2620B498j526j378Q47J138j570j903J215R45j740n64M52J411J96j852J548J841
2636A558j16j117P1K555j440j052j14J850j378k139J26J662p60k476Q52J297N54
2653f7j504rK478J060j691p79K189O51j656j060K068m47k133K62N29O2j117j489
2671b653J914l31N69r07J445J013j210q23J085J802j203r84J408O94j411j507
2687a099L82M07N3q98q50J862o61o9R7J673N7j490m79L443m47j764m41J501L64
2706A641k131J79Q87j436q79n21J825R25r15j051J494J544j729l20J229K238k132
2723H48r73J361L57j496j23K98Q69k421j115P56R33K44j480J533P07N5j671J196
2741a22K149p35j201J093K45k72j543j23J705m00k561M44M89P46j322Q41J37N93
$$ y = [2498, 972, -406, 441, 1579, 9, -1894, -679, 266, -1474, -2038, -1586, -175, 21, -1831, -283, 1558, 1442, 325, 396, 2951, 1511, 459, 345, 2195, 817, -1322, -1196, 466, -294, -2770, -1918, -621, -67, -1571, -1580, 898, 1958, 267, -512, 1677, 2328, 672, -388, 1680, 1233, -900, -638, -109, -47, -1164, -2653, -739, -1070, -501, -1408, 37, 1050, -160, -983, 102, 1904, 701, -283, 1125, 1819, 408, -1099, -717, -310, -257, -1155, -2005, -143, -804, -873, -776, 897, 954, -536, -1015, 2428, 1981, 217, -224, 1277, 1641, -490, -311, 576, -860, -1739, -2260, -435, 490, -425, -1476, 18, 1562, -167, -487, 742, 2980, 848, -125, 1236, 1593, 97, -26, 272, 1141, -1280, -2395, -1639, -706, -462, -1942, -409, 298, 353, -1318, -122, 2027, 1292, 91, 1184, 1429, 1157, -386, -509, 1196, 796, -1765, -1321, -832, -86, -1408, -567, -430, 163]
2759A63K36j013J623O88j262K43L05P93j619j421J733N39j501j159P84O61j686
2776a893j274K144J868j283j050L194k58r49l26N65J767j128j650K69R73p25j456
2793a212k53J862j66k029M14J344M08j804J501Q67n71j277R41J602k09j071j228
2810h81K012o93j624M99P4O7j574J341n25J858n71r73M96K038k301Q12J589l98
2828A246r90O4k98O77p69l39p85J333m79j321J735J35p16q37Q38J063Q60j352
2846F5O87k35R83j958n26J615R0r85j84K75m35m38j339K372J41j358J85K058P59
2865A772j912O09j48J009j683l0J515n54n99j023J081L19j760k3O04J372j366
2882h17l8P17J448j46j327M60J414m34p83P13Q1p44j455P66O72p20r05j42J639
$$ y = [163, 399, -614, 1009, 1697, 435, 678, 983, 1776, 157, -1264, 469, 1008, -493, -1652, -868, -207, -1893, -3167, -1023, 845, -438, -1488, 1706, 1448, 499, 173, 738, 2505, 1377, -273, -4, 969, 244, -1212, -1465, 397, 231, -1798, -1384, -40, 368, -1436, 65, 932, 361, -916, 25, 1627, 1418, 347, -881, 1131, 438, -1186, -687, -613, -546, -2120, -779, -1304, 554, -17, -990, -494, 1544, -757, 55, 1644, 1246, 256, 320, 22, 699, -70, -409, -1194, 139, -340, -1661, 74, 209, -507, -1344, -506, 557, 1417, 65, 752, 517, 1500, -458, -984, 631, 721, -264, -448, -173, -608, -1046, -2385, -13, 128, -1230, -1045, 1013, 1772, -140, 469, 321, 1330, -353, -383, 1132, 578, -21, -1044, 37, 356, -1404, -1427, -823, 549, -817, -855, -138, 1310, 1164, -163, 297, 1711, 1277, 494, 1207, 1288, 544, -911, -145, 527, -193, -1098, -1240, 399]
2901C99r70J79J65J312n16j062R24J004j58j882M5N31O52l49r80J232J9j465o76
2920a596L02K087k069J353R52j188J95N8P89O01o2j259J111j21p99p84K86J85
2938D1l7j380j1J890j271J05m6J364O3q0n67J408O59j383j64J021k82j837J41
2957c66N05l91r86j9N10O14l27j241J776L94k30N0K43M26q09J134K09J6j147j546
2977a185N04J208k064M59P78Q27j233j97J302M68n05k97J372L11j041r4n03J644
2995A754r38j27o80N60q84mQ09L3p19o62p30J328k55l65J283N20N58m32p28J398
3015A719j159j579J299P0O88k127j08J161o78j97k72R36K88r59K10J165J77m91
3033A43M77o85J704q12r21K13M3r27j258J437O45r85p73O06O86P68r08M22J332
$$ y = [399, -571, -392, -227, 1085, 569, -493, 431, 1435, 1277, -605, -560, -29, 623, 274, -706, 526, 545, -920, -1596, -1294, 793, -1276, 77, 1029, -159, 36, 94, 883, 1484, 1422, 163, 1274, 1153, 354, -430, -144, 41, 4, -1376, -1387, 503, -768, -663, -709, 655, 718, 638, 71, 1479, 2138, 755, 591, 1612, 1330, -507, -366, 139, -252, -1238, -1257, -747, -133, -460, -1701, 75, 469, 239, 289, 532, 958, 149, 1283, 1492, 1508, 361, -1185, -681, 527, -1537, -1078, -300, 527, -706, -903, 399, 867, 362, 65, 1437, 1748, 707, 613, 110, 1754, 816, 689, 9, 569, -315, -319, 490, 523, -196, -858, -1588, -260, -515, -880, 403, 923, 1481, 1049, 321, 1719, 560, -1019, 280, 350, 1038, -1089, -1197, -36, -714, -911, -1183, -247, 41, -918, -708, 457, 634, 143, 620, -65, 1639, 827, -94, 119, 162, -765, -2023, -586, 59, -926, -1699, -1093, -407, 361, -547, -125, 1207]
3052A207j271l58J513M06q24n89l90P0L49p54j20J105j68p11k9j26R92j17j229
3071a044P21M90n04K95R02Q61j595J35N10p46m78o65J51Q76K29m57k4N21m15j13
3091c50J22Q93j04q89O70J290p37q58M26M00l95n56l2o65J252j835Q63Q61L23
3110F79j055O7L02j82N07q12J460o19K74p68q2J016r05o27M58j19L34j721Q24
3129i69R63n84k64J639J8r53q59J699J72o97m11O48Qj052J023j432J055m42p84
3148a222Q2J164j56q09N41O04o63M66k01R57m1n68J117n97K42n10j35o04l52N44
3168a41j230R21p8o29Q81J015j311J421j207J666j26j424K52M87M00o71k61m53
3186d88j35n74J46P71j74J71j136Q59J486j746O20J96P64Q8l01O9K4K76r66P6
$$ y = [1207, -64, -422, 1091, 1497, 673, 84, -306, -236, 113, -641, -761, 344, 176, -535, -564, -690, 302, 185, -1044, -323, 167, -337, -42, 860, 1721, 126, 261, 771, 25, -453, -1118, -967, -91, 138, -319, -343, 178, -237, -350, -228, 665, 561, -328, 342, 1632, 895, 37, 463, 863, 468, -88, -120, -785, 467, -1368, -505, 356, 679, -376, -309, -7, -189, 318, -494, 966, 347, 621, -147, -229, 787, -118, -745, -287, -406, -72, -1793, -969, -6, -590, -854, 785, 803, -150, -1009, 690, 862, 165, -246, 402, 410, -642, 381, -1051, 4, -438, -1222, -1140, 24, -132, -941, -400, 204, -459, 7, -194, 763, 722, 154, 1271, 674, 916, 406, 271, -333, -685, -141, -1371, -450, -528, -1157, -276, 739, -572, 849, -358, 1308, 1182, -242, 10, 497, 897, 226, -35, -488, -623, -1197, -1051, -280, -454, -283, -1419, -560, 926, -820, -200, -4, 760, 848, 547, 616, 640, 916, -50, 26]
3206B6M69p08r25k80J510n48m07O84J76l0k46O04K45j19K87r62N57R8M71r82m2
3227a22k36l54M79l42n1j160J351N36l14K90J087q02J105p72k61L9J206j768N8
3246c1Q53n85n11j24l38R20q72q31J218J50L46J50j065J295l29K8K3O23O72j655
3266f3l47R54R2j957Q47L3j430J577q58M83k28J860p40j49O0P8P34K53r64L01
3286E36j21m02l11n33L68r9P05j376O76o57O8R63N62k4K1p42O69k38J119j197
3306a3o6O82P66r50n41R43o42j539J124K77l16j18M52N29p96K70K55n51P17M71
3326I54q79m5J203j055r36L80k94p16O25Q2j57M58M86L88m34o3P17p97N76K19
3346G12j206K89L37K83n21n54J044j126J161m03j67o58R54o5j07O99J07o99M50
$$ y = [26, 495, -213, -1138, -1418, 92, -456, -863, -179, -3, -33, -279, 325, 570, 451, 738, -224, 333, 431, 902, -80, -122, -358, -712, -233, -575, -626, -1786, -435, 101, -213, 77, 1164, 362, 1467, 695, 434, 473, 1679, -89, -31, 822, 237, -274, -398, -736, 184, -688, -1519, -301, -151, 195, 345, -720, 575, 246, 274, 297, 920, 1592, -63, -410, 544, 636, -1321, -474, -441, -1871, -294, -1152, -669, -897, 963, 223, 74, 134, 212, 946, 1199, 235, 536, 415, 13, -298, -831, -463, -562, 143, -1233, -557, -1214, -1146, -183, 379, 355, 376, -366, 303, 65, 1184, -13, -79, 603, 1369, 419, -122, 821, 179, -1360, -236, 41, -275, -393, 59, 588, -208, 62, 317, -234, 483, 954, 75, 30, 1233, 178, -758, -378, -672, -1388, -763, -681, -838, -380, 106, 494, 60, -3, 714, -83, 493, 712, -494, -205, 132, 415, -106, -660, 384, -742, 419, 16, -151, -809, 145, 80, -27, 672, 779, 80, 530]
3365E30Q94p82j134N33M22m78M62m23k62j097L32j29K78P04P31j214O82J176r16
3384C09n07J53M07l28M21J5o88q02R44M07n94Q94j315K23R28j141k74P98P83q84
3404b51m21K96K17M92o55Q14q94P04M15j181M28L89p76n17J034M69p41n8j69J115
3424G10k294J600J620j488o68J484k11r0k39r21N74m39J111j141l57Q12m88j129
3442a554O59J266r37N48N80n43O96j67l65r7J30J80j228J152K5q75j07R87J48
3461D98j827J497j73J30k04M94j29L83j222K036o25r90M92j132L36J458j976Q98
3479e6J03n01qN06n3L50M9k02j18p66N65p2P04o82l44N8l53P63j51o11M87J241
3501I09k176j93J708l51k01P05K61l6j008L77K3O4J97n6k85P87r25j74M16N1j02
$$ y = [530, 1424, 642, -492, 41, 463, -15, 447, 24, -238, -1335, -1003, -1132, -854, -150, 581, -633, 49, 1225, 309, -198, -45, 362, 34, 455, 470, -218, -1020, -76, 331, -263, 631, -684, -461, 467, -674, -948, -150, 633, -251, -672, -376, -159, 333, -322, 492, -402, 302, 717, -464, -36, 353, -423, -940, 94, 563, -178, -236, -405, 710, -1584, 16, 1636, 148, -520, 964, 753, 663, 424, -497, 77, -362, 749, -392, -749, 63, -425, -1554, -895, 371, -566, -18, 562, 19, 715, 548, 183, 86, 216, 396, -832, 320, 345, -530, -637, 350, 498, -1329, 168, -5, 125, -79, 415, 286, 669, -553, 1483, 858, -132, 360, -772, -436, 1022, -954, -56, 47, -454, -462, 44, -9, 341, 390, 188, 70, -696, -131, -203, 501, -181, -525, -467, -820, -57, -208, -819, -332, 909, -1267, -1460, 248, -103, -304, 401, 662, 626, -382, -5, 18, 82, 279, 223, -62, 725, -200, -374, 42, 93, -9]
3522ik386K673J84r16J64M5P78l00Q89j774O33M75n6r83M79L19j05l59M45j66
3542C0o41R17k51o02R09O25j028j53N39J15J27O81r14k94MJ238r48p82P63q3j727
3563a475L47J365j20m83J049j024k26R26k51m30J162q68j22j69K12K0m17PQ36
3582C39j110L90J107m01j700K087q02M47j41M10o11J99P55p75j78M0N40j107Q10
3601B99R0n03o59O5Q47p7j50L71n28m65J171r1j154J198N39j142j63R09j52j066
3621f61J160j268M06L43l53j62j35P56j2n42K71l88N56J47J006q91L93q2N93j535
3641c98l32R62j224J028k62n08R34N06o73o62J422n61k99J218p64L29j320O93
3659H9j91o19n7J253j417J293J41r22q13O01N53j85J41P35j326j88K426q81j454
$$ y = [-9, -2395, 278, 462, -454, -290, -245, 533, 233, 1122, -652, -19, 456, 400, -583, -104, 215, 110, -249, 196, 30, -611, 306, 55, -547, 362, 987, -41, -194, 345, 460, 587, 1268, 354, 60, 64, 1302, 354, -428, 335, 252, -1475, -1128, 237, 117, -366, 683, -341, -567, 359, 108, -322, 840, -28, -150, -319, -107, -87, -504, -497, 339, -771, -381, 726, 325, -1375, 712, -90, 357, 216, 626, 15, 214, 969, 194, 16, 56, 596, -511, 299, 389, -114, -773, -708, 139, 62, -88, 283, -245, -710, 461, 370, -784, 414, 953, -189, -352, 557, 405, -661, 499, -769, -363, -20, -373, -535, -670, 86, 74, -468, -197, -585, -29, 118, 1124, 233, 626, 544, 1137, -398, -730, 232, -992, 36, -226, -734, 200, 706, 33, -629, 793, 232, -67, 1151, 387, 716, -604, 89, -102, -721, -778, 475, -942, 351, 492, -430, -1243, -642, -89, -274, -133, 602, -724, -912, 1514, 633, -821]
3678h21J017P29j028p77J720p85p46N73k15q3L88J36j000L60P68J245k708J521
3696B94J20k88l12J197q25q97J140r85L8K78o7q88J242P0p3n51O85j10l01J083
3716H50Q65j769O85j52o55L2L26J024k244O95k2J43J9N13l70L31j439J632j284
3735h20J210K3n03p19J440l11n60L23K23k63K69j9m71o05P68M20o59O21J5p73
3755c91L75J003p32QM3N33m47m18M64o50l48K66N45j090j79O60L1K33m69J014
3775D51j481J579n2j258J785k64p33L58O53j027j012J300M42j986K69J214l20
3792h2o12J196K21r31j16k46k3N89L46m62N78q04J37k67k72J146j302K66O15j378
3812a401J105K18L45k82q3m04Q03p18R88k67m28P69o16K85n65O78o40j36k21O0
$$ y = [-821, 196, 925, -103, -880, 840, 55, -691, -118, -333, -416, -28, 108, -892, -532, 236, 1481, -1227, 294, 414, 126, -186, 1011, 186, -711, 429, -556, -518, -240, -307, -1195, 47, 117, 44, -507, 178, 68, -233, 850, 1715, -54, 631, 479, -176, -144, 182, 1206, -1038, -343, -365, -222, -203, 310, -60, 271, -1168, 464, -820, 390, 413, -90, -809, 631, 320, -240, 83, 306, 43, 312, 293, -178, -783, -15, 405, -254, 367, 382, -391, -16, 987, 255, 263, 306, 839, 392, -26, 438, -212, -560, -294, 251, -839, -1018, -358, -327, -94, -563, 451, -1030, 549, 497, -761, 1024, 760, 27, 385, 1038, 11, -1001, 299, 741, -1245, -976, 238, -82, -694, 502, 723, -208, -324, -570, -593, -4, 342, -120, 458, -346, -209, -476, -748, 398, -904, -638, -23, -1401, -296, -78, 267, -15, -98, -502, 301, -417, 571, 304, -124, 645, 29, 314, -251, 427, -213, -349, -570, -510]
3832e10L42k05p12J016j091J437Mk97J81J93O1J0R02j566M74M69k4j654N8O94
3852b18l9q7N95k32r47J291o39O90r8k73O27p53Q61o12m72K11M08n92K1L44r6
3873a0j614J073J057p51N51o62R16k32j08L89m50l15R14O6l02l59j52l86R26k23
3893C28q12J72M38p23J153m08N85n56j76l72p6J739j692J226r01j5m84m73N62
3912d85Q46j208k1J007o66RO59p52M58J043r22J106j112P7N34m38L41p68o89Q67
3932a14p82M90J89L92j427K04J072L11r21Q61O2j139J401k95J90l39K07j77n0
3951A35L77J06q67J77J16M35o42l31O93j299Q56J169j105J013o68K4J57p90N00
3970E6n12O03j434Q16j43Q0J130j501P56O47q2J12j394R42k60o03J388p41N88
$$ y = [-510, -168, -373, -1085, -69, -1160, 277, 281, -16, 165, 358, 419, 429, 1331, -235, 239, 708, 684, -970, -912, -218, -257, -344, 251, 19, -928, 363, -276, 414, 316, 43, 670, -83, 778, 166, -306, -95, 313, -279, -258, 86, -10, -1624, -551, 506, -245, 306, -356, 560, 328, 220, 609, 159, -156, 758, 824, 522, 163, 11, -375, 551, 328, -484, -312, 126, -597, 556, 148, 733, 177, 1, -371, -447, 1292, -400, 826, -75, -90, -574, -1047, -485, 361, -847, -868, 139, -527, -518, 141, -611, -153, 890, -32, 1074, -38, 39, 573, 135, 476, -292, -981, -114, -896, -406, -217, 175, -1252, -1048, 24, 335, -586, 275, 337, -802, 599, 304, 494, 155, 362, 185, 135, 512, 618, -249, -72, 44, 479, -163, -494, 199, -1100, -244, 925, -180, 833, 165, 189, 346, -444, 56, -456, 147, -1287, -471, -614, -534, 596, -905, -149, 498, 416, 528, -866, 76, -184, -787, 601, -140, 448]
3989D48m30L99q37L66O67p94J41o80R29P4K21k19j35R0n61J314k64l54J27n29
4009b7M33J9l22j15n91J536q23m83L1o20J128m32K89j59L54J33r59M58m68J342
4029G24j60l53j52N7p1L85j158M11P28j432L00R9M4l8J084J32k08K70p60P54j272
4050f16P91j93L13m34m87O5P20o4r15J188p12L15n97l41R55O00p88m50R34L70
4070F54m42k7J85r5k49L48l11J24j049J067L62j043M91l40L59L60p48N98j54K21
4090C11L47n55k50J22n90N57R28r77n66Q52L20l03j21L3J67p62k17J512k76n24
4110HM31o3n64k14N90k41O45m30k27N59p99J186j372L04O96n16Q93j178K90L55
4130C53l41N23q71K50O02j13n3q0j175N37M62n35J207j295k57R47k14n77L15l38
$$ y = [448, 18, 417, -420, -54, 613, -181, -40, -720, 209, 283, 504, 285, 150, 240, -321, 993, 729, 375, 502, -27, 406, 425, 103, -12, -603, 933, 110, -373, -342, -962, 166, -266, 23, -136, 218, 351, -608, -150, -618, 724, 564, 211, 59, 116, 45, 430, -728, -317, 411, -1021, -721, -622, -578, -616, 468, 600, 392, 662, -98, 656, -616, 175, -18, 295, -139, -626, -561, 159, 95, -820, 368, -344, -29, -626, -967, -12, 588, -200, -650, 284, 654, 212, 185, 370, 275, 26, 374, 63, 187, -862, 205, 567, -476, 15, -325, 34, 394, -354, 244, 90, 311, 658, 103, -147, -25, -615, -58, 870, -107, -673, 179, 499, 196, 75, 108, 275, -487, -704, 808, 532, 8, 439, 376, -188, -402, 188, -53, 592, 162, -65, 494, -305, 881, -491, -187, 509, -7, 886, -292, -2, 353, 12, 535, -336, -86, 516, 403, 350, 270, -905, -368, 94, -441, 766, -529, -786, 161, -53, -630, -315, -653]
4150f53J290K14q15J050r72k1l22K30N22p29M0j15Q04k47n22Q03P66j803J895
4169A415k269J331K65j324P32Mm30R46j363Q16j61n31O31j65L46m45j61M71m3
4188F5J84N5j37k95M36pr39Q55M07r31P9L17J9J60j34M26k79l09k58J78Ql3L25
4211A92J34j84q59N89j53J520j655K48O56j368Q41q39P46n05L87m9K20k66m63
4230h08J79N82M39l50j08m5M62K67m59M83K7l63M61p01J19P74m57J44j014L90
4250B2j90L65n72K12L59o51N18L20p67J72L05k72l29n49Q68Q21j075M96J4q11
4270g44J063m89O77J70p99N33O37j246J049q33p8N86o21o77P89p23N96J43j301
4289a268J425j57N94q35J06j39k78J47P20k37N33o51qj86Q5j57k14M00n24L94
$$ y = [-653, 637, 851, 36, 1086, 114, 93, -229, 1, 523, -206, -166, -281, 523, 276, -246, 557, 1323, -480, 1415, -854, 477, 742, -582, 150, 154, -276, 670, -693, 123, -38, -569, 62, -103, 243, -202, -363, 108, 65, 249, 304, 167, -128, 308, 301, -638, 217, 624, -307, -228, 89, 108, 268, 134, 560, 281, -28, -286, -108, -100, -133, 192, 326, 142, -717, -128, -281, 1239, -416, -168, 488, -880, -39, -878, -132, -637, -250, -299, -79, -345, -808, -629, -47, 392, 42, -66, -111, 351, 618, 159, 642, 669, 306, 767, 66, 185, 959, 502, 646, -368, 22, -168, 197, -375, -163, 196, -455, 63, 383, -384, -212, 93, -179, -508, -1057, -189, 632, -443, 53, 67, -744, 319, -170, 507, 677, -122, 411, 1048, -198, 851, 18, -60, 526, -95, -772, 17, -706, -110, 33, -1268, 157, 0, 594, -241, -135, -274, -552, -405, 315, 78, 611, -40, -48, -234, -149, -306, -520, -120, -644, -250]
4309b50k48k88Q10n6J191j534J39J342j206N28K83p33O95j02m80j40o21k54J245
4328C21o97M29n20k39N82J05K57n35l44p4K54Q01m32l88R33o41l19j01J018p27
$$ y = [-250, -498, -786, 24, -32, 1159, -375, -236, 1106, -100, 428, 711, -22, 673, 571, 91, -49, -670, -924, 321, -376, 53, -467, -706, -124, -19, 238, -297, -641, -715, -461, 340, -92, -480, 453, -188, -507, -608, 410, -317]
$$ [...]
8191a00
##END NTUPLES=NMR FID
##END=
