##TITLE=1H_SA_56.224
 D2O, 8 sc, 
 1.9.2020
##JCAMPDX= 6.0         $$ Bruker NMR JCAMP-DX V2.0
##DATA TYPE= NMR FID
##DATA CLASS= NTUPLES
##ORIGIN= UXNMR, Bruker Analytische Messtechnik GmbH
##OWNER= root
$$ XWIN-NMR		Version 3.5
$$ Tue Sep  1 12:48:14 2020 Russian Standard Time (UT+4h)  she@DPX200
##.OBSERVE FREQUENCY= 200.1315066352
##.OBSERVE NUCLEUS= ^1H
##.DELAY= (6, 6)
##.ACQUISITION MODE= SIMULTANEOUS
##.ACQUISITION SCHEME= undefined
##.AVERAGES= 12
##.DIGITISER RES= 18
##SPECTROMETER/DATA SYSTEM= spect
##.PULSE SEQUENCE= zg30
##.SOLVENT NAME= D2O
##.SHIFT REFERENCE= (INTERNAL, D2O, 0, 15.7039)
##AUDIT TRAIL= $$ (NUMBER, WHEN, WHO, WHERE, WHAT)
$$ ##TITLE= Audit trail, XWIN-NMR		Version 3.5
$$ ##JCAMPDX= 5.01
$$ ##ORIGIN= Bruker BioSpin GmbH
$$ ##OWNER= she
$$ F:/spectra/data/she/nmr/H-F/1/audita.txt
$$ ##AUDIT TRAIL=  $$ (NUMBER, WHEN, WHO, WHERE, WHAT)
(   1,<2020-09-01 12:46:58.45 +0400>,<she>,<DPX200>,
      <created by zg, POWCHK disabled, PULCHK disabled
       terminated by command 'halt'
       configuration hash MD5:
       00 E9 B6 7A A2 85 ED C7 34 08 36 98 17 FE 4E 26
       data hash MD5: 16K
       51 D8 06 6C 2B 16 68 BA 0C 05 33 3E 0E 13 72 10>)
$$ ##END=
$$ 
$$ hash MD5
$$ B4 3F 34 5A A7 E8 7A 03 4F 4B 81 51 DB FE 52 F8
##$RELAX= 
##$RELAX= 
##$RELAX= 
##$RELAX= 
##$RELAX= 
##$RELAX= 
$$ Bruker specific parameters
$$ --------------------------
##$DU= <F:/spectra>
##$EXPNO= 1
##$NAME= <H-F>
##$PROCNO= 1
##$TYPE= <nmr>
##$USER= <she>
##$AMP= (0..31)
100 100 100 100 100 100 100 100 100 100 100 100 100 100 100 100 100 100 
100 100 100 100 100 100 100 100 100 100 100 100 100 100 
##$AQSEQ= 0
##$AQ_mod= 1
##$AUNM= <au_zg>
##$AUTOPOS= <>
##$BF1= 200.13
##$BF2= 200.13
##$BF3= 200.13
##$BF4= 200.13
##$BF5= 200.13
##$BF6= 200.13
##$BF7= 200.13
##$BF8= 200.13
##$BYTORDA= 1
##$CFDGTYP= 0
##$CFRGTYP= 5
##$CHEMSTR= <none>
##$CNST= (0..31)
1 1 145 1 1 1 1 1 1 1 1 1 1 1 1 1 1 1 1 1 1 1 1 1 1 1 1 1 1 1 1 1 
##$CPDPRG= <>
##$CPDPRG1= <>
##$CPDPRG2= <>
##$CPDPRG3= <>
##$CPDPRG4= <mlev>
##$CPDPRG5= <mlev>
##$CPDPRG6= <mlev>
##$CPDPRG7= <mlev>
##$CPDPRG8= <mlev>
##$CPDPRGB= <>
##$CPDPRGT= <>
##$D= (0..31)
0 1.2 0 0 0 0 0 0 0 0.06 0 0.03 0 0 0 0 0.0002 0 0 0 0 0 0 0 0 0 0 0 0 
0 0 0 
##$DATE= 1598950018
##$DBL= (0..7)
120 120 120 120 120 120 120 120 
##$DBP= (0..7)
150 150 150 150 150 150 150 150 
##$DBP07= 0
##$DBPNAM0= <>
##$DBPNAM1= <>
##$DBPNAM2= <>
##$DBPNAM3= <>
##$DBPNAM4= <>
##$DBPNAM5= <>
##$DBPNAM6= <>
##$DBPNAM7= <>
##$DBPOAL= (0..7)
0.5 0.5 0.5 0.5 0.5 0.5 0.5 0.5 
##$DBPOFFS= (0..7)
0 0 0 0 0 0 0 0 
##$DE= 6
##$DECBNUC= <off>
##$DECIM= 32
##$DECNUC= <off>
##$DECSTAT= 4
##$DIGMOD= 1
##$DIGTYP= 9
##$DL= (0..7)
0 120 120 120 120 120 120 120 
##$DP= (0..7)
150 150 150 150 150 150 150 150 
##$DP07= 0
##$DPNAME0= <>
##$DPNAME1= <>
##$DPNAME2= <>
##$DPNAME3= <>
##$DPNAME4= <>
##$DPNAME5= <>
##$DPNAME6= <>
##$DPNAME7= <>
##$DPOAL= (0..7)
0.5 0.5 0.5 0.5 0.5 0.5 0.5 0.5 
##$DPOFFS= (0..7)
0 0 0 0 0 0 0 0 
##$DQDMODE= 0
##$DR= 18
##$DS= 0
$$ [...]
##$SUBNAM2= <"">
##$SUBNAM3= <"">
##$SUBNAM4= <"">
##$SUBNAM5= <"">
##$SUBNAM6= <"">
##$SUBNAM7= <"">
##$SUBNAM8= <"">
##$SUBNAM9= <"">
##$SW= 16.880792210976
##$SWIBOX= (0..15)
0 0 2 0 0 0 0 0 0 0 0 0 0 0 0 0 
##$SW_h= 3378.37837837838
##$TD= 16384
##$TD0= 1
##$TE= 0
##$TE2= 300
##$TE3= 300
##$TEG= 300
##$TL= (0..7)
0 120 120 120 120 120 120 120 
##$TP= (0..7)
150 150 150 150 150 150 150 150 
##$TP07= 0
##$TPNAME0= <>
##$TPNAME1= <>
##$TPNAME2= <>
##$TPNAME3= <>
##$TPNAME4= <>
##$TPNAME5= <>
##$TPNAME6= <>
##$TPNAME7= <>
##$TPOAL= (0..7)
0.5 0.5 0.5 0.5 0.5 0.5 0.5 0.5 
##$TPOFFS= (0..7)
0 0 0 0 0 0 0 0 
##$TUNHIN= 0
##$TUNHOUT= 0
##$TUNXOUT= 0
##$USERA1= <user>
##$USERA2= <user>
##$USERA3= <user>
##$USERA4= <user>
##$USERA5= <user>
##$V9= 5
##$VALIST= <valist>
##$VCLIST= <CCCCCCCCCCCCCCC>
##$VD= 0
##$VDLIST= <DDDDDDDDDDDDDDD>
##$VPLIST= <PPPPPPPPPPPPPPP>
##$VTLIST= <TTTTTTTTTTTTTTT>
##$WBST= 1024
##$WBSW= 4
##$XGAIN= (0..3)
0 0 0 0 
##$XL= 0
##$YL= 0
##$YMAX_a= 88192
##$YMIN_a= -116625
##$ZGOPTNS= <>
##$ZL1= 120
##$ZL2= 120
##$ZL3= 120
##$ZL4= 120
##$ABSF1= 10
##$ABSF2= 0
##$ABSG= 5
##$ABSL= 3
##$ALPHA= 0
##$AQORDER= 0
##$ASSFAC= 0
##$ASSFACI= 0
##$ASSFACX= 0
##$ASSWID= 0
##$AUNMP= <proc_1d>
##$AZFE= 0.1
##$AZFW= 0.1
##$BCFW= 1
##$BC_mod= 2
##$BYTORDP= 1
##$COROFFS= 0
##$CY= 11.3945322036743
##$DATMOD= 1
##$DC= 2
##$DFILT= <>
##$DTYPP= 0
##$F1P= 16.9975609425685
##$F2P= -3.02152046262296
##$FCOR= 0.5
##$FTSIZE= 0
##$FT_mod= 4
##$GAMMA= 1
##$GB= 0.15
##$INTBC= 1
##$INTSCL= 1
##$ISEN= 128
##$LB= 0.24
##$LEV0= 0
##$LPBIN= 0
##$MAXI= 10000
##$MC2= 0
##$MEAN= 0
##$ME_mod= 0
##$MI= 1.114404
##$NCOEF= 0
##$NC_proc= 0
##$NLEV= 6
##$NOISF1= 3.799351
##$NOISF2= 2.8
##$NSP= 1
##$NTH_PI= 0
##$NZP= 0
##$OFFSET= 15.70392
##$PC= 1
##$PHC0= -9976.522
##$PHC1= 10.60091
##$PH_mod= 1
##$PKNL= yes
##$PPARMOD= 0
##$PSCAL= 0
##$PSIGN= 0
##$REVERSE= no
##$SF= 200.130013532006
##$SI= 16384
##$SIGF1= 3
##$SIGF2= 2
##$SINO= 400
##$SIOLD= 16384
##$SREGLST= <1H.CDCl3>
##$SSB= 0
##$STSI= 0
##$STSR= 0
##$SW_p= 3612.71676300578
##$SYMM= 0
##$S_DEV= 0
##$TDeff= 0
##$TDoff= 0
##$TI= <>
##$TILT= no
##$TM1= 0
##$TM2= 0
##$TOPLEV= 0
##$USERP1= <user>
##$USERP2= <user>
##$USERP3= <user>
##$USERP4= <user>
##$USERP5= <user>
##$WDW= 1
##$XDIM= 8192
##$YMAX_p= 0
##$YMIN_p= 0
$$ End of Bruker specific parameters
$$ ---------------------------------
##NTUPLES= NMR FID
##VAR_NAME=  TIME,          FID/REAL,        FID/IMAG
##SYMBOL=    X,             R,               I
##VAR_TYPE=  INDEPENDENT,   DEPENDENT,       DEPENDENT
##VAR_FORM=  AFFN,          ASDF,            ASDF
##VAR_DIM=   8192,          8192,            8192
##UNITS=     SECONDS,       ARBITRARY UNITS, ARBITRARY UNITS
##FACTOR=    0.000296,      1,               1
##FIRST=     0,             0,               0
##LAST=      2.424536,      0,               0
##MIN=       0,             -116625,         0
##MAX=       2.424536,      88192,           0
$$ Real data points
##PAGE= N=1
##DATA TABLE= (X++(R..R)), XYDATA
0@%%%%%%%%%%%%%%%%%%%jQj9K4k4K4k4K6l6M6m9N8o9P5q5R8j10J24j39J57j80
40i6K04k26K49k75L04l36L72m13M55n01N54o09O68p35Q11q94R86j093J212j349
60g12J512j699J919k192K539k986L588m467N926j7199O6757n1784P062l4373r0516
75a16625J12415J588J0143L4212j23541J6754N2520j3567R4910o4048p0606M6377
87a9468l5545P8325M9533r4419J6156m3110n27J14791l9189j1080j1933q3680
99h0146Q5579L5585j7443L7667r7057j0511O9819j6110O6052k9158q8622M3652
111f93j6007M2063O2467q8124p473j2998k2447J00411j7852l9754L932p5177N2967
124a8685N7919l4307K6624o6201l7550P6154p702L5977n02r1679L0554J1507J5208
$$ y = [0, 0, 0, 0, 0, 0, 0, 0, 0, 0, 0, 0, 0, 0, 0, 0, 0, 0, 0, 0, -1, 7, -12, 12, -12, 12, -12, 14, -22, 24, -25, 33, -36, 39, -46, 52, -58, 66, -73, 84, -96, 108, -118, 131, -144, 160, -176, 196, -217, 238, -263, 291, -318, 350, -385, 426, -468, 518, -575, 637, -712, 800, -899, 1020, -1172, 1367, -1619, 1969, -2498, 3428, -13771, 52986, 1202, 8264, -26109, -116625, -4210, -2622, 7521, 41733, -81808, -65054, -12534, -26101, 68809, 4761, -65845, -19468, -55013, 23312, 72845, -21574, -5418, -48528, -49055, 65736, 26547, 15467, 3534, -80146, 5433, 41018, 23575, 61242, -35815, -46326, 23493, 7383, 73435, 44277, -44345, -693, -16700, 25363, 87830, -294, -7767, -20765, -43212, 57199, 39347, -407, 3525, -71652, -18685, 39234, 4927, 31551, -34650, -72200, 3954, -3748, 32229, 31727, -59952, -29398, -17891, -2683]
137b683O8435o7063l0899J4207k6236Q0818J1086n5911R522n2634K4296P4057
149D6995l2327R159l5435n2845P0676J0930Q651J6284q3809R271L3694j817N9998
162E9425m2857n3303K5174k1036N3935L3049o4948K182l0251j256P8759k3552
174A5321j2681j2015n9535N5333L0933j2143K2460o7649j2715N0011o392M4998
186C5926j8173o5150K6456n110L0407M8174o0080j0789o898j4502P3290n138l0422
199b009Q53n1663L5585M8253k1422J7105m7113l1315N5956k14K4575J394p0161
212d0176J7757J1468J0707N1486m8531k8186Q889j9614O0315J2593m4846N027
224c111m0365J6004N9226k3040N333k6730m3787N3466J1236O955J3549o5774M007
$$ y = [-2683, 65752, -1311, -32210, -18003, -44239, 36579, 47665, -8246, 1276, -51358, -27062, 46995, 14668, 23827, -11608, -64453, 6223, 17153, 25804, 42088, -41721, -32450, 1244, -573, 59425, 16568, -36735, -11561, -32597, 21338, 54387, -10561, -8379, -38630, -39886, 38873, 15321, 2640, -9375, -68910, -13577, 17356, 5213, 27673, -39976, -52691, -2680, -9072, 35926, 17753, -47397, -20941, -26051, 4356, 52530, -7550, -18339, -25237, -39739, 33551, 28413, -2009, -1156, -52819, -17234, 31019, 9597, 26702, -20411, -51726, 4230, 4016, 28591, 29985, -40176, -22419, -10951, -244, 51242, 2711, -25475, -16586, -36200, 24115, 36708, -8138, -3111, -43476, -27472, 31754, 8714, 14047, -12683, -56470, -3004, 8232, 15187, 28736, -37038, -33031]
237c3031K7623L16M7846l1434m3487J8714j4708M3021K8716m8888o5k3326j40
250b8843O3233j4950r893j0735m6554M3644K6180p856J7212n4099j2118L9258
262D479k859L5651j4155n3723J9217m422K5450L8916m7729j0802o499j1095N9470
275C1899l070k4572p02m3027K9190L9568j6312J3676l9894k6539M5181N18K1572
288B7488P4n8273J2935R389J0479M2846l9449k4535O849j5506N0551J1166l5751
301a737K557l3100J3197M9805j7096L879k3554l6081M3441J0858O299J0117n5047
314b6462K125K2684J145L9824k6467l7226J4532j1707L6854K4578m1718p10j9668
327b2216j25N4483j2435q305j0028m0220L6856K1963n960J4074m7818j0963L3592
$$ y = [-33031, -5408, -5092, 42754, 11320, -32167, -13453, -28161, 14860, 43576, -5312, -5377, -28703, -28843, 34390, 19440, 9547, -1188, -47742, -4098, 22082, 14226, 31438, -22661, -34779, 4479, 1620, 37271, 23116, -30607, -11390, -15812, 9638, 48554, 825, -9977, -16476, -27571, 31899, 28829, 4257, 3555, -39472, -10282, 29286, 12974, 26650, -13244, -39783, 5398, 5916, 27488, 27562, -30711, -17776, -8387, 2092, 44938, 5489, -19046, -12197, -27703, 22848, 34014, -1737, 820, -32280, -19083, 30722, 13626, 17505, -6049, -42130, 1311, 12169, 18468, 28585, -26462, -24337, -1653, -508, 39316, 12849, -24377, -9845, -21552, 15302, 39880, -1838, -2548, -22216, -22341, 32142, 19707, 11402, 1374, -38846, -1990, 19973, 14013, 28087, -19731, -30694, 2898]
340B898l153L1081j3119m7052J6102m294K2444L3514m1494r229n885r941N2357
353B4229k248k1173o59l7748K5894L4339j3013J1418l4966k2192L8744O35J9058
366B2318M9n0485J1428P507R976L8064l4709j9859M801j2612M4839R596l0071
379H42K453k9970J3046M3304j5259M189k1274l2306L8872P873O284Q660m9933
392b3219K383J8375R41L5648k5046l1256J1714j1209L3389K0534l5716J02j9222
405b2582J613M7514j0805n888r641l4466L2746J8994l566J1888m1730q471K8154
418C760j305K8052j1952l9444J3604l992K1567K8889l5046p897o460o646M5807
431B8937k534j6261k390l2933K3276K8598j0453R647l1548j9918L3075P6J7253
$$ y = [2898, -255, 30826, 17707, -29345, -13243, -17537, 4907, 38421, -3073, -12302, -18187, -28128, 24229, 21981, 808, 149, -37599, -11705, 22634, 9621, 21039, -13927, -36119, 2625, 3260, 22318, 22367, -28118, -16690, -9183, 793, 38857, 4148, -15711, -10910, -23522, 21317, 30913, 842, 3295, -26675, -13629, 29675, 14416, 18605, -2669, -34975, 3897, 11770, 18054, 26714, -23219, -20836, -2461, -1520, 34128, 9082, -22174, -10460, -21669, 11720, 32254, -3462, -3360, -22582, -20969, 26545, 15740, 9852, 211, -34255, -1509, 17485, 13919, 25807, -15923, -24394, 3760, 2455, 30507, 18555, -20889, -7285, -11277, 10290, 39179, 4133, -3764, -10224, -16870, 28937, 26403, 10142, 7752, -25181, -1905, 26693, 16240, 25887, -5661, -25579, 7496, 7572, 24825]
444B4825j634m4564R449N437R129L2056l0446j7481K534j0388L9065P812k5398
457C96R28k6077J2111L6704j2031L940k0204k6335L2144P590P123O034m2046J395
471a8328J5568L243K9922k0926k6893Q876p991K9502J7550k9253j475j6377J708
484a4874M0229p921n478r575k9836K7979J5928k368R119l6323p834K2865p0K3654
498B5495j0932l4475R778k703J8565K4390k9792p653o202n308L9069j470j4092
511D670k768k8062J9789K5098q081P567k7097j6746K7078J843J5722k363l6991
524b0341O761N192R315K7092k5281j5769J964p865L3336P312k1014p95k2189J0202
538a2080L1747q917K389j7878k2735K7375P476O102M753l6549R56J2878L854K5336
$$ y = [24825, 23191, -21373, -11924, -6487, 2642, 34698, 4252, -13229, -10695, -21083, 17982, 25794, 396, 1324, -24753, -12642, 24062, 12031, 15971, -4233, -30568, 1576, 9166, 16289, 22323, -19723, -18328, -2760, 483, 30405, 9479, -17414, -8538, -16529, 12973, 30523, 1270, -205, -16582, -14874, 25355, 17434, 11956, 2381, -27455, 524, 16452, 14084, 23203, -13120, -20954, 1911, 1841, 25495, 14563, -19912, -10134, -12837, 5728, 30118, 326, -7327, -13529, -18837, 20232, 18762, 4670, 1902, -26160, -6371, 18727, 10646, 18213, -8884, -25630, 1448, 3291, 19013, 16650, -20341, -13580, -8388, 927, 28019, 2738, -13031, -11067, -18932, 14404, 21716, 702, -93, -22282, -12080, 19667, 10750, 13139, -4739, -27474, -99, 7377, 13479, 18232, -18317, -17361, -4483, -629, 24707]
552B4707j7539k3269O368o337K5789J5452k4713k131j4587K378L4623n797m280
565A0664r687k5035K3343J4611q30O935l0916o799J8947J622K0804j0000k8875
578a5216O866j409J6320K1068k4407p832o517l683L2963j6j2237m095k3285J6267
592e213K1486n733O468k4122j4140K2187K777J3673k146l1621N257M553Q899K3081
606B5406k1258j3877J42n747K8535O894j7538j931j8836R125K6505o068J359j5598
620b887j9124K2070P622O083L130l0565o02J1247M209K1087j4532k0611M144m564
634a3293K1589J3446k0441l854j2525K064K8975l750m661q882k1121J8707J3511
647I765l9N273k6242p051J6654K043J7634p914k5035N298j126J4469J7942k0852
$$ y = [24707, 7168, -16101, -9733, -16070, 9719, 25171, 458, -1673, -16260, -13882, 20741, 14944, 10664, 977, -24058, -715, 13896, 13066, 20001, -10915, -17714, 1233, 2855, 23659, 13659, -15216, -8350, -9759, 6561, 27629, 3222, -4610, -11127, -14810, 18153, 18137, 5900, 1805, -21480, -5213, 16273, 10540, 17008, -7114, -21254, 933, 3710, 17383, 15237, -16384, -11127, -6574, 2325, 25406, 4148, -9729, -9587, -15334, 13201, 20095, 2557, 626, -18210, -9085, 17420, 11352, 12711, -2887, -22011, 59, 7681, 13764, 16894, -13671, -14273, -3026, 1183, 22270, 7738, -12873, -8729, -13293, 8296, 21742, 1301, -2553, -15078, -13014, 15961, 12211, 7550, -1332, -22453, -3746, 9765, 9726, 14999, -11243, -18294, -1640, 403, 18037, 10123, -14912, -9614, -10740, 3729, 21671, 819]
661H19p260n672k920K8385N32j0651l980k0133J3323J9717m333M605k0310j3045
675b0923J9620L262J1623j552k7558L539L921Q587J9762j7631j3042O9n038K4768
689I407O531j5550k526j6183P068K3913n059J373j3561j7314J9600P364N343K877
703A3283k6550p74J0058L704J9339j3002j8255L694m389J9407J2141j8562k883
716b789j1058R48K6177l126l969p786j9083J6789J2366l25M976k2860o021J3989
730a772K249J5895o619k2257M478r78J2808J6403j8414o552n779k556K5228Q87
744A3021r389l565j8122J1998J6998l003M367j8341j1335J7360K926J0932j501
757A2346k4158L287L033P832J7545j6047j0826n81m969K2323N449j3500k125j5373
$$ y = [819, -6441, -12113, -15033, 13352, 13884, 3233, -747, -20880, -7557, 12160, 7827, 12432, -7878, -20923, -1303, 1959, 13582, 12030, -15528, -11989, -8068, 519, 20281, 2650, -10392, -10323, -15361, 9407, 15938, 388, -2138, -18321, -11253, 12660, 7601, 8974, -4587, -21901, -2301, 5063, 10406, 13283, -13267, -14041, -3983, -279, 19060, 6058, -12197, -8503, -12892, 6515, 18656, 94, -2789, -13847, -12899, 13278, 10152, 6183, -1603, -20686, -3897, 8469, 8144, 13120, -9740, -15761, -1772, 477, 16372, 9753, -12504, -8026, -9004, 3804, 20207, 1793, -4759, -10538, -13094, 12134, 13021, 3632, 67, -18055, -6057, 10941, 7938, 12305, -6036, -17371, -11, 2915, 13847, 12346, -11812, -8525, -5492, 2340, 19885, 3838, -6988, -7569, -12538, 9785, 15234, 1734, -391, -15764]
771a5764O873K0601m145J570j2850j4960J6924O565N056K990k3781l87Q310L682
785F84J7156j1275j6047K974m085J6976J0841j5986l354j0263J779K2237k430
798I207l032p744j6500J4652J0529R85M158k0942n134J2218K429J4068o108j9442
812a0656L291j176J1599J3811j5729o154n257k517K1689J178p982l805j6312J0669
826g351J5122k362L771j5949j0055J4761L058R988j445k1071K677K656P017J5683
840A6500j3403j0044j341l408J9054N169j1722k502j3282O034J7837k870J220
853G242j1321j3023J4475N910N095J992k0463j109P410L543J5077r928j3970J586
867g484k937J4830R379j3578l437r008J494J9385j714k253p194j4068J2464R968
$$ y = [-15764, -8891, 11710, 7565, 9135, -3715, -18675, -1751, 4814, 9870, 12860, -10921, -11308, -2998, 684, 17840, 6565, -9482, -6508, -10593, 6383, 17224, 1238, -2116, -12379, -10600, 11637, 9207, 6175, -1569, -18069, -3417, 7112, 8097, 12255, -8687, -13821, -1603, 826, 14894, 8786, -10656, -7365, -8541, 3058, 16869, 1140, -5014, -10271, -12788, 8901, 10079, 2097, -1708, -18020, -7351, 7771, 5409, 9180, -6769, -16824, -2063, 995, 10983, 9538, -11533, -8856, -6200, 817, 16500, 3097, -6947, -8288, -11696, 7358, 12527, 805, -1697, -14979, -8945, 8892, 6022, 7242, -4079, -17102, -2627, 3283, 8378, 10370, -10093, -11202, -3792, -249, 14828, 4900, -9070, -7484, -10421, 4409, 13788, 210, -3227, -12235, -10741, 8644, 6930, 4677, -2517, -16585, -4121, 5847]
881E847J081M064j8079m700J0716K541J2557n082j6922K934j280J0872J1788j3461
895B876n639m236k083J9018P56o493m089j3836R098J2811j659L261j4485q695
909a3395J2362K891Q923j824j7887J397K194O157J3702j1661q838j413l146J6714
923F176M445r711k625j1747N139J5696k326J347r657j1056J2431N341N397J700
937A0550j7688j355O388M317J2759q383j1863Q95k570J2994P932j1227l470p997
951h718J572J6705j247k433o092j2770J0669Q666R61K870j5844m270Q836K335
965A240J0379m604j4951J898o39R213J0496j1880n174m611j399J5997J489n497
979A957l790j2130P721J1424p27K559j2496p354J0863L055P420q16j5877J004
$$ y = [5847, 6928, 10992, -7087, -11787, -1071, 1470, 14027, 8945, -7977, -5043, -6323, 4549, 16337, 2876, -2763, -6999, -9082, 9936, 10692, 4199, 110, -13726, -4628, 8183, 6524, 9785, -4700, -13395, -1033, 1858, 10781, 8957, -8930, -7533, -5339, 818, 14520, 2859, -5979, -7392, -10538, 6176, 10621, 910, -1715, -13462, -8323, 7373, 5047, 6394, -3263, -14319, -1888, 3453, 8850, 10550, -7138, -8493, -2105, 2212, 14971, 6588, -5275, -4380, -6950, 6044, 13976, 2749, -721, -8718, -7146, 9559, 8312, 5879, -213, -12983, -2314, 6352, 7313, 10183, -5661, -9931, -1095, 1240, 11619, 7015, -7936, -6038, -6677, 2536, 13032, 1152, -4022, -8633, -10032, 5965, 7454, 1957, -1833, -13963, -6242, 5182, 4455, 7014, -5482, -12836, -1973, 1082, 8502, 7686, -8191, -7187]
993g187K209N856J1955r747q066j427k516J4624L991p776k531j0454M193J3556
1007F680j341P02q684j0098J0543N312M172J216j5633j193N048L953J1008p267
1021D418j0823O54k129J1512P439j0253k562p501J036J5135p49j885n790j0958
1035a2456R308P530J272K685j3536m234Q223K248R844m070j3066J298q21Q917
1049C142R102j0228m525l970j484J4663J010m805l108j0625O699R990n45K108
1063G424j0874o591Q862K965O918j004j4323J017J979N074J0257q639o865j618
1077e418k469J3725L444p471j768r922M216J2124j198O16p644r253R413M620L805
1092F820J310j3949r85M509L084J0428o527r795J041k503J0299P039q951k427
$$ y = [-7187, -4978, 878, 12833, 3086, -4980, -6407, -8923, 5701, 9692, 1916, -615, -11069, -6876, 6680, 5339, 6041, -2643, -12741, -2198, 3114, 7286, 8502, -7131, -8324, -3276, 677, 11685, 4418, -6405, -5751, -7880, 3632, 11071, 818, -1744, -9245, -8209, 6926, 6177, 4292, -1498, -12456, -3148, 4382, 5654, 8339, -5197, -9431, -1208, 1040, 10884, 6814, -6252, -4954, -5775, 3142, 12244, 2016, -2509, -6479, -7963, 6700, 7710, 2905, -203, -10828, -4129, 5861, 5316, 7424, -3450, -10041, -1179, 1786, 8704, 7700, -6623, -5606, -3627, 1447, 11704, 3065, -3800, -5418, -7887, 5838, 9282, 1811, 43, -9879, -5663, 6461, 5263, 5879, -1765, -11018, -1605, 3015, 6820, 8130, -5819, -6804, -2295, 789, 11217, 4690, -5105, -4064, -6567, 3732, 10771, 1820, -607]
1106f07p048Q39J3592r85j370n212r855Q360O272J423K389j2176m121O906J885
1121B92Q808l287j1613J142r54P527Q456q757l912m243r83J2841J363m252l279
1136h51r411O176Q214J1K075r943o214P956K581O309p54j2477K91J240M965R721
1152I889p843o140j578k016J1820L293o302k084p835K976J0694r44R56p010p994
1167a0118Q204L749L765Q85j2044j088L744K893Q933n311q382M88k328R425O029
1182H844p731k683n658R42J1143kj379m846q742P117N350J462K633j1122l769
1197h441O146J884P735l138r980O84p77P172P756p624l719l588q28J1583J156
1212F021l617k780q503N264P864J29J793q706n519O849K325N769r59j0891L40
$$ y = [-607, -7655, -6816, 6776, 5791, 4421, -791, -10646, -2286, 3986, 5409, 7798, -4378, -8499, -1593, 292, 9100, 5813, -5800, -4658, -5612, 1915, 10371, 1614, -2298, -6541, -7524, 5317, 6680, 2428, -851, -10262, -4086, 4128, 4139, 6214, -3729, -9943, -1987, 594, 6903, 6149, -6328, -6037, -4797, 168, 9889, 2046, -4094, -5672, -7688, 4132, 7425, 1123, -961, -8796, -5820, 4874, 3930, 4886, -2124, -10118, -1914, 1835, 5600, 6485, -5559, -6647, -2903, -10, 8923, 3612, -4770, -4282, -6610, 2815, 8844, 1113, -1570, -7228, -6286, 4857, 4855, 3476, -1370, -10112, -2995, 2355, 3817, 6450, -4672, -8441, -2295, -411, 7324, 4186, -5794, -5110, -5887, 1285, 9041, 1417, -2302, -5890, -6718, 4865, 6021, 2404, -376, -8879, -3615, 4249, 4378, 6171, -2535, -8054, -1205, 1120, 6889, 5930, -4961, -4621]
1227d621J327M155Q730o833n098k092j890J0589K869n414j955p467L087R322o96
1242D013Q86o799o877O988L009L651Q25j0852j011K930K902P964m678o933l56
1257d338j374Q313M902o057k188n546Q09J0250j16q57m476p580O206M831K030
1272D809J381r560k998M679K350O651k850q584M0k39N865O628o675l189l509p16
1288e917R922J387k938l100p764M805O664l82J973q243m474N686K288M970q04
1303D073r614J92Q15M088P449n837m412j336j764R207K885m473j853o604K909
1318d275Q170n70O28n663o092O192K965L167N20r314r39K512K898O711m087o250
1334c427j35j486P102M800n500k165m999R74Q642N63j481l723o884N113M200J696
$$ y = [-4621, -3294, 861, 9591, 2758, -2340, -4432, -6322, 4267, 7136, 1722, -233, -7700, -4613, 4709, 4013, 4899, -1900, -8777, -1789, 1220, 4871, 5696, -5156, -6167, -3237, -335, 7629, 2951, -3982, -4338, -5712, 2601, 7503, 1446, -742, -6288, -5479, 4771, 4655, 3798, -678, -8258, -2052, 2779, 4809, 6190, -3370, -6368, -1689, 661, 7312, 4462, -4122, -4082, -4321, 1544, 8172, 1497, -1692, -5201, -5917, 4005, 5392, 2454, -646, -8410, -3605, 3059, 2677, 4650, -3593, -8067, -2381, -93, 4877, 4073, -5541, -5349, -4534, -446, 7003, 1166, -3246, -4582, -6346, 2861, 5746, 1273, -580, -7184, -4275, 3895, 3325, 3953, -1710, -7802, -1610, 1355, 4522, 5042, -4272, -5211, -2699, 199, 6910, 2823, -3427, -3562, -5048, 2054, 6854, 1354, -811, -5810, -4836, 3806, 4369, 2888, -835, -7719, -2606, 1594, 3290]
1350C290J259q438k635M221J795O282k384p585o6k54N319N558n202k959k688r97
1366e484Q964R52k756k049o862M430N792N38P96o970m082M786K304M948p86q751
1382d230J48J077L658O269m867l931j822j201Q195K333l502k334n341J864P432
1397C748n32P42n105n196M900K564L052P11q067j389K472K535O056l442n566m74
1413b991r40O137L935m695j876m275R34P604K1k86l895o014M773L782J395J319
1429D928p776k124L294J895N654k622o153j57q75N089N241n155k188k765p32P731
1445C285J008k089k585n899L549N369J82J329o320l384M097J703M366q98o782
1460c069n05L66L545N551m318l603j422j067P059K067l206j542n192J942O113
$$ y = [3290, 4549, -3889, -6524, -2303, -508, 5774, 3390, -4195, -4261, -4515, 804, 6362, 1160, -1799, -4487, -5484, 3480, 4432, 1676, -373, -7235, -2805, 2987, 3525, 4321, -2649, -6731, -1945, 359, 5307, 4521, -4230, -4082, -3005, 653, 6922, 2055, -1876, -3698, -4899, 3296, 5629, 2127, -207, -5548, -3684, 3748, 3216, 3958, -1147, -6343, -1443, 1121, 4173, 4884, -3183, -4572, -2100, 435, 6491, 3049, -2517, -2991, -3931, 2206, 6141, 1446, -430, -4705, -3771, 3833, 3854, 3568, -327, -6341, -1568, 2214, 3609, 4928, -2848, -4972, -1678, 217, 5871, 3249, -2904, -3061, -3936, 1153, 6394, 1239, -949, -3714, -4446, 3285, 4293, 2204, -381, -6280, -2731, 2638, 2820, 4149, -2171, -5555, -1458, 245, 4611, 3713, -3069, -3574, -3208, 337, 5888, 1570, -2033, -3455, -4522, 2537, 4604, 1398, -144, -5336, -3394, 2719]
1475B719L3Q57m740n050M673K321K743N72p221q69J588K184N874l046n202k7j187
1492c778N768L362m085j582m040M84P133L4j80l455n382M080L157J748Q53o896
1508b779j904L381J580M679j970n988mq41M756M657m420j977k571p69O995J128
1524C953j943k306n417L456M607O80Q68n730l408M132J541L747o40o292l04O99
1540b357L334M879l612l356j399j271O445J853k503j826m535J884N466J58N92
1555C752m312m322L936K203K570K96o367q93J389J990N068k913m402m22q76N180
1571A877L206l656j676l509M88O022K82n44k628m880L216L508J212Q46n664j850
1587c750K353J515M865j969n078j25o03M325L596l348k323k171l18N663Q98j253
$$ y = [2719, 2752, 3609, -1131, -6181, -1508, 813, 3556, 4128, -3093, -3962, -2374, -190, 5684, 2638, -2564, -2591, -3778, 1990, 5352, 1267, -315, -4355, -3871, 3262, 3296, 3116, -339, -5721, -1641, 1516, 3264, 4117, -2779, -4683, -1302, 278, 4957, 2987, -3001, -3005, -3846, 910, 5567, 1147, -830, -3401, -4170, 2825, 3953, 2010, -296, -5713, -2257, 2350, 3030, 3898, -1832, -5240, -1108, 433, 4180, 3540, -2752, -3056, -2357, 977, 5856, 2244, -1112, -2511, -3782, 2663, 4516, 2013, 187, -4348, -2464, 3002, 3160, 3752, -560, -4882, -946, 1257, 3827, 4123, -2244, -3137, -1748, 242, 5310, 2397, -2005, -2427, -3303, 1877, 5083, 1427, -249, -3758, -3270, 2752, 3034, 2490, -138, -5018, -1802, 1706, 2918, 3764, -1900, -3750, -1397, 118, 4983, 3014, -2064, -2189, -2792, 1533, 5129, 1781, -542, -2713, -3031, 2632, 3530, 2277]
1603B277k007m750K595M117N59R64n043k690K727J569L632r80n472k94L30K997
1619E31M291l206l046j310q00N476J827k479j388m485J970M494N78M19l926l593
1635d647L304K116K222M34n749p72J322K104M450k668l812n82q26M882K595k998
1651A375j480l127L75N094P55o75k407m378L398K416J644N39n392j413K041J216
1667a9L840j359m413m03k92L311L580l173j641k503j31M943J005r04k009m005
1683d173K061L834M53J211m644k545K721J401L181m96m765q51P58K425M121k713
1699A979k662j681q00N120J567j671j405l836J470M215O34j19l427l132K729J816
1715G97K007M10m662j440J207K128L295j499l542p88p46M080K577k626j454l055
$$ y = [2277, 270, -4480, -1885, 2232, 2791, 3755, -1288, -3978, -1251, 318, 3950, 2970, -2502, -2796, -2466, 531, 4822, 1616, -1430, -2740, -3540, 1936, 3763, 1284, -104, -4589, -2619, 1875, 2453, 2872, -1054, -4647, -1343, 773, 2995, 3429, -2320, -3092, -1770, 334, 4784, 2116, -1696, -2278, -3104, 1778, 4373, 1375, -105, -3232, -2857, 2237, 2992, 2317, -90, -4468, -1070, 1346, 2990, 3529, -1863, -3276, -1235, -19, 3821, 2462, -1951, -2354, -2646, 665, 4245, 1072, -569, -3072, -3203, 1740, 2745, 1841, -168, -4173, -2112, 1722, 2175, 3386, -1258, -3803, -1082, 319, 3500, 3004, -1761, -2612, -1854, 571, 4692, 1979, -683, -2364, -3164, 1956, 3523, 1852, 447, -3389, -1919, 2296, 2930, 2811, -616, -3748, -1019, 797, 2804, 3214, -1448, -2888, -1681, 447, 3742, 2243, -1299, -2087, -2833, 1247, 3824, 1198, -256, -3311]
1731c311P26M600P71n85k609l141K522K326J233N30m186j930J647J508L544j187
1747B458l618p64j49K627K983k155j874k053l5M210J002p02k282l257J790L448
1763A629L32N11l382k547J970J406K938l98m532n56L80K723L566k860k155j416
1779b391m32M001J954j897j666k479O62L872N34L46l022k883K374J610J910O28
1795C121m737p06J060J386L234j341k989j147l64L344K397k271j199k780M08M135
1811A551M49l28k060l167J902K208J227P89l638j666J381J328K889j246l119q40
1827b340k35K860K476j508j879j840p30M675Q00q39j569k922J266K871Q56K22
1843B164l048k162K220Q46K488k75l772k12r3K194K834j506k067j422o80L649
$$ y = [-3311, -2585, 2015, 2786, 2201, -408, -3549, -1027, 1299, 2532, 3062, -1124, -3054, -1407, 101, 3645, 2458, -1160, -1924, -2073, 554, 3537, 1382, -492, -2545, -2580, 1630, 2632, 1930, -352, -3609, -1819, 1629, 1961, 2472, -910, -3457, -1487, -81, 2857, 2459, -2073, -2629, -2249, 474, 4040, 1180, -975, -2391, -2823, 1178, 3132, 1235, -431, -2910, -2248, 1624, 2158, 2504, -518, -3401, -1027, 583, 2493, 3121, -1616, -2322, -1262, 124, 3358, 2017, -972, -2119, -2483, 861, 3258, 987, -212, -2992, -2584, 1551, 2000, 1672, -388, -3555, -1653, 555, 1782, 2571, -1067, -2733, -1352, -24, 2865, 1619, -1500, -2340, -2575, 285, 2761, 1253, -626, -2466, -3196, 1479, 2279, 1440, -129, -3051, -1785, 1086, 1942, 2164, -884, -3046, -826, 20, 2508, 2233, -1539, -1751, -1844, 350, 3184, 1678, -389, -1811, -2491, 1158]
1859A158J783j490j369k727O74L476L08M82k763k497K005J770J654L30l982j034
1875b222J025J507K704j301k509n86q51L058K012j515j555k040N26L021N94J10
1891A978k086k968J969J963J196R1l052j228J104P52K758p01k917m45n23K552
1907D43K552k075j246j482l92L168J059n32j519k535Q45K786O86L42k519k157
1923b576J705R71K190l06l120l47l35K034K742j669j788j344k73L368J160j255
1939A157r28k869R42K509M41O82k379k352J667J215J696K73l235r07M38J450K694
1956B494j108k499n35n38K660K046j567j034k417M53K949P07O5j847k803K011
1972i63J248J251O44l099j461J067R43K762p73k483p54k16K189K221j759r69j664
$$ y = [1158, 2941, 1451, 82, -2645, -1971, 1505, 1813, 2295, -468, -2965, -960, 810, 2464, 2794, -1188, -2222, -1197, 310, 3014, 1713, -796, -1382, -2233, 825, 2837, 1322, -233, -2273, -1747, 1274, 1868, 1978, -108, -3076, -1107, 856, 2052, 2143, -909, -2137, -1033, -281, 2477, 1776, -1141, -1586, -2109, 443, 2995, 920, -326, -1808, -2200, 968, 2027, 1495, -24, -2559, -1714, 1072, 1758, 2100, -419, -2576, -871, 100, 2290, 1984, -1136, -1483, -1818, 216, 2958, 1289, -499, -1843, -2116, 1252, 2412, 1157, 229, -2640, -1698, 811, 1252, 1934, -445, -2797, -1130, 85, 1781, 2054, -1181, -2088, -1650, -200, 2494, 1386, -1113, -1648, -2186, 474, 2520, 953, -81, -2498, -2045, 904, 1611, 1676, -171, -2974, -963, 285, 1536, 2180, -919, -2380, -1313, -370, 2392, 1619, -864, -1618, -1834, 355, 2576, 817, -152, -1816]
1989a816j95K901Q17l34j438k618J360K068N65N20k326k030J550Q56K249k08k789
2006h68o97J54J248K489j444j545j129J0K592J139o57r64k473P17K464N69J11
2023A716j913k209J566J259J503M39l084p18L56J163K305r40j943q92l82K489
2039G15J402j053r89j786M6K687L53K87j803k182J006J802J141L88k593q81N66
2056h94J066J659m1k392q11o2J866J815r79j077j625l14K626O79k08j152k228
2073b072R41J651O67N91k057j628J047J050J474q5k440l37l54J420K352j015j710
2090e05p32p10K494R70m82q37j999K06K401L97M80j819j857Q99J355J392R2k396
2108f51q84K07J020K451j045j443r26m66K083J267k52j245k073K62K420N28k0
$$ y = [-1816, -2011, 890, 1707, 1373, -65, -2683, -1323, 745, 1310, 1830, -496, -2526, -976, -120, 2129, 1921, -868, -1565, -1411, -163, 2326, 882, -663, -1792, -1782, 810, 1949, 1292, 328, -2145, -1428, 1036, 1605, 1716, -197, -2406, -840, 419, 1922, 2361, -723, -1441, -1085, 78, 2383, 1443, -500, -1392, -1774, 715, 2117, 1064, 75, -1711, -1665, 1022, 1375, 1662, -141, -2323, -1317, 485, 1626, 2014, -579, -1460, -894, 172, 1831, 1790, -602, -1413, -1475, 391, 2206, 1227, 150, -1475, -1789, 837, 1516, 1308, 156, -2072, -1131, 520, 1187, 1778, -279, -1907, -860, 190, 1664, 1579, -861, -1198, -1552, -132, 2220, 1205, -505, -1237, -1947, 547, 1517, 1035, 198, -1801, -1595, 806, 1203, 1683, -136, -1993, -1094, 261, 1653, 1745, -651, -1535, -1328, -308, 2143, 1098, -345, -1271, -1737, 346, 1613, 1361, 116, -1957, -1695, 725, 1253, 1233]
2125A233j397j773P79J610O08O58k301j126P67N97K408p44j897p64k92J697J764
2142A827q93j104j262k97J849J209l14p24k316Q58J684O82M73j892j539R84Q48
2159G3J266N88k278r69K17Q75J774m98r92j012p96J941J462m84p47k038M31K016
2177H29O3L58j357k092J423Q90J484q4k223o23M05R87J686n26j476p17n26J868
2195C69J304q89o31j543J16J985K44L90j228j683L34J070J239M83j808j152O10
2212g90L60J739k89j345r59J65J258J563o38r78r48m49J998O80m9j046j603L97
2230i34J414P79K85j737j505R18M38J562j08j773m06p3J041J671o41j099r02l24
2248a394J751R19n63o87j578L03J803J61R07j606j461Q73N73J152L34j569q67
$$ y = [1233, -164, -1937, -1158, 452, 1060, 1718, -583, -1709, -942, -345, 2063, 1319, -578, -1342, -1634, 63, 1827, 934, -170, -1432, -1729, 120, 1329, 1015, 291, -2025, -1167, 517, 1199, 1672, -220, -1759, -775, 73, 1339, 1927, -351, -1320, -1103, -228, 1546, 1048, 56, -956, -1752, 189, 1651, 1167, 420, -1618, -1187, 829, 892, 1250, -107, -2199, -776, 114, 1598, 1514, -709, -1332, -927, 60, 1746, 1220, -256, -973, -1499, 369, 1673, 784, 153, -1390, -1274, 711, 955, 1345, 117, -1566, -1232, -162, 1077, 1560, -248, -1400, -790, -430, 1309, 1020, -325, -1284, -1119, 139, 1702, 1064, 86, -862, -1311, 687, 1367, 1318, 272, -1331, -934, 480, 1259, 1544, -193, -1698, -780, -342, 1220, 1112, -661, -1067, -1140, -99, 1572, 931, -168, -1070, -1394, 357, 1276, 713, 26, -1552, -1249, 554, 715, 1622, 16, -1445, -572, 1, 1153, 1487, -82, -949]
2265i49j68Q77J740n63j184m62o00J475J079m51q90j035q8J540N50P3o98j793
2283a547M97R76J011M53j917r18J78Q83J713m87j144p87k15J172J485m50r86j022
2301a105j02J505Q40j73j103j363K87J599N34K81j301q10J57P35R33M46j384j377
2319a401N95M21J632l27r93j075k34J271J161m01n19j335OJ491M85K94q84j439
2337a252J64Q96R65L18j255q66j19R19J372J1j319n94k91R42J352n42n32j082
2355i13j90J589K63L06o99j672L62R66R37L06j385r48M33J31J662P0j477n21k75
2374a055R54J510o58q01n82n35J117Q74K69q62j429M07P95O34N39j087j225N54
2392e81K12J220L32j463l44l82N63J391P4j127o50m32R85J136j91o27r65k50J107
$$ y = [-949, -1117, -240, 1500, 937, -247, -709, -1309, 166, 1245, 794, -96, -1131, -1219, 321, 871, 944, 246, -1547, -1050, -74, 937, 1390, -527, -1445, -1267, -384, 1329, 842, -302, -1089, -1304, -132, 1353, 903, -83, -1105, -1207, 298, 1138, 965, -138, -1501, -1214, 385, 919, 1200, -101, -911, -754, -19, 914, 1360, -24, -1401, -806, -385, 1247, 920, -73, -1148, -1382, -111, 1050, 649, 130, -1205, -1199, 292, 777, 1071, 187, -1252, -1088, -192, 773, 1091, -164, -1030, -1149, -230, 1142, 1153, -166, -760, -1051, -109, 1243, 701, 169, -913, -1103, 486, 749, 1055, 356, -1316, -954, 12, 949, 1255, -130, -1078, -645, -514, 1148, 1218, -259, -780, -1055, -101, 1409, 751, -50, -632, -1167, -50, 824, 1093, 231, -1198, -791, 4, 638, 1177, 90, -1135, -581, -369, 851, 1183, -280, -624, -1006, -443, 948, 1022, -105, -755, -1187, -202, 934, 743, 116, -849, -1099, 8]
2411HR94j07j092r96N54N12J048L19j479p36m8N49J359k34o65p93l01Q15J424
2430A131k85p54n67n80J214Q77j01o08j313j9J070N82K31r26p45N7M38J199j12
2449G89n76o28k99N15J243k16q11q36l87J209N61K08m62j224LP52M35O90r76j134
2469a144L05L46J250N5r76k44k06O42J007k23p17n90n46P48R35J24m53j221j32
2488a040J248K36M91p62j163M97J48Q78M60r57n87q2N85R75q3p75o33m12O79J053
2508G56J29o24q96k60Q90L45K73m65j094J75Q56L95N26j044p04L13L51R00pp84
2528C1n87o07Q60J196l86j24r49k57Q29N54K90q34q98K42O39N81N22q43j212K27
2548g26M13P51N82r26k95o28M38J259j25o87m48n74Q92Q05l02l6q89l09O21L27
$$ y = [8, 1002, 895, -197, -1193, -639, -127, 921, 1240, -239, -975, -1023, -474, 885, 651, -14, -807, -1108, -293, 1131, 846, 92, -475, -1055, 159, 1036, 935, 327, -986, -1005, 65, 647, 878, -48, -793, -736, -298, 901, 789, 213, -415, -714, -199, 1044, 828, 17, -819, -1206, 3, 564, 772, 310, -914, -911, -159, 276, 966, -10, -1144, -839, -493, 757, 812, -164, -408, -614, 28, 1035, 812, 95, -495, -1041, -293, 642, 766, 313, -908, -1040, 208, 444, 935, 173, -990, -493, -345, 533, 993, 36, -551, -633, -48, 927, 844, 69, -564, -976, -297, 756, 885, 261, -635, -895, -5, 340, 613, 148, -946, -771, 85, 480, 1006, -38, -742, -429, -78, 822, 815, 31, -556, -1163, -303, 893, 507, 383, -566, -823, 6, 560, 850, 16, -882, -640, -1, 580, 1102, 259, -953, -726, -313, 438, 1020, 94, -201, -829, -391, 868, 743, 56, -392, -966, -74, 731, 429, 393, -496, -805, -184, 143]
2568A43N27n42q16j29N70R71N05r76r35qQ20N40J6n06p67R3K91Q94l6l38q55M3
2590d95L11N18J99k67q29l46Q35K88P86q32q05J09p5J250K72o16m96m14R4J196
2610F83l7o26o42k79Q21L53K14Q6j365J48M75M08N48o89p87K02K80N89N84j017
2630e1j93n77O79P21p8l62o48j52O67M25L59o99m56m42P25M48J98l20q65J74K36
2651b11M93N24o56n66k27M72M45M91n35o56j42K95N45L03k09p66j66M57L16N39
2671G46n92q43k41P79L96M34o00o58l3K11J024o7k74m57l37Q5J039k48K8o06m08
2692f22J23P16o0K17n85n14M83M80M92p07m39o7J94M93O54l91o91m29K66P64n4
2713C23j27j9q30N04M82J37k71p11k28N95L65J82l2m75m39K22M67N66q09j36k37
$$ y = [143, 670, 128, -688, -817, -247, 724, 1229, 253, -682, -690, 130, 670, 686, 180, -587, -494, -203, 691, 655, 317, -538, -495, -184, 334, 533, 266, -563, -909, -74, 214, 1000, 168, -637, -528, -603, 647, 919, 303, -193, -607, -513, 683, 646, 20, -622, -901, -80, 273, 487, 573, -792, -644, -169, 239, 787, 98, -689, -487, -207, 382, 966, -51, -244, -821, -142, 579, 501, 139, -509, -661, 6, 431, 790, 91, -365, -807, -82, 366, 564, 244, -621, -447, -211, 282, 806, 150, -416, -643, -171, 274, 765, 230, -426, -568, -273, 272, 575, 366, -400, -566, -109, 207, 746, 154, -689, -930, -151, 245, 679, 79, -579, -612, -401, 623, 556, 282, -175, -512, -427, 612, 364, 392, -214, -622, -499, 217, 157, 374, -211, -725, -242, 238, 730, 23, -416, -483, -289, 204, 858, 467, -224, -653, -387, 377, 323, 196, 177, -653, -149, 333, 470, 199, -512, -740, -145, 220, 402, 370, -105, -544, -322, 145, 711, -98, -234, -471]
2734d71R8P81M54o94k83j93J18J07J24P4k05n48K55O89K98l04m60k58KN15N77
2755F76o34l20k72O9R00K75k90n05m29K80O77Q0k52n17n50O99M48j30J35n52k89
2776e01M93K9N04O8j037qL89K47N37o11k98k88j04P00K58n4o46k69K42K42L39
2797B32O5n97j05L7N73K12l53k11l78K23O04K04m00k26j69rN57Q9m93K4n13M47
2819a87N09L64n61k41n10O74K12L25k13m73m07K75L51L63k14l74R4l03L64M83
2839E31k07l27o83Q5N95N21m2m73k66j75Q25j56L77o00n84n2Q19P6J31n73l18
2860d96J36M74L03j92j59k24n09R19L67o16K32o30k3M92M8M33q36k09J69N14j7
2881A76R7l54n04M78o8O28q4k87m54Q3L67M32P6k97o63J89L99K49Rj84n49Q4j38
$$ y = [-471, -373, 408, 862, 168, -115, -308, -190, -83, 41, 115, -90, -638, -383, 306, 604, 300, -160, -418, -416, 99, 676, 42, -278, -550, -481, 419, 694, 404, -101, -530, -250, 427, 507, 255, -262, -812, -113, 335, 205, 340, -212, -501, -8, 21, 525, 593, -444, -452, -63, 184, 721, 110, -188, -476, -580, 120, 378, 324, -322, -591, -349, -107, 232, 297, -300, -405, -368, 205, 417, 64, -147, -525, -302, 302, 506, 106, -120, -289, -298, 259, 348, -145, -121, -634, -187, 322, 686, 125, -116, -626, 48, 260, 585, 372, -101, -508, -233, 118, 481, 267, -107, -13, -316, 48, 531, 324, -3, -686, -601, -6, 515, 473, 0, -266, -441, 384, 228, 605, 5, -579, -631, 188, 264, 395, -178, -496, -360, 114, 417, 225, 66, -158, -667, 252, 619, 3, 235, -395, -418, 74, 122, 555, -281, -490, -321, 193, 176, 273, -81, -585, -107, -175, 453, 369, 82, -372, -289, 78, 510, 586, 289, -374, -185, 214, 463, 472, 288, -261, -177, -315]
2904c15O40j25K4n12k46P33L14J9n05j33m75M89P19l66l3n65j2M75J41J79n20
2925g4m15K29J9M57R8l43l51M7K38O38L7p61m64K92O17K97m38n25K81m51M24M42
2947B94j33J4n55j92P36K29J40o17k22J28L10mL76o50M7j15K32L02n3rq15K87
2969b70K50O38n69j27l86O4J53N51p5l59n24L93j30M70J86k85m50j7P74j67L30
2990D50n72j46K19l25N49m3j55J32n15J37K84J94Ok87j82K52K13M02p10l10L2
3011c75L29N92k28k69j34n0L4L54J79n41L3m11L37L53Q3j68l45o2K34L15K58l16
3033B02n25K07k98P47n0k48m02m6J38P56j8l30l1l47o7Q3P04k86m22k43M84M05
3055D13r0l13j97j62K39J94M62l83k54m26J50O68K49l22l70k03K75L55m5q7m53
$$ y = [-315, 325, 200, 224, -288, -534, 199, 513, 532, 27, -106, -581, -92, 627, 261, 228, -337, -349, 126, 267, 446, -74, -489, -260, -241, 216, 314, -29, -380, -333, -95, 543, 580, -181, -645, -353, 264, 561, 123, -402, -121, -572, -148, 294, 161, 175, -380, -572, 164, 393, 533, -84, -306, -178, 132, 128, 504, -146, -99, -214, 18, 320, 267, 258, -557, -270, -20, 618, 49, -78, -464, -400, -247, 304, 229, -130, -654, -261, -391, 79, 265, -20, -470, -487, 287, 120, 450, -122, -268, -49, -374, 175, 132, -23, 109, -406, -269, 15, 209, 215, -72, -254, -2, 211, 613, -97, -407, -375, -46, 546, 318, 49, -85, -135, -101, 253, 432, -109, -76, -487, -150, 203, 286, 118, -227, -289, -55, 260, 518, 202, -323, -116, -414, 333, 283, 35, -367, -413, -275, 481, 463, 133, 102, -245, -312, -229, 475, 189, -233, -476, 8, 413, 323, 10, -187, -349, -110, 84, 546, 163, -91, -517, -367, 301, 550, 228, -142, -345, -70, 285, 240, 153, -300]
3076c00O6j11P26K11m72n85J4M73J19K77jo94j73O3O40J58k36k11r9j78L39K86
3098C12J19o25k96M15K02L99j15o09j40J36M20L85k49o00k62N39M1K51O8n87j79
3119c75m0O08K50k90j31n23L44K65J41J74m88m70K67K04N53r5p47k68L22K69O58
3140F28n48j90o34M46M85L33j79o03k02R5M24M96k62l01q98Q08L40K1M46j081
3160c76j77K37O03p2J96p81J15J4K88J40J00j69o97K54N32K28J08m94l93R0J90
3181f4L60R0n20k49J80M80J51K94r29k51Q1L49K45K36o29m85N82J86J62M7m52
3202a36l83P9N54N10k58o14j55L21K45J09J30p60j31K59L61N74o2q78K22k21M27
3223A93M12j10n91k74j49Q17n7j11j17n25L08K42L49pp19k89L69K62J79L61q22
$$ y = [-300, -234, -345, 381, 592, 120, -465, -451, 22, 141, 418, 417, -277, -450, -387, 253, 411, 175, -36, -135, -313, 26, 312, 431, -194, -490, -75, 127, 526, 411, -198, -338, -202, 218, 603, 354, -246, -508, 31, 72, 323, 391, -196, -375, -415, 193, 443, 153, 22, -501, -157, 108, 249, 423, -65, -535, -268, -64, 489, 394, -353, -621, -299, -30, 628, 80, -110, -744, -298, 187, 520, 341, -262, -464, -369, 55, 551, 289, -12, -910, -102, 238, 259, 705, -376, -553, -316, 287, 215, 411, -370, -255, -241, 47, 187, 287, 118, -579, -325, 207, 435, 543, 49, -344, -254, -64, 296, 386, -134, -383, -203, 277, 428, 722, -207, -458, -377, -28, 217, 453, -176, -661, -79, 107, 269, 316, -136, -519, -440, 114, 624, 366, -248, -403, -82, 163, 272, 402, -358, -489, -230, 131, 705, 643, -235, -13, -234, 193, 605, 495, -96, -370, -519, 298, 241, 130, 13, -512, -204, 38, 387, 380, -339, -628, -259, 3, 182, 543, -279]
3244b79M5j01L93M33l8l24p08l5P75L57o1n53l03J07K85M29K29n67p66M95K86
3265I9J81M2m42m13K44K34K29M05n67p14J26N38N46j10l56n04J50M60M02j49n96
3286a95j60P0L67L58k2n83k2k36L73N86k78l61m58L5Q74K41j99l91m88R7N53N39
3308G00o90j45k55j54P34M33o4p63k85P2M65N72j92o42j82J19K56O84k56m25k90
3329c08j92O81K97J17o43m01P6M25L33K06p18m68J91N02M80l54j72m36R9K27M54
3350C96K42q15n28L8P56O25q6o80o55K73J69O10m4l75m85J8O25L62K34j023l33
3371f76K71J52R65k6r44p0q4J22M85N62q81l15O0M26L37M9m27n35j51R05J88l2
3393C81n95j71J40K57M78J93j041j81O7L28O73l27m3m50j05L84N68Q9q10n42J74
$$ y = [-279, -234, -335, 58, 491, 453, 129, -579, -614, 161, 518, 457, -96, -399, -292, -7, 422, 651, 84, -682, -187, 99, 280, 322, -120, -533, -289, -55, 174, 579, 12, -702, -576, -38, 508, 398, 42, -462, -312, 148, 550, 401, -195, -355, -285, 82, 440, 418, -165, -187, -423, -50, 536, 258, -103, -561, -526, 348, 589, 390, -1, -489, -392, 161, 700, 10, -135, -390, -544, 190, 623, 559, -204, -489, -417, 48, 620, 428, -214, -396, -277, -21, 663, 407, -18, -308, -500, 181, 478, 595, -48, -449, -373, 52, 385, 591, -127, -595, -404, 98, 578, 224, 52, -384, -285, -58, 396, 638, -177, -705, -667, 89, 714, 628, -52, -707, -434, -265, 345, 301, -74, -559, -541, 84, 446, 680, -343, -676, -405, -253, 712, 686, -258, -328, -412, -290, 195, 757, -124, -439, -379, 47, 384, 433, 6, -529, -680, 225, 413, 381, -214, -385, -245, 12, 490, 683, -358, -539, -472, -144, 529, 202, 159, -291, -396, -12, 556, 645, -165, -707, -533]
3414e33N32O04n34K7p34p2M03Q36J80o89o23Q3K83R00j24l91o50k48O67L20J46
3435C83k21o72K7P72L3L00m87o25K2L30L77L41m85p72J24P80j10L24n64j60m57
3456g40N94L26k3o6q57L53M95J03M15n39o60K90L92J70L55k97p48J94M5O90L56
3477H48r72m84J31M25O17j57k70n01j60M50N30Nl85o01n3L43M40K67k14q90K44
3498c87N29N1J66o80qj56K62N43K57q14j90L1M60K77K4m48q6m04M22M99J43m59
3520C2p48L22K89P05j99p67L8j49L47N52m6l90l56j1K37N23k58j55n21m0O05O81
3542F91P7p23m67P0K70M02J11o93l41O6L46R34k8p72k82k79K21Q49j60l73l89
3563d70l55R42K56O5j0r71J68N91L37M5n79l10r5K65O98j68n01l07q8K19R53j70
$$ y = [-533, -1, 603, 69, 96, -638, -710, -307, 529, 709, 20, -603, -520, -237, 663, 539, 148, -502, -750, -83, 237, 383, 162, -510, -483, 289, 322, 622, 135, -490, -468, -138, 239, 580, 95, -677, -553, 227, 117, 441, -123, -283, -740, -146, 180, 157, 91, -766, -413, 82, 185, 600, 61, -599, -309, 83, 253, 608, 311, -437, -243, -198, 492, 848, -124, -608, -477, -52, 565, 408, 138, -363, -523, -73, 457, 462, 77, -524, -577, -234, 206, 473, 259, -631, -387, 142, 193, 359, -321, -329, -485, -223, 320, 577, -237, -427, -396, 64, 341, 365, -83, -169, -573, -151, 348, 491, 32, -716, -394, -105, 600, 401, -366, -328, -477, -130, 422, 376, -14, -370, -381, -144, 379, 121, -34, -555, -595, 10, 691, 768, 45, -422, -352, -82, 320, 431, -262, -603, -537, -191, 743, 715, -57, -339, -618, -397, 452, 292, -81, -470, -825, 117, 373, 438, 428, -543, -375, 216, 553, 598, 19, -291, -386, -121, 577, 409, -92, -399, -487, -268, 685, 515]
3585E15n77j51k32M14O61k93j42r92R3P63M09J09n29m33oL60M91n0k46m18m49
3606g03O42N21L92q24l73l81O50N61J04p80k32k05O43M14L23o29p44J19N24O71
3626F93J32o94p05q5N80O41k9l92p49J34L02O30L12p51m95j88O96L59K30n70k79
3647b28l18L16K55O11q25k63k40M06P38K8m21o54J95J09J088k27k74p09k25L81
3667b57P09P3n00q85K31P74L00J71n60o89k10Q78J95P21q19n09j81K22Q44J96
3687G04n70o93k15O46N64K84o72m06m35J108J43J73n05n62j82N56O38K2p02n94
3707f98J88N50Q04k1q50l99j39M40R51m05q0o62m38P52O60p2p41k75j61Q41L90
3728F35k31k14p41j7O00M49K49m58n99k73P01N28k87Nq37k31M73R24k22l76o85
$$ y = [515, -62, -213, -445, -31, 630, 337, 195, -797, -704, 59, 468, 577, 48, -385, -391, -31, 460, 410, 164, -254, -703, -61, 460, 852, 28, -345, -726, -76, 485, 589, -191, -423, -628, 15, 429, 752, 123, -621, -502, 22, 693, 825, 131, -574, -659, -79, 562, 533, 141, -608, -474, -172, 458, 770, 19, -476, -664, 32, 391, 621, 51, -228, -546, -230, 25, 636, -189, -452, -692, -286, 452, 480, 59, -595, -400, -291, 797, 570, 296, -413, -638, -257, 452, 525, 25, -860, -629, 145, 445, 616, 56, -633, -843, 35, 230, 951, 132, -377, -558, -336, 508, 704, 134, -559, -774, -128, 436, 720, 48, -358, -793, 315, 458, 631, 126, -436, -618, -62, 576, 598, -104, -698, -510, 40, 844, 823, -27, -426, -565, -125, 826, 421, 341, -321, -759, -7, 653, 581, -160, -435, -596, 245, 635, 404, 190, -551, -568, 32, 481, 730, 272, -327, -600, 101, 629, 342, 347, -490, -721, -248, 676, 454, 78, -607]
3749f07RO98M57l2n74m18j10O72M01J72o15l63k39K63P77L21p61n11k96P13O83
3770F40j77m44o89Q3L11Q74o3n55p24J62N65O56K56p13j028O46j47O72Q6k24q61
3791f74q6O78P69Kp52k28k52K27J027k75l21p88j82R39K22J98k29q12O9L58R08
3812G98Q6p92o39j25Q44L65J19n65n76j93M78P67Q8l96q32J3L43P86J49m09m86
3833a77j04k3O65N22r05o75J38N68L78M19j003l94k5O16N57nl96n81l96Q63K57
3854B99L91l79q43L5M03N69L06o35o74J46j28J202Q1n08o47l5J01N29M13k47q53
3875d74l02N66J012m40j2q24j80O99L72M9m94o90K98K26N12N18p48l70m25L04
3895d03R36m7l38o83l20N84R88k64k34l43o76P21N16J8l43q59J98L05K60P22o20
$$ y = [-607, -598, 100, 557, 525, -49, -467, -577, 95, 496, 668, 53, -310, -549, -286, 491, 812, 51, -460, -756, -43, 640, 463, 19, -670, -587, -276, 598, 535, -20, -744, -582, -17, 639, 895, 182, -846, -200, -347, 325, 411, 187, -674, -760, -82, 687, 689, -63, -291, -543, -316, 711, 436, 115, -673, -855, 84, 306, 504, 275, -537, -468, -110, 798, 884, 92, -547, -672, 172, 537, 656, 91, -485, -678, -200, 567, 655, 259, -573, -560, -217, 569, 718, 309, -177, -281, -304, 361, 883, -22, -697, -559, 9, 387, 806, -197, -591, -616, 0, 557, 552, 156, -425, -821, 42, 299, 690, 311, -532, -497, -94, 475, 781, 146, -528, -382, -510, 692, 773, 265, -382, -417, -316, 213, 626, 379, -474, -776, -210, 802, 362, 350, -474, -654, 45, 417, 466, -28, -718, -420, -194, 318, 836, 88, -282, -707, -403, 533, 486, 148, -535, -855, -271, 717, 453, 219, -124, -800, -79, 437, 455, 112, -747, -549, -244, 16, 738, 118]
3916A18n24k49L69O61J86o28o34J13L21O03L89n91n58k24N84N58K35j011j19m71
3936h72P04N11J55k11r08J63J61P86Qm64l42k25O97M41J41o48l37m04N47K99N97
3957G99o52q69p5M76R83P3n99n50k03P20L30mn43k84k75O54M17J47l67o17k47
3978f86O37O12J8n39q05L15M97M17L14l80p78k96N20O44N58r25j011N03K11O60
3998D86J93p14m66K66o5R06k9l26o68q8N44L45O9k82o53k93Q89L94K29r01k80
4019d44n3K03Q47L0o72l81j84O63Q94n02k83m05j77N28O32n3k91j047l6R24K50
4040D43J25o74l43m22O46P45J82p94j27m63M61J066k09n64n03m37P50P15j31l03
4060A63p43j04M32R99l78k60n64J24J63L99M30o20n25m4M79Q90j60m00q95R2N78
$$ y = [118, -406, -655, -286, 375, 561, -67, -701, -588, -267, 336, 725, 134, -424, -648, -64, 494, 729, -282, -401, -872, -168, 343, 498, 287, -621, -458, -297, 489, 497, 33, -309, -534, 163, 604, 745, 97, -240, -644, -97, 202, 799, 147, -722, -797, -321, 662, 735, 136, -414, -617, 103, 433, 429, -114, -398, -673, -19, 398, 545, 178, -439, -686, -49, 563, 581, 42, -763, -448, 49, 466, 780, 400, -378, -674, -154, 490, 1048, 123, -888, -385, -174, 486, 679, -35, -501, -235, -300, 606, 577, 251, -417, -505, 39, 384, 453, 171, -482, -775, 114, 508, 737, -164, -444, -497, -294, 553, 583, -89, -470, -654, 9, 903, 401, 118, -287, -464, 64, 696, 643, 352, -695, -731, 193, 443, 568, -106, -449, -871, -225, 520, 702, -92, -219, -682, -221, 845, 636, 72, -431, -868, -118, 597, 466, 163, -580, -684, -252, 747, 369, 109, -455, -331, -168, 231, 661, 41, -484, -528, -49, 841, 681, 281, -614, -522, 56]
4081E6K13J86k84o52j32N46M36r9k77l11j33O8P90n1k23o90N0L72P50Lp62J0k84
4104d18J89R92j32n69l73r0M20K15N72r50k69N5K96L45M32p30p04J04L63Q00J31
4125F79o82m66n28P93J023l40m78n79k99P44P17l5m14n90l70O90N13M86p47n90
4145d73j51O01N79J77n13n27l53M11Q76mm07n81j07K39J205l65l09o79r5J82O53
4166C59K26k69p97j38M91N40J46p43j17j05K62P51j24p84j29l61N72R04m35K04
4186D53q88l22Q71L56K24m9j322k02Q60M11L53p47o13k02P58K86L32o20n10QK73
4207b90P24J39n69k37l46L63Q60j11j33q66j04N05L91J96k16p38n4M41O78N3l88
4228B98p74k30P18P21m2n37n28m43P35O26M6m17n05k46N68N99j60J3r94n7Q77
$$ y = [56, 269, 455, 171, -481, -613, -67, 369, 270, -7, -318, -451, -383, 407, 356, 133, -557, -507, -135, 615, 618, -144, -134, -418, -229, 763, 631, 62, -311, -401, 19, 234, 806, -144, -413, -358, -62, 283, 715, -15, -719, -615, -252, 548, 679, -3, -469, -997, -204, 819, 479, 1, -578, -877, -133, 584, 549, 135, -455, -825, -135, 378, 864, 117, -473, -624, -23, 556, 733, 220, -307, -660, -249, 627, 623, 216, -365, -472, -233, 972, 607, 298, -381, -476, -294, 359, 585, 316, -481, -619, -128, 412, 558, -185, -302, -407, -145, 606, 482, -302, -431, -792, -220, 684, 249, 453, -435, -757, 114, 470, 694, 645, -677, -879, -19, 392, 745, -2, -615, -817, -59, 227, 559, -61, -571, -563, -290, 434, 573, 4, -233, -579, -216, 644, 533, 400, -466, -570, -65, 326, 522, 306, -432, -486, -45, 633, 686, 298, -476, -706, 12, 733, 691, 154, -374, -817, -82, 544, 590, 173, -332, -578, -10, 589, 429, 442, -552, -609, 268]
4249B68J93j08l87n17K10K33O82J50p27m85k06L98O83K01m37m94n94R51L83J44
4269E41n45o34j70P50M59K01n68m56lK71N13J59p04l69K66J04O96J33m89p61j2
4290f18L79J170j64n69p06n8N46J22M72m23r18M39L05P47n7o96n89o4O08N76K20
4311G22n62p10k68P70N72Q0p97l65j02N85P54j87l67n11q7K71N19N0l80n03J61
4332c55L17L67K12n09l91k84O71R19l78m02o58r0N75N88j62l23p58j51Q11L77
4352C76J64l90q25J31O20J33N75p77l97J35J92M46J57m61m30j90M93M15L9j18
4372B88p62j54N56N15J60m40r05L27N46M98q0m56p87M6K46J045m11k21n57r6N44
4393i8M95K72m48p69m1M66P97K43o83p64R3L68P54j29m17q49q3Q23N68K03q02
$$ y = [268, 461, 353, -34, -551, -341, -108, 574, 724, -3, -488, -694, -296, 387, 588, 151, -343, -937, 14, 397, 541, -4, -638, -808, -58, 401, 602, 34, -422, -425, -154, 359, 518, -186, -555, -289, -185, 511, 644, 155, -606, -618, -239, 931, 767, 198, -508, -566, -20, 102, 574, 151, -767, -328, -23, 724, 667, -29, -618, -682, -74, 502, 722, 160, -550, -818, -48, 524, 604, -193, -558, -660, -75, 679, 492, 125, -386, -473, -202, 317, 367, -13, -516, -355, -38, 329, 541, 32, -359, -643, 28, 947, 569, 167, -491, -581, -6, 582, 420, 97, -661, -812, -1, 376, 540, 150, -675, -544, 76, 209, 784, 7, -390, -255, -63, 383, 540, 79, -351, -541, -48, 367, 406, 288, -474, -628, -72, 443, 603, 163, -742, -415, 131, 629, 549, 93, -694, -648, -402, 643, 232, 11, -546, -642, -98, 397, 669, 221, -548, -589, -123, 674, 917, 234, -530, -437, -69, 685, 556, 139, -710, -793, 30, 598, 801, -1]
4414an15k01N60M54Q4l01p11j05P65N20J16n53p84J69M81K41O14m45r59Q5M36
4435e0N17K60q45l04k90P92N30q4k99j070M62J92Q73m38M4p07m57Q77N46J32l09
4456C72j051M6Q66L36q4m29m88l34M53P85L09r14m50L23L10L64J04k0j041j07
4476f50O36P96k3q47l12n6O22K33N6m43l21l28M57O01L51p04l70m35N56P14Q3
4497F16n70m70k09P67J44M70o24o12J28M30N53J42o66n49l2O13N51l60l84j76
4517b38j17K71O30J6o24o22J80M72Q02k72o1j298K93N50N01J34m97n60p7M79M45
4538D07L98o96p67L43M15K85j5k48o33J8M96L25K86l63p81n6P03K79K11m16p75
4559e84J69J05O94J39p85j93L13L5N35R2o31l10k73P43Q1K71k89o43k0O17N28
$$ y = [-1, -516, -717, -157, 297, 381, 80, -631, -736, 29, 549, 665, 112, -672, -503, -22, 219, 833, 388, -571, -486, -50, 467, 727, -118, -422, -712, 80, 610, 526, 227, -843, -381, -189, 684, 246, 290, -417, -874, 3, 549, 681, 372, -679, -633, 233, 569, 485, 56, -432, -766, -313, 472, 781, -133, -583, -260, 50, 414, 518, 498, -543, -650, -14, 782, 759, -88, -400, -456, 166, 399, 455, 12, -309, -637, -180, 421, 772, 68, -302, -737, -181, 533, 616, 46, -424, -633, 134, 278, 748, 124, -488, -360, 70, 623, 765, 99, -450, -482, 131, 682, 322, -62, -238, -355, -84, 546, 562, -62, -684, -504, -32, 770, 498, 437, -861, -568, -18, 483, 617, 120, -440, -517, -38, 407, 805, 109, -658, -315, 100, 385, 370, 122, -511, -493, 3, 328, 614, 251, -530, -586, 117, 396, 607, 191, -584, -415, -310, 384, 523, -262, -455, -142, -107, 428, 520, -111, -421, -694, 49, 130, 401, 112, -531, -551, 66, 594]
4580E94K07p29n06j79M72N71J83q23k35qM42N14p5n62n03O4M31Q01k16k57m80
4601b94k17M89L90q0l63o28K53M74N86k14k33o84p5N77Q31m9o48n16m85Q45Q51
4622H10l61m90l18N6J51P36p0n57k30p7L90K91K86m01m69l23N99J43J11l81o19
4643g23O78j62Q10j54l58n31J25L10N48k08j89l49n40O24L10J25k14m70Q0K84
4663dL15K37l09m14k28Q1Q40k8m04l64l49N84M89P6m92n59QO49N52k13k26q91
4685f50K28O33K56J40m76m79k43N86K76L82p89m99K30M16N02j19m17n47K6O11
4705F7M61O4p18k57l2M69R6M68l70q32K27L80K57M7k48p68J5P31O27j31q78L2
4727b93j53K37O48K30q33k84m5M78N30P8o11m91J46M06L21K00l11q79M07J81J91
$$ y = [594, 801, 72, -434, -613, -141, 430, 613, -210, -445, -453, -11, 503, 428, -134, -637, -573, -142, 659, 443, 186, -294, -511, -22, 368, 288, -75, -703, -450, 24, 610, 396, 163, -521, -596, -19, 812, 763, 115, -401, -886, -41, 810, 449, -41, -359, -303, -152, 584, 514, -43, -273, -350, 40, 331, 617, 216, -253, -576, 23, 166, 277, -104, -723, -45, -207, 603, 449, 91, -440, -315, -5, 543, 335, 146, -203, -743, -119, 191, 316, 102, -368, -288, -4, 311, 548, 239, -175, -403, -322, 518, 490, 86, -278, -627, -43, 446, 522, 30, -529, -521, 128, 680, 467, 241, -650, -422, 211, 467, 607, 131, -348, -591, -5, 271, 653, -136, -635, -405, 11, 513, 394, -23, -570, -544, 67, 528, 592, -126, -383, -415, 54, 150, 618, 248, -584, -357, 23, 280, 327, 79, -689, -674, 57, 684, 553, -325, -293, -446, -209, 439, 669, -164, -448, -493, -15, 515, 593, -18, -509, -363, 43, 364, 564, 253, -626, -219, -38, 153]
4748A53K75l38n45R4O61J22k97j97k33j13L39L98M10m55p53N5N08L65j89j8o63
4769d21j3Q04r7N33o12r11M22J72O94l7l76p00L10L59L19l87j69l70pL46P20o4
4791E15n12m94p4O86M73J02p23m95K18L7N11J44m10n11k2J18Q05J8o30l02r4Q78
4813B38K25N9n62m57J33K98L73Jl65k03k47N85L88O8o48k23J61L23M40N0p01k93
4835c57j97N04N71Q1n11o59J24J82M71J85l89o75K14N86J85J30n46l81K08J85
4855h9L94L18l78n30k0J64R33j40l66o46JM86K63K48n33n89m0M64M23L59n58k02
4877c8m84M18N44p3n02J00n82N76Q00k96o39k27l42P88K62J59m67n29K69L03L24
4898C64j68j79m57K8M20N10j34k77l49k67L10Q76k76l94l79k67P21K48J55l07
$$ y = [153, 428, 90, -455, -361, 300, 422, 125, -72, -305, -418, -79, 319, 729, 274, -479, -424, 84, 449, 260, 242, -421, -434, 370, 273, 806, 194, -717, -295, -123, 571, 534, 158, -542, -232, 127, 446, 59, -110, -480, -487, -141, 579, 515, 3, -491, -565, 121, 594, 696, -27, -522, -304, -267, 244, 388, -22, -533, -555, -437, 368, 386, -244, -546, -640, 238, 463, 522, -40, -497, -364, -66, 307, 308, -57, -260, -507, 78, 466, 534, -114, -337, -176, 147, 587, 637, -64, -357, -554, -50, 521, 602, 91, -568, -444, -262, 209, 394, 5, -670, -456, 130, 315, 445, -101, -482, -274, -89, 305, 623, 245, -285, -305, -141, 792, 652, 286, -360, -359, 127, 390, 638, 105, -484, -524, -60, 363, 722, 164, -38, -522, -104, 440, 367, -135, -35, -617, -41, 759, 463, -176, -403, -745, 43, 305, 464, -3, -532, -263, 40, 364, 196, 17, -440, -412, 8, 518, 384, 107, -242, -509, -199, 677, 401, 7, -372, -639, 82, 330, 485, 178]
4918A78n51N0M77J83K34o03l13k49L96O49n44Q6n47L60J62M64J11o45k61J50M75
4939B62K20Rl51l92k15O01L63po16o2j40L11N68K0r11o6K15l7J086l83n51j34
4961b10m23N53M12L08p03N9n04M56L93j55M5n79o5R7P70o5n30l73mL22P00k0n86
4984a02m85J63L13L27M28q88m82N54L12K47k6n07k84J2L73Q00m67k89o37L12O40
5005C14q2K74p02j31N4J27N99J06o59l69l25Q79M40J11n32p76J87Q92mK08n27
5026H4n89j25L80O99p8l05o26L63K6N36K47m84n90J24O41j50Q0j66m72J77L22
5047I4O1N58q70k33k46K97N26M47n79m41O2K74Q57k15o26j09r9R0M80Q8o19j34
5069c37p8K15M32k1Op72L30K67P54j93o61k34J06K00L79mo59L1q8L77N26k32m22
$$ y = [178, -373, -323, 154, 337, 571, -32, -345, -594, -198, 451, -93, -7, -554, -194, -32, 432, 543, -102, -363, -213, 262, 482, 491, 140, -252, -467, 134, 497, 490, -126, -188, -328, -17, 551, 571, -340, -406, -191, -228, 858, 475, -76, -210, -633, -80, 332, 640, -63, -4, -508, -52, 341, 186, 231, -348, -413, -316, 454, 389, -141, -514, -518, -196, 504, 484, -102, -587, -424, -111, 216, 644, -244, -726, -172, 140, 387, 361, -146, -430, -418, -45, 755, 288, -1, -638, -326, 314, 232, 506, -196, -327, -273, -146, 453, 559, -100, -469, -794, 85, 525, 636, 104, -672, -485, 407, 403, 611, 84, -505, -630, -250, 449, 371, 66, -560, -197, -171, 365, 612, 128, -462, -338, 303, 153, 233, 67, -405, -228, 94, 155, 713, -157, -390, -636, -339, 187, 634, 55, -386, -324, -50, 807, 592, -34, -143, -242, -152, 328, 416, -203, -337, -415, -200, 232, 211, 217, -555, -225, 42, 796, 603, -58, -292, -186, 14, 393, 389, -270, -239, -327, 50, 576, 344, -78]
5092g8k26j41M36J53L73k79o63o2N68L75K7l35m02R2L56L84l18L2l79l78P36P0
5114C41J99m78o86N65J58L18k09Q8p31j50N94K72O7j42n23l15O34M21J38n75k53
5135b67k26P63L69k86l61k76j64M71K98J26o50k3n5M29N9K34j34q12K39J12O16
5156D62j90k35m46l5M48M24j73k52k42j6K59K69M30r75mp2M37M14j18l31n68L41
5178a73L67K22j1r9r05L95K23N31r1n28k17k02M68L25R1l61l46r4K19L79Q7j89
5200I1n00K29J64M52l0m76k85O4K45M91R1m98j09l24M15M05o1k29k98j56L73P18
5222G72m98j26q43K72O89q4J54k50n82J66L83J81K17n71k22k80P73L30j58j89
5242A34p93L72K23M35m8l22m29k93R07J18r6k03o48J45M59O91l41l00n06K96L54
$$ y = [-78, -304, -445, -9, 144, 517, 238, -425, -487, 81, 456, 483, 148, -254, -162, 194, 578, 260, 292, -87, -465, 271, 341, 540, 62, -624, -59, 99, 417, 208, 296, -435, -585, 9, 281, 348, 206, -317, -632, 2, 423, 561, -14, -267, -493, 270, 639, 353, -8, -284, -448, 23, 321, 447, -203, -226, -281, 148, 207, 441, 307, -505, -266, -154, 462, 272, 37, -409, -444, 4, 428, 255, 3, -239, -255, 4, 273, 703, -272, -276, -348, 89, 503, 385, 54, -514, -173, 194, 416, 405, 306, -599, -204, 19, 550, 459, -69, -286, -488, -20, 305, 396, 35, -311, -405, -186, 193, 280, 91, -409, -180, -16, 436, 406, -70, -355, -291, -46, 445, 536, 38, -71, -395, 20, 425, 364, 135, -163, -319, 54, 772, 274, 148, -695, -423, 266, 182, 336, 86, -496, -330, 53, 234, 451, -120, -342, -622, 151, 481, 323, 134, -659, -287, -64, 371, 323, 1, -428, -721, 186, 304, 208, 5, -643, -498, -39, 652, 311, 11, -495, -199, 155]
5263A55L85j24m96j30k73M36N03r1n09l04j31Q07K9K04n30j87j91N01L45N4m62
5284il26J15K28L30l6l12m50l9M46M01Oj12o01j47L98M49J55k71m85k06P14R4
5306C42K91n17n72L2L92N57n4o14l51J46M59L72N5o79j7l00L57N99K3o04r2m5
5328b20N32J38j66l99l22k02J038J76p13L70p51M37N8M31k74K1l32j87L78O05
5348F18j07m75l02n4J50O03K14p40l93J46P86pl55j70m81M2O58L31Q8l81m74k72
5370e75O38L82J21l91n28M3L31K00K61m99l44K0K87L39l1m01l11K42L47M36l33
5391B34l77n69K49M04K99k33R9n64kM34M54M3m93m19M6L79rL33l28m5l93K11L80
5414A33M71p08k68J92K44L69L61r22n18N29K15P1J98p28k93L63K77P37n11k74
$$ y = [155, 540, 416, -80, -210, -483, -47, 456, 365, -144, -448, -579, 228, 257, 461, -69, -256, -447, 54, 399, 453, -9, -335, -220, 8, 338, 302, -10, -460, -499, -53, 348, 354, 242, -359, -506, -108, 341, 496, 225, -260, -466, 248, 342, 633, 116, -456, -424, -32, 525, 471, -143, -494, -348, 111, 483, 538, -141, -158, -458, -101, 498, 521, -83, -175, -220, 312, 450, 284, -115, -437, -639, 399, 575, -138, 232, -519, -82, -24, 407, 133, 154, -178, -365, 13, 618, 511, 36, -266, -320, -170, 433, 647, -93, -486, -340, 446, 439, 84, -86, -567, -525, 133, 464, 552, 171, -303, -575, 63, 445, 566, 175, -353, -310, 21, 221, 482, -17, -361, -341, -54, 285, 254, -147, -458, -216, 131, 567, 234, -143, -712, -463, -59, 240, 7, 106, -458, -460, -26, 428, 471, -22, -441, -395, -16, -25, 308, -20, -65, -458, -247, 133, 604, -104, -372, -180, 64, 433, 794, -128, -646, -117, 98, 169, 367, -361, -654, -291, -14, 723, 212, -62]
5434f2n04K73M83L02k04j90o28J12O21K78j71o36j02J78j53J011n1n60n16K47
5454b72J48M29J7m97l91J42M56N02k2o05o53N65l0O12K87q00l67rN22N79k98n24
5476b09j32R4L15L42k4m57r3j96M71K66K05o81k77J40L39K90J07m21o28J1O02
5497F4L65k93j56m64J21J77P01j95l53m56K42L53K77J02n55q6o9L60L29r4m73
5518a03l23N3N65L70m12l04l04K47L38r9M10o58l12m00N72O85j21j05l97l8L59
5539B3N11K11p13n20J89K47N56o7o78n5m6L92M81l92l71o7Q4l4O79r8m91j24n4
5562c37L87M10j86m02l47j53P34J11K97m59l27NL88M87j51n36n29L88M84J77r2
5583C49k86m40j3M45M55l25j43j77l88O49L66m34j31l87L09K49N38l76j98m83
$$ y = [-62, -566, -293, 190, 492, 288, 98, -530, -418, 203, 481, 310, -326, -428, -250, -403, 608, 557, -3, -519, -272, -124, 305, 322, -175, -566, -424, 32, 534, 512, -93, -746, -181, -211, 401, 688, -112, -479, -488, 34, 613, 315, -209, -341, -247, 68, 410, 386, -71, -164, -360, 111, 377, 582, -99, -376, -236, 103, 393, 500, 79, -549, -538, 64, 429, 136, -20, -484, -363, -186, 515, 320, -33, -489, -247, 106, 383, 485, -70, -156, -225, 135, 464, 370, -103, -426, -373, 192, 562, 150, -154, -458, -211, 127, 28, 438, -220, -532, -932, -360, 325, 204, 99, -298, -336, 23, 534, 745, 32, -488, -299, -52, 504, 437, -241, -296, -342, 50, 531, 139, -232, -299, -215, -249, 430, 332, -159, -283, -337, 50, 460, 274, -128, -475, -628, 106, 217, 514, 55, -272, -267, 121, 608, 457, -79, -608, -220, 264, 441, 349, 63, -377, -390, 55, 510, 185, 42, -135, -523, 126, 492, 58, -73, -460, -151, 98, 636, 260, 62, -421]
5603d21K8M11N36j20k22m79O3M0O47k23k12j37j83K17O28l63k52k62L3L11J54
5624A94J73k59j46k9L17nJ17k86l53j19M39J36J46m49k69L4L42N46j03l16l27
5645b17J9L16L63k23q6l55l03L26P22k75l00r1l42L01R9K07M5o72p0P20j9L17
5667D82p41j23j59L87M05N9k26k42J17J8O02k06j42m23j8J14L35K52o26k87J85
5688b37M08O5N9j06l82j06M90M73k87o49M1q3K65L51O3l99m13O2L17O86k97p97
5710d76P2J92K30L51p8k18k18N6M8M10k28j82k43k58L82N03J00o65o3J15K31J47
5732B08m0m98n5P6K77J37J82m15q8l0L8M84m2j75l05j68L09L13J43l68o77M88
5754b06L59L41j43k46n57MN65L91l39j21l80j72O29J85l7l44k12R6N09P2P5m03
$$ y = [-421, -393, 18, 554, 434, 212, -267, -204, -164, 483, 260, 48, -89, -272, -55, 573, 210, -42, -304, -271, 40, 194, 367, 108, -38, -67, 250, 245, 362, 76, -277, -396, 43, 179, 325, -124, -393, -359, -17, 529, 426, 110, -217, -198, 118, 481, 258, 172, -183, -486, -160, 562, 287, -13, -104, -446, -145, -46, 161, 206, -466, -536, 184, 165, 482, -259, -382, -541, -154, 251, 310, 84, -158, -41, -23, 579, 373, 231, -192, -210, -96, 239, 491, -135, -422, -237, 171, 236, 295, 189, -193, -299, 191, 664, 377, -272, -231, -314, -49, 302, 365, -34, -447, -385, -68, 618, 321, -476, -404, -212, 18, 369, 291, 73, -145, -89, -41, 369, 141, -41, -284, -542, -160, 343, 443, -222, -285, -170, 61, 208, 168, -330, -385, -309, -32, 105, 287, -128, -216, -246, -208, 276, 234, 59, -246, -414, -105, 208, 351, -17, -694, -206, 153, 494, 351, 105, -452, -448, 117, 508, 169, 48, -332, -504, 125, 310, 273, -71, -283, -187, 322, 394, 469, 66]
5776F6m59K66J56L42p9k48m46M06J55K17j4m95k78J10N09r1N4j75o07L68M2N14
5798C13nl46n93L87N51J89p7l46j85k16K26M80K82q26J15n24M51O13L3o39n03
5819f20M52J42J38J11j27n65L18M03j3k16J49n87M28j79L52K33k49k46j54M95
5839B65J86j07n59N3j04J89N78j47m07j51P5J46L80l32r1k08J80L85n3O7m18n16
5861e89n3R48J12Q3o90k25J97K25L95k44k85j0k51L71J33j46J8n35K39J00P93
5882E86j67p28M8k54L67M18J55l23m31K39J24J92L9m65j64r3N17K32j6n97N2L6
5904b33K86K56l8k05l40J75J06J82j23m66Q1k0M59M42l33n40q5j70N55L75L3n75
5926a78j52P6N12K2rn16q8pK95O22pp95RkN40j34pj87m09J31M03K36Rj03r54M46
$$ y = [66, -393, -127, 29, 371, 292, 44, -402, 4, 159, 376, 362, -133, -411, -301, 208, 117, 171, -4, -611, -243, -201, 313, 308, -38, -631, -244, 307, 496, 419, 73, -112, -328, -102, 378, 660, -166, -51, -575, -124, 489, 522, -117, -620, -168, -26, 112, 223, 96, -469, -151, 252, 239, 23, 172, -415, 13, -166, 186, 419, 170, -76, -230, 265, 451, 344, -215, -162, -266, -77, 501, 354, -53, -204, -129, 17, 397, 65, -26, -234, -54, 331, 278, 345, -73, -589, -642, 306, 418, 501, -189, -414, -217, 8, 403, 159, -126, -136, -387, -16, 117, -29, -11, -546, -307, -207, 586, 419, -309, -261, -515, -148, 270, 425, 102, -329, -90, 34, 226, 265, -200, -364, -457, 60, 292, 276, -321, -269, -233, 53, 309, 271, 66, -274, -99, 7, 189, 66, -400, -319, -339, 120, 562, 229, -311, -396, -566, -11, 364, 397, -178, -330, -254, 258, 280, 271, -245, -333, -340, -45, 577, 570, -225, -216, -218, 322, 188, 181, -6, -415, -284, 119, 355, 364, 261, -693, -247]
5952b47K83L72K65r13n8l7K60P28q56J82k33M2M19R3k60j32l33O4O53k6L49r38
5974c23J3k75O32O46k99n86k48K58L49K29l11m26j2j63Q66J23l82r4o61N76J51
5995F3K18lk65l30K40J3N06k05k15j51l94M96M31M6m52l51K14K25L80j00o40J4
6017b60L49J47J06Mn12j72k8M69J57k28j02n15L99L40L60k00m06k76K4O68K01
6038E25l56l60k82K47K56K65qj01n81j0O69M9Q9q48M3j1P60l87K52j32n89L43
6060a67M34K60l20j94m59K14K28K79j92m00J15L2K56K93k97j06k40J02K96K67
6080D01l9n05k24J85L98K36l14k51m45O33L97O2l57m50j80K23L04L10j76l17n
6101a14K65j81L09j11l22J32LR7N76n71j68l96KM69K87j49p2m4k38J80J71J27
$$ y = [-247, 36, 408, 673, -240, -298, -335, -75, 653, -203, -21, -254, -212, 207, 300, 40, -92, -425, -361, 292, 266, 615, -323, -310, -585, 47, 693, 394, -192, -440, -182, 167, 396, 85, -341, -353, -516, 350, 473, 91, -3, -664, -88, 63, 281, 278, 13, -317, -77, -64, 442, 237, 22, -129, -523, -27, 404, 450, -2, -353, -139, 86, 466, 366, -274, -260, 89, 236, 342, 346, -166, -338, -366, 103, 260, 32, -70, -585, -186, 154, 514, 314, -92, -368, -344, 324, 525, 169, -191, -473, -226, 30, 295, 287, 186, -395, -405, 264, 313, 402, -446, -403, -414, 346, -41, 211, 79, -510, -167, 267, 527, 207, 13, -446, -232, -4, 275, 83, -317, -202, -170, 86, 379, 82, -24, -264, -162, 134, 401, 362, -143, -367, -182, 216, 452, 138, -113, -558, 75, 472, 534, 177, -273, -453, -230, 74, 384, 208, -109, -114, 151, -30, 279, 168, -154, -22, -19, 78, 654, 83, -85, -481, -479, -10, 277, 128, 56, 12, -226, -46, 125, 252]
6123B52n14r6K02K86K56j0l25m81PN48L37k08k60l96L25L19k04J95l70j68J17
6144a88L89M74m45l69K4j85N30J27r3j96k03m14P88M5J11m31l81L82O3P08p21
6165A5j71l85K10N17L91l72k14l66L80K59j6k3k25m46R7M66K75n13j36K42j76
6186a91L67J69k40Q7k09r7K90j53K49n53j05K25L32J50K10n93k45j5M37J95r0
6207B20l90n69Q28K61j31o9m7k69l2R6N21j21m52l03L82L49L1k0n14k62J98N56
6229B63K43l06j35l73K34M31j03j98k18j39r5N18P6J20l82k47l7K85N62l8o88
6250b27k54K11L96J08m5l25J6l86N52M67j68m39l3j31O32K14m26n46K6J71J49
6271c8N02p7m93m67M51N43p0l40j10l43K38J83N51k09l64l44K76J66K01O9l33
$$ y = [252, -262, -358, -156, 130, 386, 376, 51, -430, -423, 125, 462, 254, -6, -402, -77, 242, 38, 233, -137, -305, -188, 201, 675, 230, -139, -115, -300, 230, 357, 264, 68, -135, -549, 239, 284, 395, -36, -417, -35, 28, 736, 15, -156, -541, -331, 186, 577, 205, -9, -375, 5, 264, 248, 225, 0, -446, -349, 117, 392, -121, -257, -15, -191, 176, 345, 105, 192, -17, -114, 176, 23, 272, -281, -386, -161, 171, 321, 531, -62, -307, -322, 115, 310, 220, -170, -739, 89, 350, 219, 150, 103, -166, -198, -102, 419, 298, -154, -457, -75, 274, 305, 285, -229, -491, -293, 263, 506, 200, 65, -308, -74, 357, 254, 56, -162, -301, -396, 122, 198, 318, -64, -311, -348, -63, 499, 461, -227, -481, -270, 126, 234, 189, -136, -120, -506, 46, 513, 345, -94, -127, -258, 374, 588, 162, -384, -358, -187, -38, 464, 387, -106, -573, -122, 421, 351, 11, -99, -442, -204, -21, 530, 321, -43, -387, -111, 55, 256, 325, -8]
6292hl49p1O93j28J13k52o78N38M12J29l2l74o00L44P05k9q7m43l03K44J00M07
6314C31J31o91j94K86N65m2k50j91m82K23M63J00L4l43j9Q7J92k7K54n15q7p4
6336b49M13Q7J39m17n53K77Q00l68O2q7j12j78N44j46j46q8k84K06K85R4R7n34
6358a58k80L98K04J03k27j32k40p3N46J33l2n02L0K34jK71j58m4n84K43L82J76
6380B89K44n34l95K38m9M33j64k06j70o2M98J38m0l82m0J62O0K83j25l81l52M73
6402h2N55l51K24n24q0K03j39K70p7k72j92N94j53L24j01l25j48p6O92j34J50
6423C58n55j91q9P07K18j64m64k59L06L14j14J04l06PJ53L8J59J73m58k08l42
6444f13O44M14n76J1l62M50J12N15o55k18LM04o3M1K19l88j3k91N71k0j26k37
$$ y = [-8, -357, -428, 265, 137, 250, -2, -680, -142, 270, 399, 367, -7, -607, -263, 442, 413, 326, -117, -420, -176, -76, 331, 462, -229, -423, -137, 428, 386, 136, -55, -537, -314, 149, 249, 283, -60, -79, 8, 200, 173, 427, -88, -175, -249, 164, 251, 390, -27, -580, -303, 497, 129, 191, 104, -8, -186, 358, 212, 66, -22, -306, -100, 185, 279, 376, -158, -438, -40, 164, 267, 40, -92, -332, -405, 141, 274, 242, -260, -230, 4, 3, 274, 116, 72, -512, -269, 113, 289, 533, -1, -396, -158, -207, 226, 62, -144, -314, -376, 122, 260, 220, -162, -202, -40, 20, 303, 178, -203, -555, -82, 473, 122, 346, -178, -258, -55, -194, 76, -1, -273, -465, 129, -24, 300, 199, -126, -274, -350, 342, 208, 358, -197, -388, -477, 230, 448, 284, -180, -439, -133, 181, 67, 171, -135, -128, 25, 63, 222, 395, -63, -271, -613, 31, 445, -131, -120, -482, -32, 80, 595, -60, -278, -275, 129, 66, 107, 326, -62, -75, -366, 205, 185, 59, -178]
6466a78k83L78K21jl0j54m29J43M87K25l72j89j52J92L17J83j90k91j56j59L14
6487a24M92j12j52n26L05L25P7K1n64J31J69J36N6j28k59j70K66L99J72m38k99
6508b23l57M87L02J97N0m68j35k1J82O52n03k42k81M35O2K29k69j73PJ3J54M52
6530E50j26p89Q6K38Q8K69P0p69k1M18J63o5N1l20P3N2K73J29n5k11m84K24K55
6553I9K57n0j2m54J05K22p9j45j80j36J72K08L03j78l63o8K35K43K88K4n96m31
6575e36J50O57J50m50k2j83J44J64K12n6m17j8o3J87N03l87K6j50J56M9M81p01
6597a04j52j14L18J70mJ89m08k86K0N87K84l42k81j98L12M74j69J4k77j08j6n2
6619a43L69o0k27j32J37K12n7J12o87K75o6L63K98k59m19lK8L87J34k91J10l96
$$ y = [-178, -461, -83, 138, 137, 107, -47, -476, -333, 154, 379, 7, -182, -334, -142, 175, 358, 168, -123, -279, -438, -124, 368, 256, 104, -422, -117, 208, 285, 306, -258, -127, 42, 178, 234, 106, -153, -323, -57, 342, 514, 76, -223, -580, -93, 209, 406, 456, -12, -147, -168, 14, 666, 163, -79, -360, 75, 137, 366, 97, -76, -69, -56, 98, 550, 424, -365, -279, -41, 47, 316, 386, -383, -404, 14, 177, 112, 163, -157, -84, -32, 241, 370, 315, 104, -380, -156, 99, 356, 306, 294, -160, -55, 167, 88, -57, -237, -373, -201, 7, 310, 132, -231, -299, -64, 179, 467, 491, -105, -536, -386, 271, 421, -29, -51, -234, -90, 74, 286, 230, -187, -205, -268, -81, 422, 35, 61, -89, 67, 116, 597, -104, -256, -370, -52, 118, 114, 303, -105, -391, -371, 216, 500, 158, -123, -321, -9, 465, 296, 310, 33, -75, -91, -143, 226, 166, -61, -193, -56, 156, 99, 211, -476, -201, -267, 96, 394, 135, -284, -287, -259, 128, 262, -29, 81, -315]
6641c15J12N94r0J81q16R7o5L92K00k84L5m2j56M1K04j28l40j13K70P94k19n18
6663a66K28l66k2N51q1R2k09l27M88q2K4l9l19j16J79K13L34k10j06m89M9M92
6685A18L44l84j6m65L23J69L02l18l72L9P6m5M90k80j29j39M1L53M27o76k34J01
6707b75J64K85K79k82k41q8n3O16k98L25q29R4L68L34mq5m77j78L09K50L34N6
6729F04p68k78J76N08L40o23k52q3J45K01M60m71M8k89o6M89L65m66m89L60L1
6750e8M15k44Q6n26q4K87L20J01j02n47k4K28K69N1k80j22P5J16R3J75m39L74
6772A64m66P3L44M59j91p39J25m3O04P6k26j01m24L29K55j46j51j6j06j1N45J00
6794D54k36m41PL54K06J4J64n85l88M94K4L25k05n01j71J77L77J10O5l26k21n5
$$ y = [-315, -203, 391, 301, 482, -334, -237, -302, 90, 290, 6, 41, -1, -157, -116, 88, -40, -380, -493, -223, 571, 352, -166, 62, -304, -326, 225, 144, 236, 27, -300, 188, 106, 130, 91, -228, -344, -165, 48, 382, 172, 66, -423, -374, 118, 462, 78, 62, -403, -80, 89, 391, 73, -299, -260, -184, -229, 261, -19, -148, -287, -246, 107, 534, -142, -376, -275, -111, 174, 453, 171, -70, -158, -211, 405, 107, 432, -397, -303, 65, 399, 395, 310, -167, -345, -36, 214, 548, 604, -164, -442, -266, 242, 582, -41, -293, -376, -231, -30, 430, -41, 7, -282, -348, 141, 506, 40, -449, -89, -58, 357, 113, 199, -327, -411, -124, 196, 297, 195, -352, -376, -148, 121, 172, -108, -230, -155, -39, 54, 229, -210, 164, -302, -229, 115, 574, 383, -356, -231, -274, 330, 406, 180, 79, -345, -16, 239, 93, -58, -74, -180, -191, 354, 454, 218, -223, -216, 138, 344, 358, 522, -63, -451, 43, 67, 392, 187, -314, -485, -308, 69, 179, 244, -82, -303, -358]
6816c58O25J9k33j67k44j26P12k88J20k87r0O21m58L74l6m86N0L42K39J22j99
6837B52m07r9K60M5L29j46m59k96N23L34J83m94m54J83K99K75n7k69l51K43J9
6858h7M78k23k41J60j89N0K93M2j88j45m28M09L27M5k48j01N0J56O5r3m03J79
6880i2k55k22R63k12J76m17j54L60J10K30k15m68l4K08K95k37qk53k64K69N85
6901C65J54n11j34O6R5K10j69j7m71N9M6N63N6l98l04J86r0L62L99k03l87m17
6923e40N41J24M93o72m37P3K15M43o0J08o56J94R2M72K5m19m58L7M16L13J44n69
6945a21N7m92L12O01J6p5n44k62M66K19J97k28l36K4O0N78l73l11k8j44M92J56
6967B64J81n82k54M8q7P69K11n12j50k18J32L69J66m73k90Q7M7O21N1k73m23J54
$$ y = [-358, 267, 286, 53, -114, -358, -484, 228, -60, 60, -227, -317, 304, -154, 220, 184, -302, -252, 90, 329, 451, 252, -155, -254, 6, 51, 380, 234, -225, -521, 2, 336, 519, 25, -429, -246, 53, 328, 271, 2, -349, -106, -87, 391, 168, -73, 87, -102, -52, 241, 283, 95, -50, -478, -69, 258, 303, 55, -46, 4, 160, 225, 132, -271, -92, -347, -569, 394, 182, 358, -59, -213, 147, 257, 487, 272, -196, -230, -22, 273, 36, 28, -225, -489, -220, 365, 519, 8, -126, -60, 35, 245, 76, 59, -412, -353, -307, 256, 312, -86, -390, -204, -294, 68, 467, 264, -123, -540, 1, 125, 618, -54, -491, -418, -203, 240, 180, 288, -368, -174, -82, 390, 415, -4, -462, -425, -9, 304, 448, -121, -64, -556, -244, 357, 373, 298, -246, -508, -42, 177, 374, 146, -190, -166, -106, 472, 99, -212, -240, -384, 108, 264, 445, -137, -391, -343, -430, 339, 550, 38, -112, -330, -198, 171, 337, -136, -426, -339, -292, 329, 380, 107, -316, -162]
6989a62O6M51k71m40k64K85K02L01J82N1o45k9K80J71L48l27l92r3J80N77q1l27
7011F3j20k70K74K70M69n91m04R1J62M07l67N0k11j86L30M06m37L2j92k70L78
7032a16M19J11k22n94K92l05L83O58o73o6l02O20K09j98j68l55q3J19O69K8l58
7053F8n15K0N31o1L82l79m08J17L15K34J26k32o82J61K12N62M2p32r0k02L61P58
7075E88j66k25m31j49N80j64J80k68j12k52M86M61k82L0l44j05o5M71L07k33m26
7096a19m7L74l2q9k1l76L6L96J60j93k08q5l57M69L18M1j94j43l79N90J13q3j55
7119A6r5k23M66N7l8J51o47K71J37L45M7o70Q4j62L70K83R9k70n29J01J22M91
7141D06k19j79k30j50L34L35K72k62m46o3P2L73L15l28m85N6M38J33J13m03p06
$$ y = [-162, -96, 355, 84, -356, -620, -335, -133, 168, 350, 401, -244, -273, 7, 178, 526, 199, -193, -286, -106, 471, 390, 63, -57, -327, -53, 217, 686, 95, -309, -218, -56, 351, -16, 34, -177, -363, -33, 373, -64, -32, -224, -494, -116, 303, 414, 192, -402, -110, -415, -32, 626, -47, -113, -415, 205, 414, 216, 48, -307, -390, -271, 398, 426, 68, -447, -427, 104, 43, 425, 46, -362, -245, 70, 304, 430, 198, -484, -323, -111, 451, 493, -239, -329, -531, -170, 588, 422, 197, -234, -383, 197, 33, 213, -55, -167, -419, 67, 528, 246, 276, -68, -173, -238, 233, 540, 307, -119, -166, 208, 176, 87, 66, -310, -274, 122, 282, 89, -119, -204, -561, -92, 226, 267, 73, -70, -449, 141, 254, 171, 16, -79, -302, 164, 221, 183, 334, -313, -42, 95, 440, 487, -183, -99, -261, 109, 392, 491, 221, -308, -207, -85, 406, 187, 8, -222, -372, -38, 297, 569, 307, -139, -202, -130, 243, 558, 230, -255, -199, 239, 372, 485, 82, -624]
7162f24K84K62J96K32j88k33k20L43J36Q7k54k40m79N98L45r6om90N3M17J52j34
7184A41Ql38k32J50M68N5k79m14p1N07K73L26o31k61k46N75K89L4m22j80L1K35
7206A8K48J86l68m99J79M06O3mr7m24j92M92K64L7k9o15O0K02K74K05m36J7l46
7229c59L80M35k38k76p3m98M98N12J22n36l11J73Q5N03k79M6p11J96K26O71n71
7250ej10k28J60J26M95j33m05R1n05M93Q4J23p4n19oJ85M04K09m11Rk97L01K65
7273B52rj82l28k54M06O44o0m60l4k23K60K07k6j90l20J31K88j78L97k42l68J31
7295a58N5K11R5k90j69l1K39J47M03m34m94K08o0O86J3j53l47k40l0N64Q1k53
7317D3m88J13K92J26J79k05j43j75M99m3K12n09j84J90j88P76j38M6o77n7J17
$$ y = [-624, -340, -78, 118, 350, 162, -71, -291, 52, 188, 275, 21, -219, -698, -100, 245, 149, 143, -347, -294, 123, 275, 141, 149, -189, -421, -271, 197, 252, -27, -441, -512, -5, 268, 594, -37, -298, -544, 31, 320, 354, -68, -248, -217, 18, 266, 452, 84, -415, -236, 170, 233, 229, 132, -292, -484, 8, 272, 309, 280, -335, -275, -73, 201, 406, -30, -13, -359, 21, 456, 218, -58, -131, -629, -131, 381, 503, -33, -344, -171, -86, 417, 138, 184, -527, -331, -105, 566, -5, -115, -343, -183, -57, 438, 305, -100, -9, -514, -21, 63, 186, 112, -407, -413, -228, 176, 385, -26, -17, -314, -13, 252, 243, 61, -267, -521, -115, 529, 469, 9, -25, -248, 12, 219, 193, 3, -317, -186, 102, -76, 321, 79, -289, -158, -103, 108, 203, -87, -256, -287, -48, 99, 502, 68, -426, -218, -278, 408, 421, 268, -79, -319, -349, 215, 296, 43, -445, -332, -40, 86, 265, 60, -83, -258, 241, 198, 410, -99, -283, -93, -281, 495, 357, 403, -274, -331, -214]
7338b14O61j32k78j44k5J07J66J93k56j69l26K78N92k87m05L7M1l2M21j89J73
7359B12m79R1K9L99O9l23k85l28L07P80N7n83k89K79J06L51k09r1n01K95Q6K30
7381B03L2k87m18K00O8M39O0j76m87p3P02k50M47m90m02K52lM70N8m00j52m2J29
7404a20O94J52p17o05l5M80K54K72j60m35K73j83L89K3l19r3k01L13M82L0k74
7425B20l46j49M26k06L14l43J3j01K76J88J41l88n44L92K37J00P3l89k54k93N37
7446i6M14jm00j99K2J37M77n3k35n16K7L58N72j80m24j14j72L90K29J81n17q1
7468a81k29J93K19L46m30m86K79O1O68n8l63k95j14K46O37k81k29k06j07K23O04
7489D97l77k13j27o7J77K38J05k10o49j7N93K95q9k27N9k61K04M21k23j16m92
$$ y = [-214, 447, 315, 37, -107, -132, -25, 141, 334, 78, -91, -417, -139, 453, 166, -239, -202, -161, -193, 228, 39, 212, -267, -176, -147, 252, 321, -2, -287, -615, -308, 472, 529, -54, -343, -64, 42, 393, 184, 93, -408, -113, -27, 203, 235, -52, -470, -270, -202, 237, 297, 121, -366, -439, 263, 13, 460, -30, -432, -180, -183, 287, 345, -55, -207, -249, -120, 574, 726, 9, -596, -631, -151, 103, 375, 215, -220, 53, -130, 259, 282, -37, -130, -331, -18, 464, 494, 220, -126, -275, 151, -55, 259, -84, -71, -172, 104, 292, 433, 45, -499, -107, 130, 230, 303, -86, -340, -633, -96, 318, 317, -83, -282, -260, -123, 354, 301, 66, -450, -423, -65, 507, 327, -97, -211, -383, 7, 236, 417, -100, -181, -410, -217, 2, 348, -82, -568, -289, -228, 440, 382, 19, -276, -390, -144, 493, 212, -17, -223, -330, -107, 497, 120, -93, -220, -287, -110, 128, 233, 23, -626, -643, -50, 245, 156, -71, -12, -273, -69, 352, 129, 13, -479]
7510d79J95L03j26L54l78j95J61J75N49k69l27k94J86P9K37L06m35o4l04L08M44
7531D26k25J56n84N7M90j51J03j83J1n14L26L28K50n91P3l77O21P5l17K78k36
7552A6k58L36j08L04m85j35P1K46L79j61l51K1k08K36L81o5l24j28j58K61P93
7573F63l93n42k21J47N20j28P5J2n29j13M49J51L80k00n44J8L62K11j0j17n42
7594c51J19K89KK13n80k05O8N60J77J41l94m44K46J81J57J48r7n37J53J81N97
7615F24n7n52m06L54j80J92L36O5o35Q6Q8J56K79k14n06K28pL17Q0j2n23J5K51
7638b1K95J8k93k87J09P6L31Rj86j36j40K96j04K02r2l85J00%M89l3J28q80l8
7661e42N41K85k04J31n73l6P18q8N2k16m73N39J31O2l84J72m38K7L00J47J79k39
$$ y = [-479, -284, 19, -107, 247, -131, -326, -165, 10, 559, 290, -37, -331, -145, -66, 171, 477, 42, -22, -326, -18, 426, 201, 357, -227, -170, 320, 169, 272, 89, 100, -414, -88, 240, 490, -101, -28, -405, 216, 291, -26, 252, 16, -242, 94, -14, 290, -195, -330, -259, -13, 366, 205, -146, -125, -333, -97, 284, 219, -105, -233, -391, -130, 663, 270, -272, -493, -346, 174, 46, 121, 133, -396, -509, -60, 91, 471, 271, -273, -255, 107, 318, 308, 191, -351, -232, 57, 59, 272, -308, -513, -445, 115, 292, 433, 39, -405, -159, 22, 179, 327, 230, -307, -154, 27, 624, 567, 15, -391, -37, -217, -25, 311, 376, -259, -173, -85, 71, 350, 136, -370, -142, -149, 168, 248, 236, -287, -272, -21, 274, 292, -1, -288, -179, -103, 228, 237, 51, -85, -225, 71, -33, 169, 77, -308, -208, -208, 281, 248, 376, -504, -542, -1, 284, 80, 211, -362, -398, 320, 232, 284, 68, -405, 134, 265, 327, -57, 115, -323, -296, 4, 151, 330, 91]
7683I1r3l93L52L51q6n9l63j68N19J11j24j43l34j42M24K81J69p52m0L8J26K92
7705E7L22j20l64j03n7N60L81n47m70J27Q9N27k37j56k57k33M03M15k1n09k3m0
7727b56J47N24O6o67k23L49N31k12K82o32j37K19n0J03K73l54l29OJ08N70j21
7748A97k98l22j85M01M23P4l18o4k08J76N00k93k24p2L2L96M17j84m59l69R5N26
7770B41R3Q8n59k65J98L26K64j08l91K34j66K38J26n30K06j05k59L41J76J26m57
7791a83j42j64P63pNj88n02K82j3N40J93n09m19j31L38K84K29n76k09O4N8M88
7813B01K37m66k67L79j60K97l1j41M8o47O36k3L21j29k35n33L10N18j39k61k18
7834c03m7J84M11q4k06k00J8l9O29J7m61l27n4K85N79j95j25l95J44J03J45K85
$$ y = [91, -2, -395, -43, 308, 222, 163, -200, -368, 151, 262, 138, -5, -339, -481, -57, 224, 393, -359, -399, -361, -235, 57, 379, 259, -105, -208, -265, 295, 676, 129, -341, -214, -125, 402, 165, 9, -248, -481, -78, 337, 316, -193, -216, -256, -109, 415, 481, -186, -409, -60, 471, 259, 541, -91, -228, -9, -59, 44, 317, -37, -366, -360, -252, 318, 197, -101, -423, -608, -207, 216, 290, -28, -92, -300, -124, 376, 83, -141, -213, -181, 215, 632, 448, -11, -380, -285, 241, 334, 422, -137, -402, -204, 122, 386, 278, -113, 121, -45, 193, 319, -211, -5, -110, -369, -28, 148, 274, -183, -325, -489, 274, 267, 272, 84, -418, -136, -149, 391, 584, 75, -344, -475, -137, 147, 376, -200, -409, -345, -287, 201, 438, -28, -295, 84, -76, 221, 190, 49, 97, -550, 86, 63, 384, 255, 20, -513, -203, 315, 176, -85, -303, -350, -166, 245, 161, -45, -245, -227, -266, 363, 380, -81, -408, -462, -177, 402, 207, 82, -313, -169, -66, 79, 364]
7856C64m96j91n9N21j37K50j73m48J9L70J63k62J21l65K53K12j6M65n56o75J45
7877d95K82N06%l51J91m23M08L29r4l67k37R9J64K15N7k04m63J43K98L83L9m55
7899B5k83J4O2L80J57k39n39L0M09J3K81k44m73p3K82L98j57j78r8J2L16J10J81
7922C86k44l07K80P5J19j41k21k74K34K85O0k7k79l2n0J03L10R3j93m96J49J31
7944c9L81J31m34j95K03n3L03J7o62k56L14M26j4J3l03J14k36K91K71j80m57J83
7966a82k31M49N43m78k17j24M8J89K69J65n93n6K72L2M04j71l29m94n6N17K86
7987B43J25n17j29K02P2L45j04k38m00K36M75M4k47pk66j79K42K88J06m29J61
8008B3k83M27J19j46k7m34N0J90L75k25k80j05J20L60N3Q9j94k03j39L07K69k96
$$ y = [364, -132, -323, -382, 139, 2, 252, 79, -369, -350, 20, 183, -79, 42, -323, -70, 142, 126, 591, 35, -640, -495, -213, 293, 293, -58, 133, -290, 118, 447, 353, -14, -251, -152, 12, 227, 284, 80, -383, -240, 58, 441, 480, 25, -258, -244, -182, 198, 355, 116, -423, -393, 16, 29, 310, 66, -407, -480, -198, 200, 43, -135, -233, -221, 95, 205, 386, 142, -165, 115, 190, 309, 168, -53, -327, -93, 192, 252, 225, -54, -86, -136, -33, 277, 370, 177, -319, -170, -39, 342, 473, 39, -156, 47, -6, 297, 314, -348, -604, -290, 136, 122, 135, -168, -54, -290, 1, 272, 92, -365, -182, -413, 36, 579, 101, -116, -240, -192, -3, 266, 431, -162, -218, 54, 86, 490, 319, -10, -504, -560, -43, 243, 368, -149, -278, -76, -4, 341, 237, -1, -401, -165, 310, 354, 107, 100, -166, -345, -103, 185, 291, -138, 23, -260, 167, 286, 140, 113, -321, -271, -81, 294, 69, -211, -316, -196, 164, 217, 306, 112, -91, -230, 77, 346, 50]
8030E0l18j65J06M65J79j38j10j29O9L9J78k0l98R0R7j05N98l69j26l47P3K55
8052b6J96k34j96K01mm59M68L44l90j27k02N46R3J9j84m87J97L50K09J35n22m64
8074e37K39O02Q1k11j41l61o3K75O62l21m57l3j06K40L18J7l25J37j56K20K38
8095C18k00q8m17N06l8J5R4l8m94J57J54K04Pl49K02j25K14K80l84J16l46r0M19
8118A17J86j80o2l67K33L60JJ4n26R2j38K96J65J18m27q3j54K12N85k79J7n68
8140c88L3M01L29j57j60n02K25M33r4L67l89k89j63L58K68p9r3n78M6K45M52J02
8162C67j17m22j77L10J97J0k15k01J01k0L23J73q4o18J35L70K52j54O8m36k34
8183c72M47m8N5K02m53K16K6K86
$$ y = [50, -268, -433, -327, 138, 317, 179, 69, -60, 9, 48, 226, 206, -192, -102, -5, -110, 488, 119, -7, -354, -281, -26, 170, -64, -260, -59, -63, -522, -54, 290, -100, -227, -429, 117, 210, 229, 45, -442, -245, 105, 314, 449, -73, -537, -298, 304, 385, 174, 33, -328, -391, -116, 546, 225, -232, -265, -371, -131, 187, 204, -121, 16, -140, 80, 318, 118, 30, -387, 119, 81, 96, 190, 152, -342, -185, -31, 173, 180, -169, 33, -92, 122, 402, 18, 134, -212, -302, 117, 303, 123, 61, -306, -73, 287, 288, 302, -224, -132, -270, 26, 191, 309, -118, -201, -355, -143, 442, 163, 180, -388, -355, 46, 375, 218, 58, -444, -219, 214, 120, 487, 98, -191, -354, 4, 272, 193, 100, -478, -432, -187, 265, 367, 250, -172, -349, -39, 158, 168, -47, -248, -147, -167, 156, 329, 245, -373, -238, 132, 384, 230, 298, -138, -372, 75, 27, 82, 284, -169, 47, 73, 359]
8191C59
$$ Imaginary data points
##PAGE= N=2
##DATA TABLE= (X++(I..I)), XYDATA
0@%%%%%%%%%%%%%%kJ4k4K4k4K4l5M7m9O1p3Q4r7J11j29J45j66J91k16K47k80L13
36A66l53L98m46M96n51O12o80P54q36R24j017J121j238J364j501J654j824K013
54A056k223K459k724L027l382L799m292M890n635O596p883R700j2490J7352k8238
69a7988J00189K782q9751L7735q8829J01142M2912o6681K2590q2862j9504J14133
81E5868l5993L2610l0047j04874P2633J6225J2924O1399j12683j2791L2656j9570
93c1643J00729k5584p8564K7141n3142O0053P3743o9841R923m7265l3765J07956
105C9741j0856K33M19r7876N1792M3383o579N7675q0615l9321N2131j6952P2033
118F5208M086q8937K2057k6789K5522Q3383o0858j5041j8154m6922Q9289J1358
$$ y = [0, 0, 0, 0, 0, 0, 0, 0, 0, 0, 0, 0, 0, 0, 0, -2, 12, -12, 12, -12, 12, -23, 24, -25, 36, -37, 47, -50, 61, -68, 77, -89, 102, -114, 133, -147, 166, -187, 211, -235, 261, -290, 322, -358, 396, -440, 484, -533, 588, -650, 714, -787, 867, -957, 1056, -1167, 1292, -1432, 1595, -1787, 2012, -2280, 2610, -3025, 3571, -4312, 5388, -7102, 10250, -17988, 82201, 84983, -4768, 32967, -55862, 45280, 88192, 21511, 44101, -38761, -58265, 55868, 19875, 52485, 22438, -82436, -9803, 6422, 19346, 80745, -31938, -44729, -12073, -31643, 69086, 43502, -35062, -7921, -61063, -1010, 72733, 2892, 12815, -34450, -68215, 39741, 28885, 29118, 29537, -68339, -16547, 26836, 20257, 77932, -2683, -42004, 10127, -6825, 65208, 69294, -19643, 2414, -24375, 1147, 84530, 23672, 8631, -9523, -56445, 32844, 44202]
130D4202k8297J0927q3462K0027O2497j8020M0520n0093o2008N5295l835M0228
142B7981K6441q6355N371J799L366Q0708l8099l7838L341m4052O6293L7856m2311
155D501J0807n7495n285P4934j3073J9427k0474p0998M7808J6469J4708L8812
167F0141p4827j4935K3557q449O8898j4978n7587J3039l4218L9497N4764m7504
179G398J97l4158k5903P4432k119l210j978p1242L0744L5320k982L8452n5998
192a1047l4739L7267q217M9991P299o5468J0431j5677J8152O3794l8982j5189
204b385j2058l3961O5445J6299k0677P313n9782J1306N0934r540K8766l4657m9261
217d2258M0167L40L0188K2933o6441K66K388J390O3715k6995l2452K342l5033
$$ y = [44202, 15905, 26832, -56630, -36603, 25894, 7874, 48394, -1699, -63707, -8412, -12247, 27981, 54422, -31933, -26562, -24763, -21397, 59311, 21212, -16626, -13285, -57337, 8956, 46812, 4501, 15308, -42187, -47472, 27462, 14389, 33816, 13342, -57656, -9848, 6621, 21329, 60141, -14686, -29621, -6064, -14513, 54385, 39407, -18180, -5141, -39359, 138, 54902, 7398, 7595, -26563, -52466, 21966, 19847, 16637, 14659, -56583, -25839, 9481, 6499, 44951, -11047, -45786, -8519, -16736, 33255, 40554, -24914, -14483, -30160, -12008, 51786, 12804, -2385, -14443, -48404, 17041, 33340, 12663, 19976, -39806, -28500, 22434, 12894, 41660, 7003, -42258, -2091, -1751, 28437, 51370, -15071, -14805, -12417, -11027, 52688, 25693, -6759, -4417, -39450]
230c9450M9753L1764l2330O447m5818o957N8778q093J4093j6720n7636L4563J4641
243C035J1603L0760n8426j4387J7680n495N4737r662m5363P430k5676L2107M5063
256D3406l4901j329k7488k0269N8865J468j853k727n6927K3241K8722r3L0615
269D0730m5529k9511K8075n424M1751N609n3536O607j3242J5430N2515l1103j3046
282f74j1705k8273N3886J3649j5786M505n0991Q774M1614o694K3396k9662m1983
295c9944L1366J309K5035J8337n4511j911J506K540N3003k1237k6878j30k7915
308c9430M1983K7696k6005M130l7964o042M9388n312J1731j4635m8510K7727J2652
321b591J1125K5784n0122j2806J5304m031M7287q003l8433O465k2019K8253L9426
$$ y = [-39450, 10303, 42067, 9737, 16184, -29634, -36591, 22187, 14094, 28187, 11467, -46169, -11606, 3035, 14638, 45398, -13028, -27415, -9735, -15230, 39507, 29845, -15518, -8088, -33764, -1657, 43406, 8505, 7176, -20312, -40581, 18284, 19752, 17899, 15172, -41755, -18514, 10208, 10115, 40730, -4799, -34310, -6235, -11659, 30092, 35701, -17835, -11228, -24470, -9040, 43475, 12372, -674, -12379, -40652, 13234, 26883, 11097, 15602, -35389, -26615, 14999, 8305, 31701, 2039, -39944, -8578, -7269, 17766, 36103, -18408, -20319, -18813, -16273, 36730, 15493, -11385, -11515, -39430, 2553, 30249, 4244, 8374, -29590, -35632, 13756, 8444, 20175, 5540, -42970, -15243, -2591, 8534, 34318, -15804, -28610, -13306, -17337, 29950, 21947, -16486, -10021, -32040, -3787, 35639]
334C5639k9684n25k3962j7549N1586J484q16k866m9808K0199K4455l75K6314l9774
348e682k5843K4114n009L6245N093m5950M731j1509J4172M5389k6727j1205j0806
361a2987k3810M6626J2115j3293L482m4112P641L5677n437K1367k6766l6141K7671
374g967P20K3197J6577m7957m44M49L238M7472j8835k2074J27k4856L8004K4223
388C1874k1722M298l4323m206M3100n611J2242j4261m3195K4996R152J0538K1928
401C4810m4418j0882J1574l795M2126q473l3044M638j9947K5312L3279k5206m30
414E544k2562j4159M4232O32L65l932m3402J7419K0451J561K2825l5393k1328
427b7747J9434l455L3015L318l8657M616j0804J4119L9906k3074q535j0280j9795
$$ y = [35639, 5955, 5430, -18532, -36081, 15505, 16989, 16173, 13307, -36501, -16302, 8153, 7778, 34092, -5682, -31525, -7411, -12420, 23825, 28918, -17032, -12301, -23810, -9638, 35751, 9024, -2181, -12987, -36797, 9829, 21944, 8651, 12133, -31979, -24338, 11339, 5902, 27269, 503, -35638, -7967, -7247, 15950, 32527, -15430, -15874, -15425, -12187, 35285, 16450, -5624, -5497, -30353, 7651, 31874, 10152, 14450, -19873, -24079, 19021, 13410, 25652, 11391, -31804, -6808, 2344, 12882, 34810, -9608, -20490, -8916, -12711, 29415, 20942, -12102, -7464, -27411, -2099, 31180, 5974, 5544, -17018, -31177, 13055, 13687, 14052, 10120, -33282, -15863, 4588, 6149, 28974, -6419, -27747, -8313, -11768, 21247, 24565, -14092, -9476, -20280, -6161, 33745, 10671, 2136, -8144, -27939]
440b7939M1145J0297j0945K727l9184P835K9601l827J7822k4105l1077K2047O06
453d997K1071J2435m1047j688j004M261L9653j6619j8826j863k0999L2611J9719
466B2707j7446K668l0445l101L5778l181R980j3518l5791J9778R092J0556J7850
479B4927l7209r710Q945j347L6468o749k7302K731j6156K2833K8895k0123j277
492D926j9760j1497L8135J762N82m224l7146J4616J7621K468J8926l0582j8923
505b3096J5926k023K7906L206l3357K392r287J2656L3351j8258q208j0119j6396
518b5307L4975R445q018P72l3560N910K5969j760J5109k1020k6397J8006J627
531d249J8871J0963l4794k422k78M448L4149j3177j6237k822j7114K8058J7863
$$ y = [-27939, 13206, 23503, 12558, 15285, -23899, -16064, 13537, 9710, 27532, 3427, -27650, -5603, -4997, 16074, 28509, -12538, -14226, -15230, -10969, 28684, 12065, -6761, -8624, -29623, 2988, 22707, 5261, 7929, -22516, -25617, 10161, 6980, 16960, 3442, -32349, -12571, -3479, 7077, 24927, -12282, -21992, -13047, -14394, 22074, 15325, -11977, -9246, -25402, -2569, 26326, 6203, 4926, -14834, -26331, 11804, 13566, 14148, 9924, -27222, -12606, 5015, 7483, 26409, -4173, -23096, -7170, -9193, 18713, 21919, -11438, -9046, -18333, -5677, 27674, 9416, 1208, -8911, -25307, 9668, 19113, 11095, 11867, -21693, -15783, 10186, 8426, 23535, 2515, -23882, -5876, -4249, 14622, 25585, -9209, -11631, -11909, -7461, 26688, 13511, -2726, -5548, -22662, 5396, 23259]
544B3259j4362J259k6425k463L0496j856Q857j2130l1275J6598P761R918J5377
557B5014l2157r131O840K63L0686n478k3211J021j4247J9893K4860j5947k167
570F239j7594r716L1710L361M87m491l1596J1468J5447L628J5385k5701j6462
583a7835J2017j53K4166K454k8114Q52p757J1313K8637j5238p818j0032j3678
596b1186K9038R035o291q66k8787M923K1608l38J2554j8242k3182J4707K541J6533
610A2047Q565k9143l164j078M923K9114j0426j4394l884j4086K3716J5802j1025
623F967n42k2175k465K5711M93P028j0620k6472J2937Q138R227J2461k6615r144
637a5071N749R71K6101l876k0200r21j1334J6688K1227j3005k727j5525q610K7248
$$ y = [23259, 8897, 10156, -16269, -18732, 11764, 9908, 18765, 6635, -24640, -8042, -281, 9637, 25014, -7143, -16274, -9434, -9171, 21515, 16037, -7174, -6153, -20400, -507, 24353, 8406, 6239, -11355, -21071, 10639, 14000, 14487, 9996, -21600, -10132, 5315, 8943, 24328, -1373, -17835, -5818, -5971, 18195, 20649, -7465, -6613, -14370, -3057, 25580, 10342, 2524, -7508, -21186, 7852, 16887, 10596, 9730, -19057, -14134, 7474, 7136, 19690, 1448, -21734, -7027, -4486, 12047, 20612, -8531, -11695, -12773, -7850, 21264, 10838, -3556, -7440, -21526, 2190, 17992, 6967, 6425, -15750, -18215, 7496, 7989, 15017, 4397, -22075, -9138, -1000, 8227, 20688, -5927, -15071, -9322, -8351, 17750, 13874, -6326, -7247, -18581, -1893, 19334, 6329, 3602, -11923, -20533, 6715]
651F715L706L87m480k6945R043J4147L015J3413k1951j5107J0711K15K1153K632
665A6654k4037n57o579R407K5536j2466p667q320j1650K4685R007n748q26k4260
679a6821L412J9241M90J1200j5966k0149J2464K997J4137Q083k5165l545n80L955
693f247K5393q441j3161l319j2707K0339J4658r385m60j9500l063K2991Q15O148
707A4061q849k3838J1590O872Q463J1547k3577p856M598P96K3187l011j8284p36
721e037j0285J4497J9478j1976k224j3970p824K4067L201R14l898k4207P978J2237
735B951L762J1712j9621j3531R525k25J8670K467k1199q65o335Q569K2320j1009
749G191o504q215j0497K2076P626m423p75k1627K941J6785P68J0143j4135j7589
$$ y = [6715, 10421, 10808, 6328, -20617, -11574, 2573, 5588, 19001, -2950, -18057, -7346, -7131, 14022, 16654, -7383, -7940, -14519, -5112, 20424, 7958, 291, -8029, -19679, 5006, 14013, 8265, 7439, -16821, -13409, 5832, 6322, 17522, 1556, -18593, -6129, -3132, 11005, 19088, -6077, -9622, -10202, -6247, 19146, 10705, -2456, -5775, -18482, 1857, 16515, 7130, 6670, -12830, -15893, 7098, 7913, 14061, 5212, -18626, -7036, -164, 8299, 19846, -3731, -11587, -6989, -6193, 16994, 13983, -4301, -5037, -15322, -825, 18653, 6677, 4453, -9517, -17341, 6726, 9927, 10841, 6943, -17264, -9286, 2951, 6713, 18425, -1196, -14727, -5202, -5427, 13243, 15710, -5489, -6354, -12689, -4120, 18200, 7191, 687, -7528, -18025, 4051, 11677, 7254, 6479, -15148, -12207, 4578, 5346, 15489, 1354, -16235]
763a6235J0626K336J3281O661k2258l245j182L742K2649p758j1475l243j1881
776a7982J8491J2091q072n37j7950k049J9861J402N762q700k0447R971O350P925
790F116R803k0769p385L922R84K0875l027j5721j441r296J3153J6682r660k182
804B054j2804o511K0958K937J371l599k0600O494J0715L831J0541j7014j1976
817a3603P510J76J6986J923j8672r47o117Q177J8910r317n749p566q972J9337
831B076O419l146r36j9194K523J5023J114R372j2500j5528Q743K414J1639O774
845A4793j9299l140j337L543J9614o321r525l687r910J5721J0882o296l50j5977
859a1289j973J7555J109N666p445j8098Q078N604P407Q498j7866o765K931J151
$$ y = [-16235, -5609, -3273, 10008, 16669, -5589, -8834, -10016, -6274, 16375, 8617, -2858, -6101, -17982, 509, 12600, 4528, 3991, -13959, -16008, 3853, 5255, 11017, 2317, -18130, -8159, -1809, 6116, 15919, -4850, -12235, -8313, -7329, 13546, 10519, -5202, -6643, -15939, -2786, 13896, 4236, 2054, -10750, -17261, 3697, 6634, 8005, 4406, -16194, -9700, 1015, 4846, 15387, -1627, -13603, -6093, -5917, 11069, 12992, -5680, -6627, -12744, -4567, 14343, 5026, -723, -8289, -17261, 2076, 8495, 5349, 4413, -14781, -12258, 2765, 3879, 13251, 751, -14777, -6034, -3620, 8019, 14793, -4506, -7646, -8983, -5440, 14174, 7853, -1672, -5359, -15269, 452, 11334, 5038, 4688, -11289, -13262, 4293, 5402, 11068, 3623, -14475, -6397, -793, 6614, 15112, -2754, -9519, -6588, -5437]
873e437J7913k598j3750j227q781J1722J4070p949j898j1517n638J8128L323J055
887G416l423j8262N987R571L769R143j4714j0264O132J011J4569J860j5818j584
901d607m963P131J6822p625n099p215p817J6557O392k434j812j6591K289J2538
915C566J716P389j0848j3481P044J883J0592N225j6913l307j236L266J6772n579
929F089q653l891q370J3738R593n883r65j3760j457J4662J857N041o832j5314
943a4145P174M663O972P350j5288o014K774J221J5426j733j1547j801o886R958
957a876J2483o359k054r870m769J5637K940J391l054j6118M548Q414L435Q176
971A2924j3306r161N033Q15J2589J388j3795j816m706O484J4470o615m326o353
$$ y = [-5437, 12476, 9878, -3872, -5099, -13880, -2158, 11912, 3963, 2065, -9452, -15090, 3038, 6361, 7416, 3993, -14269, -8282, 1289, 5058, 14201, -513, -10777, -4645, -3634, 10935, 12795, -3023, -4607, -9570, -2439, 14383, 6758, 1659, -5556, -13373, 3184, 9576, 7142, 5330, -11261, -8972, 3566, 5282, 12671, 1823, -11658, -4614, -2731, 7861, 13086, -3827, -7134, -8370, -5104, 11668, 6089, -2564, -6455, -14825, -1087, 8506, 2623, 1658, -12102, -13559, 1103, 2960, 8001, 1169, -14145, -6971, -2308, 4664, 12014, -3274, -9288, -6514, -5293, 10133, 8400, -3147, -4948, -11834, -1876, 10607, 4248, 2194, -7676, -12445, 3192, 6132, 7523, 4469, -11649, -7101, 1313, 4748, 12924, -382, -9543, -4510, -3695, 8894, 10282, -3513, -5329, -10035, -3551, 10919, 4304, -22, -6375]
985f375p188J4499N882k509j006j4761J865J1009J759O806r421j1924O207K196
999b961R533M697j4426l272r39L571J4541l948p843l523o862J1473Q782m350p52
1014C721j2101j544J2931J608M197n586j3944O079M543N695O513j3501n427J658
1028e158J328J3806j611j0302j723o427Q934J0858n483j658r221m577J4143K609
1042E518J385k870j4008M094P268L327O631j1113q138M025L88J2195J512j2169
1056a955j723l925N441J2744n372l934n878n693J2286N485j925r30j3270J429
1070g220R533J844N643p939j0827N069J839Q605L876j2607k958j379K835J3203
1084I517l769o258l480o602J1063P000l458o06j1040j716J1542J442M050n154
$$ y = [-6375, -13563, 936, 6818, 4309, 3303, -11458, -9593, 1416, 3175, 9981, 560, -11364, -5157, -2961, 6572, 11269, -3157, -6429, -7368, -3797, 10744, 6796, -1047, -4570, -11432, 41, 8823, 4473, 3721, -8380, -9924, 3007, 4615, 8812, 3226, -10718, -4639, -96, 5599, 12112, -1389, -6816, -5158, -3830, 9976, 8365, -1937, -3660, -10087, -1153, 9705, 4222, 2564, -6657, -11234, 2909, 5518, 6903, 4033, -9975, -5881, 1387, 4714, 11345, 232, -7906, -3881, -3493, 8702, 10214, -1955, -3678, -7603, -2162, 10582, 5210, 1276, -4602, -10295, 1991, 7476, 5551, 4621, -8649, -7220, 2313, 4157, 9800, 1861, -8966, -3897, -2058, 6547, 10423, -2184, -5142, -6521, -3686, 9517, 5748, -510, -3990, -10592, 471, 7471, 4013, 3407, -7633, -9349, 2193, 3635, 7685, 2531]
1098B531j2327M675L990N258O097j1975m668J279J221J2154j175r182j531n765
1112i418Q095R678m635j398q400l687J1633K615J383k629j2678L643N804L744
1126C750N970j0229o832L388L80J0384J573j0559j273m262N352J1526m800l323
1140A045n239n825J1337M683j376j080j1638Q48Q840J610N183p517r269M446J651
1155b301P562L503j0650l180r89K981J1522l070n964l056n253Q893P266l491l77
1170C396j0085j166R834J523M188n065j0902M571L127N472M981j0738l873J046
1184c691J010J0886p13p741j822n236O923R063m090j995o866l758J0342K337J542
1199F191k877j0900K757N232K828N714r140o169K816O98R173J419r446j239l659
$$ y = [2531, -9796, -5121, -1131, 4127, 10224, -1751, -6419, -5140, -3919, 8235, 7060, -2122, -3653, -9418, -1323, 8355, 3720, 2322, -6078, -9765, 1868, 4483, 5866, 3237, -9441, -5798, 6, 3750, 9720, -509, -7341, -3953, -3573, 6811, 8384, -2175, -3448, -7710, -2358, 9168, 4368, 1045, -4194, -10019, 1318, 6001, 4625, 3545, -8093, -7245, 1595, 3205, 8388, 871, -8398, -3952, -2301, 5261, 8764, -1886, -5066, -6055, -3074, 8448, 5378, -586, -3642, -8895, -2, 7264, 3773, 3396, -6689, -7855, 1979, 3502, 7690, 2625, -8277, -3706, -579, 4893, 9874, -864, -4737, -3691, -2681, 8205, 7492, -249, -2071, -7307, -384, 8679, 4589, 2594, -4272, -8030, 2312, 4649, 6191, 3314, -7586, -4829, 403, 3231, 8945, -195, -6364, -3548, -2850, 6323, 7742, -1704, -2943, -6602]
1214f602M547J0263l991k707n096m641R758L858q43p57j0414Q31P236J978M740
1229H160o704q018L645J117P255L504j0112k143j306K326J0627k800m741k890
1243b080n615Q470N464k250p30q594j617Q652J365L307m671r114L367K556M923
1258C433M178r030m053Q27J042R886r55o701j559m850O657P529l188j327o499
1273d610k801Q766K604Q13k091r578K352M501K993M829p873n136J744Q76Q584
1288E973Q07p608j451l181M113Q887l325k852m431m550Q495M004r49j027q927
1303f022L79O272J697L957n930p066K931J194O247K727q456k111j160K388R082
1318F129k150m171k709m503P212N284j937p87p544r02O881J897K917l713q465
$$ y = [-6602, -2055, 8208, 4217, 1510, -3586, -8227, 1531, 5389, 4546, 3789, -6625, -5794, 1442, 3420, 8160, 1456, -6562, -2917, -1800, 5455, 8959, -1153, -3296, -4602, -2276, 8351, 5551, 810, -2080, -7695, 775, 6239, 3989, 3259, -5335, -6952, 1700, 3065, 6372, 1701, -7413, -4046, -1490, 3433, 7611, -1419, -5472, -4645, -3603, 6283, 5328, -1373, -2932, -7782, -1125, 6404, 3216, 1889, -4610, -7411, 1355, 3959, 4772, 2681, -6897, -4545, -44, 2949, 7778, -95, -5231, -3487, -2611, 5973, 6780, -828, -2279, -5460, -1347, 7540, 4215, 1363, -3068, -7618, 877, 4881, 3932, 2905, -6022, -5643, 629, 2326, 6283, 353, -6713, -3782, -2588, 3659, 6386, -2070, -4181, -5341, -2953, 6129, 3979, -192, -2901, -7404, -192, 5092, 3155, 2368, -5176, -6078, 803, 2700, 5617, 1904, -6561]
1333f561K805K790M351M056q135l252M21R70Q622k93n553k097l787N600O665k876
1349C726j012n896k601P324K292J448k417q639J831M203K538M376p017m839J670
1364c013P17P298J205p073j839k547L478Q191k930k156m134l620P138L571n72
1379C714j065p790N07N325J723L679n213o389K720R30N318K693p061k035j531
1394d475K275P904j537l583k880l857O480M275j492r00o769j226O679J700K387
1409D981l642o879K410J816M193L171o774l408N92J113P514o05m962j983l115
1424e578M906N871k034j412n559j987O652J504J838k355p238J301L717K727L313
1439E666n991m424J519O15O781Q03o125r66l038L399O889k295j993l922k964O590
$$ y = [-6561, -3756, -966, 3385, 7441, -694, -3946, -3525, -2555, 6067, 5774, 221, -1876, -5663, -63, 6602, 3726, 2714, -3182, -5783, 1541, 3833, 5281, 2864, -5775, -3944, 259, 2797, 7173, 156, -4683, -3013, -2296, 5002, 6207, -866, -2705, -5252, -1774, 6417, 3487, 1331, -2803, -6423, 715, 4286, 3714, 2649, -5141, -4634, 691, 2414, 6093, 880, -5509, -2789, -1859, 3459, 6152, -909, -2944, -4475, -2200, 5704, 4167, 584, -2296, -6153, 327, 4602, 3110, 2210, -4559, -5785, 894, 2594, 4981, 1339, -5540, -3130, -1314, 2879, 6050, -724, -4132, -3540, -2427, 5087, 4482, -480, -2463, -5578, -672, 5199, 3165, 1753, -3806, -5793, 859, 2363, 4201, 1846, -5392, -4091, -374, 2353, 5666, -325, -4749, -3230, -2615, 4166, 4969, -1156, -2122, -5160, -1761, 5128, 2833, 840, -3082, -6046, 544]
1455E44K986l08j168p281N23M736J910L113m630n557J943J130N206K175o410j629
1471b717j531K276O881j791k878k708l092N270M312j153r53o107q15N678J512
1486B184K067l069o224K012K055L625K950o184k915O53O92O622k82m273j666l471
1502e224M600N405j912r82m877j923N764K047J232j786o956J517K991K488L063
1517E447n100m372J415P63N900Q67n662j170k344L198N825k112j512l474k980
1532e311N603K741J25j143o212P8M501J347K893l959m588J133J310M623J925n765
1548f99j709j086J796O382j240k635k450l333N073L621q70o54n637k44M583J044
1564A942K513k994n477J694J531L300K727n540k629J09Q54O053l01l923j681l140
$$ y = [544, 3530, 3222, 2054, -5227, -4704, 32, 1942, 5055, 425, -5132, -3189, -2059, 3147, 5322, -1088, -2717, -4248, -1972, 4909, 3118, 240, -2468, -5560, -290, 4022, 2869, 1916, -4191, -5006, 672, 2184, 4251, 1182, -5042, -3030, -975, 2650, 5600, -584, -3499, -2846, -2154, 4468, 4186, -87, -1753, -5224, -624, 4781, 2869, 1887, -2990, -4913, 851, 2898, 4130, 2344, -4612, -3095, -104, 2384, 5447, 347, -4025, -2610, -1847, 4053, 4920, -742, -1912, -4256, -1058, 4767, 2655, 1143, -2331, -5311, 292, 3033, 3158, 2015, -4197, -4119, 382, 1729, 4622, 663, -3925, -2792, -1482, 3141, 5066, -699, -2408, -3494, -1698, 4684, 3444, 809, -1641, -4974, 99, 3720, 2850, 2196, -3441, -3685, 898, 1942, 4455, 1461, -4016, -2322, -791, 2509, 5236, -304, -2933, -2824, -1970, 4083, 3782, -141, -1822, -4962]
1580d962L900M987j771j006m479j494N302J790P51j377o043J330K241K369L144
1595D682m701l199N43M28N558M92m300j152k332K781N406j714j264l211k333N021
1611G05K025K27j042n684L65L754J501K567l493m569J467P79M272J228m791j297
1627a986j302J371N877j302k376k252k851M513L368o77q82m800l56L991J014K317
1643C667k712m629J005J770K799K709m773k321K78J009M911l43l223j256k743
1658c852L458M181j306p69m002j652M546J791J041j216n305N67K469K199K426
1673D576m033l446J006M26M794N86m156j112j630J990M821j547j203k994k270
1688d192M529J972L58j054m666K48K973J577K294l293l948J415O95L744J392m238
$$ y = [-4962, -1062, 3925, 2154, 1148, -3331, -4825, 477, 2267, 3018, 1641, -4402, -3072, -831, 1538, 4682, -19, -3218, -2675, -2247, 3311, 3803, -497, -1649, -3981, -1200, 4206, 2492, 1228, -1983, -4316, 705, 2730, 2957, 1915, -3769, -3404, 350, 1851, 4418, 925, -3644, -2177, -1398, 2874, 4102, -689, -1986, -3288, -1917, 3960, 2658, 282, -1970, -4821, -308, 3060, 2383, 1501, -3299, -3655, 336, 1350, 3667, 955, -3674, -2669, -899, 1900, 4609, -164, -2485, -2207, -1198, 3713, 3370, 147, -1109, -3852, -394, 3787, 2481, 1712, -2290, -3942, 604, 2395, 3436, 2220, -3085, -2518, -49, 2150, 4576, 543, -2903, -1897, -1471, 3323, 3909, -247, -1359, -2989, -999, 3822, 2275, 1072, -1922, -4192, 337, 2309, 2667, 1613, -3053, -2805, 168, 1745, 4039, 746, -3202, -1787, -1092, 2652, 4044, -194]
1704a94j503j485J870M798o73k162j893k296L617K921m95r20m210o79L755J182
1720A633J476j882m416J082J369K807K102m239j865p43J005M653P7k797j567k080
1736c385K638L656r47p35l210j773L965J655R91j493m445R09J817K008K130l226
1752E55k949J96J025L813L32l072j086j808K049M018q18j493k293k441L921K136
1768B085M58j092m203Q8K620J317J759k504l105M32P70L287J465l707j364r14
1784b608R03M211n71j793j578k479L436K496j96o31l565q26L284J748J225j892
1800A164m096J192R10K530K027l706j821l16O60M152k1k300j405k014K545L066
1816B567m33n46l400j314L272J430J324j433l870M38J552J978J981l100k308j39
$$ y = [-194, -1697, -3182, -1312, 3486, 2813, 651, -1242, -3538, 79, 3000, 2505, 1585, -2625, -3304, 451, 1633, 3109, 1227, -3189, -2107, -738, 2069, 4171, -68, -1933, -2676, -1671, 2982, 3059, 262, -1305, -3385, -747, 2909, 1962, 1227, -1983, -3756, 209, 1864, 2855, 1362, -3083, -2174, -357, 1651, 3781, 555, -2394, -2198, -1173, 2640, 2972, -100, -1186, -2994, -945, 3073, 2255, 762, -1531, -3972, -51, 2085, 2543, 1451, -2752, -2664, -44, 1273, 3032, 528, -2577, -2145, -1375, 1912, 3377, -330, -1694, -2608, -1705, 2506, 1935, 142, -1436, -3915, -479, 2017, 1821, 1190, -2375, -3201, 83, 1831, 3056, 1164, -2932, -1740, -830, 1700, 3727, 21, -1800, -2116, -1456, 2696, 2675, 375, -1030, -3044, -499, 2567, 2134, 1588, -1812, -3126, 146, 1576, 2900, 1467, -2403, -1965, -413, 1565, 3546, 446, -1862, -2001]
1832b001N45L636O91k879j358j367J647L518o20r37k274j906L183J679L98n01
1848A454l722j79K358J110J952k008l309O61N55L046J119l018j226r55R85L619
1864B442k38j803j365k054K645K644l81l32l257j077K792J356J264j378l797R22
1880a617P03K215K166l413j515l27Q14L234j95j979j114j782K164K836k73p29
1896A188k342j387K678J150Q78q06l637L9J694J521J638k377k412L38M29L066
1912A658Q32k361j247j717J484L200l98p06k236j534K273K120L68n31l405K7J709
1929d64J183J764k000k989R47L33K549J374k719j284r53R91L230K95j881j473
1945a097j550K425J984j42n71l260m24K590J019J179j180k948K32O69K240J460
$$ y = [-2001, -1456, 2180, 2871, -8, -1366, -2733, -1086, 2432, 1812, 875, -1399, -3305, -122, 1557, 1955, 1454, -2268, -2447, -89, 1021, 2973, 965, -2344, -1683, -1128, 1918, 3037, 19, -1207, -2162, -1177, 2442, 2204, 401, -964, -3018, -373, 2271, 1890, 1558, -1699, -2776, 16, 1372, 2636, 1258, -2539, -1617, -914, 1301, 3467, 54, -1461, -1788, -974, 2260, 2065, 86, -1028, -2810, -646, 2190, 1917, 1188, -1154, -2541, 137, 1287, 2165, 1359, -2278, -2239, -545, 976, 2614, 237, -2175, -1837, -1408, 1658, 2490, 129, -1118, -2835, -1351, 1849, 1451, 745, -1491, -3025, -752, 1368, 1736, 1205, -2200, -2173, -464, 719, 2483, 483, -2506, -1559, -1226, 1323, 2697, -22, -1306, -2259, -1268, 1962, 2257, 376, -1097, -2647, -222, 1762, 1620, 1049, -2211, -2635, -45, 974, 2153, 973, -1975, -1743, -1074, 1166, 2626]
1961B626k365j633o38P39K904L96j665j617j013J237K823l09m16k897r89K719
1977i8J468N99j006l002J99J397J527J445j935k036j8Q7L140Q14k312j219j487
1994b437J669K641r2r80j756j626K521J617M58r57l005k62K123P26J545j577k476
2011a868M72K41K390J063k361j171n70P40K944n7j317j361j590J826J805L03n63
$$ y = [2626, 261, -1372, -2010, -1271, 1633, 2029, 364, -1253, -2266, -1029, 1794, 1485, 1069, -1828, -2817, -98, 1370, 1969, 963, -2039, -1840, -443, 1084, 2529, 594, -1442, -1460, -1373, 1767, 2581, 269, -950, -2437, -768, 1873, 1781, 801, -955, -2581, -60, 1557, 2015, 1058, -1947, -2209, -86, 640, 2185, 608, -1868, -1396, -1155, 1235, 2298, -63, -1234, -1804, -1064, 1880, 1823, 506, -855, -2445, -619, 1186, 1489, 926]
$$ [...]
8191B4
##END NTUPLES=NMR FID
##END=
