##TITLE=1H_SA_55.229
 DMSO-d6, 108 sc, 
 2.9.2020
##JCAMPDX= 6.0         $$ Bruker NMR JCAMP-DX V2.0
##DATA TYPE= NMR FID
##DATA CLASS= NTUPLES
##ORIGIN= UXNMR, Bruker Analytische Messtechnik GmbH
##OWNER= root
$$ XWIN-NMR		Version 3.5
$$ Wed Sep  2 09:43:50 2020 Russian Standard Time (UT+4h)  she@DPX200
##.OBSERVE FREQUENCY= 200.1315066352
##.OBSERVE NUCLEUS= ^1H
##.DELAY= (6, 6)
##.ACQUISITION MODE= SIMULTANEOUS
##.ACQUISITION SCHEME= undefined
##.AVERAGES= 108
##.DIGITISER RES= 18
##SPECTROMETER/DATA SYSTEM= spect
##.PULSE SEQUENCE= zg30
##.SOLVENT NAME= DMSO
##.SHIFT REFERENCE= (INTERNAL, DMSO, 0, 15.7039)
##AUDIT TRAIL= $$ (NUMBER, WHEN, WHO, WHERE, WHAT)
$$ ##TITLE= Audit trail, XWIN-NMR		Version 3.5
$$ ##JCAMPDX= 5.01
$$ ##ORIGIN= Bruker BioSpin GmbH
$$ ##OWNER= she
$$ F:/spectra/data/she/nmr/H-F/1/audita.txt
$$ ##AUDIT TRAIL=  $$ (NUMBER, WHEN, WHO, WHERE, WHAT)
(   1,<2020-09-02 09:41:47.89 +0400>,<she>,<DPX200>,
      <continue with go, POWCHK disabled, PULCHK disabled
       configuration hash MD5:
       00 E9 B6 7A A2 85 ED C7 34 08 36 98 17 FE 4E 26
       data hash MD5: 16K
       57 98 90 62 EC 60 E4 6D 20 7E 0C 8B 99 60 AB 1E>)
$$ ##END=
$$ 
$$ hash MD5
$$ 03 64 CE FB B6 A6 D2 06 13 CA 46 34 5C 3C C7 51
##$RELAX= 
##$RELAX= 
##$RELAX= 
##$RELAX= 
##$RELAX= 
##$RELAX= 
$$ Bruker specific parameters
$$ --------------------------
##$DU= <F:/spectra>
##$EXPNO= 1
##$NAME= <H-F>
##$PROCNO= 1
##$TYPE= <nmr>
##$USER= <she>
##$AMP= (0..31)
100 100 100 100 100 100 100 100 100 100 100 100 100 100 100 100 100 100 
100 100 100 100 100 100 100 100 100 100 100 100 100 100 
##$AQSEQ= 0
##$AQ_mod= 1
##$AUNM= <au_zg>
##$AUTOPOS= <>
##$BF1= 200.13
##$BF2= 200.13
##$BF3= 200.13
##$BF4= 200.13
##$BF5= 200.13
##$BF6= 200.13
##$BF7= 200.13
##$BF8= 200.13
##$BYTORDA= 1
##$CFDGTYP= 0
##$CFRGTYP= 5
##$CHEMSTR= <none>
##$CNST= (0..31)
1 1 145 1 1 1 1 1 1 1 1 1 1 1 1 1 1 1 1 1 1 1 1 1 1 1 1 1 1 1 1 1 
##$CPDPRG= <>
##$CPDPRG1= <>
##$CPDPRG2= <>
##$CPDPRG3= <>
##$CPDPRG4= <mlev>
##$CPDPRG5= <mlev>
##$CPDPRG6= <mlev>
##$CPDPRG7= <mlev>
##$CPDPRG8= <mlev>
##$CPDPRGB= <>
##$CPDPRGT= <>
##$D= (0..31)
0 1.2 0 0 0 0 0 0 0 0.06 0 0.03 0 0 0 0 0.0002 0 0 0 0 0 0 0 0 0 0 0 0 
0 0 0 
##$DATE= 1599024920
##$DBL= (0..7)
120 120 120 120 120 120 120 120 
##$DBP= (0..7)
150 150 150 150 150 150 150 150 
##$DBP07= 0
##$DBPNAM0= <>
##$DBPNAM1= <>
##$DBPNAM2= <>
##$DBPNAM3= <>
##$DBPNAM4= <>
##$DBPNAM5= <>
##$DBPNAM6= <>
##$DBPNAM7= <>
##$DBPOAL= (0..7)
0.5 0.5 0.5 0.5 0.5 0.5 0.5 0.5 
##$DBPOFFS= (0..7)
0 0 0 0 0 0 0 0 
##$DE= 6
##$DECBNUC= <off>
##$DECIM= 32
##$DECNUC= <off>
##$DECSTAT= 4
##$DIGMOD= 1
##$DIGTYP= 9
##$DL= (0..7)
0 120 120 120 120 120 120 120 
##$DP= (0..7)
150 150 150 150 150 150 150 150 
##$DP07= 0
##$DPNAME0= <>
##$DPNAME1= <>
##$DPNAME2= <>
##$DPNAME3= <>
##$DPNAME4= <>
##$DPNAME5= <>
##$DPNAME6= <>
##$DPNAME7= <>
##$DPOAL= (0..7)
0.5 0.5 0.5 0.5 0.5 0.5 0.5 0.5 
##$DPOFFS= (0..7)
0 0 0 0 0 0 0 0 
##$DQDMODE= 0
##$DR= 18
##$DS= 0
$$ [...]
##$SUBNAM2= <"">
##$SUBNAM3= <"">
##$SUBNAM4= <"">
##$SUBNAM5= <"">
##$SUBNAM6= <"">
##$SUBNAM7= <"">
##$SUBNAM8= <"">
##$SUBNAM9= <"">
##$SW= 16.880792210976
##$SWIBOX= (0..15)
0 0 2 0 0 0 0 0 0 0 0 0 0 0 0 0 
##$SW_h= 3378.37837837838
##$TD= 16384
##$TD0= 1
##$TE= 0
##$TE2= 300
##$TE3= 300
##$TEG= 300
##$TL= (0..7)
0 120 120 120 120 120 120 120 
##$TP= (0..7)
150 150 150 150 150 150 150 150 
##$TP07= 0
##$TPNAME0= <>
##$TPNAME1= <>
##$TPNAME2= <>
##$TPNAME3= <>
##$TPNAME4= <>
##$TPNAME5= <>
##$TPNAME6= <>
##$TPNAME7= <>
##$TPOAL= (0..7)
0.5 0.5 0.5 0.5 0.5 0.5 0.5 0.5 
##$TPOFFS= (0..7)
0 0 0 0 0 0 0 0 
##$TUNHIN= 0
##$TUNHOUT= 0
##$TUNXOUT= 0
##$USERA1= <user>
##$USERA2= <user>
##$USERA3= <user>
##$USERA4= <user>
##$USERA5= <user>
##$V9= 5
##$VALIST= <valist>
##$VCLIST= <CCCCCCCCCCCCCCC>
##$VD= 0
##$VDLIST= <DDDDDDDDDDDDDDD>
##$VPLIST= <PPPPPPPPPPPPPPP>
##$VTLIST= <TTTTTTTTTTTTTTT>
##$WBST= 1024
##$WBSW= 4
##$XGAIN= (0..3)
0 0 0 0 
##$XL= 0
##$YL= 0
##$YMAX_a= 1526087
##$YMIN_a= -1630847
##$ZGOPTNS= <>
##$ZL1= 120
##$ZL2= 120
##$ZL3= 120
##$ZL4= 120
##$ABSF1= 10
##$ABSF2= 0
##$ABSG= 5
##$ABSL= 3
##$ALPHA= 0
##$AQORDER= 0
##$ASSFAC= 0
##$ASSFACI= 0
##$ASSFACX= 0
##$ASSWID= 0
##$AUNMP= <proc_1d>
##$AZFE= 0.1
##$AZFW= 0.1
##$BCFW= 1
##$BC_mod= 2
##$BYTORDP= 1
##$COROFFS= 0
##$CY= 11.3945322036743
##$DATMOD= 1
##$DC= 2
##$DFILT= <>
##$DTYPP= 0
##$F1P= 16.9975609425685
##$F2P= -3.02152046262296
##$FCOR= 0.5
##$FTSIZE= 0
##$FT_mod= 4
##$GAMMA= 1
##$GB= 0.15
##$INTBC= 1
##$INTSCL= 1
##$ISEN= 128
##$LB= 0.24
##$LEV0= 0
##$LPBIN= 0
##$MAXI= 10000
##$MC2= 0
##$MEAN= 0
##$ME_mod= 0
##$MI= 1.114404
##$NCOEF= 0
##$NC_proc= 0
##$NLEV= 6
##$NOISF1= 3.799351
##$NOISF2= 2.8
##$NSP= 1
##$NTH_PI= 0
##$NZP= 0
##$OFFSET= 15.70392
##$PC= 1
##$PHC0= -9978.608
##$PHC1= 16.0009
##$PH_mod= 1
##$PKNL= yes
##$PPARMOD= 0
##$PSCAL= 0
##$PSIGN= 0
##$REVERSE= no
##$SF= 200.130013532006
##$SI= 16384
##$SIGF1= 3
##$SIGF2= 2
##$SINO= 400
##$SIOLD= 16384
##$SREGLST= <1H.CDCl3>
##$SSB= 0
##$STSI= 0
##$STSR= 0
##$SW_p= 3612.71676300578
##$SYMM= 0
##$S_DEV= 0
##$TDeff= 0
##$TDoff= 0
##$TI= <>
##$TILT= no
##$TM1= 0
##$TM2= 0
##$TOPLEV= 0
##$USERP1= <user>
##$USERP2= <user>
##$USERP3= <user>
##$USERP4= <user>
##$USERP5= <user>
##$WDW= 1
##$XDIM= 8192
##$YMAX_p= 0
##$YMIN_p= 0
$$ End of Bruker specific parameters
$$ ---------------------------------
##NTUPLES= NMR FID
##VAR_NAME=  TIME,          FID/REAL,        FID/IMAG
##SYMBOL=    X,             R,               I
##VAR_TYPE=  INDEPENDENT,   DEPENDENT,       DEPENDENT
##VAR_FORM=  AFFN,          ASDF,            ASDF
##VAR_DIM=   8192,          8192,            8192
##UNITS=     SECONDS,       ARBITRARY UNITS, ARBITRARY UNITS
##FACTOR=    0.000296,      1,               1
##FIRST=     0,             0,               0
##LAST=      2.424536,      0,               0
##MIN=       0,             -1630847,        0
##MAX=       2.424536,      1526087,         0
$$ Real data points
##PAGE= N=1
##DATA TABLE= (X++(R..R)), XYDATA
0 0 0 0 0 0 0 0 0 0 0 0 0 0 0 0 0 0 0 0 108 -108 108 -108 108 -115 216 -216 216 -314 324 -353 432 -501 544
33 544 -643 724 -810 904 -1013 1144 -1278 1423 -1581 1762 -1956 2159 -2383 2642 -2920 3205
49 3205 -3532 3898 -4290 4724 -5211 5752 -6355 7035 -7817 8708 -9742 10962 -12424
62 -12424 14224 -16484 19414 -23399 29079 -37833 52732 -163204 1435487 799235 -1573238
73 -1573238 -658263 1283064 648263 -1151594 -707338 862532 852215 -726664 -1048464
82 -1048464 603248 1266100 -620114 -1411477 660888 1489092 -744131 -1456950 771306
91 771306 1368030 -739224 -1226283 614674 1120783 -414196 -1057368 182281 1094091
100 1094091 39351 -1178734 -191876 1325097 285142 -1429633 -262155 1526087 233915
109 233915 -1480515 -143205 1409563 152488 -1225748 -180705 1069058 320038 -907056
118 -907056 -495367 829753 704493 -812868 -870142 876180 987707 -939357 -1000898 1007864
128 1007864 971236 -994990 -876946 930255 806252 -773898 -760089 593410 795217
137 795217 -395283 -878155 249813 1016185 -152516 -1146337 135685 1250204 -164426
146 -164426 -1284826 208159 1247583 -231736 -1152054 201564 1028680 -107671 -913672
155 -913672 -41971 842177 221803 -831193 -394034 875369 518971 -954828 -584163
164 -584163 1025069 580493 -1062157 -536262 1035699 481211 -942711 -448416 804763
173 804763 472306 -647586 -548146 513949 669146 -423827 -807591 390361 925662
182 925662 -409308 -997819 448154 1005659 -479544 -962621 470349 882323 -412193
191 -412193 -802342 295824 744601 -149065 -738890 -5849 777317 129432 -853408 -211855
201 -211855 931726 235780 -994268 -223443 1003921 182470 -965891 -163182 869540
210 869540 171143 -760057 -237193 644815 336648 -569103 -469882 530978 589809 -545708
220 -545708 -684792 581022 724521 -621389 -719196 633499 676182 -605120 -621781 526719
230 526719 579677 -411497 -576456 280592 613748 -167035 -686092 83038 768864 -45165
240 -45165 -842381 43380 885417 -64219 -880422 84375 832823 -78009 -754856 34969
250 34969 676766 50850 -612487 -160043 582263 277122 -588869 -375226 625911 436897
260 436897 -671725 -456124 698047 441675 -696474 -412043 649880 382358 -569851
269 -569851 -382838 467307 416995 -369155 -483442 293689 565388 -252159 -647196 240911
279 240911 705980 -256300 -729804 273414 714489 -275038 -671137 244288 617729 -181050
289 -181050 -574853 90964 551476 8333 -560194 -102348 594157 170232 -641644 -207064
299 -207064 679905 212892 -696179 -200454 679872 186588 -631409 -189464 559441 218153
309 218153 -484318 -275447 419807 350682 -381809 -432214 368329 498959 -379163 -542849
319 -542849 394584 550645 -403166 -535309 386700 504204 -344929 -479023 275467 464919
329 464919 -193721 -476341 111228 510471 -44679 -558257 2599 600982 13610 -631214
339 -631214 -15628 636327 10210 -616171 -16666 571226 38571 -520718 -87941 472690
349 472690 151553 -442967 -225155 430747 294109 -438421 -344785 455258 370086 -469093
359 -469093 -375438 464077 364318 -441866 -353485 393021 349480 -332651 -363358 265182 394346
370 394346 -207797 -441822 165259 488050 -143737 -526847 135593 545972 -135084 -547119
380 -547119 127730 525752 -109380 -497420 71323 467115 -18703 -446241 -43332 439749
390 439749 105159 -448911 -157780 465195 193081 -481358 -209864 487613 216932 -477331
400 -477331 -216822 453056 223156 -410577 -238256 361559 267672 -316158 -310997 280579
410 280579 356537 -258939 -397674 248960 428817 -243363 -442892 239434 443221 -225957
420 -225957 -431148 197141 417005 -155247 -409047 104744 407604 -52180 -419379 3714
430 3714 436043 32590 -456816 -59082 467986 71537 -472737 -84627 460721 93140
440 93140 -439900 -111841 408623 139863 -375828 -176958 351297 221212 -333315 -260641
450 -260641 323896 295334 -319594 -320268 315515 333760 -306853 -335456 289292 336443 -258656
461 -258656 -338272 220863 344552 -178716 -359325 138422 377896 -103120 -400288 77478
471 77478 418966 -58692 -430185 43305 432709 -28835 -426579 10396 410605 14591
481 14591 -394227 -49573 378961 85851 -369692 -125265 362471 158316 -360499 -186792
491 -186792 359425 209699 -356479 -223977 345250 234390 -325789 -244928 300545 258845
501 258845 -270259 -276151 240669 297514 -212429 -321175 189040 341767 -170359 -361348
511 -361348 151867 372445 -137647 -377018 119313 376544 -96323 -370809 69167 368251
521 368251 -36002 -363595 4439 365767 28346 -367168 -58038 371086 83434 -371420
531 -371420 -102955 368719 120279 -358582 -136439 346325 155811 -326867 -174611 309053
541 309053 198936 -286870 -221617 271055 246963 -253433 -267726 242364 287243 -226845 -299259
552 -299259 211187 308824 -192858 -315862 168608 320287 -145420 -326872 118034 334678
562 334678 -89014 -340735 63329 349355 -38753 -354662 16074 358347 2823 -357581
572 -357581 -23462 354173 44376 -346524 -65643 338414 89717 -327304 -113084 317283
582 317283 138766 -308175 -160543 298148 183211 -287640 -201527 276842 217728 -262297
592 -262297 -232414 247239 245603 -228437 -257482 208766 270706 -187109 -282649 164930 294743
603 294743 -144236 -306677 123182 315701 -104640 -321586 84677 327792 -62936 -329205
613 -329205 42382 329326 -21544 -327389 -3490 324904 24855 -324416 -49366 319097
623 319097 70675 -316192 -91063 309546 111429 -302683 -130546 292890 148488 -282352
633 -282352 -165034 268865 181604 -255732 -198337 241269 214384 -224641 -230693 208691 244551
644 244551 -193205 -256157 175608 267758 -156598 -276878 140242 285439 -120875 -291579
654 -291579 100227 296381 -79738 -301327 58600 304630 -38072 -306862 17793 306676
664 306676 3086 -306081 -23253 302989 43181 -300268 -61952 295041 80919 -288726
674 -288726 -99597 280894 118135 -271282 -135869 262092 152962 -251147 -169215 239259
684 239259 185212 -226963 -199524 211638 212151 -197213 -224117 182146 236671 -165170 -245952
695 -245952 148171 255067 -131151 -263655 113862 269462 -95214 -274701 76494 279211
705 279211 -57331 -282738 40514 283421 -20007 -284853 1483 283519 17146 -281423
715 -281423 -36185 278946 54548 -274066 -71532 268077 89792 -261026 -106400 253305
725 253305 123134 -243504 -138601 234558 153679 -223468 -166821 210769 181423 -198135
735 -198135 -193455 185319 204026 -171314 -215500 156659 225330 -141558 -233397 125475 240955
746 240955 -108735 -246733 92390 252402 -75446 -257343 58952 259243 -41749 -260818
756 -260818 23165 261566 -6192 -261518 -10494 259773 28230 -256915 -44950 254410
766 254410 61305 -248180 -78046 242348 94318 -235490 -108266 226506 121797 -217426
776 -217426 -136853 207583 150625 -196192 -163092 186530 174638 -173384 -184739 161475 195743
787 195743 -147393 -203503 134613 212080 -119269 -217813 103904 224710 -88719 -230292
797 -230292 73314 234386 -56968 -237709 42388 239927 -26015 -240290 10457 240031
807 240031 5302 -237582 -19819 235139 35368 -232142 -52286 227843 67385 -221589
817 -221589 -82316 216565 96226 -209975 -110479 202669 122113 -194164 -133113 184756
827 184756 144008 -173514 -154615 161468 165377 -149468 -174012 136316 183802 -124058 -192487
838 -192487 111333 198752 -99597 -204700 86155 209734 -72472 -212729 58711 214851
848 214851 -44768 -215374 28036 216099 -13054 -216561 -1534 216342 16859 -215457
858 -215457 -30686 213525 43654 -209952 -56757 205579 69737 -199449 -81133 190794
868 190794 93533 -183869 -105351 174733 118585 -166322 -130086 158471 140269 -148075 -149457
879 -149457 139159 159089 -129028 -164128 119813 171462 -105909 -175970 93511 181687 -79355
890 -79355 -185831 65353 190168 -52037 -194622 39510 196374 -25774 -198823 13724
900 13724 199181 -2236 -197503 -9308 194705 22444 -191261 -35341 186450 48508
910 48508 -182761 -61452 177376 74508 -173313 -86546 167452 96669 -161720 -105275 155639
921 155639 113644 -146473 -122026 137924 130203 -127064 -137949 116345 146097 -104489 -152872
932 -152872 94046 160074 -82140 -166392 72503 171240 -62645 -173810 51980 174541
942 174541 -41291 -176213 28927 176353 -15914 -175018 2352 174950 10365 -174229
952 -174229 -23674 174203 34008 -171981 -44377 170275 54832 -165259 -64190 159141
962 159141 72889 -151830 -82470 143893 92308 -136123 -102262 128721 111829 -120346 -120566
973 -120566 113857 128248 -105830 -134999 97946 138763 -89879 -143317 80275 146908 -68110
984 -68110 -149351 56407 152805 -44406 -155813 32552 158404 -20997 -161104 12608
994 12608 162588 -2323 -161732 -7001 160598 16607 -158377 -26876 153871 37007
1004 37007 -149496 -48184 144882 58447 -140193 -69874 135782 79266 -130826 -87444 126686
1015 126686 95513 -120140 -101883 114026 107697 -105321 -112291 95746 117652 -86274 -123542
1026 -123542 76257 129621 -67169 -133768 57445 139462 -49416 -142503 41516 144910
1036 144910 -32637 -144885 24129 145247 -12618 -144919 2921 143187 8272 -141544
1046 -141544 -18047 141023 29005 -138775 -37771 137789 46825 -134592 -54375 131061
1056 131061 61822 -126248 -68719 120448 76338 -114566 -84094 105414 91292 -98631 -98873
1067 -98873 92067 105952 -85109 -112187 78688 116753 -71741 -120282 63932 122887 -55238
1078 -55238 -124788 46354 127611 -36137 -128718 26860 130348 -17055 -131803 8048
1088 8048 132298 259 -133386 -8643 132958 17841 -130589 -24785 128237 31837
1098 31837 -124176 -40845 120968 49360 -115956 -57347 112802 65488 -108195 -73788 102466
1109 102466 80632 -97785 -86508 92199 91902 -86095 -95791 80238 100122 -71136 -103974
1120 -103974 62732 107817 -56140 -112803 47503 116944 -40064 -119048 31457 121092 -23296
1131 -23296 -122003 16702 122839 -8464 -121681 286 120958 8413 -120200 -15959
1141 -15959 118617 25026 -116190 -33440 113636 41687 -111151 -47839 108870 54725 -104575
1152 -104575 -60600 100020 66758 -95315 -72324 88632 77832 -83033 -83861 77383 89816
1163 89816 -70888 -94592 63930 98519 -58405 -103351 50693 105021 -44105 -107608 37246
1174 37246 109772 -28951 -110270 21360 111607 -14644 -112364 6285 112549 1943 -112601
1185 -112601 -8660 112004 16441 -110383 -23883 108925 30389 -105434 -37738 102655
1195 102655 43468 -100126 -50602 95444 57656 -91051 -63448 86644 69468 -81970 -74321
1206 -74321 77448 79453 -71714 -83085 65946 87607 -59934 -92034 53512 94906 -45478
1217 -45478 -96144 39923 99940 -33513 -102205 26507 103434 -19167 -104294 13781 105060
1228 105060 -5514 -105766 -1457 104991 8299 -104245 -14586 101935 23003 -99728
1238 -99728 -29180 97444 36326 -96029 -41985 92670 47962 -89272 -54032 85157 61043
1249 61043 -80027 -63986 76738 70180 -71847 -73770 66717 77608 -60371 -81696 55749
1260 55749 85022 -49344 -88454 42491 92064 -36338 -94209 30866 95946 -24220 -96965
1271 -96965 17322 97158 -10984 -97557 4498 98555 2612 -97805 -7762 96830 14806
1282 14806 -95694 -21565 93912 26674 -91397 -32927 88588 38309 -85912 -44765 83060
1293 83060 49953 -78601 -56335 74767 60581 -71000 -64921 66531 69942 -61828 -72571
1304 -72571 56509 76475 -51270 -79140 46035 82695 -39731 -84540 34655 87980 -29041
1315 -29041 -88257 22487 90185 -16438 -90451 9991 91197 -4423 -91246 -2654 90831
1326 90831 7542 -89908 -14197 88281 18767 -86263 -25124 84493 30677 -82818 -36249
1337 -36249 80082 41976 -78504 -46698 73682 51735 -72035 -57004 66583 60089 -62790
1348 -62790 -63065 57558 67616 -53001 -70603 48861 74178 -43259 -75969 38124 79923
1359 79923 -32609 -82194 27444 82951 -21967 -84518 16607 85494 -11534 -84471 5743
1370 5743 85025 250 -83398 -6480 83631 12139 -81521 -17844 81294 24007 -80391 -28469
1382 -28469 79119 33443 -75106 -38454 72845 42264 -69366 -47218 65546 51112 -61992
1393 -61992 -55146 57940 59668 -53436 -63230 50000 66987 -45702 -69526 41717 72550
1404 72550 -38182 -73504 32914 74944 -27137 -76243 21704 76537 -14659 -77769 9147
1415 9147 79965 -3004 -80534 -1740 80795 6530 -79823 -9948 78384 14505 -76645 -18774
1427 -18774 74421 24639 -71404 -29820 69558 34415 -66883 -39736 64648 45329 -62108
1438 -62108 -48899 58992 52406 -57365 -54918 52077 57242 -48629 -59124 44507 61839
1449 61839 -37904 -64025 32411 67098 -28133 -69361 23590 73102 -18748 -74416 15458 75408
1461 75408 -11545 -74985 7065 74631 -3651 -72545 -2750 71346 9285 -71055 -15130 70237
1473 70237 20877 -69915 -25803 69159 29463 -67764 -33102 65921 35401 -63412 -38109 59204
1485 59204 41134 -55964 -43868 50384 49277 -45737 -53844 42230 58457 -38724 -61580 37194
1497 37194 64146 -34522 -65453 31434 65030 -27724 -65502 21827 64904 -16484 -64509 8364
1509 8364 66415 -2790 -67536 -1591 69098 5974 -70149 -9690 70473 12351 -69556 -14764
1521 -14764 67975 17532 -64272 -21622 59963 26659 -56719 -31193 53343 38503 -51867 -43198
1533 -43198 50526 47754 -50164 -49412 48332 50763 -45356 -51147 42065 52149 -35816 -52083 29380
1546 29380 54770 -24299 -58312 19213 61370 -14412 -64875 10621 67102 -9512 -67474 8053
1558 8053 66652 -5473 -65652 1066 61925 2898 -59055 -9814 57642 15753 -56701 -21635
1570 -21635 56375 27733 -57952 -30528 58620 33166 -57371 -33645 55211 34148 -50657 -35020
1582 -35020 45786 37870 -40275 -41540 35529 46983 -31064 -51944 28328 55790 -26782 -57564
1594 -57564 26774 59877 -25330 -59046 22143 57148 -18645 -54577 12148 53441 -5997 -54161
1606 -54161 -1320 55787 7354 -58287 -11254 60320 14325 -61478 -13963 62201 14519 -59251
1618 -59251 -15256 54121 18494 -49294 -23853 45994 27700 -41880 -34627 39895 40815 -38778
1630 -38778 -44764 40941 47488 -41284 -47039 38242 46192 -36102 -45053 31593 43685 -23806 -45353
1643 -45353 18265 48145 -11599 -52504 7367 56352 -3905 -59555 4278 60497 -2875 -60179
1655 -60179 2747 56805 -790 -52592 -2654 49478 8379 -46138 -14745 45420 22853 -45381
1667 -45381 -27883 46670 30721 -47656 -32804 48611 32112 -47269 -31682 44567 32247 -39492
1679 -39492 -32332 32436 33733 -26513 -38976 21238 46075 -19541 -50231 18603 54045 -19111
1691 -19111 -55656 19797 52657 -18034 -49223 16298 47314 -10926 -43507 3576 43299 4287
1703 4287 -45572 -9388 48200 14920 -50319 -16497 53632 16650 -53453 -15447 52463 14471
1715 14471 -47539 -16260 42194 19386 -37571 -25416 32201 30989 -29498 -36839 30008 42123
1727 42123 -30199 -43767 32534 44614 -32203 -43417 30376 40125 -27302 -37449 20478 37366
1739 37366 -13037 -38790 6532 43381 -643 -46642 -1049 51722 1271 -53481 -969 52785
1751 52785 -389 -50115 -488 46686 2020 -41924 -6914 38150 14783 -35157 -20917 35748
1763 35748 26649 -36827 -31034 38592 32522 -42032 -31651 41233 29253 -37987 -27800 33698
1775 33698 27563 -26707 -29728 20478 33348 -15816 -38348 12403 43649 -11132 -48211 11822
1787 11822 49836 -14157 -48206 14664 44865 -12064 -41871 8743 37451 -2831 -35923 -5092
1799 -5092 36368 10985 -38507 -16125 42313 18894 -44784 -18520 46517 17511 -45827 -15779
1811 -15779 41991 16036 -35873 -16704 29788 20247 -25763 -26074 21296 32399 -21041 -36967
1823 -36967 21701 40928 -23591 -40174 25729 38404 -25597 -36087 21378 34469 -17041 -31646
1835 -31646 10208 32551 -2427 -35346 -2088 39778 4310 -43648 -6243 45783 4800 -46983
1847 -46983 -3652 45063 2774 -41583 -3818 36096 8445 -32089 -12024 29547 18658 -27755
1859 -27755 -24811 28793 29021 -31233 -31362 33792 30759 -34096 -29395 32415 27107 -28796 -24944 23967
1873 23967 25021 -16945 -28220 10366 32250 -7921 -37099 6516 40950 -6680 -43259 8262
1885 8262 43713 -9538 -41628 8887 37324 -5995 -33583 1487 30382 5046 -28973 -11171
1897 -11171 30589 15668 -34233 -18587 36730 19510 -38269 -18515 38899 16800 -36267 -16077
1909 -16077 32660 16026 -26291 -19250 21080 22937 -17763 -28253 15362 33132 -16043 -36151
1921 -36151 17108 37401 -18281 -36350 18887 33753 -17281 -30464 13216 29742 -7566 -28212
1933 -28212 2117 29377 3420 -32638 -6093 36630 8307 -38369 -8639 39666 5972 -39163
1945 -39163 -5026 36162 6204 -31136 -7011 27793 10939 -24054 -16985 22091 21319 -22093
1957 -22093 -25951 23807 28432 -25897 -29033 26824 28904 -26053 -25285 23820 24607 -19348 -22990 14061
1971 14061 24429 -9570 -27379 5284 31027 -2788 -35553 2714 37603 -2537 -38223 4293
1983 4293 36941 -4478 -32966 3164 30826 300 -26796 -5003 26051 9938 -25914 -14161
1995 -14161 27268 18394 -29419 -19539 31516 19289 -31178 -16761 29551 16080 -26487 -17166
2007 -17166 23129 18136 -18059 -19700 14846 24309 -12880 -28050 11379 32341 -12514 -32420
2019 -32420 12710 32975 -13222 -30981 12259 28893 -10981 -27026 6585 24730 -1914 -26269
2031 -26269 -2877 26801 6556 -29918 -9158 31325 8665 -33177 -8729 32554 7745 -30196
2043 -30196 -8101 27821 9119 -24333 -11578 21656 14462 -19394 -18366 18962 23381 -19090
2055 -19090 -24586 19131 25524 -20950 -25705 21353 23802 -19504 -23089 15197 22426 -11630 -22602
2068 -22602 7303 23570 -4759 -26306 2479 29050 -1181 -31528 723 31987 -767 -32457
2080 -32457 784 30157 -1050 -26807 -1825 24726 4813 -21872 -8594 22251 12531 -23340
2092 -23340 -15320 24073 16786 -25114 -17211 24954 16986 -24306 -17058 22328 17503 -19362 -15944
2105 -15944 16039 17582 -12687 -21003 10884 23576 -9690 -25719 9249 28594 -9277 -28217
2117 -28217 9003 27725 -7649 -25929 6745 25308 -3695 -22886 911 23295 2006 -24217
2129 -24217 -5245 24573 8221 -26246 -8333 27175 9476 -26636 -9632 25831 9475 -23575
2141 -23575 -10632 21905 12133 -18642 -14596 17057 17003 -14880 -19232 16463 22130 -15102 -21820
2154 -21820 15051 22719 -15853 -21700 13790 20835 -12342 -21456 9182 21197 -6832 -21612 3635
2167 3635 22762 -1620 -24924 -520 26261 780 -26427 -1087 25443 1263 -24884 -1778
2179 -1778 23401 4503 -21228 -6161 20350 8847 -20836 -10504 19904 12570 -20387 -15438
2191 -15438 19511 16164 -19358 -16343 20062 15650 -17455 -16328 15872 17580 -14255 -16766 10661
2204 10661 18915 -10073 -20206 7918 22788 -7241 -22827 6735 24004 -5788 -23824 5274
2216 5274 23330 -3911 -21935 1825 21679 223 -21053 -1385 21067 5017 -21164 -6720
2228 -6720 22053 8093 -22768 -8226 21275 9731 -21551 -10006 20105 9739 -18202 -11544
2240 -11544 16697 12888 -15006 -14926 13411 16530 -12696 -17129 12480 19500 -11131 -19423 11037
2253 11037 20402 -10785 -19848 8393 19791 -6505 -19017 5321 18971 -2558 -20082 1175
2265 1175 21200 -720 -21922 -1110 21390 2328 -21977 -3112 22148 3963 -20283 -5044
2277 -5044 19542 6524 -18897 -7886 17343 10954 -16778 -10930 16652 13235 -16268 -14064 15524
2290 15524 14219 -15139 -14904 14881 15799 -12493 -16977 11141 15973 -8878 -18183 7768 18931
2303 18931 -6515 -18959 5276 19896 -5200 -19506 4311 19485 -2801 -19611 1431 18810
2315 18810 363 -19498 -1076 18933 2016 -18878 -4976 18902 5453 -17419 -8476 18084
2327 18084 7715 -18092 -9193 16619 9849 -17208 -11037 15837 11160 -14184 -12238 13355 12782
2340 12782 -11321 -14440 9783 15233 -10101 -15708 9559 17224 -7759 -17109 7286 18534 -6562
2353 -6562 -17551 4288 17150 -3374 -18069 1218 18601 461 -18260 57 18955 1800
2365 1800 -17770 -2016 18239 3665 -18839 -4838 16878 5782 -16703 -5598 15883 7808
2377 7808 -14666 -8485 14416 10246 -13896 -11278 13660 11916 -12630 -12878 11285 13310 -10703
2390 -10703 -13988 10012 14445 -8861 -14312 7733 16017 -6004 -15393 6106 16608 -3897 -16416
2403 -16416 3568 16227 -1931 -16548 1100 16593 -184 -16677 -970 16922 2674 -16477
2415 -16477 -3435 16273 5338 -16652 -5364 15395 7313 -15144 -8519 14787 8089 -13768
2427 -13768 -9354 13732 10083 -12459 -10428 12015 11487 -10384 -12834 10294 13794 -8398 -13616
2440 -13616 8006 13299 -6619 -15057 6271 15396 -6274 -14647 4575 15277 -3282 -15799 1431
2453 1431 15144 -1253 -15661 511 16143 1445 -15241 -2353 15744 3481 -14828 -3657
2465 -3657 14246 4349 -15259 -6752 14932 6240 -14062 -8154 12092 9024 -12233 -9732 10951
2478 10951 9404 -10193 -10922 10462 11136 -9653 -12250 8366 12486 -7884 -12553 6612 13752 -6369
2492 -6369 -13678 4908 13556 -4567 -14874 2270 14142 -2219 -15004 732 14419 524
2504 524 -15093 -829 14707 2219 -13834 -2252 14090 4342 -13423 -3877 13545 5516 -13181
2517 -13181 -6335 13857 7483 -11681 -8210 11786 8290 -10713 -9625 10248 9663 -10389 -10629 8630
2531 8630 10343 -7969 -11462 7880 12266 -6542 -12943 4696 12799 -5186 -13862 3292 13286
2544 13286 -3126 -13403 2251 13051 -1106 -13397 245 13249 1365 -13117 -1948 13709
2556 13709 2145 -13228 -3009 12937 5249 -12402 -5332 11632 5721 -12794 -6819 11353 7533
2569 7533 -10584 -7802 10677 7991 -10094 -9594 8753 9257 -8662 -9984 7505 11428 -6001 -11391
2583 -11391 6398 11008 -5392 -11647 4629 12044 -3757 -12255 3527 12328 -2290 -13145 387
2596 387 12487 -758 -12918 -153 12342 1340 -12567 -1637 12643 3595 -11739 -3791 11352
2609 11352 4216 -11839 -5205 11348 6299 -10501 -5985 10501 7720 -10399 -7587 8701 7882
2622 7882 -8401 -8810 7641 9049 -6289 -10222 7001 10735 -5249 -10341 4125 11126 -3668
2635 -3668 -10469 4374 12301 -3134 -11433 1561 11374 -1187 -11431 1103 11254 297 -11545
2648 -11545 -584 11451 2779 -11616 -2226 11485 3735 -10922 -4276 11192 4440 -10159 -5557
2661 -5557 10407 5848 -8651 -6844 8503 7615 -8321 -8307 8264 8323 -7105 -8688 6347 9698
2675 9698 -6185 -9414 5891 10224 -5584 -9722 3980 10667 -3933 -10669 3322 11352 -3647
2688 -3647 -11049 1475 10370 -491 -10604 -898 10739 829 -11352 -1836 10258 1064 -10295
2701 -10295 -3244 9523 4171 -9883 -4840 9050 5541 -9851 -5410 9204 6957 -8333 -7393
2714 -7393 8250 7256 -7373 -8273 7970 7592 -6740 -9001 6048 8207 -5038 -9054 4941 9482
2728 9482 -3089 -10017 3303 9944 -3154 -10696 1413 10575 -1036 -10635 595 9932 337
2741 337 -10397 -893 9620 973 -10028 -1468 10121 3254 -8875 -2891 9841 3673 -9051
2754 -9051 -4601 9091 5038 -8030 -6031 8032 6773 -7372 -7156 7028 6539 -6831 -7227 5250
2768 5250 7189 -5128 -7810 4847 7708 -4589 -9767 3664 8566 -3035 -9058 2208 9000
2781 9000 -1697 -9146 1203 9754 -719 -9670 88 9137 1145 -9544 -864 9605 2230 -8843
2795 -8843 -2542 8659 2958 -8578 -3330 7955 4089 -8573 -4558 7349 5407 -7185 -6152
2808 -6152 6834 6110 -7045 -6400 7028 7093 -5465 -6928 5640 7906 -4668 -7515 4409 7729
2822 7729 -3448 -8157 2528 8119 -2458 -8756 2489 9042 -655 -9610 -208 9458 434 -9130
2836 -9130 -12 9275 474 -8174 -1095 8508 2155 -8468 -2769 8085 3164 -7984 -3642 6726
2850 6726 3970 -7869 -5053 7572 5043 -7403 -6372 6019 6038 -6730 -6469 4982 6946 -4558
2864 -4558 -6859 5223 7933 -4730 -7432 3766 8102 -2841 -8875 2380 8488 -1333 -8135 1244
2878 1244 8568 -1051 -8815 -371 8695 686 -7458 -1072 8291 1734 -8355 -1184 7732 3101 -7339
2893 -7339 -3001 7999 3677 -7953 -3974 7090 4687 -6548 -4865 6085 5155 -6042 -6200 6686
2907 6686 5479 -5006 -6068 3697 6359 -4155 -7170 3312 6657 -3301 -7048 2325 7628 -136
2921 -136 -7365 1395 6917 -1389 -7744 825 7968 -200 -7577 -39 7811 934 -7245 -1185 7265
2936 7265 2534 -7547 -2147 7582 2129 -6580 -3231 6023 4008 -6545 -4034 5590 5124 -5407
2950 -5407 -5385 5385 5152 -5522 -4800 4071 5661 -4725 -5805 3291 5511 -3362 -6734 2707 5960
2965 5960 -3205 -6691 2368 7301 -2359 -7991 1140 6774 -121 -7360 504 6711 -430 -6933 -214
2980 -214 7032 1242 -7371 -1722 7129 2284 -6571 -2228 6120 2356 -5776 -3323 5840 3689 -5551
2995 -5551 -3798 5426 4413 -6052 -4660 4586 5325 -4318 -4614 4773 5924 -3377 -5385 3422 5869
3010 5869 -3474 -6244 2029 6341 -2061 -5826 736 6380 -693 -7042 441 6773 -205 -6528 -392
3025 -392 6666 813 -7005 -126 7266 1283 -7388 -1949 5834 2344 -6401 -2486 5598 3717 -5228
3040 -5228 -2953 5497 3144 -4122 -3199 4640 4194 -4504 -4194 4530 4880 -4469 -5829 3083 4763 -4004
3056 -4004 -5812 2788 6319 -2872 -6305 2071 6106 -2825 -5817 1221 6445 -635 -6505 -172 6948
3071 6948 -204 -5570 307 6231 1183 -5876 -1738 5876 1494 -6225 -1574 4883 2651 -6101 -2955
3086 -2955 5152 3550 -5659 -3123 4978 2996 -4200 -4199 4383 4051 -3473 -4591 3670 5109 -3349 -4397
3102 -4397 2938 4896 -2812 -5475 2207 5518 -1835 -5613 1600 5844 -1617 -5881 512 5909 -339
3117 -339 -5418 702 5072 674 -5876 -687 5256 601 -5356 -1841 5867 1636 -4811 -1695 5974
3132 5974 1601 -5371 -3278 4598 3827 -4577 -3660 4611 4503 -3484 -3615 4428 4597 -3732 -3599 4111
3148 4111 3774 -2929 -4360 3177 4515 -2356 -4835 1049 4650 -1992 -5235 2480 4981 -1026 -4821
3163 -4821 790 5171 -1038 -5313 -142 5214 -47 -5148 -624 5903 1995 -5224 -1559 5376 1181
3178 1181 -5121 -2893 4883 2678 -4256 -2553 4674 2614 -3893 -3027 4090 3664 -3166 -4802 2784
3193 2784 4809 -2703 -4249 3539 4599 -2347 -4991 2058 5355 -2331 -5112 2027 4206 -463 -4840
3208 -4840 928 4271 -822 -4931 -1056 4757 295 -4662 -1104 4989 253 -5543 -633 4556 1820
3223 1820 -4382 -1186 3439 2254 -4663 -2270 4317 2365 -3961 -2826 3427 4141 -3476 -3268 3530
3238 3530 3092 -2893 -3298 3370 3569 -3504 -3994 1677 3851 -1322 -3563 1662 4124 -1324 -4406 1741
3254 1741 4786 -228 -5326 498 4941 342 -5428 551 4542 -281 -4522 -300 3512 1038 -4594
3269 -4594 -598 4951 1281 -4420 -2477 4612 2273 -4053 -1714 4903 2333 -3404 -3006 3825 2622
3284 2622 -2449 -2573 2708 3865 -2464 -3957 2311 3348 -1823 -4836 3084 4509 -1665 -3681 2159
3299 2159 4583 -673 -3945 381 3734 -321 -3901 648 4617 116 -4685 -587 4376 483 -4054
3314 -4054 -486 4931 1020 -4241 -1466 3843 1510 -4469 -2390 3624 2012 -3094 -2484 3796 2788
3329 2788 -3325 -2746 3441 3603 -2827 -3457 3417 3259 -2009 -2799 1814 3096 -1459 -3317 1956 3514
3345 3514 -807 -4251 1068 4252 -952 -4018 41 4887 -874 -4081 210 3414 422 -2606 208
3360 208 4048 121 -3222 -705 2720 1731 -4302 -1780 4652 1332 -3860 -3008 3587 2890 -4154 -2327
3376 -2327 3602 2703 -3060 -2784 2455 3363 -1913 -2720 1981 3096 -1638 -3840 1331 4169 -917 -3672
3392 -3672 2486 3580 -1246 -3299 927 3121 -532 -2697 -342 3578 293 -2923 -287 4121 706
3407 706 -3718 -394 3849 505 -3565 -670 3958 1439 -3797 -916 3230 1291 -3169 -1500 1537
3422 1537 2412 -3139 -3668 2462 3086 -3194 -3157 3157 3111 -2606 -2649 2200 2955 -1504 -3572 1523 2920
3439 2920 -1422 -2366 986 3387 -779 -3863 927 4386 -586 -3618 403 4264 -468 -2887 -82
3454 -82 3437 831 -3547 -84 2774 1289 -3030 -1928 3141 1422 -3278 -905 3162 1890 -2845
3469 -2845 -1727 2963 2518 -3260 -1958 2468 1944 -1284 -2553 964 1925 -917 -3645 1700 3445 -1276
3485 -1276 -3432 841 3462 -553 -3549 835 2270 -1387 -3109 460 3017 -603 -3201 -390 3505
3500 3505 1262 -2886 -1203 3397 1002 -2946 -1270 2601 957 -3688 -823 3313 1350 -2897 -800
3515 -800 2553 1536 -2069 -1790 3096 3681 -1918 -2781 1792 3055 -2932 -2067 2478 3147 -2611 -3365 1657
3532 1657 2835 -1564 -2737 988 3548 -928 -3547 517 4395 121 -4039 265 3080 -246 -2561
3547 -2561 -780 2768 -92 -3424 94 2932 -469 -2202 -1327 2356 1927 -1684 -1641 2996 1843 -2488
3563 -2488 -1780 3125 1929 -3246 -1984 2039 2622 -2405 -1455 1837 1933 -1821 -2534 421 2419 -962
3579 -962 -2536 1116 3344 -954 -3849 1241 2705 -650 -2752 702 1952 -600 -1830 352 1742
3594 1742 -12 -1948 69 2792 1031 -3459 -1019 3458 1381 -2935 -455 3286 1815 -2462 -1071
3609 -1071 2536 1254 -1956 -2131 2649 1802 -1278 -2482 1475 2236 -1260 -1965 1803 2898 -1598 -2716
3625 -2716 1424 2424 -1413 -3079 692 3202 -505 -2865 496 2329 301 -2616 -71 3364 398
3640 398 -2884 -701 3949 -581 -2824 9 2902 117 -1857 -688 1484 270 -1608 -1811 1118
3655 1118 1246 -2311 -1779 2620 1180 -2902 -1420 2050 1813 -2043 -2400 2395 1030 -2446 -1564 852
3671 852 2629 -1162 -2100 155 2004 -494 -2332 -52 3940 -812 -2168 889 2198 -138 -2290
3686 -2290 1126 2404 91 -1877 -367 1845 858 -1912 -1641 2250 871 -2627 -1358 2737 1063
3701 1063 -2736 -1110 3239 635 -1970 -783 1605 1125 -1618 -2200 1457 2546 -1155 -1861 1324 2517
3717 2517 -1184 -2578 1545 2595 -1078 -2299 998 2137 -700 -1554 189 2133 981 -1985 -97
3732 -97 1669 47 -2387 -186 2336 431 -2091 -386 1964 0 -2429 -259 2195 514 -1813
3747 -1813 -1296 1910 1189 -1471 -1114 1340 691 -1566 -1534 1292 1596 -1733 -2166 1191 1250 -1841 -969 1470
3765 1470 1597 -1081 -1285 513 2386 -991 -2491 1538 2076 -125 -2707 648 2061 -194 -2925 80
3781 80 1925 260 -1468 452 2685 103 -3200 -947 1524 898 -1434 -1297 1702 857 -2664 -1004
3797 -1004 1625 1246 -2351 -959 1797 1023 -2216 -1603 895 1433 -920 -1711 645 1375 -1407 -1793 748
3814 748 3407 -1045 -1689 554 2359 -1954 -3090 622 1332 -512 -1014 491 1376 403 -1465 -148
3830 -148 2218 722 -1699 222 1892 -380 -1673 -188 1843 297 -1056 -745 2441 996 -1288
3845 -1288 -2389 1909 1982 -827 -1167 1197 1831 -1895 -1353 1758 2069 -2030 -2026 1324 942 -1297 -2098 1183
3863 1183 2504 -1120 -1704 116 1462 -104 -1976 235 1666 247 -1905 95 1341 -403 -1801
3878 -1801 78 1846 135 -1187 -72 1568 974 -1354 31 2427 1470 -2127 -1032 1074 1635 -1517
3894 -1517 -817 1968 1066 -1459 -1371 1702 555 -615 -446 374 1288 67 -1471 80 2073 -1055 -1745
3911 -1745 133 2238 207 -1265 455 2023 -583 -1339 -627 1433 -567 -1575 -434 1132 317 -1560
3927 -1560 157 1428 615 -2776 -99 1720 576 -1563 -290 1551 606 -1394 -1203 1667 1674 -811
3943 -811 -624 716 1006 -1236 -1269 1586 1796 -433 -1619 1616 911 -430 -1718 695 981 -807 -1467
3960 -1467 352 1145 -1505 -1587 426 1905 452 -2017 -186 2271 1 -1826 -902 1069 335 -1071
3976 -1071 -54 1631 525 -742 -310 882 210 -652 -421 630 549 -919 -2022 1161 1074 -1377 -301
3993 -301 1316 1395 -1113 -1683 -18 1331 -348 -1897 316 1252 -251 -252 521 1639 -439 -1515 473
4010 473 1997 -424 -1478 81 1636 460 -1195 205 1232 418 -1431 124 726 128 -2217 -592
4026 -592 1717 1243 -2316 -1613 1887 810 -659 -187 1289 190 -462 -626 -386 1204 -334 -629 1181
4043 1181 1335 -897 -1598 995 1685 -582 -1386 1475 2267 -351 -2352 409 1222 -333 -1181 -598 1463
4060 1463 7 -1464 532 1110 512 -1230 239 1588 45 -1617 -653 1404 469 -1279 -298 1142
4076 1142 -205 -1027 -1702 702 632 -518 -973 1130 712 -739 -1326 1363 968 -1559 -1261 951 2182
4093 2182 -151 -518 1147 993 -94 136 792 1422 -162 -1394 615 834 2 -1061 218 1576 -12
4110 -12 -2724 -17 384 220 -1102 -558 595 44 -1276 32 703 549 -1218 -387 867 1409 -1055
4127 -1055 -518 1314 1143 -323 -421 1654 190 143 -626 -340 1178 -109 -975 813 1217 -970 -1627 63
4145 63 806 -581 -1492 465 1292 -379 -852 -282 1025 -190 -1209 420 999 -373 -562 -562 1370 249
4163 249 -1110 -561 1072 522 -858 -718 1434 1072 -993 -642 1129 931 -1382 -773 907 271 -1712
4180 -1712 -1142 -170 850 -150 -1160 370 1195 -369 -924 554 1224 -877 -59 918 1122 -861 -127
4197 -127 -272 1088 3 -1705 31 297 -689 -665 -59 1092 424 -963 -779 1381 281 -2069 541
4214 541 428 520 -551 262 1736 1330 -517 257 1488 735 -305 -489 1264 1436 -182 -1214 519
4231 519 798 148 -383 -334 1288 -763 -991 464 693 -314 -778 767 597 -293 -1462 627 491 -41
4249 -41 -1035 393 851 -303 -1238 261 1665 -234 -563 48 1255 512 -1357 -468 1 615 -336 -206
4267 -206 1009 389 -1093 -1382 880 739 -934 -938 441 1112 -481 -1290 -87 1098 -41 -1323 171
4284 171 1333 -74 -132 1014 1249 -317 -919 -12 472 -485 -116 -93 369 -63 -57 -684 1207 248 -579 -66
4304 -66 1227 370 -1490 401 1634 173 -1478 -644 1005 1304 -1476 493 1230 896 -933 -535 711
4321 711 924 -1193 -1019 1252 791 -777 -91 810 623 -56 -402 711 1442 255 -1924 722 407 286
4339 286 -606 1127 1301 -295 -126 63 906 293 -1161 19 172 1198 -1016 -461 1090 -91 -1063
4356 -1063 59 604 1480 -389 -1031 1627 50 -1287 -917 935 -4 -683 -810 744 1277 261 -990
4373 -990 196 469 -791 -1289 -263 1085 -1107 -259 251 643 -527 -519 27 115 78 -70 500 858 -948
4392 -948 -1199 244 1327 -155 -746 403 220 423 -535 339 642 -100 -742 -680 542 201 -192 -749 331
4411 331 1254 323 565 1034 478 -534 -6 664 -317 -747 -813 572 1013 402 -1047 831 383 -807 -1510
4430 -1510 -653 1028 -633 -728 989 1676 -674 -944 -186 625 369 -706 208 1670 -90 -336 -779 687
4448 687 425 -395 -789 496 319 -994 -519 563 589 -1005 -1047 163 1222 106 173 521 483 -571 -86
4467 -86 155 762 -331 -803 510 676 234 190 -444 496 -567 -166 841 422 -133 -1175 569 1071 416
4486 416 -1161 342 906 4 -298 -175 883 379 -337 -603 469 559 -1099 15 917 574 -603 -595 1399
4505 1399 488 194 -343 874 78 -275 -995 592 1309 -382 -771 134 760 -256 -827 8 1093 -423
4523 -423 -538 517 461 395 -845 -429 809 -399 14 167 462 -664 -805 -50 -21 -734 -809 256 -366
4542 -366 101 115 -997 556 -862 178 -630 -338 -118 -506 -71 582 812 334 -353 715 883 -874
4560 -874 -402 146 828 -366 -254 716 155 62 153 527 406 162 -334 -356 945 -176 -854 621 1249 -282
4580 -282 -961 243 40 272 270 -144 552 107 -390 -310 1009 154 -554 -145 496 410 -1251 -874 -277 702
4600 702 -223 -802 1026 396 -845 -1036 329 659 -405 717 180 -72 76 -1111 1334 345 314 -924
4618 -924 -308 876 831 -602 -712 1416 541 -196 191 1060 1 -1006 -764 845 257 -1257 -840 671
4636 671 -458 -126 -1020 1203 -453 50 -316 861 -553 -662 -222 -170 892 -560 -833 736 795 397
4654 397 -300 432 327 -1153 -512 -660 485 -369 -645 336 715 242 -540 624 613 -666 -650 -324 270
4673 270 -525 -583 62 661 -688 -514 -126 -33 162 -366 -855 -579 290 -1180 -441 -399 -1270 -185 -129 -441
4693 -441 1110 -759 -544 841 17 -474 -24 859 366 174 -878 -19 363 -252 -231 268 731 527 -795
4712 -795 71 399 171 293 -36 798 -75 -9 -329 481 -112 -800 -189 850 -538 -292 422 -278 131 -745
4732 -745 106 101 -1004 -127 -96 -266 -431 191 -415 596 -97 -536 -323 381 946 188 -1051 -117 895 125
4752 125 -75 269 185 -392 -568 -319 625 153 -519 -542 970 -360 88 -274 -176 -452 -737 -429 336 512
4772 512 340 72 991 -124 -334 -3 332 -566 -721 238 586 343 115 -106 283 147 455 -552 6
4791 6 -57 -172 88 -352 54 -488 -215 -289 140 -972 -974 383 297 -217 -9 -243 68 662 835 -356 634
4812 634 -260 122 200 -60 45 -1051 555 481 -428 -1077 156 -659 -209 215 -43 -193 398 -432 -267 45
4832 45 480 353 -374 -725 654 -842 413 683 356 -627 -846 516 218 132 -595 899 767 335 222
4851 222 -104 40 33 -157 -253 941 150 200 282 490 129 -1401 266 872 -240 -447 49 274 -149 -1585
4871 -1585 -1162 760 -116 -893 -1 299 25 -112 961 -47 -161 251 157 414 -439 -208 -441 468 11
4890 11 608 511 -356 98 -199 123 241 1287 -696 -1310 265 108 -167 -588 594 241 246 250 -313 -218 473
4911 473 -1623 545 437 1210 133 37 1185 -266 -419 500 -127 202 6 -296 -827 125 222 -206 748
4930 748 169 -178 -295 482 1059 85 -196 91 -589 381 652 934 259 -565 -518 205 -81 596 426 656
4950 656 -179 1122 364 519 739 9 -924 357 810 242 193 -125 470 329 -1242 -638 494 -601 -559
4969 -559 366 131 -93 171 -15 428 705 -1147 198 580 345 378 560 -53 134 99 -67 527 1022 -44
4989 -44 -999 133 270 360 -1428 111 -55 29 20 -678 194 122 -510 489 528 747 -245 -158 -483 4 -1186
5010 -1186 -834 947 270 -285 246 -443 -606 -234 215 361 -284 -159 125 229 696 92 -874 271 -27
5029 -27 -130 -369 -33 940 -578 291 593 -604 -692 -392 -578 -154 -351 -189 -230 386 -605 106 -438 -43
5049 -43 1173 35 89 -115 -139 111 -322 683 208 -309 898 283 1011 -1011 -286 753 262 -112 -42
5068 -42 786 302 38 -477 -24 -73 -885 -278 -39 724 -1014 -120 406 -583 -112 -126 728 641 -885 -198 -2
5089 -2 248 714 28 64 114 -218 115 532 226 -165 -41 275 43 -244 438 -234 432 547 -530 156 540
5110 540 -131 84 -228 475 69 -853 -25 365 59 -56 -1070 -39 469 -340 -220 -167 -113 -517 -456 357
5130 357 -243 -332 -19 79 -283 55 17 299 168 369 -163 241 -458 423 -38 -261 360 177 213 -566 111
5151 111 519 598 261 389 -193 -356 -592 854 -185 -132 -238 165 96 -394 -1186 769 -62 42 -707 910
5171 910 621 268 -1142 42 -764 -1025 457 -238 628 -688 -214 -298 -580 -877 34 97 442 336 -406
5190 -406 -617 406 141 303 44 78 805 -457 -149 498 -515 35 249 205 223 -653 593 121 45 171
5210 171 -53 -465 -287 -118 516 643 532 261 381 -616 586 -124 -21 398 387 -861 -158 -398 -796 383
5230 383 1 633 494 -47 -349 -402 -42 26 -365 -95 78 -187 289 313 143 227 -747 553 33 471 223
5251 223 -455 -646 -390 -78 147 424 1151 177 193 242 1433 845 -156 545 962 351 30 452 990 151
5271 151 -188 79 -244 159 -1115 -459 1132 251 -1179 330 897 -217 -373 407 -512 -257 649 226
5289 226 -653 -748 279 987 526 407 236 264 -458 125 -968 -80 441 639 -684 -93 170 778 -130 405
5309 405 -67 54 -33 -115 178 33 818 445 -267 35 -116 465 373 -9 -73 300 15 -489 -102 251 -15
5330 -15 595 -307 -52 32 161 163 173 -123 27 206 -241 -318 219 175 145 -615 -389 44 -880 298 -267 -209 35
5353 35 -231 724 145 224 615 -748 -317 -338 -606 -1139 488 -48 -590 -386 -754 122 430 176 379 524
5373 524 -133 -679 353 524 -492 -117 285 408 78 564 167 359 932 -64 257 314 481 74 1054 57
5393 57 -294 101 278 667 507 -357 485 245 -432 -679 103 -176 299 494 -381 -704 -96 -903 -494 -483 -164
5414 -164 -60 -808 -115 442 534 -940 186 298 337 -680 326 141 -848 665 -439 -478 -223 435 50
5433 50 644 -113 -676 -31 -593 -546 330 109 594 200 52 541 604 647 1086 -287 -580 -216 -258 231 -779
5454 -779 -893 -274 -114 -641 12 852 -8 -61 -693 74 79 -181 461 -404 -112 779 -344 -205 -247 -158 -347
5475 -347 -502 -588 -130 -251 118 362 -273 -578 92 240 -12 50 40 78 -137 562 -464 463 776 -191 -895
5496 -895 -380 425 563 -344 285 -112 318 490 -473 201 -86 -89 -166 -486 287 318 -400 739 151 194 394
5517 394 1490 461 -404 -465 -336 604 -251 -1001 511 -172 625 -737 358 146 367 -477 -348 479 322
5536 322 -225 -189 202 257 -20 58 277 -259 -300 58 -148 -244 85 -154 483 -171 -507 -586 -398 254 -55 -728
5558 -728 398 381 -600 -96 429 285 39 688 -698 466 -632 -635 813 116 -133 18 280 -277 942
5577 942 146 53 -440 677 716 -50 953 -601 -925 -572 -548 -241 50 796 -136 -295 -1163 -769 672 -218
5597 -218 435 563 63 942 -80 -403 269 566 -62 -124 64 -13 237 -608 190 -187 67 -520 578 -429
5617 -429 376 47 -206 818 -118 -742 176 272 299 713 -710 630 28 333 -475 1057 -473 -667 531
5636 531 149 -497 -365 -785 444 793 -236 -398 232 317 56 -315 -61 -137 337 -512 -336 941 118 -541
5656 -541 -534 -943 756 -401 -1136 -275 365 -509 -218 -640 492 -275 -43 125 -293 -476 -215 767 227 -279
5676 -279 -422 281 -81 192 -434 408 -285 223 -375 698 67 171 869 -642 361 342 -549 -661 13
5695 13 164 -44 425 225 -209 832 -284 741 418 -97 53 -54 -861 575 -224 -185 532 150 817
5714 817 -433 -120 -211 508 454 682 -479 -210 -983 44 65 658 -953 -284 -424 -257 -78 -755 213 -836
5734 -836 -837 -382 -26 -274 409 -169 -779 -63 -559 433 -275 -436 -527 399 -936 -474 412 86 -782 -278 292
5755 292 -285 -29 -88 -492 470 222 -368 14 530 -726 -337 32 -307 -217 167 560 -288 605 -1079 609
5775 609 -463 353 -562 181 -342 251 -677 -110 347 145 593 836 -1048 -38 272 -474 -280 -270 292
5794 292 -384 -80 -24 -345 -249 -258 -472 462 -117 -415 187 610 379 -115 504 -187 -757 24 -211 1050 -626
5815 -626 193 249 -155 37 -227 613 5 201 458 -313 478 -104 -298 -488 74 -22 -83 627 267 471 -577
5836 -577 -878 -247 260 366 -37 -3 -80 453 104 -22 -28 -587 549 515 -98 -471 151 -187 225 -217 -96
5857 -96 -14 -496 -435 -468 -540 -238 185 1063 516 351 549 -38 -402 696 214 131 195 205 -468 463 -601 -662
5879 -662 826 -13 -264 800 293 -410 -245 -294 734 -345 133 -286 1119 -36 -291 -214 248 15 427
5898 427 227 -65 323 -427 47 -34 843 -750 -306 -221 -356 -554 574 282 792 1291 430 432 -224 160 73
5919 73 185 1247 273 -12 595 -13 224 -12 -481 -353 233 749 236 97 479 -293 -149 -705 -170 85
5939 85 -18 194 -313 -318 -156 466 469 -1034 239 138 324 532 -317 195 -140 -485 80 192 -829 -513 544
5960 544 -63 261 296 198 285 -326 -96 805 199 582 650 200 -100 -616 -520 -216 -1471 408 1211 -1034 258
5981 258 239 113 175 183 65 179 -454 312 -291 -29 -259 -38 597 303 106 59 -418 -58 -693 89 310 -448
6003 -448 -191 -660 -671 -432 -144 59 -189 -266 449 28 249 608 -47 230 -10 -156 79 650 633 -401 -292
6024 -292 -120 -380 356 34 73 790 -267 158 544 28 -28 -738 18 -131 280 896 -378 -499 603 -231
6044 -231 244 35 -133 -109 39 145 534 960 -533 195 53 -586 1234 637 -401 89 -61 -451 23
6063 23 235 106 -176 -712 5 -566 -601 844 -238 628 -283 524 -714 -49 810 -842 221 865 1262
6082 1262 -24 482 -815 182 -430 -4 -23 223 -307 297 -512 463 380 79 696 -689 168 -350 -459
6101 -459 -884 1106 391 -1122 -33 -587 -888 286 -1230 389 1598 252 -494 -66 534 -1095 -335
6118 -335 -1167 271 337 -591 -339 -608 -501 68 -321 4 -528 121 78 -1020 -319 737 87 -65 162 546
6138 546 378 -427 -193 -612 -588 448 -250 -454 -621 -29 -1162 39 -550 139 -301 -759 -5 -1256 722
6157 722 783 349 -6 291 -139 -916 -19 285 478 -592 -495 -669 -268 -786 -168 91 -401 -240 -484 -85
6177 -85 -354 126 22 171 421 -83 -541 -293 -127 -129 254 162 -7 227 -798 218 645 -437 -369 -758 151
6198 151 -330 -259 600 259 829 -37 119 168 548 786 93 -380 -544 -267 -309 -288 -318 -36 -461 115 -862 71
6220 71 34 402 -158 -764 112 675 125 376 -291 -72 -166 -1056 -710 186 -55 -595 -620 -555 103 -653 -150 466
6242 466 -307 -98 603 -430 119 -314 -218 -425 75 -534 549 566 974 91 -39 -181 54 489 -88 170
6262 170 -513 -6 -797 -304 -435 422 -45 -117 -333 -661 -439 616 124 -200 140 -157 789 300 84 -872
6282 -872 1 332 -717 622 -269 -338 125 -155 40 -472 600 834 -482 9 547 650 306 -461 -207
6301 -207 190 -113 -978 732 -133 -197 -411 -129 308 -354 -64 238 532 -1217 261 25 157 -108 -319
6320 -319 -337 474 122 -91 605 -302 -1124 -441 -293 680 508 631 -279 231 -309 -462 719 499 -495 416
6340 416 105 134 891 -226 -58 24 430 -484 330 171 -240 563 217 24 -149 -743 23 -811 106 -128
6360 -128 61 647 743 375 -47 392 307 30 233 529 682 1555 -137 632 -218 -197 495 -6 136 118 12
6381 12 -172 449 76 -215 43 184 9 128 326 -1036 18 293 -23 673 966 -204 -349 -734 -284
6400 -284 506 436 626 323 -276 -906 801 676 -29 144 81 -278 539 -442 253 96 -560 246 72 -214
6420 -214 168 -430 11 -59 -364 -151 -53 -46 -281 266 491 27 340 -193 -731 847 268 -590 -298 -176 -458
6441 -458 459 89 -642 101 -549 380 -168 628 165 1009 -480 -646 -23 -315 -30 339 907 201 238 -68
6461 -68 483 770 164 169 -361 -226 -152 -598 -560 -78 283 -551 -394 513 92 -1810 574 -124 130 -46 250
6482 250 -355 -338 -220 -121 37 528 -60 149 109 -231 -1107 264 -177 460 231 401 132 -202 556 -305 717
6503 717 54 680 318 788 -736 328 -544 -3 -333 437 -22 -239 19 324 -949 -447 -481 -96 363
6522 363 1047 242 -83 -4 -209 -568 121 -235 -186 191 113 496 -630 -219 191 -29 123 34 297 89 94 -186
6544 -186 -42 344 -155 732 -219 -965 1023 -261 -22 542 -593 427 -407 -911 444 1075 524 -302
6562 -302 -434 293 271 -108 567 -123 149 39 355 -250 -900 593 102 936 65 -167 -353 240 -96 -268
6582 -268 13 -548 256 239 -515 -746 466 907 -602 -17 -65 -532 -504 -158 623 627 32 199 1159 -1153 186
6603 186 720 -350 -297 267 507 233 304 -182 -625 325 -31 156 338 -238 -267 -659 -149 409 394 517 -349
6624 -349 -225 -673 71 90 181 300 -83 -517 -165 1336 -596 -397 68 730 138 134 712 -565 -395 477
6644 477 30 310 -1209 79 -318 435 411 -50 -164 -47 414 -1025 1249 75 204 966 3 -172 1206
6663 1206 1038 396 104 -414 -672 -660 -111 -591 655 38 -1331 -236 278 -122 575 -461 11 -550 -193
6682 -193 298 594 -624 611 -343 -488 -215 -156 618 -606 -733 -506 642 -117 349 -324 93 1182 124
6701 124 760 337 -528 134 -24 -141 4 211 417 -561 5 -679 -8 537 68 185 189 532 -733 -318
6721 -318 301 -919 -54 -575 468 130 -791 -292 119 -92 136 -104 -107 558 -184 -302 -379 821 -877 686
6741 686 144 120 -632 -298 -518 -294 142 -241 339 -601 -438 -88 -185 -453 -449 416 107 -533 -343 -155 -13
6762 -13 433 23 57 591 -253 707 -153 -77 -708 191 -51 252 -4 -743 656 392 -687 -269 -29 816
6782 816 -310 -237 -1537 1094 868 165 -257 -363 11 116 -230 103 311 -200 -90 -161 399 608 -368 -517
6802 -517 988 -347 102 517 -365 -268 -405 75 -932 408 789 71 -246 -108 -524 -268 230 -824 909
6821 909 -35 -34 -641 356 9 545 -480 274 -660 255 151 166 498 -750 -353 -47 -241 68 -54 257
6841 257 472 141 -190 264 221 -27 0 187 1 -527 -44 86 239 46 89 302 228 88 547 -488 359
6862 359 58 666 1015 757 126 -1046 1166 82 -531 20 -90 739 -46 627 869 -474 188 109 -810
6881 -810 666 -691 -410 -151 347 634 -146 49 -48 -380 -903 90 739 31 -121 -492 -139 300 -123 327
6901 327 -309 506 387 -321 210 -174 -415 686 -515 963 -129 -394 -637 158 -448 628 -168 332
6919 332 -241 -361 308 239 117 -247 -305 1597 417 281 192 266 656 -700 401 63 272 -477 -246 18
6939 18 -114 521 -243 -920 -342 -486 663 -194 -660 269 -304 283 -163 -13 5 464 413 239 -37 -288 -679
6960 -679 -103 560 -263 -172 -1179 237 -584 -587 359 -13 -71 451 -1 -43 -169 393 -297 388 376 471 -275 5
6982 5 -324 575 -226 -335 -677 165 -158 -269 586 -313 -1650 -586 420 -887 414 201 -758 175 -697
7001 -697 793 583 214 179 -748 -277 509 566 679 858 73 33 59 -20 -191 68 105 233 -163 -293 -223 -3
7023 -3 850 181 -337 -273 370 -245 162 -218 -238 -925 -670 -691 186 -738 584 548 690 665 -445 -330 -70 419
7045 419 116 -199 365 -88 966 -762 672 580 -55 -300 -434 -204 -105 641 -444 -389 188 478 393 173
7065 173 -604 -195 -110 -334 522 -289 150 541 122 -631 498 761 183 -242 -137 384 -192 -293 -420 209
7085 209 51 -132 147 -610 -260 -842 -575 -94 -554 22 -463 -752 -545 -393 -896 637 -231 -186 75 360
7105 360 -22 57 -700 -488 432 -333 -264 -293 -101 -58 52 -809 -79 429 -133 27 -218 82 -735 359 -190
7126 -190 195 214 -91 320 -385 -493 112 -436 317 24 411 494 96 499 -490 237 -169 53 38 -617 75
7147 75 678 36 271 -975 -380 -457 4 431 426 71 343 -619 428 -205 -748 -126 -174 -63 -11 131 372
7168 372 -277 745 155 -408 39 -250 -166 215 269 -400 285 -126 -171 339 18 392 334 87 758 -457 -379
7189 -379 218 583 -402 -271 18 645 140 -92 530 25 -299 -548 -246 73 74 -464 149 814 -83 -207 741
7210 741 391 -26 420 -539 17 -119 -784 -342 -486 745 -696 677 266 120 526 194 -63 320 -412
7229 -412 -12 -260 352 -193 115 297 -22 137 17 662 151 441 345 -825 -29 -26 -11 -1050 -282 -884 -163
7250 -163 -447 -693 161 411 86 572 -585 1380 794 620 -63 262 175 -233 5 -215 -578 357 881 -788
7270 -788 99 -302 286 -319 50 668 -632 678 216 964 -99 -263 41 -730 390 -521 334 815 519
7289 519 489 -294 413 231 -451 22 461 -1047 4 468 378 171 -44 -502 86 453 -193 100 290 316
7309 316 -689 -594 -457 -325 -266 -512 -450 428 -441 574 514 -22 -12 -544 253 62 -944 -554 -115 470 -673
7330 -673 442 308 71 -377 247 -315 -148 19 -81 -422 -717 -3 230 -136 318 808 318 -564 -156 493
7350 493 990 523 541 -528 -546 -169 -249 -248 1125 -527 -598 191 203 292 -179 325 224 171 -562 -486 -112 -119 434
7373 434 -262 -220 -367 -25 343 319 -302 -582 -836 188 -491 -372 2 -628 166 502 41 556 468 -64 851
7394 851 -411 450 247 -392 36 -36 -8 -115 -132 254 -293 491 -459 583 751 427 206 463 -272 -848
7414 -848 -840 -130 -497 343 776 -179 -784 41 723 -216 279 -80 260 -108 250 -670 814 284 -41 -454
7434 -454 625 -636 -248 113 262 163 29 531 821 12 523 43 305 239 -847 -183 40 -65 688 -66
7454 -66 150 -255 -574 915 -78 -366 188 -294 -333 1002 25 49 399 670 399 -11 733 -272 -878 -17
7474 -17 418 289 -147 1381 347 -222 238 -52 638 113 -172 -444 -87 -475 -93 88 344 -163 820 435
7494 435 -941 353 -1321 352 581 -573 508 745 79 409 -342 -28 -719 -4 -204 -295 -16 -643
7512 -643 -548 33 -508 -278 118 -520 367 544 63 -257 -510 132 -511 -143 -383 -599 417 181 229 14
7532 14 62 741 691 -48 1086 -679 281 -215 -17 -791 -93 468 -22 570 -432 619 488 352 332 163
7552 163 53 120 -386 -435 571 509 -89 -333 154 -176 350 -18 -623 313 13 -1 237 -66 -455 -151 388
7573 388 -254 -526 -449 796 712 -376 -291 505 -1059 164 -164 38 240 752 -343 58 -115 260 -172
7592 -172 -603 551 -12 -393 367 -961 -99 -251 -600 454 78 750 454 -4 705 104 359 -188 -131
7611 -131 256 -559 -173 476 340 244 169 -215 53 337 -711 -218 261 428 -1186 209 440 -96 349 349
7631 349 489 650 120 -444 230 -649 -533 -3 141 -69 863 111 358 -604 904 -336 328 -111 -316
7650 -316 752 -162 29 -160 78 -342 863 230 13 184 -638 -279 -45 -35 427 211 641 286 -20 624
7670 624 -62 -204 -67 -238 961 209 489 798 -423 189 -238 -343 -109 46 -410 615 -845 159
7688 159 292 -32 -130 31 -512 614 -851 308 241 -120 -43 -56 -84 -508 -481 588 -341 570 -106 -201 1199
7709 1199 -171 507 -119 29 24 541 1481 -255 139 314 39 -133 304 -338 359 599 410 112 -765 180
7729 180 28 -605 -124 -1755 41 -84 21 691 -462 163 -785 -821 -59 -421 -56 150 1108 -460 124
7748 124 118 161 29 308 129 289 430 -277 -42 -129 -53 -100 463 -234 -229 -349 511 -185 613 -683 200 597
7770 597 146 -1064 -58 -999 271 -345 -189 612 -127 -147 433 553 578 -96 919 49 -1093 198 -874
7789 -874 -293 -1046 93 -75 -282 176 153 293 -725 -44 -286 -253 418 285 -363 383 -540 327 87 -71
7809 -71 -409 -576 85 -765 -112 -605 -214 -442 -628 1045 -291 -339 948 -101 -89 -387 180 -145 -24 -758
7829 -758 107 -486 91 -614 -183 86 -1580 -416 -14 -63 -786 189 -67 60 113 548 -1013 -389 -307 -512
7849 -512 -17 -520 833 -389 -152 -120 -731 82 118 738 -18 65 105 49 154 -142 542 726 -494 -423 63
7870 63 -430 617 382 -16 -37 10 -308 -29 39 -77 -196 -634 31 -731 1006 -231 -388 -1221 -342 -159
7890 -159 48 619 -356 364 329 -287 -796 584 -114 -1033 -203 658 -347 -806 1498 -198 793 249 425
7909 425 -35 625 324 -461 591 -478 23 -751 -124 260 -141 259 -65 729 182 244 -579 585 -315
7928 -315 70 -805 -67 555 679 -132 -255 -181 355 421 -116 97 -320 -221 386 537 489 450 364 279 -582 485
7950 485 436 -209 80 -504 -292 -126 -113 -451 327 -288 -677 12 502 71 183 631 498 467 -1167 165
7970 165 231 -479 -935 -110 46 -303 49 -762 -150 248 279 326 -373 -338 -908 -91 -1076 -63 -409 124 386
7991 386 -127 -126 -189 -597 -126 -487 -595 8 -194 -175 1080 -462 361 -117 -833 719 -564 621 -551
8010 -551 514 165 -701 -389 425 -762 -362 -705 798 467 -1014 -542 -945 -370 737 833 -6 895 -537
8029 -537 -644 279 -662 329 -395 -145 -1051 -236 389 -578 -217 434 -120 -10 -432 374 -479 -394 525 -193
8049 -193 321 442 577 335 -16 191 -2 -904 -895 -569 -167 -82 -22 381 -286 523 -398 56 -271 474 -307
8070 -307 -4 -84 508 12 -626 -1071 373 -93 1040 -419 -347 441 -1011 389 -138 94 4 34 -201 -257
8090 -257 -704 -14 -77 9 -429 -537 -404 456 396 -729 119 161 242 295 -733 -731 -267 731 -172 464 85 477
8112 477 -345 27 -9 -26 -13 554 -422 -21 335 213 -369 -906 -167 324 224 -182 1308 -323 635 -571
8132 -571 462 332 -436 -733 -154 -563 -556 345 517 -451 119 -77 -154 437 -573 597 346 -373 152 103
8152 103 -257 -284 506 -178 463 149 -454 319 283 233 -87 -439 -48 356 -177 -391 -229 -213 203 22 45 -354
8174 -354 267 -385 -139 -198 -55 -180 -436 -696 761 -19 9 -145 411 501 409 -442 -711
8191g11
$$ Imaginary data points
##PAGE= N=2
##DATA TABLE= (X++(I..I)), XYDATA
0 0 0 0 0 0 0 0 0 0 0 0 0 0 0 0 -108 108 -108 108 -108 216 -216 217 -324 325 -432 443 -542 648 -756 865
30 865 -975 1086 -1248 1410 -1611 1802 -2019 2262 -2526 2813 -3130 3478 -3865 4263 -4719 5217
46 5217 -5761 6343 -6986 7706 -8485 9348 -10297 11378 -12572 13919 -15462 17239
58 17239 -19311 21750 -24694 28324 -32922 38951 -47259 59458 -79168 116201 -209883
69 -209883 984353 1014710 -1630847 -605523 1393817 711160 -1248996 -623010 982319
78 982319 802111 -803588 -919998 642710 1185043 -604197 -1324461 635633 1483242
87 1483242 -702698 -1465029 767609 1436156 -764852 -1282787 693090 1182454 -517036
96 -517036 -1067390 304268 1077198 -64132 -1123039 -124029 1254073 247756 -1379717
105 -1379717 -284809 1489814 253387 -1509664 -180915 1463724 150242 -1307908
113 -1307908 -143485 1160848 254459 -970435 -392559 866964 604637 -808993 -792315
122 -792315 840461 939907 -907028 -1002681 980305 994735 -1006775 -923668 975998 841369
132 841369 -856334 -773589 688795 772034 -490263 -827959 318823 945758 -190747
141 -190747 -1079906 139440 1207403 -141712 -1273593 187987 1275385 -225073 -1205802
150 -1205802 224012 1089700 -164259 -968308 38329 869960 130965 -828427 -310983
159 -310983 847681 463562 -914230 -560372 992327 586787 -1052917 -565340 1053916
168 1053916 504398 -999466 -461985 877386 452143 -724664 -502238 577448 606209
177 606209 -458466 -736551 402387 872626 -393449 -966547 430098 1011550 -465048
186 -465048 -988054 483036 927399 -445948 -838558 362578 769792 -223995 -733438
195 -733438 73172 754574 75174 -809918 -173951 896607 232627 -964749 -230587 1008951
205 1008951 206851 -989185 -168011 925677 163736 -814661 -196018 702358 283629
214 283629 -600886 -399770 545451 533433 -532827 -641653 562219 712109 -601407 -726567
224 -726567 633122 701838 -624175 -647721 573974 599551 -470208 -570808 348430 592173
234 592173 -218873 -645218 122353 729468 -57298 -806678 41483 871106 -50043 -887993
244 -887993 78960 863266 -83970 -793135 62454 716482 7455 -638832 -100538 595594
254 595594 222340 -578009 -325590 608338 413983 -645226 -448236 691034 455450 -699205
264 -699205 -424609 681358 396334 -612792 -376748 521345 396687 -415098 -445202 330254
274 330254 524793 -266609 -605706 244701 681954 -245536 -721008 266611 727147 -275879
284 -275879 -693981 264783 645521 -215257 -592081 140464 560854 -40701 -550927 -56981
294 -56981 577096 141559 -616827 -191322 663267 213116 -690412 -206895 693119 194435
304 194435 -658180 -183373 597798 201237 -520002 -242701 450968 313767 -395452 -390150
314 -390150 373618 470156 -369387 -523406 388323 551623 -400594 -544379 400480 520839
324 520839 -368115 -489785 313897 470427 -234565 -466855 152772 492818 -73952 -531611
334 -531611 22639 581929 9643 -617613 -14342 639790 13685 -626897 -10092 597334
344 597334 28243 -544883 -59764 497413 119926 -454606 -187060 435100 263119 -431665
354 -431665 -319995 449218 361487 -460604 -372960 471017 372287 -453291 -356719 421253 350961
365 350961 -363086 -352200 299348 379411 -232289 -414493 185831 466928 -151866 -507177
375 -507177 140628 540583 -134507 -547154 134753 539302 -120915 -510712 93883 482171
385 482171 -45652 -454667 -10902 443104 75634 -441480 -132590 457576 177626 -474106
395 -474106 -202255 487035 216080 -483636 -216711 468505 221541 -430170 -227299 388695
405 388695 253515 -336179 -287197 297698 334461 -267600 -377293 252492 415586 -244620
415 -244620 -436836 243828 447203 -232272 -435624 215415 425982 -175916 -409618 132646
425 132646 408568 -77124 -410663 29725 429414 17824 -445484 -45887 465168 67144
435 67144 -471080 -77675 468226 88422 -451237 -101495 424157 125134 -390927 -157350
445 -157350 362974 199213 -341296 -240669 329553 279995 -319374 -308815 318101 328831
455 328831 -310770 -334229 299323 338115 -273688 -334952 241665 341521 -198574 -349059 159286
466 159286 369244 -119078 -388732 90998 411351 -66236 -425477 52465 434185 -35267
476 -35267 -428399 22397 420387 1922 -401309 -30066 387225 68385 -372070 -105882
486 -105882 365729 143093 -360276 -173480 359849 200985 -357172 -218322 351509 230851
496 230851 -335360 -239119 314415 251457 -285101 -264498 256794 287676 -225068 -307443 201204
507 201204 334374 -177322 -351868 162311 367844 -144561 -374586 129088 377752 -108329
517 -108329 -374173 84653 370944 -52521 -364311 21647 366249 13990 -365668 -42224
527 -42224 370748 72342 -371418 -91711 371855 113260 -363286 -127206 353782 147359
537 147359 -336821 -163509 319500 186975 -297185 -208601 280957 235858 -261444 -257450 248390
548 248390 279448 -232910 -292397 221160 306091 -200279 -311450 182305 318488 -157583
558 -157583 -323458 131057 329661 -103602 -336703 76767 346034 -50338 -350823 28168
568 28168 357653 -6043 -357722 -13475 357165 34114 -351012 -54537 342187 76560
578 76560 -332844 -100809 322467 126582 -311775 -149536 303079 171874 -292155 -192188
588 -192188 282590 210100 -270637 -225037 255085 239017 -237768 -251245 219000 265061 -197225
599 -197225 -276825 176113 289056 -153835 -301493 134113 311609 -114362 -319453 95429
609 95429 325217 -73934 -327979 53525 330239 -31127 -327664 10499 328075 14050
619 14050 -323289 -36133 321958 59466 -317304 -80027 313402 102103 -305838 -121003
629 -121003 297640 140495 -287428 -155724 276983 174307 -261729 -189733 248773 207827
639 207827 -232245 -221436 217579 238803 -200214 -249243 185145 262646 -167190 -271424 149575
650 149575 281793 -130544 -289167 110548 294625 -89204 -298246 70414 304133 -47888
660 -47888 -304728 29787 306313 -6996 -305708 -11849 306802 32358 -301756 -51723
670 -51723 298040 71810 -290385 -89884 284917 109867 -275242 -127446 268091 145675
680 145675 -255337 -161140 245994 178270 -232099 -191634 219371 206207 -204063 -218047 190344
691 190344 231453 -173986 -239995 157520 251374 -139099 -258200 123396 267737 -104460
701 -104460 -271648 86614 278074 -66515 -280638 49948 283865 -29340 -283986 11866
711 11866 285675 8419 -282512 -26050 279927 45544 -275403 -62797 271836 80604
721 80604 -264041 -97931 257172 115490 -248407 -129742 239916 146432 -228173 -159487
731 -159487 217829 174002 -205026 -187338 193514 200050 -177983 -209026 163314 220338 -149215
742 -149215 -229228 133728 238162 -116623 -243633 100381 251373 -83609 -254008 67869
752 67869 258142 -48455 -259379 32448 261905 -13834 -260863 -2508 260529 20749
762 20749 -257824 -36610 256230 53383 -250716 -69197 245567 85706 -238977 -100688
772 -100688 232057 115602 -222184 -129443 213089 143560 -202231 -156499 192454 168549 -180191
783 -180191 -179899 167617 190135 -155301 -198723 141337 208073 -126889 -214981 112428 221525
794 221525 -96937 -226961 81072 232604 -64502 -236729 50278 239034 -33568 -239193
804 -239193 18703 241723 -2671 -239028 -11947 237682 28390 -232579 -43981 229780
814 229780 60318 -224216 -74923 219815 90001 -213120 -102909 206765 116224 -197538
824 -197538 -127381 188834 139268 -179398 -148751 168105 159655 -155208 -169991 142799 179838
835 179838 -129401 -187183 118726 196328 -105634 -200708 93443 207056 -78324 -210413
845 -210413 65446 213506 -51021 -215117 36158 215648 -20050 -216212 4896 217104
855 217104 9828 -214822 -23476 214579 37971 -211957 -49432 208227 62765 -202611
865 -202611 -75609 196309 87635 -187686 -98922 179455 112293 -171045 -124331 162304
875 162304 136004 -152767 -145989 144121 155278 -133954 -161853 124849 168468 -112196 -173663
886 -173663 99715 178844 -86246 -182899 72835 187526 -58521 -192696 45278 194453
896 194453 -32224 -197828 20436 198880 -8355 -198498 -2975 196311 15728 -192847
906 -192847 -28425 188722 42375 -184653 -55592 179972 69013 -175640 -80798 170123
916 170123 92840 -164900 -102031 159933 110199 -151588 -119289 142015 126785 -131635 -134251
927 -134251 120013 142130 -110484 -148369 99983 157441 -87736 -162862 77199 169356 -66998
938 -66998 -171626 57855 174628 -46359 -175251 35002 175541 -21843 -174755 9564
948 9564 174923 4542 -174001 -16662 173639 29673 -172386 -40335 170716 49476
958 49476 -167295 -58093 162260 68071 -155450 -77389 148257 87019 -139976 -98127 132265
969 132265 107212 -124728 -115472 117364 124814 -109741 -132232 103089 137992 -93471 -142128
980 -142128 84444 144821 -73955 -147889 62229 150563 -50979 -153991 38974 156654
990 156654 -26745 -159769 16763 161690 -6029 -161937 -2561 162663 12238 -159081
1000 -159081 -22320 156239 31530 -151599 -41591 147135 53760 -141294 -63640 138255
1010 138255 74293 -133127 -83160 129276 91171 -123406 -97812 116907 104418 -110063 -110174
1021 -110174 101499 114720 -92039 -119959 80940 127127 -71623 -132181 62570 137192 -53510
1032 -53510 -141033 45011 144620 -36988 -145934 27511 144858 -18021 -145177 7445
1042 7445 143539 2618 -142588 -12437 141355 22984 -139911 -32958 138432 42991
1052 42991 -136660 -51080 133800 58768 -129638 -65223 123271 72431 -116328 -80441 109256
1063 109256 87366 -102688 -95616 95599 101949 -88379 -108504 82266 114286 -74288 -118568
1074 -118568 67089 122275 -59754 -124015 51218 127257 -41448 -127425 31258 129801 -21279
1085 -21279 -131296 12960 132527 -2329 -133507 -4032 133738 13709 -131750 -20718
1095 -20718 129655 28932 -125973 -36532 123281 46609 -118287 -53488 114596 61567 -110068
1106 -110068 -69340 104932 77328 -101221 -83285 95848 89359 -88900 -93719 83190 98552
1117 98552 -76084 -103368 68295 106423 -59593 -110457 51872 114350 -43905 -117869 35989
1128 35989 120287 -27466 -121103 20322 122336 -12177 -121969 5701 121797 3702
1138 3702 -121257 -11814 119112 19439 -116949 -28237 114963 36638 -113124 -44465 109691
1149 109691 50922 -105965 -58009 102762 64667 -97001 -70111 90978 75801 -86516 -81708
1160 -81708 80639 87149 -73874 -91992 67126 95463 -61385 -100921 54444 104248 -47591
1171 -47591 -106777 40730 108314 -34490 -109738 26600 111635 -17268 -111490 10628 113111
1182 113111 -2054 -112386 -5697 112851 13063 -110630 -20361 110544 27844 -107659
1192 -107659 -33839 104831 41081 -102301 -47377 97975 53610 -93087 -59434 90321 65649
1203 65649 -83701 -71998 79815 77222 -74070 -80898 68187 85341 -62690 -89300 56820
1214 56820 93122 -49885 -95821 43106 98815 -35967 -100997 30129 103313 -22401 -103404
1225 -103404 15854 104573 -9106 -104697 1268 104904 4611 -103817 -12027 102570
1235 102570 19129 -101374 -25352 99364 32763 -95613 -39035 93767 44545 -90593 -50652
1246 -50652 87636 58083 -82924 -62168 79179 66569 -73559 -70730 68633 75778 -62850
1257 -62850 -79400 57715 83556 -52847 -87506 46908 89605 -40663 -92500 34631 95048
1268 95048 -27092 -96293 21100 97571 -14153 -97179 7343 99417 60 -96519 -4490
1279 -4490 96842 12303 -95866 -17429 95098 24181 -91634 -29819 89509 36083 -87053
1290 -87053 -42972 84544 47154 -81892 -53142 78251 57366 -72968 -63187 68999 67799
1301 67799 -64526 -70526 59371 75319 -54044 -78399 48521 81783 -43574 -83608 37818
1312 37818 85877 -31807 -86895 24857 88979 -19203 -91627 13377 91218 -8060 -91804
1323 -91804 1363 91378 4300 -90391 -9860 89410 16155 -87891 -21657 85970 27963
1334 27963 -84301 -34045 82131 38418 -79170 -44637 75618 48956 -72215 -53642 68292
1345 68292 57751 -65517 -61518 60241 65259 -55401 -69552 50917 72407 -45398 -75322
1356 -75322 39779 77466 -35585 -79979 28380 81397 -23795 -84151 19361 84736 -14290
1367 -14290 -84793 8525 84857 -2188 -83733 -3519 84214 9935 -81757 -15757 82590 21781
1379 21781 -80840 -25363 79488 31759 -77772 -35529 75541 40419 -71479 -43896 67163
1390 67163 49089 -64260 -52967 59803 57770 -55442 -61199 51914 64793 -47468 -68164
1401 -68164 43185 70976 -38538 -73071 35194 74433 -29619 -74296 24122 76808 -17878
1412 -17878 -77702 12814 78086 -6708 -80223 764 79564 3435 -80860 -8400 79201 13339
1424 13339 -77732 -16847 75938 21270 -72715 -26928 70407 33475 -67688 -37780 65827
1435 65827 43448 -62907 -47213 60926 51137 -57987 -53058 54841 55750 -50934 -58073 47091
1447 47091 61328 -41406 -62621 35526 66114 -29909 -69004 25042 71398 -20306 -73429 17754
1459 17754 75039 -13510 -75765 10317 74128 -4985 -73495 -126 72707 5937 -71474 -12170
1471 -12170 69481 17175 -70331 -24053 68628 27703 -68800 -31427 67398 34111 -64289 -36888
1483 -36888 61205 39444 -58195 -43919 51981 47081 -48379 -51394 43648 56447 -41170 -60940
1495 -60940 38052 63349 -35385 -66112 33465 65571 -28966 -65468 24677 64477 -19436 -64159
1507 -64159 12903 65816 -6798 -66773 -124 68479 3502 -70229 -7618 70663 11572 -70429
1519 -70429 -12944 69048 16676 -64964 -19500 61639 23332 -58481 -30163 55136 35407 -52702
1531 -52702 -41086 51309 45462 -50872 -48768 48962 50641 -47468 -51537 44066 51417 -39433 -52727
1544 -52727 33571 53787 -26853 -56561 21188 60395 -16914 -63773 12592 65804 -10578 -67600
1556 -67600 8209 67935 -6948 -65954 3978 62552 344 -60031 -6353 57785 12405 -57798
1568 -57798 -19707 56563 24477 -57345 -30199 58624 32753 -58699 -32859 56390 34533 -54223
1580 -54223 -34526 48109 36787 -43194 -39480 37545 44039 -32044 -49857 29821 53766 -27587
1592 -27587 -58317 26573 59609 -26395 -59629 24481 57881 -20870 -55439 15904 53773 -8611
1604 -8611 -52636 2568 54483 4090 -56505 -9524 59611 12284 -62230 -13711 62039 14648
1616 14648 -59644 -15090 56861 17727 -51821 -20185 47113 26089 -42596 -31776 40864 38379
1628 38379 -39123 -42988 38609 46019 -39367 -47967 40005 47668 -37489 -46382 34452 44466 -28185
1641 -28185 -44820 20804 46251 -14026 -50234 9363 53812 -5436 -58319 3904 60228 -3506
1653 -3506 -60748 2616 58105 -2170 -55062 -694 51308 5670 -47240 -11876 45074 19382
1665 19382 -44803 -25082 45618 29690 -48731 -32294 49431 33772 -49374 -31975 47212 30764
1677 30764 -41445 -30540 35785 33531 -29825 -37486 24545 42046 -20987 -48405 19090 52073
1689 52073 -19561 -55026 19081 54179 -19272 -52155 17884 48337 -12116 -45295 6904 43561
1701 43561 -402 -43979 -7395 46279 12944 -49068 -14968 52351 16299 -54006 -16734 53892
1713 53892 15703 -49886 -15403 45332 17809 -38701 -21092 34123 26673 -30994 -33239 28704
1725 28704 39924 -29548 -43168 31452 45632 -31683 -43848 31749 41704 -29453 -38958 23838
1737 23838 36655 -16303 -37783 9624 41001 -4248 -44353 -959 49794 862 -52155 -1857
1749 -1857 53113 -42 -52288 12 48560 1832 -44682 -5046 38501 10929 -36237 -16238
1761 -16238 34696 24329 -35288 -29091 38127 31860 -40444 -32242 41831 31588 -40022 -28819
1773 -28819 36407 27782 -30206 -27489 24526 30807 -17611 -35356 14046 41617 -11682 -45959
1785 -45959 11473 48182 -13140 -48566 14833 46481 -13504 -43436 11036 38560 -5006 -36107
1797 -36107 -1830 35395 8188 -37095 -13851 39152 17166 -42851 -20274 45730 18597 -46332
1809 -46332 -15250 43691 15460 -38856 -15740 33648 19016 -28224 -23421 23593 29723 -21797
1821 -21797 -35185 21793 39009 -22941 -41546 24940 40467 -25479 -38786 22907 35379 -20002
1833 -20002 -32904 13504 32060 -6518 -33409 -323 37024 4765 -41551 -5510 46163 5216
1845 5216 -46387 -3819 45518 3372 -42845 -3612 37944 5467 -33796 -8854 29464 15667
1857 15667 -27186 -23005 28112 27952 -29666 -30799 32530 31349 -34113 -30054 32214 27831 -30172
1870 -30172 -24955 26823 24646 -20119 -27154 13681 29951 -9314 -34573 6997 40105 -5708
1882 -5708 -43807 7708 44472 -9042 -42230 8448 39536 -7385 -35047 3390 32198 1955
1894 1955 -30099 -7342 29493 13105 -32833 -18279 35054 18791 -37202 -19887 38249 18093
1906 18093 -37447 -16018 34362 15849 -30002 -16801 23208 20270 -18335 -25424 16589 31152
1918 31152 -16540 -34938 17172 37191 -17549 -37024 19823 36016 -18912 -33055 15901 29643
1930 29643 -11617 -28389 5059 28529 -60 -30259 -5156 33783 8281 -36829 -7891 39395
1942 39395 6914 -39083 -5874 37258 6337 -33823 -6350 29951 10085 -25459 -14282 22871
1954 22871 19023 -21015 -23911 23367 28129 -25269 -29514 26715 28768 -26084 -26886 24748 24972 -21242
1968 -21242 -23687 15751 24780 -11322 -26647 6464 29781 -3754 -33465 2569 36478 -2593
1980 -2593 -37818 4090 37291 -4393 -34300 4693 31634 -1740 -28743 -2962 26645 6623
1992 6623 -24967 -12646 27875 16734 -28960 -18999 30779 19204 -31341 -18268 30980 17107
2004 17107 -28637 -16507 25339 17353 -21436 -19322 17203 21531 -14102 -26211 12245 28741
2016 28741 -12085 -32682 12937 33223 -13436 -31434 12539 30951 -11337 -28477 8389 25845
2028 25845 -4158 -25056 -595 27183 4217 -28287 -8114 31427 9140 -33248 -8857 33112
2040 33112 8337 -31890 -8011 30182 7937 -25992 -10080 23109 13271 -20241 -17095 18468
2052 18468 21591 -17904 -24379 19497 25276 -20789 -25980 20684 25283 -19456 -23851 17176 22164
2065 22164 -13598 -22527 10578 22687 -6212 -24577 2457 28040 -908 -30291 577 31675
2077 31675 -1761 -31816 915 30539 -625 -28395 -501 25840 4083 -22415 -6921 22612
2089 22612 10887 -22643 -14479 23315 16030 -24308 -17205 24996 17013 -25312 -17614 23825 16959
2102 16959 -21565 -17299 18347 18260 -14210 -19504 11805 22921 -9978 -25442 8429 27734 -8770
2115 -8770 -28518 9052 28188 -9207 -25921 7715 24832 -5478 -23670 2534 22117 1357
2127 1357 -23462 -4163 24284 6432 -25078 -8912 26920 9117 -26161 -9651 26233 8882
2139 8882 -24953 -9437 22899 9790 -20118 -13162 18656 15578 -16231 -17588 15426 21094 -15828
2152 -15828 -21565 15502 22170 -15957 -22711 14562 22060 -13438 -20236 11224 20965 -8155 -21241
2165 -21241 5189 22745 -2073 -25008 420 25013 75 -25285 -1350 26025 1158 -26077
2177 -26077 -1461 25325 2878 -23025 -5027 22809 6983 -20383 -9462 20394 12714 -19491
2189 -19491 -14756 19494 16074 -21043 -16385 19011 15524 -19062 -15830 16776 16343 -14462 -16769
2202 -16769 13255 17920 -10571 -19753 8771 22135 -7536 -22568 5752 23696 -6380 -24788
2214 -24788 5477 23388 -3563 -22892 2985 22066 -522 -21559 -1313 21255 3316 -20978
2226 -20978 -5530 21958 7668 -21792 -8301 21885 9272 -21733 -9100 20923 9550 -19033
2238 -19033 -10691 17609 12463 -15553 -13238 15161 16219 -13250 -17018 11950 17915 -12262 -19121
2251 -19121 12035 20084 -10995 -19792 9667 20593 -8444 -18703 6033 19505 -3415 -19345
2263 -19345 1320 20413 -212 -21281 -891 22842 1454 -23080 -2537 20272 2877 -21321
2275 -21321 -4613 19575 5983 -19097 -6849 18126 9822 -16634 -10472 16634 11810 -16035
2287 -16035 -14431 15848 13556 -16103 -14771 15583 14582 -13497 -15876 12252 15585 -10235 -16575
2300 -16575 8538 18075 -6643 -18639 6841 18892 -4441 -20037 4280 19850 -3522 -19684
2312 -19684 1917 20035 -1270 -19256 -720 19077 2947 -18513 -3386 18932 5152 -18357
2324 -18357 -6877 17363 6791 -18510 -8914 17170 9192 -17292 -10368 15716 11200 -14792 -11976
2337 -11976 12535 12188 -12700 -13578 11892 14866 -10469 -15976 9771 17263 -8660 -18024 7874
2350 7874 16885 -6764 -17437 5629 17128 -3761 -17736 3385 17431 -1569 -18349 -240
2362 -240 18445 1332 -17941 -2518 18850 3275 -18029 -4044 17905 4929 -16487 -7405
2374 -7405 16018 8655 -14706 -8886 14661 9875 -13528 -11773 13401 11979 -12744 -12077 12620
2387 12620 13340 -11199 -13201 10526 14682 -8235 -14452 7890 14653 -6819 -15606 6740 16169
2400 16169 -4867 -16203 3405 17347 -2609 -16306 1635 17254 -1263 -16572 -1161 16232
2412 16232 1956 -17112 -3632 16615 4066 -15708 -5267 15113 5775 -15599 -6849 14993
2424 14993 8070 -14359 -9149 13817 9398 -13007 -10841 12559 11810 -11547 -12381 9838 13096 -9576
2438 -9576 -13090 9008 14021 -7783 -13538 6394 15053 -5893 -14839 4668 15088 -4550 -14649
2451 -14649 2474 15935 -1477 -15069 1065 16069 708 -16019 -1008 16016 2342 -15718
2463 -15718 -3854 15518 4625 -14894 -5239 14064 6929 -14001 -7225 12958 8459 -13036 -8859
2476 -8859 11346 9043 -11355 -10030 11046 11224 -9933 -12619 9075 12175 -8419 -12997 7067
2489 7067 13247 -6124 -13892 5978 13577 -4384 -14399 3924 14861 -3399 -14466 1905 15074
2502 15074 -345 -15206 -643 15231 765 -14615 -2803 14950 3043 -14380 -3536 13220
2514 13220 4477 -13013 -6447 13533 7035 -12627 -7181 12036 8873 -10678 -9176 10718 9078
2527 9078 -10374 -10573 9044 11042 -7385 -10926 7841 11576 -6619 -12289 5786 13000 -5714
2540 -5714 -13965 4586 13400 -3829 -12818 1915 14249 -1339 -13171 1153 14025 350 -13391
2553 -13391 -928 13365 1216 -13237 -3191 14065 4661 -13817 -4264 12243 5231 -12141
2565 -12141 -5434 12372 6443 -12046 -8196 10460 8206 -10069 -8082 9265 8975 -8803 -10982
2578 -10982 7472 10339 -7314 -11730 5978 10668 -5754 -11392 4540 12580 -3768 -11887 3639
2591 3639 12671 -2247 -11564 2871 13107 -267 -13251 299 12624 802 -12275 -1967
2603 -1967 12258 3239 -11639 -3934 11703 4395 -12234 -5350 11011 5705 -10530 -6113 9946
2616 9946 6777 -9776 -7736 10184 8165 -8064 -9138 9364 8719 -7894 -9715 6637 10206 -5276
2630 -5276 -9958 5253 11538 -4733 -10637 4178 11003 -2628 -11548 2310 11839 -1349 -12004
2643 -12004 915 12001 -217 -11374 -636 10779 1043 -11609 -2388 11690 3987 -11125
2655 -11125 -3941 10521 4587 -10813 -4755 9645 5407 -10324 -6983 9637 6413 -7893 -7584
2668 -7584 8231 8009 -7761 -8352 7147 8850 -6377 -8575 5602 10603 -5188 -9578 5192 10720
2682 10720 -3632 -10529 3512 11031 -2392 -11644 1478 10413 -1485 -10878 -238 10370 1261
2695 1261 -10584 -664 10784 1527 -11303 -3209 10970 3097 -9679 -3853 9463 4779 -9822
2708 -9822 -5573 9224 5105 -8001 -6591 8221 6455 -7320 -8086 6937 8613 -6609 -7964 6299
2722 6299 8638 -5295 -8009 4613 8561 -4397 -10021 3483 9599 -3649 -9452 2240 9686
2735 9686 -2243 -9974 1606 10619 -777 -10266 -605 10784 315 -10011 -2525 9828 2357
2748 2357 -9220 -2992 9062 3860 -9264 -5029 9272 5335 -8027 -5243 8355 5566 -7655
2761 -7655 -6203 6944 7030 -6355 -7521 5821 7665 -5512 -8692 5260 8584 -4855 -8113 3590
2775 3590 8383 -4657 -8472 3749 9128 -2392 -9194 1248 9141 -741 -10196 -46 9762 969
2789 969 -9404 67 8610 1431 -8671 -3137 7649 2408 -9366 -4109 8595 3507 -8163 -5266
2803 -5266 7757 5192 -7912 -5570 7481 5625 -7535 -6496 6918 7018 -5835 -6857 5653
2816 5653 7330 -4219 -7392 3938 8164 -4193 -8038 3009 8317 -2496 -8656 2352 8368
2829 8368 -2355 -8201 1331 8650 -415 -10144 124 7943 657 -8989 -1246 8876 2269 -7709
2843 -7709 -2307 8412 3527 -8077 -3338 8461 3420 -6915 -4221 6556 4353 -6707 -6100 5474
2857 5474 6102 -5604 -6299 4784 5977 -4841 -6699 5147 7577 -4241 -7949 3812 8057 -3899
2871 -3899 -7866 2730 8892 -2405 -8163 1170 7712 -334 -7893 345 7491 619 -8026 -779
2885 -779 7498 394 -7613 -2002 7343 2429 -7199 -2135 7627 2716 -7374 -2663 7532 4053 -6132
2900 -6132 -5735 6212 4230 -5707 -5141 5989 6496 -5388 -5517 4709 6323 -4819 -6926 3816
2914 3816 6591 -3818 -6959 2793 7284 -2446 -7950 2172 7905 -1185 -8252 837 7440 -970
2928 -970 -7460 15 7272 177 -7406 -476 7067 1888 -7225 -2700 7443 2847 -6033 -3429 6740
2943 6740 3760 -6859 -3852 6955 3858 -6249 -4767 4695 4689 -5529 -5159 6080 4711 -4063 -5651
2958 -5651 4120 6606 -4131 -5345 3973 6381 -2760 -6175 2524 6877 -2430 -6969 1205 7248 -1136
2973 -1136 -7809 -155 6677 373 -7090 -242 7040 1075 -7286 -1486 6883 1061 -6150 -2262 6348
2988 6348 2590 -6472 -2306 5243 3312 -6364 -3886 5877 5510 -5225 -4251 5079 5055 -4692 -5326 4644
3004 4644 4953 -4003 -5951 3441 5948 -3290 -6148 3003 6070 -1833 -6067 1863 6434 -864 -6265
3019 -6265 341 5817 -822 -6839 -342 6883 697 -6122 792 6664 1084 -6613 -1776 5675 2132
3034 2132 -5983 -3151 5510 2722 -5494 -3498 5917 3254 -5108 -2591 5333 4372 -4428 -4824 5177
3049 5177 4145 -3804 -5073 4128 4914 -3121 -6260 2901 5913 -2704 -5885 1226 4486 -3127 -5792
3064 -5792 1645 6908 -777 -6098 1081 6303 -707 -6633 -641 5301 70 -5902 -748 5184 1796
3079 1796 -5741 -2454 5805 2142 -5791 -2725 6140 3375 -5180 -2643 5405 3157 -5130 -4213 3621
3094 3621 4636 -4320 -4692 3367 4256 -3522 -4507 3135 5289 -3315 -5341 2785 5159 -2109 -5294 1594
3110 1594 5844 -1609 -6143 365 6037 -1332 -6197 145 5288 -150 -5683 378 5740 529 -5575
3125 -5575 -1447 5175 1291 -5322 -1330 5270 2743 -4867 -2879 5771 3317 -4679 -2614 3966 4107
3140 4107 -4991 -3079 3080 3764 -3787 -3990 3392 4878 -3014 -4492 3099 4646 -2624 -4352 2686
3155 2686 4901 -2097 -5187 2375 4619 -664 -4476 1289 5793 44 -4844 202 5279 353 -5320
3170 -5320 -507 5725 795 -5846 -1242 5793 1791 -4732 -1829 5110 2650 -5055 -2554 4977 2814
3185 2814 -4396 -3718 3810 4140 -2969 -3496 2938 3381 -3178 -3393 3545 4678 -2686 -5041 1436 3843
3201 3843 -1864 -4624 2077 4669 -847 -3776 672 4869 -1175 -5881 444 5555 -582 -4493 -471
3216 -471 4568 725 -5262 -543 4681 409 -4929 -1568 5265 1619 -4586 -1365 4458 2925 -4342
3231 -4342 -2435 3981 3004 -4394 -3263 4354 3142 -3694 -4262 3497 3802 -3314 -3316 2455 3571 -1373
3247 -1373 -4603 874 4540 -1555 -3622 2017 4453 -661 -5137 1088 4780 -373 -4863 739 4601
3262 4601 -335 -4028 -1216 4210 840 -4294 -815 4335 975 -3984 -1966 4224 1693 -4398 -1683
3277 -1683 3726 3603 -2704 -1940 2904 2932 -3532 -3438 2572 3218 -1570 -4237 2070 4135 -2891 -5186 2749
3294 2749 3787 -1647 -3752 1240 4084 -2029 -4201 1192 4055 197 -3510 -389 3742 370 -4314
3309 -4314 -574 4859 -24 -4848 -455 4515 654 -4622 -339 3953 1253 -3533 -929 4071 1599
3324 1599 -3733 -1199 3793 1611 -3086 -2587 3335 3160 -3852 -3260 2730 3377 -3411 -3495 3263 2771 -1146
3341 -1146 -2830 2111 3578 -1230 -3940 1047 3918 -379 -3817 -717 4721 -882 -4283 1589 3906
3356 3906 123 -4260 -370 4186 590 -4235 -657 4041 851 -2836 -1527 3595 2147 -3744 -1708
3371 -1708 3947 1809 -3749 -1516 3912 1830 -2779 -1420 2981 2893 -2392 -3595 1726 3408 -2116
3386 -2116 -3692 980 3730 -1580 -4186 1777 4029 -1995 -3270 1057 3700 -1137 -3783 170 3966
3401 3966 -57 -3064 -223 3362 304 -3831 -354 3178 828 -3356 -1090 4023 -85 -4588 -1221
3416 -1221 2909 1143 -2770 -1239 2530 1574 -2065 -2072 2607 2896 -2462 -3203 2212 3357 -2117 -2552 1468
3433 1468 3333 -2481 -2038 1501 2900 -1705 -3049 302 2571 -1249 -2743 1153 3987 -1253 -4397
3448 -4397 312 4180 -853 -3808 283 3391 -39 -2715 -707 2597 1639 -1964 -530 2300 1820
3463 1820 -2881 -2248 3214 1936 -2791 -1289 3902 2460 -3192 -1699 2088 1107 -2026 -2666 1956 2078
3479 2078 -2623 -2489 1261 3392 -1343 -2806 1293 3446 -662 -3111 491 2988 -1235 -2814 1209
3494 1209 3645 494 -3289 -882 2375 994 -2990 -155 3300 796 -3374 -1144 3421 2252 -3482
3509 -3482 -968 3782 1236 -3409 -1427 2454 2343 -1552 -1573 1994 2145 -3062 -2605 2504 2211 -1938
3525 -1938 -3121 1949 2679 -1635 -2831 1455 2567 -2194 -2166 1503 2169 -1322 -2406 -125 3257 -573
3541 -573 -2739 -555 2841 385 -3904 398 4161 -175 -3792 -688 2675 1045 -3394 -973 2227
3556 2227 1757 -1914 -1369 2969 1745 -2631 -1687 3110 2015 -3150 -1256 2283 1733 -1716 -1416 2142
3572 2142 1664 -1536 -1859 1019 2233 -197 -1933 950 2803 -115 -2722 1609 3934 -250 -3526
3587 -3526 1602 2439 96 -1360 194 1264 818 -2185 -366 2533 936 -2221 -1741 3672 610 -2474
3603 -2474 -544 3715 1462 -2960 -1049 2725 263 -2340 -1385 1817 1089 -1893 -2074 2106 1472 -2093
3619 -2093 -2735 1264 2780 -1982 -2286 1410 1958 -1567 -1858 1233 1632 -878 -2432 1091 2136 142
3635 142 -1645 -425 2085 -348 -2957 -291 2466 -580 -3216 230 3476 19 -1714 172 2098
3650 2098 829 -1373 -1450 2186 532 -1112 -1743 1663 1074 -1696 -1864 2633 1497 -2617 -2430 1854
3666 1854 1895 -1567 -1265 1422 1583 -1403 -1646 1309 2856 -1436 -2030 1164 2520 -1595 -2398 665 3393
3683 3393 -763 -2803 425 2263 -543 -2463 128 1739 821 -1831 -807 1913 2118 -2230 -1993 2282
3699 2282 361 -2906 -1617 1529 951 -1644 -1135 1792 1853 -2021 -1432 1206 524 -356 -1220 2043 2607
3716 2607 -621 -2417 1343 2269 -996 -2478 822 1906 -905 -2680 52 2426 253 -2413 10
3731 10 2961 638 -1411 -623 2534 610 -2657 -291 2457 753 -2005 -270 2005 1320 -2300 -1302
3747 -1302 1828 1623 -1802 -1482 1467 1703 -1210 -2661 1384 1003 -1931 -1845 1399 1641 -1428 -930 1732
3764 1732 1337 -788 -1979 1028 2195 -1035 -1712 602 2598 -596 -2569 -353 2341 -354 -2863
3779 -2863 -315 1671 -720 -2450 230 1925 -155 -2101 -449 1816 659 -2190 -667 1777 630
3794 630 -2277 -868 2243 1717 -1991 -767 1566 654 -1801 -748 902 1664 -1095 -1416 1588 1642 -238
3811 -238 -1729 1162 1383 -587 -1737 1646 2253 -342 -2017 1023 1624 -344 -2272 878 1983 -314
3827 -314 -1369 -1028 2098 999 -2304 -1031 2514 330 -1991 -59 1739 275 -2589 -454 1888
3842 1888 856 -1185 -97 1003 1506 -1434 -1035 1024 1624 -918 -1462 774 2017 -1438 -1204 1501
3858 1501 2467 -1010 -1644 1088 2183 214 -2480 353 1850 -95 -2276 751 2849 -341 -2033
3873 -2033 426 2135 25 -2910 559 2560 27 -2038 826 1310 341 -1696 -866 1005 1885 -1287
3889 -1287 -1155 1676 1847 -2695 -1265 2089 1112 -2448 -757 1647 824 -1561 -1469 1908 1871 -863 -1672
3906 -1672 411 1998 -111 -2019 394 1795 -1326 -2240 -173 1950 -222 -1552 -342 1063 -1125
3921 -1125 -2167 680 887 -402 -1921 -1146 1581 447 -2126 -805 1443 684 -2035 2 1163 283
3937 283 -1486 -885 1624 602 -989 -846 714 1248 -453 -1141 621 1192 -985 -1039 685 1656 -1175
3954 -1175 -1613 739 665 -742 -1257 326 1840 447 -1672 239 1591 -620 -1202 448 3033 -748
3970 -748 -1480 -963 2027 -9 -1764 -76 2293 244 -1675 -494 2084 462 -1490 -30 1477 1382
3986 1382 -1074 -738 1408 644 -276 -761 401 666 -1428 -1270 662 717 -733 -1527 1147 754 -525
4003 -525 -1560 -677 1567 65 -117 -160 1317 -283 -1239 81 1409 160 -1123 -45 1417 -211
4019 -211 -1885 -569 984 1036 -1285 -900 1031 726 292 -959 1300 708 -2012 -544 1570 824 -119
4036 -119 -1615 1013 938 -747 -1833 769 660 -960 -672 970 1487 -975 -1702 910 939 -453 -1412
4053 -1412 333 767 -538 -1046 -354 2070 465 -320 -162 698 -233 -1611 -496 1355 -105 -1226 -484
4070 -484 1709 1324 -1980 -853 1265 879 -1093 -579 1467 962 -1057 -1535 1462 1407 -704 -1450 1773
4087 1773 878 -1131 -867 290 1385 -260 -1458 555 1567 -1661 -575 254 1421 -153 -1722 495
4103 495 1443 -1375 -819 705 445 702 -1440 690 1140 -684 -1717 341 1046 750 -1969 -1041 1470
4120 1470 403 -762 564 1217 918 -838 -862 602 1222 -37 -1027 1627 907 -729 123 463 1033
4137 1033 -365 -940 313 1448 -495 -30 1145 856 -868 -2089 71 625 -199 -1491 539 741
4153 741 466 -1077 -96 1551 -121 -1059 -645 1189 172 -1343 -899 1400 639 -778 -484 1282 403
4170 403 -1658 -649 683 304 -1309 -702 962 97 -1983 -706 397 545 -1093 -650 833 1975
4186 1975 -1247 -1455 1847 1022 -422 -1658 1149 645 -761 -1385 615 668 -894 -1694 -382 1515 147
4203 147 -1265 -23 1794 262 -339 -103 1485 160 -1928 -241 1871 869 -885 -717 1332 77
4219 77 -827 -934 482 280 -663 -1007 923 1430 -760 -1107 536 448 -841 -180 407 750 -702 -1124 334
4238 334 884 -1003 -1320 -782 1685 814 -206 362 1065 -942 -585 213 372 -142 -1011 385 1226 524
4256 524 -991 466 867 425 -467 -151 362 654 -452 -405 839 222 -1151 -559 513 -233 -536 -466 585
4275 585 882 -1385 -1139 -25 390 275 -1210 1105 1247 51 -839 446 628 -365 -313 593 1113 288
4293 288 -400 299 1106 279 -1003 -967 450 472 -1574 -800 809 -1062 -2161 46 583 164 -1112 -306
4311 -306 526 388 -375 -892 723 -19 -509 -979 906 -203 -917 -57 159 128 -795 -946 397 1177 -287
4330 -287 -855 963 1830 -1394 -1037 33 1232 -594 -1534 121 197 -247 -868 126 839 468 -1397 6
4348 6 955 -74 -612 -464 -375 751 -268 -835 856 -71 -1222 -902 890 431 -2167 137 496 1058
4366 1058 12 323 617 747 -285 -871 788 520 -542 -212 671 1779 296 -451 582 1788 388
4383 388 -1845 736 271 136 -613 135 449 254 -936 -621 144 -474 327 55 332 -618 113 169 1104
4402 1104 370 -1121 84 631 -198 -328 -747 28 532 411 -725 228 411 -952 -163 -221 1161 -803
4420 -803 -587 23 771 -414 -1229 547 1165 209 -984 392 1160 55 -148 -600 1405 -130 -890 32
4438 32 279 243 -636 -5 310 -143 -453 -130 1427 83 -1065 -506 997 -805 238 -1222 407 -84
4456 -84 -503 -762 1004 96 -1221 154 270 966 -111 -589 466 716 -291 -559 907 547 -1393 -660
4474 -660 362 1034 -93 -731 324 1093 470 -861 -470 45 22 -531 -639 988 238 -527 -147 61 687
4493 687 -1202 -691 780 1051 -870 -468 424 473 287 -195 1617 1138 -797 -591 373 201 -577 -968 626
4512 626 863 -305 -711 516 55 -51 -292 960 -34 -19 -1037 -1234 849 335 -393 -80 805 377 -528
4531 -528 400 788 -133 -769 39 1420 531 -700 -84 1151 -315 -371 -706 230 -476 -106 -387 246 257
4550 257 -453 -30 275 856 -878 -897 -25 257 356 -233 1128 128 -555 -111 750 911 -1006 -267 159
4569 159 16 -795 -7 982 -114 -473 158 -308 444 -167 321 950 814 379 0 760 634 1326 -1354
4588 -1354 -19 817 -624 -504 -1143 915 -211 22 -269 43 42 -840 -18 61 459 -37 -576 -251 734
4607 734 -49 105 935 263 -206 204 1191 -261 -572 -220 -195 145 368 -238 -350 1014 696 -450 -164
4626 -164 1148 196 -310 215 428 464 498 225 137 0 -605 259 211 25 -624 -228 252 999 -821 -740 1038
4647 1038 189 -750 178 -346 648 -595 -649 650 286 -587 -449 726 750 -293 -539 222 969 -355 251
4666 251 371 772 -485 -870 520 668 -519 -522 -699 163 -22 -597 24 281 -472 -128 44 182 76 -1178
4686 -1178 273 610 -269 -32 -16 1249 -323 -823 -1058 861 858 -711 -227 646 -172 626 114 -536 701
4705 701 -17 -613 613 -184 -237 207 664 501 552 252 -892 239 -15 -333 -378 1180 377 -468 -105 -64
4725 -64 320 35 -70 293 423 92 -162 1167 204 127 -362 956 782 539 346 -62 447 -647 -910 646
4745 646 228 -536 -430 24 795 -64 -144 697 -137 -624 -304 277 383 -148 227 -582 -68 45 -526 -462 926
4766 926 206 -128 -587 220 -249 -12 -367 -1004 276 -908 -448 -354 -170 -902 -233 332 1276 -513 -81
4785 -81 1039 1205 -831 -103 597 696 -621 -348 846 198 7 401 724 284 -127 -766 647 488 125
4804 125 -59 -6 534 204 -1297 -126 -223 -144 -362 503 1033 214 -150 81 777 317 750 -399 441 745
4824 745 1017 -58 -579 119 -803 -224 707 280 -96 -448 252 507 132 -235 542 92 -672 -718 -380 -314
4844 -314 -563 -1204 355 478 -612 -468 119 515 -765 -428 746 -1 -396 -990 612 769 102 -291
4862 -291 232 10 370 -8 639 -90 360 -1214 -3 52 61 -401 269 -183 -221 -256 -584 1158 -1126 -1119 -108
4883 -108 48 -643 -1531 -49 1087 -331 -112 362 408 -80 -343 -453 408 -561 -253 -722 585 638 -184
4902 -184 -96 133 448 1088 -245 -830 407 306 181 50 266 442 732 -69 944 324 -145 -159 81 606
4922 606 -22 -442 74 -1053 517 -806 787 809 -883 123 1047 641 84 -399 50 241 943 312
4940 312 766 306 854 318 -11 -243 257 -2 17 38 -511 320 674 832 292 -486 -396 322 24 356 -260
4961 -260 1229 11 221 742 -14 -6 492 52 -52 83 -1384 -340 248 319 407 -163 149 -155 56 11
4981 11 421 -312 -55 279 262 257 -453 -410 -112 833 46 -355 -93 21 -553 -56 994 141 716 110 784
5002 784 -581 13 306 -376 440 -36 -223 -759 479 -16 -6 -171 987 488 -446 -190 305 110 -294
5021 -294 -137 -105 226 -844 -508 -8 588 211 -570 -13 379 -840 -991 102 983 -553 -54 310 647
5040 647 -223 -249 -640 433 295 -812 656 -404 24 -573 1067 732 199 -551 -226 -64 719 -702
5058 -702 -577 -12 179 -776 578 819 875 -305 -441 205 -49 -258 58 1054 360 -900 -341 114 450
5077 450 348 168 323 96 259 -427 -394 -144 58 294 10 1211 -239 -687 294 232 83 -266 624 256
5097 256 -208 -300 959 203 -578 168 283 562 -262 66 -55 215 -322 -387 -1249 490 433 -190 -644 -9
5117 -9 -188 247 -1014 -411 482 -509 131 -129 281 -130 -583 183 -148 11 -446 -356 449 -848 -204 -560
5137 -560 546 -116 -277 717 546 103 -493 827 359 -391 -817 -704 139 -116 268 -364 -200 -81 -486
5156 -486 -119 291 -162 -909 -9 109 463 -574 -913 1234 963 700 347 -44 321 -122 -174 -509 124 373
5176 373 179 -58 1533 585 -457 -709 785 449 -348 70 698 664 -995 297 495 752 296 -52 354
5195 354 -1075 -638 409 -516 394 -423 -134 372 277 -237 -605 -334 207 -773 -420 551 100 -454 696
5214 696 348 302 152 635 -32 137 -266 -304 -234 260 -487 16 223 266 217 98 -648 -300 -541 -470 283 268
5236 268 -105 330 -143 1131 -663 -82 5 -371 176 -711 474 655 -219 210 -114 232 -313 -431 -771
5255 -771 -7 -732 369 294 61 -34 45 491 285 441 -565 430 -643 23 -839 -697 8 -131 339 887
5275 887 -363 326 313 308 294 -341 459 442 -576 1074 423 -195 346 332 819 917 214 -281 1298 -187 -449
5296 -449 226 -133 59 264 -316 -236 44 -182 645 -540 -38 209 373 216 36 -164 333 3 446 905
5316 905 37 -95 -502 -421 -616 36 -72 -74 -17 397 -323 -584 90 -83 838 727 774 -86 -687 10 -944 -377
5338 -377 -96 564 -438 164 62 326 -661 -951 200 -227 -910 239 478 -740 -386 -180 248 971 -643
5357 -643 1170 -250 654 -378 123 -239 574 532 481 -450 -332 -854 -412 888 -446 -83 45 297 -1434
5376 -1434 288 -416 366 77 -587 279 310 -397 553 -91 373 -604 -430 -241 104 -10 -576 -139 414 -73
5396 -73 -943 672 -275 146 -254 173 -710 166 -130 208 530 204 209 239 301 651 -447 -217 118 -2 1048
5417 1048 -313 -1132 -101 -238 -94 -357 7 233 -527 -258 -526 -178 -284 -490 160 549 54 298 -313
5436 -313 -845 57 -781 415 785 -480 -640 -237 705 -104 288 -441 709 6 26 -418 -971 -667 1070
5455 1070 -793 190 336 -636 -355 562 397 153 1 165 -253 -265 -350 22 -237 148 36 -63 -362 -690
5475 -690 -233 -583 -329 8 135 -117 357 234 -274 28 293 -249 -93 400 -95 492 -496 -635 462 -322
5495 -322 90 -551 195 -242 322 359 -43 28 -552 552 -716 -532 -349 599 345 631 -274 115 326 -735
5515 -735 249 -5 493 -451 -643 859 -344 -64 260 397 171 80 51 -231 170 -574 -503 -430 682 -83
5535 -83 -1017 -88 797 318 -647 -219 -209 -1044 -126 74 472 194 8 743 -474 -13 -217 -524 -303 317
5555 317 104 169 -191 -34 -293 199 -305 224 801 -420 68 253 42 -545 1278 -14 567 508 83 338
5575 338 235 -630 580 663 75 -149 106 -720 51 21 -462 -17 831 54 416 -229 -738 302 -449 -28
5595 -28 280 -14 -607 188 -73 104 628 -537 -760 -80 -684 76 323 890 -677 268 -332 813 -216
5614 -216 153 -6 427 -283 706 -887 106 860 -525 -349 -240 752 -312 -554 285 -105 773 858 78
5633 78 -126 356 597 402 -446 -266 724 -359 623 -125 -350 390 300 -553 -382 526 425 -617 -580 288
5653 288 -112 51 258 111 298 14 180 138 -320 626 -1182 334 342 -9 -439 -692 933 -858 -198 -786
5673 -786 -540 10 163 1372 304 474 -290 194 257 -8 -269 318 -125 450 66 347 -557 285 225 -446
5693 -446 264 -251 191 391 -501 -532 233 134 -43 385 -294 -823 -549 -809 -942 -976 -701 83 -362 441 -56
5714 -56 -316 -143 81 251 -370 -109 414 589 33 -381 -571 409 -123 139 -54 302 98 260 -74 -520
5734 -520 -268 264 273 -213 362 -144 -191 65 -13 185 -152 781 458 -31 -719 327 337 -358 -133 -573 -86
5755 -86 32 133 874 616 -2 -333 -487 -474 -218 -661 -46 467 -178 -31 76 432 576 -27 458 -653
5775 -653 416 -693 -297 -490 -671 -739 -173 274 -452 -416 101 -225 -164 -271 -546 607 145 -27 250 192
5795 192 871 -34 168 696 -105 -181 -648 557 -42 -524 -912 -188 193 -482 -124 -845 72 541 -458 -65
5815 -65 776 -528 -475 -529 -65 192 178 883 -526 275 658 -610 -664 15 711 63 -124 128 707 -383
5835 -383 -624 -13 -81 -362 -93 -80 -43 58 677 -10 -252 -413 -163 -105 464 478 -532 62 279 310 -297 155
5857 155 -185 698 -266 -432 1116 55 495 345 714 186 232 163 599 393 -395 178 -368 933 -488
5876 -488 -323 146 -593 -271 414 167 120 118 -138 1058 -89 712 -338 -675 -468 154 92 676 -41 -526
5896 -526 -778 488 572 -71 -920 -924 148 -135 -47 225 298 -32 297 645 248 -878 117 706 -390 1005
5916 1005 194 126 -784 260 70 435 -748 31 -9 -378 454 814 -131 -490 -620 31 965 -479 -55
5935 -55 301 -28 476 385 -137 344 -256 161 663 -61 261 -340 -202 875 -278 -242 1057 154 170 385
5955 385 -24 -850 -624 172 -319 303 130 -174 151 -30 -569 -633 87 -304 365 413 -367 1491 401 -281
5975 -281 -353 -926 -16 -266 480 -319 -622 -197 281 -52 -884 55 240 769 1097 381 -363 -14 -377 -417 -67
5996 -67 354 423 60 -300 -131 -49 142 1080 -1245 233 111 291 -614 546 -132 -338 3 -818 77 -30
6016 -30 109 -155 -513 -136 193 -220 -1156 -253 -12 414 235 -52 479 -153 -399 -82 68 -394 950 -352
6036 -352 216 159 26 -333 -596 396 -194 -362 134 -424 621 -414 -289 966 -218 -628 691 -663
6054 -663 207 266 -88 -590 -1078 -372 -115 466 -485 1061 239 36 -291 647 -1008 -332 70 -334 -277 -157
6074 -157 230 227 328 17 -1558 78 304 975 202 3 -328 -246 -49 -407 76 280 -163 -434 -734 405
6094 405 -203 350 -37 -276 -80 -190 -111 -128 -315 421 -41 -682 122 -204 -446 63 -386 -403 -786 425 -480
6115 -480 -198 374 -540 951 -605 -481 -87 170 788 -357 -293 -264 -246 731 -248 284 626 -330 -403 -378 1044
6136 1044 175 -216 40 202 -350 207 -135 -1084 361 78 1 -268 86 -377 4 318 -135 -319 -947 -325
6156 -325 117 -1022 -541 -312 403 2 -798 129 239 -338 -396 -537 -708 -496 0 694 200 112 -506 -133
6176 -133 331 46 -11 579 -445 -224 -873 -730 212 -233 -265 99 140 456 110 -115 528 74 -1064 -76
6196 -76 -401 422 -197 677 489 -941 -77 16 -484 -437 54 -170 -119 -322 -61 -710 175 427 -22 -113 470
6217 470 -108 -334 -94 550 1202 -506 -91 64 -820 488 -810 314 -525 -612 -1162 -355 -114 -634 -324
6236 -324 -247 -210 362 738 177 -2 -503 -55 -515 579 526 -252 500 9 236 45 -121 -44 -223 -440 -209
6257 -209 -5 -500 262 -656 79 -405 -386 300 -280 -1065 28 -347 -571 -568 363 322 387 -417 46 -29 630 -252
6279 -252 -511 -277 208 -130 -143 -223 -240 153 -752 348 -594 -47 -517 67 -678 -547 -147 -318 -541 494
6299 494 187 -18 -213 -273 -377 398 443 -191 567 182 -982 -331 7 -63 441 -340 815 169 525 517 89
6320 89 212 -103 -408 -260 72 -288 -769 -468 -160 -795 248 -648 193 -467 -271 -197 450 223 112 235
6340 235 -465 258 12 -599 -237 -239 -790 -316 369 -6 307 -191 71 -291 320 22 127 -325 -519 742
6360 742 579 271 793 -11 -970 -659 563 -1212 79 -89 -156 1085 420 -232 -493 -187 -185 664 -109 -556
6380 -556 -507 399 -82 -348 -315 129 714 -520 -256 -221 61 302 -41 -108 507 220 -8 596 -116 -1105 -284
6401 -284 -105 -64 -91 -580 223 256 -217 -282 283 138 198 696 -1021 233 -547 -152 150 511 467 -946 -355
6422 -355 -192 -61 205 89 253 67 585 -332 412 933 -364 -574 -303 454 -40 -82 960 -778 366
6441 366 465 -251 -234 351 574 943 269 312 231 322 93 448 149 -56 -91 388 439 52 1036 -6 -28 -802
6463 -802 -852 -282 239 713 -509 -489 923 -1006 53 225 -259 157 118 18 196 7 106 -529 799 -103
6483 -103 508 254 -402 687 217 -254 155 -9 877 1447 305 -484 120 -102 -212 323 -426 -595 -254
6502 -254 633 118 -12 -473 -338 -524 -773 -10 -379 -530 638 510 384 284 -457 290 -583 -453 259 -205
6522 -205 507 940 212 396 -222 -389 -510 -171 416 -605 -737 897 441 323 -330 -846 441 884 -280
6541 -280 193 98 -306 -551 -5 306 -423 -114 267 -674 -671 658 189 304 141 -331 378 -410 136 153 375
6562 375 -354 560 389 -180 252 -165 -66 -398 31 798 -100 -539 -365 717 756 -472 -390 -466 -5 -166 -403
6583 -403 573 -473 -196 -54 -546 -141 585 -365 -21 -854 7 696 488 198 -65 47 32 -372 -219 -34
6603 -34 -1041 -249 -446 -78 -288 -358 230 405 156 319 13 241 387 336 -827 -247 175 -482 -246 742
6623 742 -1008 -629 407 -200 864 241 -708 -352 542 382 -252 -737 -324 -21 -706 -11 -1443 -258
6641 -258 87 -53 -276 241 173 234 -799 398 542 191 325 -226 -134 -353 270 -79 -1055 164 373 106
6661 106 -327 99 531 -217 712 -1022 -177 66 1162 291 398 825 70 -141 382 118 -44 -143 -532 505
6681 505 584 -440 50 -1334 -459 -32 -665 -10 -146 -9 618 -195 80 158 -639 -75 -220 -546 395 -878
6701 -878 -78 -97 139 -101 561 -448 -120 279 -211 92 284 118 319 301 -110 235 -1111 -422 441 283
6721 283 259 945 -668 -269 423 249 -735 -128 448 94 -521 770 174 185 585 3 -209 -227 145 975
6741 975 -66 -629 -90 -403 498 196 340 611 130 231 -328 -611 -358 144 -95 19 97 348 -622 976
6761 976 -972 436 -247 149 -191 -379 403 -296 -433 152 -466 256 867 -137 -389 -689 -426 827 544
6780 544 -408 175 68 263 -35 -332 -145 335 -334 -1059 -159 -279 -651 296 -580 -274 110 26 -124 423
6800 423 -96 650 -1025 299 -204 -587 528 -469 -643 -502 -265 275 110 -395 -89 30 717 8 158
6819 158 711 365 1210 -177 -571 -784 79 461 448 194 -671 -374 -279 564 -134 644 -125 -279 -147 511
6839 511 -355 127 -355 307 579 663 127 -299 -113 232 48 586 -47 -404 -118 -514 -86 -554 994 -528
6859 -528 -1215 -238 -899 618 -737 -733 85 1003 885 261 -529 -306 -1107 -607 -160 -553 -1099 -113 539 444
6879 444 -189 -375 719 103 -261 2 68 718 -198 -497 321 -130 -106 224 517 228 -598 195 -225 -654
6899 -654 -44 -215 743 -1472 168 246 330 -221 577 -256 -442 441 -249 -1 228 168 402 678 -387 612
6919 612 -778 -4 841 582 -301 13 260 765 -170 -1411 -30 415 -156 130 668 -120 199 -265 264
6938 264 -512 66 773 -528 -520 -168 311 220 -73 -417 -217 -9 -494 256 -131 198 425 764 -870 225
6958 225 -1163 992 -24 461 181 -205 239 -597 -1058 -24 -206 -406 -185 689 222 602 403 -222 -778
6977 -778 -160 -90 -260 -299 -15 -243 221 522 -577 -160 23 309 -457 67 219 212 619 151 -63 122 -81
6998 -81 506 389 -307 -374 167 232 185 638 -136 -781 -590 -1212 -34 -58 20 11 -149 208 198 -565 32 121 -141
7021 -141 -5 -581 -230 -375 189 -555 -66 691 243 47 -222 461 70 410 150 -297 51 -505 -420 3
7041 3 112 483 -292 -376 -529 -439 -355 729 182 110 156 120 218 324 -25 -476 463 669 453 416 709 -86 474
7064 474 -15 -731 -133 -355 -538 521 -724 -576 -360 144 -79 -283 101 -311 -833 -669 103 280 506
7083 506 -714 844 -532 605 142 493 -472 89 183 -829 282 -611 92 709 -336 -184 -36 -700
7101 -700 -116 -243 -83 -589 393 -726 324 551 -222 1324 221 -351 -109 529 33 60 165 468 -195
7120 -195 -67 -557 70 258 -28 608 948 287 -673 762 -229 -319 164 -60 822 -246 -886 -102 206 -871
7140 -871 463 -729 663 736 -196 235 74 -466 -400 -870 -1015 140 -351 -471 265 -90 -294 -205 410 -234
7160 -234 -536 342 319 -42 137 485 -43 -265 -254 406 129 -283 644 301 563 137 -17 -366 67 -432 233
7181 233 769 -465 117 -698 37 714 -29 -610 361 -315 1256 297 147 -1080 -243 -29 -398 324 168
7200 168 410 -134 -274 -414 175 1 520 143 -539 -547 -644 -165 -1009 213 654 -260 -98 299 270 -432 -674
7221 -674 -175 194 148 -142 1619 526 -122 -448 40 -299 -693 -476 703 -46 269 -467 58 260 488
7240 488 -332 162 -248 1031 18 196 -422 -599 390 47 192 249 -153 -603 -129 -104 1001 -299 465
7259 465 609 -224 441 536 -277 -401 216 129 -82 -109 460 -372 -472 413 -931 -56 -248 987 -352 121
7279 121 16 -342 475 48 73 354 292 -958 -189 171 -616 -326 -26 -175 626 643 1092 8 -811 1303
7299 1303 -840 -232 -102 67 -31 -59 -280 -395 479 -368 166 -702 411 287 719 -395 316 -445 -672
7318 -672 -219 -591 362 -485 -252 507 128 608 -697 -675 -417 190 443 453 530 -458 -597 -286 32 -885 -486
7339 -486 -578 165 -719 -1044 393 -16 83 470 -300 243 3 12 -195 465 -94 -331 -14 716 466 219 -536
7360 -536 -64 -275 -203 -25 -493 -559 -380 811 53 -554 -280 256 479 -1033 -297 351 216 -507 -31 211
7380 211 107 342 277 162 -626 587 212 -427 -188 -427 409 94 -419 -557 -284 442 -565 260 -420 53
7400 53 -67 -10 514 -46 -603 -286 -1169 289 551 -45 346 240 7 -32 443 241 -228 145 -218 -949 -420
7421 -420 45 -397 -593 -174 -640 -957 47 -223 392 433 259 -611 -539 707 -461 -748 -750 20 237 -605
$$ [...]
8191a69
##END NTUPLES=NMR FID
##END=
