##TITLE=1H_SA_55.223
 D2O, 8 sc, 
 1.9.2020
##JCAMPDX= 6.0         $$ Bruker NMR JCAMP-DX V2.0
##DATA TYPE= NMR FID
##DATA CLASS= NTUPLES
##ORIGIN= UXNMR, Bruker Analytische Messtechnik GmbH
##OWNER= root
$$ XWIN-NMR		Version 3.5
$$ Tue Sep  1 12:16:52 2020 Russian Standard Time (UT+4h)  she@DPX200
##.OBSERVE FREQUENCY= 200.1315066352
##.OBSERVE NUCLEUS= ^1H
##.DELAY= (6, 6)
##.ACQUISITION MODE= SIMULTANEOUS
##.ACQUISITION SCHEME= undefined
##.AVERAGES= 8
##.DIGITISER RES= 18
##SPECTROMETER/DATA SYSTEM= spect
##.PULSE SEQUENCE= zg30
##.SOLVENT NAME= D2O
##.SHIFT REFERENCE= (INTERNAL, D2O, 0, 15.7039)
##AUDIT TRAIL= $$ (NUMBER, WHEN, WHO, WHERE, WHAT)
$$ ##TITLE= Audit trail, XWIN-NMR		Version 3.5
$$ ##JCAMPDX= 5.01
$$ ##ORIGIN= Bruker BioSpin GmbH
$$ ##OWNER= she
$$ F:/spectra/data/she/nmr/H-F/1/audita.txt
$$ ##AUDIT TRAIL=  $$ (NUMBER, WHEN, WHO, WHERE, WHAT)
(   1,<2020-09-01 12:15:57.03 +0400>,<she>,<DPX200>,
      <created by zg, POWCHK disabled, PULCHK disabled
       configuration hash MD5:
       00 E9 B6 7A A2 85 ED C7 34 08 36 98 17 FE 4E 26
       data hash MD5: 16K
       F7 43 5A F3 64 87 4E 4C 67 32 12 BD 29 1B 86 4E>)
$$ ##END=
$$ 
$$ hash MD5
$$ D2 F4 78 9F 17 B1 E8 20 3A 88 08 BD B4 50 80 48
##$RELAX= 
##$RELAX= 
##$RELAX= 
##$RELAX= 
##$RELAX= 
##$RELAX= 
$$ Bruker specific parameters
$$ --------------------------
##$DU= <F:/spectra>
##$EXPNO= 1
##$NAME= <H-F>
##$PROCNO= 1
##$TYPE= <nmr>
##$USER= <she>
##$AMP= (0..31)
100 100 100 100 100 100 100 100 100 100 100 100 100 100 100 100 100 100 
100 100 100 100 100 100 100 100 100 100 100 100 100 100 
##$AQSEQ= 0
##$AQ_mod= 1
##$AUNM= <au_zg>
##$AUTOPOS= <>
##$BF1= 200.13
##$BF2= 200.13
##$BF3= 200.13
##$BF4= 200.13
##$BF5= 200.13
##$BF6= 200.13
##$BF7= 200.13
##$BF8= 200.13
##$BYTORDA= 1
##$CFDGTYP= 0
##$CFRGTYP= 5
##$CHEMSTR= <none>
##$CNST= (0..31)
1 1 145 1 1 1 1 1 1 1 1 1 1 1 1 1 1 1 1 1 1 1 1 1 1 1 1 1 1 1 1 1 
##$CPDPRG= <>
##$CPDPRG1= <>
##$CPDPRG2= <>
##$CPDPRG3= <>
##$CPDPRG4= <mlev>
##$CPDPRG5= <mlev>
##$CPDPRG6= <mlev>
##$CPDPRG7= <mlev>
##$CPDPRG8= <mlev>
##$CPDPRGB= <>
##$CPDPRGT= <>
##$D= (0..31)
0 1.2 0 0 0 0 0 0 0 0.06 0 0.03 0 0 0 0 0.0002 0 0 0 0 0 0 0 0 0 0 0 0 
0 0 0 
##$DATE= 1598948156
##$DBL= (0..7)
120 120 120 120 120 120 120 120 
##$DBP= (0..7)
150 150 150 150 150 150 150 150 
##$DBP07= 0
##$DBPNAM0= <>
##$DBPNAM1= <>
##$DBPNAM2= <>
##$DBPNAM3= <>
##$DBPNAM4= <>
##$DBPNAM5= <>
##$DBPNAM6= <>
##$DBPNAM7= <>
##$DBPOAL= (0..7)
0.5 0.5 0.5 0.5 0.5 0.5 0.5 0.5 
##$DBPOFFS= (0..7)
0 0 0 0 0 0 0 0 
##$DE= 6
##$DECBNUC= <off>
##$DECIM= 32
##$DECNUC= <off>
##$DECSTAT= 4
##$DIGMOD= 1
##$DIGTYP= 9
##$DL= (0..7)
0 120 120 120 120 120 120 120 
##$DP= (0..7)
150 150 150 150 150 150 150 150 
##$DP07= 0
##$DPNAME0= <>
##$DPNAME1= <>
##$DPNAME2= <>
##$DPNAME3= <>
##$DPNAME4= <>
##$DPNAME5= <>
##$DPNAME6= <>
##$DPNAME7= <>
##$DPOAL= (0..7)
0.5 0.5 0.5 0.5 0.5 0.5 0.5 0.5 
##$DPOFFS= (0..7)
0 0 0 0 0 0 0 0 
##$DQDMODE= 0
##$DR= 18
##$DS= 0
##$DSLIST= <SSSSSSSSSSSSSSS>
$$ [...]
##$SUBNAM2= <"">
##$SUBNAM3= <"">
##$SUBNAM4= <"">
##$SUBNAM5= <"">
##$SUBNAM6= <"">
##$SUBNAM7= <"">
##$SUBNAM8= <"">
##$SUBNAM9= <"">
##$SW= 16.880792210976
##$SWIBOX= (0..15)
0 0 2 0 0 0 0 0 0 0 0 0 0 0 0 0 
##$SW_h= 3378.37837837838
##$TD= 16384
##$TD0= 1
##$TE= 0
##$TE2= 300
##$TE3= 300
##$TEG= 300
##$TL= (0..7)
0 120 120 120 120 120 120 120 
##$TP= (0..7)
150 150 150 150 150 150 150 150 
##$TP07= 0
##$TPNAME0= <>
##$TPNAME1= <>
##$TPNAME2= <>
##$TPNAME3= <>
##$TPNAME4= <>
##$TPNAME5= <>
##$TPNAME6= <>
##$TPNAME7= <>
##$TPOAL= (0..7)
0.5 0.5 0.5 0.5 0.5 0.5 0.5 0.5 
##$TPOFFS= (0..7)
0 0 0 0 0 0 0 0 
##$TUNHIN= 0
##$TUNHOUT= 0
##$TUNXOUT= 0
##$USERA1= <user>
##$USERA2= <user>
##$USERA3= <user>
##$USERA4= <user>
##$USERA5= <user>
##$V9= 5
##$VALIST= <valist>
##$VCLIST= <CCCCCCCCCCCCCCC>
##$VD= 0
##$VDLIST= <DDDDDDDDDDDDDDD>
##$VPLIST= <PPPPPPPPPPPPPPP>
##$VTLIST= <TTTTTTTTTTTTTTT>
##$WBST= 1024
##$WBSW= 4
##$XGAIN= (0..3)
0 0 0 0 
##$XL= 0
##$YL= 0
##$YMAX_a= 68858
##$YMIN_a= -56601
##$ZGOPTNS= <>
##$ZL1= 120
##$ZL2= 120
##$ZL3= 120
##$ZL4= 120
##$ABSF1= 10
##$ABSF2= 0
##$ABSG= 5
##$ABSL= 3
##$ALPHA= 0
##$AQORDER= 0
##$ASSFAC= 0
##$ASSFACI= 0
##$ASSFACX= 0
##$ASSWID= 0
##$AUNMP= <proc_1d>
##$AZFE= 0.1
##$AZFW= 0.1
##$BCFW= 1
##$BC_mod= 2
##$BYTORDP= 1
##$COROFFS= 0
##$CY= 11.3945322036743
##$DATMOD= 1
##$DC= 2
##$DFILT= <>
##$DTYPP= 0
##$F1P= 16.9975609425685
##$F2P= -3.02152046262296
##$FCOR= 0.5
##$FTSIZE= 0
##$FT_mod= 4
##$GAMMA= 1
##$GB= 0.15
##$INTBC= 1
##$INTSCL= 1
##$ISEN= 128
##$LB= 0.24
##$LEV0= 0
##$LPBIN= 0
##$MAXI= 10000
##$MC2= 0
##$MEAN= 0
##$ME_mod= 0
##$MI= 1.114404
##$NCOEF= 0
##$NC_proc= 0
##$NLEV= 6
##$NOISF1= 3.799351
##$NOISF2= 2.8
##$NSP= 1
##$NTH_PI= 0
##$NZP= 0
##$OFFSET= 15.70392
##$PC= 1
##$PHC0= -9981.996
##$PHC1= 19.00092
##$PH_mod= 1
##$PKNL= yes
##$PPARMOD= 0
##$PSCAL= 0
##$PSIGN= 0
##$REVERSE= no
##$SF= 200.130013532006
##$SI= 16384
##$SIGF1= 3
##$SIGF2= 2
##$SINO= 400
##$SIOLD= 16384
##$SREGLST= <1H.CDCl3>
##$SSB= 0
##$STSI= 0
##$STSR= 0
##$SW_p= 3612.71676300578
##$SYMM= 0
##$S_DEV= 0
##$TDeff= 0
##$TDoff= 0
##$TI= <>
##$TILT= no
##$TM1= 0
##$TM2= 0
##$TOPLEV= 0
##$USERP1= <user>
##$USERP2= <user>
##$USERP3= <user>
##$USERP4= <user>
##$USERP5= <user>
##$WDW= 1
##$XDIM= 8192
##$YMAX_p= 0
##$YMIN_p= 0
$$ End of Bruker specific parameters
$$ ---------------------------------
##NTUPLES= NMR FID
##VAR_NAME=  TIME,          FID/REAL,        FID/IMAG
##SYMBOL=    X,             R,               I
##VAR_TYPE=  INDEPENDENT,   DEPENDENT,       DEPENDENT
##VAR_FORM=  AFFN,          ASDF,            ASDF
##VAR_DIM=   8192,          8192,            8192
##UNITS=     SECONDS,       ARBITRARY UNITS, ARBITRARY UNITS
##FACTOR=    0.000296,      1,               1
##FIRST=     0,             0,               0
##LAST=      2.424536,      0,               0
##MIN=       0,             -56601,          0
##MAX=       2.424536,      68858,           0
$$ Real data points
##PAGE= N=1
##DATA TABLE= (X++(R..R)), XYDATA
0@%%%%%%%%%%%%%%%%%%%%%%Mj1J5j6J6j6J6j9K6l1L2l5M2m7N2n9O6p4Q3r3J02
43E3j12J25j39J53j67J85k05K25k48K75l03L33l70M11m55N06n69O41p26Q33r71
64e25J154j406J787k435L826j4318K2360J9068k9429l8529j8154K4795L8592J7871
78B4657k2162l7782j5782K5291M0121J8047k1477l5842j4228K4317L7935J6769
90C9864k0348l5935j4466K2155L7229J5424k0754l4868j4121K1881L5190J5133
102D6384j9950l3838j3782K0757L3882J3910j9968l3589j3886J8909L2008J2597
114D3434k0315l3477j4623J7754L0263J1864j9491l2523j3707J7890L0130J2485
126B9684j7611l0911j1714J8080L0819J2732j6458k8802j1028J7950K9729J2764
$$ plain form
0 0 0 0 0 0 0 0 0 0 0 0 0 0 0 0 0 0 0 0 0 0 0 0 4 -7 8 -8 8 -8 8 -11 15 -16 16 -19 23 -24 28 -31 35 -39 44 -49 53
43 53 -59 66 -73 80 -87 98 -107 118 -130 145 -158 175 -195 216 -239 267 -302 339 -387 446 -525
64 -525 629 -777 1010 -1425 2401 -11917 10443 29511 82 -38447 -56601 -31806 6786 24657
78 24657 2495 -35287 -51069 -25778 14343 32390 10913 -24929 -39157 -14840 23095 39864
90 39864 19516 -16419 -30885 -8730 28499 43923 23169 -11699 -25820 -3939 31251 46384
102 46384 26434 -7404 -21186 -429 33453 47363 27395 -6194 -20080 -1171 30837 43434
114 43434 23119 -10358 -24981 -7227 23036 34900 15409 -17114 -30821 -12931 17199 29684
126 29684 12073 -18838 -30552 -12472 18347 31079 14621 -14181 -25209 -7259 22470 35234
138C5234j6345k8697j1379J6885K8349J1437j6483k8361j1991J5500K7225J1106
150C2480j5755k8229j1498J5035K6884J1265j5312k6664j1717J5214K5939J1229
162B8871j5409k6076j1311J4181K5048J0535j4484k6005j1010J3743K5038J0778
174B3899j4358k4562j0357J4100K4836J1339j3045k3591r868J4239K4216J1734
186B8582j3113k3357j0053J3084K3543J0222j3030k3497j0259J1795K2717R443
198B6077j2971k3185j0567J1956K1706J0145j2815k2152j0076J1707K1732R771
210B1328j1923k1813r921J1433K1521R713j1725k1440j0131J1387K1087R604j1488
223G632k0945j0035J1683K0602R327j0592k0217r749J1155K0681R654j0805j9715
$$ plain form
138 35234 18889 -9808 -21187 -4302 24047 35484 19001 -9360 -21351 -5851 21374 32480
150 32480 16725 -11504 -23002 -7967 18917 30182 14870 -11794 -23511 -8297 17642 28871
162 28871 13462 -12614 -23925 -9744 15304 25839 11355 -14650 -25660 -11917 13121 23899
174 23899 9541 -15021 -25378 -11278 13558 24897 11852 -11739 -21607 -7368 16848 28582
186 28582 15469 -7888 -17941 -4857 18686 28908 15878 -7619 -17878 -6083 16634 26077
198 26077 13106 -10079 -20646 -8690 13016 23161 10346 -11806 -21882 -10175 11557 21328
210 21328 9405 -12408 -22329 -10896 10625 20338 8613 -12827 -22958 -11571 9516 19120 7632
223 7632 -13313 -23348 -11665 8937 18264 7672 -12545 -22294 -11139 9542 19196 8391 -11324
236a1324r399J1010K0124R555j0784j9879r125J0218J9654Q950j0503j9668r251
249b0422J0006J9128R067j0509j9317q916J0237J8842Q756r678j8826r407J0470
262a0569J8865Q727r787j8939q410R989J8346Q462r570j8087q798R557J8135Q269
276A6190r285j8130q698R737J7901Q427r320j7890q282R391J7737Q382r039j7935
290a0814q085R426J7089Q752r024j7404q287R387J7209Q263r127j6869p959Q650
304h793J7123Q243r179j6669q034R078J6334P936q841j6414p844Q282J6576P871
318A5669q515j6499p635Q826J5949P743q503j6153p358Q454J6224P210q072j6067
332h727p617Q608J5590P269q051j5810p010P838J5505P571q282j4993p349Q531
$$ plain form
236 -11324 -20723 -9713 10411 19966 9182 -10697 -19822 -9604 10050 19000 8497 -11171 -20422
249 -20422 -10416 8712 17779 7270 -12047 -20963 -10726 8116 16872 7194 -11632 -21039 -10569
262 -10569 8296 17023 7236 -11703 -20113 -10124 8222 16684 7114 -10973 -19771 -10214 7921 16190
276 16190 6905 -11225 -19923 -10186 7715 16142 6822 -11068 -19350 -9959 7778 16160 7121 -10814
290 -10814 -18899 -9473 7616 16368 7344 -10060 -18347 -8960 8249 16512 7385 -9484 -17443 -8793
304 -8793 8330 16573 7394 -9275 -17309 -8231 8103 16039 7198 -9216 -17060 -8778 7798 15669
318 15669 7154 -9345 -16980 -8154 7795 15538 7035 -9118 -16476 -8022 8202 15412 7340 -8727
332 -8727 -16344 -7736 7854 15123 7072 -8738 -15748 -7910 7595 15166 6884 -8109 -15458 -6927
346f927J5241P397p788j5015o963Q046J5172P132p855j4809p132P699J4887O730
360A5815p910j4739p347P611J4515O727p795j4716o615P591J4468O951p562j4115
374g121o582P591J4402P073p557j3806o643P403J4101O353p518j3859o533P360
388e336J3693O108p172j3840o664P453J3662O343p018j3642n665P070J3900O026
402A4918p089j3140o150P344J3080O025o794j3550o091O997J3101N819p352j2851
416e733o068O782J3046N878o774j2900n564O921J3072O144o752j2366n765P137
430b942J2614N813o783j2864o090O681J2403N267o875j2827n852O239J1860N461
444A2105o892j2335n748O593J1998N637o585j1996n321O414J2305N469o470j2004
$$ plain form
346 -6927 8314 15711 7923 -7092 -14055 -6009 9163 16295 8440 -6369 -13501 -5802 9085 15815
360 15815 7905 -6834 -14181 -6570 7945 14672 6877 -7839 -14454 -6863 7605 14556 6994 -7121
374 -7121 -13703 -6112 8290 15363 7806 -6000 -12643 -5240 8861 15214 7696 -6163 -12696 -5336
388 -5336 8357 14465 7293 -6547 -13211 -5758 7904 14247 7229 -6413 -12078 -5008 8892 14918
402 14918 7829 -5311 -11461 -4117 8963 14988 8194 -5356 -11447 -4450 8651 14470 7118 -5733
416 -5733 -11801 -5019 8027 13905 7131 -5769 -11333 -4412 8660 14804 8052 -4314 -10079 -2942
430 -2942 9672 15485 8702 -4162 -10252 -3571 8832 14099 7224 -5603 -11455 -5216 6644 12105
444 12105 5213 -7122 -12870 -6277 5721 11358 4773 -7223 -12544 -6130 6175 11644 5174 -6830
458f830n316O665J1557N494o420j2048n441O631J1587N198o348j1619n006O425
472e471J1872N363n858j1571m866O421J1573N450o372j1318n263O244J0991N039
486A2234o479j1644n524N861J0725N021p113j1400n036N535J1060M895o433j1056
500i354n056N959J1359N072n869j0843m783O000J1038M941n894j0736m777N843
514g100J0708M787n881j0561m615N713J0712M875n657j0646m501N773J0737M960
528I304n572j0223m611N873J0225M600n381j0575m600N213J0288M526n878j0271
542g082m941N452R817M561n564r887m478N668J0039M842n380r631m088N655J0498
557E481M771n612r142m771N878R866M241n122r726m585N544R515M508n820r503
$$ plain form
458 -6830 -12146 -5481 6076 11570 5150 -6898 -12339 -5708 5879 11077 4729 -6890 -11896 -5471
472 -5471 6401 11764 5906 -5665 -10531 -4110 7463 12913 6541 -4777 -10040 -3796 7195 12234
486 12234 5755 -5889 -11413 -5552 5173 10194 3081 -8319 -13355 -7820 3240 8135 1702 -9354
500 -9354 -14410 -8451 2908 7980 2111 -8732 -13515 -7515 3523 8464 2570 -8166 -12943 -7100
514 -7100 3608 8395 2514 -8047 -12662 -6949 3763 8638 2981 -7665 -12166 -6393 4344 9304
528 9304 3732 -6491 -11102 -5229 4996 9596 4215 -6360 -10960 -5747 4541 9067 3189 -7082
542 -7082 -12023 -6571 3246 7807 2243 -7644 -12122 -6454 3585 8427 3047 -6584 -10672 -5017 5481
557 5481 10252 4640 -4502 -9273 -3395 6471 10712 5590 -4136 -8721 -3177 6338 10846 5026 -4477
572d477m330N034R836M300n327r858m059N253R549M252n588r608m082M988R438
587E321L855n423r529m355N008R191L849m771r683m306N160R454M211n307q777
602f102l973N543R346M281n033q787l728N226R613L936m780q904l733M838Q980
617F723M012n146r061l925M771Q862M026m966r122l906N058Q538L934m884q904
632c990l658M997Q462M087n234q675l959M787Q581L656m703q886l691M479Q629
647D882L623m702q461l822M758Q538L984m600q378l702N017Q532L572m306q298
662c363l649M577Q101L962n042q134l440M171Q156L684m770p952l622M439P796
677D914L727m785q139l386M392P939L653m523p950l493M305Q212L103m195q035
$$ plain form
572 -4477 -8807 -3773 6063 10363 5036 -4822 -8881 -3628 5921 10173 4585 -5023 -9105 -4117 5321
587 5321 9176 3753 -5776 -10131 -5123 4068 7917 3146 -6537 -10843 -5683 3771 7982 2675 -6102
602 -6102 -10075 -4532 4814 9095 4062 -4725 -8453 -3227 6386 10322 5542 -3362 -7095 -2257 6723
617 6723 10735 5589 -3472 -7397 -2626 6236 10262 5296 -3826 -7732 -2674 5864 9798 4914 -3990
632 -3990 -7648 -2651 5811 9898 4664 -4011 -7970 -3183 5398 9054 4351 -4535 -8226 -3747 4882
647 4882 8505 3803 -4658 -8480 -3722 4816 8800 4200 -4178 -7880 -2863 5669 9241 4935 -3363
662 -3363 -7012 -2435 5666 9628 4586 -3548 -6988 -2817 5339 9023 4253 -3699 -7321 -2882 4914
677 4914 8641 3856 -4283 -7669 -3277 4662 8315 3792 -4158 -7651 -3346 4866 7969 3774 -4261
692d261l590M028Q387L180m075q166l350M067P784L488m503p472l355M158P885
707D205L231l797q127l219M179P818L566m273p835l486M432P736L182l903p859
722d150l406M235P574L471m395p170l649L941P455L542m137p611l257M203P319
737C965L450m209p397l355M280P249K981l758p504l321L915P425L206l812p303
752d188l437L863P160K989l489p446l171L937P140L235m153o956l340M013P132
767C289L302l808p055k969L910P189L182m116o833l091L833O810L201l937o810
782c903l096L759O654L232l845o814l091L655O485L240l777o762k923L649O534
797B997L477m282o249l134L650O647L155l728o691k944L525O497K826l646o637
$$ plain form
692 -4261 -7851 -3823 4564 7744 3669 -4497 -7847 -3780 4004 7492 2989 -4483 -7838 -3680 4205
707 4205 7436 3639 -4488 -7707 -3528 4290 7856 3583 -4252 -7738 -3306 4430 7612 3709 -4150
722 -4150 -7556 -3321 4253 7724 3329 -3841 -7490 -3549 3906 7448 3311 -4300 -7557 -3354 3965
737 3965 7415 3206 -4191 -7546 -3266 3983 6964 3206 -4298 -7619 -3704 3721 6927 3115 -4188
752 -4188 -7625 -3762 3398 6387 2898 -4548 -7719 -3782 3358 6593 2440 -4516 -7856 -3843 3289
767 3289 6591 2783 -4272 -7241 -3331 3858 7040 2924 -3909 -7000 -3167 3643 6844 2907 -3903
782 -3903 -6999 -3240 3414 6646 2801 -4013 -7104 -3449 3036 6276 2499 -4263 -7186 -3537 2997
797 2997 6474 2192 -4057 -7191 -3541 3106 6261 2533 -4158 -7102 -3577 2920 5746 2100 -4537
812d537k780L291O824L061l614o667k681L543O641K829l124o528l039L693O733
827C645K587l296o121k992L162O299L014l782o236k621L251O544K467l756o046
842c881k587L397O395K803l270o084k828L456O297K971l428o242k755L573N975
857C792K811l329o319k907L556N972K739l587n951k706L740N579K870l143o127
872c010k613L280N999K490k970n871k371L283N628K475l267n648k898L496N464
887C467K436l132n756k906L236N881K358l207n601k199K825O265K356l007n450
902b434k538K877O093K425l281n654k530L209N632K221l100n556k304K842N460
917C362K503k818n584k408K801N741K790l182n295k166K789N631K630l197n689
$$ plain form
812 -4537 -7317 -4026 2798 5859 2245 -4422 -7103 -3560 3081 5910 2786 -3742 -6781 -3088 3645
827 3645 6232 2936 -3185 -6177 -3015 3284 6298 2516 -3720 -6341 -3090 3454 5921 2165 -3881
842 -3881 -6468 -3071 3324 6127 2857 -3227 -6055 -2599 3698 6669 3241 -3001 -5756 -2183 3792
857 3792 6603 3274 -3045 -5952 -2396 3576 6315 2728 -3223 -5929 -2189 3390 6260 3117 -3010
872 -3010 -5623 -2343 3656 6146 3176 -2695 -5066 -1783 3845 6320 3053 -2595 -5493 -1997 3467
887 3467 5903 2771 -2985 -5891 -2655 3226 5584 2377 -3224 -5423 -2598 3667 6023 3016 -2434
902 -2434 -4972 -2095 3998 6423 3142 -2512 -5042 -1833 3799 6020 2920 -2636 -4940 -2098 3362
917 3362 5865 3047 -2537 -4945 -2144 3597 6387 3205 -2090 -4256 -1467 4164 6794 3597 -2092
932b092k301L202N047K003k615n460k760K868N357K336l338n036k639K862N233
947B667K559l104n267k108K943N228K331k942n380k326K983N112K273l297m907
962c235k395K516N259K379k924n291k056K704N146K441k897n033k181K955M991
977B379K419k543m972k229L054N045J983k720n121k157K795N158K205k971n155
992b830k025K680M938J917k546n066k091K817M889K241k827m812j920K667M460
1007B492K351l523l714k179K441M556K133k928m613k254K716M583K172k908m951
1022c626j712K618N011J507k395m691j757K734M482K341k744m590k047K528M813
1037B472J792k580m546k001K747M512J875l013m478j596K451M750J790k576m514
$$ plain form
932 -2092 -4393 -1191 3856 5859 3244 -2216 -4976 -2108 3249 5585 2247 -2789 -5428 -2566 2667
947 2667 5226 2122 -3145 -5253 -2310 2918 5249 2307 -3073 -5399 -2416 2696 4969 1672 -3235
962 -3235 -5630 -3114 2145 4524 1600 -3691 -5747 -3043 2103 4544 1647 -3386 -5567 -2612 2379
977 2379 4798 2255 -2717 -4946 -1892 3153 5136 2416 -2705 -4862 -2067 3091 5296 2325 -2830
992 -2830 -4855 -2175 2763 4680 2134 -2932 -5023 -2206 2683 4924 2097 -2715 -4635 -1968 2492
1007 2492 4843 1320 -2394 -4573 -2132 2424 4557 1629 -2984 -5238 -2522 2061 4233 1325 -3626
1022 -3626 -5338 -2720 2291 3798 1403 -3288 -5045 -2311 2171 4512 1768 -2822 -4869 -2341 2472
1037 2472 4264 1684 -2862 -4863 -2116 2396 4271 1258 -3220 -4816 -2365 2385 4175 1599 -2915
1052b915j699K443M373K107k555m535j937K633M492K112k651m625j802K387M470
1067B298J728k687m126j857K604M622J611k533m458j829K763M204J917k424m355
1082b522j704K723M199J644k380m324j582K194M335J880k689m004k072K796L961
1097B455J856k595m140j709K466M063J847k608m185j560K795L666J750k175m068
1112b142j792K045M462J578k073m470j536K276M057J466k304l986j651K473L859
1127B262J869k399m170j595K348M254J715k414m104j796K741L851J651k353m260
1142b400j404K547L862J587k410l964j475K298L728J660k243l968j386K339L775
1157B546J703k562l611j558K146L804J539k202l884j783K436M017J506k247l779
$$ plain form
1052 -2915 -4614 -2171 2202 4309 1754 -2781 -4718 -2085 2407 4519 1868 -2757 -4559 -2172 2298
1067 2298 4026 1339 -2787 -4644 -2040 2582 4193 1660 -2798 -4627 -1864 2340 4257 1833 -2522
1082 -2522 -4226 -1503 2696 4340 1960 -2364 -3946 -1752 2583 4463 1774 -2230 -4302 -1506 2455
1097 2455 4311 1716 -2424 -4133 -1667 2396 4243 1635 -2550 -4110 -1315 2351 4101 1926 -2142
1112 -2142 -3934 -1889 2573 4151 2078 -2392 -3928 -1652 2405 3871 1567 -2419 -4070 -1597 2262
1127 2262 4131 1732 -2438 -4033 -1685 2569 4284 1870 -2234 -4030 -1289 2562 4213 1860 -2400
1142 -2400 -3804 -1257 2605 4192 1782 -2182 -3657 -1359 2369 4029 1786 -2182 -3568 -1229 2546
1157 2546 4249 1687 -1924 -3482 -1336 2468 4007 1805 -2079 -3862 -1426 2591 4097 1850 -1929
1172a929j282K107L711J453k285l709j782K305L970J599k501l462j844K450L869
1187B670J050k116l328j377J871L640J709k445l444j412K207L638J411k259l731
1202a916j540K107L839J623k442l795j423K362L544J222j812l880j417K282L672
1217B426J217k209l577j349K086L712J128k003l648j583K282L454J375k090l357
1232b136j468J797L723J485k283l388j406K123L384J526k068l480j345K272L256
1247A992J181k037l229j240K121L126J259j826l581j325K234L263R07k113l320
1262b588j158K201L272J252j918l706r53J965L282J535k299l294j104J879L424
1277A790R19j871l308j137K146K928J480j965l193j259K015L192J276k001l123
$$ plain form
1172 -1929 -3211 -1104 2607 4060 1775 -1934 -3716 -1411 2559 4158 1657 -1805 -3649 -1199 2670
1187 2670 3720 1604 -1724 -3101 -1230 2410 4119 1674 -1770 -3182 -975 2663 4074 1815 -1916
1202 -1916 -3456 -1349 2490 4113 1671 -2124 -3547 -1185 2359 3581 1769 -2111 -3528 -1246 2426
1217 2426 3643 1434 -2143 -3492 -1406 2306 3434 1431 -2217 -3800 -1518 1936 3311 1221 -2136
1232 -2136 -3604 -1807 1916 3401 1118 -2270 -3676 -1553 1831 3357 1289 -2191 -3536 -1264 1992
1247 1992 3173 1136 -2093 -3333 -1212 1914 3173 1347 -2234 -3559 -1325 1938 2845 732 -2588
1262 -2588 -3746 -1545 1727 2979 1061 -2645 -3598 -1633 1649 3184 885 -2409 -3513 -1634 1790
1277 1790 2709 838 -2470 -3607 -1461 1467 2947 982 -2211 -3470 -1455 1737 3013 1012 -2111
1292b111j270J942L359J091j913l091j222K085L099J216j838l230j123J875L069
1307A938J254k103k966j133J620L122J165k066l030j240J706L093J444k166l096
1322b458j016J971K967J253k106l011j206J993L208J119j845k757j459J686L124
1337A463J068j830k783j177K159K921R48j763k647j105J842L044R35j571l171
1352a667q93K162K558J290j937k802r76J665K758J035j857k818j013J413L091
1367B009J023j690k851j137J894K669J082j685k986r52J826K879J211k138k786
1382a632q58J619K766J221j822l162n17J414K906P44j676k597j069J998K400J085
1398B820j445l087p82J901K744P73j736k624j077J760K708R22j828k709j046J718
$$ plain form
1292 -2111 -3381 -1439 1920 3011 1098 -1993 -3215 -1130 1969 3185 1347 -1883 -3006 -1131 1938
1307 1938 3192 1089 -1877 -3010 -1390 1732 2897 831 -2199 -3439 -1733 1360 2804 638 -2458
1322 -2458 -3474 -1503 1464 2717 611 -2400 -3606 -1613 1595 2714 869 -1888 -3347 -1661 1463
1337 1463 2531 701 -2082 -3259 -1100 1821 2769 1006 -1641 -2746 -904 2140 3075 1504 -1667
1352 -1667 -2560 -398 2160 3450 1513 -1289 -2265 -600 2158 3193 1336 -1482 -2495 -1082 2009
1367 2009 3032 1342 -1509 -2646 -752 1917 2999 1314 -1672 -2624 -798 2081 3292 1154 -1632
1382 -1632 -2490 -871 1895 3116 1294 -1868 -2385 -971 1935 2679 1003 -1594 -2663 -665 1735 2820
1398 2820 1375 -1712 -2494 -593 2151 2924 1188 -1436 -2513 -753 1955 2877 1049 -1660 -2706 -988
1414i88K596P94j617k579o56J374K679Q76j713k487o33J596K509R82j757k610
1430a634p13J516K656R31j598k679o99J674K426Q35j816k233j057J894K516R66
1446B985j991k303q24J293K839Q77j790k552r25J786K347O14j230k753q42J629
1462h40K491P99j929k376r65J758K549Q04j716k454p70J807K330O85j557k278
1478a662p28J493K572P93j777k329q37J544K618P07j761k314q53J864K102J027
1494B459j596k704m31J256K632N64j628k269j016K103K194O78j549k597m81J563
1510h22K140P24j495k186p27J502K397N63j731k299o70J698K178R53j425k470
1526a670o76J510K130R32k032j643r02J316K669P26k010k168m77J401K098Q25
$$ plain form
1414 -988 1608 2402 785 -1794 -2450 -1076 1603 2479 766 -1721 -2354 -758 1751 2733 976 -1634
1430 -1634 -2347 -831 1825 2756 1158 -1521 -2220 -546 1880 2715 899 -1334 -2391 -497 2019 2985
1446 2985 994 -1309 -2133 -840 1999 2876 1086 -1466 -2391 -605 1742 2356 1126 -1627 -2469 -840
1462 -840 1651 2450 521 -1855 -2820 -1062 1487 2291 575 -1879 -2649 -842 1488 2173 616 -1662
1478 -1662 -2390 -897 1675 2468 691 -1638 -2475 -931 1687 2394 633 -1681 -2534 -670 1432 2459
1494 2459 863 -1841 -2272 -1016 1616 2180 552 -1717 -2733 -630 1564 2242 693 -1904 -2385 -822
1510 -822 1318 2042 547 -1639 -2366 -864 1533 2096 365 -1934 -2604 -906 1272 2225 800 -1670
1526 -1670 -2346 -836 1294 2226 194 -1449 -2351 -1035 1634 2360 350 -1818 -2295 -894 1204 2029
1542B029j489k342o15J563K353K99j342k154o71J354K533N86j413k367n09J497
1558f88J999Q61j725k215n47J635K224O30j513k059q50J856J922O28j603k042
1574a487m93J565J764R83j710k216n90J732K042M48j537k280n73J291K498O36
1590B073j445k483n02J793K374J51j473k275l70J500J910O70j332j867r00J602
1606e74K222L86j183k140n81J462K376P1j385j908r06J951J762O40j415k035n02
1623a759J383J948O16j404k040n91J585K001L35j485j830n61J484J768L60j244
1639E66j881l52J345J866L42j092k155m05J469J986O68j459k100n28J586J846
1655A702N75j628j667o88J554J690M13j429j599n43J605J694M54j551j718m61
$$ plain form
1542 2029 540 -1802 -2417 -854 1499 1798 456 -1698 -2369 -1015 1518 2104 691 -1676 -2185 -688
1558 -688 1311 2172 447 -1768 -2315 -680 1544 2174 661 -1398 -2248 -392 1530 2158 555 -1487
1574 -1487 -1980 -415 1349 2332 622 -1594 -2184 -452 1590 2038 501 -1779 -2352 -1061 1437 2073
1590 2073 628 -1855 -2357 -564 1810 1961 488 -1787 -2157 -657 1253 1923 591 -1276 -2176 -574
1606 -574 1648 2034 851 -1289 -1870 -408 1968 2039 654 -1254 -2160 -209 1553 2193 778 -1257 -1759
1623 -1759 -376 1572 2188 784 -1256 -1847 -262 1739 2074 589 -1241 -1802 -318 1450 1810 566
1639 566 -1315 -1667 -322 1544 1886 794 -1361 -1766 -297 1689 2357 898 -1202 -1730 -144 1702
1655 1702 2277 649 -1018 -1706 -152 1538 1951 522 -1077 -1620 -15 1679 2133 582 -1136 -1597
1671a597J321J902N51j609j814m56J444J797L38j477j619l51J247J501P98j435
1687E41k059l97J399J989N28j519j634o00J395J939L98j236k066n85J494K002
1703A589K59j268j821m62J100J925K91j289j706k19J205J610M92j147k048l11
1719a800J265J601P60j337j934l33J362J802L24j380j809k8J155J657M28j367
1735C66j586o22J563J595L45j294j498n77J269J881L41j365j812o6J053J655M37
1752A685j332j525o22J334J789L87j450j726o81J502J547O72j679j327m61J245
1768f42J815K52j120j974j96J224J774N04j519j390k72J047J734L7r88j681l39
1785a734J172J826K14j211j592m19J270J626M70j628j247k85J136J703L71j286
$$ plain form
1671 -1597 -276 1626 2177 568 -1246 -1702 -258 1539 1877 400 -1219 -1570 -323 1178 1976 541
1687 541 -1518 -1915 -516 1473 2001 482 -1152 -1752 -357 1582 1980 744 -1322 -1907 -413 1589
1703 1589 1848 580 -1241 -1703 -603 1322 1613 324 -1382 -1601 -396 1214 1706 559 -1489 -1800
1719 -1800 -535 1066 1826 489 -1445 -1778 -416 1386 1710 330 -1479 -1507 -352 1305 1733 366
1735 366 -1220 -1842 -279 1316 1661 367 -1131 -1708 -439 1442 1783 418 -1394 -1460 -407 1248 1685
1752 1685 353 -1172 -1794 -460 1329 1716 266 -1460 -2141 -639 908 1580 -99 -1426 -1887 -642
1768 -642 1173 1425 305 -1669 -1865 -641 1133 1637 118 -1272 -1544 -497 1237 1274 286 -1395 -1734
1785 -1734 -562 1264 1478 267 -1325 -1744 -474 1152 1622 -6 -1253 -1538 -402 1301 1672 386
1801C86j706j94J133J737J38j197j655m8J191J542L28j407j572k43J394J506N98
1818A931j753j286k98J121J391M24j140j677pR23J765M04j522j415l87J147J472
1835A093M14j499j259k68J126J531L36j379j364l71J711J007N30j295j913J47
1851a453J283J339L19j357j293l92J195J465K70j113j423k33J304J250M37j175
1867D23j615p5J217J671J26j440j187n14J315J345O9r35j501o3J177J410Q5j153
1885C55j736K14R09J276M74j293j239m40J263J170N46j208j387k43J096J538K6
1902A321q88j654J91Q08J431L81j265j462j54R73J255P55j665j281Q0J148J088
1919A062L23j288j289r8J077J261L38j231j214q7J109J337j38j046j270M4J043
$$ plain form
1801 386 -1320 -1514 -381 1356 1494 297 -1358 -1406 -215 1327 1655 248 -1324 -1567 -173 1333 1931
1818 1931 178 -1108 -1406 -285 1106 1530 390 -1287 -1294 -371 1394 1798 276 -1139 -1526 -379 1093
1835 1093 1507 8 -1251 -1519 -393 1138 1474 95 -1269 -1640 71 1078 1608 313 -1600 -1453
1851 -1453 -170 1169 1488 131 -1162 -1554 -359 1106 1376 263 -1160 -1393 -89 1161 1598 423
1867 423 -1192 -1267 -50 1621 1747 307 -880 -1394 -79 1266 1335 400 -1101 -1164 13 1423 1508 355
1885 355 -1381 -1167 -258 1018 1492 199 -1040 -1480 -217 953 1499 291 -1096 -1339 -243 1295 1321
1902 1321 433 -1221 -1030 -222 1209 1590 325 -1137 -1291 -318 937 1692 27 -1254 -1174 -26 1062
1919 1062 1385 97 -1192 -1290 -213 1048 1386 155 -1059 -1146 -37 1300 1162 116 -1154 -1110 -67
1936f7J056L27j054j185n45J360J354qj451r88j12J112J202K16j146j241k6J125
1954g1J348j11q86j262k75R03J291L24j235j236L8J056J295j0r95j249k14J242
1972d7J127J1j054j325j34J115J114L55r77j653J02J299J141J17j120j207j15
1989a251J126J247l3q23j496K09P45J180J05q82j014l47J250Q85M21j244j238
2006a160k24J382J194J63j159j088k19J151J178k03p11j331j97J011J273oq35
2023B19j403N7R35J216K1q21j330m2Q06J089M04r70j275N7R94J072J69r64j264
2042a030l5J121Q51L45j014j392M2J019J121J9j043j083J68Q19Q76L26j092j114
2060a096p3J283Q63p3o91j312j07J164P71K71r76j103n8R94J140l8j186q15r2
$$ plain form
1936 -67 989 1316 262 -923 -1468 -108 1246 1238 -213 -1201 -1313 -201 1001 1217 71 -1170 -1196 -71
1954 -71 1277 1166 280 -982 -1257 -354 937 1261 26 -1210 -1172 -116 1179 1169 174 -1075 -1289 -47
1972 -47 1080 1091 37 -1288 -1422 -307 807 1162 185 -1468 -1366 -67 1074 1191 71 -1136 -1251
1989 -1251 -125 1122 1089 266 -1230 -1021 -276 904 1009 127 -887 -1234 16 901 1322 78 -1160
2006 -1160 -1384 -2 1192 1355 196 -892 -1111 40 1218 1015 304 -1027 -1224 -213 1060 1054 219
2023 219 -1184 -1127 -192 1024 1045 224 -1106 -1148 -342 747 1151 181 -1094 -1037 -43 1029 1198 234 -1030
2042 -1030 -1065 56 907 1252 238 -1154 -1112 -93 1028 1047 4 -1079 -911 -92 784 1110 18 -1096
2060 -1096 -1169 114 977 904 213 -1099 -1206 -42 729 1000 24 -1079 -1137 -143 997 959 -227 -1042 -1134
2079a134J190J088Or82j112j89J059J131j33o69j157k1P05J229K45j322r46r3
2097a105Q34J260R7q46j262k49J127J095J04q49j060r3P78J136J54j020q14o19
2115a332J266J228j49q91r87N4Q78R13N4q69q02k10R09Q16P1o55j256J68Q95Q79
2135I80J5r16r41K83M51J198P1j125r16L0Q37R80K66j051q97j71J024O67R9j073
2155a89o50n4R70J041j19j085p40m0Q49Q63L38j238r80J38Q59J024P0q39j103
2174h85n7Q33J295r9q65r95l7O88J090j87n27j065MJ012N59K60r90r10r2J010
2194D2J011k49j056q07m4R31Q56L81j000r70k00Q42J240k36p96j007J01Q77J086
2213A002l27n69q79m97J547N28R8r50r09q9Q61J023K21j129o58l18R68R36Mj023
$$ plain form
2079 -1134 56 1144 1150 168 -944 -1133 -74 1057 924 255 -902 -923 -218 1011 1256 -66 -1012 -1105
2097 -1105 -271 989 1086 240 -1022 -1271 -144 951 1055 206 -854 -947 -169 967 1121 101 -713 -1332
2115 -1332 -66 1162 1013 122 -865 -811 67 980 1034 165 -637 -847 62 878 949 294 -962 -794 101 980
2135 980 995 79 -862 -579 -128 1070 1141 16 -900 -870 -33 947 1213 162 -735 -906 118 785 884 -189
2155 -189 -839 -893 77 1118 999 -86 -826 -866 -17 846 1184 -54 -1034 -896 -37 987 1057 218 -885
2174 -885 -942 -109 1186 1087 222 -773 -810 -122 968 781 254 -811 -807 205 764 1024 34 -876 -968 42
2194 42 1053 804 -252 -1059 -1103 -172 684 1065 65 -905 -1105 -263 977 741 -55 -1062 -961 -84 1002
2213 1002 675 106 -773 -1270 277 805 903 -47 -956 -1045 -184 839 1060 -69 -727 -1045 -77 859 863 -160
2233a60q94J34Q33Q37K53j063r18J04R11J037O6j056r33j45J104R22l05r35l75
2252e83j46N97J008j18p46o62j23Q15Q39o6p93q31K66N62O76Q6p51j118L36Q17
2272F5O50J28j062m94J8R34N07J99j197r62L29Q88O45J74r04o93j18Q25Q00J4
2292G46o44r75j91Q97O42M0m89j128J31J074N46J97j079m46l71R36Q42R4p78p94
2312g50r4R15P91j93n19r75k10J024R32p3j024p29P6R51Q41n5o21j146K12P99
2332A52O52O4r76p60J06Q19P01q0o62r78L00Q15P15j98p09r15K72P92N86M1o41
2353I6q35k29J026P02k61m29q50L38N31R21k16j078m97j55J005P38O5r94m50J8
2373e54O06O10M8p90q70N74K88Q36L30j038p60m8P94P59m6q04q68J70P64P93j55
$$ plain form
2233 -160 -1054 -920 -87 750 1003 -60 -978 -874 37 1074 1140 84 -849 -994 110 1032 727 -208 -583
2252 -583 -729 -132 876 758 12 -650 -773 42 881 815 22 -809 -543 19 695 781 30 -1088 -752 65
2272 65 715 843 -219 -713 -695 239 746 945 -252 -1214 -885 3 648 822 -82 -775 -893 -68 732 746
2292 746 102 -873 -1064 -167 475 515 26 -1102 -971 103 649 846 -233 -679 -1050 -114 728 822 44 -750
2312 -750 -844 71 862 669 150 -825 -1035 -11 921 848 -176 -905 -829 122 963 908 287 -859 -647 152
2332 152 804 868 -108 -868 -762 57 758 678 16 -962 -662 153 868 670 -39 -954 -682 110 696 737 96
2353 96 -739 -968 58 760 499 70 -780 -442 89 1010 794 -284 -781 -936 69 807 872 -122 -572 -554
2373 -554 52 662 710 -80 -950 -376 -88 748 1078 40 -720 -768 26 785 739 -65 -933 -763 1 794 639
2394F39q14n04r2R60O53j37q94m38N6R19M67j80o70p63O1P91P24p1q22r24K43
2415g96Q44P81l5j033n01J17O29Q94k28q08l87J3O46O28n0q21q62K71O03Q45J25
2436H75j076p03K75O95N82N9m97j078K58P82O97k81r48l14J99N47O06J52q13p64
2456g47k3J028M71k32m56n08o6M40Q02Mo16q66K17O36N97j02n63n58j29Q54M46
2477F29K8q49k60q8O04Q60k27p24n03n5Q83M64L9j037n36J90P84K58J24r85k29
2498f30n7Q85N63k50n60o24J37O24O66j27o62p31J91Q48L86j61p01n97J22O34
2518d4N57J06n94o95l0P38O57j41q20m82P8Q12O27j74o63o61P5P69N38j91m36
2539B6o38M2O63O61k96m58o60O0P99N60r0p73m92j6O33P26k69o91l17n1P46N37
$$ plain form
2394 639 -175 -679 -771 189 842 705 -189 -627 -571 348 815 635 -35 -798 -737 54 778 707 -115 -1039 -796
2415 -796 48 829 794 -239 -740 -623 6 900 672 -136 -523 -510 136 764 714 -107 -969 -698 -95 750 875
2436 875 -201 -904 -629 66 648 707 210 -868 -610 172 869 588 -360 -674 -475 72 678 830 17 -747
2456 -747 -770 258 729 497 41 -467 -533 -93 709 713 97 -769 -552 84 681 579 16 -542 -671 183 629
2477 629 657 -192 -452 -540 64 924 697 -27 -530 -585 298 762 801 -236 -772 -582 202 460 584 -401 -630
2498 -630 -687 198 761 511 -49 -673 -536 88 754 627 -35 -766 -575 273 659 498 -203 -800 -678 -44
2518 -44 513 619 25 -670 -700 38 695 554 -266 -748 -670 142 769 595 -68 -729 -654 115 653 462 26
2539 26 -612 -570 93 754 458 0 -660 -600 199 759 669 -104 -596 -612 21 747 478 -213 -530 -581 165 702
2561G02l97m13o94K74P93L96l1q14k27K4O79K16On70q19J78O48Q36m09n13n39
2582f74J20O28M53O6p41m99J93N51N39l79n09l36p6O64M88J80q69n35K29O61M56
2603F10j8q27l79J78P20K57J97r10l47J30M77P27n44m59m11j13R82P49n84m45
2623a0m12P1L20N29j9m89o17K41M97N36j15k69o90l3N80O23m04n81l81L18O98
2644C93M9R6n82o55J41N93O81j59q03l62J9O60L97J3m36l67q7N56K90J15q19l85
2666f52P7R53L37l75n19l93L6O30P44l72p59l28J64O61M49K2o70l11M2N85M20
2687G41m45l98n06L61L71O08l29n81m64J94Q53J49J20p71m38J25M21L24J90l59
2707A66p39K3N15K98J51n57m30J55M78O92l60p24j98J08N87N23k09m67n84K85
$$ plain form
2561 702 305 -108 -802 -528 265 661 630 -184 -411 -387 292 508 514 -56 -875 -697 -49 787 378 -135 -674
2582 -674 -554 74 527 593 -148 -647 -454 97 636 257 -252 -588 -664 0 488 668 -201 -736 -507 154 610
2603 610 592 -235 -614 -436 284 541 738 -172 -519 -389 88 815 271 -188 -599 -712 270 1019 435 -10
2623 -10 -422 -351 -31 498 479 -10 -627 -386 111 647 532 263 -427 -460 120 743 339 -242 -623 -305 393
2644 393 442 538 -44 -699 -558 35 716 557 -246 -608 -589 71 468 481 45 -322 -409 147 437 552 -267 -652
2666 -652 -575 378 715 340 -179 -572 -536 94 838 466 -293 -621 -457 204 653 675 5 -306 -264 321 741
2687 741 296 -102 -608 -247 124 732 403 -178 -642 -448 405 554 674 -97 -535 -410 11 335 525 166
2707 166 -573 -550 -35 263 414 -143 -573 -418 60 752 392 -332 -530 -422 165 688 479 12 -572 -287
2727b87L42N16o2p72k99J71L50N57j61o22k66J00L86N54p3m68p60L42O24M53j51
2748D74n48n02j36Q14M94o5p40m69J94P09L52P2q28j81j19Q25K95j27n15n14P0
2769d45O49K86q4m64m87L01L63K27Kl80m47L65K68K60j92o12k13q4Q76L70k85
2790B74m62n04J45P53L50l40m41k19o4O11M42l99l07l78J23M02M88m2o71l65K42
2811c62N89K43j50o28j83L03K66L53o8n80j58Q2K88M77o5n00m51J12O97J68p6
2832C57o40l45L28N94J53p1l12q68O28L71J69k7m47l39K13M94N1j05l63m36K00
2853c95K97P09j67n02m30N2N40M92j10q00j89J58Q11k0k02m42p2k46N62M58m94
2874A0l62l50L23M51M17q7m86l66k3M38L12j70j44o70N23M90J41k9o80j62J43
$$ plain form
2727 -287 55 571 509 -263 -562 -391 -41 516 355 -267 -533 -433 -47 507 434 -34 -794 -452 172 625 474
2748 474 -74 -576 -712 102 596 531 -209 -678 -484 225 577 649 -179 -360 -479 346 641 514 -1 -515 -445
2769 -445 204 490 406 -58 -545 -244 119 346 348 -32 -479 -114 154 414 222 -390 -603 -687 189 559 274
2790 274 -188 -692 -547 206 556 216 -225 -444 -508 103 545 146 -161 -539 -416 -14 474 432 -239 -604 -362
2811 -362 227 470 320 -308 -491 -188 78 431 363 -217 -375 -293 -5 472 407 -93 -544 -432 265 433 357
2832 357 -283 -628 -300 294 447 376 64 -804 -176 195 364 337 -110 -449 -236 258 309 204 -159 -595 -395
2853 -395 -98 611 444 -58 -488 -436 104 596 486 -314 -503 -345 466 446 244 -198 -270 -516 46 504 10
2874 10 -352 -702 -379 72 489 402 -84 -450 -473 -35 277 107 -37 -707 -184 306 447 418 -262 -424 -281
2895b81N35n9J31n25j50J59L48J57J73o44j63K08L50J23m8m93k08J27L66K66J62
2916E34o93l37K20N87J74k27j80n43J15N34J21Q9n89j09K35K69L07k09l89l12
2936d03J15N59K86l94l33l17L45M5Q08m53l36m64N04K86J98n5n28k36O5L94K09
2957B95O3n31k26M07j31P17k68m92k05J51L55K08k40k17l99J18N04K39j32k88
2977g2j70P4N53K32l31n26J89j9R5K4K37m90j00M5L70N31j86o40k05J97M36P0
2999C14j71m38n4n6O75J72j17l62n39K56N34J43j83l47k76J56M85J98l11j46m28
3020d95M3N11M67n52j80l26K20N93k7j04k63k58k5O41J82Q6l93n97M02O9P9k2
3042E1j23l10N9K12N47l6o38j73J04L49J35K22n40k06K87L3M17r0j86n55J42L88
$$ plain form
2895 -281 254 195 326 -199 -349 -190 158 315 488 -156 -319 -111 239 362 314 -179 -387 -260 106 372 534
2916 534 -159 -496 -276 311 485 258 78 -465 -350 184 305 394 -195 -304 -69 200 507 298 -91 -403
2936 -403 -288 271 557 163 -170 -487 -142 -97 711 258 -78 -542 -38 248 446 391 -137 -373 -308 86 295
2957 295 358 -173 -399 8 -123 594 326 -166 -371 -220 135 343 103 -114 -513 -395 109 348 216 -72
2977 -72 -242 -168 385 617 286 -240 -51 -70 25 49 286 -204 -304 -259 111 642 456 -184 -389 -192 244 314
2999 314 143 -295 -349 -405 270 442 325 -37 -576 -320 214 357 174 -173 -449 -293 192 390 79 -67 -495
3020 -495 -452 59 526 -26 -206 -532 -312 281 254 150 -113 -371 -396 245 427 513 120 -477 -75 -6 73 51
3042 51 -72 -382 -323 -111 436 400 -238 -411 -307 42 177 399 -141 -347 -60 -27 390 300 114 -441 -299 89
3064H9K36j50k91m31K68N05J79l06m22k19K55J92J82N5l00m2j65L48K21J42l26
3085B0l77J21M73K34j82l26j93k08O45j23K37j59m66J78L07J49l41q2k34n4L84
3106CM48j18m25k40K41K58K47l39j44m29K47K77M04m8m34l42M5P43k9j49m78m9
3128c11P5K67M76j01n71k5P9K34L27k10k78j85K20J92J64J79n95k30r7L86N23
3149E19k24l96l79L50M26J60l40k73l3K7J81K49k24o6m27L87J21K83Q6n71j78
3170c22J81L67J97j13n28k08L04M45P7m10j59k7J58K48L1J6m79k69L87J22K59
3191B77j7l18j97J63K92p7o1k83j9J57L96L03l78l10l60M40K53P5k43j01m81M41
3213d8L67J42k51k32m88L09M07J20j58l25j27P2O22J32n99j05k47L26K00OK32
$$ plain form
3064 89 325 175 -116 -547 -279 226 405 99 -323 -542 -287 -95 87 142 -158 -200 -365 -17 204 346 20
3085 20 -357 -236 237 471 289 -37 -230 -438 207 84 321 162 -304 -126 181 330 -11 -93 -327 -381 3
3106 3 451 333 -92 -332 -91 167 414 75 -69 -498 -251 26 430 382 -52 -394 -349 394 365 216 -262 -311
3128 -311 -236 31 507 406 -165 -190 -111 123 450 240 -38 -223 -3 189 353 532 -63 -293 -390 -4 519
3149 519 295 -101 -480 -130 296 456 116 -157 -190 -163 18 267 43 -23 -450 -63 58 341 427 -144 -322
3170 -322 -141 226 423 310 -218 -426 -122 323 400 -10 -169 -196 -38 210 241 257 -222 -491 -104 18 277
3191 277 260 -58 -255 -92 200 123 62 -221 -240 -83 313 616 238 -72 -432 8 261 336 93 -8 -489 -48
3213 -48 319 461 210 -22 -510 -201 206 326 168 -157 -284 -212 410 542 -57 -162 -409 -83 117 123 355
3234C55n60k50L08M05Q3Lo78J84lN02j83J79l80l12J65J65M75m22k30j11K40P6
3256A1L02j65l69J55j7M74j14l01N7l68J80L80Om2l77J2l6K32K46k77q8q7K8k6
3280a84J63N0j16n33N99K84j49L02n91j35J44M78k0l28J19m53L48K22R6k64l61
3301c29K32ON63j43k61k74O8R5K02K36l64j68l71M95J18M35j46p32j00K46K57
3322F5M48m72k21j82L03M61j16k94M0q0nK97L3j91k38m1K11m3J81j98m2Q0Q3N
3346H4K3jp7k91K95M02k53j95j12Pk20N14J54j75k17j33J69K13j55K25m77k8J28
3369a20L57J37k90k59J7J34J61%o4k03k51N96K32k07Lm28j9n9J8L20J05n38l3
3392c91L73l0Q7k13J98j08q5N15k45j14q8j97R1L34Q9N7k92r1PM27q6o3l94j21
$$ plain form
3234 355 -205 -455 -147 258 341 344 -334 -150 -153 349 166 345 -35 -347 -182 -17 458 36 -194 -305 -65 11
3256 11 313 148 -221 -66 -83 391 277 -24 33 -335 -155 225 231 189 -188 -176 -212 20 266 -11 -99 -186 -158 -184
3280 -184 -21 29 -87 -620 -21 263 114 416 -175 -310 -166 312 292 -36 83 -370 -22 200 296 32 -329
3301 -329 -97 -91 472 329 68 -206 -138 -43 159 395 31 -137 -508 -13 105 540 394 -338 -438 -192 65
3322 65 513 41 -180 -362 -59 402 286 -8 32 -48 -53 244 277 86 -152 -193 18 -25 156 -42 -84 -4 79 84
3346 84 107 106 29 -262 33 435 182 -13 -125 -118 -338 176 330 155 -62 -195 -26 187 32 257 -220 -248 -120
3369 -120 237 374 84 -175 -158 -24 137 137 73 -130 -381 215 447 240 243 -185 -204 -263 -245 75 180 -358 -391
3392 -391 -18 -48 39 -174 24 -84 -169 346 101 -13 -101 -298 -207 127 216 273 -19 -110 -103 324 238 175 -219 -340
3416c40J69J50K81j44j54j96J94L28K8k17l37O9L79q7P0j67j07l69L74K68m0j36
3438A6L9o5j95L81O6l59J45K2r9J90K24k84k17j84J69J23M0J3m9p9J35J50m5j01
3462C6q6k32J59K07qq4j95J51p5K12k30n5k29L50M9Q0pJ22k96j05J87jL94l07
3486C7m94L58P8L27k73j22Oj14j8M12R4l73k42R1K1J84J32j31K77n53K44J93M0
3509A74j92j27j6L1L35q9k27%J21OJ98q1om52J09J58K57J44l72j60K50o7J00K2
3533A16o9o7m9Q4O8J36j14l26N8o1L35m5j50r4j96K6N06l1Nk6m42R3K37J79p0
3558A03j66j13J38K25j29j94r1L95N2P0j05Q9k34k72J84J1J14n6j76p9L80j69
3580b3J24j64J61l41J29L31k48N5j03j24J96J50O7k80jl3lm6L39j57K7l42R7L51
$$ plain form
3416 -340 -171 -21 260 116 -38 -234 -40 288 316 99 -238 -169 210 123 193 26 -81 -450 -76 192 152 16
3438 16 55 -10 -205 176 242 -117 28 50 -49 141 365 81 -136 -320 -151 -28 12 25 -24 -103 32 182 137 36
3462 36 -50 -282 -123 84 76 -8 -203 -52 -127 85 -145 -200 -429 -79 -30 50 43 165 -131 -236 -49 -50 344 37
3486 37 -457 -99 -21 306 33 -89 -83 -197 -215 197 291 -82 -324 -233 -212 -28 104 -27 250 -303 -59 134 174
3509 174 -18 -145 -161 -130 205 116 -111 -111 10 16 214 133 127 -325 -216 -58 199 343 -29 -189 61 -6 94 116
3533 116 47 -20 -69 15 83 219 105 -221 -163 -224 111 66 -84 -178 -374 -348 158 127 132 106 -336 -243 -6 173 103
3558 103 -63 -176 -38 187 58 -136 -227 168 220 290 185 274 40 -232 -48 -37 77 21 -155 -234 146 -23
3580 -23 101 -63 98 -243 -114 217 -31 24 -79 -203 -7 143 210 -70 -71 -104 -107 -153 186 29 56 -286 -189 162
3604A62k7l02J19j99M08Q8j56k7l03J34Q6K30j65qk59J90j05L07j06k05Oj88J08
3627b12K97Q1Rl14j99N70k4j76j18k65R7J77J78j51m4o3L0M00l1m10J38m7j08
3650a85J43K3K15r8mk14J62J03l2k11Q2j80J12PJ04Qj51o9JJ39J12k52J52j51
3674a84K68J11j0r6j65m1J05J32J38m56k0M0P8Q6K08j86P0j29l0J33k3j3q0O6
3698BK37k92J3J17q7j51K50q3J0o6r6J57l8J06K1Nm5k14N2J89n6M5o8j23J87K9
3724A01M8l13o6K36Q9j6J87l96M2M9K88j02J8m23L49k3o7J70k81J13q3j4L9J98
3748A43K1l6j40j55J20K18J40j80k81K91j54K53j51j72K68j68j29M02j94k84r7
3769b85L24j4L2j22J11j47j58L16j19L93p1l26k05K84K33L4m57M07l02L6J29j52
$$ plain form
3604 162 135 -167 -48 -247 161 249 93 66 -237 -103 -17 213 48 40 -219 -29 -134 173 67 -138 -132 -320 -212
3627 -212 85 166 175 -139 -338 232 208 32 -86 -351 -254 -77 101 -50 -94 -157 -127 273 242 -168 -30 -77 -185
3650 -185 -42 -19 196 98 94 -120 42 145 113 -98 -16 -196 -84 -77 27 35 -116 -185 -184 -45 67 -185 -33 -184
3674 -184 84 195 185 89 -76 -117 -12 120 258 -198 -218 -178 -100 -14 194 8 78 -51 -81 52 29 16 -64 2
3698 2 239 -53 -40 77 -10 -161 89 6 16 -50 -146 11 -27 79 100 105 60 -154 -102 87 31 76 8 -115 72 101
3724 101 149 -164 -230 6 95 79 266 -130 -88 -39 249 147 165 -258 91 68 1 171 -110 3 -80 -94 -55 143
3748 143 164 128 -12 -167 -47 171 311 131 -150 141 -13 240 89 -83 185 17 -112 290 96 -188 -285
3769 -285 39 25 57 -65 46 -101 -259 57 -62 331 260 -66 -271 13 246 280 -177 230 -72 -36 93 -59
3791e9j01O0n3J20r9r2K12j87J77N3k6J49o4n0k90K77J33j45r6k12J45K80j21
3814A1o3J8j37K02p0J12l9O5p8M9J39n2J92n18J59o0J85j62Rq8JL09m97L03N3
3839D3r2N8J10m0l2m5j23J08k0K07m51L68j22J63j27Nj00k3n9Q7j4Q3K05j46j68
3864a25K15k5m90N04M9n1j84Q7J67q9K5j12m7KL18k26m0j6L3Q2j01K6j08J2MJ65
3890G5r4L73o7m18q1K61J41k3J20k86j4K2k89K59K13l03O3L1RJ73k42K04r8n4
3914b5R8j0M9J56k57K8l07K82N8n6k97J93J21J04k7j14K2KJ4O7K3j14j52q0L30
3939A08j90J2k4J92j32J00K05j59j60j17Q1j06K60j31R9k41J96j16L3K28ll5J22
3962B22j58o2P8l6k8j43J20M3k08K71q2j57j62M54j16N4l9M0p2J61k91K23k56
$$ plain form
3791 -59 -160 -100 -153 -33 -132 -224 -12 -199 -22 31 5 154 90 40 -250 27 160 15 -81 -293 -148 132 11
3814 11 -52 -34 -171 31 -39 73 34 99 21 70 209 157 349 -169 -10 -70 115 -47 -38 -126 -125 184 -313 -10 43
3839 43 -49 9 119 79 47 2 -121 -13 -33 174 -277 91 -31 132 5 10 -90 -113 -172 -85 -99 -16 189 43 -125
3864 -125 90 65 -425 79 128 77 -107 -20 147 58 83 -29 -76 -74 244 18 -22 -38 -5 77 -24 2 -106 -94 -90 75
3890 75 -19 354 287 -131 -212 49 190 167 287 1 -13 9 -280 -21 192 -111 -48 -17 -8 165 -77 127 29 -25
3914 -25 73 63 112 268 11 39 -268 14 72 16 -281 -88 33 137 110 -4 18 20 34 101 124 10 -142 -222 108
3939 108 -82 -70 -94 98 -34 66 271 112 -48 -165 -84 -190 70 -61 38 -203 -7 -123 -90 138 135 100 222
3962 222 64 2 80 44 16 -127 -7 36 -172 99 17 -140 -302 152 36 90 51 91 19 180 -111 112 -144
3985a44J28o5K91n6l63L26p3j8J66l79J07k1R2J39p4Q1n6j73k67K76L78n35J26
4008a14k4P4L81j63J36m96L01k32M14k60J09m61j38K85L86%n64M30r7l4R7Q7j42
4031b5l78L02J29LK14l31j76J57Q2Q5o7j77J8K78k66J9M97j86l44J08J93m3j57
4054f5P7p8J84j02O5l23J03J80m5k16L79j30J25o7m27K69%J13J00k24q4R0J62
4077H6no6N6k18K86n5L9K9l90J34L8K2J03r9J29j08Mm8J54K42l57J17J78j57J4
4102A28r7j99J79k8k4K21j32j22k24K0K59J50p9r9O3n8J27l0J3J06j75M7j73K3
4126a04J14m4M1J98o0J7j52J86k47K2j1l6J78j91k63K87J89k76O7r6K84k40L11
4149A74l21K42J2j51L25j74n7K5p3l4J19j36J46o6L0j46NQ1J46k76K21k6k9j77
$$ plain form
3985 -144 -16 -81 210 154 -209 117 44 26 192 -187 -80 -101 -9 130 56 137 81 -92 -359 -83 295 -240 -114
4008 -114 -138 -64 317 154 290 -206 95 -137 277 17 126 -335 -473 -188 198 198 -366 64 -33 -67 30 117 -25
4031 -25 -403 -101 28 31 245 -86 -262 -105 -23 62 -5 -182 -164 114 -152 -133 364 178 -166 -58 135 92 -65
4054 -65 12 -66 118 16 81 -242 -139 41 -4 -220 159 29 154 87 -340 -71 -71 42 142 -82 -166 -76 86
4077 86 81 15 71 -147 139 84 123 152 -238 -104 -66 -44 59 -40 89 -19 -15 -63 91 333 -24 93 271 114 128
4102 128 31 -168 11 -17 -41 180 48 -74 -298 -278 -19 131 52 -47 16 -42 85 55 68 174 -1 46 -127 -104
4126 -104 10 -34 7 205 145 162 10 196 -51 -29 -40 -76 102 -89 -352 -65 124 -152 -85 -181 103 -137 174
4149 174 -147 95 107 -44 281 107 50 75 2 -32 87 -49 97 31 61 -85 -80 1 147 -129 92 66 37 -140
4173a40K34j44Q0k33K70P0o8o8JJ63l3j2PJ61n90K60J10K17k85J12k53J55J71
4196A85J22J3j10m38J41K41R5k40K7j16p4K86k12J6o8J33j16J85p5J1j48O8L2
4219d2J27Q5lo6K7l76K36m3J76j63j76K85J88j66j57J95l2l27L5K57k28MMl7M01
4244B04j96K58l19Q0o3M3j10K43k04J87l08J49M9J13l22K28J31k04J33q1O7k07
4266a29R4l9k1P8j66J30k9K83l29J40j19K1K49l14J14J69k63k30J56N16k98J40
4288A53j59l1J02n9P3k24L60k74R3J56j70J07k60n3M6k5N8L58o9m06J28P0N6q0
4312e0r5R0J14M4k5q3n6J40J10k23K31k13K5j95K23K41j09k62N2oN7j45K42j8
4336H9p6r2J98j52qok12N36l53K20o8O7j84N4j33J77kLM0k36K97r4m7N8N3k28
$$ plain form
4173 -140 94 -50 30 -203 67 137 69 1 2 165 132 120 127 288 -302 -42 68 285 0 112 -141 14 185
4196 185 307 320 210 -228 -87 154 249 9 36 -80 -154 132 -80 -64 -132 1 -115 70 -5 6 -142 -74 -42
4219 -42 85 170 167 101 128 -248 -12 -55 121 -42 -218 67 255 89 -68 127 95 -232 -197 60 -168 -164 -160 -197 204
4244 204 8 266 -53 27 -36 7 -103 140 -64 123 -185 -36 13 126 -196 32 163 -41 92 11 78 -129
4266 -129 -35 -74 -95 -17 -183 -53 -82 201 -128 12 -107 -86 163 -151 -37 132 -131 -361 -205 311 13 153
4288 153 -6 -37 65 6 79 -145 215 -59 34 190 20 127 -133 -186 -140 -165 -107 251 182 -224 -96 -26 30 -50
4312 -50 -145 -55 59 103 78 -5 -61 79 189 -34 197 -16 9 -186 37 278 169 -93 -41 -47 10 -135 107 89
4336 89 13 -79 119 -33 -41 -47 -259 277 -76 144 76 143 -41 13 -120 57 55 58 98 -138 159 65 18 76 129 -99
4362i9K60k47K90p3k21N0j30J27J52ll38l2J51m1P3J23p2O8K15l14K01l8k73J68
4386cM7lM1l0j86J33K99j77N0k01n5Mj63N00l2k57P4k47K96j2k7J20r7j71l9J25
4412a1J30pj94N0J9k30L26M1k1j94J04P7m7k73K0L74n0l3K60j54j03l04K63N8
4436A01Q5n9r3j54Q3R6j20J64j42k24j22N77k55K34j58k31J10K87o1k90J94r6
4458g4j39M45L1j29j86O4J51L6J3j7j97n4n9p6L93l62M17k74L4q5q7L04K03m32
4482h0p7L6L7K98l05K50l27J77J0M1J66l25j15K23nl9J1oN9p8O3K22l20N3K61
4507B30l09Q8M2q3j47JL94J22j90k81r2L11q8j32K15j32j60J67P2K31k85J04k10
4530a32J3K45k2n8k50L98j8j69O0N8k75J08M2k6Q6R5k68J3J36j19K88k34M4p7
$$ plain form
4362 -99 161 -86 204 131 -90 -40 -170 -43 109 106 -232 -264 -113 -154 -81 42 -30 38 253 -61 140 102 -171 -3
4386 -3 44 41 82 52 -134 -1 298 121 171 -30 -85 -81 -244 256 224 -33 41 -206 90 78 51 171 74 -97 -136 -11
4412 -11 119 112 -82 -32 -13 -243 83 124 103 -91 13 90 43 -230 -210 164 114 81 341 187 84 -220 43 101
4436 101 186 127 34 -120 -37 59 -61 103 -39 -263 -385 192 -63 171 13 -218 -108 179 118 -172 22 -74
4458 -74 -213 232 263 134 -52 12 163 199 212 195 -2 -56 -115 -191 202 -160 257 -17 17 -68 -155 149 352 -80
4482 -80 -157 -121 -84 214 -91 159 -168 9 19 60 226 -99 -214 9 4 -35 -24 -30 29 -49 14 236 -84 -31 230
4507 230 -79 9 51 -32 -179 -178 216 338 148 -133 -225 86 -2 -134 81 -51 -211 -44 28 259 -26 78 -132
4530 -132 -119 126 104 46 -204 194 176 7 67 125 -150 -42 0 -26 60 155 -113 -100 36 -83 205 -29 15 -62
4554f2o2L06N5k30j99J2k45N99N6k46j46J12K9N7M7r3k27K97l9OR0j28j59l1K57
4579E6L5J50l31J92l25%K18k1M8r6o7k39K27L55j31q7Q1q8%R5j40j3J4J38r5P
4605a7j55R2J75k27J58j6K5q9J15j56R6K87k52j96P2j2R4J67j86J37J8j89M1q4
4629a02J99M6k99R0K86j39m6j5m3j9K42j93r9%q7J34K23J40k48l2k52J81n2N8
4653b7Pm8L0K07k95n6J51R3k98O4K11l5j71M6K1k7K56r6J72j54n7P9J70j49k26
4678a32R3j19K08j80K94l17J40J2R1n8p9K12k80J18k68K16LJ29k74k7p9L99j44
4701d2J50j47j82Q3J70j56pm3M1K67k19K37m4q5j30J8J80M5N9j98j27J82J85n7
4725A80k03j08J65qK6J7k51J26O7o2J93j67lPl14L97P4l0M3k00j22J28K01q7J70
$$ plain form
4554 -62 -124 182 237 7 -192 -180 -425 174 230 -16 -162 -50 -21 36 83 -10 -237 60 21 27 117 -11 -170 -201 56
4579 56 91 241 -90 102 -223 -223 -5 -26 22 -74 -141 -380 -153 202 71 -16 65 -23 -23 72 -68 -81 -67 71 -24 -17
4605 -17 -172 -80 95 -132 26 10 35 -54 61 -95 1 288 36 -160 -88 -100 -6 161 -25 112 130 -59 -18 -102
4629 -102 97 143 -156 -66 220 81 35 20 -23 -42 200 7 -92 -92 -179 -45 178 318 70 38 -214 -33 -85 -27
4653 -27 -20 -68 -38 169 -126 -182 -31 62 -236 -172 39 4 -167 -121 -100 -127 129 33 205 51 -6 73 243 94 -132
4678 -132 -39 -158 50 -130 164 -153 -13 -1 90 32 -47 165 -115 3 -265 -49 -46 83 -191 -218 -297 102 -42
4701 -42 108 -39 -221 -138 32 -124 -131 -174 -133 134 -85 152 108 23 -107 -89 91 136 195 -3 -130 52 237 180
4725 180 -23 -131 34 26 52 69 -182 -56 11 -51 142 -25 -28 -21 -335 62 136 106 149 -51 -173 -45 156 69 239
4750B39l33p7L32j21J24p0l90K30J4K79j78K97l05l03R9K85J78k59J82n04R6P6
4772a09L33l34J52J11l03L35k80J85j80q2J63k00K77J86m89K27q6PK43r0j55K38
4794A49J0j41K22k62J4k90o9L57Pp9p3J54l6K30j46j28P7nl8J81k00J96l00J17
4818e3j26L21j73j57J75o1J70P6j84j08J06j72M14k03L0k40Q0MN4J65J14l83K41
4841I0j81P4J85k44N7j05j32j0pM07j10k19j49N80k71N0j68K81m16K59J00j5m4
4864A2n4j05P1M11j33k11Qo1j70L34J02o5j97K5MN2o1P9o2j08R4J54j29L6o9J0
4890c3j5M7J89r7o6k66j9K11M3J61k93jJ30m9R1K78l83L8jJ05q9qO7j28M7J68
4916A27p3o1l1l87M35k6L4M3k73Q6J5J37R1r3j76O6O3n4J28R2j83j28J67LJ18
$$ plain form
4750 239 -94 -171 161 40 164 94 -296 -66 -52 227 49 346 41 -262 -163 122 300 41 223 -281 -185 -109
4772 -109 224 -110 42 153 -150 185 -95 90 -90 -172 -9 -209 68 254 -235 -8 -94 -87 156 66 -89 149
4794 149 159 18 240 -22 -8 -298 -367 -10 -3 -82 -155 -1 -37 193 47 -81 -4 -9 -47 134 -66 130 -170 -53
4818 -53 -179 142 -31 -188 -13 -74 96 172 -12 -120 -14 -186 228 25 55 -185 -105 -101 -47 118 232 -151 90
4841 90 -91 -17 168 -76 -19 -124 -256 -266 -273 134 24 -195 -344 236 -35 15 -153 128 -288 -29 71 56 12
4864 12 -42 -147 -76 335 202 -9 -1 -62 -232 102 204 139 -58 -33 -29 23 -38 41 -21 -129 -35 119 -10 26 -43 -33
4890 -33 -48 -1 188 91 25 -241 -260 -49 -6 155 -138 -139 -9 -58 33 311 -72 -34 -35 70 -19 -27 40 -88 -41 127
4916 127 54 -7 -38 -425 10 -16 18 61 -212 -126 -111 26 117 24 -152 -86 -23 -77 51 143 -40 -168 -1 2 120
4941A20j64r4k26J78K40P9M2J1k32PJ80l6j99n3j0O6K00m2Pk85j59N18k04J29
4965G3j66J45j82M04P0q4O8m69j6P2N7L5o6n6J21j37J45R1p8k44J86k2K98j99
4989D6o3n4o1K57p2k24J77j06K8r4K67J58j73J3k57K10K3k30L80n46O4J75L02
5012B20j82j36j41K36O0NP6k23l5J34j13J51k5J52K7m88J08M04l1k33P3nk07K11
5036C8j81J69l45J90K28K51k29q6n1j37K54kmj41j08J7O6J28O3j52pj58J01J38
5060D2J49k10j79K20K7k82J70K02l74K97%J36Q1m04j5L8O8L55l09q7j29J87j40
5083a57L35R3J3l67o8K09R7j43j92L75l86J3J21J93q1j81J12n5LJ9K2j47K67l36
5107b41K97K8k13J66p9O6J05ol30K88p3Q6q6l9J07k39K8lK56j4j20j94J47P8R5
$$ plain form
4941 120 -44 -138 -364 -186 54 133 175 186 -46 -39 141 105 -94 -147 -157 -91 109 67 74 -211 -370 148 -56 73
4965 73 -93 52 -130 274 344 260 328 -141 -157 -85 -28 7 -59 -115 6 -131 14 105 27 -217 -31 -53 245 46
4989 46 -17 -71 -132 125 53 -171 6 -100 -72 -166 101 259 86 99 -158 52 75 -155 225 -321 -257 -82 220
5012 220 38 -98 -239 -3 57 62 138 -85 -120 14 -99 52 27 179 206 -282 -174 230 199 -34 39 34 -173 38
5036 38 -143 26 -319 -129 99 350 121 35 -16 -153 101 99 95 -46 -154 -137 -71 57 120 -32 -39 -197 -96 42
5060 42 191 -19 -198 22 49 -233 -63 139 -235 62 62 198 279 -125 -140 -102 -34 321 12 -75 -204 -17 -157
5083 -157 178 271 284 -83 -151 58 155 12 -180 195 -191 -178 -57 136 55 -126 -14 -69 -66 -47 -25 -172 95 -241
5107 -241 56 84 -129 37 -42 24 129 123 -207 81 8 94 8 -31 76 -163 -135 -138 118 104 -16 -210 -63 15 110
5132A10j70K73k57J3J74p9K12l0j24q8kJ69K7k40k10R7J82o4J01k27j98pM00J72
5156B34k52j09L30l87J66M3N4j4k04J79j72L33oj02r2o4mL20k36K7j36J54j63
5179a01L19k8j56j78j00L87o2J19j28j43N7l9p5R7R7L9o4j53L3N2M3k07J9J15
5203e7l4J71j73j5l7K26J04k51J28p3j18M3K73l21J16k11L19j98R8Q1j64k1r2
5226b06L80J36m24j32Q7N8K68K2k67Q2j23n0L08j97K75l31j31L24m7j10J67N9
5248A48k65O1k2J03M4o5n5m6M5K01j85k3R5j4m4J28J0j3k70NJ14K17j05k20K54
5273I8j09j73K10J42j37J8j86l3K19K4m2p4m4K7J14q7J09m24P9L73k4q6k11o3
5297b80K22o2k9K85k32M5K24j45r1R2O6j80K20n2L6n3j37rN7n2r6J21J25nj83
$$ plain form
5132 110 -60 213 -44 -31 143 64 276 246 122 34 32 201 228 -12 -222 -125 57 -7 94 -133 -331 -338 62 234
5156 234 -18 -127 203 -184 -18 25 79 65 -139 40 -132 201 195 93 1 -63 -67 253 17 44 -92 62 -101
5179 -101 218 190 34 -144 -244 143 81 200 72 -71 -14 -53 -128 -31 66 105 41 -112 -79 -27 16 -191 -172 -57
5203 -57 -91 80 -93 -108 -145 81 185 -66 62 -11 -129 -86 187 -134 -18 -229 90 -108 -10 71 -93 -114 -206
5226 -206 174 310 -114 -246 -159 -101 167 189 -78 4 -119 -169 139 -58 217 -114 -245 79 32 -78 89 148
5248 148 -117 -56 -78 25 69 4 -51 -97 -52 149 -36 -59 36 22 -22 106 116 103 -167 -162 -48 169 64 -156 98
5273 98 -11 -184 26 168 31 49 -137 -170 49 73 31 -43 -87 -60 54 -33 76 -348 -269 104 80 -6 -217 -280
5297 -280 -58 -120 -149 136 -96 -51 173 28 -63 29 95 -85 135 83 119 66 -71 -80 -23 -75 -171 -50 75 70 -113
5322a13R6M6J96K4n52L23N2j11J71j54l03K85qj34J22J4k30J68l7o3M01k11j55
5345a73K00O2j73J11K1l22J15P5K83k56L4o2j68J96K51j80k8j37m1K57k40K76
5367A01k17J76k34l8K50o7K98j60k64K45j34K56j49o5j56K78J4j25R6o6j18j31
5389b10K53K67l89M0J11J7%qj0M0j79J63r1J06k03K97j78m6K19j57j93N1P1P4
5413D5rJ26l6l60L02p3P3J56j74Q6j25M2Q4k75N2j14L23l07N29l30j02j88M3k8
5437b60M10j52M4J12j46j27J09J20k24J12j68J92J63K5k51j73J04K45l38N28l55
5458c0k3J26j20J95j10k35O2Q2Q7K8L2k04L27l76L42j17J42K3j50j31K07K02k08
5481A51l44J86k8m5L14l4j62o0m5l6J10K35l6m17K56M1j9R3k02O3M8q5O3k61J5
$$ plain form
5322 -113 -17 29 225 249 -303 20 72 -39 132 -22 -325 -40 -48 -182 -60 -46 -276 -108 -145 -208 193 -18 -173
5345 -173 27 89 -84 27 48 -274 -159 -84 199 -57 -23 -85 -253 -57 194 14 -14 -151 -192 65 -175 101
5367 101 -116 60 -174 -212 38 -29 269 109 -155 90 -44 212 63 -2 -158 120 134 9 105 39 -79 -210
5389 -210 43 310 -79 -39 72 89 89 81 71 111 -68 95 4 110 -93 204 26 -20 199 42 -151 -100 -29 45
5413 45 36 162 126 -234 68 -5 68 224 50 136 11 53 137 -138 -86 -200 123 -184 345 15 -87 -275 -232 -260
5437 -260 150 -2 42 154 8 -119 -10 110 -114 -2 -170 22 185 210 -41 -214 -110 135 -203 325 -30
5458 -30 -53 73 -47 148 38 -197 -135 -53 34 62 94 -110 217 -159 183 66 208 231 81 -50 157 359 151
5481 151 -193 -7 -35 -80 234 200 38 -22 -67 -103 7 242 206 -211 45 86 67 160 -42 21 69 -16 47 -214 -199
5506a99J59j08K68K2M4J56l92j71L28m5KJ19l59j04L00M2j2n9k09J94j16M16k14
5529F2KRj16L1j6NRj49N7M3K83j91r6j90J53L03l08j84K57O2j45PJ34K12k85r9
5555a50J4J05J88r4j91J22j18j0J19O5p4j31N2K82O5r1j90j46L50k03j98M16m5
5578A37k04Q8J05J15k39J86l65j13L37j80K26qQ6j4J82l42R9j11kN3J47Q0j26
5601A37o7j99M8J99Mk89J82l5n7J77j63M5k03J43P5r7R2m3j38K63j19q8K85k73
5625a21K4J71J08r8J29k50r0O3j11L71R6N9m02k19R9J12L69j80P8l90R5q5L53
5648A81k58K82k32o1J31q4p2K99k59j40M19j95o2M0l2k8L21l7o1j96l4j52K97
5671F7N5M3k35J03k17R4j1N28k54k65J02r7K42l15P4J96k87J03J52j76J9m6O1
$$ plain form
5506 -199 -40 -148 120 142 186 342 -50 -221 107 62 64 183 -176 -280 20 62 50 -9 -218 -24 -140 276 62
5529 62 64 73 -43 -12 -28 -23 -14 -163 -106 -63 220 29 -67 -257 -104 199 -109 -293 -36 26 -119 -112 22 234 -51 -150
5555 -150 -136 -31 157 63 -128 -6 -124 -134 -15 50 -24 -155 -103 179 244 153 -37 -183 167 -36 -234 182 137
5578 137 -67 21 126 241 2 188 -177 -290 47 -133 93 85 171 157 339 -3 96 -15 -17 36 183 263 137
5601 137 70 -129 -81 118 122 -167 15 -20 -77 100 -63 -18 -221 -78 -3 -100 -8 -51 -189 74 -45 -133 152 -121
5625 -121 -97 74 182 84 213 -37 -127 -64 -175 196 292 351 -51 -270 -171 -59 310 130 208 -182 -87 -172 181
5648 181 -77 205 -27 -88 43 -41 -113 186 -73 -213 206 11 -51 -11 -43 -71 250 213 152 -44 -78 -230 67
5671 67 122 165 -70 33 -184 -90 -101 427 173 -92 10 -87 155 -160 -86 110 -177 -74 78 -98 -79 -125 -64
5694f4N2J93m0j67j28J57P6j14M4j17J60j22m2K34k04K23j22j1l7L38k16j02J19
5717A10l00K51j05o6J52o8l5O7J53n2j38m9m3n2K17n9n5p0L58k36R7k29Q4qK67
5742A91j97N4N1j24k18O2J68q7K76j36K26j23j67J14J56k70J1r3j84L31j3J16
5764A44j43j26M77j23j88lR5k64P8J93J0k68J21k2j3Q7rj54R0P0o8J23k56K7N6
5789f6L3P3p1j22J30R7L9j36J14O1q7k54K45K75k77l3N7k30K25K20j37N9ln10
5813b98L62J3O7Mr0k23O6J54J52k22N3j15J12J35j85L40n85J59j04J39j3K47k10
5836d2O1J2l31K20J34Q4l99J09o9L46L6k28j89K93o9j72M39k69j08J67K10J4l45
5859i6K70k33K49k50M1K77l38n1J41o2J65M6j37j63K11k30L04l44K71l30K73j41
$$ plain form
5694 -64 -12 181 141 -26 -154 3 79 -35 9 -108 52 -70 -112 122 -82 141 19 8 -29 309 93 -9 110
5717 110 -190 61 -44 -110 42 -26 -61 6 159 107 -31 -80 -123 -175 42 -17 -72 -142 216 -20 77 -152 -68 -76 191
5742 191 -6 48 99 -25 -243 -181 -13 -100 176 40 266 143 -24 90 246 -24 -13 -106 -290 41 28 144
5764 144 1 -125 352 229 41 38 133 -131 -53 140 150 -118 3 -19 -32 55 46 -108 -18 52 -16 107 -149 -122 -66
5789 -66 -33 40 -31 -153 -23 74 113 -23 91 152 65 -189 56 331 54 21 78 -152 73 293 156 215 212 -298
5813 -298 64 77 144 148 58 -165 -99 55 207 -15 38 -77 35 170 -15 325 -260 -101 -205 -66 -79 168 -42
5836 -42 19 31 -300 -80 54 138 -261 -152 -221 125 161 -67 -256 37 -32 -204 235 -34 -142 25 235 249 -96
5859 -96 174 -59 190 -60 -19 258 -80 -131 10 -52 113 159 22 -141 70 -160 144 -200 71 -259 14 -127
5881a27P3K22j48j49n1r0J90Oj73J38k3J14j0K92k11Ok60K45Q1L2k43jL4J2m7
5906h8J25L8pn9j84K19k7j16K25j80j6K14k90J78J43k60Q2R0l15N56j88k12j89
5929b61L19l4J08K0j99M0j20K57J7j63o2OR1m5J00l13K81k35L05m1J4l51K05J0
5953e1J07J44m06J65J13j48K56M2k41m9l1r2K19k35J92J10j10j18K78m38J33L76
5975B16l64J74j9j65J88j62K42k74L81j4l28K15j35J42j57K8K70k09j04J16K9
5996G0N9m35K83j32K76m5R6j16j02N7J45k16J79k88l8K35R8K27m96J05K12k78
6018a04J25j14K53j41J3k7o8K36o3j01j8J85j96O8q0j49R4m0k1M56j98OM4l69
6042b09K44k39K07j4k7j6r3J8M32j63j04K05j66J02lj18j01k03K41L9r8P8o5L20
$$ plain form
5881 -127 -54 168 20 -129 -180 -270 -80 -74 -247 -109 -132 -18 -28 264 53 59 -201 44 125 157 -86 -87 -53 -41 -88
5906 -88 37 75 68 9 -175 44 17 -99 126 -54 -70 144 -146 32 175 -85 -3 87 -228 328 140 -72 -261
5929 -261 58 24 132 152 -47 -7 -127 130 147 -16 -78 -72 19 -26 74 -239 42 -193 112 71 85 -266 -61 -51
5953 -51 56 200 -206 -41 72 -76 180 222 -19 -68 -99 -191 28 -207 -15 95 -15 -133 145 -293 -160 216
5975 216 -148 26 7 -158 30 -132 110 -164 217 203 -125 90 -45 97 -60 -32 238 29 -75 41 70
5996 70 129 -306 -23 -155 121 76 172 56 -46 11 156 -60 119 -169 -207 28 126 353 -143 -38 174 -104
6018 -104 21 -93 160 19 32 5 -63 173 110 9 -9 176 -20 48 -32 -181 -87 -127 -148 308 110 116 160 -209
6042 -209 35 -204 3 -11 -38 -54 -147 -129 303 140 36 241 75 177 174 56 -45 -248 -7 32 -66 12 -53 267
6066B67j40J42j96N9j31Q0l23K89J8L8j08k20L51R2j95j36J14k2K63k37j4q9k5
6089a23K57M9k93L54r5j47j98L14n4j57j3J40j73K51j1O0k26K6K3k37J37K28l34
6112b22oM14l42K58j43J56k76L9Q7K28j97j01N6o8L26P2j9j32l12k7K62j11K4
6135c4j36L48j93o1J46P0m8O1j27j20K44n7n7k01J55M3P3j97j18J83j17J74j0
6158B1N6l9j61J49K34k46j41l0R6j04J41p9k1J83k07K95K06n02J19p5J09pK79
6181B76r7l40J03Q8K34l71J25O1j57m1J73j60N6LP4K08j56j83K11j54j27J36Q8
6204E0j03N5o6J98j85M5j6K30k27k88L35r6J19m9J16J7Qj68J65j29Q2j09m0%m1
6229i7J44J13j30l8J95j66o7p2j46J84K31j91J29j73J17j09J80N6k5k15k41J66
$$ plain form
6066 267 127 269 73 132 1 81 -242 47 65 103 -5 -225 126 218 23 -113 1 -21 242 5 -9 -98 -123
6089 -123 134 183 -110 244 149 2 -196 118 64 -93 -106 34 -139 112 101 161 -65 -39 -16 -253 -116 112 -222
6112 -222 -228 186 -156 102 -41 115 -161 -122 -35 193 -4 -105 -49 -117 209 281 262 130 -182 -209 53 -58 -34
6135 -34 -170 178 -15 -76 70 140 92 153 26 -94 150 93 36 -165 -10 33 106 -91 -209 -26 -143 31 21
6158 21 77 38 -123 26 260 14 -127 -157 -61 -165 -24 -103 -124 59 -148 147 353 -149 -30 -105 4 -3 276
6181 276 179 -161 -58 30 264 -107 18 79 -78 -119 54 -106 -50 -47 27 235 79 -104 107 -47 -174 -38 50
6204 50 -53 2 -64 134 -51 -6 -22 208 -19 -307 28 -68 51 2 118 135 143 -25 140 11 93 -16 -56 -56 -97
6229 -97 47 160 30 -8 187 21 -46 -118 -264 -80 151 -40 89 -84 33 -76 104 160 135 -80 -321 -155
6251a55J26j12M89k74k32J2M7j5K82k45P8N3n8N9L1k14n6L06j78Q6K0np4J07j50
6276g2J84j26K68m04P4R8j20R4J59j26k9L9o6J80o0O9q4k33J42N0N3J39l87N41
6300C83m09O8l4J10k76j5L27R4o1m3j89Q0j3J67k67k12M75j08n5M1J05k56J02
6323A4J57M9J44m02N5m5j06J48J9J35j75J08q9m8k1J36Nj97J62Ok6k22J40q4j67
6348c04L92J19j57k17J97j12L14M5l02Q9m8o1j2J09O5k86J74j42N5l4J54J43m01
6371b20J76O3R1l07J50M9j06J82rk69J27R1L5k8J19j77O4j75N2J44J63j33k13
6394a31j61K1K45m2jj59K54j32J01J22mj57J28m25K74m3K70k47O0K08L3j75p7
6417c8M7M8r3n2J85j43K63k04k56K68Q7Qk76N1j57K66K20j17j18Q4R1j51M05m79
$$ plain form
6251 -155 -29 -141 348 74 -158 -146 -99 -114 168 -77 1 54 -4 55 86 -128 -184 122 -56 30 50 45 -29 78 -72
6276 -72 112 -14 254 -150 -76 22 -98 -4 155 29 0 39 -27 153 93 162 78 -155 -13 37 90 229 -158 383
6300 383 -26 42 8 118 -158 -173 154 248 187 144 -45 35 22 189 -78 -290 185 77 22 63 168 -88 14
6323 14 171 220 364 -38 17 -28 -134 14 33 168 -7 101 12 -36 -57 79 84 -113 49 55 29 -193 -53 -137 -304
6348 -304 88 207 50 -167 30 -82 232 277 -25 64 16 -45 -57 52 117 -169 5 -137 -82 -116 38 181 -220
6371 -220 -44 19 110 -197 -47 2 -104 78 69 -200 -73 18 53 25 144 -33 31 -144 -92 52 215 82 -131
6394 -131 -292 -271 -26 -68 -69 -228 26 -106 -5 117 113 -44 84 -341 -67 -110 160 -87 -27 181 214 39 -38
6417 -38 9 57 -36 -88 97 -46 217 13 -243 25 112 120 -156 -105 -262 4 224 107 -11 73 164 13 418 -61
6441f1j21J75j71Q2j04Q2L25j41j28OJ0o7K28J2o3k77L96k03k8pJ67n9n6j03J42
6466C6j83K9K88l53J74j55M57l79N8L9j39J06j81K75J54k93L8o1l3K87j12q0o1
6489h9K13j65o4J57j12J04J76k18K43n6r8r3o3J0oJ50R1n6k16J78n5P2j85l6P7
6514d1o6q2j2K73K1q3k20K58Q4r2mk4LJ34k61K27K8j60J06k10K46j57J09l9k38
6539b00L12n9K2j16j45m2K72q8M6k78M19m21K11M8P3j38K3QM2Q7O6k04K36M3l58
6564a41M5o8O7K07j25Rj88R6N0q1j55Q0Q5J80Q3k89j09K83J07l40K22r5K23k40
6588i4K0O7j20N6P5q6J62j46J17j21p5K18j43J46R5pj51K34q1j87K12k56R9O1
6612I5l9l3q1J20l25J91J44o6k11J58j0j62K09n4K9M4P1J8J27m14J72%P8m7qL1
$$ plain form
6441 -61 -182 -7 -178 -96 -200 -118 207 66 -62 -56 -46 -113 115 127 64 -213 183 -20 -48 -55 112 53 -3 -106 36
6466 36 -147 -118 170 -183 -9 -164 293 -86 -28 11 -128 -22 -203 72 226 -67 -29 -90 -123 164 52 -28 -89
6489 -89 124 -41 -105 52 -60 44 220 2 245 189 91 -2 -65 -55 -61 89 180 124 -92 86 31 103 -82 -118 -41
6514 -41 -107 -189 -201 72 93 10 -210 48 132 40 36 12 15 149 -112 115 143 -17 89 -121 125 -32 77 38 -200
6539 -200 112 53 75 -41 -186 -228 44 -44 2 -276 143 -278 -67 -19 54 -84 -61 -53 -11 76 142 -62 174 217 -141
6564 -141 -96 -164 -97 110 -15 -6 -194 -98 -48 -129 -284 -204 -119 61 144 -145 -254 29 136 -204 18 -77 146 -94
6588 -94 -74 -7 -127 -71 4 -82 80 -66 51 -70 -145 73 -70 76 171 164 13 247 166 -21 191 -65 34 95
6612 95 56 23 -58 62 -263 -72 72 6 -205 -47 -57 -219 -10 -64 -35 9 80 98 225 -189 -17 -17 61 14 6 37
6638C7J32o2j50M4J38l09L03o8P5o7j60Q4l6J09N7k52O0K29k46R5j38R6N3p1R4
6663D7p5k2K20k26L09k57k01K69K0j3j15r0m5nJ63o0M8m3K45n1j62J02O7q4K2
6688F3L4k5j32L6K65j34L6m9j4j87J31J5l6K29l8k09J4J11M5j34m7K1L9J13J4
6713A61m7J5j56J67Lk95K8J79R2k22P9Rm9j35L1K55k29P6P5j97K22r2l07L94m7
6738A0K28n1k08j28l7R8L72l80J35k00O8J72j85L4N1J05k30K24l29J29J7J54J14
6761A63l57J36J05q9k20J83o0L16j34r5r3j2J32k29J57L10j25j06K06j9Nj08K0
6784H6r0k58K64K38k66k7p0Q1J11J18l0l27O9L4m4q4J21Q0k13O0M79m17Q8r2K6
6809f3k3L9j7jJ79J03m7k07R0k8J20j85Q4J03J9l35K18j61j32M95j95j13L5J74
$$ plain form
6638 37 169 107 -43 1 139 -170 133 65 140 73 -87 -3 -39 70 127 -125 -65 164 -82 13 -125 -29 24 -47 47
6663 47 -28 -50 170 -56 253 -4 -205 64 84 71 -44 -134 -179 -184 -21 -81 -33 -76 169 118 -44 58 125 41 63
6688 63 97 72 -60 -24 241 107 143 94 80 -107 24 39 3 232 194 -15 -1 110 155 21 -26 -5 34 147 161
6713 161 114 129 -27 140 143 -152 -124 55 147 -75 4 13 -36 -171 -140 115 -114 -38 37 -160 62 -30 -337 57 10
6738 10 238 187 -21 -149 -186 -88 284 -96 39 -161 -93 79 -106 -72 -21 84 -146 78 -251 -122 -105 49 163
6761 163 -194 -58 47 -42 -262 -79 -139 177 43 -52 -145 -157 -25 -254 -97 213 88 -18 188 169 174 66 86
6784 86 -4 -262 2 240 -26 -53 -123 -42 69 187 157 -170 -101 -67 -111 -195 -74 6 -207 -147 332 -85 3 -89 -63
6809 -63 -86 -47 -64 -65 114 217 170 -37 53 25 145 -40 44 147 166 -169 49 -112 -244 251 56 -57 -22 152
6833A52m71K33K20j33Rj38j7Q2O5N9q3k42M12k47O8N3j50J10J13J37j73j28oK22
6857A47J58m27N9L04j35j65k51K73K49j36j53J29R5j94j4n0J47l8P4K08m80K36
6879C6M2m3m1mK28j6j4l48L05p2O4k7j73K02P1l43J67j61n2r6K93j96L02j13m3
6904c2O5Q5P9l0l76K02j05J78K14k63j71J86l4L6L0o4N6k12K09m8K12k13J0j68
6928a54L75J8j58k13k1J26l9j31K73J44k99m4K73k35L84k79J23J30k81Q8J00k15
6950c5J37j51o6J85l03Q5J53p9j00K36l06Q6J73j19J56j4J02r7Q6k71J05K9o7
6973g5K28j77l8J19j06K47m4q1j00l4K11k55J80j02p4J45kP6p3j0j2l37J65R1
6997e8M1k00J31L51m52K97m5k46K05J94j49k00L55l66K39o8k5K5P9j36J59k17
$$ plain form
6833 152 -319 -86 134 1 10 -128 -145 -63 2 61 -22 -264 148 -99 -31 22 -128 -18 95 232 59 -69 -75 147
6857 147 305 -122 -63 241 106 -59 -310 -37 212 76 -77 52 147 -47 -61 -111 36 -2 72 280 -200 36
6879 36 78 35 -6 -10 218 202 188 -160 145 73 137 110 -63 139 210 -133 34 -127 -179 -275 18 -178 124 11 -32
6904 -32 33 118 197 167 -209 -7 -112 66 280 17 -154 32 -2 34 64 0 56 -156 53 5 217 4 14 -154
6928 -154 221 239 81 -132 -153 -27 -66 -197 76 220 -79 -123 150 -85 299 20 143 273 -8 80 180 -35
6950 -35 102 -49 -115 70 -233 -148 5 -74 -174 62 -244 -158 15 -104 52 38 140 43 129 -142 -37 -8 -75
6973 -75 153 -24 -62 57 -49 198 154 73 -27 -61 150 -105 75 -27 -101 44 42 118 45 35 23 -314 -149 -58
6997 -58 -17 -217 -86 265 -187 110 65 -181 24 218 69 -131 224 -142 97 29 4 29 108 -28 131 -86
7019h6%K38j18k38L15o0L3j6J07j50J1j62K02l34J76P2j22J68MQ0J94o40K42K67
7043A83j42M2j07k0J58P1j40JJ38j29k56J38K0qJ25j91j02K04K3N1L08l13n1J39
7067A42l12K72j00Q3j21M8J9j31M77l54m5J86k84J96m0j67k2L32j92O0J18m24
7089b59L61L3j96P1PJ9j59O6K55k43N5j34ml90M93K20n5j58N7j15M9J55j09N4
7113G3k18M39j63N2j52o2K12q6j75K18j72l5l1j31J99L3Q8k45J74J5J44j06J29
7136B00j99N4k37j9L21l05L60j03N1j17L4J50r9k3j6l07K07K91l18J48j21J63
7158A15k01O6l7j3N3k12M99k94J65j48K4l23M36n6J5k95J41kNQ4K9k93K11K91
7182B60j93J01k99K73k60K24k22J39m3o3q9L43j26j34J50r5L8K6q6M3J7J00j62
$$ plain form
7019 -86 -86 152 34 -204 111 51 84 68 175 25 36 -126 76 -258 -82 -10 -132 36 40 120 314 -326 -84 183
7043 183 41 83 -24 -44 114 185 45 46 184 55 -201 -63 -43 -51 74 -117 -219 -15 8 59 367 54 3 142
7067 142 -170 102 2 85 -36 12 31 -100 377 23 -22 164 -120 76 36 -131 -153 179 -13 47 165 -259
7089 -259 102 135 -61 10 17 36 -123 -57 198 -45 10 -124 -128 -518 -25 195 140 -18 39 -76 -27 128 19 73
7113 73 -145 294 131 183 31 -31 181 95 -80 138 -34 -69 -100 -231 -32 1 89 -156 18 33 177 71 200
7136 200 1 55 -182 -201 120 -185 175 72 123 6 40 190 91 68 52 -255 -48 243 -75 73 -48 115
7158 115 -86 -20 -57 -70 -17 -229 270 -24 141 -7 17 -306 130 74 89 -206 -65 -67 -62 22 51 -242 -31 260
7182 260 67 168 -131 142 -118 106 -116 23 -20 -83 -172 171 45 -89 61 -34 4 30 -56 -13 4 104 -58
7205e8K2K32j14l4p2P1k0m7N0j60o7K12k66M56j53n7j34L10j55R0j46J50k45K12
7229G7j06P8N0j45O9P7l32K07m1RJ36r6M2J49j3j45M8j94K85ll53P0j8J74J02
7254A27k6j73Q4J43j38r8J55o4j29K23l0k45KK22k66m5K19R5J1Kj08k1J17r2K29
7279A94l28k33L90o1J31j40m3L7qL7K10k42J11M6p7P7n4J41j88j17k4o7K31m0
7303a7j27K06K5j42J6P1j99J93Ml0J09N2k71J56j33K30l30J65j88K71LO3k47J78
7327E8Mj29J75j01J9k24K9o5J82p9O9J18l3O7N6k20k38J85R0P0k83M86r4j79J1
7352b6o5k7J75j22o6N91m88n7j95K53l8o9L08q4k76J45l6M4j34J4j8J26M3j8P3
7377E3j38J49m8J37k97M4j32L42k33L45n7j92k8m1J43J9OM2j89J43J01k07J08
$$ plain form
7205 -58 -36 196 82 48 -24 47 27 -20 30 -130 -197 15 -251 205 52 -5 -139 171 16 106 -40 110 -135 77
7229 77 -29 49 99 -46 23 100 -232 -25 -66 -57 79 -17 25 174 161 16 64 -130 155 152 -201 -131 -149 25 127
7254 127 101 -72 12 155 17 -81 74 10 -119 104 74 -171 -169 53 -213 -258 -39 56 67 69 -39 -60 57 -35 194
7279 194 -134 -367 23 -38 93 -47 -90 -53 -61 -24 186 -56 55 101 24 101 47 188 0 -117 -141 -208 23 -17
7303 -17 -144 62 87 -55 -39 32 -167 26 30 0 109 161 -110 46 -87 143 -187 -22 -210 61 64 127 -120 58
7327 58 62 -67 108 7 26 -198 -169 -234 -52 -131 -62 56 23 90 146 -74 -312 -127 -37 33 -250 236 142 -37 -26
7352 -26 -91 -118 57 -65 -131 460 -28 -85 -280 -27 -65 -134 174 90 -186 -41 -77 -33 -167 -153 -171 -45 -2 -20 53
7377 53 -85 64 16 153 -144 -100 -232 110 -123 222 165 -27 -55 -96 47 66 72 114 -75 68 169 -38 70
7400G0j01l9J94j84RM9L89m38MJ16O0m08L06j50J03R6j12Q6j5j69k38M82j27K69
7424B52k39j08K8J55O8n6j36R0k17k6J87q3N3l77L79lm8J03l8K39n27M47k10K75
7448B08j45k39J22N9L27k99j27J20j3j40O8J82N6k71P0QO6l8M8j69J48j27K37
7471A51km02Q3J77p1J95j89N2n7l5l7lQ8p3K7N3J09J5k47J84j01O0J79j41Jo6
7497e0O7j06J14jp4q2K55l6j30NR9k27K7j2pK84q7N2j75K1j57K72K1j22J9O3J39
7524A72k60j38N0L74j27n3R3k6K6R8m3j58R6L1k37P7q3O6R4J16P3j00j76n6J71
7549H0m2J37l93J48J16j63J35l25L40q2K17j83j6N4J39j64N5j89L84k64L5l7N0
7572C2K5k22R1O4O6r2J90j30P8r4j04J18j45P8J77j66o6K10M3R7l65J15N1k15
$$ plain form
7400 70 -31 -70 124 -60 -51 -2 387 -51 -47 69 129 -279 27 -123 -20 76 -36 50 35 -134 -372 110 -17 252
7424 252 13 -95 -67 88 156 100 -36 54 -163 -189 -2 -85 -32 -409 -30 -33 -81 22 -16 223 -304 143 -67 208
7448 208 63 -176 -54 5 332 33 -94 26 13 -127 -59 123 179 -92 -22 -14 52 14 62 -107 41 -86 151
7471 151 149 -253 -170 7 -64 131 -58 -6 -63 -98 -135 -138 -50 -123 -96 -43 66 81 -166 18 -83 -23 156 15 16 -50
7497 -50 17 -89 25 24 -50 -132 123 87 -43 -38 61 -166 -139 -151 -158 126 39 91 -84 -63 -220 52 73 -49 -30 33 172
7524 172 -88 -226 -176 198 71 18 111 85 111 209 166 8 104 135 -102 -25 -108 -42 52 168 241 141 -35 -91 80
7549 80 38 175 -218 -70 46 -117 18 -307 33 -49 168 -15 -31 23 162 -2 53 -136 248 -16 19 -18 32
7572 32 57 -165 -74 -10 56 -36 154 24 102 8 -96 22 -123 -45 132 -34 -100 110 153 250 -115 0 51 -164
7596a64K21m04K62N2m6L6R7J58k18P1PK07k89r0r2L2j30J69K63j04M6J07r3J49
7620B47j69p2J46r2j76L46k39J24K2j90k15R5M21l13K97l36J2J19j36J89l63Q7
7642a96L05O9j60l3K30j26m1J05j27o3J29l12J77N4k31K44J6J36k38r6J67l1K27
7665B05l20P0J34j07J2R8J52m34L31j49j5M6J79l56K63j4j48pO9J00JJ67k16j00
7689c9K2K0J67j83P6j05j58J33n6N0J11l6L9L9j47J33j66O1j6o0K04o8l03J67
7713a15K75j12J87m5Jr9j1J53k26L50l23J20k37K76k29k18L86j30N9j34R0J39
7735A57l17K29n5l20J25J95j09K82l1n5l02J09L2L49m14nL01rl3q5K4K17j13l
7759A69k8j40L8J77j51r2k24J41J84r2k60K16L11k79j10L7K69r6j66J38k7J42
$$ plain form
7596 -164 57 -347 -85 -33 -79 -43 54 212 -6 65 72 279 -10 -100 -192 -160 -290 -121 142 38 84 191 98 247
7620 247 78 6 152 60 -116 230 -9 115 137 -53 -268 -173 248 -65 232 -104 -92 27 -109 80 -283 -196
7642 -196 109 178 18 -15 215 89 48 153 26 -37 92 -220 -43 11 -220 24 40 176 -62 -158 9 -22 205
7665 205 -115 -45 89 -18 -6 92 244 -190 141 -8 -23 23 202 -154 109 95 -53 -60 9 109 110 277 61 -39
7689 -39 -17 3 170 -13 63 -42 -200 -67 -123 -73 38 2 41 80 -67 66 -100 -39 -55 -115 89 21 -282 -115
7713 -115 160 48 235 190 191 92 81 234 8 358 35 155 -82 194 -35 -253 133 3 62 -72 18 157
7735 157 -160 69 14 -306 -181 14 -95 187 156 101 -201 -92 -60 289 -125 -130 171 162 129 44 68 285 172 169
7759 169 141 1 39 216 65 -27 -251 -110 74 -18 -278 -62 249 -30 -140 -103 166 70 -96 42 15 157
7781A57j68Q2j8J1Q1n6j98JK34k11J68j46L96k40k08mK18l9J37j83P4r5j35N5
7805h7p8K69j17J24l98L64M8j86K1Q8K26k36j8j01j91J91K1k0J59j18J47j65k55
7828c12M51n8j43M4Q7j86J87P7k78L24k15m4K16k69L02j17N4k12k3J32K61l63
7850h5J84j21j00R3J0N7Mj28OP5L4q0L9m9mO8L6j4o8r9J45p3J32j11j10j14L51
7877G8r8J83k02J99l47K05K99l56N4j10J05p3J64k44K15l7K02k77J35M2k12K01
7899A26k68K1M17l62K23k39m9J82j6Q0J7l30J53J68%j93m6K14L1M0l9l14J82m8
7923e0J34J70l74J36j51N7J17j09J03n5N6m1J58M6q0m4j30J47n0J1K3k36RJ26
7947b7R0j05q9Q7p5K18k36L29j50J68j91J4N3l7j51J86O3p4j68q0J42jj66O5K17
$$ plain form
7781 157 -11 71 53 64 145 89 -109 -108 126 -85 83 -63 333 93 -115 -119 99 60 197 14 88 -7 -142 -87
7805 -87 -165 104 -13 111 -287 77 125 -61 -40 48 274 38 20 -81 -272 -81 -60 -80 79 -39 108 -57 -312
7828 -312 139 81 -62 -18 69 -117 70 147 -131 193 -22 -66 150 -119 183 66 120 -92 -115 17 278 -85
7850 -85 99 -22 -122 -29 -19 38 42 -86 -80 -5 29 -51 -12 -61 -65 3 39 25 -43 -142 3 -70 62 -49 -159 -273 78
7877 78 -20 163 -39 160 -187 18 317 -39 15 -95 10 -63 101 -143 72 35 237 -40 95 137 -75 126
7899 126 -142 -121 296 -66 157 -82 -131 51 35 115 132 -198 -45 123 123 -70 -116 98 129 169 130 -184 -2 -50
7923 -50 84 254 -120 16 -135 -78 39 -70 33 -22 34 -7 151 197 117 73 -57 90 40 51 74 -162 -153 -27
7947 -27 63 -42 -131 -44 -119 99 -137 192 42 210 19 33 86 49 -102 84 147 73 -95 -175 -33 -34 -200 -135 82
7972H2Mj0L7J88l41k61M29j15pJ98j89J45j78n7J38L5p1j66J01j1K01j89n8Q5
7996a0l5l9K75J42l63j3K76k33J6L2j66Q7n7J04L5q4K7j16j01J73or0P3K36k82
8021a19L02o6n7o1K32p0k29PJ58k67L22L9k20K24k45P0K32k27K37k27j48J52m67
8044d28M96J4j06l3L6l6J24Lk44J26m2J47J55j12Q2j45n8j50K85J9J04k71j78
8067b12L07j62J01M9j59j8J22O3l5J29k70j62L04N7R5j60R5k23N5J12k23J27P3
8090F5m3j92K45J15m9k31J22k1N2J45k22K71k78nk7J92l60J02K04k18Q4J72k94
8113a71J08R4j50J02j29L16k57L0j45M4K00j61J58j01m9j6M04k51J71l59K64l69
8135b67J68J33j06Q6k47K11j70K5k2M30k73J12j26L00j77j59Q8rp3J27j96j2K94
$$ plain form
7972 82 86 76 113 301 -40 -301 128 13 6 204 15 160 -18 -75 63 98 27 -139 -38 -49 152 -37 -95 -10
7996 -10 -45 -84 191 333 -30 -43 233 0 16 48 -118 -31 -88 16 51 -33 -6 -122 -223 -50 -56 -146 -73 163 -119
8021 -119 183 117 60 -1 231 161 -68 -61 97 -170 152 191 -29 195 -50 20 252 25 262 35 -113 39 -428
8044 -428 68 82 -24 -57 -21 -57 67 70 -174 -48 -90 57 212 100 182 37 -21 -171 114 133 237 -34 -212
8067 -212 95 -67 34 83 -76 -94 28 91 56 185 -85 -247 57 114 209 49 144 -79 -24 88 -135 -8 65
8090 65 22 -170 75 190 141 -90 32 11 63 208 -14 257 -21 -26 -53 139 -221 -119 85 -133 -49 123 -171
8113 -171 -63 31 -119 -17 -146 170 -87 -57 -202 -158 42 -119 39 -62 -111 -127 277 26 197 -162 102 -267
8135 -267 -99 34 -72 14 -233 -22 -192 -167 -189 241 -32 80 -46 254 77 -82 6 -3 -76 51 -145 -157 137
8158A37j58J04k07J26J27j32J06O0K2j46j79J10m6JJ61R7l09J91J1j41K18k56
8180a03Q0K0J18j92OO4m4P2J32r0k12
$$ plain form
8158 137 -21 83 -124 2 129 -3 103 163 185 39 -140 -30 -76 -75 86 183 -126 65 76 -65 153 -103
8180 -103 -23 -3 115 -77 -71 -7 -51 21 153 63 -149
8191a49
$$ Imaginary data points
##PAGE= N=2
##DATA TABLE= (X++(I..I)), XYDATA
0@%%%%%%%%%%%%%%%%%Oj4J6j6J6j7K3l0L2l5M3n0N7o5P5q7R7j09J23j38J56j74
39i1J95k19K42k69K99l31L67m05M46m91N41n97O57p24P98q81R76j083J204j343
59g09J508j703J943k243K629l150L892n051P124j2006M8770K7854n4034k6477
73a1653k323L8519K6879l355m0148l2528k8L5971K9099l761l7668l1158K831L5458
87F135K9505l203l4642k9673L425L4334K9440l328l3634k8787L583L3145K8103
100C4403l469l1887k7727L586L2269K8232k878l0632k6327M343L1220K7413l020
113C5526k9324k6460L634L0024K5428l711k9816k6418K297K7550K4250m592k9532
126a144k6451J889K6872K3548m047k8141k4720L023K6635K4173k389k6170k3225
$$ plain form
0 0 0 0 0 0 0 0 0 0 0 0 0 0 0 0 0 0 0 6 -8 8 -8 8 -9 14 -16 16 -19 24 -26 31 -34 41 -46 51 -58 65 -73 83 -91
39 -91 104 -115 127 -142 157 -174 193 -212 234 -257 284 -313 344 -380 418 -463 513 -570 634 -709
59 -709 799 -904 1039 -1204 1425 -1725 2167 -2884 4240 -7766 41004 68858 14824 -11653
73 -11653 -13976 24543 51422 48067 7919 -24609 -24637 11334 40433 36672 -996 -32154 -29323 6135
87 6135 35640 32437 -2205 -31878 -28453 5881 35321 31993 -1641 -30428 -26845 6300 34403
100 34403 30934 -953 -28680 -25094 7175 35407 32529 1897 -24430 -20087 11133 38546 35526
113 35526 6202 -20258 -16624 13400 38828 35117 5301 -21117 -18820 8730 32980 28388 -1144
126 -1144 -27595 -25706 1166 24714 20667 -7474 -32194 -29171 -2536 21637 19248 -6922 -30147
139c0147L158K6850K3976j798k5334k2520K886K5712K3517k465k5009k2760K588
152b1346K4746K2344k869k4121k2186K256K4206K1920k220k3711k1493K089K3509
165C124K0900j974k3460k1275J734K2247K0260k832k2832k1332J153K1394J9684
178A6791k041k2278k0767J430K1654K0217j245k1328j9534K338K1516K0092n67
191A6278k0516j8924J994K1161J9342r29k0321j8758J392K0142J8638j264j9990
204a755j8992J229J9328J8585j261j9846j8179R32J9022J8320j128j9193j8157
217b1095J042J8753J8054j085j9013j7895Q90J8412J7427j052j8660j7603Q38
230b0987J8251J7344j156j8039j6669Q28J8121J7227m47j7403j6726Q37J8244
$$ plain form
139 -30147 -26989 -139 23837 22039 -3295 -25815 -22929 2783 26300 23835 -1174 -23934 -21346
152 -21346 3400 25744 22875 -1246 -23432 -21176 3030 24950 22730 -981 -22474 -20385 3124
165 3124 24024 22050 -1410 -22685 -20951 1296 21556 18724 -4108 -25440 -24287 -2893 16791
178 16791 14750 -7528 -28295 -26865 -5211 15006 13761 -7567 -27101 -24763 -3247 16845 16278
191 16278 -4238 -23162 -21168 -7 19335 18406 -1915 -20673 -19281 861 19499 18235 -1755
204 -1755 -20747 -19518 -190 18395 17134 -2712 -20891 -19959 -937 17383 16255 -2938 -21095
217 -21095 -20053 -1300 16754 15669 -3344 -21239 -20349 -1937 15490 14438 -4222 -21825 -20987
230 -20987 -2736 14608 13452 -4587 -21256 -20428 -2307 14920 14473 -2930 -19656 -18819 -575
243e75J7083p22j7322j6114O47J7242J6735p91j7080j6414N48J7333J6072p99
257A5843j7097j6175P90J6556J6231q89j6299j5709N66J6503J6015p35j6265j5238
271a5903O36J6068J5599q60j5904j5197L92J6112J5307o86j5778j5223N95J5726
285H84J4875o51j5317j4863K03J5512J4898q19j4952j4647L97J5199J4925q69
299A4775j4766j4506L71J5549J4195m84j4674j4472P11J4991J4104m14j4617j4096
313a3333N40J4689J4039r08j4265j3827N97J4110J3874o10j4128j4143O96J4448
327A779J3313l37j3965j3547L97J4146J3402m31j3881j3378K25J3439J3284k08
341A4238j3928j3077K34J3427J3048l93j3598j2842L05J3683J2930j91j3198j2654
$$ plain form
243 -575 16508 15786 -1536 -17650 -17003 239 16974 16183 -897 -17311 -16763 570 16642 15843
257 15843 -1254 -17429 -16639 -83 16148 15259 -1040 -16749 -16183 320 16335 15600 -665 -15903
271 -15903 -15267 801 16400 15540 -364 -15561 -15169 943 16250 15564 -214 -15437 -14842 884
285 884 15759 15108 -209 -15072 -14869 643 15541 14722 -230 -14877 -14480 719 15644 14775
299 14775 9 -14497 -14126 1423 15618 15134 460 -14012 -13301 1690 15794 15380 763 -13333
313 -13333 -12793 1896 15935 15027 762 -13065 -12468 1642 15516 14906 778 -13365 -12669 1779
327 1779 15092 14755 790 -12757 -12360 1786 15188 14757 876 -12502 -12277 1162 14446 14238
341 14238 310 -12767 -12533 894 13942 13549 -49 -12891 -12586 1097 14027 13836 638 -12016
355a2016R65J3268J2740n25j3007j2381O48J2664J2785q82j2790j2792N08J2275
369A460J2156l21j3151j2135J20J2628J2309m76j2660j2059N32J2534J2051m61
383A2527j2197j1966N90J2302J1751m86j2334j1784M16J1853J1423m00j2602j1382
397a2289K20J2016J0854L71j2075j1573O22J1822J1498n37j1669j1041R49J1593
411G61J0974o28j1566j1333N98J1367J0933o87j1794j1098J51J1378J0986o15
425I427j1386j0732P73J1334J1076m95j0740j0688R20J1483J0857p28j0603j0641
439a0143M60J1090J0396r24j0901j0672K62J0420R928m86j1168j0427M35J0321
453a409R951p01j0730j0457O63J0990R537n34j0673r887N11J0652R460n94j0623
$$ plain form
355 -12016 -11051 2217 14957 14432 1425 -10956 -10308 2356 15141 14259 1469 -11323 -10815 1460
369 1460 13616 13295 144 -11991 -11871 757 13066 12590 -70 -12129 -11597 937 12988 12527
383 12527 330 -11636 -11046 1256 13007 12521 187 -11597 -11181 672 12095 11695 -907 -12289
397 -12289 -12069 -53 10801 11172 -903 -12476 -11854 -32 11466 10929 -740 -11781 -10832 761
411 761 11735 11107 -459 -11792 -11194 173 11106 10419 -1375 -12473 -12322 -944 10042 9427
425 9427 -1959 -12691 -11918 -584 10492 9997 -743 -11431 -10511 972 11829 11101 498 -10143
439 -10143 -9683 1407 11803 10879 -22 -10694 -10432 -12 9916 9430 -1738 -12165 -11730 -1409
453 -1409 8542 7841 -2889 -13346 -12683 -1693 7844 7310 -3363 -13250 -12739 -2087 7373 6779 -3844
468c844j0184P09J0358R478o03j0400r899R25J0487R917n34j0131r032Q00J0758
483a195J0035k87r589r343J039J0523R212o31r709r204K64R818R214o05j0269
498g27r449O45R473R146p39r886r343O54R848R128l90r532r024Q44R634R123n43
515H862r439q966P13R320Q816l71r711q613O52R083R013k57r378q368N51R340
531A247R151n10q905q410M64R577Q776l98r333q422N76Q783Q561q43r400q791
547g877M76Q605Q330j047r270q370M20R025Q255m09q914q238O94R039Q440l40
563H819q641q413J317Q692Q294o36q535q168Q08Q707Q131n73q730q006M23R000
579B489Q143r55q442p913P01Q731P831o12q249p999O69Q359P509p87q544p855
$$ plain form
468 -3844 -14028 -13319 -2961 6517 5914 -4486 -14385 -13460 -2973 6944 6410 -3721 -12753 -11953 -1195
483 -1195 8840 8553 -1036 -10379 -9340 1183 10395 9764 55 -9149 -8885 933 10147 9542 -727
498 -727 -10176 -9531 -58 9088 8349 -1537 -10880 -10226 -378 8750 8360 -1172 -10196 -9352 282 9405 8862
515 8862 -577 -9543 -8830 490 9306 8935 -776 -9389 -8737 346 9359 9102 -276 -8644 -8093 1247
531 1247 10398 9888 983 -7427 -6963 2614 11390 10992 1659 -6763 -6187 2596 11157 10314 914 -7877
547 -7877 -7401 1204 9534 8487 -783 -9153 -8733 292 8547 8138 -776 -9014 -8320 719 9159 8819
563 8819 178 -8235 -6918 1774 10068 9432 897 -7271 -6463 2244 10375 9802 1072 -6934 -6511 2489
579 2489 10632 9677 1235 -6678 -5977 2754 10585 9973 1724 -6275 -5606 2753 10262 9475 931 -6924
595f924L19P869P513p68q270q262P15P960P242p32p891p732O22Q249P602m07p938
612h33p811Q70Q480P482l54p817p300O02Q248P340m61q213p178M08Q075P449o86
629H301p665p506M33P950P060l13p790p220L53P637P398n04p756p319M68P309
645H36P225n85q030p086J1P711P068n18q077p019O49P383P087n76p547o856M59
662g865P664O899l75p544o636P07P249O945n53p098o920K94P548O646n40p372
678i51o517N74P248O551n40p393o627P46P017O853n36p172o595M82P040O666l91
695F455p504o420M20P163O442o57o980o503M12P029O421p11o710o562L92O739
711e74O705k09p020o162J38O925O377m00o702o147L77O654O553n98o714o299M00
$$ plain form
595 -6924 -6605 1264 8777 8009 -261 -8523 -7808 152 7394 6662 -1229 -8961 -8339 -90 7512 7105 -833
612 -833 -8644 -7774 706 8188 7834 17 -7283 -6681 1567 8907 8446 233 -6945 -6537 1538 8987 8301
629 8301 636 -6870 -6437 1513 8573 8260 470 -6750 -6397 1240 8638 8134 378 -6941 -6473 836
645 836 8061 7476 -554 -7640 -7629 82 7150 6632 -1445 -8464 -7815 -432 6655 6079 -1468 -8324 -7865
662 -7865 -201 6698 6323 -1221 -7857 -7150 99 7044 6491 -607 -7527 -7233 315 6961 6421 -951
678 -951 -7468 -6894 354 6905 6365 -1028 -7655 -6909 108 6961 6425 -747 -7342 -6860 180 6846 6455
695 6455 -1049 -7469 -7049 114 6556 5899 -1081 -7584 -7172 -143 6278 5567 -1143 -7705 -7313 -574
711 -574 6131 5922 -1098 -7260 -7122 -197 6180 5780 -922 -7069 -6692 -38 6515 5917 -797 -7096 -6696
728f696O879O298o85o677n974L71O889O122o62o560o154O15O493O366n93o625
744e93o136J43O830N803N8o798o113O52O290N966k02o352o317M40O427N913o09
761E402o246o059M25O151N996m08o080o301O40O243N753k06o110n714K27O442
777A55O023m76o119n884P16O249N499j95n894n768K80N868N923o59o058n486M29
794e397O010N748m40o006n506J84O071N613l19o040n486M40O112N371k66o123
810c4n137R4N780N510l01n975n472J40N775N368l81n775n542O92N620N629l17
827E674n788n319M63N922N257n06n292n513L96N906N179n54n582n540O09N232
843E44N453n07n362n647N01N489N526o10n592m810L31N771M997l09n329n100M56
$$ plain form
728 -6696 183 6481 5796 -881 -6855 -6484 405 6527 5865 -695 -6849 -6234 259 6625 6032 -593
744 -593 -6729 -6586 244 6047 6105 -693 -6806 -6154 136 6102 5900 -452 -6769 -6329 98 6011 5402
761 5402 -844 -6903 -6478 -327 5669 5261 -819 -7120 -6480 -237 5516 5310 -800 -6514 -6287 155
777 155 6178 5702 -417 -6301 -5585 664 6163 5968 74 -5694 -5414 454 6377 5718 -340 -5826 -5397
794 -5397 613 6361 5921 -85 -5591 -5407 664 6277 5958 -82 -5568 -5128 984 6355 6089 -34
810 -34 -5171 -5077 703 6213 5912 -63 -5535 -5395 380 5748 5367 -408 -5950 -5258 362 5991 5674
827 5674 -114 -5433 -4970 952 6209 5703 411 -5102 -4706 1200 6379 5825 243 -5297 -4688 544
843 544 5997 5490 128 -5519 -5018 471 5997 5387 -205 -5015 -4684 1087 6084 5775 446 -4654 -4198
860d198N332N015k12n615m975K56N251M964l21n395n037K48N467M988j95n670
876i7m630J20N712M858m05m980n074K37N431M967l35n396m701J97M968M740l71
893E241n276m832J74N111M830r75n041m627K19N257M765m06n165m610L80N176
909B21M693n33m723m853L49M974M433m28n141m484J68N063M325l98m464m728K09
926e317M891M590k02m626m718N97M732M666k50m808m168J95M988M229n20m745
942d66m354N73M647M245n21m788m830O52M849M190j56m603m509N96M431M353l04
959D005m613m410L82M792M070k63m740m157L27M543M093p79m527m165J87M857
975c98L731r7m563m268L12M942M274o76m182l984J18M797M137l08m388m174M87
$$ plain form
860 -4198 1134 6149 5937 322 -4653 -4397 854 5818 5497 102 -4935 -4687 780 5768 5573 -97
876 -97 -4727 -4607 1105 5963 5558 578 -4496 -4259 1172 6139 5804 408 -4293 -4096 872 5612 5241
893 5241 -35 -4867 -4693 418 5248 4273 -768 -5395 -5176 81 4846 4440 -725 -5335 -4955 221
909 221 4914 4381 -342 -5195 -4846 128 4561 4133 -1008 -5492 -5324 -261 4064 3666 -798 -5526 -5317
926 -5317 -426 4164 3962 -664 -5382 -4785 -53 4613 4363 -445 -4613 -4418 570 4799 4279 -466
942 -466 -4820 -4247 400 4645 4124 -664 -5494 -4842 7 4197 4041 -562 -5071 -4475 -44 4309 4005
959 4005 -608 -5018 -4636 156 4226 3963 -777 -4934 -4607 -64 4029 3250 -1277 -5442 -5255 -398
975 -398 3333 3236 -1327 -5595 -5283 -341 3933 3257 -925 -4909 -4791 6 4143 3835 -553 -4727 -4240
992d240M290M179l10m594m118L99M397M169j88m306m043o9M746L887l72m255l875
1009d303O03L960M563n43m285m295P76M144M040p91m110m035L64M037M053l77
1025C801m381l913L41M222M077l74m682l598M16M513L657m14m142l640M00M346
1041F29L675n29l931m028N06L845M044m07m227l845N79L926L759m7m086l772M40
1058c469M252L693m71l913l690L96L959L484k64l859l821K63M310L423l63m154
1074b24l405K85L986L426m59l721l514K56M091L654m10l931l517K05M152L229
1090D103j19l704l900N70L911L191k44l713l638M97L602L314J7m167l400O48L594
1107E62L604o84l643l324L69L965K964j66l715l611O19L885L026n70l762l239
$$ plain form
992 -4240 50 4229 3919 -675 -4793 -4394 3 4172 3984 -322 -4365 -4434 312 4199 3827 -428 -4303
1009 -4303 -3700 260 4823 4280 -5 -4300 -3524 620 4660 3869 -241 -4276 -3912 125 4178 3801
1025 3801 -580 -4493 -4152 70 4147 3773 -909 -4507 -4091 422 4079 3665 -477 -4117 -3717 629
1041 629 4304 3775 -156 -4184 -3678 167 4211 3804 -423 -4268 -3689 237 3996 3949 -137 -3909 -3469
1058 -3469 783 4476 4005 92 -3598 -3202 757 4241 3977 118 -3703 -3440 870 4293 3930 -224
1074 -224 -3629 -3344 642 4068 3609 -112 -3626 -3370 721 4375 3965 34 -3483 -3278 874 4103
1090 4103 3984 280 -3620 -3050 861 4052 3808 95 -3543 -3046 556 3870 3887 -280 -3680 -3032 562
1107 562 4166 3482 -161 -3485 -3116 849 3813 3647 -68 -3679 -3060 825 3851 3281 -481 -3720
1123c720L11L761L532m93l818l380M67L831L235l63l723l219L28L811L205m45
1139C320l676l194N61L556L092k77l766l064K4M017L205k87l911l148O30L519
1155F01L068k73l720l026K46L818K854j87l760l110N90L231L471n04l920k799
1171c420L21L824K978p49l428k934L90L340K929k81l346l326N60L275L326o62
1187B797l492l276N52L638K803m94l231l227P10L550K758l30l492l078M92L652
1203C32K858n73l254k796L86L338K686n71l062l016N37L236K988o92l308k637
1219c548L93L184K687m11l136k677L49L301K931o95l170k791L43L388K616j35
1235B629l189l288R42L023K872p24k882k613K66L071K796l87l246k703L56L383
$$ plain form
1123 -3720 -3409 352 3884 3391 -427 -3807 -3340 491 3726 3363 -360 -3579 -3251 560 3765 3320
1139 3320 -356 -3550 -2989 567 3659 3382 -384 -3448 -3424 593 3798 3511 -400 -3548 -2918 601
1155 601 3669 3396 -324 -3350 -3104 714 3568 3381 -379 -3489 -2899 332 3803 3299 -621 -3420
1171 -3420 -3099 725 3703 2954 -474 -3408 -3018 322 3251 2970 -376 -3702 -3142 133 3459 2797
1187 2797 -695 -3971 -3419 219 3022 2528 -703 -3930 -3220 330 3088 2758 -734 -3812 -3320 332
1203 332 3190 2617 -637 -3433 -3047 291 2977 2406 -656 -3672 -3135 101 3089 2397 -911 -3548
1219 -3548 -3155 29 2716 2305 -831 -3508 -3159 142 3073 2378 -792 -3583 -3240 148 2764 2629
1235 2629 -560 -3848 -2906 117 2989 2265 -617 -3230 -2964 107 2903 2516 -730 -3433 -3077 306
1251C06K416q7l153k724L91L547K490n34l096k534K77L100K672l46l153k751M59
1268b720L276K561o64l096k429J84L088K546m40k801k657M76L017K731n43k926
1284c97k798M53L171K341l60l183k585N56L082K429k26l170k366N34L127K287
1300B895m36k782k502M09L033K734m42k907k636Q14K851K486o20k721k576L58
1316b042K856K582n33k950k414M35L000K449q22k672k483O17K807K321n94k626
1332f9k514M55K819K199m78k736k362M41K827K273n67l032j976L93K635K253n89
1349A972k585k133O29K818K199o57k684k017K48K854K311l96k592k084J19K888
1365H90K097k89k865k127O24K386K257m91k821k060M89K503K535q71k596k240
$$ plain form
1251 306 2722 2635 -518 -3242 -2851 696 3186 2652 -444 -2978 -2701 399 3071 2725 -428 -3179 -2720
1268 -2720 556 3117 2453 -643 -3072 -2888 200 2746 2306 -495 -3152 -2676 341 3072 2529 -397
1284 -397 -3195 -2742 429 2770 2410 -773 -3358 -2802 280 2709 2483 -687 -3053 -2519 608 2895
1300 2895 2459 -323 -2825 -2416 617 3351 2909 2 -2634 -1820 1031 3517 2897 176 -2400 -2042
1316 -2042 814 3396 2863 -87 -2501 -2066 934 3383 2561 -111 -2594 -1977 830 3151 2557 -69
1332 -69 -2583 -2128 691 2890 2412 -324 -2686 -2245 582 2855 2288 -744 -2720 -2327 308 2561 1972
1349 1972 -613 -2746 -2117 701 2900 2243 -441 -2458 -2210 644 2955 2559 -33 -2117 -1998 890
1365 890 2987 2698 -167 -2294 -1670 716 2973 2482 -339 -2399 -1910 593 3128 2257 -339 -2579
1381b579M65L022K052o14k776k209N93K615K047j94k679k294O86K484K149n80
1397B188k435k448K30K840J956l30k409k447Q28K534K094k98k846k085O81K598
1413F51J717k22k684j993N71K411K172p90k448k101M20K529K007l92k591k318
1429c061N89K410K214j02k798j759L75K630J928l68k578k253P47K724J737o14
1445A821k485j949O17K450J973m01k637j719L78K615J985q73k075k006N13K452
1461F59K003n32k744j809N24K128K066m95k501j973O58K421J543n53k182j871
1477b658P62K006J730k92k177k089N30K319J931n67k214j781M93K283J776l00
1493A752k514j519M90K209J807n28k187j799M85K172J819o61k123j924Q83K149
$$ plain form
1381 -2579 -2114 908 2960 2346 -430 -2639 -2046 569 2616 2422 -257 -2551 -1865 619 2768 2188
1397 2188 -247 -2695 -2465 375 2331 2001 -408 -2855 -2027 507 2601 2303 -543 -2628 -1947 651
1413 651 2368 2146 -538 -2531 -1960 451 2623 1833 -615 -2716 -2296 233 2240 1848 -743 -3061
1429 -3061 -2472 -62 2152 2050 -748 -2507 -2132 498 2426 2058 -520 -2773 -2026 698 2435 1821
1445 1821 -664 -2613 -1996 454 2427 2026 -611 -2330 -1952 663 2648 1775 -300 -2306 -1793 659
1461 659 2662 2130 -614 -2423 -1899 229 2295 1800 -701 -2674 -2016 405 1948 1395 -787 -2658
1477 -2658 -1896 110 1840 1548 -629 -2718 -2188 131 2062 1495 -719 -2500 -2007 276 2052 1752
1493 1752 -762 -2281 -1791 418 2225 1697 -490 -2289 -1804 368 2187 1526 -597 -2521 -1638 511
1509E11J552k87k239j962P38K358J647n10k423j617M52K439J440l89k387j539
1525b216O53J920J893o35k067j869N04K643J431l25k570j405M92K428J321n66
1541A632k058j775O87K182J616p99j839j488J40K225J812r48j789j653L62K418
1557G25J495n47k176j511N82K304J330n91j866j817M67K149J821p97j863j781
1573b076O78J982J674n53j978j914O63K154J597n05k002j821Q89K213J188m62
1589A727j975j477N38J870J457l34k375j621P85K149J438m81k135j713Q03K063
1605G19J337o24j594j710N68K029J327l51k075j311K18K162J267l28j889j511
1621a766M29J924J587n08j938j494O36J994J520p39j961j427P10J728J446n85
$$ plain form
1509 511 2063 1776 -463 -2425 -1687 671 2318 1808 -615 -2232 -1780 659 2099 1710 -677 -2216
1525 -2216 -1563 357 2250 1615 -452 -2321 -1817 826 2257 1932 -638 -2043 -1551 877 2198 1632
1541 1632 -426 -2201 -1514 668 2284 1485 -354 -1842 -1702 523 2335 1387 -402 -2055 -1693 725
1557 725 2220 1673 -503 -2014 -1432 872 2202 1611 -255 -2072 -1605 544 2365 1568 -295 -2076
1573 -2076 -1398 584 2258 1705 -273 -2187 -1524 630 2227 1722 -280 -2101 -1212 1001 2189 1727
1589 1727 -248 -1725 -1187 683 2140 1806 -569 -2190 -1405 744 2182 1701 -434 -2147 -1344 719
1605 719 2056 1432 -162 -1872 -1304 725 2052 1701 -374 -1685 -1467 695 1962 1634 -255 -1766
1621 -1766 -1337 587 2174 1666 -272 -1766 -1130 864 2384 1645 -316 -1743 -1033 695 2141 1556
1637A556k040j214L83J769J454m54k195j250L57K225J355n83k106j102K30K067
1653D52J232n15j714j464O61J864J396o53k052j105L38J857J543l29j888j571
1669a948N19K013J155l91k053j088M14J989J172m98j789j355N88K044R46l96k025
1686g03j519P74J886J566q56j760j388L98J753J609m63k029j283M91J884J281
1702A641n02j810j258N51J883J257p04j732j047J75J742J320m27j741j223J71
1718a704K101J107o63j683j197N56J869J248o13j596j386P11J498J243m86j693
1734f88j236N64J937P71l01j578j221O60J289J391l40j742j265O17J658J213l43
1751A386j892j069M17K020R07n21j659j175N37J850Q90l25j683j574Q48J664J074
$$ plain form
1637 1556 -484 -1698 -1315 454 1908 1454 -741 -1991 -1634 591 1946 1363 -743 -1845 -1615 452
1653 452 1684 1169 -545 -2009 -1348 516 1912 1259 -793 -1898 -1560 297 1840 1511 -377 -1948
1669 -1948 -1429 584 1739 1348 -705 -1793 -1379 610 1782 1284 -505 -1860 -1272 772 1718 1322 -703
1686 -703 -2222 -1448 438 2004 1148 -612 -2000 -1602 151 1760 1297 -732 -2015 -1524 360 1641
1702 1641 1139 -671 -1929 -1378 505 1762 1058 -674 -1721 -1546 196 1516 1089 -652 -1875 -1704
1718 -1704 397 1504 841 -842 -2039 -1483 386 1634 1021 -575 -1961 -1250 248 1491 1005 -688
1734 -688 -1924 -1360 577 1348 1047 -531 -1752 -1092 197 1588 1248 -494 -1759 -1142 516 1729 1386
1751 1386 -506 -1575 -1158 862 1769 1248 -411 -1586 -1049 801 1691 1366 -317 -1891 -1043 621 1695
1768A695n15j918r53M19J901Q84k90j999r76M75J661J317q49j570q17K54J634
1785C53J240p35j395q38J34J598J284n80j539j221N47J435J445n01j701j096M77
1802a093J958P25o06j455j216P75J397J264q09j477r68N87J613Q50k15j686j291
1819a647P80J620R58n25j597r30N56J351J166o65j493r59O81J429R30o71j407
1836d23j113P04J371J199o26j633j028O73J364J180p12j543p13K11J445J309o17
1853A048j674j158O76J472R44m40j501q74M57J508P47k98j445r83K80J518J197
1870A474p75j263p63K27J649J005k91j861q50M00J629Q25l96j510r25O71J437
1887F83O37m13j305r90N85J474Q20n69j543r41P44J486O46l37j382r86N53J439
$$ plain form
1768 1695 1180 -738 -1691 -1272 629 1513 1223 -776 -1752 -1277 384 1701 852 -718 -1535 -1281 353
1785 353 1593 858 -537 -1375 -1241 357 1641 1061 -478 -1699 -1152 283 1728 1227 -474 -1570 -1093
1802 -1093 865 1590 984 -471 -1687 -912 485 1749 940 -537 -1505 -918 695 1545 1330 -356 -1647
1819 -1647 -867 753 1711 1186 -411 -1341 -785 566 1732 1067 -426 -1385 -704 725 1655 984 -423
1836 -423 -1536 -832 539 1738 1112 -521 -1549 -876 488 1668 956 -587 -1300 -1089 356 1665 1048
1853 1048 -626 -1784 -1108 364 1308 868 -633 -1507 -1050 458 1205 907 -538 -1521 -1241 277 1474
1870 1474 699 -564 -1327 -1100 549 1554 1263 -598 -1448 -1048 581 1406 1010 -500 -1425 -754 683
1887 683 1320 907 -398 -1388 -803 671 1491 922 -621 -1562 -818 668 1314 977 -405 -1391 -838 601
1905F01R50o17j299j123N80J420J068r51j202q20M32J663Q40o26j519r91N44J669
1923F19P04j79j794q47O67J512N87m92j320r85N97J442P21l40j435r67M97J541
1941E28P35m35j618n68L16J551O86p51q69r54M45J128R92l88j419m36J01J534
1959E78N92k39j397q46N63J471M60l04j548o98M24J518P25n52j388o27N52J389
1977F73P55o59j339q54P40J328O56n82j467r80O66J525Q31l49j346q68N04R55
1995A89R97l91j382q83P36J109R45n75j312r43O46J576N14l91j146p62L39J278
2013E44P10m02j360p64N42J365P66m53j517n93O07J074P21p43r74o28J22J519
2031E36O36k82j398o36L05J393O60l69j339q17O04J329M50j24j298q37N34J428
$$ plain form
1905 601 1551 934 -365 -1488 -908 512 1580 629 -573 -1393 -961 702 1542 916 -603 -1594 -1050 619
1923 619 1323 1144 -650 -1497 -830 682 1269 777 -543 -1528 -931 511 1232 892 -543 -1510 -1013 528
1941 528 1263 828 -790 -1358 -1042 509 1195 444 -425 -1379 -934 194 1186 798 -621 -1057 -956 578
1959 578 1170 931 -466 -1312 -749 722 1182 878 -670 -1368 -944 574 1299 747 -641 -1268 -716 673
1977 673 1428 769 -570 -1424 -684 644 1300 718 -749 -1729 -1063 462 1293 944 -402 -1270 -766 189
1995 189 1186 795 -587 -1470 -734 375 1320 745 -567 -1510 -864 712 1226 835 -311 -1073 -734 544
2013 544 1254 852 -508 -1272 -730 635 1401 948 -569 -1162 -555 519 1240 497 -477 -1105 -983 536
2031 536 1172 890 -508 -1144 -839 554 1214 845 -494 -1311 -707 622 1072 948 -350 -1187 -653 775
2049G75M60l39j372r48R63J085O42n67j147p22N29J142N47k67j210o03N93O83
2067B44J082p24j116p91P15J177M26m91j023p83P48J247O10o56j347n63N07J319
2085E81P16o47j349l57M24J293P66o70j304l21M85R83N79m90j292k84K50J407
2103G70K67j28j335o27L33J144R57q14r01q88P33J138N90n29j319l70L28J320
2121F69M29n23j084p23N61J328N98n58j112o83M97J219O23n72j209p06P29J056
2139E39O96o44j173k90M16Q89P27n71q90p69M05J379K95m67j078n36N68J159M34
2158A089n03j084o11M26Q85P31l76j282n12O39Q23P82m83j028o08L64J414M72
2176A138o51p44r92M71J484J95k72j252m22L82J145O72p22q83o63P47R30P23m67
$$ plain form
2049 775 1235 896 -476 -1424 -461 624 1266 699 -448 -1170 -641 501 1048 781 -429 -1032 -439 244
2067 244 1326 602 -514 -1305 -590 587 1013 522 -501 -1284 -536 711 1321 665 -682 -1245 -738 581
2085 581 1297 650 -699 -1056 -632 661 1427 757 -547 -868 -383 600 1179 689 -603 -887 -637 770
2103 770 1037 909 -426 -1053 -720 424 1381 567 -334 -1222 -489 649 1239 710 -609 -979 -651 669
2121 669 1098 575 -509 -1232 -671 657 1255 697 -415 -1098 -601 618 1241 669 -540 -1246 -517 539
2139 539 1235 591 -582 -872 -456 433 1160 589 -301 -1070 -665 714 1009 542 -536 -1072 -504 655 1089
2158 1089 586 -498 -1109 -683 202 933 557 -725 -1237 -598 225 1007 524 -504 -1112 -748 666 1138
2176 1138 487 -257 -1249 -778 706 901 629 -623 -1045 -663 482 1154 432 -451 -1114 -367 563 1286 819
2195H19j233o73N32R51P47m20j088p06M63R49P64n14j191m23N70Q31O55o28j024
2214f19n01O41J020M19m65j205j84L62Q05O64n25q97m47K61J074M71k18j114o20
2233a078L08J453K17o23n85p40N04J313R3n42q06n68M16J151L21n96p57n95O57
2252d57P29M78k91q44q69Q72R83M87n97r49o54Q42P57M37k72j269o79R25P06Q18
2272A153o72j136k46M57R47M59l83j159n63M41J204N37o46j006l11M67R03M42
2290H88n20q40n31M90R24N59o05j025o7L19R84L08n62p98l67K21J191P5j88r01
2310d45n30P31Q65L63o04p65n57N93O23M37l91p33p18O46J098M32p92o48k61L76
2330b80P60N27l54j233q7K28R74M32m49q81n09O81R10K52k49j056n66L53J064
$$ plain form
2195 819 -414 -1087 -555 396 1143 723 -365 -1071 -608 341 1105 591 -600 -1023 -453 378 1033 405 -619
2214 -619 -1120 -479 541 960 495 -710 -894 -532 273 937 412 -485 -932 -671 403 874 656 -458 -1078
2233 -1078 -770 683 900 277 -308 -1048 -544 769 862 320 -486 -1054 -638 513 834 238 -519 -1114 -457
2252 -457 272 750 459 -385 -1254 -382 601 1088 491 -458 -1112 -270 487 924 652 -617 -1296 -371 335 1153
2272 1153 481 -655 -901 -444 503 962 579 -580 -1143 -702 502 1039 393 -613 -924 -457 446 888
2290 888 368 -472 -1003 -513 411 970 365 -660 -727 -408 576 884 322 -476 -843 -622 569 644 456 -445
2310 -445 -975 -244 621 984 380 -385 -942 -349 274 711 320 -413 -1131 -485 613 1045 253 -395 -656 -280
2330 -280 480 1007 653 -580 -667 -439 535 967 518 -363 -872 -191 719 971 722 -334 -900 -547 517
2349E17O29r28o40n38N64J135K09n66p86l03K67R03M17m74p79l18J38R69N12m86
2369D42q48m23L21R91M75o78r22k82Q06O22M05m73q91m22L77J093L27o00q47n30
2389a057O84Q32J21l14p28l46N19R48j06n0j008n51N82R14O16n16j099n21P09
2408c71R63L84o22q14n04N06Q64K98l53q95k94M36P65M94n67q52k7M46P38L94
2428I89m88q40m90N59O36N64n18q93l17M37R43J69k19j017j83L78O64O04n13r57
2448d92k12K89P65O17p13q21k94N61O47N79p86r11k05O98P31L92m48q63n51N69
2468d48O45N15m55r02l14O28O26P41q86n99k11J01J084J12n25p46n5M13O88K50
2488F62m99n46l70L49N91O68o81o79j83K39Q91L49q15l87l85O79M46K72n73o15
$$ plain form
2349 517 1146 218 -422 -960 -396 739 948 382 -404 -707 -440 463 880 406 -373 -691 -553 416 928 442
2369 442 -406 -829 -508 483 958 280 -642 -924 -118 504 909 436 -455 -877 -500 593 920 320 -527 -1057
2389 -1057 -373 459 580 266 -462 -808 -289 659 553 503 -505 -1056 -474 440 1056 540 -559 -1080 -371
2408 -371 592 976 354 -460 -964 -458 406 704 351 -544 -838 -402 363 857 290 -562 -589 -143 595 989
2428 989 501 -339 -829 -270 366 930 412 -481 -798 -361 582 751 532 -485 -668 -290 374 978 465 -492
2448 -492 -704 -415 350 967 254 -567 -861 -300 347 926 140 -771 -976 -278 453 845 397 -466 -1017 -448
2468 -448 197 712 257 -645 -959 -331 295 1036 150 -449 -660 -559 525 637 112 -634 -689 -276 412 662
2488 662 163 -383 -753 -404 187 855 174 -505 -688 -449 442 791 -24 -411 -796 -117 329 601 28 -587
2508e87j48L65Q98M17m33j144l31O76O40M20o43p59j63N63N44O26n72p86l00O00
2528a17N20L06m16q04r4L78O18M74n75p56j35L60P67M04o31q61k00L35J180j99
2548E54n60n93J77P4Q20P7l58p74j26K90Q48K63m91p60n9L87N73K95k21p01l14
2569e99L50P77J47l58q20j53M06M75M09m35n08m51O17N38N49n30r96n3M20M34
2589B19M02l54p21k19M74M24L61l27p65l5K56P63J38m87m73k59K8P57L62k80o61
2610c97k50K83O55L22l65n33j93K33R35j7m97n88j82K87Q19J71l80o07l4K27N28
2631D17K71k61o47l25M53P06J74m19p35j10M36M61L35l53n48l93L53P59J92o19
2651A47k32o19L87Q37K38k84p71k96N00O15k4l64m32n32M32R40N3m89o09l58O66
$$ plain form
2508 -587 -735 -370 528 945 512 -632 -963 -287 353 773 130 -629 -792 -229 315 941 369 -417 -717 -117
2528 -117 403 709 293 -511 -605 -227 391 865 290 -466 -601 -241 526 930 299 -562 -762 -427 753 554
2548 554 -6 -599 -422 -348 472 549 191 -583 -709 -419 429 692 201 -559 -618 -231 342 637 416 -285 -599
2569 -599 -249 528 675 317 -503 -656 -250 225 634 199 -309 -760 -143 395 944 414 -582 -635 -215 219
2589 219 621 267 -454 -673 -199 225 586 259 -506 -541 -285 478 616 129 -344 -603 -575 182 544 264 -397
2610 -397 -647 -364 291 613 248 -285 -478 -245 690 673 176 -412 -594 -307 512 683 303 -304 -338 -111 417
2631 417 688 427 -220 -545 -92 614 788 369 -366 -476 -40 421 756 403 -145 -538 -185 574 766 147
2651 147 -85 -704 -317 520 758 474 -297 -593 -93 522 498 134 -298 -830 -398 542 595 106 -503 -861 -195
2672a95M73K22m74m59j71N02L37L17l70o08j51L55O40K9m23m85r9K91O34P4l24
2693A15o62r3M85M66K02j54o54j27J97O68L58n81p23j39O07L09J11o2p34k20K18
2714d13R84m8m62k74j95L35M15K11l97p48l2N95K09L76n13j89m44N05M39K91m21
2735B24p33JM44N54N6l76o47M7K50O02M3l09n42j03K45P49r0m23m19l83P98L63
2757C51K85o27m29j97M81J43N78m09p27j8M64M54K75k01p84O1P9M91J91k98n90
2778d27j7L64M46l6l30l32j9M83K17J92o39on02M45O41K29m90l95m72J98Q63J60
2800E73j83r60J24J53P10l3j32p32O9L22K58N10m42o00J1N22Q0J20j92k83k68
$$ plain form
2672 -195 278 500 26 -433 -604 -102 235 552 182 -426 -577 -222 418 447 24 -461 -560 -269 365 439 115
2693 115 -547 -640 -155 311 513 359 -295 -422 -225 443 801 220 -503 -642 -35 274 385 323 -411 -631 -413
2714 -413 571 523 61 -213 -408 -73 342 553 156 -592 -624 -29 180 556 43 -146 -590 -85 354 645 224
2735 224 -509 -508 -64 490 546 170 -477 -430 -180 422 465 156 -386 -489 -244 505 415 -8 -427 -810 -12 351
2757 351 636 9 -420 -617 -136 7 585 176 -551 -569 -105 349 624 423 -361 -300 -221 270 461 163 -427
2778 -427 -444 -80 366 330 0 -332 -351 132 349 541 -98 -104 -606 -161 480 709 219 -176 -648 -450 413 573
2800 573 390 -570 -446 -293 417 384 252 -480 -411 -89 169 679 237 -363 -352 170 250 370 178 -105 -373
$$ [...]
8191A35
##END NTUPLES=NMR FID
##END=
