##TITLE=1H_SA_54_Benzene
 CDCl3, 8 sc, 
 28.8.2020
##JCAMPDX= 6.0         $$ Bruker NMR JCAMP-DX V2.0
##DATA TYPE= NMR FID
##DATA CLASS= NTUPLES
##ORIGIN= UXNMR, Bruker Analytische Messtechnik GmbH
##OWNER= root
$$ XWIN-NMR		Version 3.5
$$ Fri Aug 28 12:03:32 2020 Russian Standard Time (UT+4h)  she@DPX200
##.OBSERVE FREQUENCY= 200.1315066352
##.OBSERVE NUCLEUS= ^1H
##.DELAY= (6, 6)
##.ACQUISITION MODE= SIMULTANEOUS
##.ACQUISITION SCHEME= undefined
##.AVERAGES= 8
##.DIGITISER RES= 18
##SPECTROMETER/DATA SYSTEM= spect
##.PULSE SEQUENCE= zg30
##.SOLVENT NAME= CDCl3
##.SHIFT REFERENCE= (INTERNAL, CDCl3, 0, 15.7039)
##AUDIT TRAIL= $$ (NUMBER, WHEN, WHO, WHERE, WHAT)
$$ ##TITLE= Audit trail, XWIN-NMR		Version 3.5
$$ ##JCAMPDX= 5.01
$$ ##ORIGIN= Bruker BioSpin GmbH
$$ ##OWNER= she
$$ F:/spectra/data/she/nmr/H-F/1/audita.txt
$$ ##AUDIT TRAIL=  $$ (NUMBER, WHEN, WHO, WHERE, WHAT)
(   1,<2020-08-28 12:02:06.81 +0400>,<she>,<DPX200>,
      <created by zg, POWCHK disabled, PULCHK disabled
       configuration hash MD5:
       00 E9 B6 7A A2 85 ED C7 34 08 36 98 17 FE 4E 26
       data hash MD5: 16K
       DC 7A 33 89 D1 C9 00 20 68 AC 11 37 32 BB 61 03>)
$$ ##END=
$$ 
$$ hash MD5
$$ B4 0D 5E ED 62 1E B9 CB 37 E9 E0 A8 1B 01 22 5D
##$RELAX= 
##$RELAX= 
##$RELAX= 
##$RELAX= 
##$RELAX= 
##$RELAX= 
$$ Bruker specific parameters
$$ --------------------------
##$DU= <F:/spectra>
##$EXPNO= 1
##$NAME= <H-F>
##$PROCNO= 1
##$TYPE= <nmr>
##$USER= <she>
##$AMP= (0..31)
100 100 100 100 100 100 100 100 100 100 100 100 100 100 100 100 100 100 
100 100 100 100 100 100 100 100 100 100 100 100 100 100 
##$AQSEQ= 0
##$AQ_mod= 1
##$AUNM= <au_zg>
##$AUTOPOS= <>
##$BF1= 200.13
##$BF2= 200.13
##$BF3= 200.13
##$BF4= 200.13
##$BF5= 200.13
##$BF6= 200.13
##$BF7= 200.13
##$BF8= 200.13
##$BYTORDA= 1
##$CFDGTYP= 0
##$CFRGTYP= 5
##$CHEMSTR= <none>
##$CNST= (0..31)
1 1 145 1 1 1 1 1 1 1 1 1 1 1 1 1 1 1 1 1 1 1 1 1 1 1 1 1 1 1 1 1 
##$CPDPRG= <>
##$CPDPRG1= <>
##$CPDPRG2= <>
##$CPDPRG3= <>
##$CPDPRG4= <mlev>
##$CPDPRG5= <mlev>
##$CPDPRG6= <mlev>
##$CPDPRG7= <mlev>
##$CPDPRG8= <mlev>
##$CPDPRGB= <>
##$CPDPRGT= <>
##$D= (0..31)
0 1.2 0 0 0 0 0 0 0 0.06 0 0.03 0 0 0 0 0.0002 0 0 0 0 0 0 0 0 0 0 0 0 
0 0 0 
##$DATE= 1598601726
##$DBL= (0..7)
120 120 120 120 120 120 120 120 
##$DBP= (0..7)
150 150 150 150 150 150 150 150 
##$DBP07= 0
##$DBPNAM0= <>
##$DBPNAM1= <>
##$DBPNAM2= <>
##$DBPNAM3= <>
##$DBPNAM4= <>
##$DBPNAM5= <>
##$DBPNAM6= <>
##$DBPNAM7= <>
##$DBPOAL= (0..7)
0.5 0.5 0.5 0.5 0.5 0.5 0.5 0.5 
##$DBPOFFS= (0..7)
0 0 0 0 0 0 0 0 
##$DE= 6
##$DECBNUC= <off>
##$DECIM= 32
##$DECNUC= <off>
##$DECSTAT= 4
##$DIGMOD= 1
##$DIGTYP= 9
##$DL= (0..7)
0 120 120 120 120 120 120 120 
##$DP= (0..7)
150 150 150 150 150 150 150 150 
##$DP07= 0
##$DPNAME0= <>
##$DPNAME1= <>
##$DPNAME2= <>
##$DPNAME3= <>
##$DPNAME4= <>
##$DPNAME5= <>
##$DPNAME6= <>
##$DPNAME7= <>
##$DPOAL= (0..7)
0.5 0.5 0.5 0.5 0.5 0.5 0.5 0.5 
##$DPOFFS= (0..7)
0 0 0 0 0 0 0 0 
##$DQDMODE= 0
##$DR= 18
##$DS= 0
$$ [...]
##$SUBNAM2= <"">
##$SUBNAM3= <"">
##$SUBNAM4= <"">
##$SUBNAM5= <"">
##$SUBNAM6= <"">
##$SUBNAM7= <"">
##$SUBNAM8= <"">
##$SUBNAM9= <"">
##$SW= 16.880792210976
##$SWIBOX= (0..15)
0 0 2 0 0 0 0 0 0 0 0 0 0 0 0 0 
##$SW_h= 3378.37837837838
##$TD= 16384
##$TD0= 1
##$TE= 0
##$TE2= 300
##$TE3= 300
##$TEG= 300
##$TL= (0..7)
0 120 120 120 120 120 120 120 
##$TP= (0..7)
150 150 150 150 150 150 150 150 
##$TP07= 0
##$TPNAME0= <>
##$TPNAME1= <>
##$TPNAME2= <>
##$TPNAME3= <>
##$TPNAME4= <>
##$TPNAME5= <>
##$TPNAME6= <>
##$TPNAME7= <>
##$TPOAL= (0..7)
0.5 0.5 0.5 0.5 0.5 0.5 0.5 0.5 
##$TPOFFS= (0..7)
0 0 0 0 0 0 0 0 
##$TUNHIN= 0
##$TUNHOUT= 0
##$TUNXOUT= 0
##$USERA1= <user>
##$USERA2= <user>
##$USERA3= <user>
##$USERA4= <user>
##$USERA5= <user>
##$V9= 5
##$VALIST= <valist>
##$VCLIST= <CCCCCCCCCCCCCCC>
##$VD= 0
##$VDLIST= <DDDDDDDDDDDDDDD>
##$VPLIST= <PPPPPPPPPPPPPPP>
##$VTLIST= <TTTTTTTTTTTTTTT>
##$WBST= 1024
##$WBSW= 4
##$XGAIN= (0..3)
0 0 0 0 
##$XL= 0
##$YL= 0
##$YMAX_a= 66359
##$YMIN_a= -53755
##$ZGOPTNS= <>
##$ZL1= 120
##$ZL2= 120
##$ZL3= 120
##$ZL4= 120
##$ABSF1= 10
##$ABSF2= 0
##$ABSG= 5
##$ABSL= 3
##$ALPHA= 0
##$AQORDER= 0
##$ASSFAC= 0
##$ASSFACI= 0
##$ASSFACX= 0
##$ASSWID= 0
##$AUNMP= <proc_1d>
##$AZFE= 0.1
##$AZFW= 0.1
##$BCFW= 1
##$BC_mod= 2
##$BYTORDP= 1
##$COROFFS= 0
##$CY= 11.3945322036743
##$DATMOD= 1
##$DC= 2
##$DFILT= <>
##$DTYPP= 0
##$F1P= 16.9975609425685
##$F2P= -3.02152046262296
##$FCOR= 0.5
##$FTSIZE= 0
##$FT_mod= 4
##$GAMMA= 1
##$GB= 0.15
##$INTBC= 1
##$INTSCL= 1
##$ISEN= 128
##$LB= 0.24
##$LEV0= 0
##$LPBIN= 0
##$MAXI= 10000
##$MC2= 0
##$MEAN= 0
##$ME_mod= 0
##$MI= 1.114404
##$NCOEF= 0
##$NC_proc= 0
##$NLEV= 6
##$NOISF1= 3.799351
##$NOISF2= 2.8
##$NSP= 1
##$NTH_PI= 0
##$NZP= 0
##$OFFSET= 15.70392
##$PC= 1
##$PHC0= -9974.162
##$PHC1= 10.00092
##$PH_mod= 1
##$PKNL= yes
##$PPARMOD= 0
##$PSCAL= 0
##$PSIGN= 0
##$REVERSE= no
##$SF= 200.130013532006
##$SI= 16384
##$SIGF1= 3
##$SIGF2= 2
##$SINO= 400
##$SIOLD= 16384
##$SREGLST= <1H.CDCl3>
##$SSB= 0
##$STSI= 0
##$STSR= 0
##$SW_p= 3612.71676300578
##$SYMM= 0
##$S_DEV= 0
##$TDeff= 0
##$TDoff= 0
##$TI= <>
##$TILT= no
##$TM1= 0
##$TM2= 0
##$TOPLEV= 0
##$USERP1= <user>
##$USERP2= <user>
##$USERP3= <user>
##$USERP4= <user>
##$USERP5= <user>
##$WDW= 1
##$XDIM= 8192
##$YMAX_p= 0
##$YMIN_p= 0
$$ End of Bruker specific parameters
$$ ---------------------------------
##NTUPLES= NMR FID
##VAR_NAME=  TIME,          FID/REAL,        FID/IMAG
##SYMBOL=    X,             R,               I
##VAR_TYPE=  INDEPENDENT,   DEPENDENT,       DEPENDENT
##VAR_FORM=  AFFN,          ASDF,            ASDF
##VAR_DIM=   8192,          8192,            8192
##UNITS=     SECONDS,       ARBITRARY UNITS, ARBITRARY UNITS
##FACTOR=    0.000296,      1,               1
##FIRST=     0,             0,               0
##LAST=      2.424536,      0,               0
##MIN=       0,             -53755,          0
##MAX=       2.424536,      66359,           0
$$ Real data points
##PAGE= N=1
##DATA TABLE= (X++(R..R)), XYDATA
$$ [...]
$$ plain form
1832 49 -722 594 -760 -15 330 -51 534 -198 -94 595 -113 -390 1041 -964 225 158 -639 263 -1088
1851 -1088 -72 -421 -787 -451 -546 -346 -225 -787 -274 -3 -1315 488 -737 -59 431 -1172 799 -476
1869 -476 -183 320 35 -24 38 -357 220 -58 -436 493 -891 414 -546 -364 862 -1103 220 -116 -471
1888 -471 152 -353 -199 236 -581 90 393 -469 849 -444 524 726 -497 767 -279 50 345 -527
1906 -527 126 241 -622 456 -236 -474 228 -1130 448 -723 -438 376 -706 356 -356 -619 351 -312
1924 -312 -658 443 -781 173 -91 -999 478 -899 182 -21 -674 276 -541 -71 -149 -434 62 165 -792
1943 -792 424 -585 -33 475 -776 658 -544 -38 457 -265 357 60 21 595 133 115 1128 -371
1961 -371 974 337 128 1023 -187 1018 402 305 911 171 467 639 158 584 697 -151 1095 86 237
$$ packed form
1832D9p71J316j354P45L45l81N85p32J04O89p08k77J431k005J189o7p97R02j351
1851a088J016l49l66L36r5K00J21n62N13K71j312J803j225O78M90j603J971j275
1869d76K93N03k85n9O2l95N77k78l78R29j384J305r60J82J226j965J323l36l55
1888d71O23n05J54M35q17O71L03q62J318j293R68K02j223J264j046L29K95q72
1906e27O53J15q63J078o92k38P02j358J578j171K85Q14j082J062p12k63R70o63
1924c12l46J101j224R54k64r08J477j377J081k03o53R50q17M70p8k85M96J03r57
1943g92J216j009N52N08j251J434j202N06M95p22O22k97l9N74m62j8J013j499
1961c71J345o37k09Q95j210J205o16r7O06p40K96J72m81M26J13q48J246j009J51
$$ plain form
1980 237 494 -304 942 -152 209 524 33 282 41 11 611 239 -55 876 -446 451 31 -250 458
1999 458 -729 368 -158 -369 -60 -351 -635 -179 -537 -382 -312 -1003 196 -858 72 -335 -760 181 -398
2018 -398 -121 -258 208 60 226 -438 83 -62 70 185 -594 405 -515 96 343 -491 40 -187 348 -11
2038 -11 104 -166 399 55 208 483 241 1057 55 1005 682 774 1003 710 1134 747 818 778 1027 424 694
2059 694 453 357 641 113 867 -179 524 175 113 310 28 272 168 363 41 817 -117 620 571 130 690
2080 690 -8 356 83 116 3 -173 -50 -376 -107 -505 -114 -582 -96 -777 -354 -90 -906 -141 -842 -153
2100 -153 -456 -134 -259 -325 123 11 494 152 737 -27 424 387 261 374 -251 417 -167 85 -228 -146 -57
2121 -57 -212 -215 -126 195 -584 175 -163 428 -2 92 416 -91 737 460 664 376 659 497 727 453 37 657
$$ packed form
1980B37K57p98J246j094L61L15m91K49k41l0O00l72k94R31j322Q97m20k81P08
1999D58j187J097n26k11L09k91k84M56l58J55P0o91J199j054R30m07m25R41n79
2018c98K77j37M66j48J66o64N21j45J32J15p79R99r20O11K47q34N31k27N35l59
2038a1J15k70N65l44J53K75k42Q16j002R50l23R2K29k93M24l87P1m0K49o03K70
2059F94k41r6K84n28P54j046P03l49o2J97k82K44j04J95l22P76r34P37m9m41N60
2080F90o98L64k73L3j13j76J23l26K69l98L91m68M86o81M23K64q16P65p01O89
2100a53l03L22j25o6M48j12M83l42N85p64M51l7j26J13o25O68n84K52l13Q2Q9
2121e7j55lQ9L21p79P59l38N91m30R4L24n07Q28k77K04k88K83j62K30k74m16O20
$$ plain form
2143 657 -93 61 -428 71 89 -442 -183 -453 -156 -714 -190 -467 -186 -565 -342 -77 -572 -21 -331 233
2163 233 -73 -44 249 106 33 -217 274 -251 -180 -532 -89 -491 -959 -676 -957 -147 -859 -527 -461 -477 -479 -520 -359
2186 -359 -390 -484 -497 110 -101 214 464 153 804 9 852 446 560 113 -7 152 -275 -508 -184 -155 -804
2207 -804 8 -478 -134 40 -494 557 -474 65 -4 81 378 -186 380 503 630 368 735 363 500 -28
2227 -28 254 297 -671 -211 -649 -315 -833 -613 -373 -470 -656 -622 99 -623 35 -751 184 -126 -569 208 -107
2248 -107 185 -37 323 429 456 187 635 347 226 99 -440 178 -789 -479 -462 -708 -273 -764 49 167 -68
2269 -68 -127 398 4 111 186 251 845 -136 832 660 426 848 230 1017 472 163 605 285 -406 -77 -355
2290 -355 -446 -426 -772 194 -754 186 -28 -158 221 -228 -59 408 29 -3 540 -372 384 158 40 795 -389
$$ packed form
2143F57p50J54m89M99J8n31K59k70K97n58N24k77K81l79K23K65m95N51l10N64
2163B33l06K9K93j43p3k50M91n25P1l52M43m02m68K83k81Q10p12L32O6j6km1J61
2186c59l1r4j3O07k11L15K50l11O51p95Q43m06J14m47j20J59m27k33L24K9o49
2207h04Q12m86L44J74n34J051j031N39o9Q5K97n64N66J23J27k62L67l72J37n28
2227b8K82M3r68M60m38L34n18K20K40r7j86L4P21p22O58p86R35l10m43P77l15
2248a07K92k22L60J06K7k69M48k88j21j27n39O18r67L10J7k46M35m91Q13J18k35
2269f8n9N25l94J07P5O5N94r81R68j72k34M22o18P87n45l09M42l20o91L29k78
2290c55r1K0l46R66r48R40k14j30L79m49J69M67l79l2N43r12P56k26j18P55j184
$$ plain form
2311 -389 97 -54 259 -3 -696 96 -406 -435 -229 -568 -586 0 -754 236 203 -502 441 -401 119 173 -405
2332 -405 392 23 72 287 -54 120 379 -404 873 -59 260 320 -491 281 -349 -328 -279 -341 -171 27 -163
2353 -163 48 91 -363 664 -382 525 127 -192 583 -307 423 423 -95 362 323 195 310 26 343 244 -546
2374 -546 355 -574 38 -114 -587 -52 -488 396 153 98 -162 6 -165 158 -58 40 475 -313 515 -139 183
2395 183 563 -182 577 191 -112 255 294 -152 413 -390 -136 48 -418 258 -544 135 204 -105 242 -63 122
2416 122 256 118 180 505 -213 481 -158 -125 250 -416 594 104 -277 84 -175 230 -282 -507 -209 -156 -983
2437 -983 -380 -562 -374 -362 -674 4 -762 -167 -315 -392 -306 -223 -213 -142 -282 -202 181 -506 217 -285 -183 -89 -794
2460 -794 31 -531 -605 -403 -457 -305 -508 -553 -349 -366 -523 -46 -514 -32 -51 -217 285 -164 225 128 157 389
$$ packed form
2311c89M86j51L13k62o93P92n02k9K06l39j8N86p54R90l3p05R43q42N20N4n78
2332d05P97l69M9K15l41J74K59p83J277r32L19O0q11P72o30K1M9o2J70J98j90
2353a63K11M3m54J027j046R07l98l19P75q90P30%n18M57l9j28J15k84L17r9p90
2374e46R01r29O12j52m73N35m36Q84k43n5k60J68j71L23k16R8M35p88Q28o54L22
2395A83L80p45P59l86l03L67L9m46N65q03K54J84m66O76q02O79O9l09L47l05J85
2416A22J34j38O2L25p18O94o39L3L75o66J010m90l81L61k59M05n12k25K98N3q27
2437i83O03j82J88J2l12O78p66N95j48p7Q6Q3J0P1j40Q0L83o87P23n02J02R4p05
2460g94Q25n62p4K02n4J52k03m5K04j7j57M77m68M82j9j66N02m49L89r7K9K32
$$ plain form
2482 389 121 35 473 -54 183 547 -118 201 -342 196 64 -332 127 -166 -72 -187 13 -18 396 -28 331
2503 331 275 115 789 -187 520 95 557 301 182 401 308 189 150 215 -137 189 -68 -163 67 -348 10 -333
2525 -333 46 -176 -317 -56 -157 -35 -253 -108 -88 507 60 233 275 143 193 -33 318 190 172 96 -245 67
2547 67 -118 -3 -106 -59 -290 215 -277 -30 -108 -592 304 -132 92 -1 483 91 296 526 471 308 411 677
2569 677 184 486 169 -45 424 -190 118 122 44 -112 55 -108 -92 -276 -438 -14 -581 -114 -388 -90 -190
2590 -190 -259 188 -51 234 -187 291 -80 89 -159 -101 78 -215 14 -315 125 -376 -300 118 -359 -277 -728
2611 -728 -208 -519 -510 -467 -120 -161 -98 -90 -334 152 -346 291 274 177 44 -201 303 -50 -156 -136 193 176 147 77
2635 77 244 -103 -383 270 -267 63 -299 -474 18 -158 104 407 408 209 775 468 571 346 512 880 185
$$ packed form
2482C89k68q6M38n27K37L64o65L19n43N38j32l96M59k93R4j15K00l1M14m24L59
2503C31n6j60O74r76P07m25M62k56j19K19r3j19l9O5l52L26k57r5K30m15L58l43
2525c33L79k22j41K61j01J22k18J45K0N95m47J73M2j32N0k26L51j28j8p6l41L12
2547F7j85J15j03M7k31N05m92K47p8m84Q96m36K24r3M84l92K05K30n5j63J03K66
2569F77m93L02l17k14M69o14L08Mp8j56J67j63J6j84j62M24n67M67k74K98j00
2590a90o9M47k39K85m21M78l71J69k48N8J79k93K29l29M40n01P6M18m77Q2m51
2611g28N20l11RM3L47m1O3Qk44M86m98O37j7r7j33k45N04l53j06K0L29j7k9p0
2635G7J67l47k80O53n37L30l62j75M92j76K62L03Jj99N66l07J03k25J66L68o95
$$ plain form
2656 185 416 52 342 179 74 158 114 125 -380 87 -316 -27 -188 138 -235 -289 -6 -144 75 -192 116
2677 116 601 286 327 402 479 106 161 40 203 157 -121 271 -120 206 -372 82 4 -192 -189 18 -371 -507 -256
2700 -256 -465 -115 -581 107 215 -3 551 111 820 376 345 373 452 292 11 176 50 189 -187 355 -26
2721 -26 1 -77 -143 -180 -489 9 -186 -63 -463 50 -16 65 -28 137 584 95 665 219 208 153 -70 142 -60
2744 -60 -293 103 -248 -130 -21 -478 -197 -263 -360 -342 -736 -340 -536 -553 -258 -422 -151 -116 -43 128 266 51
2766 51 423 1 8 273 -125 314 -196 24 25 -479 -172 -345 -271 -53 -236 -63 -229 -626 -276 -138 -528 166
2788 166 -443 172 163 310 726 523 653 577 370 569 651 21 243 -167 17 115 -351 466 -199 135 99 66
2810 66 -261 -58 -141 -200 7 -186 208 -153 510 125 122 639 -59 753 39 550 296 292 -45 185 -83 -16 92
$$ packed form
2656A85K31l64K90j63j05Q4m4J1n05M67m03K89j61L26l73n4K83j38K19k67L08
2677A16M85l15M1P5P7l73N5j21J63m6k78L92l91L26n78M54p8j96LK07l89j36K51
2700b56k09L50m66O88J08k18N54m40P09m44l1K8P9j60k81J65j26J39l76N42l81
2721b6K7p8o6l7l09M98j95J23m00N13o6Q1r3J65M47m89N70m46j1n5k23K12k02
2744f0k33L96l51J18J09m57K81o6r7J8l94L96j96j7K95j64K71L5P3J71J38k15
2766E1L72m22PK65l98M39n10K20Jn04L07j73P4K18j83J73j66l97L50J38l90O94
2788A66o09O15rJ47M16k03J30p6k07J99Q2o30K22m10J84R8m66Q17o65L34l6l3
2810F6l27K03q3n9K07j93L94l61O63l85lN17o98Q12p14N11k54ml37K30k68O7J08
$$ plain form
2833 92 -508 427 -511 -11 28 -277 -80 -618 -85 -198 -280 -105 -175 29 103 -169 66 206 -42 511 134 172
2855 172 11 -205 199 -140 -241 -131 -171 -543 -168 -359 -178 -468 -278 146 -402 -237 -202 -410 3 -68 -32
2876 -32 40 -27 77 347 -55 211 -186 428 252 -356 279 -157 51 104 -283 -187 -378 -272 -258 -296 -201 -280 -325
2899 -325 -32 -93 -246 311 -337 141 -258 -164 104 116 96 258 -10 48 417 -253 310 35 -25 -59 -501 -89
2921 -89 -111 -66 43 -338 -46 42 3 -28 165 118 418 71 294 65 328 391 -196 579 169 503 230 370 322
2944 322 330 -60 416 229 -248 150 -192 232 309 134 227 -289 -9 -95 85 12 262 -109 56 44 73 277 126
2967 126 530 -83 139 164 -274 165 -110 -35 112 -185 -251 73 -235 -10 -142 -391 -146 -282 49 -447 -42
2988 -42 20 -137 -186 -216 -367 -195 111 -219 84 153 105 166 -180 43 72 68 -196 108 -29 -8 135 -438 -33 -444
$$ packed form
2833I2o00R35r38N00L9l05J97n38N33j13q2J75p0K04P4k72K35J40k48N53l77L8
2855A72j61k16M04l39j01J10m0l72L75j91J81k90J90M24n48J65L5k08M13p1L6
2876c2P2o7J04K70m02K66l97O14j76o08O35m36K08N3l87R6j91J06J4l8R5p9m5
2899c25K93o1j53N57o48M78l99R4K68J2k0J62k68N8L69o70N63k75o0l4m42M12
2921h9k2M5J09l81K92Q8l9l1J93m7L00l47K23k29K63O3n87P75m10L34k73J40m8
2944C22Ql90M76j87m77L98l42M24P7j75R3n16K80q6J80p3K50l71J65j2K9K04j51
2967A26M04o13K22K5m38M39k75P5J47k97o6L24l08K25j32k49K45j36L31m96M05
2988d2O2j57m9l0j51J72L06l30L03O9m8O1l46K23K9mk64L04j37K1J43n73M05m11
$$ plain form
3012 -444 140 -97 25 78 -195 161 -26 326 -86 156 230 -157 20 -126 124 -21 113 -70 -4 -183 37
3033 37 147 -136 -107 -302 116 -2 -181 -42 -41 62 -244 -232 -7 18 -422 -231 -385 -97 109 -142 60 -316
3055 -316 -112 -257 96 -120 -156 -79 -52 -16 -301 13 -251 -100 -254 -100 34 -62 135 -120 31 6 -121 132
3077 132 84 -36 -54 121 -141 304 379 156 184 16 111 231 237 106 413 162 104 -36 47 393 18 425 -93
3100 -93 332 119 102 472 54 84 37 487 179 152 -283 65 55 -65 316 158 84 -38 243 182 40 -12 44
3123 44 119 -222 92 -165 57 -212 -94 -224 -213 -149 -235 228 -339 -100 -70 -284 -151 28 -32 -4 -170 -255 38
3146 38 -94 113 -29 -41 149 -289 18 -181 -79 -108 -181 -100 46 5 -224 91 83 264 -379 -116 -16 -59 250
3169 250 -17 65 -32 -27 206 21 -76 92 142 27 216 -95 227 12 -95 118 -363 56 -223 -92 -192 -143
$$ packed form
3012d44N84k37J22N3k73L56j87L52m12K42P4l87J77j46K50j45J34j83O6j79K20
3033C7J10k83K9j95M18j18j79J39JJ03l06J2K25K5m40J91j54K88K06k51K02l76
3055c16K04j45L53k16l6P7K7L6k85L14k64J51j54J54J34r6J97k55J51k5j27K53
3077A32m8j20j8J75k62M45P5k23K8j68R5J20Oj31L07k51n8j40Q3L46l75M07n18
3100i3M25k13j7L70m18L0m7M50l08k7m35L48j0j20L81j58p4j22K81o1j42n2N6
3123D4P5l41L14k57K22k69J18j30J1O4q6M63n67K39L0k14J33J79o0K8j66q5K93
3146C8j32K07j42j2J90m38L07j99J02k9p3Q1J46m1k29L15qJ81o43K63J00m3L09
3169B50k67Q2r7NK33j85r7J68N0j15J89l11L22k15j07K13m81M19k79J31j00M9
$$ plain form
3191 -143 -374 -260 44 -251 53 -216 114 -235 377 62 27 129 -209 122 -250 -59 -226 -24 -212 -12
3211 -12 -197 -186 74 -308 -121 -9 -309 -134 -152 -71 -120 205 -44 3 199 157 -34 56 285 -322 218 -75 281
3234 281 5 107 192 128 -166 -39 15 -93 218 -113 87 -248 -69 208 -427 110 -84 81 276 -39 204
3255 204 329 441 145 385 398 152 -82 134 186 95 252 -511 60 86 -216 -35 -59 -130 -100 -237 -37 -153
3277 -153 -290 136 0 -110 51 -204 86 -206 -48 -21 73 83 -122 54 -97 -134 -207 40 -283 29 -227 -139
3299 -139 -20 -238 -244 2 -64 -228 -267 -236 -193 11 52 234 -96 43 47 509 112 -56 307 -110 215 -204 -216
3322 -216 26 9 -3 301 39 16 111 -4 74 -264 -50 75 -253 1 -20 -49 5 306 -225 356 -32 255 152
3345 152 77 469 -74 147 12 73 152 -76 7 12 -78 -368 15 -62 21 -119 181 -134 -9 76 110 -158 115 90
$$ packed form
3191a43k31J14L04k95L04k69L30l49O12l15l5J02l38L31l72J91j67K02j88K00
3211a2j85J1K60l82J87J12l00J75j8Q1m9L25k49M7J96m2j91R0K29o07N40k93L56
3234B81k76J02Q5o4k94J27N4j08L11l31K00l35J79K77o35N37j94J65J95l15K43
3255B04J25J12k96K40J3k46k34K16N2r1J57p63N71K6l02J81k4p1L0j37K00j16
3277a53j37M26j36j10J61k55K90k92J58K7R4J0k05J76j51l7p3K47l23L12k56Q8
3299a39J19k18oK46o6j64l9L1M3K04M1J82l30J39MM62l97j68L63m17L25m19j2
3322b16K42j7j2L04k62k3R5j15P8l38K14J25l28K54k1k9N4L01n31N81l88K87j03
3345A52p5L92n43K21j35O1P9k28Q3Nr0k90L83p7Q3j40L00l15J25Q5L4k68K73k5
$$ plain form
3369 90 3 255 217 329 61 95 145 -294 24 -93 -306 114 20 45 -154 -118 70 -74 8 33 152 -45 -4 -244
3393 -244 242 72 65 19 147 27 -35 124 53 -23 37 43 36 -89 -74 126 40 -208 150 126 148 100 -168 90 -321
3418 -321 45 -39 -248 -42 -101 101 -179 206 36 144 59 38 -33 -27 8 -83 -42 -106 192 -142 77 -121 -23 -234
3442 -234 -165 -21 -243 -124 -267 -300 -85 52 -4 -299 132 61 288 56 209 58 -110 296 27 164 -68
3463 -68 426 121 63 118 -181 114 66 31 177 73 -200 -1 -57 -296 239 -272 -37 -130 79 -27 198 69
3485 69 -203 226 48 197 -286 253 -31 -109 107 40 100 -74 48 -53 103 -167 -114 -109 -203 -105 -69 42 -60
3508 -60 240 -62 26 -13 199 185 47 144 3 42 86 424 50 -73 365 21 221 109 106 18 142 161 -224 -7
3532 -7 -19 85 -92 87 181 227 177 150 11 -80 155 91 80 32 75 -23 -174 213 -34 138 -96 -21 210 128 35
$$ packed form
3369I0q7K52l8J12k68L4N0m39L18j17k13M20r4K5j99L6J88j44Q2K5J19j97M1k40
3393b44M86j70pm6J28j20o2J59p1p6O0Opj25J5K00q6k48L58k4K2m8k68K58m11
3418c21L66q4k09K06n9K02k80L85j70J08q5k1p1OL5r1M1o4K98l34K19j98R8k11
3442b34O9J44k22J19j43l3K15J37n6k95M31p1K27k32J53j51j68M06k69J37k32
3463f8M94l05n8N5k99K95m8l5J46j04k73J99n6k39N35n11K35r3K09j06K25j29
3485F9k72M29j78J49m83N39k84p8K16o7O0j74J22j01J56k70N3Nr4R8L6J11j02
3508f0L00l02Q8l9K12j4j38R7j41L9M4L38l74j23M38l44K00j12lq8J24J9l85K17
3532gj2J04j77J79R4M6n0k7j39r1K35o4j1m8M3r8j51L87k47J72k34P5K31q2r3
$$ plain form
3557 35 171 254 203 62 -78 133 -54 74 -54 -68 -153 -76 131 -52 170 -157 -211 340 -74 228 38 -151
3579 -151 -282 121 41 -95 166 -115 53 -346 -6 -113 128 -166 -57 -27 -442 -187 -314 5 -207 -86 -65
3600 -65 -217 -73 -140 76 11 179 -13 -120 -16 -113 95 89 2 -215 -1 245 194 -284 40 -12 -214 -91 -94 -150
3624 -150 -198 182 94 -110 46 -11 -24 -75 120 100 51 158 256 83 171 40 -159 205 -343 -18 -8 -354 -79
3647 -79 155 167 -86 173 -113 193 -37 75 -128 -322 103 -274 88 173 51 -28 -186 74 5 -24 170 55
3669 55 -63 -87 -29 -190 -103 -100 -133 -337 117 -3 -223 159 -103 -51 -38 76 -49 221 73 93 147 101 324 -12
3693 -12 207 434 243 164 -32 184 -88 54 -50 -120 -195 27 -138 -81 -88 -231 389 -177 90 4 -139 17 -12
3716 -12 61 53 -93 137 -149 27 62 232 -67 21 -149 105 -27 -120 -271 -365 -143 88 -49 -341 -95 -259 -130
$$ packed form
3557C5J36Q3n1j41j40K11j87J28j28j4q5P7K07j83K22l27n4N51m14L02j90j89
3579a51j31M03q0j36K61k81J68l99L40j07K41k94J09L0m15K55j27L19k12J21K1
3600f5j52J44o7K16o5J68j92j07J04r7K08oq7k17K14K46n1m78L24n2k02J23ln6
3624a50m8L80q8k04J56n7j3n1J95k0m9J07R8j73Q8j31j99L64n48L25J0l46K75
3647g9K34J2k53K59k86L06k30J12k03j94M25l77L62Q5j22p9j58K60o9k9J94j15
3669E5j18k4N8j61Q7Ll3k04M54j20k20L82k62N2J3J14j25K70j48K0N4m6K23l36
3693a2K19K27j91p9j96K16k72J42j04p0p5K22j65N7pj43O20n66K67q6j43J56k9
3716a2P3qj46K30k86J76L5J70k99Q8j70K54j32r3j51r4K22K31j37k92K46j64J29
$$ plain form
3739 -130 -118 21 40 -112 -60 8 38 -12 -4 29 18 173 338 393 68 183 4 276 -277 165 -97 -88 7 -422 47
3764 47 -158 -41 -167 -31 14 -145 -51 130 367 -218 100 0 239 191 224 210 40 20 121 -73 -16 92 17
3787 17 -158 72 -264 64 -36 -231 -170 -246 146 -89 -48 184 -256 -109 55 64 220 229 51 237 -33 172 232
3810 232 -24 90 117 81 -163 -147 -96 117 -110 104 -173 -95 -196 -137 12 133 152 77 -18 150 118 0 28 272
3834 272 73 279 205 116 228 147 426 -136 -24 -91 201 97 -161 63 44 -31 -72 131 -80 160 -33 -198
3856 -198 56 125 198 54 67 286 298 143 50 102 68 165 239 144 -300 80 -128 -58 59 -358 61 -14 -71 -150 83
3881 83 -56 -44 -118 -42 -33 -199 276 -37 27 -121 -230 152 -54 160 46 75 70 25 -61 -85 -483 -208 -105 -423
3905 -423 35 -256 -169 6 -174 -92 -143 127 -124 -37 -202 297 83 -103 274 78 169 -30 -51 -123 -55 -44 -257
$$ packed form
3739a30J2J39J9j52N2O8L0n0QL3j1J55J65N5l25J15j79K72n53M42k62RR5m29M69
3764D7k05J17j26J36M5j59R4J81K37n85L18j00K39m8L3j4j70k0J01j94N7J08p5
3787A7j75K30l36L28j00j95O1p6L92k35M1K32m40J47J64RJ56Rj78J86k70K05O0
3810B32k56J14K7l6k44J6N1K13k27K14k77P8j01N9J49J21J9p5r5J68l2j18K8K44
3834B72j99K06p4q9J12q1K79n62J12o7K92j04k58K24j9p5m1K03k11K40j93j65
3856a98K54O9P3j44J3K19J2j55r3N2l4R7P4r5m44L80k08P0J17m17M19p5n7p9K33
3881H3j39J2p4P6Rj66M75l13O4j48j09L82k06K14j14K9nm5q6k4l98K75J03l18
3905d23M58k91Q7J75j80Q2n1K70k51Q7j65M99k14j86L77j96R1j99k1p2O8J1k13
$$ plain form
3928 -257 -35 -13 -250 102 -242 126 -196 -54 -151 50 -277 41 -160 106 3 120 133 -15 -186 187 -70
3949 -70 -145 237 -69 -154 157 -317 -58 -32 -19 17 -69 -217 -108 -207 -3 -172 -107 164 65 185 -78 -110 123 62
3973 62 54 -168 39 277 258 -18 91 454 19 -70 21 -12 -15 -46 -226 113 139 -80 -1 -234 -129 -49 -22 7 280
3998 280 142 -71 18 -111 -34 -103 344 135 109 -48 -21 -29 -122 -30 107 -104 114 62 -178 -105 -60 -199 -210 -252 86
4023 86 -104 -7 62 -150 24 -93 261 116 -74 41 -67 61 -130 -80 22 -80 -44 92 -179 -179 -54 -11 42
4046 42 -151 -362 108 -63 -76 8 -154 -20 126 99 85 -188 230 -19 -93 33 176 -4 69 35 43 253 156 -107
4070 -107 126 4 106 -10 189 -166 10 209 159 -29 300 192 32 226 95 255 7 -17 52 -80 239
4091 239 8 87 26 182 290 112 221 -28 303 31 -24 -208 -237 193 -277 -81 -231 117 -82 -125 -79 -71 -47
$$ packed form
3928b57K22K2k37L52l44L68l22J42r7K01l27L18k01K66j03J17J3j48j71L73k57
3949g0p5L82l06q5L11m74K59K6J3L6q6j48J09r9K04j69O5K71r9J20k63l2K33o1
3973F2qk22K07K38j9k76J09L63m35q9R1l3ll1j80L39K6k19P9k33J05Q0K7K9K73
3998B80j38k13Q9j29P7o9M47k09k6j57K7qr3R2J37k11K18n2k40P3M5j39j1m2L38
4023H6j90R7O9k12J74j17L54j45j90J15j08J28j91N0J02j02L6J36k71%J25M3N3
4046D2j93k11M70j71j3Q4j62J34J46k7j4k73M18k49p4J26J43j80P3l4QK10r7k63
4070a07K33j22J02j16J99l55J76J99n0j88L29j08j60J94j31J60k48k4O9j32L19
4091B39k31P9o1J56J08j78J09k49L31k72n5j84k9M30m70J96j50L48j99m3M6QK4
$$ plain form
4114 -47 68 125 -90 213 -139 -1 12 -15 131 -84 98 -134 153 250 -12 48 175 -23 20 117 -86 84 -24
4137 -24 -249 -332 -97 -104 52 -20 -10 86 16 71 75 127 -40 89 218 74 77 123 242 210 210 105 -47 224 -129 162
4163 162 192 -230 -78 -138 107 -135 208 -217 -49 -87 77 -195 9 46 7 229 -56 82 -239 36 184 219
4185 219 -36 -97 81 -220 -147 -173 -244 -45 -51 158 -109 -239 -406 -55 -135 -153 6 -200 -99 -265 -52 19 68
4208 68 -38 -53 117 -113 42 103 -51 -106 43 165 -14 -24 -76 112 114 -94 -83 168 -283 190 13 150 -12
4231 -12 27 113 4 163 -34 134 146 142 76 82 25 62 0 102 -62 6 114 498 -64 -2 -163 146 167 -192 130
4256 130 -101 -21 -86 -162 -196 -84 54 -89 -264 28 -146 -10 49 -4 -211 -150 95 96 -47 -1 72 -82 -110 -65
4280 -65 -95 -129 -93 -252 181 -505 -26 -158 -10 168 -84 6 20 17 15 106 16 114 189 154 -167 124 -52 78 271
$$ packed form
4114d7J15N7k15L03l52J38J3k7J46k15J82k32K87R7k62O0J27j98M3R7k03J70j08
4137b4k25q3K35pJ56p2J0R6p0N5MN2j67J29J29j44LM6J19l2%j05j52K71l53K91
4163A62L0m22J52o0K45k42L43m25J68l8J64k72K04L7l9K22k85J38l21K75J48L5
4185B19k55o1J78l01P3k6p1J99oK09k67j30j67L51q0j8J59k06J01j66K13P1M9
4208F8j06j5J70k30J55O1j54n5J49J22j79j0n2J88Kk08J1K51m51M73j77J37j62
4231a2L9Q6j09J59j97J68J2mo6On7L7o2J02j64O8J08L84n62O2j61L09K1l59L22
4256A30k31Q0o5p6l4J12J38j43j75K92j74J36N9n3k07O1K45Jj43M6P3j54k8M5
4280f5l0l4L6j59M33o86M79j32J48J78k52R0J4lkR1r0R8P5l5l21K91j76J30J93
$$ plain form
4305 271 49 -171 -9 217 -30 -65 -14 102 58 -161 -92 -44 -324 -143 -41 90 -83 75 143 12 -16 15 174
4328 174 -132 -41 -242 80 -97 -104 -268 -9 -29 -277 66 -270 -87 -68 66 -198 -38 10 36 161 63 120 154
4351 154 28 22 49 -184 76 90 17 50 -55 110 -79 -124 120 224 4 -79 99 -65 163 -210 -129 76 -270
4374 -270 214 -52 -51 21 106 73 174 92 -95 253 12 -51 266 -44 162 192 80 -107 -121 79 159 2 115
4397 115 186 96 45 -88 -66 156 253 52 17 172 -213 32 -37 98 92 71 -128 153 -111 12 -72 -233 24 -12
4421 -12 63 147 119 -159 9 -127 -193 -59 171 -119 -121 -194 63 111 10 115 -10 -84 -148 -62 -279 110 218 136
4445 136 200 52 -70 -38 172 16 110 -239 -14 -111 209 -6 -80 52 30 220 -83 279 -77 -160 -65 23 68
4468 68 -35 -44 -55 179 -104 -5 -173 19 -44 -5 31 -109 -92 111 -132 -182 -102 -180 44 -193 -105 73 -87 -256
$$ packed form
4305B71k22k20J62K26k47l5N1J16m4k19O9M8k80J81J02J31j73J58O8j31k8L1J59
4328A74l06R1k01L22j77pj64K59k0k48L43l36J83J9J34k64J60M8K6J25r8N7L4
4351A54j26oK7k33K60J4p3L3j05J65j89m5K44J04k20q3J78j64K28l73Q1K05l46
4374b70M84k66JP2Q5l3J01q2j87L48k41o3L17l10K06L0j12j87j4K00Q0j57J13
4397A15P1r0n1j33K2K22R7k01l5J55l85K45o9J35ok1j99K81k64J23q4j61K57l6
4421a2P5Q4k8k78J68j36o6J34K30k90kp3K57M8j01J05j25p4o4Q6k17L89J08q2
4445A36O4j48j22L2K10j56R4l49K25r7L20k15p4J32k2J90l03L62l56q3R5Q8M5
4468F8j03rj1K34k83R9j68J92o3L9L6j40J7K03k43n0Q0p8K24k37Q8J78j60j69
$$ plain form
4492 -256 73 36 210 64 -20 8 5 -259 209 -111 67 -108 145 76 -187 -76 35 148 87 73 -227 1 56
4515 56 -266 51 -61 102 243 88 216 214 98 154 15 -154 397 -88 -114 80 -89 86 25 117 51 -46 -45 307
4539 307 -132 -217 -187 124 289 -5 53 15 -61 50 -184 142 -26 -3 -53 23 -43 -165 73 -104 -134 -275 -16
4562 -16 -77 -190 122 -256 189 -203 105 -77 -35 114 110 -273 87 -75 177 201 -75 132 -80 75 15 -28 164
4585 164 14 34 115 84 114 -124 -16 -48 129 -224 240 -4 250 -14 196 -96 -175 -17 154 -139 47 -69
4607 -69 -66 98 124 170 10 -10 151 18 99 231 78 215 -229 14 -49 -77 -128 -18 3 -93 -203 -90 141 -124
4631 -124 -204 -157 68 119 175 69 -158 20 -75 -17 -193 -141 -76 -75 141 146 14 -369 -2 -52 -134 -33 123 -190 -69
4656 -69 -54 64 -30 61 -31 -121 -1 -219 140 133 -167 -229 93 -20 -40 64 49 -2 -50 -42 -66 51 75 219 -135 -247
$$ packed form
4492b56L29l7J74j46q4K8lk64M68l20J78j75K53o9k63J11J11J13o1j4l00K28N5
4515E6l22L17j12J63J41j55J28kj16N6j39j69N51m85k6J94j69J75o1R2o6r7JL52
4539C07m39q5L0L11J65k94N8l8p6J11k34L26j68K3n0P6o6j22K38j77l0j41K59
4562a6o1j13L12l78M45l92L08j82M2J49ml83L60j62K52K4k76K07k12J55o0m3J92
4585A64j50K0Q1l1L0k38J08l2J77l53M64k44K54k64K10k92p9J58J71k93J86j16
4607f9LJ64K6M6j60k0J61j33Q1J32j53J37m44K43o3k8n1J10K1r6j10J13K31k65
4631a24q0M7K25N1N6j06k27J78r5N8j76N2O5JK16Nj32l83L67n0q2J01J56l13J21
4656f9J5J18r4R1r2r0J20k18L59pl00o2L22j13k0J04j5n1m8Qk4J17K4J44l54j12
$$ plain form
4682 -247 114 -47 -14 -83 51 -9 -43 158 -78 -91 36 -37 336 -73 60 -119 -108 -54 23 15 1 -194 296 -4
4706 -4 -163 62 262 -72 -54 35 90 -20 106 -112 -119 200 -107 -118 36 -64 -184 53 -233 -111 8 -53 23
4729 23 -34 -103 -20 199 151 -107 184 269 155 115 287 -85 30 -87 -216 67 -7 61 78 118 -60 210 168 -215
4753 -215 -27 -85 44 -4 255 -303 73 202 -91 142 -103 130 159 -1 -106 -282 71 145 -41 122 38 71
4775 71 -130 -80 -66 -123 -62 130 -34 108 -26 18 222 -89 -32 -10 -265 106 111 44 -78 152 143 -24 -97 -127 -143
4800 -143 -143 -313 -103 -152 -87 -86 136 -126 -14 248 106 66 41 -67 100 -24 10 -152 176 252 -2 -182 82
4823 82 26 123 -127 -49 -68 285 119 48 -33 -79 30 -15 184 204 154 -64 -23 112 26 -75 -155 172 8 35 123
4848 123 -18 172 118 86 86 32 -181 -98 -275 -198 39 -10 -69 269 94 -64 -87 -177 -124 85 -53 155 -172 247
$$ packed form
4682b47L61j61L3o9J34o0l4K01k36j3J27p3L73m09J33j79J1N4P7qj4j95M90l00
4706dj59K25K00l34J8Q9N5j10J26k18pL19l07j1J54j00j20K37k86J22J19o1P6
4729B3n7o9Q3K19m8k58K91Q5j14m0J72l72J15j17j29K83p4O8J7M0j78K70m2l83
4753b15J88n8J29m8K59n58L76J29k93K33k45K33K9j60j05j76L53P4j86J63q4L3
4775G1k01N0J4n7O1J92j64J42j34M4K04l11N7K2k55L71No7j22K30rj67p3l0j6
4800a43%j70K10m9O5JK22k62J12K62j42m0k5j08J67j24L4j62L28P6k54j80K64
4823H2n6R7k50P8j9L53j66p1q1m6J09m5J99K0n0k18M1J35q6j01q0L27j64K7Q8
4848A23j41J90n4l2%n4k13Q3j77P7K37m9n9L38j75j58k3r0N3K09j38K08l27M19
$$ plain form
4872 247 200 -49 -120 -66 -176 114 146 78 189 161 74 -161 -61 -46 -24 -234 55 -30 55 26 34 199 100 118 56 359
4898 359 3 -104 193 246 23 -54 105 -177 -2 149 94 61 -73 62 204 -24 -57 97 -36 -157 30 -166
4920 -166 -75 -129 146 146 144 -83 29 269 -147 122 -94 -16 -22 260 -326 -52 116 -21 229 -24 55 37 11 -85
4944 -85 -150 -94 -245 -240 -131 -46 -124 -181 117 -15 -52 15 58 27 62 -11 237 -132 -124 243 44 -137 -19 -396 -37
4969 -37 167 180 -129 41 72 -200 -263 48 97 127 75 47 191 -57 68 301 288 204 88 -86 221 29 -206
4992 -206 50 45 -21 -60 3 -152 -267 123 -259 -38 -33 23 106 -59 142 -196 -42 -186 195 80 57 25 91 169
5016 169 149 -103 8 120 4 -77 -279 9 73 -119 109 35 -312 -77 -108 82 23 3 -174 -145 23 146 -92
5039 -92 -176 -14 -140 202 18 21 39 167 82 124 72 -180 -187 -58 44 -4 -78 61 -7 -37 -60 77 277 -223 -220 33
$$ packed form
4872B47m7k49p1N4j10K90L2o8J11k8q7k35J00J5K2k10K89q5Q5k9QJ65r9J8o2L03
4898C59l56j07K97N3k23p7J59k82J75J51n5l3j34J35J42k28l3J54j33j21J87j96
4920a66R1n4K75%kk27J12K40m16K69k16P8oK82n86K74J68j37K50k53P9j8k6r6
4944h5o5N6j51NJ09Q5p8n7K98j32l7O7M3l1L5p3K48l69QL67j99j81J18l77L59
4969c7K04J3l09J70L1k72o3L11M9L0n2k8J44k48J25K33j3q4j16j74L07j92k35
4992b06K56no6l9O3j55j15L90l82K21NN6Q3j65K01l38J54j44L81j15k3l2O6P8
5016A69k0k52J11J12j16q1k02K88O4j92K28p4l47K35l1J90n9k0j77K9J68J23k38
5039i2q4J62j26L42j84LJ8J28q5M2n2k52pJ29J02m8p4J39o8l0k3J37K00n00LK53
$$ plain form
5065 33 56 37 248 -156 1 -220 112 175 278 -20 37 -65 111 42 -141 92 22 68 4 8 -186 -127 -83 -262
5089 -262 115 90 91 -52 183 -119 -253 -92 -14 31 121 -130 175 147 118 117 40 106 -38 25 125 99 70 144 53 125
5115 125 134 15 -72 -128 70 9 82 223 14 185 202 77 -125 57 1 -43 49 184 31 -160 47 -8 -105 77
5139 77 -72 -10 13 -87 249 -26 -70 -53 -24 -42 0 -25 -16 -9 -126 -7 -68 -182 -135 -110 56 83 -268 109 174 -49
5165 -49 -12 -248 118 71 -82 -182 -3 -247 111 83 114 -15 84 -242 -45 -91 -2 -71 -4 -159 -157 56 32 -6 -80
5190 -80 -8 128 -82 -50 -8 -85 21 206 -64 -188 60 -28 -158 -104 100 -194 60 24 -51 91 52 381 203
5213 203 50 79 182 -68 -154 101 128 98 158 51 -38 141 3 75 -91 69 -162 48 -33 45 265 55 151
5236 151 -119 15 27 -51 403 6 46 -118 26 123 -150 278 28 6 -119 72 8 9 -61 17 -55 -8 -66 -45 -65
$$ packed form
5065C3K3j9K11m04J57k21L32O3J03k98N7j02J76o9j83K33p0M6o4Mj94N9M4j79
5089b62L77k5Jj43K35l02j34J61P8M5R0k51L05k8k9jp7O6j44O3J00k6k9P4r1P2
5115A25Rj19q7n6J98o1P3J41k09J71J7j25k02J82n6m4R2J35j53j91K07n5r7J82
5139G7j49O2K3j00L36k75m4J7K9j8M2k5RPj17J19o1j14M7K5J66K7l51L77O5k23
5165d9L7k36L66m7j53j00J79k44L58k8L1j29R9l26J97m6Q9o9O7j55KK13k4l8p4
5190h0P2J36k10L2M2p7J06J85k70j24K48q8j30N4K04k94K54l6p5J42l9L29j78
5213B03j53K9J03k50q6K55K7l0O0j07q9J79j38P2j66J60k31K10q1P8K20k10R6
5236A51k70J34J2p8M54l97M0j64J44R7k73M28k50k2j25J91o4Jp0P8p2M7n8K1k0
$$ plain form
5261 -65 67 134 -23 8 190 230 125 9 84 38 -87 -163 21 -18 -30 71 60 2 36 -13 279 -135 -40 -252 -314
5286 -314 -54 19 -10 -88 80 73 87 -81 36 -31 124 28 -140 -92 65 -19 -66 -249 -58 -98 -150 -81 104 -130 83
5311 83 -50 -61 17 -209 -219 -140 41 -23 -7 -48 72 -90 60 -83 127 45 165 -24 -106 -138 15 152 206 -144
5335 -144 -16 149 -39 -188 98 77 -135 -108 -102 -32 196 -121 -180 -39 275 210 104 16 37 -3 132 -17 -68 5
5359 5 -234 -153 2 50 -230 44 10 140 -62 -127 -97 -216 -40 67 322 -48 105 -67 -144 -82 -168 66 122 4
5383 4 231 -64 96 24 191 217 150 -61 170 -95 -54 79 82 -84 59 12 -274 154 -158 -19 168 -193 -50
5406 -50 -133 -118 -226 39 20 -173 -137 283 146 -97 264 -123 -136 -325 161 179 112 28 -233 94 230 -38 -63
5429 -63 -28 -18 111 -60 82 81 -88 -83 455 140 16 -211 38 288 59 -76 60 95 -33 -69 -42 -57 117 -19
$$ packed form
5261f5J32O7j57L1J82M0j05j16P5m6j25p6J84l9j2J01j1n8L4m9K92m14R5k12o2
5286c14K60P3k9p8J68pJ4j68J17o7J55r6j68M8J57q4m7j83J91m0n2O9J85k34K13
5311H3j33j1P8k26j0P9J81o4J6m1J20j62J50j43K10q2J20j89q2l2J53J37N4l50
5335a44J28J65j88j49K86k1k12K7OP0K28l17n9J41L14o5j06q8K1m0J35j49n1P3
5359Ek39Q1J55M8k80K74l4J30k02o5L0j19J76J07K55l70J53j72p7O2q6K34N6j18
5383DK27k95J60p2J67K6o7k11K31k65M1J33Lj66J43m7k86M28l12J39J87l61J43
5406e0q3J5j08K65j9j93L6M20j37k43L61l87j3j89M86J8o7q4k61L27J36k68k5
5429f3L5J0J29j71J42jj69NN38l15j24k27K49K50k29j35J36L5j28l6K7j5J74j36
$$ plain form
5453 -19 -47 -31 50 -2 -102 -53 150 -10 -228 164 150 75 -162 140 -189 133 114 49 193 -124 127 -154 157
5476 157 -80 -170 160 -454 67 264 79 -75 -146 -70 52 -42 -115 -94 -27 -202 -219 -7 -41 227 31 -89 -167
5499 -167 -65 140 -21 85 177 89 256 89 67 -254 -141 107 29 -166 -54 -226 -90 85 -99 -141 6 -123
5521 -123 16 -146 -41 -156 208 8 -56 35 117 -32 88 -52 -86 325 160 291 -130 -33 -129 126 -96 88
5543 88 -71 -95 -224 -277 -222 19 232 -183 -7 -206 -135 28 122 339 -89 247 176 -55 -160 12 161 -113
5565 -113 19 -57 -27 -67 52 232 -93 -17 83 -32 32 -30 -159 54 -90 -229 19 13 241 9 -110 80 38
5588 38 166 172 393 -127 2 -131 108 -228 -149 -134 124 11 150 183 -124 -67 -392 -43 151 50 -67 -82 49
5611 49 65 64 159 -28 -51 -71 387 -28 173 129 267 -95 -60 2 -38 6 49 -200 81 -32 -54 26 -76 -1 -52 -175
$$ packed form
5453a9k8J6Q1n2j00M9K03j60k18L92j4p5k37L02l29L22j9o5J44l17K51k81L11
5476A57k37r0L30o14N21J97j85j54p1P6J22r4p3K1O7j75j7K12l4K68j96j20p8
5499a67J02K05j61J06R2q8J67j67k2l21J13K48p8j95J12j72J36J75j84m2J47j29
5521a23J39j62J05j15L64k00o4R1Q2j49J20j40l4M11j65J31m21R7r6K55k22J84
5543H8j59k4j29n3N5K41K13m15J76j99P1J63R4K17m28L36p1k31j05J72J49k74
5565a13J32p6L0m0J19J80l25P6J00j15O4o2j29K13j44j39K48oK28k32j19J90m2
5588C8J28OK21n20J29j33K39l36P9J5K58j13J39L3l07N7l25L49J94j01j17j5J31
5611D9J6jR5j87k3k0M58m15K01m4J38l62L5O2m0M4M3k49K81j13k2Q0j02P5n1j23
$$ plain form
5637 -175 21 -15 -170 133 31 -10 -47 132 -122 -78 85 -104 -16 -17 -127 -124 -124 -326 124 -66 -57 -191 67 111 -53
5662 -53 -123 -323 124 -104 179 -5 160 101 -9 -56 115 -26 -58 45 32 21 -45 71 -48 0 15 -191 -97 36
5686 36 -59 77 -148 -52 10 214 -119 -109 128 -176 -145 -291 -89 -50 -37 -162 -59 -97 -247 -31 -6 46 46 -94
5710 -94 137 -116 228 240 182 -44 -226 -70 152 15 -70 29 10 131 3 -130 -72 -44 265 -88 -192 -55 -10
5733 -10 162 -111 -129 178 -93 199 3 -66 24 -8 66 -83 124 -59 188 -145 270 37 97 -52 -201 -25
5755 -25 -171 -58 -115 11 88 -41 -72 33 123 -37 -45 -212 110 2 65 -132 -122 -370 -195 35 -8 -129 88
5778 88 -61 -97 -52 -26 -105 -89 -102 -55 8 -36 115 32 69 90 -213 12 -278 -112 -56 125 -195 -56 103 -107 71
5803 71 -41 186 46 -154 -31 70 -34 118 3 -98 183 -92 -7 -28 58 175 -39 -53 25 132 -72 139
$$ packed form
5637a75J96l6j55L03j02m1l7J79k54M4J63j89Q8jj10L%k02M50j90Rj34K58M4j64
5662e3p0k00M47k28K83j84J65n9j10m7J71j41l2J03j3j1o6J16j19M8J5k06R4J33
5686C6r5J36k25R6O2K04l33J0K37l04L1j46K02L9J3j25J03l8j50K16K5N2%j40
5710i4K31k53L44J2n8k26j82J56K22j37q5R9j9J21j28j33N8K8L09l53j04J37M5
5733a0J72k73j8L07k71K92j96o9R0l2P4j49K07j83K47l33M15k33O0j49j49J76
5755b5j46J13n7J26P7j29l1J05R0j60qj67L22j08O3j97J0k48J75K30m3j21K17
5778H8j49l6M5K6p9J6j3M7O3m4J51q3L7K1l03K25k90J66N6J81l20J39J59k10J78
5803G1j12K27j40k00J23J01j04J52j15j01K81k75Q5k1Q6J17k14j4P8J07k04K11
$$ plain form
5825 139 -13 28 -208 -74 134 19 12 229 162 20 -10 -71 -61 -214 -124 -184 -52 35 -214 212 -109 -37 -82 290
5849 290 -127 62 -229 -180 13 130 68 -153 211 -90 -59 -63 -89 -89 -233 -7 151 183 -34 84 -179 82 191
5872 191 4 -91 -109 8 -90 -110 33 137 137 19 -28 164 76 126 119 92 -7 19 -114 -8 125 209 -174 116 -221
5897 -221 21 -135 33 -134 -49 39 -252 5 -197 -113 -101 79 -24 123 -98 -93 -33 -215 19 -25 22 24 -19 49
5921 49 44 8 -54 105 -65 -164 -27 -113 -44 14 -15 205 86 127 -56 80 96 -24 69 -266 -10 -10 55 80 -197 37
5947 37 -183 -108 -81 299 -108 -198 -65 -85 -91 -104 -240 -156 -12 -59 -75 14 -24 26 140 -137 60 -126 16 14 -53 48
5973 48 -63 -72 45 47 65 82 -53 69 33 -56 -23 40 172 155 40 98 -157 -215 -88 -113 112 230 58 -17 -109 15
5999 15 111 142 31 5 -55 143 -153 31 303 117 -6 -83 133 -172 -25 -70 19 36 282 -19 -133 -115 133
$$ packed form
5825A39j52M1k36J34K08j15pK17o7j42l0o1J0j53R0o0J32Q7k49M26l21P2m5L72
5849B90m17J89k91M9J93J17o2k21L64l01L1mk6%j44K26J58L2k17J18k63K61J09
5872A91j87r5j8J17r8k0J43J04%j18m7J92q8N0pk7r9K6j33J06J33Q4l83K90l37
5897b21K42j56J68j67Q5Q8k91K57k02Q4J2J80j03J47k21NO0j82K34m4M7Km3O8
5921D9nl6o2J59j70r9J37q6O9N8k9K20j19M1j83J36J6j20R3l35K56%O5K5k77K34
5947C7k20P5K7L80m07r0J33k0oj3j36Q4J44m7j6Q9l8N0J14k77J97j86J42ko7J01
5973D8j11rJ17KJ8J7j35J22l6q9L3O3J32j7j15N8k55n8J27k5K25J18j72p5r2J24
5999A5R6L1j11k6o0J98k96J84K72j86j23p7K16l05J47m5Q9J7K46l01j14J8K48
$$ plain form
6022 133 8 -68 -3 23 165 255 64 -42 137 49 107 -201 -18 -168 -122 -95 -81 -107 -31 -71 -37 105 41 63 -45
6047 -45 -125 -55 123 -16 -80 10 -150 34 234 112 -2 88 108 15 22 158 13 99 -53 15 170 40 105 -34
6071 -34 69 -13 -29 -115 -55 -33 -126 23 -69 -72 -36 -203 -143 -104 -246 112 -49 30 15 238 166 -72 -107 11 -255 -39
6097 -39 11 -29 -145 57 340 -181 -20 9 13 -71 76 70 -18 -82 99 -198 -163 -189 149 -40 -176 100 24 -151 -247
6122 -247 -101 57 -59 -14 -90 84 150 176 -41 189 45 -187 -114 140 23 144 187 -60 132 -99 72 -92
6144 -92 -6 125 57 -102 -93 41 112 282 146 -95 107 -185 32 19 -89 -98 -40 181 139 5 -119 -87 -59 173
6168 173 8 -43 -169 7 -191 -132 -95 74 -5 0 33 -16 -102 -219 80 185 -118 -168 396 -111 -106 171 -165 -68
6192 -68 113 -172 236 126 167 127 -189 34 -86 -210 78 63 2 -93 -237 -40 -95 -160 8 -99 -5 91 20 -102
$$ packed form
6022A33j25p6O5K6J42R0j91j06J79q8N8l08J83j50M6K7J4k6P6m0L4J42o4K2j08
6047d5q0P0J78j39o4R0j60J84K00j22j14R0K0r3PJ36j45Q6j52O8J55j30O5j39
6071c4J03q2j6q6O0K2r3J49r2lL6j67O0L9j42L58j61P9j5K23p2k38l5J18k66K16
6097c9N0m0j16K02K83n21J61K9Mq4J47oq8o4J81k97L5k6L38j89j36K76p6j75r6
6122b47J46J58j16M5p6J74O6K6k17K30j44k32P3K54j17J21M3k47J92k31J71j64
6144i2Q6J31o8j59RJ34P1J70j36k41K02k92K17j3j08rN8K21m2j34j24L2K8K32
6168A73j65n1j26J76j98N9L7J69p9NL3m9q6j17K99J05l03n0N64n07NK77l36R7
6192f8J81k85M08j10M1m0l16K23j20j24K88j5o1r5j44J97n5o5J68j07R4R6p1j22
$$ plain form
6216 -102 -66 29 92 -49 39 -145 -86 19 12 177 -176 -105 44 55 -12 -89 -40 -68 -187 -21 2 -38 207 -56 20
6241 20 111 155 -128 73 -126 26 54 -74 -64 47 202 -8 -260 147 20 -30 399 365 100 63 109 157 -17
6264 -17 28 -22 77 -101 -27 21 -109 -128 -105 2 2 -59 42 -62 40 113 -139 -65 31 131 -58 -194 -14 62 47
6289 47 -126 55 -9 25 -200 -194 -148 -27 3 -96 40 -3 -7 110 -86 -122 292 -225 -252 79 264 -7 17 190 -110
6314 -110 76 190 -48 6 -5 54 -368 132 140 24 -43 -26 131 44 -86 -74 20 -108 -37 61 89 -21 178 151 137
6339 137 127 62 -34 26 -45 372 216 285 -149 10 -263 -125 -74 -137 199 155 -83 82 -27 118 -214 -38 73
6362 73 184 230 13 -278 73 106 1 232 -174 -221 -48 235 89 198 -37 -37 -93 58 -177 46 101 -44 -167
6385 -167 107 174 110 30 -163 59 109 53 -57 1 118 -214 -177 -56 187 5 192 -140 -50 -165 -177 63 -142
$$ packed form
6216a02L6R5O3j41Q8j84N9J05pJ65l53P1J49J1o7p7M9k8j19J66K3m0K45k63P6
6241B0R1M4k83K01j99J52K8j28J0J11J55k10k52M07j27n0M29l4k65l7M6M8j74
6264a7M5n0R9j78P4M8j30j9K3J07%o1J01j04J02P3k52P4R6J00j89j36J80P6j5
6289D7j73J81o4L4k25OM6J21L0r9J36m3mJ17j96l6M14n17k7L31J85k71K4J73l00
6314a10J86J14k38N4j1N9m22N00Qj16o7J7J57q7j30J2R4j28P1R8K8j10J99k7j4
6339A37j0o5r6O0p1M17j56O9m34J59k73J38N1o3L36m4k38J65j09J45l32J76J11
6362G3J11M6k17k91L51L3j05K31m06m7J73K83j46J09k35%n6J51k35K23N5j45j23
6385a67K74O7o4q0j93K22N0n6j10N8J17l32L7J21K43j82J87l32R0j15j2K40k05
$$ plain form
6408 -142 57 -111 -33 -48 12 -158 -109 -8 15 -27 -203 8 13 46 62 47 -84 62 21 -35 80 -104 139 29
6432 29 -67 -294 16 53 154 -23 -40 98 -166 -94 -67 -74 362 74 53 -110 -80 -172 17 48 58 223 135 -82 -69
6457 -69 -3 -310 123 -9 159 139 -115 111 -62 -209 -217 81 -18 144 33 109 90 49 147 -18 73 -80 -185 26
6481 26 -51 9 -1 21 89 -309 -103 -343 -51 154 112 -11 -22 -322 206 -116 -134 89 135 -135 22 -14 -75 107
6505 107 -122 58 6 -104 -93 23 -211 -20 -325 14 -55 87 -138 5 47 227 167 -23 -103 10 8 48 16
6528 16 -25 -68 -89 -14 -36 33 -77 -116 36 318 100 128 -7 118 -88 -154 156 61 -41 209 340 -143 85 -3
6552 -3 -200 45 39 -91 -125 -71 139 -150 127 -43 -78 -50 116 -31 75 44 -47 203 -85 -103 -50 126 -264 -164
6576 -164 -153 158 -22 29 25 -141 21 -80 259 -99 -296 132 104 -22 155 149 -5 -74 -95 -122 -32 -46 36 -92
$$ packed form
6408a42J99j68P8j5O0j70M9J01K3m2j76K11NL3J6j5j31J46m1n6J15j84K43j10
6432B9r6k27L10L7J01j77j7J38k64P2K7pM36k88k1j63L0r2J89L1J0J65q8k17J3
6457f9O6l07M33j32J68k0k54K26j73j47qK98r9J62j11P6j9m1R8j65R1j53j05K11
6481B6p7O0j0K2O8l98K06k40K92K05m2j23j1l00N28l22j8K23M6k70J57l6o1J82
6505A07k29J80n2j10J1J16k34J91l05L39o9J42k25J43M2J80o0j90q0J13kM0l2
6528A6m1m3k1P5k2O9j10l9J52K82k18K8j35J25k06o6L10r5j02K50J31m83K28q8
6552cj97K45oj30l4N4K10k89K77j70l5K8J66j47J06l1r1K50k88j8N3J76l90J00
6576a64J1L11j80N1mj66J62j01L39l58j97M28k8j26J77oj54o9k1k7R0j4Q2j28
$$ plain form
6600 -92 -236 116 76 116 -63 -73 69 -110 -258 -44 193 -145 36 -215 101 33 -152 -136 259 -55 27 21 -47
6623 -47 133 -198 -117 -33 -16 269 -29 -5 334 101 132 -37 8 -43 -19 -70 -165 75 -165 73 169 -19 170 -158
6647 -158 -76 -338 -374 -123 -66 295 -255 -94 -151 145 -318 132 147 164 -98 -85 -175 -138 -73 -62 124 167 60 -271
6671 -271 13 -13 -126 -83 -61 146 164 -109 53 -192 -62 -86 70 121 -65 134 -265 -79 -36 -98 -83 -160 298
6694 298 254 162 -177 -157 197 -276 78 75 -23 0 103 -177 -223 43 62 -15 -115 -85 6 -3 -238 82 226 142 189
6719 189 167 -44 84 174 26 -97 -68 -149 -51 40 -36 48 109 -72 -11 -79 87 -147 88 147 21 152 -206 -48
6743 -48 330 143 81 15 153 41 148 96 -56 278 -12 -148 -120 58 138 39 -62 -67 -273 0 -5 -108 -170 99
6767 99 -177 -165 104 51 -120 -112 31 21 157 -159 -117 85 114 -47 -193 -94 21 189 -137 -40 -65 -84 56 -203
$$ packed form
6600i2j44L52m0M0j79j0J42j79j48K14K37l38J81k51L16o8j85J6L95l14Q2oo8
6623d7J80l31Q1Q4J7K85k98K4L39k33L1j69M5n1K4n1r5K40k40K38R6j88J89l28
6647a58Q2k62l6K51N7L61n50J61n7K96m63M50J5J7k62J3r0L7O5J1J86M3j07l31
6671b71K84k6j13M3K2K07J8k73J62k45J30k4J56N1j86J99l99J86M3o2J5p7M58
6694B98m4r2l39K0L54m73L54lr8K3J03k80m6K66J9p7j00L0R1rk35L20J44q4M7
6719A89k2k11J28R0j48j23K9q1R8R1p6Q4O1j81O1o8J66k34K35N9j26J31l58J58
6743d8L78j87o2o6J38j12J07n2j52L34k90j36K8J78Q0r9j01nk06K73nj03o2K69
6767I9k76J2K69n3j71QJ43j0J36l16M2K02K9j61j46R9J15J68l26R7k5j9J40k59
$$ plain form
6791 -203 -14 55 79 -42 -43 -45 -103 -121 114 -88 40 -139 -15 -158 -65 46 -186 -95 -115 -89 132 54 -53 -37 74
6816 74 -134 -4 111 24 -4 -112 -92 -164 -205 40 -162 137 -149 -61 150 -206 -69 -153 -88 191 -59 152 -157
6839 -157 -34 120 -33 -165 -205 70 -83 -34 184 26 -124 52 -166 96 19 45 125 58 96 -1 64 -38 0
6862 0 15 -26 128 -88 -175 -91 110 -112 -55 -145 79 125 -132 -196 -344 115 129 -39 290 111 -117 108 125 -61
6886 -61 -44 49 -76 -86 -110 -146 98 131 -57 31 -133 19 4 63 -108 -85 -228 54 -32 -1 -2 -170 -203 -15 -59 -119
6912 -119 18 -102 23 154 -127 -56 -22 16 73 -228 100 -111 -92 -9 -89 -18 87 64 -51 -71 232 -65 -88 63
6936 63 -34 -30 216 18 61 -79 21 265 -84 -69 129 70 17 101 -68 67 -92 -87 -4 158 -115 -38 63 62 -125
6961 -125 -96 137 -35 -226 -73 -77 -50 126 -53 65 372 -173 -88 149 31 28 111 123 -143 -90 -50 -40 104 95 -42
$$ packed form
6791b03J89O9K4j21jkn8j8K35k02J28j79J24j43R3J11k32R1k0K6K21p8j07J6J11
6816G4k08J30J15q7k8j08K0p2m1K45k02K99k86Q8K11l56J37q4O5K79k50K11l09
6839a57J23J54j53j32m0K75j53M9K18j58j50J76k18K62p7K6Q0o7L8r7O5j02L8
6862@J5m1J54k16q7Q4K01k22N7r0K24M6k57o4j48M59J4j68L29j79k28K25J7j86
6886f1J7R3j25j0k4l6K44L3j88Q8j64J52j5N9j71K3j43K82q6L1jj68l3J88m4o0
6912a19J37j20J25J31k81P1L4L8N7l01L28k11J9Q3q0P1J05k3j15k0L03k97k3J51
6936F3r7MK46j98M3j40J00K44l49J5J98n9n3Q4j69J35j59NQ3J62k73P7J01jj87
6961a25K9K33j72j91J53mK7J76j79J18L07n45Q5K37j18lQ3J2k66N3M0J0J44rj37
$$ plain form
6986 -42 41 -116 25 34 50 59 125 77 -140 16 -149 -85 98 62 16 88 -69 -149 -71 116 66 168 109 -152 150 -73
7012 -73 80 -49 30 -166 30 113 -46 -130 -246 -192 -24 -233 40 -98 45 170 -31 161 -142 -23 86 -126
7034 -126 108 -117 57 133 -143 -57 -43 29 171 -76 7 1 272 32 190 -16 -109 195 1 -80 -29 150 -9
7057 -9 37 -197 -98 131 -156 256 -36 262 -193 270 26 106 103 -47 -17 -193 127 107 38 139 102 -29 151 -18
7081 -18 274 31 129 -129 309 -16 -29 -221 -72 -91 -154 -67 195 -32 -155 -116 41 110 10 37 -218 239 -151
7104 -151 49 198 38 -123 11 48 -103 99 -60 -98 224 -214 35 17 -193 203 13 115 59 75 -209 -172
7126 -172 130 222 -42 -89 -215 -122 110 78 289 25 98 226 32 13 81 72 146 -242 -81 -133 -71 162 130 179 -216
7151 -216 -33 76 -8 -91 9 18 85 19 172 -12 -79 48 -54 -291 -133 100 -36 48 -24 128 -74 -181 143
$$ packed form
6986d2Q3j57J41RJ6RO6m8k17J56j65O4J83l6m6P2j57q0P8J87n0J02n9k61L02k23
7012g3J53j29P9j96J96Q3j59q4j16N4J68k09K73j38J43J25k01J92l03J19J09k12
7034a26K34k25J74P6k76Q6J4P2J42k47Q3oK71k40J58k06r3L04j94q1N1J79j59
7057iM6k34R9K29k87M12k92K98m55M63k44Q0lj50L0j76L20k0o9J01l7j31J80j69
7081a8K92k43R8k58M38l25j3j92J49j9o3Q7K62k27j23L9J57O9j00K7k55M57l90
7104a51K00J49j60j61J34L7j51K02j59l8L22m38K49j8k10L96j90J02n6J6k84L7
7126a72L02R2k64m7j26R3K32l2K11k64P3J28j94j9O8rP4l88J61n2O2K33l2M9l95
7151b16J83J09q4q3J00RO7o6J53j84o7J27j02k37J58K33j36Q4p2J52k02j07L24
$$ plain form
7174 143 69 14 50 211 -100 54 171 -39 -107 118 183 153 98 -245 -206 -187 -17 -65 88 -55 -13 17 -79 -52 22
7199 22 -280 61 46 -115 -236 -106 -146 75 83 -34 165 -39 -87 -252 -17 47 -39 -126 216 -125 -94 105 151 193
7223 193 80 -108 -48 130 -197 144 32 -160 244 15 -105 -71 -40 9 35 -164 111 -318 -149 -104 154 122
7245 122 258 -116 58 -13 132 -29 106 69 -282 -193 -137 96 142 -185 -54 12 47 -31 -159 -41 -87 -285 161
7268 161 72 -167 297 -108 -37 -188 -142 -345 -223 -289 -30 -98 -213 -135 -178 -67 233 -122 40 188 38 27 -147
7291 -147 -55 135 -178 -3 -59 3 6 33 100 86 -136 -8 -130 52 -41 -64 59 -22 -40 -183 -55 -59 169 -61 34
7316 34 28 59 -103 46 -26 118 -17 41 178 206 81 -43 39 52 46 -162 101 -70 -54 85 -60 31 -105 -194 91
7341 91 11 149 102 48 -72 -171 138 150 -10 -103 -16 -65 -9 109 -89 18 -177 -44 2 -29 -310 -66 -190 190
$$ packed form
7174A43p4n5L6J61l11J54J17k10o8K25O5l0n5l43L9J9J70m8J53j43M2L0r6K7P4
7199B2l02L41j5j61j21J30m0K21Qj17J99k04m8j65K35O4q6q7L42l41L1J99M6M2
7223A93j13j88O0J78l27L41j12j92M04k29j20L4L1M9K6j99K75m29J69M5K58l2
7245A22J36l74J74p1J45j61J35l7l51Q9N6K33M6l27J31O6L5p8j28J18m6j98M46
7268A61q9k39M64m05P1j51M6k03J22o6K59o8j15P8m3J11L00l55J62J48j50j1j74
7291a47R2J90l13J75n6O2LK7O7j4k22J28j22J82r3k3J23q1j8j43J28mK28k30R5
7316C4oL1j62J49p2J44j35N8J37K8j25j24Q2J3ok08K63j71J6J39j45R1j36q9K85
7341I1q0J38m7n4j20r9L09J2j60r3Q7m9N6J18j98J07j95J33M6l1k81K44j24L80
$$ plain form
7365 190 -15 65 138 32 -35 261 -10 118 -62 38 26 -146 28 -24 225 34 -90 -75 4 -282 -95 -32 -133
7388 -133 48 -13 31 -19 -64 -268 -325 -49 -73 199 -97 196 -58 141 141 25 30 37 -196 19 86 -26 9 105 105 33
7414 33 78 -17 69 -55 74 88 21 -15 -48 -33 44 148 -107 -20 17 -34 91 26 56 -39 64 265 -40 -109 38 -28
7440 -28 -96 -20 61 -166 -81 33 -104 174 -22 -79 -11 -58 -234 75 -32 150 -120 418 -14 97 -46 -144 108
7463 108 -207 -154 77 176 -120 -82 -203 87 -93 -3 -52 34 74 157 -12 -100 -240 -235 -14 103 -49 36 22 -28 118
7488 118 62 44 -141 9 87 -144 -116 22 -157 176 72 54 134 197 72 8 -40 -171 90 -28 -186 -15 -8 208
7512 208 57 158 9 73 -112 164 107 -156 173 -123 37 42 -136 147 -2 -43 21 22 -56 161 30 114 -119
7535 -119 -202 -44 -24 -34 143 88 20 -185 183 41 -17 37 185 256 -54 38 -5 179 93 40 -184 127 -124 -171
$$ packed form
7365A90k05Q0P3j06o7K96k71J28j80J00j2j72J74n2K49j91j24J5P9k86J87O3j01
7388a33J81o1M4n0m5k04n7K76k4K72k96K93k54J99%j16NPk33K15O7j12L5R6%p2
7414C3M5r5Q6j24J29J4o7l6l3J5P7J04k55Q7L7n1J25o5L0r5J03K01l05o9J47o6
7440b8o8P6Q1k27Q5J14j37K78j96n7O8m7j76L09j07J82k70N38m32J11j43r8K52
7463A08l15N3K31R9k96L8j21K90j80R0m9Q6M0Q3j69q8j40NK21J17j52Q5j4n0J46
7488A18n6j8j85J50P8k31K8J38j79L33j04j8Q0O3j25o4m8j31K61j18j58J71PK16
7512B08j51J01j49O4j85K76n7k63L29k96J60Nj78K83j49m1O4Jp8K17j31Q4k33
7535a19q3J58K0j0J77n5o8k05L68j42n8N4J48P1l10R2m3J84q6n3k24L11k51m7
$$ plain form
7559 -171 -77 -108 3 -238 -74 112 -152 -83 -96 120 -120 269 92 72 -159 -23 -4 -276 144 24 -211 -96
7581 -96 277 124 259 -106 -78 227 41 -170 13 -101 173 -249 58 228 147 67 -136 122 -129 7 6 -137
7603 -137 -175 -73 47 -202 -102 -23 50 25 42 72 -188 -49 -112 -73 86 177 -38 57 -30 52 -227 99 -153 -94
7627 -94 -135 158 80 -136 93 -12 87 93 330 -9 97 -46 169 -112 -35 82 -161 -24 108 -100 -189 138 28
7650 28 -83 -42 -2 -175 -25 -276 -39 93 30 -87 -68 -65 -67 -134 79 -129 -73 159 79 1 -25 22 -200 -75 -78 17
7676 17 39 147 226 -49 -3 -107 -26 120 -12 -275 -64 -177 15 171 232 -113 185 97 -143 84 152 -252 2
7699 2 -44 64 139 -141 -6 -68 177 -17 -120 -9 -106 -213 -153 70 54 125 38 68 39 -37 59 76 -8 -119 -66 67
7725 67 9 -198 22 -26 -26 162 275 16 -204 177 -197 134 -53 -121 -122 190 -33 97 58 -283 -170 56 -197
$$ packed form
7559a71R4l1J11k41J64J86k64O9j3K16k40L89j77k0k31J36J9k72M20j20k35J15
7581i6L73j53J35l65K8L05j86k11J83j14K74m22L07J70q1q0k03K58k51J36jj43
7603a37l8J02J20k49J00P9P3k5J7L0k60J39o3L9J59R1k15R5q7Q2k79L26k52N9
7627i4m1K93p8k16K29j05R9OK37l39J06j43K15k81P7J17k43J37J32k08q9L27j10
7650B8j11M1M0j73J50k51K37J32o3j17J9Lko7K13k08N6K32q0p8k6M7k22J25lR5
7676A7K2J08P9k75M6j04Q1J46j32k63K11j13J92J56O1l45K98q8k40K27O8m04K54
7699Bm6J08P5k80J35o2K45j94j03J11r7j07O0K23j6P1q7L0k9p6R6J7q4j11N3J33
7725F7n8k07K20m8%J88J13k59k20L81l74L31j87o8jL12k23J30l9l41J13K26k53
$$ plain form
7748 -197 104 193 -112 63 -135 -85 -144 212 78 18 230 -112 -168 12 -164 124 5 -87 34 -85 31 -159
7770 -159 146 -41 82 181 -131 88 -90 -63 -265 -152 -73 -32 93 14 114 -5 -37 164 222 -241 -77 75
7792 75 -59 60 -21 -91 -102 -62 -179 -72 -101 70 -32 51 -66 -250 39 43 76 109 53 -4 80 -158 71 219 94
7817 94 -128 -195 -192 214 66 11 -186 2 -57 -41 2 -115 81 -44 2 117 98 125 7 207 -85 -131 -103 -102 38
7842 38 127 -113 -60 27 105 45 63 -127 -83 -50 47 88 226 140 59 -52 75 -77 13 -176 -65 -46 -184 1 36
7867 36 209 -30 -131 -132 118 -91 85 196 -97 272 -161 82 69 20 -120 -62 -43 -22 133 -88 -64 -107 -94 227
7891 227 -152 -298 -45 -351 98 -72 -49 161 226 295 -97 258 70 40 -142 -170 -49 -28 -109 22 158 -233
7913 -233 -112 -74 -26 -142 -4 124 132 -91 118 -31 68 -68 175 -8 -267 190 -153 131 161 -136 50 -25
$$ packed form
7748a97L01Q9l05J75j98N0n9L56j34o0K12l42n6J80j76K88j19r2J21j19J16j90
7770a59L05j87J23R9l12K19j78K7k02J13P9M1J25p9J00j19l2K01N8m63J64J52
7792G5j34J19q1p0j1M0j17J07k9J71j02Q3j17j84K89ML3L3n6n7Q4k38K29J48j25
7817I4k22o7LM06j48n5j97J88n9J6M3j17J96j25M6J15j9K7j18K00k92m6K8JJ40
7842C8Q9k40N3Q7P8o0J8j90M4L3R7M1J38q6q1j11J27j52R0j89J11J9j38J85L5
7867C6J73k39j01jK50k09J76J11k93L69m33K43j3m9j40N8J9K1J55k21K4m3J3L21
7891B27l79j46K53l06M49j70K3K10O5O9l92L55j88l0j82k8J21K1q1J31J36l91
7913b33J21L8M8j16J38J28Qk23K09j49R9j36K43j83k59M57l43K84L0k97J86p5
$$ plain form
7935 -25 -75 37 143 171 4 159 25 138 -76 -71 -40 -38 -146 25 -11 -49 -34 -52 9 -149 184 -190 -99 102 21
7960 21 34 284 339 -220 -24 -70 185 67 -26 177 179 -97 137 -166 107 -139 183 -32 -52 -10 140 -182 -112
7983 -112 -28 192 169 76 -49 -44 1 -73 11 -126 45 179 -65 42 115 77 -7 -312 206 208 -300 -162 -30 245
8007 245 -152 -296 39 6 59 74 121 -64 70 47 12 -171 -77 31 -118 100 52 22 119 -57 121 -10 -42 -229
8031 -229 -136 154 -68 56 185 -155 -23 8 55 -72 155 -108 -428 -41 -19 -64 17 -57 -57 52 0 -157 -107 130
8055 130 -111 49 77 -58 84 3 -43 143 166 -175 2 50 -33 226 228 102 216 -26 -158 5 -84 152 -4
8078 -4 -129 -39 -68 82 -25 68 -57 -52 -82 -40 -190 25 -53 -91 -10 -30 -34 -255 120 64 3 -195 82 -16 -281 -38
8104 -38 -41 -48 169 105 265 129 -48 202 -119 -113 -12 -90 -183 -112 52 67 -19 246 -68 165 -199 113 276 -32
$$ packed form
7935b5n0J12J06K8j67J55j34J13k14NL1Kj08J71l6l8J5j8O1j58L33l74R1K01q1
7960B1J3K50N5n59J96m6K55j18r3K03Kk76K34l03K73k46L22k15k0M2J50l22P0
7983a12Q4K20k3r3j25NM5p4Q4j37J71J34k44J07P3l8q4l05N18Kn08J38J32K75
8007B45l97j44L35l3N3J5M7j85J34k3l5j83R4J08j49K18m8l0R7j76J78j31l2j87
8031b29R3K90k22J24J29l40J32L1M7j27K27k63l20L87K2m5Q1p4%J09n2j57N0K37
8055A30k41J60K8j35J42q1m6J86K3l41J77M8q3K59Kj26J14k42j32J63q9K36j56
8078dj25R0k9J50j07R3j25Nl0M2j50K15p8l8Q1k0mk21L75n6o1j98K77r8k65K43
8104c8lpK17o4J60j36j77K50l21OJ01p8r3P1J64J5q6K65l14K33l64L12J63l08
$$ plain form
8128 -32 -38 -79 -156 163 -98 119 -186 51 -1 4 101 -84 248 16 -204 39 32 -146 -197 40 -140 15 118 19
8152 19 -171 194 34 -148 538 425 234 56 -77 -242 115 -146 -57 -262 -86 39 -107 -50 292 -9 -4 317
8174 317 -152 71 -50 -55 22 179 210 27 88 -19 84 -182 130 -119 -102 -8 -257
$$ packed form
8128c2om1p7L19k61K17l05K37n2NR7j85L32k32k20K43pj78n1K37j80J55J03r9
8152A9j90L65j60j82O86j13j91j78j33j65L57k61Q9k05J76J25j46N7L42l01NL21
8174C17m69K23j21nP7J57L1j83O1j07J03k66L12k49J7R4k49
8191b57
$$ Imaginary data points
##PAGE= N=2
##DATA TABLE= (X++(I..I)), XYDATA
$$ plain form
0 0 0 0 0 0 0 0 0 0 0 0 0 0 0 0 -8 8 -8 8 -8 16 -16 16 -24 24 -32 32 -40 48 -52 60 -68 80 -88 100 -114 129
36 129 -144 162 -180 201 -221 248 -275 304 -334 372 -407 453 -497 548 -602 665 -731 809 -893
55 -893 988 -1095 1221 -1367 1538 -1744 1995 -2313 2725 -3290 4107 -5397 7758 -13505 60029
70 60029 56053 -2615 66359 16802 26250 17825 31 24415 15942 -8584 13416 14116 19601 -15994
84 -15994 8789 34907 -29321 10398 10620 -14670 23062 -17888 2449 35202 -13309 2088 30639
97 30639 1049 6081 -6118 7798 -674 -30828 -3658 -26116 -14491 -22211 -46438 5175 -21906
110 -21906 -45640 2558 -17010 -27398 -6105 -29932 -370 -12777 -30515 3764 -8007 -1632
122 -1632 -11638 4701 21461 -13482 6495 18399 -7548 6401 -5214 -12088 16168 -27654
$$ packed form
0@%%%%%%%%%%%%%%qJ6j6J6j6K4l2L2m0M8n6O4p2Q8j00J12j28J48j68J88k14K43
36A29k73L06l42L81m22M69n23N79o38P06p79Q60r50J045j150J267j396J540j702
55h93J881k083K316k588K905l282L739m308N038o015P397r504J3155k1263P3534
70F0029l976n8668O8974m9557R448q425j7794K4384q473k4526K2000P00N485l5595
84a5994K4783K6118o4228L9719K22k5290L7732m0950K0337L2753m8511J5397K8551
97C0639k9590N032j2199J3916q472l0154K7170k2458J1625p720k4227N1613k7081
110b1906k3734M8198j9568j0388K1293k3827K9562j2407j7738L4279j1771O375
122a632j0006J6339J6760l4943J9977J1904k5947J3949j1615o874K8256m3822
$$ plain form
134 -27654 -12308 10832 -20170 -3660 -8103 2417 2312 -12600 5600 4770 -3633 2430 -4879 10693
148 10693 9511 -14571 24343 10581 -88 20310 3176 18370 7106 -4932 11506 930
160 930 -10093 -4977 -7757 -3378 -14452 -15777 5861 -17511 -6216 -4470 -11423 4378 -17048 -6916
174 -6916 3707 -12274 -7667 357 -4648 2168 -5468 1376 9768 -8029 5455 -2631 -635 -1540
188 -1540 -15605 -232 -8564 -15361 -7244 -8203 -9091 -4325 -11223 1071 -868 -9176 4973 -3626 3524
203 3524 -893 -1066 9469 589 5151 8887 8182 9382 9807 6786 14835 4327 4790 9903 -897
218 -897 6156 -2366 1866 2640 -2929 2348 2171 2276 2610 3471 3044 7231 22 6225 5103 1358 7968
235 7968 1210 8275 4485 4835 6731 4683 4590 3207 2484 -97 733 -5637 -933 -6285 -6050 -4511 -8767
$$ packed form
134b7654J5346K3140l1002J6510m443J0520j05j4912J8200q30q403O063p309J5572
148A0693j182k4082L8914j3762j0669K0398j7134J5194j1264j2038J6438j0576
160I30j1023N116k780M379j1074j325K1638k3372J1295J746o953J5801k1426J0132
174f916J0623j5981M607Q024n005O816p636O844Q392j7797J3484q086J996r05
188a540j4065J5373q332o797Q117r59q88M766o898J2294j939q308J4149q599P150
203C524m417j73J0535q880M562L736p05J200M25l021Q049j0508M63N113j0800
218h97P053q522M232P74n569N277j77J05L34Q61m27M187p209O203j122l745O610
235G968o758P065l790L50J896k048r3j383p23k581Q30o370M704n352K35J539m256
$$ plain form
252 -8767 -3639 -8372 -4237 -5767 -4739 -4563 -4316 -3888 -4526 -1949 -4796 -84 -4390 -188 -1480 -1997
268 -1997 416 -2669 576 -3556 -1146 -3706 -3360 -5088 -5020 -4310 -7177 -3678 -6842 -2540 -5507 -2652
284 -2652 -2381 -2417 -260 -2331 2206 -462 2323 891 3836 3139 2676 5062 2619 5763 1803 5304
300 5304 2261 3320 2296 1208 2904 -818 1990 -965 1847 -862 779 805 338 2370 131 4197
316 4197 709 4080 2472 4037 4219 2633 5429 2673 5028 2012 4576 2218 2916 2095 1066 2439
332 2439 -1387 2499 -2022 152 -1267 -1603 -439 -3002 -414 -2149 -161 -2042 1146 -1022 1168
347 1168 577 196 3710 -1535 3711 -27 1589 833 -351 1950 -438 -546 -612 1245 -2520 714 -3032
364 -3032 53 -861 -4914 1586 -3912 -990 -2700 -1710 573 -2050 -1249 1780 978 -403 2890 -227
$$ packed form
252h767N128m733M135j530J028J76K47M28o38K577k847M712m306M202j292n17
268a997K413l085L245m132K410k560L46j728O8P10k867L499l164M302k967K855
284b652K71l6K157k071M537k668K785j432K945o97m63K386k443L144l960L501
300E304l043J059j024j088J696l722K808k955K812k709J641K6m67K032k239M066
316D197l488L371j608J565J82j586K796k756K355l016K564k358O98q21j029J373
332B439l826L886m521K174j419l36J164k563K588j735J988j881L188k168K190
347A168n91l81L514n245N246l738J616p56j184K301k388j08o6J857l765L234l746
364c032L085r14m053O500n498K922j710R90K283k623Q01L029q02j381L293l117
$$ plain form
380 -227 4757 -1478 429 4453 -2827 2137 -1441 1038 1360 -2937 540 2270 -1920 -895 400 -1738
396 -1738 1504 -6148 1998 -291 -4337 1933 -3150 2956 -551 -2704 4296 1434 -3049 2837 -216
411 -216 86 580 -5125 4602 -3541 -2879 376 -3410 2196 -6248 -1923 2273 -6457 -4304 -317 -6198
427 -6198 -1336 -6424 -5800 3149 -9998 -2062 -1286 -3659 -1189 -7168 1366 -1809 -6961 -831 -2713
442 -2713 -4112 -869 -8885 2001 -406 -11671 4583 -4208 -3713 -1241 -6891 1658 -4901 -7103 -770
457 -770 -3039 -3379 -3417 -4071 6021 -6213 -2068 7887 -6051 5282 -827 -614 8702 -4562 472
472 472 7511 -252 1726 3527 3367 6799 -3098 6729 4334 -1583 5905 -5033 6756 2533 -7936
487 -7936 8311 2598 -3204 7314 1353 4970 7050 -2614 10503 4160 1474 5506 1712 9849
$$ packed form
380b27M984o235J907M024p280M964l578K479L22m297L477J730m190J025J295k138
396a738L242p652Q146k289m046O270n083O106l507k153P000k862m483N886l053
411b16L02M94n705R727q143O62L255l786N606q444M325M196q730K153L987n881
427f198M862n088O24Q949j3147P936P76k373K470n979Q534l175n152O130j882
442b713j399L243q016J0886k407j1265J6254q791M95K472n650Q549o559k202O333
457g70k269l40l8o54J0092j2234M145R955j3938J1333o109K13R316j3264N034
472D72P039p763J978J801j60L432r897R827k395n917P488j0938J1789m223j0469
487g936J6247n713n802J0518n961L617K080r664J3117o343k686M032l794Q137
$$ plain form
501 9849 -2853 2425 10695 -2594 4247 5014 -1755 8218 -2447 -3878 9814 -7916 -1514 1100
515 1100 -4147 1441 -6770 2127 1101 -3953 2573 -1220 1635 3647 -7013 5450 3468 -9582
529 -9582 6722 -2795 -1652 2396 -7323 3808 -1531 -5349 22 -3157 -2349 -5476 -7054 1710 -9075
544 -9075 -6907 1470 -9928 2253 -4614 -5220 6690 -6812 -1272 3791 -3248 267 -1153 -1949 3401
559 3401 -5315 188 905 -3910 3119 -6928 2131 -7 -9275 2437 -3721 -5798 -428 -6505 -1969
574 -1969 -141 -7533 2894 -1288 -1866 2873 -2926 5653 -1720 -623 5675 -2336 2304 1345 -1841
589 -1841 4098 -1551 -3023 5420 -4465 399 165 -4052 2526 -6081 -927 -208 -4598 274 -2272 -457
605 -457 2387 -2128 2549 3704 -1838 5908 130 2132 4820 -2262 5123 517 189 2961 -816 1664
$$ packed form
501I849j2702N278Q270j3289O841P67o769R973j0665j431J3692j7730O402K614
515A100n247N588q211Q897j026n054O526l793K855K012j0660J2463j982j3050
529i582J6304r517J143M048r719J1131n339l818N371l179Q08l127j578Q764j0785
544i075K168Q377j1398J2181o867o06J1910j3502N540N063p039L515j420p96N350
559C401q716N503P17m815P029j0047R059k138r268J1712o158k077N370o077M536
574a969J828p392J0427m182n78M739n799Q579p373J097O298q011M640r59l186
589a841N939n649j472Q443r885M864k34m217O578q607N154P19m390M872k546J815
605d57K844m515M677J155n542P746n778K002K688p082P385m606l28K772l777K480
$$ plain form
621 1664 1389 -1887 2144 -944 -2288 2272 -4452 1252 -1012 -2819 2787 -2881 1857 1479 261 3754
637 3754 2338 1963 5035 1328 3285 4364 -504 5471 141 2222 2976 -581 3542 -221 783 1584
653 1584 -674 3 885 -1388 1386 -753 -717 3525 -1890 2954 1275 1674 3913 607 3890 3142 1984
670 1984 2675 3090 1685 2923 126 2139 2363 -1559 1987 -1211 781 -770 -2052 1054 -1683 -1684 -751
687 -751 -297 -1384 -344 -1739 1168 -289 -1200 1712 -716 1652 -871 1175 1605 -488 17 461 542
704 542 -1315 -563 -1495 368 -3059 -2011 -721 -2509 -1367 -3272 -94 -1780 -2088 -1229 -460 -558 -1796
721 -1796 11 -404 814 -1416 1532 1220 350 946 981 2667 26 1054 1078 1401 -696 -487 985 -126
739 -126 84 -1110 1628 -447 109 353 892 1617 -752 1620 1045 1844 332 1776 2125 1263 1528 1493
$$ packed form
621A664k75l276M031l088j344M560o724N704k264j807N606n668M738l78j218L493
637C754j416l75L072l707J957J079m868N975n330K081P54l557M123l763J004Q01
653A584k258O77Q82k273K774k139L6M242n415M844j679L99K239l306L283p48j158
670A984O91M15j405J238k797K013K24l922L546l198J992j551j282L106k737jR33
687g51M54j087J040j395K907j457r11K912k428K368k523K046M30k093N05M44Q1
704E42j857P52r32J863l427J048J290j788J142j905L178j686l08Q59P69r8j238
721a796J807m15J218k230K948l12q70N96L5J686k641J028K4L23k097K09J472j111
739a26K10j194K738k075N56K44N39P25k369K372n75P99j512J444L49q62K65l5
$$ plain form
757 1493 3510 740 2230 1573 2277 587 89 1464 -308 293 -1436 689 -1018 -604 -666 -90 45
774 45 -1770 381 -1210 292 -1333 -513 332 -1138 -72 -727 754 -564 206 -3 704 -318 -623
791 -623 407 -1655 -370 -2520 -462 -1572 -1800 -965 -1755 -569 -1820 -417 -1126 -170 -1398 157 -458
808 -458 -875 538 -912 1366 -689 1166 831 489 1249 675 1355 668 893 40 1435 -666 508 352
826 352 -466 1142 -1465 1666 -127 -209 1037 -28 444 199 590 335 713 -1212 1582 -281 361 1030
844 1030 -619 2242 -1091 741 873 -503 -224 -448 -380 -477 -1342 -1203 904 -2555 134 -1362 -1145 223
862 223 -3627 801 -1217 -1709 -633 -1311 -811 -458 -1962 207 525 -2125 1614 -1219 1021 -392 -1419
879 -1419 2706 -1257 252 799 -106 929 -225 -636 2367 -1087 -616 2302 -1593 1627 -1101 605
$$ packed form
757A493K017k770J490o57P04j690m98J375j772O01j729K125j707M14o2N76J35
774D5j815K151j591J502j625Q20Q45j470J066o55J481j318P70k09P07j022l05
791f23J030k062J285k150K058j110k28Q35p90J186j251J403p09R56j228J555o15
808d58m17J413j450K278k055J855l35l42P60n74O80o87K25q53J395k101J174j56
826C52q18J608k607L131j793q2J246j065M72k45L91k55L78j925K794j863O42O69
844A030j649K861l333J832J32j376K79k24O8r7q65J39K107l459K689j496K17J368
862B23l850M428k018m92J076o78N00L53j504K169L18k650L739k833K240j413j027
879a419M125l963J509N47r05J035j154m11L003l454M71K918l895L220k728J706
$$ plain form
895 605 2267 -1681 1613 656 952 1682 137 2408 2997 -1006 3367 2719 120 4018 -309 4104 2177
912 2177 -394 3225 723 1206 554 189 2205 -69 -1594 2376 -1584 -80 881 -2097 3707 -2424
928 -2424 -318 3059 -1421 1215 429 463 2046 -396 560 3292 -928 1861 -99 70 2426 -4129
944 -4129 1999 -487 -2938 413 -2633 -655 -448 -3494 30 521 -3188 755 -1724 634 -373 -2646
960 -2646 3243 -1938 699 1302 -865 2845 64 -748 3937 -665 -957 2269 -2455 1387 -2273 -2026
976 -2026 1026 -3895 -202 -1802 -1486 440 -2917 94 1085 -2782 793 121 -1648 2559 -2592 2042
992 2042 1795 -1592 3094 -97 1283 1004 -1139 1259 -605 -2384 570 -2995 -1910 -1097 -4976 1103
1008 1103 -3113 -2326 884 -3360 906 -1116 -1077 975 -1271 -554 1511 -1284 1712 300 -349 3567
$$ packed form
895F05J662l948L294r57K96P30j545K271N89m003M373o48k599L898m327M413j927
912B177k571L619k502M83o52l65K016k274j525L970l960J504R61k978N804o131
928b424K106L377m480K636p86L4J583k442R56K732m220K789j960J69K356o555
944d129O128k486k451L351l046J978K07l046L524M91l709L943k479K358j007k273
960b646N889n181K637O03k167L710k781q12M685m602k92L226m724L842l660K47
976b026L052m921L693j600L16J926l357L011R91l867L575o72j769M207n151M634
992B042k47l387M686l191J380k79k143K398j864j779K954l565J085Q13l879O079
1008A103m216P87L210m244M266k022L9K052k246P17K065k795K996j412o49L916
$$ plain form
1024 3567 -1572 2385 889 -720 1797 -2093 -67 -542 -2993 -446 -1542 -2880 467 -2646 -524
1039 -524 1057 -2653 2527 -828 750 1754 -999 2071 571 712 2312 522 1436 2696 -384 3123
1055 3123 531 -573 1748 -2471 923 -1404 -2529 -290 -2534 -1315 -637 -1454 201 -488 -1240 2070
1071 2070 -1057 815 839 -997 2658 -1499 1134 1534 -446 1231 619 434 1325 -454 -765 778 -2849
1088 -2849 -628 -2538 -1994 -1253 -4096 4 -1858 -1412 -305 -725 558 562 -740 1164 1024 -1050 1615
1105 1615 -458 1404 568 -374 2617 115 720 469 679 -120 -897 -1473 -395 -2199 -2707 -647 -2326
1122 -2326 31 -1955 -463 1034 -902 990 549 1444 400 349 801 1231 -278 397 1090 110 1597
1139 1597 -783 1628 196 -1109 -45 -1233 -1308 -2391 -2203 -2042 -2067 -3061 -1157 -879 -862 -273 -622 1438
$$ packed form
1024C567n139L957j496j609K517l890K026m75k451K547j096j338L347l113K122
1039e24J581l710N180l355J578J004k753L070j500J41J600j790R14J260l080L507
1055C123k592j104K321m219L394k327j125K239k244J219O78q17J655o89p52L310
1071B070l127J872K4j836L655m157K633M00j980J677o12j85Q91j779l11J543l627
1088b849K221j910N44P41k843M100j862M46J107m20J283Mj302J904j40k074K665
1105A615k073J862q36r42K991k502O05k51K10p99p77n76J078j804n08K060j679
1122b326K357j986J492J497j936J892m41Q95j044n1M52M30j509O75O93r80J487
1139A597k380K411j432j305J064j188p5j083J88J61k5r94J904K78J7N89l49K060
$$ plain form
1157 1438 -576 325 603 256 160 -387 614 141 95 -457 1189 -269 160 -119 -336 -8 -1991 -736
1175 -736 -1678 -1828 -2486 -1926 -763 -1409 -517 -43 1338 89 1274 1213 1438 1328 301 1768 704 1159
1193 1159 253 1611 1286 827 957 1045 930 -402 635 -647 -507 -1544 -1501 -730 -1703 -445 -831 421
1211 421 -170 667 937 1103 1267 675 1739 185 961 66 876 399 -59 782 -81 643 -798 -54 -879
1230 -879 -1003 -1540 -1923 -1868 -2472 -1677 -2538 -1112 -1621 -693 -231 -310 651 -191 1006 -42 351 -143 372 39
1250 39 -352 40 -530 560 -808 318 -610 -800 -578 -1288 -870 -1951 -1501 -1691 -1467 -1954 -321 -722 83
1269 83 796 488 2085 432 1343 1317 904 1243 354 1313 449 592 329 1175 158 468 243 217 221 -1645
1289 -1645 97 -1241 -1090 -1179 -989 -56 -932 -308 614 974 100 1540 575 1341 543 -180 1606 -779
$$ packed form
1157A438k014R01K78l47r6n47J001m73m6n52J646j458M29k79k17L28j983J255
1175g36r42j50o58N60J163o46Q92M74J381j249J185o1K25j10j027J467j064M55
1193A159r06J358l25m59J30Q8j15j332J037j282J40j037M3P71r73J258l86J252
1211D21n91Q37K70J66J64n92J064j554P76q95Q10m77m58Q41q63P24j441P44q25
1230h79j24n37l83N5o04P95q61J426n09R28M62p9R61q42J197j048L93m94N15l33
1250C9l91L92n70J090j368J126r28j90K22p10M18j081M50j90K24m87J633m01Q05
1269H3P13l08J597j653R11k6m13L39q89R59q64J43k63Q46j017L10k25k6Mj866
1289a645J742j338J51q9J90R33q76O24R22L60q74J440r65P66p98p23J786k385
$$ plain form
1307 -779 329 -270 234 230 -731 -30 -45 -733 -1306 -439 -1511 -861 -2244 -1024 -679 -2403 3 -1252 210
1326 210 76 -118 948 964 142 744 1265 432 876 -453 1760 -4 -118 1243 -189 1172 -324 -224
1344 -224 1013 -743 -994 546 -548 -652 -8 -917 1488 -729 866 1748 795 1994 465 2547 1765
1361 1765 509 1692 1688 485 1595 499 682 1691 -812 1513 341 -249 87 -969 738 -1048
1377 -1048 -948 291 -698 -815 153 -844 998 -385 -1148 2220 -1011 535 710 -245 1458 -697 194
1394 194 785 -466 -430 -119 -554 696 -1876 -218 420 -2576 644 -1705 -921 -154 -2229 199 -120
1411 -120 -1187 84 -47 -319 575 -918 1750 416 -311 1797 -482 1985 34 -203 2057 -400
1427 -400 36 913 -633 241 352 -1170 1523 -860 -189 312 -1027 974 -1413 534 573 -1164 822
$$ packed form
1307g79J108n99N04mr61P01j5o88n73Q67j072O50j383J220L45j724K406j255J462
1326B10j34j94J066J6q22O02N21q33M44j329K213j764j14J361j432J361j496J00
1344b24J237j756k51J540j094j04O44r09K405k217J595Q82r53J199j529K082p82
1361A765j256J183mj203J110j096J83J009k503K325j172n90L36j056J707j786
1377a048J00J239r89j17R68r97J842j383p63L368l231J546J75r55J703k155Q91
1394A94N91j251L6L11m35J250k572J658O38k996L220k349P84P67k075K428l19
1411a20j067J271j31k72Q94j493K668j334p27K108k279K467j951k37K260k457
1427d00M36Q77j546Q74J11j522K693k383O71N01j339K001k387J947L9j737J986
$$ plain form
1444 822 326 -398 1025 -308 642 2046 -877 1888 350 -326 1305 -1107 760 -401 -843 -45 -1052
1461 -1052 -676 -285 -1837 -57 -726 -1969 631 -1906 -534 -276 -1647 590 -1370 -360 319 -490
1477 -490 575 425 -233 1464 -230 195 1054 -1316 939 -786 -269 594 -1460 397 -371 -652 399
1494 399 -519 -95 773 -888 570 -4 -482 1703 -760 1186 785 477 1965 806 1671 1759 730 1735
1512 1735 1115 136 1476 -196 560 840 -1017 1198 -475 77 524 -513 600 -182 -354 309 -214
1529 -214 -237 645 -514 1125 53 315 1934 -87 1718 787 492 1278 -405 271 -19 -756 -386 -272
1547 -272 -1030 30 -1260 47 287 -1318 382 -967 -52 -258 -895 1 123 -469 467 829 641 1734
1565 1734 222 1948 808 806 1383 -286 1058 -354 -146 5 -485 -396 -177 -391 48 5 -749 873 -1031
$$ packed form
1444H22m96p24J423j333R50J404k923K765j538o76J631k412J867j161m42P98j007
1461a052L76L91j552J780o69j243K600k537J372K58j371K237j960J010O79q09
1477d90J065j50o58J697j694M25Q59k370K255j725N17Q63k054J857p68k81J051
1494C99r18M24Q68j661J458n74m78K185k463J946m01l08J488j159Q65Q8j029J005
1512A735o20r79J340j672P56K80j857K215j673N52M47j037J113p82j72O63n23
1529b14k3Q82j159J639j072K62J619k021J805r31k95P86j683O76k90p37L70J14
1547b72p58J060j290J307K40j605J700j349R15k06o37Q96J22n92R36L62j88J093
1565A734j512J726j140kN77j669J344j412K08J51m90Q9K19k14M39m3p54J622j904
$$ plain form
1584 -1031 -96 -33 -584 263 -882 387 448 435 739 683 615 830 655 576 781 -1068 202 -626 -810 -647
1604 -647 -1405 -419 -1210 -808 -1004 -518 -1226 -838 -1412 -853 -889 -1513 2 -891 138 -142 53 490 223 803
1624 803 580 566 56 612 -490 -162 -610 -465 -230 -1157 100 -809 198 104 -425 453 179 220 -92 525
1644 525 -64 503 522 801 905 655 1742 1008 1924 1153 1058 1030 788 770 353 277 -221 -35 -540 336 -266
1665 -266 -405 -12 -345 286 -500 112 -619 -81 -293 -314 -141 11 582 -395 585 -324 474 99 -233 107
1685 107 -779 -364 -1474 -823 -1397 -1421 -1511 -1264 -1307 -1478 -669 -1367 -351 -1637 -744 -843 -826 -601 -885 -51 -258
1706 -258 141 -15 611 152 272 401 -122 328 -599 274 -452 -485 -462 -772 136 -948 -195 -41 -92 -529 105
1727 105 220 117 -40 -227 1062 -85 540 485 975 1003 310 1291 792 479 -30 558 25 -262 -662 -637
$$ packed form
1584a031R35O3n51Q47j145J269O1j3L04n6o8K15j75p9K05j849J270q28j84J63
1604f47p58R86p91M02j96M86p08L88n74N59l6o24J515q93J029k80J95M37k67N80
1624H03k23j4n10N56j102L28m48J45K35r27J257r09J007r4n29Q78k74M1l12O17
1644E25n89N67J9K79J04k50J087p34R16p71r5k8k42j8m17p6m98J86n05Q76o02
1665b66j39L93l33O31p86O12p31N38k12k1J73J52N71r77R80r09P98l75l32L40
1685A07q86M15j110O51n74k4r0K47m3j71Q09o98J016j286Q93r9J7K25k84Q34k07
1706b58L99j56O26m59J20J29n23M50r27Q73p26l3K3l10R08j084P53J54n1m37O34
1727A05J15j03j57j87J289j147O25n5M90K8o93R81m99l13n09N88n33k87m00K5
$$ plain form
1747 -637 -7 -1245 -321 -943 -282 -692 -719 226 -514 -438 -407 41 -381 -159 -340 546 -33 -140 840 -32 623
1768 623 -460 251 418 -418 -328 -419 -432 -913 -851 -450 253 -1186 -297 87 -562 681 -572 783 633 -73
1788 -73 796 647 690 837 880 1032 1028 173 1694 693 840 1236 22 1294 -97 -19 897 262 49 103 65
1809 65 632 97 -101 1116 -44 793 373 536 1542 -221 1278 815 565 780 636 716 975 -469 -55
1828 -55 786 -721 82 -653 89 -621 -1041 458 -771 -442 -258 -398 330 -464 -789 447 -216 -828 855
1847 855 -732 664 -357 -248 953 -377 208 -104 89 75 -758 -138 309 -886 62 -18 -573 741
1865 741 -904 388 320 -595 307 -26 559 493 57 389 381 15 954 -100 447 823 -499 931 -310
1884 -310 -337 726 -633 159 -47 -616 272 -247 -613 353 -548 51 -305 -666 537 -1218 303 -158 -886
$$ packed form
1747f37O30j238R24o22O61m10k7R45p40P6L1M48m22K22j81Q86n79j07R80q72O55
1768F23j083P11J67q36R0r1j3m81O2M01P03j439Q89L84o49J243j253J355j50p06
1788g3Q69j49M3J47M3J52mq55J521j001J47L96j214J272j391P8R16o35k13N4l8
1809F5N67n35j98J217j160Q37m20J63J006j763J499m63k50K15j44Q0K59j444M14
1828e5Q41j507Q03p35P42p10m20J499j229L29J84j40P28p94l25J236o63o12J683
1847H55j587J396j021J09J201j330N85l12J93j4q33O20M47j195R48q0n55J314
1865G41j645J292o8r15R02l33N85o6m36L32ql66R39j054N47L76j322J430j241
1884c10k7J063j359P92k06n69Q88n19l66R66r01N99l56l61J203j755J521m61p28
$$ plain form
1903 -886 330 -548 -266 -126 -785 -38 112 -1014 91 -1052 -430 -219 -1266 335 -1232 -599 -419 -1119
1921 -1119 -254 -462 -1112 -70 -790 -948 332 -1275 202 -248 -722 531 -1018 259 -389 -632 560
1938 560 -264 -225 -206 -505 -38 339 -574 691 -558 156 534 -599 696 -638 -10 212 -159 -28 35
1957 35 -750 394 -16 -431 699 -622 774 -371 -153 367 -717 372 -21 112 308 31 39 622 -408
1976 -408 348 203 -645 590 -585 195 -147 -395 292 -569 22 -251 -15 -93 241 -472 132 -138 49 232
1996 232 -707 753 -329 5 95 33 50 41 320 -89 157 4 568 -459 89 -393 -207 480 -749 136
2016 136 -194 -469 60 -458 -84 -300 -354 -211 329 -844 258 -226 -14 108 -777 610 -445 -88 29
2035 29 -365 -23 -278 -442 -376 -258 -842 102 -957 -405 -709 -629 -1 -911 -147 -460 -170 -310 -246 -16 214
$$ packed form
1903h86J216q78K82J40o59P47J50j126J105j143O22K11j047J601j567O33J80p00
1921a119Q65k08o50J042p20j58J280j607J477m50m74J253j549J277o48k43J192
1938E60q24L9J9k99M67L77r13J265j249P14L78j133J295j334O28K22l71J31O3
1957C5p85J144m10m15J130j321J396j145K18N20j084J089l93J33J96k77QN83j030
1976d08P56j45q48J235j175P80l42k48O87q61N91k73K36p8L34p13O04k70J87J83
1996B32r39J460j082L34R0o2J7rK79m09K46j53N64j027N48m82J86O87j229Q85
2016A36l30k75N29n18L74k16n4J43N40j173J102m84K12J22q85J387j055L57J17
2035B9l94L42k55j64O6J18n84R44j059N52l04Q0O28r10P64l13K90j40O4K30K30
$$ plain form
2056 214 73 -117 336 -146 582 -426 -187 138 -165 481 -387 244 -416 105 -314 241 -347 -99 190 -296
2076 -296 543 -114 705 116 468 695 371 711 558 690 527 904 464 922 300 512 808 248 794 278
2096 278 592 115 -70 383 174 42 27 93 131 98 -92 377 201 79 730 241 918 193 801 299 430
2117 430 472 262 359 -170 235 -96 413 -466 -108 72 -320 -29 -672 -334 -630 -568 -525 -504 -501 -330 -8 -53 249
2140 249 -427 530 81 387 606 -86 826 -289 212 149 42 -101 -232 -65 -244 -278 -276 239 -410 -15 -343
2161 -343 -161 7 -622 289 -50 171 126 559 830 432 388 370 1004 89 738 187 677 -4 -275 414 -406
2182 -406 124 -122 -298 -227 -13 -216 -278 -297 -846 -76 -677 -48 -318 40 502 10 489 179 485 189 499
2203 499 249 1 -230 -75 -22 -490 -43 -898 -80 -527 -697 -288 -606 -256 -909 -494 -475 -315 -551 84 -173
$$ packed form
2056B14j41j90M53m82P28j008K39L25l03O46q68O31o60N21m19N55n88K48K89m86
2076b96Q39o57Q19n89L52K27l24L40j53J32j63L77m40M58o22K12K96n60N46n16
2096B78L14m77j85M53k09j32j5O6L8l3j90M69j76j22O51m89O77p25O08n02J31
2117D30M2k10R7n29M05l31N09q79L58J80l92K91o43L38k96O2M3K1LJ71L22m5L02
2140B49o76R57m49L06K19o92R12j115N01o3j07j43j31J67j79l4KN15o49L95l28
2161c43J82J68o29R11l39K21m5M33K71l98m4j8O34r15O49n51M90o81k71O89q20
2182d06N30k46j76P1K14k03o2j9n49P70o01O29k70L58M62m92M79l10L06k96L10
2203D99k50k48k31J55N3m68M47q55Q18m47j70M09l18L50o53M15J9J60k36O35k57
$$ plain form
2224 -173 -240 130 114 649 319 588 514 706 319 61 215 131 34 -330 82 -465 -113 -40 -321 307 -722 10
2246 10 -169 -112 -193 -351 177 87 348 207 847 139 934 415 728 604 29 932 -195 209 -24 -133 -179
2267 -179 -102 -423 -365 -398 -576 -57 -544 -27 -650 -418 -43 -939 112 -509 -187 156 -238 213 523 171 356
2288 356 243 -284 395 -436 56 -313 -833 -257 -820 -270 -677 -609 69 -313 -747 -4 -342 -483 -285 -492
2308 -492 690 -250 -10 466 -100 911 184 632 627 157 66 218 -86 293 -62 -114 456 -713 113 65 -10
2329 -10 349 -458 342 -173 -186 210 154 -269 587 -78 537 323 -137 1192 129 652 496 -16 346 76
2349 76 -73 -86 -271 -303 159 -573 -173 -462 -367 244 -941 273 -564 -159 -22 -484 -433 -3 -152 241 -4
2370 -4 37 540 -180 600 596 -303 430 -631 -136 1 -301 -116 -132 -322 -213 -317 -245 202 -385 407 -172 135
$$ packed form
2224a73o7L70j6N35l30K69p4J92l87k58J54q4r7l64M12n47L52P3k81O28j029P32
2246A0j79N7q1j58N28r0K61j41O40p08P95n19L13j24n75R03j127M04k33j09m6
2267a79P7l21N8l3j78N19m87N17o23K32L75q96J051o21L22L43l94M51L10l52J85
2288C56j13n27O79q31M92l69n20N76n63N50m07O8O78l82m34P43l38j41J98k07
2308d92J182r40K40M76n66J011p27M48nm70r1J52l04L79l55n2N70j169Q26m8p5
2329a0L59q07Q00n15j3L96n6m23Q56o65O15k14m60J329j063N23j56n12L62k70
2349G6j49j3j85l2M62p32M00k89R5O11j185J214q37M05J37m62N1M30j49L93k45
2370dM1N03p20P80mq99P33j061M95J37l02J85j6j90J09j04P2M47n87P92n79L07
$$ plain form
2392 135 521 -309 593 139 375 528 288 297 673 301 673 807 119 903 255 570 334 -44 417 -116 311
2413 311 255 192 627 197 -33 354 -147 53 433 -330 753 101 284 539 -4 611 157 262 344 121 38
2434 38 383 -419 -23 -59 -220 149 -747 -154 -179 -402 3 -515 -192 -467 -366 -417 -472 -589 -78 -287 -228 -37
2456 -37 -349 -22 -436 86 -123 -332 287 -202 -164 -243 -233 -513 -49 -698 -43 -362 -536 194 -938 7 -283
2477 -283 -341 -158 -294 -165 5 -92 231 62 -153 596 416 380 450 -70 537 26 108 147 -56 160 -328 -118
2499 -118 -280 28 -468 142 -471 154 -501 -273 160 -552 234 -89 -106 -23 -86 166 -7 88 -118 125 -99
2520 -99 290 -89 -34 -352 -470 106 -605 -92 -359 -103 -353 -469 -441 -213 -384 -327 210 -272 171 -286 65
2541 65 -81 -10 225 37 399 195 152 160 593 4 20 296 47 8 -577 229 -10 -301 -98 25 -81 -281
$$ packed form
2392A35L86q30R02m54K36J53k40RL76l72L72J34o88P84o48L15k36l78M61n33M27
2413C11n6o3M35m30k30L87n01K00L80p63J083o52J83K55n43O15m54J05Q2k23q3
2434C8L45q02L96l6j61L69q96N93k5k23M05n18L23k75J01n1n5j17N11k09N9J91
2456c7l12L27m14N22k09k09O19m89L8p9J0k80M64o49O55l19j74P30j132R45k90
2477b83n8J83j36J29J70r7L23j69k15P49j80l6P0n20O07n11Q2L9k03K16m88K10
2499a18j62L08m96O10o13O25o55K28M33p12P86l23j7Q3o3K52j73R5k06K43k24
2520i9L89l79N5l18j18N76p11N13k67K56k50j16K8K28j71N7N37m82M43m57L51
2541F5j46P1K35j88L62k04m3QM33n89J6K76k49l9n85Q06k39k91K03J23j06k00
$$ plain form
2563 -281 348 64 135 47 392 248 23 266 136 517 -92 380 551 -3 169 41 413 230 171 -157 90
2584 90 -151 -252 -242 -231 -309 -449 -249 -372 -319 -206 -68 58 -147 135 38 536 -161 259 -30 25 -59 -208 347
2607 347 -209 7 -152 18 50 -256 -467 -235 -142 -670 -37 -524 -308 -302 -34 41 -139 255 -68 556 234 172
2629 172 208 299 342 131 444 139 388 133 420 271 42 223 -499 247 -465 -120 21 -267 -553 -143 0
2650 0 -398 109 -203 312 32 220 123 -30 234 -192 25 66 -24 -94 152 49 -87 -14 -5 189 -508 -206 -535
2673 -535 -404 -521 -483 -367 -446 -259 -72 135 -86 161 200 60 299 -85 491 223 475 133 -170 506 -245
2694 -245 309 210 316 -173 252 -164 221 -348 -284 114 -556 -242 -202 156 140 -6 350 535 635 125 323
2715 323 333 472 141 489 440 17 613 -42 504 232 -90 397 -101 -95 -229 -308 -403 -587 -682 -63 -501 -94
$$ packed form
2563b81O29k84P1q8L45j44k25K43j30L81o09M72J71n54J72j28L72j83n9l28K47
2584I0k41j01J0J1p8j40K00j23N3J13J38J26k05K82r7M98o97M20k89N5q4j49N55
2607C47n56K16j59J70L2l06k11K32R3n28O33m87K16OK68P5j80L94l23O24l22o2
2629A72L6R1M3k11L13l05K49k55K87j49k29J81p22P46p12L45J41k88k86M10J43
2650@l98N07l12N15k80J88r7j53K64m26K17M1r0p0K46j03j36P3RJ94o97L02l29
2673e35J31j17L8J16p9J87J87K07k21K47L9j40K39l84N76k68K52l42l03O76p51
2694b45N54r9J06m89M25m16L85n69O4L98o70L14M0L58j6j46L56J85J00n10J98
2715C23J0J39l31L48m9m23N96o55N46k72l22M87m98Oj34p9r5j84r5O19m38M07
$$ plain form
2737 -94 65 -162 343 -33 423 225 136 387 -9 337 152 144 81 141 -133 293 -88 -60 155 -373 53 -400
2759 -400 -257 -267 -351 -211 -216 -163 -54 192 -167 323 405 639 324 182 745 83 254 233 609 431 179 -40
2781 -40 395 205 -100 243 -282 -141 -440 -420 -44 -521 27 -193 186 46 98 77 463 73 266 482 -66
2802 -66 270 -244 317 -2 -152 153 -148 159 -51 -289 -332 37 -626 -277 -415 -339 -311 -751 -82 -619 -152
2823 -152 17 187 566 199 272 95 281 -12 432 161 24 127 -110 411 -301 344 32 201 189 -59 69
2844 69 64 7 -85 52 -416 263 -76 129 474 -53 632 176 335 224 410 305 204 254 258 93 106 402 -207
2867 -207 120 208 -204 324 -232 121 -343 -342 -116 -178 -261 -218 -211 -84 191 -107 391 -88 -10 -18 -58 247 -147 111
2891 111 -42 -9 -302 87 -445 -7 -311 -234 -110 -398 40 -455 -528 -385 -430 -62 -472 -24 -246 -12 -179
$$ packed form
2737i4J59k27N05l76M56j98q9K51l96L46j85qo3O0k74M26l81K8K15n28M26m53
2759d00J43j0q4J40nN3J09K46l59M90Q2K34l15j42N63o62J71k1L76j78k52k19
2781d0M35j90l05L43n25J41k99K0L76m77N48k20L79j40N2k1L86l90J93K16n48
2802f6L36n14N61l19j50L05l01L07k10k38m3L69o63L49j38P6K8m40O69n37M67
2823a52J69J70L79l67P3j77J86k93M44k71j37J03k37N21p12O45l12J69j2k48J28
2844F9nn7r2J37m68O79l39K05L45n27O85m56J59j11J86j05j01N0Mj65J3K96o09
2867b07L27Q8m12N28n56L53m64JK26o2q3M3PJ27K75k98M98m79P8qm0L05l94K58
2891A11j53L3k93L89n32M38l04P7J24k88M38m95p3J43m5L68m10M48k22K34j67
$$ plain form
2912 -179 -64 -239 332 205 -36 361 -79 380 48 193 241 -135 -59 -48 150 21 32 125 -88 -102 -40 254
2934 254 -270 184 -30 236 30 37 -6 286 79 240 254 15 395 97 179 194 198 142 -143 201 -6 -64 141
2957 141 -91 -115 -304 -236 -327 31 -568 96 -236 -5 420 -161 126 -136 203 32 52 111 -8 89 -181 437
2979 437 -20 69 -4 154 131 -179 411 141 60 -418 -60 -6 -51 224 354 218 172 85 -126 244 141 134 168 69
3003 69 350 53 302 359 134 138 202 111 -30 231 52 65 -287 165 -123 96 -3 -62 389 -153 -15 5 158
3026 158 15 147 110 47 280 -47 114 -280 172 -189 -72 -16 -45 -75 -267 -6 -188 95 -108 81 -82 -225
3048 -225 -44 -368 -188 -233 224 -413 -487 19 -271 0 -210 -80 -253 21 -72 -11 175 -331 -42 -5 211 -242
3070 -242 -82 83 -208 -128 -65 166 -310 68 -102 111 -13 -121 -129 -249 -90 -80 64 -48 72 -139 227 402
$$ packed form
2912a79J15j75N71j27k41L97m40M59l32J45M8l76P6J1J98j29J1R3k13j4O2K94
2934B54n24M54k14K66k06Pm3K92k07J61J4k39L80k98Q2J5Mn6k85L44k07n8K05
2957A41k32k4j89O8r1L58n99O64l32K31M25n81K87k62L39j71K0N9j19R7k70O18
2979D37m57Q9p3J58k3l10N90k70q1m78L58N4m5K75J30j36m6q7k11L70j03pL4r9
3003F9K81k97K49N7k25MO4r1j41K61j79J3l52M52k88K19r9n9M51n42J38K0J53
3026A58j43J32l7o3K33l27J61l94M52l61J17N6k9l0j92K61j82K83k03J89j63j43
3048b25J81l24J80m5M57o37p4N06k90K71k10J30j73K74r3O1J86n06K89L7K16m53
3070b42J60J65k91Q0O3K31m76L78j70K13j24j08qj20J59J0J44j12J20k11L66J75
$$ plain form
3092 402 -53 222 -17 178 -160 208 48 92 194 -12 327 -61 67 81 -43 47 -12 21 -31 102 -175 77
3114 77 -31 198 -66 133 174 -279 149 -134 288 30 156 -76 43 149 208 138 78 36 -101 86 11 -63 153
3137 153 -165 12 -195 12 52 -115 -94 272 -31 62 358 58 224 41 41 339 144 65 246 184 203 212 163 538
3161 538 72 44 -76 -11 359 -150 88 -169 20 123 -74 -6 -168 -257 8 40 -61 476 178 -7 99 -69
3183 -69 289 -36 222 -88 -123 63 -115 -103 -30 10 -185 -160 -229 61 -35 -374 50 -310 -135 -116 -57 -169 45
3206 45 28 33 123 48 137 -334 299 25 -171 65 -316 -11 -182 100 -131 0 51 -202 -89 -148 87 -101 130
3229 130 -83 92 -17 53 -14 -167 148 150 366 -188 139 155 22 -148 135 143 -244 148 -261 -152 -86 -207 118
3252 118 -397 -158 -187 -98 31 150 -151 229 96 -60 297 -200 143 -300 7 118 188 356 48 -65 16
$$ packed form
3092D02m55K75k39J95l38L68j60M4J02k06L39l88J28J4j24R0n9L3n2J33k77K52
3114G7j08K29k64J99M1m53M28k83M22k58J26k32J19J06N9p0o0m2j37J87p5p4K16
3137A53l18J77k07K07M0j67K1L66l03R3K96l00J66j83%K98j95p9J81o2J9Rm9L75
3161E38m66k8j20O5L70n09K38k57J89J03j97O8j62q9K65L2j01N37k98j85J06j68
3183f9L58l25K58l10l5J86j78J2P3M0j95K5o9K90r6l39M24l60J75J9N9j12K14
3206D5j7NR0p5Q9m71O33k74j96K36l81L05j71K82k31J31N1k53J13n9K35j88K31
3229A30k13J75j09P0o7j53L15KK16n54L27J6j33j70K83Ql87L92m09J09O6j21L25
3252A18n15K39k9Q9J29J19l01L80j33j56L57m97L43m43L07J11P0J68l08j13Q1
$$ plain form
3273 16 -45 -62 -203 -386 -44 129 -303 188 -302 65 -81 -225 202 -103 139 44 77 -28 118 98 244 -20
3295 -20 89 232 -240 284 127 190 73 154 80 -102 -50 146 17 -32 199 -201 -117 162 -2 253 305 161 16
3318 16 57 12 152 -16 69 181 26 352 -176 327 46 -45 -108 -267 41 -287 -131 -209 -240 26 -45 -283 -320
3341 -320 -19 -130 35 -158 -81 95 -192 -38 31 -17 26 -28 -11 152 -145 22 57 -162 -150 -107 -166 2 191
3364 191 -136 -360 -29 -307 87 -258 -78 -122 259 253 135 96 -9 138 53 523 -116 82 372 -120 93 -3
3386 -3 289 157 110 -173 179 60 28 -27 -289 8 -470 75 -247 91 109 94 330 130 160 -113 168 -59 196
3409 196 -86 57 -54 -198 65 -137 -55 -116 96 -246 -197 151 -138 -318 -233 -77 -323 -73 -23 22 145 -41
3431 -41 193 21 190 -31 -79 241 227 35 -76 97 -39 84 -55 38 139 14 186 27 196 119 -75 184
$$ packed form
3273A6o1j7j41j83L42J73m32M91m90L67j46j44M27l05K42r5L3j05J46k0J46k64
3295b0J09J43m72N24j57O3j17Q1p4j82N2J96j29m9K31m00Q4K79j64K55N2j44j45
3318A6M1m5J40j68Q5J12j55L26n28N03k81r1o3j59L08l28J56p8l1K66p1k38l7
3341c20L01j11J65j93P7J76k87J54O9m8M3n4J7J63k97J67L5k19J2M3n9J68J89
3364A91l27k24L31k78L94l45J80m4L81oj18l9j05J47q5M70o39J98K90m92K13r6
3386cK92j32m7k83L52j19l2n5k62K97m78N45l22L38J8j5K36k00L0k73K81k27K55
3409A96k82J43j11j44K63k02Q2o1K12l42M9L48k89j80Q5J56k46K50N0M5J23j86
3431d1K34j72J69k21m8L20j4j92j11J73j36J23j39R3J01j25J72j59J69p7j94K59
$$ plain form
3453 184 39 9 -76 39 17 36 -80 314 315 192 237 39 76 146 171 490 153 -129 89 91 -34 -43 -298 -110 -262
3478 -262 59 136 -195 -166 -66 -299 -238 -330 -191 -183 -73 -183 -65 -106 -13 -354 -123 -273 -161 -130 -309 -276 -171
3501 -171 -149 -324 54 -252 -138 -274 -117 -101 -363 103 -370 -186 -36 -44 -253 -329 217 -71 91 -21 107 -26
3523 -26 73 58 -116 112 -79 275 -199 -84 23 -32 -3 64 188 -57 181 -48 -100 26 84 44 -69 127 33
3546 33 240 89 114 130 70 150 -128 154 -129 78 103 -108 -92 64 149 24 210 -122 152 -42 -68 -17 -129
3569 -129 154 59 -153 -166 106 -313 133 -75 -94 -97 -94 -212 -42 149 300 -149 -100 -21 9 -50 131 -52 147 -64
3593 -64 -15 -61 -23 374 -109 -65 23 224 69 103 75 17 107 42 196 0 122 136 196 187 51 295 -123 -297 1
3618 1 197 47 74 -252 46 -49 -198 34 -287 201 -192 168 -172 -147 107 -370 -26 -76 30 -325 19 -183
$$ packed form
3453A84j45l0q5J15k2J9j16L94Jj23M5j98L7P0K5L19l37k82K18Kj25rk55J88j52
3478b62L21P7l31K9J00k33O1r2J39QJ10j10J18m1R3l41K31j50J12L1j79L3J05
3501a71K2j75L78l06J14j36J57J6k62M66m73J84J50qk09p6N46k88J62j12J28j33
3523b6R9j5j74K28j91L54m74J15J07n5K9O7J24k45K38k29n2J26N8m0j13J96r4
3546C3K07j51K5J6o0Q0k78K82k83K07K5k11J6J56Q5j25J86l32K74j94k6N1j12
3569a29K83r5k12j3K72m19M46k08j9lLj18J70J91J51m49M9P9L0n9J81j83J99k11
3593f4M9m6L8L97m83M4Q8K01j55L4k8n8R0o5J54j96J22J4O0rj36K44m18j74K98
3618AJ96j50K7l26K98r5j49K32l21M88l93L60l40K5K54m77L44n0J06l55L44k02
$$ plain form
3640 -183 -212 101 -6 -66 -77 298 -54 2 -102 -102 -86 -186 67 -214 -5 -211 -104 -241 -366 -78 -35 143 60
3663 60 31 81 63 246 222 177 191 68 -120 18 7 182 125 2 354 -86 161 -134 117 -194 -117 -34 -35 142
3687 142 182 73 42 195 130 220 189 127 145 69 114 -50 87 260 136 37 -36 267 31 4 -140 -64 -10 -29 45
3712 45 -121 -98 -103 -159 -34 -212 -388 -59 -166 -150 244 130 184 34 -31 -36 92 219 -170 72 -66 73 -132
3735 -132 -129 22 81 368 -118 -110 -161 -45 -94 -118 -32 -45 170 -38 127 56 302 -35 422 74 214 247 -148 151
3759 151 232 177 -60 13 100 -59 -14 -117 154 86 -57 -280 73 -237 -219 -172 -152 -90 -181 -26 130 -21 -47 76
3783 76 37 220 151 159 163 -19 207 -124 -260 -205 -257 -150 -131 -82 -35 -215 43 -241 -63 -57 -74 -298 -134 139 -74
3808 -74 -28 -130 154 46 287 88 92 239 129 -106 -69 225 -149 244 -138 150 106 102 105 -117 272 14 103 -13
$$ packed form
3640a83k9L13j07o0j1L75l52N6j04%J6j00K53k81K09k06J07j37j25K88M3J78q3
3663F0k9N0j8J83k4m5J4j23j88J38j1J75n7j23L52m40K47k95K51l11P7Q3jJ77
3687A42M0j09l1J53o5R0l1o2J8p6M5j64J37J73j24r9p3L03k36k7j44P6N4j9P4
3712D5j66K3nn6J25j78j76L29j07J6L94j14N4j50o5nJ28J27l89K42j38J39k05
3735a32LJ51N9K87m86Qn1J16m9k4Q6j3K15k08J65p1K46l37M57l48J40L3l95K99
3759A51Q1n5k37P3Q7j59M5j03K71o8j43k23L53l10J8M7K0O2r1J55J56j51k6J23
3783G6l9J83o9QMj82K26l31j36N5n2J07J9M9M7j80K58k84J78Oj7k24J64K73k13
3808g4M6j02K84j08K41j99MJ47j10k35L7K94l74L93l82K88m4mLk22L89k58Q9j16
$$ plain form
3832 -13 114 -198 55 60 105 458 68 149 176 226 394 -11 189 258 130 -234 84 -185 162 -82 14 -178 -157
3855 -157 152 -48 61 -209 -187 119 -120 147 -74 232 -44 -95 216 145 67 185 210 -65 -57 -203 -57 -61 -124
3878 -124 277 -169 -46 -203 -89 46 44 -78 -71 41 -147 44 -87 33 20 60 255 93 48 -123 50 74 255
3901 255 324 19 88 -92 -173 146 80 -142 86 -84 201 -113 -63 310 -81 66 -76 223 260 179 83 73 84
3924 84 168 231 70 129 -142 -9 82 -48 -185 -232 203 -23 -220 -379 -267 -282 -112 -19 -307 -56 -149 -294 -287 14
3948 14 -229 228 -185 -71 45 21 83 202 159 206 -277 49 -10 8 -265 -3 -105 -110 -280 -163 41 -278 -160
3971 -160 -20 -210 75 49 98 -17 129 191 295 -56 248 22 101 -17 153 275 22 280 69 193 -108
3992 -108 -34 -19 -79 132 -107 -87 59 142 -117 -136 228 -198 -40 -69 108 212 50 193 10 -75 212 235 -69
$$ packed form
3832a3J27l12K53NM5L53l90Q1K7N0J68m05K00O9j28l64L18k69L47k44R6j92K1
3855a57L09k00J09k70K2L06k39K67k21L06k76n1L11p1p8J18K5k75Qj46J46mo3
3878a24M01m46J23j57J14J35kj22PJ12j88J91j31J20j3M0J95j62m5j71J73K4J81
3901B55O9l05O9j80q1L19o6k22K28j70K85l14N0L73l91J47j42K99L7q1r6j0J1
3924H4Q4O3j61N9k71J33R1j30j37m7M35k26j97j59J12j5J70R3k88K51r3j45PL01
3948A4k43M57m13J14J16k4O2J19m3M7m83L26n9J8k73K62j02nj70J17K04l19J18
3971a60J40j90K85k6M9j15J46O2J04l51L04k26P9j18J70J22k53K58k11J24l01
3992a08P4J5o0K11k39K0J46Q3k59j9L64m26J58k9J77J04j62J43j83q5K87K3l04
$$ plain form
4015 -69 204 36 24 -156 -6 47 -153 -144 -174 -92 -240 -115 29 -155 9 -56 13 -1 -1 118 92 -18 -130 0
4039 0 95 291 -13 120 58 146 -71 28 -111 43 -90 -348 -25 -149 101 -127 -227 -168 -111 -30 -175 -81 -44 -6
4063 -6 22 55 176 54 174 54 12 -286 -24 -52 58 184 68 136 -341 -63 3 -108 -281 -128 9 -274 -71
4086 -71 117 -4 57 -26 -251 -119 -66 -194 254 14 -125 21 -179 -126 -146 124 40 -5 -174 25 9 -5 214
4109 214 205 92 3 143 182 262 108 7 178 -61 -95 -35 47 54 55 57 15 -23 -100 308 -240 11 -28 78 285 255
4135 255 11 127 124 -213 305 -172 111 -9 16 -239 153 -75 79 91 -83 118 125 94 114 323 103 -72 -74
4158 -74 68 211 24 4 126 -240 67 -39 115 -61 165 -97 -142 -14 30 11 -118 -139 -144 10 -145 -79 -71 -64
4182 -64 -16 -11 10 -173 -30 41 -89 -10 43 -3 66 206 -55 111 -54 -108 -86 147 64 -129 1 56 44 74 151 -47
$$ packed form
4015f9K73j68j2j80J50N3k00Rl0Q2j48J25J44j84J64o5O9j4%J19k6j10j12J30
4039@R5J96l04J33o2Q8k17R9j39J54j33k58L23j24K50k28j00N9N7Q1j45R4L7L8
4063fK8L3J21j22J20j20m2k98K62k8J10J26j16O8m77K78O6j11j73J53J37k83K03
4086g1J88j21O1q3k25J32N3j28M48k40j39J46k00N3k0K70q4m5j69J99j6j4K19
4109B14rj13q9J40L9Q0j54j01J71k39l4O0Q2PJKm2l8p7M08n48K51l9J06K07l0
4135B55k44J16ll37N18m77K83j20K5k55L92k28J54J2j74K01Pl1K0K09k20j75k
4158g4J42J43j87k0J22l66L07j06J54j76K26k62m5J28M4j9j29k1nJ54j55O6QP
4182f4M8NK1j83J43P1j30P9N3m6O9J40k61J66j65n4K2K33q3j93J30N5j2L0P7j98
$$ plain form
4208 -47 -14 22 -181 45 -108 -24 12 251 110 -20 277 73 144 109 134 172 99 -60 -95 -20 -200 38 -88 27
4232 27 -117 -67 -2 -409 4 -242 -34 102 -169 133 -66 148 -139 92 -3 -9 -1 103 -52 -218 277 -67 53
4255 53 -135 118 -125 16 -50 -82 224 -129 -18 -84 173 78 -58 -299 -82 -6 -128 -267 -34 108 13 94 180
4278 180 182 113 -199 152 162 151 -23 -52 17 142 -115 -45 144 104 120 -58 105 195 159 36 -209 43 165 -97
4302 -97 -125 116 43 -116 32 79 -76 -5 202 113 -21 0 -156 -88 -52 -146 109 181 -226 -229 -170 -404 150 -59 40
4327 40 9 -232 2 28 94 40 -250 28 303 -126 47 81 3 -313 122 -73 -43 123 -245 -133 -60 -71 107
4350 107 -27 61 124 222 11 69 -42 170 76 -116 -95 -67 -143 62 49 -183 -45 233 -10 77 41 -11 139 -220
4374 -220 -172 -401 -96 -43 42 -30 -96 -123 -24 153 -140 50 102 30 122 34 51 111 133 -116 -74 -53 76 14 -25 -29 17
$$ packed form
4208d7L3L6k03K26j53Q4L6K39j41j30K97k04P1l5K5L8p3j59l5P5j80K38j26J15
4232B7j44N0O5m07M13k46K08J36k71L02j99K14k87K31r5oQJ04j55j66M95l44J20
4255E3j88K53k43J41o6l2L06l53J11o6K57r5j36k41K17P6j22j39K33J42r5Q1Q6
4278A80Ko9l12L51J0j1j74k9O9J25k57P0J89m0J6j78J63R0l6j23k45K52J22k62
4302i7k8K41p3j59J48M7j55P1K07q9j34K1j56O8L6r4K55P2m07lN9k34N54k09R9
4327D0l1k41K34K6O6n4k90K78K75m29J73L4p8l16M35j95L0J66l68J12P3j1J78
4350A07j34Q8O3R8k11N8j11K12r4j92K1K8p6K05j3k32J38K78k43Q7l6n2J50l59
4374b20M8k29L05N3Q5p2o6k7R9J77k93J90N2p2R2q8J7O0K2k49M2K1J29o2l9mM6
$$ plain form
4401 17 -65 -232 -48 -265 94 -250 -46 -201 -191 31 162 22 140 92 18 157 301 -33 7 192 140 115 60
4424 60 96 -21 44 -183 -141 154 107 -218 -19 23 46 36 -103 106 -81 -112 22 -4 26 111 264 34 11 -62 54
4449 54 -308 -2 -170 -193 -54 169 -27 -74 195 9 125 0 49 238 -118 38 -105 -61 -213 37 47 -253
4471 -253 135 -213 -17 89 -65 -19 22 -197 -75 -66 53 -66 -143 -52 19 -82 -99 -18 -40 -196 74 66 15 -159
4495 -159 -130 -11 153 -23 64 13 51 -87 5 148 50 63 -97 -53 -76 123 230 -194 49 -71 234 162 9
4518 9 -97 -157 134 -27 101 -35 99 181 -14 -130 -96 -128 29 -59 -59 1 -107 -36 -20 -211 94 9 141 57 -195
4543 -195 94 -84 -29 -70 -98 -55 -16 -73 -195 -26 -264 165 62 -145 86 22 -174 -123 -41 27 -25 109 136 45
4567 45 -68 12 -111 107 -174 166 223 38 -58 122 8 75 11 -58 -69 -181 -125 148 -26 82 -119 -21 -109 99
$$ packed form
4401A7q2j67J84k17L59l44K04j55J0K22J31j40J18m8p4J39J44l34M0J85n2k5n5
4424F0L6j17O5k27M2K95m7l25J99M2K3j0j39K09j87l1J34k6L0Q5J53k30k3p3J16
4449E4l62L06j68k3J39K23j96m7K69j86J16j25M9J89l56J56j43M4j52K50J0l00
4471b53L88l48J96J06j54M6M1k19J22RJ19j19p7R1P1j01j7Q1k2j56K70qn1j74
4495a59K9J19J64j76Q7n1L8j38R2J43r8J3j60M4k3J99J07m24K43j20L05p2j53
4518Ij06o0K91j61J28j36J34Q2j95j16L4l2J57q8%O0j08P1J6j91L05q5J32q4k52
4543a95K89j78N5m1k8M3L9n7j22J69k38M29j03k07K31o4j96N1Q2O8n2J34K7r1
4567D5j13Q0j23K18k81L40N7j85r6J80j14O7o4o9j1j12N6K73j74J08k01R8q8K08
$$ plain form
4591 99 -39 -90 -6 -62 262 -34 187 -98 -84 -125 -108 -14 173 -71 -139 -37 -47 49 -204 -148 -90 133 80 -57 15
4616 15 -196 -7 153 83 -155 96 -225 -120 -76 -29 43 77 142 191 -49 -224 -39 -132 -29 -142 8 -199 -90
4639 -90 -56 -187 -110 -38 -95 125 -17 3 48 43 -15 -15 6 -170 -53 87 41 12 163 179 101 10 101 306 128 -10
4665 -10 -43 -36 -4 31 305 -39 70 192 -72 -57 25 74 26 206 142 -102 -55 -31 30 -171 90 39 152 -39 -83
4690 -83 120 -21 -93 -315 58 -221 -180 -163 -119 -95 11 -43 -19 -5 -183 4 -35 -119 165 227 144 -9 152 -284
4714 -284 201 -79 -65 172 -152 -137 -13 148 -4 -69 -110 35 68 -129 -28 75 -40 182 61 79 -1 178
4736 178 105 107 81 198 -146 277 -25 45 206 80 -89 262 -17 168 -210 -115 -34 86 -124 -159 -252 27 -143
4759 -143 23 306 92 23 -38 -6 45 -31 -120 -57 -115 190 -188 -77 166 24 279 5 48 -7 -121 -150 7 186
$$ packed form
4591I9j38n1Q4n6L24k96K21k85J4m1J7R4J87k44o8J02j0R6k53N6N8K23n3j37P2
4616A5k11J89J60p0k38K51l21J05M4M7P2L4O5M9k40j75J85r3J03j13J50k07J09
4639i0L4j31P7P2n7K20j42K0M5nn8%K1j76J17J40m6k9J51J6p8r1R1K05j78j38
4665a0l3PL2L5K74l44J09J22k64J5Q2M9m8J80o4k44M7K4O1k01K61n1J13j91m4
4690h3K03j41p2k22L73k79M1J7M4K4J06n4K4J4j78J87l9q4K84O2q3j53J61m36
4714b84M85k80J4K37l24J5J24J61j52o5m1J45L3j97J01J03j15K22j21J8q0J79
4736A78p3Kk6J17l44M23l02P0J61j26j69L51k79J85l78R5Q1J20k10l5r3K79j70
4759a43J66K83k14o9o1L2N1p6q9O3n8L05l78J11K43j42K55k74M3n5j14k9J57J79
$$ plain form
4783 186 -214 0 314 121 -2 71 109 -240 152 60 124 171 -264 148 -128 126 227 145 -11 -146 -186 110
4805 110 -18 -74 37 -229 54 44 48 73 92 -6 -69 -22 209 -174 42 -130 -65 44 -4 89 -117 60 -83 65
4829 65 -76 -145 -57 83 169 -24 -229 -102 -250 -32 131 -58 -56 -40 -155 -126 -173 -110 241 -85 -47 -60 -50 214
4853 214 20 114 26 -1 -48 -86 -21 75 -56 -282 77 -89 -79 40 56 -10 -89 -265 217 -87 23 -12 -64 4 -17
4878 -17 -53 28 -200 -19 -16 137 70 187 61 -59 11 -129 -34 2 96 109 213 101 -27 -13 -61 -211 101 85 -46
4903 -46 119 91 -88 45 101 -23 215 126 176 136 -54 -146 211 69 -129 138 -158 -14 93 -23 -127 -114 47
4926 47 -121 130 7 59 149 63 103 115 -310 54 -49 66 38 -90 184 -110 -89 135 -213 78 91 10 -152
4949 -152 -27 -43 -227 -14 60 97 26 107 57 42 239 -65 -189 -81 25 9 230 124 -65 124 41 212 -202
$$ packed form
4783A86m00K14L14j93j23P3L8l49L92r2O4M7m35M12k76K54J01q2j56j35m0K96
4805A10j28n6J11k66K83j0MK5J9r8o3M7K31l83K16j72O5J09m8R3k06J77j43J48
4829F5j41o9Q8J40Q6j93k05J27j48K18J63j89KJ6j15K9m7O3L51l26L8j3J0K64
4853B14j94R4q8k7m7l8O5R6j31k26L59j66J0J19J6o6p9j76M82l04J10l5n2O8k1
4878a7l6Q1k28J81LJ53o7J17j26j20P0j40R5L6R4J3J04j12j28J4m8j50L12j6j31
4903d6J65k8j79J33N6j24K38q9N0m0j90r2L57j42j98K67k96J44J07j16j04J3J61
4926D7j68K51j23N2R0q6M0J2m25L64j03J15k8j28K74k94K1K24l48K91J3q1j62
4949a52J25j6j84K13P4L7p1Q1n0j5J97l04j24J08J06j6K21j06j89J89q3J71m14
$$ plain form
4972 -202 -19 -119 -32 -108 67 -113 72 -202 -32 -119 88 -77 88 134 -76 -34 98 178 10 -121 -3 -101
4994 -101 -148 36 81 -107 28 -62 -107 -7 -29 -89 -78 6 10 127 -95 -75 -135 121 -70 4 42 108 -175 124 38
5019 38 -167 -1 -115 62 26 -261 -66 22 -206 -50 5 -4 34 -32 -92 -142 -34 142 91 -3 -34 -1 -46 4 -97
5044 -97 -58 153 -20 -98 200 126 162 142 194 -153 -9 -47 -114 21 -7 -94 -85 203 -11 7 -45 111 -109 24 50
5069 50 5 84 -46 198 -192 -3 4 103 70 -16 -290 99 33 20 54 136 -21 58 114 60 78 264 -175 33 -132
5094 -132 123 -34 -67 -93 -177 -51 -108 -85 148 7 85 -45 -23 73 239 175 16 100 77 118 118 82 -104 -134 159
5119 159 -74 144 -85 128 127 -103 -110 -43 164 104 72 161 -55 135 -60 125 23 8 -56 76 -154 -70 -88 -55
5143 -55 258 -56 -137 -177 -51 -119 -58 38 222 -87 -59 -105 -118 13 27 24 160 -57 -90 -205 -31 59 21 308 94
$$ packed form
4972b02J83j00Q7p6J75j80J85k74J70q7K07j65J65M6k10M2J32Q0j68j31J18r8
4994a01m7J84M5j88J35r0m5J00k2o0J1Q4MJ17k22K0o0K56j91P4L8O6k83K99q6
5019C8k05J66j14J77l6k87J95Q8k28J56N5rL8o6o0n0J08J76n1r4l1L3m5N0j01
5044i7L9K11j73p8K98p4L6k0N2l47J44l8o7J35k8q7RK88k14J8n2J56k20J33K6
5069E0m5P9j30K44l90J89PR9l3q6k74L89o6j3L4Q2j57P9N6n4J8J86m39K08j65
5094a32K55j57l3k6q4J26n7K3K33j41P8j30K2R6J66o4j59Q4k3M1%l6j86l0K93
5119A59k33K18k29K13jk30pO7K07o0l2Q9k16J90j95J85j02j5o4J32k30Q4j8L3
5143e5L13l14q1m0J26o8O1R6J84l09K8m6j3J31J4lJ36k17l3j15J74R0l8K87k14
$$ plain form
5168 94 -224 113 -63 -75 26 187 152 226 -189 -5 82 174 -55 -24 120 9 -142 -193 -78 -178 -3 33 67
5191 67 27 80 -138 30 -145 251 243 6 -215 63 67 290 175 320 -246 4 -14 -242 -44 160 -44 -1 8 96
5215 96 202 135 241 156 76 -57 117 38 -88 142 -126 5 18 367 -168 64 82 -145 3 -121 -181 -132 73
5238 73 22 166 -34 99 -21 -244 3 176 -82 -33 37 133 2 18 -4 66 -208 -135 118 -37 50 -92 -128 3
5262 3 -32 -34 187 -60 180 -24 -153 3 89 -173 -69 52 137 36 123 -203 -83 -62 31 -264 131 67 76 127 49
5287 49 -113 -36 -42 -61 132 -128 -24 155 -19 -16 -191 124 -204 45 -47 -17 37 -242 38 -172 -159 38 324 -9
5311 -9 -51 53 -56 -44 -125 -48 71 -89 -22 12 -64 -191 44 148 -51 86 91 19 31 33 24 128 27 29 169 74 -102
5338 -102 -7 88 -86 215 -124 -20 -64 -56 -148 276 -103 -16 -189 -97 221 5 -155 -32 -139 57 50 257 260 43
$$ packed form
5168I4l18L37j76j2J01J61l5P4m15J84Q7R2k29L1J44j11j51n1J15j00J75L6L4
5191F7m0N3k18J68j75L96qk37k21K78MK23j15J45n66K50j8k28J98K04k04M3RQ8
5215I6J06o7J06q5q0j33J74p9j26K30k68J31J3L49n35K32J8k27J48j24o0M9K05
5238G3n1J44k00J33j20k23K47J73k58M9P0R6j31J6k2P0k74P3K53j55Q7j42l6J31
5262Cl5kK21k47K40k04j29J56Q6k62J04J21Q5j01Q7l26J20K1R3k95L95o4RN1p8
5287D9j62P7oj9J93k60J04J79j74Lj75L15l28K49r2L0N4k79K80k10J3J97K86l33
5311im2J04j09J2q1P7J19j60O7L4p6j27K35J04j99J37Np2J2KrJ04j01KJ40r5j76
5338a02R5R5j74L01l39J04m4Qr2M24l79Q7j73R2L18k16j60J23j07J96pK07Lk17
$$ plain form
5362 43 -53 80 64 -91 -172 224 71 -140 33 -116 -24 -91 12 140 -189 -118 -5 129 -98 153 -51 -173
5384 -173 -117 89 -70 22 -110 78 95 100 242 70 101 -7 -50 149 58 71 68 -51 -223 -51 -152 46 10 -49
5408 -49 34 139 -100 -81 30 166 27 -66 -267 -186 -77 -57 300 -104 31 -87 31 -47 -76 45 -44 145 -219
5431 -219 28 140 47 44 -40 168 44 -11 1 -49 -193 30 12 -118 124 -83 -108 111 26 -113 26 -130 47
5454 47 160 292 4 30 32 22 186 -236 -79 116 135 -58 38 15 -164 14 -94 -85 4 54 68 -134 -51 55 104
5479 104 -224 -60 37 80 159 -257 293 -211 -36 88 -35 130 -182 139 101 -2 -103 -154 -39 71 205 -90
5501 -90 -232 48 198 98 -34 -158 19 159 -130 117 17 70 -179 -24 193 -61 -161 -59 11 -512 8
5522 8 -89 137 341 182 -45 -192 -32 -240 2 -36 -24 -93 54 153 -30 65 -180 -219 129 -143 -116 -85 58 8
$$ packed form
5362D3r6J33j6j55q1L96j53k11J73j49R2o7J03J28l29P1J13J34k27K51k04j22
5384a73N6K06j59R2j32J88J7NJ42j72L1j08m3J99r1J3lj19j72J72j01J98l6n9
5408d9Q3J05k39J9J11J36j39r3k01Q1J09K0L57m04J35j18J18p8k9J21q9J89l64
5431b19K47J12r3lq4K08j24n5J2n0j44K23j8j30K42k07k5K19q5j39J39j56J77
5454D7J13J32k88K6Kj0J64m22J57J95J9j93R6k3j79J78j08RQ9N0J4k02Q3J06M9
5479A04l28J64R7M3P9m16N50n04J75J24j23J65l12L21l8j03j01n1J15J10J34k95
5501i0j42K80J50j00j32j24J77J40k89K47j00N3k49J55K17k54j00J02P0n23N20
5522Hr7K26K04j59k27j47J60k08K42l8J2o9J47R9j83R5k45l9L48k72K7L1J43n0
$$ plain form
5546 8 4 -211 86 -2 154 -182 -101 231 107 20 161 -61 89 103 40 -76 59 -138 18 95 -110 -22 -3 -44
5570 -44 -95 -108 391 20 -152 -204 -24 79 42 -166 -28 -167 142 -98 -128 -106 7 10 58 -117 -93 152 114 -77
5594 -77 51 -41 -99 -60 79 -72 90 -5 -151 0 72 -102 -38 255 -139 -197 75 0 -72 -71 -171 137 34 90
5618 90 31 39 140 99 127 231 181 170 -11 247 -30 244 -207 -99 -178 135 50 -67 96 -181 -131 23 96 -42
5642 -42 -54 -38 170 -21 18 75 6 -64 316 124 -74 33 -224 92 -173 -21 32 -24 -79 -100 -150 46 26 -147
5666 -147 -22 -77 130 -11 -79 28 -84 -15 36 255 279 -71 -82 -184 -81 -179 11 -153 136 -22 -75 -55 -140
5689 -140 116 -60 -61 -105 -9 0 44 25 96 -205 54 -11 53 -220 -83 99 98 -63 -50 -21 -139 105 -6 -124 21
5714 21 173 3 11 126 -54 245 -44 125 7 262 11 -40 1 111 29 59 64 120 -188 174 -68 -101 2 84
$$ packed form
5546Hmk15K97q8J56l36Q1L32j24q7J41k22J50J4o3j16J35j97J56P7k05Q8J9m1
5570d4n1j3M99l71j72n2J80J03l7k08J38j39L09k40l0K2J13LM8j75K4K45l8j91
5594g7J28r2n8L9J39j51J62r5j46J51P2j74O4K93l94n8K72p5p2Jj00L08j03N6
5618I0n9QJ01m1K8J04n0j1j81K58k77K74m51J08p9L13q5j17J63k77N0J54P3j38
5642d2j2J6K08j91L9N7o9p0L80j92j98J07k57L16k65J52N3n6n5k1n0J96k0j73
5666a47J25n5K07j41o8J07j12O9N1K19K4l50j1j02J03r8J90j64K89j58n3K0q5
5689a40K56j76jm4R6RM4j9P1l01K59o5O4k73J37J82jj61J3K9j18K44j11j18J45
5714B1J52j70QJ15j80K99k89J69j18K55k51n1M1J10q2L0NN6l08L62k42l3J03Q2
$$ plain form
5738 84 36 -213 92 148 135 -25 -137 -6 -3 23 -271 -222 -51 103 111 -247 136 16 122 -145 58 -120 -184 -37
5762 -37 -32 43 143 207 -30 154 -59 17 127 -60 122 -68 -63 -88 16 70 -69 -345 -55 111 102 -69 106 114 -3
5787 -3 79 14 -48 -40 -264 -55 5 -67 -64 11 -178 162 34 -40 18 -28 -56 -99 10 -47 187 -129 -93 8 -69 138 -45
5814 -45 -152 113 107 -11 33 6 -53 -14 -97 207 14 -259 -42 -28 -15 -54 -78 83 88 105 -84 -52 -76 -57 -93 10
5840 10 -324 -121 62 -32 75 91 -78 -90 96 95 66 -50 -63 -23 152 25 -139 -60 192 -43 30 121 14 64
5864 64 -20 274 149 134 159 18 141 -177 128 110 -40 -166 59 -45 2 -115 17 -74 38 -232 -171 76 -30
5887 -30 62 87 -174 107 -43 19 60 15 37 -23 -72 93 -61 -104 -278 145 -183 16 -106 75 24 197 118 154
$$ packed form
5738H4m8k49L05N6j3j60j12J31LK6k94M9J71J54Ql58L83j20J06k67K03j78o4J47
5762c7NP5J00O4k37J84k13P6J10j87J82j90Nk5J04N4j39k76K90J66rj71J75Qj17
5787cQ2o5o2Qk24K09O0p2LP5j89L40j28p4N8m6k8m3J09n7K34l16L6J01p7K07j83
5814d5j07K65oj18M4k7n9L9q3L04j93k73K17J4J3l9k4J61NJ7j89L2k4J9l6J03
5840A0l34K03J83r4J07J6j69j2J86jk9j16j3M0J75j27j64P9K52k35P3R1j07N0
5864F4q4K94j25j5K5j41J23l18L05j8j50j26K25j04M7j17J32r1J12k70O1K47j06
5887c0R2K5k61K81j50O2M1m5K2o0m9J65j54m3j74M23l28J99j22J81n1J73p9L6
$$ [...]
8191A00
##END NTUPLES=NMR FID
##END=
