##TITLE=1H_SA_54.221
 CDCl3, 8 sc, 
 24.8.2020
##JCAMPDX= 6.0         $$ Bruker NMR JCAMP-DX V2.0
##DATA TYPE= NMR FID
##DATA CLASS= NTUPLES
##ORIGIN= UXNMR, Bruker Analytische Messtechnik GmbH
##OWNER= root
$$ XWIN-NMR		Version 3.5
$$ Mon Aug 24 10:35:38 2020 Russian Standard Time (UT+4h)  she@DPX200
##.OBSERVE FREQUENCY= 200.1314999998
##.OBSERVE NUCLEUS= ^1H
##.DELAY= (6, 6)
##.ACQUISITION MODE= SIMULTANEOUS
##.ACQUISITION SCHEME= undefined
##.AVERAGES= 8
##.DIGITISER RES= 18
##SPECTROMETER/DATA SYSTEM= spect
##.PULSE SEQUENCE= zg30
##.SOLVENT NAME= CDCl3
##.SHIFT REFERENCE= (INTERNAL, CDCl3, 0, 15.7039)
##AUDIT TRAIL= $$ (NUMBER, WHEN, WHO, WHERE, WHAT)
$$ ##TITLE= Audit trail, XWIN-NMR		Version 3.5
$$ ##JCAMPDX= 5.01
$$ ##ORIGIN= Bruker BioSpin GmbH
$$ ##OWNER= she
$$ F:/spectra/data/she/nmr/H-F/1/audita.txt
$$ ##AUDIT TRAIL=  $$ (NUMBER, WHEN, WHO, WHERE, WHAT)
(   1,<2020-08-24 10:33:53.76 +0400>,<she>,<DPX200>,
      <created by zg, POWCHK disabled, PULCHK disabled
       configuration hash MD5:
       00 E9 B6 7A A2 85 ED C7 34 08 36 98 17 FE 4E 26
       data hash MD5: 16K
       D1 34 82 F8 70 8D B5 4B 8C E8 99 A8 AC F8 3F 20>)
$$ ##END=
$$ 
$$ hash MD5
$$ 91 E7 D4 D7 C2 80 72 2F 1C 8A B0 73 33 82 B3 63
##$RELAX= 
##$RELAX= 
##$RELAX= 
##$RELAX= 
##$RELAX= 
##$RELAX= 
$$ Bruker specific parameters
$$ --------------------------
##$DU= <F:/spectra>
##$EXPNO= 1
##$NAME= <H-F>
##$PROCNO= 1
##$TYPE= <nmr>
##$USER= <she>
##$AMP= (0..31)
100 100 100 100 100 100 100 100 100 100 100 100 100 100 100 100 100 100 
100 100 100 100 100 100 100 100 100 100 100 100 100 100 
##$AQSEQ= 0
##$AQ_mod= 1
##$AUNM= <au_zg>
##$AUTOPOS= <>
##$BF1= 200.13
##$BF2= 200.13
##$BF3= 200.13
##$BF4= 200.13
##$BF5= 200.13
##$BF6= 200.13
##$BF7= 200.13
##$BF8= 200.13
##$BYTORDA= 1
##$CFDGTYP= 0
##$CFRGTYP= 5
##$CHEMSTR= <none>
##$CNST= (0..31)
1 1 145 1 1 1 1 1 1 1 1 1 1 1 1 1 1 1 1 1 1 1 1 1 1 1 1 1 1 1 1 1 
##$CPDPRG= <>
##$CPDPRG1= <>
##$CPDPRG2= <>
##$CPDPRG3= <>
##$CPDPRG4= <mlev>
##$CPDPRG5= <mlev>
##$CPDPRG6= <mlev>
##$CPDPRG7= <mlev>
##$CPDPRG8= <mlev>
##$CPDPRGB= <>
##$CPDPRGT= <>
##$D= (0..31)
0 1.2 0 0 0 0 0 0 0 0.06 0 0.03 0 0 0 0 0.0002 0 0 0 0 0 0 0 0 0 0 0 0 
0 0 0 
##$DATE= 1598250833
##$DBL= (0..7)
120 120 120 120 120 120 120 120 
##$DBP= (0..7)
150 150 150 150 150 150 150 150 
##$DBP07= 0
##$DBPNAM0= <>
##$DBPNAM1= <>
##$DBPNAM2= <>
##$DBPNAM3= <>
##$DBPNAM4= <>
##$DBPNAM5= <>
##$DBPNAM6= <>
##$DBPNAM7= <>
##$DBPOAL= (0..7)
0.5 0.5 0.5 0.5 0.5 0.5 0.5 0.5 
##$DBPOFFS= (0..7)
0 0 0 0 0 0 0 0 
##$DE= 6
##$DECBNUC= <off>
##$DECIM= 24
##$DECNUC= <off>
##$DECSTAT= 4
##$DIGMOD= 1
##$DIGTYP= 9
##$DL= (0..7)
0 120 120 120 120 120 120 120 
##$DP= (0..7)
150 150 150 150 150 150 150 150 
##$DP07= 0
##$DPNAME0= <>
##$DPNAME1= <>
##$DPNAME2= <>
##$DPNAME3= <>
##$DPNAME4= <>
##$DPNAME5= <>
##$DPNAME6= <>
##$DPNAME7= <>
##$DPOAL= (0..7)
0.5 0.5 0.5 0.5 0.5 0.5 0.5 0.5 
##$DPOFFS= (0..7)
0 0 0 0 0 0 0 0 
##$DQDMODE= 0
##$DR= 18
##$DS= 0
##$DSLIST= <SSSSSSSSSSSSSSS>
$$ [...]
##$SUBNAM2= <"">
##$SUBNAM3= <"">
##$SUBNAM4= <"">
##$SUBNAM5= <"">
##$SUBNAM6= <"">
##$SUBNAM7= <"">
##$SUBNAM8= <"">
##$SUBNAM9= <"">
##$SW= 24.9337058888022
##$SWIBOX= (0..15)
0 0 2 0 0 0 0 0 0 0 0 0 0 0 0 0 
##$SW_h= 4990.01996007984
##$TD= 16384
##$TD0= 1
##$TE= 0
##$TE2= 300
##$TE3= 300
##$TEG= 300
##$TL= (0..7)
0 120 120 120 120 120 120 120 
##$TP= (0..7)
150 150 150 150 150 150 150 150 
##$TP07= 0
##$TPNAME0= <>
##$TPNAME1= <>
##$TPNAME2= <>
##$TPNAME3= <>
##$TPNAME4= <>
##$TPNAME5= <>
##$TPNAME6= <>
##$TPNAME7= <>
##$TPOAL= (0..7)
0.5 0.5 0.5 0.5 0.5 0.5 0.5 0.5 
##$TPOFFS= (0..7)
0 0 0 0 0 0 0 0 
##$TUNHIN= 0
##$TUNHOUT= 0
##$TUNXOUT= 0
##$USERA1= <user>
##$USERA2= <user>
##$USERA3= <user>
##$USERA4= <user>
##$USERA5= <user>
##$V9= 5
##$VALIST= <valist>
##$VCLIST= <CCCCCCCCCCCCCCC>
##$VD= 0
##$VDLIST= <DDDDDDDDDDDDDDD>
##$VPLIST= <PPPPPPPPPPPPPPP>
##$VTLIST= <TTTTTTTTTTTTTTT>
##$WBST= 1024
##$WBSW= 4
##$XGAIN= (0..3)
0 0 0 0 
##$XL= 0
##$YL= 0
##$YMAX_a= 114758
##$YMIN_a= -76183
##$ZGOPTNS= <>
##$ZL1= 120
##$ZL2= 120
##$ZL3= 120
##$ZL4= 120
##$ABSF1= 10
##$ABSF2= 0
##$ABSG= 5
##$ABSL= 3
##$ALPHA= 0
##$AQORDER= 0
##$ASSFAC= 0
##$ASSFACI= 0
##$ASSFACX= 0
##$ASSWID= 0
##$AUNMP= <proc_1d>
##$AZFE= 0.1
##$AZFW= 0.1
##$BCFW= 1
##$BC_mod= 2
##$BYTORDP= 1
##$COROFFS= 0
##$CY= 11.3945322036743
##$DATMOD= 1
##$DC= 2
##$DFILT= <>
##$DTYPP= 0
##$F1P= 16.9975609425685
##$F2P= -3.02152046262296
##$FCOR= 0.5
##$FTSIZE= 0
##$FT_mod= 4
##$GAMMA= 1
##$GB= 0.15
##$INTBC= 1
##$INTSCL= 1
##$ISEN= 128
##$LB= 0.24
##$LEV0= 0
##$LPBIN= 0
##$MAXI= 10000
##$MC2= 0
##$MEAN= 0
##$ME_mod= 0
##$MI= 1.114404
##$NCOEF= 0
##$NC_proc= 0
##$NLEV= 6
##$NOISF1= 3.799351
##$NOISF2= 2.8
##$NSP= 1
##$NTH_PI= 0
##$NZP= 0
##$OFFSET= 15.70392
##$PC= 1
##$PHC0= -9797.476
##$PHC1= 23.00092
##$PH_mod= 1
##$PKNL= yes
##$PPARMOD= 0
##$PSCAL= 0
##$PSIGN= 0
##$REVERSE= no
##$SF= 200.130013532006
##$SI= 16384
##$SIGF1= 3
##$SIGF2= 2
##$SINO= 400
##$SIOLD= 16384
##$SREGLST= <1H.CDCl3>
##$SSB= 0
##$STSI= 0
##$STSR= 0
##$SW_p= 3612.71676300578
##$SYMM= 0
##$S_DEV= 0
##$TDeff= 0
##$TDoff= 0
##$TI= <>
##$TILT= no
##$TM1= 0
##$TM2= 0
##$TOPLEV= 0
##$USERP1= <user>
##$USERP2= <user>
##$USERP3= <user>
##$USERP4= <user>
##$USERP5= <user>
##$WDW= 1
##$XDIM= 8192
##$YMAX_p= 0
##$YMIN_p= 0
$$ End of Bruker specific parameters
$$ ---------------------------------
##NTUPLES= NMR FID
##VAR_NAME=  TIME,          FID/REAL,        FID/IMAG
##SYMBOL=    X,             R,               I
##VAR_TYPE=  INDEPENDENT,   DEPENDENT,       DEPENDENT
##VAR_FORM=  AFFN,          ASDF,            ASDF
##VAR_DIM=   8192,          8192,            8192
##UNITS=     SECONDS,       ARBITRARY UNITS, ARBITRARY UNITS
##FACTOR=    0.0002004,     1,               1
##FIRST=     0,             0,               0
##LAST=      1.6414764,     0,               0
##MIN=       0,             -76183,          0
##MAX=       1.6414764,     114758,          0
$$ Real data points
##PAGE= N=1
##DATA TABLE= (X++(R..R)), XYDATA
$$ [...]
2209H03j949P53J230j062j373J485Q19j650QO07L75p15q95P18P37n20o06M57Q88
$$ 803 -1146 -393 837 -225 -1598 -113 706 -944 -936 -329 46 -669 -1564 -846 -109 -629 -1235 -778 110
2228A10q94j249J437J089j719k60J495j05j491J449O47r10q57Q02O22j26m62k47
$$ 110 -784 -2033 -596 493 -1226 -1486 9 -96 -1587 -138 509 -401 -1258 -456 166 40 -422 -669
2246f69P79L09j035N5R27l60j023L28J634o71j114O79O57q36p5J170n02o77L40
$$ -669 110 419 -616 -561 366 6 -1017 -689 945 274 -840 -161 496 -340 -415 755 253 -424 -84
2265h4Q47o70n4L8l67J087m90k58M92O00j494J21J894o25j026K69J112p03p14
$$ -84 763 93 39 77 -290 797 307 49 541 1141 -353 -232 1662 1037 11 280 1392 689 -25
2284b5P68M45j049L47O48l1l76q8Qj63L61k66j69M64k24p13O16Q29j503j96J407
$$ -25 743 1188 139 486 1134 1103 727 639 647 484 845 579 410 874 650 -63 553 1382 -121 -317 1090
2305A090k81p50M17P41p16p79J030N2m56J34k24j58L82k2l69M40Q3r01O96P09
$$ 1090 809 59 476 1217 501 -278 752 804 348 482 258 100 482 460 91 531 614 -287 409 1118
2325A118q38o91O79L91o67N5O24m30n12L09O74p67j75K75k29JK29m35j30K70k72
$$ 1118 280 -411 268 659 -8 47 671 241 -271 38 712 -55 -230 45 -184 -183 46 -389 -519 -249 -521
2346e21n01R06L86j401Q1J204o91o12O36L13r36r1Q07j7m69J87o2m4L73r9j17
$$ -521 -1022 -116 270 -1131 -1050 154 -537 -1149 -513 -200 -1136 -1227 -420 -437 -906 -719 -781 -825 -452 -551 -668
2367f68K47N2p25M64N00k67p43Q73k04q10L39N49m00n11P94k58o42M76L27l57
$$ -668 -421 -369 -1094 -630 -130 -397 -1140 -267 -471 -1281 -942 -393 -793 -1304 -510 -768 -1410 -934 -607 -964
2387i64m6K60k22q0O44m12k09N19K36o69L93P35j49o33O87ko54Q15N03r01M75
$$ -964 -1010 -750 -972 -1052 -408 -820 -1029 -510 -274 -943 -550 185 36 -597 90 88 -566 249 752 -149 326
2408C26J64K01n42M97j8o40P02J01o27K44M23p20K56O74p7r36R88q1p36r3J265
$$ 326 490 691 149 646 628 -12 690 791 164 408 831 111 367 1041 964 28 1016 935 199 106 1371
2429A371m74k78P10l99j37j81N93k40j09O97o39j23N39k04o45N11M67r00j08J031
$$ 1371 897 619 1329 930 793 612 1205 965 856 1553 914 791 1330 1126 481 992 1459 559 451 1482
2449A482m16r27P60Ml87l33M41k69PL50o45K02M11k76l85J28K21m93L8O78r75
$$ 1482 1066 139 899 903 516 183 624 355 362 712 67 269 680 404 19 147 368 -125 -87 591 -384
2470c84n37O01Q59j192q4M71l57l08Q22n82k90m4J46j89K08J61o18L00M72k89
$$ -384 -921 -320 539 -653 -737 -266 -623 -931 -109 -691 -981 -1025 -879 -1068 -860 -699 -1317 -1017 -545 -834
2490h34j49P16l87m76K13J047q04m39J053m89j6N86M96j245k45P98k40k7L32l41
$$ -834 -983 -267 -654 -1130 -917 130 -674 -1113 -60 -549 -565 21 517 -728 -973 -175 -415 -442 -110 -451
2510d51k59J65L78l29q3K43j018L26R31j99j005N71M87p43N48P27j92p40N23M86
$$ -451 -710 -545 -167 -496 -579 -336 -1354 -1028 -97 -296 -1301 -730 -243 -986 -438 289 97 -643 -120 366
2530C66m50N65K73k49N0L0j04K43N35r03r0J104P4q16k40P56m96o46J273k8j199
$$ 366 -84 481 754 505 555 585 481 724 1259 356 266 1370 1444 628 388 1144 648 2 1275 1247 48
2551D8j92R35m15k57P4k67J72J89m9k05M9J17o06Q43M70r90m08Q60N4j089J287
$$ 48 -144 791 376 119 193 -74 98 287 238 33 82 199 -407 436 906 -84 -492 368 422 -667 620
2572F20N61j101n65Q21Q34o45k67J19j21L92ojL4j76n13L24J080o07j053K68P03
$$ 620 1181 80 -485 336 1170 525 258 377 256 648 642 641 675 499 -14 310 1390 783 -270 -2 701
2593G01p34K70L88m89p77L17J082p99p37P75l61k97L32L34k18k53o03K55J096
$$ 701 -33 237 625 136 -641 -324 758 -41 -778 -3 -364 -661 -329 5 -213 -466 -1069 -814 282
2612B82Mr17j5R23k43m96N26O95j677P0J677k06p53J98O19o79Q7N32L59q77m33
$$ 282 286 -631 -646 277 34 -462 64 759 -918 -848 829 623 -130 68 687 8 95 627 986 109 -324
2633c24K96P40N3j184OQ31Nj420N38J127j282j014J232M81j180r3P10l92l6M17
$$ -324 -28 712 765 -419 -413 418 423 -997 -459 668 -614 -1628 -396 85 -1095 -1188 -478 -870 -906 -489
2653d89J89m69k73J02M50O86n95l33Q13N63j244L79J688p75j511J155J059o49
$$ -489 -300 -769 -1042 -940 -490 196 -399 -732 81 644 -600 -221 1467 692 -819 336 1395 746
2671G46j045Q57P7o30K40M90l24m94m2R1M13q4o34K70M83l35q22R61K11j428L37
$$ 746 -299 558 635 5 245 735 411 -83 -125 -34 379 295 -339 -69 414 79 -743 218 429 -999 -662
2692f62J383j13j705N12J157o67m04M12N09m48j26Q8Q44J54q42k7P85k02q08N72
$$ -662 721 608 -1097 -585 572 -95 -499 -87 422 -26 -152 -64 780 934 92 65 850 648 -160 412
2712D12P36j038o70J723N2j230j59R74k51j075N36P50r17p46M19N45J61p04n21
$$ 412 1148 110 -560 1163 1215 -15 -174 800 549 -526 10 760 -157 -903 -484 61 222 -482 -1003
2731a003O85M01p75r8J359n89j433N75J801j285j111J237L17o68q9J088l37j054
$$ -1003 -318 83 -692 -790 569 -20 -1453 -878 923 -362 -1473 -236 81 -587 -676 412 75 -979
2749i79N38O53J60p60k99P76J52m31n99Q83K90j210J60J373l41j408N63J192o94
$$ -979 -441 212 372 -388 -687 89 241 -190 -789 94 384 -826 -666 707 366 -1042 -479 713 19
2768A9j104R28M45p30n56J013J3j36l32J49P40m59o64O66P95r00p33J235P37j713
$$ 19 -1085 -157 288 -442 -998 15 28 -108 -440 -291 449 -10 -674 -8 787 -113 -846 389 1126 -587
2788e87J41J471m61r28O09R25q58n5p8P52l93m24M75K42L38j053m10J270n8j470
$$ -587 -446 1025 564 -364 245 1170 312 257 179 931 538 114 589 831 1169 116 -294 976 918 -552
2808e52R39J060r29q68J370L11j607K76J217n63o74J71R76l30n06K26L03J15l27
$$ -552 387 1447 518 -350 1020 1331 -276 0 1217 654 -20 151 1127 797 291 517 820 935 608
2827F08p71J260K91j317l9J393l52j134K86J162q82r34J360k1p55j37P85n56l71
$$ 608 -163 1097 1388 71 32 1425 1073 -61 225 1387 505 -429 931 910 155 18 803 247 -124
2846a24K04N99m35m82m4N39J35l86n97O83P01j331%J145k26j264L50J198p40q38
$$ -124 80 679 244 -238 -282 257 392 6 -591 92 793 -538 -538 607 381 -883 -533 665 -75 -913
2866i13N20L63n85J56M79k62j41r0p6K37%l52OO65n00n72O76M17j080j54J026
$$ -913 -393 -30 -615 -459 20 -242 -383 -473 -549 -312 -312 -664 -658 7 -493 -1065 -389 28 -1052 -1206 -180
2887a80k68r02O49N78p95l76O94N0k28l24j20O45K20l60n46P11J80r33O38O13
$$ -180 -448 -1350 -701 -123 -918 -1294 -600 -550 -778 -1102 -1222 -577 -357 -717 -1263 -552 -372 -1305 -667 -54
2907e4n43q65J254M45r05k86R25l24o75N99L43n3n96M1M38L86k86p58O82Q76r28
$$ -54 -597 -1462 -208 237 -668 -954 -29 -353 -1028 -429 -86 -139 -735 -694 -256 130 -156 -914 -232 644 -284
2928b84m37J237j87j311O57J299r19m89Q01j63j39L89K33k38k01k15L31K21k09
$$ -284 -721 516 329 -982 -325 974 55 -434 367 204 65 454 687 449 248 33 364 585 376
2947C76J03o1O12j55p43O99J79q55R5O74j29l86N04j42m14k6M93j51L4k71Q0r2
$$ 376 479 418 1030 875 132 831 1010 155 250 924 795 409 913 771 357 331 824 673 707 436 516 424
2969D24r9p0j51K60J83m59K01M61n02q32R23M12j261j34P52k26m42L69J83m34
$$ 424 325 255 104 364 547 88 289 750 248 -584 339 751 -510 -644 108 -118 -560 -191 -8 -442
2989d42j73K07j61J51M4p4L9M72m88l87N09K48r07Q4R12l66o69O97K98r76N75
$$ -442 -615 -408 -569 -418 -374 -448 -409 63 -425 -812 -303 -55 -962 -878 34 -332 -1001 -304 -6 -982 -407
3010d07L6k38j92J51j52j0J26J06l37P7N74r61L38O73n44l33Q42M56j099L79O30
$$ -407 -371 -609 -801 -650 -802 -812 -686 -580 -917 -840 -266 -1227 -889 -216 -760 -1093 -251 205 -894 -515 115
3031A15m78k17O45j20q9J62J31k83J95P4K1n6O48n38j92M42l5m36K21N58n95k44
$$ 115 -363 -580 65 -55 -144 18 149 -134 61 135 156 100 748 210 18 460 425 -11 210 768 173 -71
3053g1M86lp94Q01J67n61j8M96l23j43O32k03m1j28K08k52J63N07o96j28P69j64
$$ -71 415 412 -382 419 586 25 7 503 180 37 669 466 425 297 505 253 416 923 227 99 868 704
3075G04m40K97L75n40j49O90n64j93N56j26k85N7M41m82j06K30l55j14N36m99
$$ 704 264 561 936 396 247 937 373 180 736 610 325 382 823 341 235 465 110 -4 532 33
3095C3m01L85K61l59j4M46m28m57P37K46p56K8N59m33j77P84m97K90j71K06n29
$$ 33 -368 17 278 -81 -95 351 -77 -534 203 449 -307 -279 280 -153 -330 454 -43 247 76 282 -247
3116b47Q0M52o15J59P43q49j70R10k61o42N61L01l50m22N20L1o41O17k34k6j59
$$ -247 -167 285 -330 -171 572 -277 -447 463 202 -440 121 422 72 -350 170 201 -440 177 -57 -83 -242
3137b42Q5k49K26L47o94k4K70j44l71M27M20n67j79O24O5m29K89p3O9m23O85j28
$$ -242 -157 -406 -180 167 -527 -551 -281 -425 -796 -369 51 -516 -695 -71 -6 -435 -146 -219 -150 -573 112 -16
3159a6k99P43o70O5K69J32o43L82O9j85J54J09L0q87N30L45m21K09k31j72m12
$$ -16 -315 428 -242 -177 92 224 -419 -37 32 -153 1 110 140 -747 -217 128 -293 -84 -315 -487 -899
3180h99N62K67k69m7r9l80L92N35n88l58M13K83l04P18m6o57J02Q23j34n51O77
$$ -899 -337 -70 -339 -386 -485 -865 -473 62 -526 -884 -471 -188 -492 226 180 -477 -375 448 314 -237 440
3201D40j54m47M92L20o04j09M02K50n47M50k31m33K56L43l22M11p4m48j86R11
$$ 440 286 -161 331 651 47 -62 340 590 43 493 262 -171 85 428 106 517 443 -5 -191 720
3221G20k71o30K46K75o53n4O54J11o33J08K8Mn3N83n07m3L15k97J13O66l87j001
$$ 720 449 -181 65 340 -313 -367 287 398 -235 -127 -99 -95 -148 435 -72 -115 200 -97 16 682 295 -706
3243g06P03O67n43k37Q74m67n10M01L75l54n28L94K32k62j1o4q0J71k57k53N37
$$ -706 -3 664 121 -116 758 291 -219 182 557 203 -325 69 301 39 28 -36 -116 55 -202 -455 82
3264H2l99m62L59M26o03j27M74j5j004R86L94n84k15O8M59m36L32j61J46J23j09
$$ 82 -317 -779 -420 6 -597 -724 -250 -265 -1269 -283 111 -473 -688 -620 -161 -597 -265 -426 -280 -157 -266
3285b66j62K39K92n94J25N69K55p86K14K32p23K31R30l68l27N8J82k03k43N12
$$ -266 -428 -189 103 -491 -366 203 458 -328 -114 118 -605 -374 556 188 -139 -81 101 -102 -345 167
3305A67j65r0o0O9L6K80l48m58K91Q86r37l51R55k72n25Q21M31r13l45P02L30
$$ 167 2 -88 -148 -79 -43 237 -111 -569 -278 608 -329 -680 275 3 -522 299 730 -183 -528 174 504
3326E04k52m0K41r2n0M86p3K53m76m25N36P09n78k85O87Q9j193L56P49l99o92
$$ 504 252 212 453 361 311 797 724 977 501 76 612 1321 743 458 1145 1234 41 397 1146 747 55
3347E5K97K50j36j81J90k41J15J24k36L61m47o64M79K94J72o06J29M89n99n07
$$ 55 352 602 466 285 475 234 349 473 237 598 151 -513 -34 260 432 -174 -45 444 -155 -662
3367f62P61Q25j413N5J151l90o71N68j09j08J02kj10L17k95n38M81Kj47l65P45
$$ -662 99 924 -489 -434 717 327 -344 224 115 7 109 107 -3 314 19 -519 -38 -36 -183 -548 197
3388A97l54n96L47O24p81l63P65j3m78m36R44n34k22L21KL36l94k80l6Q14n12
$$ 197 -157 -753 -406 218 -563 -926 -161 -174 -652 -1088 -144 -678 -900 -579 -577 -241 -635 -915 -951 -137 -649
3409f49k88Q03J52q13R3R16m81n88L84M31k42k51N58k3k79P7k5Q9q9l26M01K19
$$ -649 -937 -134 18 -795 -702 214 -267 -855 -471 -40 -282 -533 25 2 -277 -200 -225 -136 -225 -551 -150 69
3431F9l1n41J64M21m95J05K35L24q53L9J195m78o44N45L99n89k4P7N39j47K03
$$ 69 38 -503 -339 82 -413 -308 -73 251 -602 -563 632 154 -490 55 454 -135 -159 -82 457 310 513
3452E13j46K26k8n10m4M39jo52N61O04o94l48M49K94o22k1M50J44q34L92O35m91
$$ 513 367 593 565 55 11 450 449 -203 358 962 268 -80 369 663 41 20 470 614 -220 172 807 316
3474C16k85j03K17K50l61l40P56J61o13J53M23k45r08L88R26j048j35P19K46r12
$$ 316 31 -72 145 395 34 -306 450 611 -2 151 574 329 -579 -191 735 -313 -448 271 517 -395
3494c95J51M80k31k88K76M65m08j24l10K93L21k25q80O82L27p54Q2M65j76p47
$$ -395 -244 236 5 -283 -7 458 50 -74 -384 -91 230 5 -875 -193 134 -620 -538 -73 -249 -996
3514i96N06O37p09n95R00k7o48M58J50J7ll90J38J19J81o75N08M79n11p14J206
$$ -996 -490 147 -562 -1157 -257 -284 -932 -474 -324 -307 -310 -700 -562 -443 -262 -937 -429 50 -461 -1175 31
3535C1M6r25J83Q09k08p26N25K05r2m32O04k00K5P5j70l9K89j69l49K64M50r21
$$ 31 77 -848 -665 144 -64 -790 -265 -60 -152 -584 20 -180 -155 -80 -250 -289 0 -169 -518 -254 196 -725
3557g25L61P09r13L8M79K54n88o3P43j33k14j8K30Q5j01l5J35J23R2m14K48L75
$$ -725 -364 345 -568 -530 -51 203 -385 -448 295 162 -52 -70 160 245 144 109 244 367 459 45 293 668
3579F68m23l52L49L58m73M11L68p81p8P52k18m61J96M25j65j89l47J94Q7K68n05
$$ 668 245 -107 242 600 127 538 906 125 47 799 581 120 316 741 576 387 40 234 321 589 84
3600H4P8N18k32m92M65J27n58L5O47l08o04K64O21n21P2m5M05j02L6k21RL60k98
$$ 84 162 680 448 -44 421 548 -10 25 672 364 -240 24 645 124 196 151 556 454 490 269 278 638 340
3623C40j22J5J11l6k25O65l76n71M33K85l00j31o6R3k94L72K43n94J78J33l46
$$ 340 218 233 344 308 83 748 372 -199 234 519 219 88 22 115 -179 193 436 -158 20 153 -193
3644a93k01P30o88N2M67m29J22N79k72o50J59Q49k24n72O25l87J84k74L47j08
$$ -193 -394 336 -352 -300 167 -262 -140 439 167 -483 -324 525 301 -271 354 -33 151 -123 224 116
3664A16j92K09j90J5K84q2o70J93M53m25J02J36k49k89N57M9o72N31J58m74p6
$$ 116 -76 133 -57 -42 242 160 -510 -317 136 -289 -187 -51 -300 -589 -32 17 -655 -124 34 -440 -516
3685e16O12k96k31K32K06l47J98J2j60J88K05m10K33J31O2n48N91L89p65j32P96
$$ -516 96 -200 -431 -199 7 -340 -142 -130 -290 -102 103 -307 -74 57 119 -429 162 551 -214 -346 450
3706D50m71r5L12jk45r4M34m23L03O8j87k95O62j72k69M5L06l39p4N35n52j59
$$ 450 -21 -116 196 195 -50 -144 290 -133 170 238 51 -244 418 246 -23 22 328 -11 -85 450 -102 -261
3728b61L93J08k43K00L27k98l92M87J2j45J44K19m05J30j90Q2J55J88l49l90O54
$$ -261 132 240 -3 197 524 226 -166 321 333 188 332 551 146 276 86 168 323 511 162 -228 426
3749D26R2m82p7M94n43k6N36N7l90J57r3l28N87l80k19J04j35J85m59O71p9n89
$$ 426 518 36 -41 453 -90 -116 420 477 87 244 151 -177 410 30 -189 -85 -220 -35 -494 177 98 -491
3771d91L15J33K11p94L87J80p39L04O42l94J55K04n15J96K92J96k94k76O20k58
$$ -491 -176 -43 168 -626 -239 -59 -798 -494 148 -246 -91 113 -402 -206 86 282 -12 -288 332 74
3791G4k76J89k79k82M43k63j43J0M09l98j80O89m53j40J70J81j63L7m6P2k63K67
$$ 74 -202 -13 -292 -574 -131 -394 -537 -527 -118 -516 -696 -7 -460 -600 -430 -249 -412 -375 -421 -349 -612 -345
3813c45j23J06M68m32O5P5L25j07q1J14N0m94Q99j57l11j17K27N7j81P6R9j64
$$ -345 -468 -362 106 -326 -261 -186 139 32 -49 65 115 -379 520 363 52 -65 162 219 38 114 213 49
3835D9M20n35o5N42l09l57K50L60k7o24O50L8m93K88L52m33j49J51K97O0j39l4
$$ 49 469 -66 -131 411 102 -255 -5 355 328 -296 354 392 -101 187 539 106 -43 108 405 465 326 292
3857B92l80P7L76r7n8L58k98j61L06P6m33K84k19%r1M47o9n53J69J33J24LJ66
$$ 292 -88 -11 365 268 210 568 270 109 415 491 58 342 123 123 32 479 410 -143 26 159 283 286 452
3880D52m16r3K10J75J47l12l7j62o9L60n04J92R5j36l07N96k23n08N6L97J00l34
$$ 452 36 -57 153 328 475 163 126 -36 -105 255 -249 -57 38 -98 -405 191 -32 -540 -484 -87 13 -321
3902c21J89j05l64j41N42P5j96K68l84K77J74m17O6J80mj31pM50r5m73M09j91
$$ -321 -132 -237 -601 -742 -200 -125 -321 -53 -437 -160 14 -403 -337 -157 -161 -292 -299 151 56 -417 -8 -199
3924a99J55l6K45j82n9r9N0p1l50L52l14L47L18p13J05M21r0m55M21J24o72M10
$$ -199 -44 -80 165 -17 -76 -175 -125 -196 -546 -194 -508 -161 157 -556 -451 -30 -120 -575 -154 -30 -702 -292
3946b92L83k79j47L99Nn83M91N01k09j78K03K01n1o6P7k72N82l44p0J52M11p72
$$ -292 91 -188 -335 64 69 -514 -23 478 269 91 294 495 444 378 455 183 765 421 351 503 914 142
3968A42O0L85k44k48J86K88l15m6M5O5l91J26LL22j5j65q3J90q7l2j20L96J12
$$ 142 202 587 343 95 281 569 254 208 253 318 -73 53 56 378 363 198 115 305 218 186 66 462 574
3991E74l81M18m6k26M9J47k65m45R79j28l53k62L65J20l14j8L40l52r1l00L37
$$ 574 193 611 565 339 388 535 270 -175 804 676 323 61 426 546 232 214 554 202 111 -189 148
4012A48%J78o43M37L53k94n90N70j72r14O78L99m07j31L57k99M9P4P5j77J7K78
$$ 148 148 326 -317 120 473 179 -411 159 -13 -927 -249 150 -257 -388 -31 -330 -281 -207 -132 -309 -292 -14
4034a4p2%J14n54L6O83k92m09M89K74m81k26M06J00l80l99M37L4o2J09l00L62
$$ -14 -86 -86 28 -526 -490 193 -99 -508 -19 255 -226 -452 -46 54 -326 -725 -288 -254 -316 -207 -507 -145
4056a45k19r7M4L80j54m27L21L78p97J80M89j3n64M14M10o44L7K97JJ58j31o3
$$ -145 -364 -461 -417 -37 -191 -618 -297 81 -716 -536 -47 -60 -624 -210 200 -444 -407 -110 -109 49 -82 -145
4078a45L03L0k26k22N68K15n46r6K55j02k47Q14l1n89n2N15l62j07Q6L36j76n31
$$ -145 158 188 -38 -260 308 523 -23 -119 136 34 -213 601 570 -19 -71 444 82 -25 61 397 221 -310
4100c10N98k43J98p9Q6L04k8l13j28M83j70n18P67j46k71l27L28K69n82J30P06
$$ -310 288 45 243 164 250 554 526 213 85 568 398 -120 647 501 230 -97 231 500 -82 48 754
4121G54l48k65L20k93K1P1j11j46M50k05l12M80j48m89N9O02k62n33M29K11m34
$$ 754 406 141 461 168 189 260 149 3 453 248 -64 416 268 -221 -162 440 178 -355 74 285 -149
4142a49J34K11k05r8l2K24k91L81j61O9mJ04n11J9P09o60K8L22L13m16k46N46
$$ -149 -15 196 -9 -107 -139 85 -206 175 14 83 79 183 -328 -309 400 -260 -232 90 403 -13 -259 287
4164B87k93o56N76M60m68Qo4J02l05K5J59k58L04j73k14K26L2l00L46J99l60k91
$$ 287 -6 -662 -86 374 -94 -86 -150 -48 -353 -328 -169 -427 -123 -296 -510 -284 -252 -552 -206 -7 -367 -658
4186f58L57L88n64m2L50j4m88N22J09r3J95j4J36l15J17r3L4L80n95L82J84n1
$$ -658 -301 87 -477 -519 -169 -183 -671 -149 -40 -133 62 48 184 -131 -14 -107 -73 307 -288 94 278 227
4208B27q08N74K29l63J08K39l20n28P70J09k47k05K41l18P4N29o33J85L32k29
$$ 227 -581 -7 222 -141 -33 206 -114 -642 128 237 -10 -215 26 -292 -218 311 -322 -137 195 -34
4228c4j45N33k21j76K80K80j65n62M69L42m46j92M78J38m47J75J02k39J19j27
$$ -34 -179 354 133 -43 237 517 352 -210 259 601 155 -37 441 579 132 307 409 170 289 162
4248A62j99J43M8m79N70M31l95j05L2J92j85n0K96k62k33L65K71m86M39J98n17
$$ 162 -37 106 154 -325 245 676 281 176 208 400 215 165 461 199 -34 331 602 116 555 753 236
4269B36j0m4J58k55lJ06j13P0K45n30R7O93o77k12N70j51o87K84R6M8l67L30K83
$$ 236 226 182 340 85 82 188 75 145 390 -140 -43 650 -27 -239 331 180 -507 -223 -127 -79 -446 -116 167
4292A67qQ7K37l51k29O7n6O2L10k85k51L01J67m18l47N79l56j99M90k16m55N26
$$ 167 159 246 483 132 -97 -30 -86 -24 286 1 -250 51 218 -200 -547 32 -324 -523 -33 -249 -704 -178
4314a78j26j3j06J70M3Q4m59K92r5M20n4k51j3L6k54J45N86k3m06n4K66l18N7
$$ -178 -304 -317 -423 -253 -210 -126 -585 -293 -388 32 -22 -273 -286 -250 -504 -359 227 204 -202 -256 10 -308 -251
4337b51K19j70j00l5Q3l22K43L93j30j69j08O1j68J77J56j33j81M06m8n6M09l73
$$ -251 -32 -202 -302 -337 -254 -576 -333 60 -70 -239 -347 -286 -454 -277 -121 -254 -435 -29 -77 -133 276 -97
4359i7n9K17n9r7o2M80j16l50K77o8j5K64K44n27Q4P4q7j94Q03q17J60J49J34
$$ -97 -156 61 2 -95 -157 323 207 -143 134 66 51 315 559 32 116 190 103 -91 712 -105 55 204 338
4382C38m45R7P14q03K38K35j09o3l2l7k53L65J83m36J20K15m15q9P29k79k46l4
$$ 338 -107 -10 704 -99 139 374 265 202 170 133 -120 245 428 -8 112 327 -88 -177 552 273 27 -7
4404gK83m53K03L02k35l13L3L36M7l43J21K21n43N70k89K06qj31j38R1J07k23
$$ -7 276 -177 26 328 93 -220 -187 149 196 -147 -26 195 -348 222 -67 139 131 0 -138 -47 60 -163
4426a63k79M25J33k63M59m33j16r0M00l74J22j3K0m75K79O34o59J04K72m41k94
$$ -163 -442 -17 116 -147 312 -121 -237 -327 73 -301 -179 -192 -172 -647 -368 266 -393 -289 -17 -458 -752
4447g52O09o2n56M96K81l99J15L89j28k89O95j47k64J29J98k50K3J81m15L98j01
$$ -752 -143 -205 -761 -265 16 -383 -268 121 -7 -296 399 252 -12 117 315 65 88 269 -146 252 151
4468A51m1k38L74M2m95J51j98L53o52P77j70l94K81L02k63r3k12J53J49J06L57
$$ 151 110 -128 246 288 -207 -56 -254 99 -553 224 54 -340 -59 243 -20 -113 -325 -172 -23 83 440
4489D40n64K65R2l58P4L22k67N77k65K41k84J65Pj39K13m05L51l06J39R3k37L6
$$ 440 -124 141 233 -125 -51 271 4 581 316 557 273 438 445 306 519 114 465 159 298 391 154 190
4511A90M1k10j14J12j25j47L46l28P6J9J88l70j13N42l70p9K62J56O8o66P87k57
$$ 190 231 21 -93 19 -106 -253 93 -235 -159 -140 48 -322 -435 107 -263 -342 -80 76 144 -522 265 8
4533HJ04Lk14J00M7P8J4j62J88l21rO25m09k58J49L2l21j1L75k78j98J98k0k66
$$ 8 112 115 -99 1 48 126 140 -22 166 -155 -164 461 52 -206 -57 -25 -346 -357 18 -260 -458 -260 -280 -546
4557e46K73Q7o6k04M64m54K95Kj61l66L93K99j88j10K56m41O9O50r6n34K54J49
$$ -546 -273 -186 -252 -456 8 -446 -151 -149 -310 -676 -283 16 -172 -282 -26 -467 -398 252 156 -378 -124 25
4579B5l75m6O66k99j9q0M6K88K6j02q9K66j31R4l85J98J27o61O46j7L7m94M09
$$ 25 -350 -396 270 -29 -48 -128 -82 206 232 130 41 307 176 270 -115 83 210 -451 195 178 215 -279 130
4602A30q5r0l03N48j35j18L1J25j25K5L9p5K04j7j04K56L56l35k43L26j55j11
$$ 130 45 -45 -348 200 65 -53 -22 103 -22 3 42 -33 171 154 50 306 662 327 84 410 255 144
4624A44M57N7k48n9J60k60k18K20L49m46n2j80l6L00J46o9j29k21mk41M05M18
$$ 144 601 658 410 351 511 251 33 253 602 156 104 -76 -112 188 334 265 136 -85 -89 -330 75 493
4646D93r53L70L04l70K1M23p6j57j04J01j33P3J21m6k60L92j6k10n0K56l27o2
$$ 493 -460 -90 214 -156 -135 288 212 55 -49 52 -81 -8 113 67 -193 199 183 -27 -77 179 -148 -210
4668b10L91j04o65O52Q8n81M41J20l66k54N10j73j24o6L25l73L66l68J13K21L2
$$ -210 181 77 -588 64 152 -429 12 132 -234 -488 22 -151 -275 -341 -16 -389 -23 -391 -278 -57 -25
4689b5k18K45k4P8m0J26k12r7k7R6l1k08MK19Lj91J90J3K27l40J5K23o3j67k74
$$ -25 -243 2 -22 56 16 142 -70 -167 -194 -98 -129 -337 -333 -114 -111 -302 -112 -99 128 -212 -197 26 -37 -204 -478
4714d78P3L22j29n02Q42j43l48J04L30l97N0K70M2j36R2r1N8K97l11K29L63k07
$$ -478 -405 -83 -212 -714 128 -15 -363 -259 71 -326 -276 -6 36 -100 -8 -99 -41 256 -55 174 537 330
4736C30m56J60N28l47k11K17m9k44J83K13m01k67N89q8j29M9J37l41O5J28J15
$$ 330 -126 34 562 215 4 221 172 -72 111 324 -77 -344 245 157 28 77 214 -127 -62 66 181
4757A81j80j5J58l76P48k36k87o2R08p95J7Q8r5M6o8M39j34j18J1o0J3J53L9j79
$$ 181 1 -14 144 -232 516 280 -7 -69 839 44 61 149 54 100 32 471 337 219 230 170 183 336 375 196
4781A96j71J55l18j59O17k98k21M66m31J00J6K81o77M23J77j22m91M41J17k79
$$ 196 25 180 -138 -297 320 22 -199 267 -164 -64 -48 233 -444 -21 156 34 -457 -16 101 -178
4801a78K79k48L6m8M17k78R7j11k06Q6J93j58j60J2K52J46n77K88L11l25j06K49
$$ -178 101 -147 -111 -159 258 -20 77 -34 -240 -154 39 -119 -279 -267 -15 131 -446 -158 153 -172 -278 -29
4823b9N8K7k83L28m96K06J83l47L92m6m57L48J12k34o6M08l6l60P1N17o61N9K61
$$ -29 29 56 -227 101 -395 -189 -6 -353 39 -7 -464 -116 -4 -238 -304 104 68 -292 -221 296 -365 -306 -45
4846d5m0j06L12q5l86M94m41n2K86M8j73r8K86j64o5J78R4j63M5K23j26k01K13
$$ -45 -85 -191 121 36 -350 144 -297 -349 -63 -15 -188 -286 0 -164 -229 -51 43 -120 -75 148 22 -179 34
4869C4K14k26K0M17l28r9J28N3l87K37R2j04J90j14L57n97Q09n55j84J40Q7m17
$$ 34 248 22 42 459 131 32 160 213 -174 63 155 51 241 127 484 -113 696 141 -43 97 184 -233
4891b33J85J38P4j47J02K37l00J81m8n9Q1J10m5j35K62k99j02J29K78k70j86M42
$$ -233 -48 90 164 17 119 356 56 237 189 130 211 321 276 141 403 104 2 131 409 139 -47 395
4913C95l22j07J76J44m37K60J41j11k09J68M2j31J69k01K99m76M17j61l54M75
$$ 395 73 -34 142 286 -151 109 250 139 -70 98 140 9 178 -23 276 -200 217 56 -298 177
4933A77j96n2K02j69n59P00O2n39O3O8R0J47k27M44n41L19k2m62M98J42m55J01
$$ 177 -19 -71 131 -38 -597 103 165 -374 -311 -243 -153 -6 -233 211 -330 -11 -33 -495 3 145 -310 -209
4955b09R4n9j91P6L28j69K08p1K2k18J61m6j99L02qj47J56K11m32n2L21J29r56
$$ -209 -115 -174 -365 -289 39 -130 78 7 29 -189 -28 -74 -273 29 21 -126 30 241 -191 -243 78 207 -749
4978g49N60J18j65q9K36m1k71L15p6Q2o8nO7r9K40k41N6n0L60l04L52n5j09R3
$$ -749 -189 -71 -236 -325 -89 -130 -401 -86 -162 -80 -148 -153 -86 -185 55 -186 -130 -180 180 -124 228 173 64 157
5002A57j3P0n4N5L61n34J09L06l21q3L7K78j64q9o9J32k64j56N54l64K29j64J50
$$ 157 144 214 160 215 576 42 151 457 136 53 90 368 204 115 46 178 -86 -242 312 -52 177 13 163
5025A63P8q4N3Or8j90K09RJ03k63j86O69l06j03J35j04j48K00J49l03j80L45l12
$$ 163 241 157 210 216 118 -72 137 146 249 -14 -200 469 163 60 195 91 -57 143 292 -11 -191 154 -158
5048a58R8L33n14K50M2rk40r3L76l88o9L77j49n1J17L30m89L9L83m83O54k10J37
$$ -158 -60 273 -241 9 51 42 -198 -291 85 -303 -372 5 -144 -195 -78 252 -237 -198 185 -298 356 146 283
5071B83l64L7O3j93L9K74k58o9J68J83j94j46M7k28Q5L55p3k25j4K84j52J65j91
$$ 283 -81 -44 19 -174 -135 139 -119 -188 -20 163 -31 -177 -130 -358 -273 82 9 -216 -230 54 -98 67 -124
5094a24j9K29O0k44m2L32k64m4L52j61k23K16R2k40K80j6k39K86l39R7j92J17
$$ -124 -143 86 146 -98 -140 192 -72 -116 236 75 -148 68 160 -80 200 184 -55 231 -108 -11 -203 -86
5116h6J91m2p9L60k23J37k30K06k93J3M94l95NM31j66p4K16l30j55L5k07K03P9
$$ -86 105 63 -16 344 121 258 28 234 -59 -46 448 53 58 489 323 249 465 135 -20 15 -192 11 90
5139I0kn5j64K14J65m45K27K17m75P0K06N8k50k9K66K37m62K10P9l31M51j29k95
$$ 90 88 33 -131 83 248 -197 30 247 -228 -158 48 106 -144 -173 93 330 -132 78 157 -174 277 148 -147
5162a47M12K3k99J97K86n72J79K12m42Q7N18j33l06j41R7R2l56r1L80k16l7N1
$$ -147 265 288 -11 186 472 -100 79 291 -151 -64 454 321 15 -126 -29 63 -293 -384 -4 -220 -257 -206
5184b06j14l0L05j51j44J41j65R2K16M5J44l04L09q6j77N9P8Kr1K94k45K58k00
$$ -206 -320 -350 -45 -196 -340 -199 -364 -272 -56 -11 133 -171 138 52 -125 -66 12 14 -77 217 -28 230 30
5207C0j31n4J74j40k36K08M0j73J64K7j35r5P6J44j74r8L28m7j93M14k56r7qK06
$$ 30 -101 -155 19 -121 -357 -149 -109 -282 -118 -91 -226 -321 -245 -101 -275 -373 -45 -92 -285 129 -127 -224 -232 -26
5231b6k97K18M83l47j22m1k21M53mk29J55q1M21n92K22J0K79l48j9N27m28J26
$$ -26 -323 -105 378 31 -91 -132 -353 100 96 -133 22 -59 362 -230 -8 2 281 -67 -86 441 13 139
5253A39j35rK00M4l71mpK04l40N08j59l01K62J31l2J55p1k09qK5K22m6j27J8N0
$$ 139 4 -5 195 239 -132 -136 -143 61 -279 229 70 -231 31 162 130 285 214 5 -3 22 244 198 71 89 139
5278A39k45J43J10l7J1o3K37p5j03J93r0N7l10o6J59J24k13j5L47j21l1k08K29
$$ 139 -106 37 147 110 121 58 295 220 117 310 220 277 -33 -99 60 184 -29 -44 303 182 151 -57 172
5301A72k39k43K10J69m18N98N2n5M3%m20p2K48m69N1N66j82l76J31L92k98j08
$$ 172 -67 -310 -100 69 -349 249 301 246 289 289 -131 -203 45 -424 -373 193 11 -365 -234 158 -140 -248
5323b48M69k98l75K76J27k12p1K22k79n2K87j73k39L05J96m16j01O68j10m39L85
$$ -248 221 -77 -452 -176 -49 -261 -332 -110 -389 -441 -154 -327 -566 -261 -65 -481 -582 86 -24 -463 -78
5344g8K2k47K66l1j11r1K59k64r1K76J65j88m5L56n27J20k12L32K84j88l29l3
$$ -78 -56 -303 -37 -68 -179 -270 -11 -275 -366 -90 75 -113 -158 198 -329 -209 -421 -89 195 7 -322 -355
5366c55O11j67j85p4L18q5l16k9L40r3r2M45m17J18j84J54L09j0l27Q3K36J63
$$ -355 256 89 -96 -170 148 63 -253 -282 58 -35 -127 318 -99 19 -165 -11 298 288 -39 44 280 443
5388D43l22J37j28K05l26K38K03o04O9P6K66l04PJ17m7J05j66J95N3r7P1j83M7
$$ 443 121 258 130 335 9 247 450 -154 -85 -9 257 -47 -40 77 30 135 -31 164 217 120 191 8 55
5411E5j33J79P3K3MQ6q9L9j82J87L5m48M07n4k49J05L5k20j5L78k21n5J11j0J72
$$ 55 -78 101 174 197 201 287 198 237 55 242 277 -171 236 182 -67 38 73 -147 -162 216 -5 -60 51 41 213
5436B13o3P4j74j26M33p47K72J44P7M5l59K01k4K17j34N2l09q4L63k81l6L08n0
$$ 213 150 224 50 -76 357 -390 -118 26 103 148 -211 -10 -34 183 49 101 -208 -292 71 -210 -246 62 12
5459A2p8K49j64j24lm8J19j23K35r8m3K84m42J45j11o3M45k99L1l6k07K49r3k66
$$ 12 -66 183 19 -105 -108 -156 -37 -160 75 -23 -66 218 -224 -79 -190 -253 192 -107 -76 -112 -319 -70 -163 -429
5483d29L23J68j92J09n8l40J76J75k19P9O4L8L09l03o8L16j13J90k19J2p9j60
$$ -429 -106 62 -130 -21 -79 -419 -243 -68 -287 -208 -144 -106 203 -100 -168 148 35 225 6 18 -61 -221
5505b21L24n2M8l83K42K48j60q4L0l6r6j9J58m8K14m4Kl03n9J81j79J43K21j36
$$ -221 103 51 99 -284 -42 206 46 -38 -8 -44 -140 -159 -1 -49 165 121 123 -180 -239 -58 -237 -94 127 -9
5529iJ01N5l3k60J80L07k34o2M35l35n7K52K45o25M69Pk78L4o4K21j71j29j94
$$ -9 92 147 114 -146 34 341 107 45 480 145 88 340 585 -40 429 436 158 192 128 349 178 49 -145
5552a45K19M7k62l3K49R0j73O9K9j79j24j08O96k59j22L9J98l91K03m7L10k7j11
$$ -145 74 121 -141 -174 75 165 -8 61 90 -89 -213 -321 375 116 -6 33 231 -160 43 -4 306 279 168
5575A68N0j86Q3r6k84L65K23m18J40J23l93o7N07k24j56j0J84j17mP3J3j53K03
$$ 168 218 32 115 19 -265 100 323 -95 45 168 -225 -292 215 -9 -165 -175 9 -108 -112 -39 -26 -179 24
5598B4k83J0K37j04k41J23L41l86J70r4L58k89K80j5o8l81n1M92j1m30L21l4m3
$$ 24 -259 -249 -12 -116 -357 -234 107 -279 -109 -203 155 -134 146 131 63 -318 -369 123 112 -318 3 -31 -74
5621g4L41m74j20L19l6l17O2L89k78lL39j41k8J49k4l69L91k66l7L66k42K7j99
$$ -74 267 -207 -327 -8 -44 -361 -299 90 -188 -191 148 7 -21 128 104 -265 126 -140 -177 189 -53 -26 -225
5644b25L53n5M5m1n5j75J83l8q3K00n1k38J18J25m0j09K25K1j48l6K7Q3L5M8k8
$$ -225 128 73 118 77 22 -153 30 -8 -91 109 58 -180 -62 63 23 -86 139 160 12 -24 3 86 121 169 141
5669A41j7rN8k53M6R5J71l17L03l13Q7J2LJ09k03J16p5K04m02N03m89j94O63j99
$$ 141 124 115 173 -80 -34 61 232 -85 218 -95 -8 4 7 116 -87 29 -46 158 -244 259 -230 -424 239 40
5693D0l18L55j84J2PJ26j61nK99k15J03L26q4m19k9P1J99k62J35k25M12n3j56
$$ 40 -278 77 -107 -95 -88 38 -123 -128 171 -44 59 385 301 -118 -147 -76 123 -139 -4 -229 183 130 -26
5716b6p2K6J04k16k08K05j10J04J21l98J52J43OJ35k24O1J17J43l91M21J80k19
$$ -26 -98 -72 32 -184 -392 -187 -297 -193 -72 -470 -318 -175 -169 -34 -258 -197 -80 63 -328 93 273 54
5738E4K52l10k7j40K14j81L57r8m12N63k10P1l62n9L02m07M69p8k6j1Q2o7N2J87
$$ 54 306 -4 -31 -171 43 -138 219 121 -291 272 62 133 -229 -288 14 -393 76 -2 -28 -39 43 -24 28 215
5762B15k02l23L48k9l06L98O5n7q3M32n08J19j89N39m82K47k76%J90O0J2j34L3
$$ 215 13 -310 38 9 -297 101 166 109 26 458 -50 69 -120 419 -63 184 -92 -92 98 158 170 36 69
5785F9q1l3K02j01K17k00O2Kk54mK94o2P8ol16K43L29l82j53J99jm6l06L40k79
$$ 69 -12 -45 157 56 273 73 135 137 -117 -121 173 111 189 183 -133 110 439 57 -96 103 102 56 -250 90 -189
5810a89J72K00l4k50J67k32O1j7K24k75K41j10o0j79K29K34m82K45n9M0K48l03
$$ -189 -17 183 149 -101 66 -166 -105 -122 102 -173 68 -42 -102 -281 -52 182 -300 -55 -114 -74 174 -129
5832a29K37j25j53J98j61J55j83R8m61M87L0rj40J00l00N57l71M2J44p6n4j27
$$ -129 108 -17 -170 28 -133 22 -161 -63 -524 -37 -7 -16 -156 -56 -356 201 -170 -128 16 -60 -114 -241
5854b41J32J34k16m5l0m9O8L16ml42K64J03k78M4P6l6j07K65K33k32j38lj00J43
$$ -241 -109 25 -191 -236 -266 -315 -247 69 65 -277 -13 90 -188 -144 -68 -104 -211 54 287 55 -83 -86 -186 -43
5878d3J9p6j90K21J46L8j87J75m19J68L62j79j27q5K61k00L98j42M60l89m1J76
$$ -43 -24 -100 -290 -69 77 115 -72 103 -316 -148 214 35 -92 -177 84 -116 282 140 600 211 170 346
5900C46k82m4J30n0j62O05l79M1K81k09l93J08L7K02q1J21l1n5K0j04k89M20m2
$$ 346 64 20 150 100 -62 543 164 205 486 277 -116 -8 29 231 150 271 240 185 205 101 -188 232 190
5923A90j60K90k80o6m7N2L13k97RK67j79J38j29p4Q4k9O4J4k9k3k45p0L43k83
$$ 190 30 320 40 -26 -73 -21 292 -5 4 271 92 230 101 27 111 82 146 160 131 108 -137 -207 136 -147
5947a47J38M40m55J50j3k5j41j82K51j40k05L45l50L65p7J5K1l29M28K9l9K68
$$ -147 -9 431 -24 126 113 88 -53 -235 16 -124 -329 16 -334 31 -46 -31 -10 -339 89 118 79 347
5969C47m79p7J96Oo0j47M38l68o2K76L28k82j49L5o8k3K67m04j29J20K3J11k5
$$ 347 -132 -209 -13 -7 -67 -214 224 -144 -206 70 398 116 -33 2 -66 -89 178 -226 -355 -235 -212 -101 -126
5992a26k34J16j7M06k02j98J81k25K8L07k96L11j39L74n90K18p3k5M6j4K27j80
$$ -126 -360 -244 -261 145 -57 -255 -74 -299 -271 36 -260 51 -88 286 -304 -86 -159 -184 -138 -152 75 -105
6014a05L0%l3m2L84l08k49O53n6l11j09K88j97j11K92k96O0J30j40K49j46r7J53
$$ -105 -75 -75 -108 -150 234 -74 -323 330 274 -37 -146 142 -55 -166 126 -170 -110 20 -120 129 -17 -114 39
6037C9n6J05l4n7J69k46K34n1n5K28k74M55l17j27l6J56L09m44K17j69Q7L86o48
$$ 39 -17 88 54 -3 166 -80 154 103 48 276 2 457 140 13 -23 133 442 -2 215 46 133 519 -129
6060a29K04J13qKj72J38Q1k74q1M4k4J68Jq2j13J16J6J04K45j65k78J27k06M22
$$ -129 75 188 180 182 10 148 229 -45 -126 -82 -106 62 63 -19 -132 -16 0 104 349 184 -94 33 -173 249
6084B49p7K0j69p7K58k62j70J10%K64j06p5r5k99J7M37m53J14N8L39m62R3J35
$$ 249 172 192 23 -54 204 -58 -228 -118 -118 146 40 -35 -130 -429 -412 25 -428 -314 -256 83 -379 -286 -151
6107a51p2J95O4j26k00J59p2K97k76J07k47M29k29%J43K2q5N6o4J19k8k90L10
$$ -151 -223 -28 36 -90 -290 -131 -203 94 -182 -75 -322 107 -122 -122 21 43 -42 14 -50 69 41 -249 61
6130F1j30j84K45J47n13N30j99k47L60j66J19P4j30Q4k33j0L38l81j3J03K30o2
$$ 61 -69 -253 -8 139 -374 156 -43 -290 70 -96 23 97 -33 51 -182 -192 146 -235 -248 -145 85 23
6152B3o7p9J46K84l37J76lLj79J97m1J02j01O8l45K3J97K90l76J45rj75L31OR5
$$ 23 -44 -123 23 307 -30 146 143 146 -33 164 123 225 124 192 -153 -130 67 357 -19 126 117 -58 273 279 374
6177C74k02J73l24P5J7k22P1J05L2n0k37kL92p8j52Q6K65l10p6O7lj97K30J45
$$ 374 172 345 21 96 113 -109 -38 67 99 49 -188 -190 202 124 -28 58 323 13 -63 4 1 -196 34 179
6201A79k88M40q5j92k7J59j03K6j5j69J98N9p9m2k02J64j72J19K0O1j64Q1k00
$$ 179 -109 331 246 54 27 186 83 109 94 -75 123 182 103 61 -141 23 -149 -30 -10 51 -113 -32 -232
6224b32K3l8J61l2l36N26j77j89J70L4K51k51J86j15N0mJ43m5r8j12k7J13L36
$$ -232 -209 -247 -86 -118 -454 72 -105 -294 -124 -90 161 -90 96 -19 31 27 170 125 27 -85 -112 1 337
6247C37l15Q7K35m18J07l8j45R8k4J09l19J38K34n6k85o9K91J4k04J54o9m2oK35
$$ 337 22 109 344 -74 33 -5 -150 -52 -76 33 -286 -148 86 30 -255 -324 -33 -19 -223 -69 -138 -180 -186 49
6271D9k9J13l12K27k57L83k88J05K86k27j14L21l6k00k05K46k45K80J01N9m43
$$ 49 20 133 -179 48 -209 174 -114 -9 277 50 -64 257 221 21 -184 62 -183 97 198 257 -186
6292a86J7L19l69K44J15l72LK72j86J54J43J39l95M95k29r4l29J6L88Q0l70M13
$$ -186 -169 150 -219 25 140 -232 -229 43 -143 11 154 293 -102 393 164 70 -259 -243 145 225 -145 268
6314B68j19j27K11j49J20k52j29N4K12m29J70J17J24R1k55L06o3m33L62k31j4
$$ 268 149 22 233 84 204 -48 -177 -123 89 -340 -170 -53 71 162 -93 213 150 -283 79 -152 -166
6335a66K38k2n1k94K88J14l91J13L68k30o4K03k07k49K80J20q5J88l60l4q4J48
$$ -166 72 50 -1 -295 -7 107 -284 -171 197 -33 -97 106 -101 -350 -70 50 -35 153 -207 -241 -325 -177
6357a77K15k30J54J10l90J88K91l93J3M36J60m26m2L88k43J8j90Kn3J21j80p0
$$ -177 38 -192 -38 72 -318 -130 161 -232 -219 217 377 -49 -91 297 54 72 -118 -116 -169 -48 -228 -298
6379b98M67Q4k89O6J23n17K12J07K72k71j43J55k96L80j71J80j93K56k92K53k74
$$ -298 169 253 -36 30 153 -364 -152 -45 227 -44 -187 -32 -328 52 -119 61 -132 124 -168 85 -189
6400a89J36j15K16M20o89J29P4n9k36K50N30m95j02J11j7K18l44K43O7j18K71
$$ -189 -53 -168 48 468 -221 -92 -18 -77 -313 -63 467 -28 -130 -19 -36 182 -162 81 148 30 301
6421C01k67J65j56k40l7J32M07n16M19j49j29L14r0k05J80j21q7J58k12L2o3m4
$$ 301 34 199 43 -197 -234 -102 305 -211 208 59 -70 244 154 -51 129 8 -79 79 -133 -101 -164 -208
6443b08J62J61m0l6j18%O3K63k84J03r8M07m68J81J31J00l19r8o8j0L99l73J00
$$ -208 -46 115 75 39 -79 -79 -16 247 -37 66 -32 375 -93 88 219 319 0 -98 -166 -176 223 -150 -50
6466e0L5K9j29R2J17k98J94L19n52K14j22j78K98K23q3k55J80o0J6k25j07L21
$$ -50 -15 14 -115 -23 94 -204 -10 309 -243 -29 -151 -329 -31 192 109 -146 34 -26 -10 -235 -342 -21
6488b1N4l54L39o6J47k78j14J92l9K46l39K26J56l52m9M55n35J42M1J31k07J55
$$ -21 33 -321 18 -48 99 -179 -293 -101 -140 106 -233 -7 149 -203 -252 203 -332 -190 -149 -18 -225 -70
6510g0R7j45J90p7m6J0k52O58j29j47N1k38o0R3k1j63K14K59l49J66j00J34l24
$$ -70 27 -118 72 -5 -51 -41 -293 365 236 89 140 -98 -158 -65 -86 -249 -35 224 -125 41 -59 75 -249
6533b49p8K95k84M07O1n0O8j31m3R2n7k32K96Q9k5m13M83o1OK4K2p3p4m8Q3j54
$$ -249 -327 -32 -316 91 152 102 170 39 -4 88 31 -201 95 184 159 -254 229 168 174 198 220 147 73 25 108 -46
6559d6J21k7k8j16P6K14j07o6J81p6j10Q4j87r8M16j60k60K60l09L89p9j07m1
$$ -46 75 48 20 -96 -20 194 87 21 202 126 16 100 -87 -185 231 71 -189 71 -238 151 72 -35 -76
6582g6k9M02p8k69Q2n0J58K44k67J39k40j24L89q2m4k73K65k13m2J98j74Q5J5
$$ -76 -105 297 219 -50 32 -18 140 384 117 256 16 -108 281 199 155 -118 147 -66 -108 90 -84 1 16
6605A6k5j26J91r7r7j2P1o5k02K51K81j57j15N9L0k08J60K60k8l68k17J89L05
$$ 16 -9 -135 56 -41 -138 -150 -79 -144 -346 -95 186 29 -86 -27 3 -205 -45 215 187 -181 -398 -209 96
6628I6O7l68k2JK24K05m45R4r3N14m31N5j29J06Q8l4r9J77l9Q4n12J52K40J26
$$ 96 163 -205 -227 -226 -2 203 -242 -148 -241 273 -158 -103 -232 -126 -38 -72 -171 6 -33 51 -461 -309 -69 57
6652E7j00r3J42j15R3O5j13J41K36j6j91j53M55j37m30K12J50p8j32K38l11M5
$$ 57 -43 -136 6 -109 -16 49 -64 77 313 297 106 -47 408 271 -159 53 203 125 -7 231 -80 -35
6674c5N5j52J98r2P7k97M56j83j64l1J87j08J21jQ5m0J25j08L4L03n52J79K68
$$ -35 20 -132 66 -26 51 -246 210 27 -137 -168 19 -89 32 31 116 76 201 93 127 430 -122 57 325
6697C25j74q3k16K22KK83j46l21O1K18Q3k03Q9k58K53kj79m5L25j02j49J16k40
$$ 325 151 68 -148 74 76 359 213 -108 -47 171 254 51 140 -118 135 133 -46 -91 234 132 -17 99 -141
6720a41K29p6j42J31J63n26K55r4K01Q4j31J23k02K38j40J13l16J23J50mj41L9
$$ -141 88 12 -130 1 164 -362 -107 -201 0 84 -47 76 -126 112 -28 85 -231 -108 42 38 -103 -64
6742f4k75K99P4K75j59p6j86k25K50L4J60j98l4J81O0M1k40Q3k39J64j17k72O55
$$ -64 -339 -40 34 309 150 74 -112 -337 -87 -53 107 -91 -125 56 116 157 -83 0 -239 -75 -192 -464 191
6765A91n09Q4J65l3N1Q1O5k61N0j90L58L15j31l67J45k33L6J48k03J76K64j04
$$ 191 -318 -234 -69 -102 -51 30 95 -166 -116 -306 52 367 236 -131 14 -219 -183 -35 -238 -62 202 98
6787I8K2J01j26N9m04K44L1k11J08j43K40P6P7m57J76k35J63J75j10N7K63M4l93
$$ 98 120 221 95 154 -250 -6 25 -186 -78 -221 19 95 172 -285 -109 -344 -181 -6 -116 -59 204 248 -145
6810a45K20J09m43K51q7j55O66l57K71m10j95L40L5j54j51J62K75Lk36j27K17
$$ -145 75 184 -259 -8 -95 -250 416 59 330 -80 -275 65 100 -54 -205 -43 232 235 -1 -128 89
6831H9j47J2K63r9l47K22J09N0l04j01L08k13J06O4O9O4m01M00r9P0q3l2l8J39
$$ 89 -58 -46 217 118 -229 -7 102 152 -152 -253 55 -158 -52 12 81 145 -256 144 45 115 32 0 -38 101
6855A01m9j00L01k89k42l6L09M6k36j44L69m2k49K17K09j97Kk03J52K52k37P1
$$ 101 52 -48 253 -36 -278 -314 -5 41 -195 -339 30 -12 -261 -44 165 -32 -30 -233 -81 171 -66 5
6877Ek21L57lm16L18k5R5P7j33k49K06j2j26J59j27J13r2j45K95l21J41K54n94
$$ 5 -216 141 138 -278 40 15 110 187 54 -195 11 -1 -127 32 -95 18 -74 -219 76 -245 -104 150 -444
6900d44N34l88J42J01l7N7P4k1j20R5j45m5R1J79J12N3k30Q9k80L04k95J00J47
$$ -444 90 -298 -156 -55 -92 -35 39 18 -102 -7 -152 -197 -106 73 185 238 8 97 -183 121 -174 -74 73
6923G3P7k81l4J84J52j52J82j86j73q0N9J52j96R0J52l7o6o5K02J93j62j24J80
$$ 73 150 -131 -165 19 171 19 201 15 -158 -238 -179 -27 -223 -133 19 -18 -84 -149 53 246 84 -40 140
6946A40l80J22J58k11J14M38k90j20J10J71l72j34L17j14J02q3n4K50j86K5J18
$$ 140 -240 -118 40 -171 -57 381 91 -29 81 252 -120 -254 63 -51 51 -32 -86 164 -22 3 121
6967A21o6O1j70j15N4J53j16l16N71k78M3jK94p30Q34k81j03K17J36j41J16K1
$$ 121 55 116 -54 -169 -115 38 -78 -394 177 -101 -58 -59 235 -495 339 58 -45 172 308 167 283 304
6989C04m54K33J33k38j74L32q4J55p9j97P1k72J40L27j12q5mj33M50o4l22J53
$$ 304 -150 83 216 -22 -196 136 52 207 128 -69 2 -270 -130 197 85 0 -4 -137 313 249 -73 80
7011H0n02K33J57O8l7m1J37J63l69K56q6Q8p9k04M6K91k22m4j07K55j32J56m6
$$ 80 -422 -189 -32 36 -1 -42 95 258 -111 145 59 147 68 -136 -90 201 -21 -65 -172 83 -49 107 61
7034F1p2j31L60j33J04l07J82k73L90J09p1l45K23j84L08l01P5L54k03k14k6J61
$$ 61 -11 -142 218 85 189 -118 64 -209 181 290 219 -126 97 -87 221 -80 -5 349 146 -68 -94 67
7056F7k54L64k08Mj73L45k9j03k74M70j63k09N52m93J47K3J45l18J50K9L03m62
$$ 67 -187 177 -31 -27 -200 145 116 13 -261 209 46 -163 389 -104 43 66 211 -107 43 72 375 -87
7078h7J7L01l4j72J48j13K6L9J3j3l19K09J96j16j06j53L98K3l63J55Rl31oL67
$$ -87 -70 231 197 25 173 60 86 125 138 125 -194 15 211 95 -11 -164 234 257 -106 49 58 -273 -279 88
7102H8J2Qk29K49r3j48J06P7M0l55N82l31m18O77l41J98n2k03J16m4J7k80M25
$$ 88 100 108 -121 128 35 -113 -7 70 110 -245 337 6 -412 265 -76 122 70 -133 -17 -61 -44 -324 101
7125A01OJ1j72q7J52l61J02M79Ok22j17qj21K57q4R3j41L01k29J02k64n6J76K00
$$ 101 107 118 -54 -141 11 -350 -248 231 237 15 -102 -110 -231 26 -58 35 -106 195 -34 68 -196 -252 -76 124
7149A24l7k44J19j55K6N6M06j7m91M7L34l1j97j7J19j12R4k12M62k79l46M49L0
$$ 124 87 -157 -38 -193 -167 -111 295 278 -213 -166 168 137 -60 -77 42 -70 24 -188 274 -5 -351 98 128
7172A28l05J93j59J87j13J30J1J1J00l21L20K0J00j54r1j47L68m71K16J21l4j83
$$ 128 -177 16 -143 44 -69 61 72 83 183 -138 182 202 302 148 57 -90 278 -193 23 144 110 -73
7194g3L93j04k74j33L12k1j69K05j57K95j09p4j30K58l01K75k93J52l33NJ88j11
$$ -73 320 216 -58 -191 121 100 -69 136 -21 274 165 91 -39 219 -82 193 -100 52 -281 -276 -88 -199
7216a99K19k23L20O1N9l41L6j24K99r1O0n9P2J62j09M4k57L58m58M6K70j1J46
$$ -199 20 -203 117 178 237 -104 -68 -192 107 16 76 17 89 251 142 186 -71 287 -171 -125 145 134 280
7239B80m91K34Lj31J98O5L7j50k12K07O6j5n04M03K00j62M2j46ML1j5J1M55j43
$$ 280 -211 23 26 -105 93 158 195 45 -167 40 106 91 -413 -10 190 28 70 -76 -72 -41 -56 -45 410 267
7263B67n21J98m09O7L48p7K46P4m29J57J4k86M57k18J14j49J87j7L3k34J45l5
$$ 267 -254 -56 -465 -398 -50 -127 119 193 -236 -79 -65 -351 106 -112 2 -147 40 23 56 -178 -33 -68
7285f8J72k55J71P3j14K31j49j34M07j89P2n6j87J90n3k98K29J36k04L3NMML2
$$ -68 104 -151 20 93 -21 210 61 -73 334 145 217 161 -26 164 111 -187 42 178 -26 7 12 16 20 52
7309E2K00p1l56L9j05K45K6P7j7j11N8j82R2K85j12j53P4pK45k12P2j93k2J98
$$ 52 252 181 -175 -136 -241 4 30 107 90 -21 37 -145 -53 232 120 -33 41 34 279 67 139 -54 -76 122
7333A22n4J0j37K50q3k07K56k43k78J30L48J0j76P1k6j95N94l88JJ60m3l39M28
$$ 122 68 78 -59 191 108 -99 157 -86 -364 -234 114 124 -52 19 -7 -202 392 4 5 165 122 -217 211
7356B11j07j98K31m5K94m76K03k89K54k27K6J66l5o2J16QJ96k10l28N5J90M22
$$ 211 104 -94 137 92 386 -90 113 -176 78 -149 -123 43 8 -54 62 70 266 56 -272 -217 -27 395
7378C95m41O1MK0j2m9l76O26l7l51L35l60PK81j69J46j18J15J03p3J36l90L40
$$ 395 -46 15 19 39 27 -22 -398 228 191 -160 175 -185 -178 103 -66 80 -38 77 180 107 243 -147 193
7401A93n2l32L24o3Q8j05j63K72j78K5k73K70j88J83Jp3K28l67M45k60l07J68
$$ 193 141 -191 133 70 158 53 -110 162 -16 9 -264 6 -182 1 2 -71 157 -210 235 -25 -332 -164
7423a64J15j10PJ38k4J53m1K1j23J13P9j13L9l37L14J02l1l40K96Q4j59k94K47
$$ -164 -49 -159 -152 -14 -38 115 74 95 -28 85 164 51 90 -247 67 169 138 -202 94 178 19 -275 -28
7446b8J06j54K69k13J00k81L35o7j54J68j12J70k81J54n4J15o8r9J27j78N60l04
$$ -28 78 -76 193 -20 80 -201 134 67 -87 81 -31 139 -142 12 -42 73 5 -94 33 -145 415 111
7468A11k77K87Q9k34J06N3l30O1l9L50M7k29o0rM5r5J54j56Q2J47J28p2k89J24
$$ 111 -166 121 210 -24 82 135 -195 -134 -173 177 224 -5 -65 -74 -29 -124 30 -126 -44 103 231 159 -130 -6
7492fK58k39p2M3J39k18O7j19J54l65M21l6L48l34k28K99Q8l17P0n1J45j94J34
$$ -6 252 13 -59 -16 123 -95 -28 -147 7 -358 63 27 375 41 -187 112 200 -117 -47 -98 47 -147 -13
7515a3l93K09J30l44K04m6J15L12j01j15R7J02j23J09j2k82J23j16J08K27j76
$$ -13 -406 -197 -67 -411 -207 -253 -138 174 73 -42 55 157 34 143 131 -151 -28 -144 -36 191 15
7536A5j12M3J32Kj31K22j59j38K7R4j35L38l31M5J09Q2j11l21J04M88n27J67m
$$ 15 -97 -54 78 80 -51 171 12 -126 -99 -5 -140 198 -133 -88 21 103 -8 -329 -225 263 -264 -97 -101
7559a01L35j00k92J69M3j38L1n1r5K72M3j23L3M4Lj45K40m62N3L45q9j31J16k43
$$ -101 234 134 -158 11 54 -84 -53 -104 -199 73 116 -7 26 70 73 -72 168 -294 -241 104 15 -116 0 -243
7583b43J69K12J66k72L3N0j82Q5q3J29L8L1l81K53K87j96m4k70K46K06j52j50
$$ -243 -74 138 304 32 65 115 -67 18 -65 64 102 133 -248 5 292 96 52 -218 28 234 82 -68
7605f8L29m50L74k3l62L56j87l1N8J43l43P23k93l82J91K02l5k29R5o6J43O4k83
$$ -68 261 -189 185 162 -200 156 -31 -62 -4 139 -204 519 226 -156 35 237 202 -27 68 2 145 209 -74
7628g4j45L58l58K88J09k00K04J05j33k38j16K7K53j4m4j17K16L4o1J2l78K59
$$ -74 -219 139 -219 69 178 -22 182 287 154 -84 -200 -173 80 66 22 -95 121 155 94 106 -272 -13
7650a3J5q5J74m4K9J42k8k13j84J74J64k59LJ36p7k52L59J31l44L05p0k93KL75
$$ -13 2 -83 91 47 76 218 190 -23 -207 -33 131 -128 -125 11 -66 -318 41 172 -172 133 63 -230 -228 147
7674A47k32NQ3J07k04K24N4j09m02J58M27k27J18l0k3L4j52p4M9p5m0L16m5r4
$$ 147 -85 -80 3 110 -94 130 184 75 -327 -169 258 31 149 119 96 130 -22 -96 -47 -122 -162 154 109 15
7698A5j27o9Q4N0J43L3m9j22K36qj76j82K25N4K7m91L54J17o2n6J69J13l45M18
$$ 15 -112 -181 -97 -47 96 129 80 -42 194 186 10 -172 53 107 134 -357 -3 114 52 -4 165 278 -67 351
7722C51n32L93j28L5k4l17K97m7L2l96M47j04J17J83j95J25l88J92JRj14L77l08
$$ 351 -181 212 84 119 95 -222 75 28 60 -336 111 7 124 307 112 237 -151 41 42 51 -63 314 6
7745Fj37Q5j07p3K24K0j37J46K04J61l56J9J57j73j66m8J70m0N3j70P8J82l8k93
$$ 6 -131 -46 -153 -226 -2 18 -119 27 231 392 36 55 212 39 -127 -175 -5 -45 8 -162 -84 98 60 -233
7769b33N14k95K53l76O6J55J9k84K37p6k64M09k9l20K42p1j83K28K41l52K2k99
$$ -233 281 -14 239 -137 -71 84 103 -181 56 -20 -284 125 96 -224 18 -53 -236 -8 233 -119 -97 -396
7791c96K90J79J21j29l34M45L01m67K94L5m27Q7J17k65J91l9K3Q5k65q3J56J04
$$ -396 -106 73 194 65 -269 176 477 10 304 339 -88 -1 116 -149 42 3 26 111 -154 -237 -81 23
7813B3m2N2lJ9j37n2J7J64j74L13k9l38L02l34K31J88l64L1K59j29j05L91j52
$$ 23 -19 33 30 49 -88 -140 -123 41 -133 180 151 -187 115 -219 12 200 -164 -133 126 -3 -108 283 131
7836A31q2k19K72k38K98N1k59J70l16M11k68P8j6l0J22j7o2M3j34K59q2j89J50
$$ 131 49 -170 102 -136 162 213 -46 124 -192 219 -49 29 13 -17 105 88 26 69 -65 194 112 -77 73
7859G3P9J4k5l19J65L23l16rK38j31j17J2L18j41O5j62J50j15K5k80O4K07k59
$$ 73 152 166 141 -178 -13 310 -6 -15 223 92 -25 -13 305 164 229 67 217 102 127 -153 -89 118 -141
7882a41K66l53L32k6J9K78l19q8pj69M78l86j79r9K42K3L3k0m6K73n0k44J41O8
$$ -141 125 -228 104 78 97 375 56 -32 -39 -208 270 -116 -295 -394 -152 -129 -96 -116 -162 111 61 -183 -42 26
7906B6N1j54K26M0K1J90n45o4J79J90j02j93J83J10R3m13N5K48k76J44K7j41j42
$$ 26 77 -77 149 189 210 400 -145 -209 -30 160 58 -135 48 158 251 -162 -107 141 -135 9 36 -105 -247
7929b47J60K48l48k1M30k66n4J12K23M7k99QJ72k5j74j4j39M56l13o7K7J40N2
$$ -247 -87 161 -187 -208 222 -44 -98 14 237 284 -15 -7 165 140 -34 -48 -187 269 -44 -111 -84 56 108
7952A08j08J00j42K1R3o6j3R5o2J47j12K36k01j01K4l34L10J97l02p4K63q7j4
$$ 108 0 100 -42 -21 72 6 -7 88 26 173 61 297 96 -5 19 -315 -5 192 -110 -184 79 -8 -22
7975b2J97j07n7O3r3p5J43J53k14K00j13qj61j73L67m5L6Lk29J84k06R0K96m00
$$ -22 175 68 11 74 -19 -94 49 202 -12 188 75 67 -94 -267 100 55 91 94 -135 49 -157 -67 229 -171
7999a71K61ro7k25J18N9R8l7K94k73l37L96J59l20O6J01l71J78l8K13r2k38M41
$$ -171 90 81 14 -211 -93 -34 64 27 321 48 -289 107 266 -54 12 113 -258 -80 -118 95 3 -235 206
8022B06n9j65N6M0l26K67P1l74J64K36j65o6j88O02n06N98n33L1O4J08J98j57
$$ 206 147 -18 38 78 -248 19 90 -284 -120 116 -49 -115 -303 299 -207 391 -142 -111 -47 61 259 102
8044A02j38j60O7J56P0J27k79K36n22L78J70k02O0J21k30q6J16J75m1j45R6k31
$$ 102 -36 -196 -129 27 97 224 -55 181 -341 37 207 5 65 186 -44 -130 -14 161 120 -25 71 -160
8066a60L98p2J26m07M5J23j58J30l2Q1l23J96K50m31K47M0J05j19j4j64L9RR4
$$ -160 238 166 292 -115 -70 53 -105 25 -7 74 -249 -53 197 -234 13 53 158 39 25 -139 -100 -91 3
8089CQ6j48j78J31o9K58l15J82j59P3N2J00o8J1K7j36J62j39K47k42L95j42J42
$$ 3 89 -59 -237 -106 -175 83 -232 -50 -209 -136 -84 16 -52 -41 -14 -150 12 -127 120 -122 273 131 273
8112B73l27L16j64p2j14O2J64K8j06N6J6m06K51J18L9Q5k44j5l32M35r4m5K81
$$ 273 -54 262 98 26 -88 -26 138 166 60 116 132 -274 -23 95 134 219 -25 -40 -372 63 -31 -76 205
8135B05k49J15j66M10j47p6j34J06j39r9Q3L03k48Nk98M19k2n4K98k15k04J81
$$ 205 -44 71 -95 315 168 92 -42 64 -75 -174 -91 212 -36 -31 -329 90 68 14 312 97 -107 74
8157G4j23J7m0Q6j98J31Q7Q9k0J46K3m56K71p5K06l51j60J63J36J12r2j95K85
$$ 74 -49 -32 -72 14 -184 -53 34 123 103 249 272 -184 87 12 218 -133 -293 -130 6 118 26 -169 116
8180A16N7j76j50K15rk11O1K60Nk05J78
$$ 116 173 -3 -153 62 53 -158 -97 163 168 -37 141
8191A41
$$ Imaginary data points
##PAGE= N=2
##DATA TABLE= (X++(I..I)), XYDATA
0@%%%%%%%%Qj6J6j6J6k4L2l3M1m9N7p2Q4r4J09j27J48j70J94k20K48k83L21l59
$$ 0 0 0 0 0 0 0 0 0 8 -8 8 -8 8 -16 16 -17 24 -25 32 -40 44 -50 59 -68 80 -90 104 -116 132 -151 170 -189
32a89M02m51N04n62O25o96P73q54R45j048J161j285J424j580J755j953K180k443
$$ -189 213 -238 266 -296 329 -367 406 -448 497 -551 610 -675 749 -831 924 -1029 1151 -1292
50a292K750l117L566m127M850n823P215r387J3275k2364Q2895M6317j36082P503
$$ -1292 1458 -1659 1907 -2220 2630 -3193 4022 -5365 7910 -14454 68441 114758 -21324 -13821
64a3821P2690Q043o9119O316M1372j1842n5279O134M2681M506m1848j1080K0300
$$ -13821 58869 66912 -2207 4109 45481 33639 -21640 -15506 27175 31681 -10167 -21247 -947
77i47N683j0019R872j454k3660L272M0136k575m1176L004M0924n955l1853J3974
$$ -947 4736 -5283 4589 3135 -20525 -17253 22883 20308 -20868 -17864 23060 17105 -14748 -774
91g74L0104j8571l2225J5123L5149o504l7053q515K6566J1194j9420j1580O825
$$ -774 29330 10759 -21466 -6343 28806 22302 -14751 -23266 3300 14494 -4926 -16506 -9681
104i681m634q692J1905Q999j9106j2805J0930L066n522J2019P385k4543j6362
$$ -9681 -14315 -23007 -11102 -2103 -21209 -34014 -23084 -20018 -25540 -13521 -6136 -30679 -47041
117d7041K5025K5766r689k0729r82J2548N619j959M203N654r315j2400J2768J9602
$$ -47041 -22016 3750 -5939 -26668 -27650 -15102 -9483 -11442 -7239 -1585 -10900 -23300 -10532 9070
131I070q223j5436P503O304r739M828J6231j0931k2491J1473K5354n779k3608
$$ 9070 847 -14589 -7086 -782 -10521 -5693 10538 -393 -22884 -11411 13943 8164 -15444
144a5444R47J7793L052j2822j377J4046r40j9868J660K8475J941l0123o031K4518
$$ -15444 -14497 3296 6348 -6474 -7851 6195 5255 -14613 -12953 15522 17463 -12660 -18691 5827
158E827N147j4075K122N232j1656l962J6668O746j4405j0159P016Q100l242l152
$$ 5827 10974 -3101 -979 4253 -7403 -11365 5303 12049 -2356 -12515 -5499 2601 -641 -3793
172c793O929J034j6551n549K5765J3701k6115j7897K2569J5174j7709o362J6775
$$ -3793 3136 4170 -12381 -17930 7835 21536 -4579 -22476 93 15267 -2442 -8804 7971
185G971L72j8103J107J7850K417j4758p375Q549P973n281o176L742Q57p730K899
$$ 7971 8343 -9760 -8653 9197 11614 -3144 -10519 -1970 6003 722 -5454 -1712 -855 -8585 -5686
200e686J2491o161j6206O750J5383o880r627R114M544j1121n77J4192L053j0603
$$ -5686 6805 644 -15562 -8812 6571 -309 -9936 -822 3722 -7399 -7976 6216 9269 -1334
214a334o417O532R427R56p631k621N316nk848O058K868r690m405Q163K525m101
$$ -1334 -7751 -1219 8208 9164 1533 -1088 4228 4223 1375 7433 10301 611 -3794 4369 6894 2793
230B793K522p89q726J228J1579n20j0019K73M576l84o5J865M8j961j419K27M770
$$ 2793 5315 4526 -4200 -2972 8607 8087 -1932 -1659 2917 2533 2468 4333 4381 2420 1001 1228 5998
247E998L083o779m318P431K624p261R58N500n975o108Q196L864r384m482O204
$$ 5998 9081 2302 -2016 5415 8039 778 1736 7236 1261 -4847 3349 7213 -2171 -6653 -449
262d49O78m236k90J444j228k548j181L454L795n133p329O978P492o987m909Q786
$$ -449 229 -4007 -4297 -2853 -4081 -6629 -7810 -4356 -561 -5694 -13023 -6045 1447 -5540 -10449 -1663
278a663K076r532K034J0592k863q656K593O162p96l617n24K123R85l857j483N510
$$ -1663 413 -9119 -7085 3507 644 -8012 -5419 743 -53 -3670 -4194 -2071 -1086 -4943 -6426 -916
294i16J547q839k450R601Q69r986J562P815m162n674N859M264m943k104M079J956
$$ -916 631 -8208 -10658 -1057 -188 -10174 -8612 -797 -4959 -10633 -4774 -510 -5453 -7557 -3478 -1522
310a522j0r22j88K923K344k978o05O604q5n903K972O043l847l906M896K022m347
$$ -1522 -1532 -2454 -2642 281 2625 -353 -958 5646 5561 -342 2630 8673 4826 920 5816 7838 3491
327C491J42K424j336j251J756k000j50K311k400k352L799J437n194r0M502j608
$$ 3491 3633 6057 4721 3470 5226 3226 3076 5387 2987 635 4434 5871 677 587 5089 3481
343C481k937K901J360k834O47J754j573J163J689l112J66M005j294l987K988L407
$$ 3481 544 3445 4805 1971 2618 4372 2799 3962 5651 2539 2705 6710 5416 1429 4417 7824
359G824m823j329M140q78l657J675J467k602l19L05j510Q54J056l509j524L793
$$ 7824 3001 1672 5812 4934 1277 2952 4419 1817 1498 1803 293 1147 2203 -1306 -2830 963
375I63q86m389K389K911m840k275N101J60l778R91J334j602N05Q75p99O80J555
$$ 963 77 -4312 -1923 988 -3852 -6127 -1026 -866 -4644 -3653 -2319 -3921 -3416 -2541 -3340 -2660 -1105
392a105l245o53N095j30n344K132M208m203k032M406N74l698K69J974q69o81K34
$$ -1105 -4350 -5003 92 -38 -5382 -3250 958 -3245 -5277 -871 -297 -3995 -3726 -1752 -2621 -3302 -3068
409c068j133Q76J624l176j169M460n40m515K041M461l873k346M580J874l991M73
$$ -3068 -4201 -3325 -1701 -4877 -6046 -1586 -2126 -6641 -4600 -139 -4012 -6358 -1778 96 -3895 -3422
425c422K453j061L11J703p29R0J736j720p85M172J71m623J530L892k911k253M064
$$ -3422 -969 -2030 -1719 -16 -745 -655 1081 -639 -1424 2748 2919 -1704 -174 3718 807 -1446 2618
442B618N70l331M18K028j272j51J401j365m13K591j157k145L352J648l937J88
$$ 2618 3188 -143 275 2303 1031 880 2281 916 503 3094 1937 -208 3144 4792 855 1043
458A043L677j481k407L148J137k529m18J475k98P75J144l328l95L008j030l204
$$ 1043 4720 3239 832 3980 5117 2588 2170 3645 3347 4122 5266 1938 1543 4551 3521 317
474C17K949K003n551j037N466k84m380Q54J630j398k74P85j84P8k56k172J659
$$ 317 3266 5269 -282 -1319 4147 3863 -517 337 1967 569 295 1080 896 974 718 -1454 205
491B05L571l299m087M314L324n534j613N034r16n552K502L844k849l355P38J908
$$ 205 3776 477 -3610 704 4028 -1506 -3119 1915 999 -4553 -2051 1793 -1056 -4411 -3673 -1765
507a765J68j325k282P56K296k343q81M212N72p322O10Q234m42o498K473M172l829
$$ -1765 -1597 -2922 -5204 -4448 -2152 -4495 -5376 -1164 -592 -7914 -7304 930 488 -6010 -3537 635 -3194
524c194j603N040J950l991k287J805L232P37l194k021K952P2l331K492L918n065
$$ -3194 -4797 243 2193 -1798 -4085 -2280 952 1689 -1505 -3526 -574 -502 -3833 -1341 2577 -2488
540b488m223N614L728m980j283M355j222k469M441L479l772k589K969L816J061
$$ -2488 -6711 -1097 2631 -2349 -3632 723 -499 -2968 1473 4952 1180 -1409 1560 5376 6437
555F437j227j708J525K683j414P92L666k677o038L531O327l962m446K437p75m201
$$ 6437 5210 3502 5027 7710 6296 7088 10754 8077 2039 5570 11897 7935 3489 5926 5151 950
571I50L145M099n672o106L262L943k222k202M67N04j520j021L188M796k752q102
$$ 950 4095 8194 2522 -3584 -322 3621 1399 -803 -336 168 -1352 -2373 815 5611 2859 -5243
587e243L741R901j535p106L597M422m895m20P657l27r193m73O887k23n018m50
$$ -5243 -1502 8399 6864 -242 3355 7777 2882 2462 10119 9792 599 126 7013 6790 1772 1322
603A322J052l086l569K027M838m425j0600M70J1206p96j2531N39R522l891q296
$$ 1322 2374 -712 -4281 -2254 2584 -1841 -12441 -11971 -765 -1561 -14092 -13553 -4031 -7922 -16218
618a6218Q080Q016q499p791Q077Q026k406m608J666K699L05K08M595J464o884
$$ -16218 -8138 -122 -8621 -16412 -8335 -309 -2715 -7323 -5657 -2958 -2653 -2445 2150 3614 -3270
633c270l182R255N134r029l725Q014l21r555L098J0827n956j3139L585J1692j168
$$ -3270 -6452 2803 7937 -1092 -4817 3197 2876 -6679 -3581 7246 1290 -11849 -8264 3428 2260
648B260r423j485N198Q87l112O42M172j324o358K238Q823r18o519K534L664l833
$$ 2260 -7163 -8648 -3450 -2563 -5675 -5033 -861 -2185 -8543 -6305 2518 1600 -4919 -2385 1279 -2554
664b554J379R280k507j1471K778J2561m61r407K94O219n92m088J673N875j569
$$ -2554 -1175 8105 5598 -5873 -3095 9466 9005 -402 -108 6111 5519 1431 3104 8979 7410
679G410r001o75J0126K975r387l455N794K6k416M240N83q588j360R046Q54p974
$$ 7410 -1591 -2266 7860 10835 1448 -2007 3787 3813 1397 5637 6220 -2368 -3728 5318 6172 -1802
695a802L31N072l153n810M978P248m484j0249K5J2343K759j1310l823R804K175
$$ -1802 -1471 3601 448 -5362 -384 6864 2380 -7869 -7844 4499 7258 -4052 -7875 1929 4104
710D104q486K022R337m545r167O173Q374l881m555L176J067l715K604N653j686
$$ 4104 -4382 -2360 6977 2432 -6735 -562 7812 3931 -624 2552 3619 -96 2508 8161 6475
725F475q783j191R303M292r861n813Q750L287j0350k142J1875r5j5069p05J3517
$$ 6475 -2308 -3499 5804 10096 235 -5578 3172 6459 -3891 -6033 5842 5747 -9322 -10027 3490
740C490J337j0919j810O223O51k661J275K764k471l410L069O369j655n828K138
$$ 3490 4827 -6092 -7902 -1679 -1028 -3689 -2414 350 -2121 -5531 -2462 3907 2252 -3576 -1438
755a438N757m093l322Q085L373j1987m222J2804M516j1208n164P690K438o210
$$ -1438 4319 226 -3096 4989 8362 -3625 -7847 4957 9473 -1735 -6899 791 3229 -2981
769b981j565M744j81o040k130N305L712n601m791L890K882l651J520L903m854
$$ -2981 -4546 198 17 -6023 -8153 -2848 864 -4737 -9528 -5638 -2756 -6407 -4887 -984 -5838
784e838m793P545N757p412m023O436K486n787l2N917qo293j883N749L923n212
$$ -5838 -10631 -3086 2671 -4741 -8764 -2328 158 -5629 -5661 256 248 -6045 -7928 -2179 1744 -3468
800c468n537L583M694m210k413M507O7o375J765P335k590n936M017L702m188k93
$$ -3468 -9005 -5422 -728 -4938 -7351 -2844 -2777 -9152 -7387 -52 -2642 -8578 -4561 -859 -5047 -5340
816e340N844J195n833r34O016L939l925m245L981M472l182m306N777L680p441
$$ -5340 504 1699 -4134 -5068 948 4887 962 -3283 698 5170 1988 -2318 3459 7139 -302
831c02l452Q202K326p866j770O616p34n321K492L520k877m226L469M438j874l794
$$ -302 -3754 4448 6774 -1092 -2862 3754 3020 -2301 191 3711 834 -3392 77 4515 2641 -1153
847a153J140N365p25n106L057O508l883o238O244O923o347n021O642L347n914
$$ -1153 -13 5352 4627 -479 2578 9086 5203 -1035 5209 12132 5785 764 7406 10753 4839
862D839j283M886J14n108l82L462K57m037k002K888J377m216k363N023O8o383
$$ 4839 3556 8442 8556 3448 3066 6528 6785 2748 746 3634 5011 795 -1568 3455 3523 -2860
878b860L95O307k232n961L009M599l752k869M078J972l303r02K568R52j109j170
$$ -2860 -2465 3842 1610 -4351 -1342 3257 -495 -3364 714 2686 -617 -1519 1049 2001 892 -278
894b78Q82K327j730k424K113K711l324k288L776O43n001M82M078k325l841K154
$$ -278 604 2931 1201 -1223 890 3601 277 -2011 1765 2408 -2593 -2111 1967 -358 -4199 -2045
910b045K113k896p99J736j28k170P55P33O56n42j628J217K020j275j846K479K053
$$ -2045 68 -2828 -3627 -1891 -2019 -4189 -3434 -2701 -2045 -2587 -4215 -2998 -978 -2253 -4099 -1620 433
927D33l339l98M372k43m056J693L908j675k358K212J032j885J46J375N62j119
$$ 433 -2906 -3304 1068 825 -3231 -1538 2370 695 -1663 549 1581 -304 -158 1217 1779 660
943F60j173M03J953J62k471j0K762j719k532L179K263m706j208M062J390l571
$$ 660 -513 -110 1843 2005 -466 -476 2286 567 -1965 1214 3477 -1229 -2437 1625 3015 -556
959e56M59J741p84j081J191Q04r6j201p40J935K086j776k486K254J750k447j74
$$ -556 -97 1644 860 -221 970 1774 1678 477 -263 1672 3758 1982 -504 1750 3500 1053 879
976H79L314j662l480J860L035j533j717R80n1n40L00N12p10l90q26m61K032R50
$$ 879 4193 2531 -949 911 3946 2413 696 1676 1625 1085 1385 1897 1187 797 -29 -490 1542 2492
994B492l591q87L136o01j799J909M57k848k55K817q2j616N44n27p64J802P63j661
$$ 2492 -1099 -1986 1150 549 -1250 659 1116 -1732 -1987 830 748 -868 -324 -851 -1615 187 950 -711
1012g11o52R59o58K10K161j355k415J220J402j007L11O85k066o94K259L50j690
$$ -711 -1363 -404 -1062 -852 1309 -46 -2461 -1241 161 -846 -535 150 -1916 -2610 -351 -1 -1691
1029a691K79M51j671P28K327j141k327R26R33p83R74K62j572k50J203o7K13P61
$$ -1691 -1412 -961 -2632 -1904 423 -718 -3045 -2119 -1186 -1969 -995 -733 -2305 -2555 -1352 -1419 -1206 -445
1047d45j474j400K620J269j857j48J362q45r69K527M13j990o04J931N9J9O31j059
$$ -445 -1919 -3319 -699 570 -1287 -1435 -73 -918 -1887 640 1053 -937 -1541 390 449 468 1099 40
1065D0p67J460L06q85O68N6k219N13K785o78k454Q26O78j224O19J759j250j492
$$ 40 -727 733 1039 154 822 878 -1341 -828 1957 1279 -1175 -349 329 -895 -276 1483 233 -1259
1083a259R11P54j65R11l31j943J470J758j286l28J561n03j175K069R69k234k01
$$ -1259 -348 406 241 1152 821 -1122 348 2106 820 492 2053 1550 375 2444 3413 1179 978
1100I78J704n39m21J191p58j547P50L34o72O26l1j897o49J909l83j992R40L45
$$ 978 2682 2143 1722 2913 2155 608 1358 1692 1020 1646 1615 -282 -931 978 595 -1397 -457 -112
1118a12j804O16J830j129j334J196P85p50P24J100j560M05J506k89n39J434k67
$$ -112 -1916 -1300 530 -599 -1933 -737 48 -702 22 1122 -438 -33 1473 1184 645 2079 1812
1135A812j514J072J262j745k72M73q25j89R73p55j975J061N62k227J95J283j228
$$ 1812 298 1370 2632 887 615 1088 263 74 1047 292 -1683 -622 -60 -2287 -2092 -809 -2037
1152b037j533J896O45k036p6J275R3n41J049N8k88J068J5n58J662M40j987P99
$$ -2037 -3570 -1674 -1029 -3065 -3141 -1866 -1773 -2314 -1265 -1207 -1495 -427 -412 -970 692 1132 -855 -56
1170e6K474j301j636K099J069k604L6K062q37k273P96O64l36m26p37j84J064n66
$$ -56 2418 1117 -519 1580 2649 45 81 2143 1306 -967 -171 493 157 -269 -1006 -1190 -126 -692
1188f92j397J069J033k504n57L406N14l580N99K773j032j815K204J344j828k39
$$ -692 -2089 -1020 13 -2491 -3048 358 872 -2708 -2109 664 -368 -2183 21 1365 -463 -702
1204g02J543L98k80p02n19J296Q35j207n29J781q84k166K434K174l011j905K789
$$ -702 841 1239 959 257 -262 1034 1869 662 133 1914 1030 -1136 1298 3472 461 -1444 1345
1221A345Q84k557P01J496j325j691J825P46p08j204n48P61J141p49j433J005M77
$$ 1345 2229 -328 373 1869 544 -1147 678 1424 716 -488 -1036 -275 866 117 -1316 -311 166
1238A66k686R78K797j870k920J894K221j964n26K410q07k693J903K914j092j578
$$ 166 -2520 -1542 1255 -615 -3535 -1641 580 -1384 -1910 500 -307 -3000 -1097 1817 725 -853
1254h53O59J086O53m95m05P76N49j824J60L402m62m699N45L710j217l128K034
$$ -853 -194 892 1545 1050 645 1421 1970 146 306 3708 3246 -1453 -908 2802 1585 -1543 491
1271D91M49l138o18L015j59l477p38J696N65j197o97Q70P07k000m05M076J355
$$ 491 940 -2198 -2816 199 40 -3437 -4175 -2479 -1914 -3111 -3808 -2938 -2231 -4231 -4636 -560 795
1288G95m776j027N564J259m145P81L566j022k821K938K683k137k454J205J661
$$ 795 -3981 -5008 556 1815 -2330 -1549 2017 995 -1826 1112 3795 1658 -796 409 2070
1303B070j09j356m51L52q08k103K337K371l882l767L621L213m133k344M185N76
$$ 2070 1961 605 154 506 -302 -2405 -68 2303 -1579 -5346 -1725 1488 -2645 -4989 -804 -228
1319b28m348N31N049p43l813M62L056J398j394p73Q63J670j618J05L355l52m268
$$ -228 -4576 -4045 1004 261 -3552 -3090 -34 1364 -30 -803 60 1730 112 217 3572 3220 -1048
1336a048J158M385j842k947K559J549m012q82M832P88n325j161L739J077j787
$$ -1048 110 4495 2653 -294 2265 3814 -198 -1080 3752 4540 -785 -1946 1793 2870 1083
1351A083j827J602J295j779r51K777J684l898j232M115J369l669L48K898k047
$$ 1083 -744 858 2153 374 -577 2200 3884 -14 -1246 2869 4238 569 917 3815 1768
1366A768k350M195J778m510j548L364R77k972m18J283P23k485j010K711J974l896
$$ 1768 -582 3613 5391 881 -667 2697 3674 702 284 1567 2290 -195 -1205 1506 3480 -416
1382d16l082M106L305l985k330M162M81l981J490M336k360l696K896K730k185
$$ -416 -3498 608 3913 -72 -2402 1760 2241 -1740 -250 4086 1726 -1970 926 3656 1471
1397A471j363J580P12j621j532K197K219k957m172K865M281l453m529L415K596
$$ 1471 108 1688 2400 779 -753 1444 3663 706 -3466 -601 3680 227 -4302 -887 1709
1412A709m659k180N116P13n238m93M278J5k786K93K016k79j411P10K594n41k657
$$ 1709 -2950 -5130 -14 699 -4539 -5032 -754 -739 -3525 -3232 -1216 -1495 -2906 -2196 398 -143 -2800
1429b800Q9M114k25m126J561M318k663l992M298L399m685l018M026K160l153j498
$$ -2800 -2711 1403 1178 -2948 -1387 2931 268 -3724 574 3973 -712 -3730 296 2456 -697 -2195
1445b195K389L65k190o04J939J169k410k134K606J949k993j387L424M49l794J457
$$ -2195 194 559 -1631 -2235 -296 873 -1537 -3671 -1065 884 -2109 -3496 -72 377 -3417 -1960
1461a960M046k261l038K646K835k266j708K363J214j618o49J684J708j468j939
$$ -1960 2086 -175 -3213 -567 2268 2 -1706 657 1871 253 -396 1288 2996 1528 -411
1476d11J580K563j864k034K266K147l273r56L616K43l993O05L462j522k410J404
$$ -411 1169 3732 1868 -166 2100 4247 974 18 3634 3877 -116 489 3951 2429 19 1423
1492A423J868j908j693J529J402p26k483P35K005p85k563J285L000k506k523L178
$$ 1423 3291 1383 -310 1219 2621 1895 -588 147 2152 1367 -1196 89 3089 583 -1940 1238
1508A238K469m041j197M175J71l294N19K969o62k648R97J814q6j493o87J612P92
$$ 1238 3707 -334 -1531 2644 2815 -479 40 3009 2347 -301 696 2510 2424 931 244 1856 2648
1525B648k573l12K966o05l766R39L381k249k844K254J685l170j356K891J169l267
$$ 2648 75 -237 2729 2124 -1642 -703 2678 429 -2415 -161 1524 -1646 -3002 -111 1058 -2209
1541b209o39J870N22j243q18Q96J405j130j632K374J915k918j606L645R69l107
$$ -2209 -2848 -978 -456 -1699 -2517 -1621 -216 -1346 -2978 -604 1311 -1607 -3213 432 1401 -1706
1557a706K82K710j184j979K201J801k496j020J363K11l76n48l93P35n28o59L63
$$ -1706 -1424 1286 102 -1877 324 2125 -371 -1391 -28 183 -193 -741 -1134 -399 -927 -1586 -1223
1574a223J835j472k384J904K200j844j677J985N50k130R64K067j194j369J335
$$ -1223 612 -860 -3244 -1340 860 -984 -2661 -676 -126 -2256 -1292 775 -419 -1788 -453
1589d53P97k32K39K9N4r4L51l8J155l27k220O26K508r63j749J146Q84k042m48
$$ -453 344 112 351 380 434 340 691 653 1808 1481 -739 -113 2395 1432 -317 829 1713 -329 -777
1608g77K885o02k553L24J198Q2n96J90n37j30L29J81K69M71j251j059K256J004
$$ -777 2108 1506 -1047 -723 475 557 -39 151 -386 -516 -187 -6 263 734 -517 -1576 680 1684
1626A684k332L71J902j175j643K702J105k586p27J718Q04p84l78J71p05L50J30
$$ 1684 -648 -277 1625 450 -1193 1509 2614 28 -699 1019 1823 1039 661 832 127 477 607
1643F07j56N59p49j750J159J726j347j581J383J03j709P64J597j440j482J293
$$ 607 451 1010 261 -1489 -330 1396 49 -1532 -149 -46 -1755 -991 606 -834 -2316 -1023
1659a023J172p34k89L8l88P4M95J48K73P13j644N4J750L77j655J03J097q81o68
$$ -1023 149 -585 -874 -836 -1224 -1150 -655 -507 -234 479 -1165 -1111 639 1016 -639 -536 561 -320 -988
1678i88J775k31j915K10J510o03o37R4n62m99J212j35k97j92j39j346J150J548
$$ -988 787 556 -1359 -1149 361 -242 -879 -785 -1347 -1846 -634 -769 -1066 -1258 -1397 -2743 -1593 -45
1696d5j394n37J106J67p31J021M11j604j05J730R3n88Q53k68j005P49J182j048
$$ -45 -1439 -1976 -870 -703 -1434 -413 -2 -1606 -1711 19 112 -476 377 109 -896 -147 1035 -13
1714a3m27K73n68K65J484q21j166O63J67p82P14O85r87o63R85N07j098N58M32
$$ -13 -440 -167 -735 -470 1014 193 -973 -310 -143 -925 -211 474 -513 -1176 -191 316 -782 -224 208
1733B08j037j35J383K76j234N41N2j79N18M74j017lR29l62n24J050j0j356M04
$$ 208 -829 -964 419 695 -539 2 54 -125 393 867 -150 -153 776 414 -110 940 930 -426 -22
1752b2J466r03p80J090m62o70R05L58r18M5K55l14L72O88q62q62J102P04j187
$$ -22 1444 541 -239 851 389 -281 624 982 64 109 364 50 422 1110 248 -614 488 1192 5
1771EM01L21r56j43J111P3j228J85O71p20j19P49n64n18L53K74r11J251Pr24J89
$$ 5 406 727 -229 -372 739 812 -416 -231 440 -280 -399 350 -214 -732 -379 -105 -1016 235 242 -682 -493
1792d93J361q31q84J581o0q83O46P52j163j8R64n07j30O28o12n09L06K50n52K18
$$ -493 868 37 -847 734 674 -209 437 1189 26 8 972 465 335 963 351 -158 148 398 -154 64
1812F4j2o22j03R21m77j311Q84L73r64L83N29o31p90J552O22j486O90P79o86m8
$$ 64 52 -570 -673 248 -229 -1540 -656 -283 -1247 -864 -335 -966 -1756 -204 418 -1068 -378 401 -285 -333
1832c33J138j80k76L16J86k12Q72O1j139K28J024p02p00J495p78j565M74J693
$$ -333 805 625 349 665 851 639 1511 1572 433 661 1685 983 283 1778 1000 -565 -91 1602
1850A602j303r91P85k1j019M26O64o39m61L1K49N46O67j059j55J024L12r92R71
$$ 1602 299 -692 93 72 -947 -521 143 -496 -957 -926 -677 -131 536 -523 -678 346 658 -334 637
1869F37P63j425k32K170K75j956M99J066p96J33M68j21q89K2L5L96L36j099j005
$$ 637 1400 -25 -257 1913 2188 232 731 1797 1001 1134 1602 1481 592 614 649 1045 1381 282 -723
1888g23J059L64j017J13J253j412j248J788J099j523j027J382J55r58R02N15q84
$$ -723 336 700 -317 -204 1049 -363 -1611 177 1276 -247 -1274 108 263 -695 207 722 -162
1905a62m13Q19M24J86m61j395M67J528o74j056J222m93j300O50J572q69j416R90
$$ -162 -575 244 668 854 393 -1002 -535 993 319 -737 485 -8 -1308 -658 914 45 -1371 -381
1923c81R26r18K06Q51p06j099R65N66M17o91j006K11J402j92j364Q19M52j344
$$ -381 545 -373 -167 684 -22 -1121 -156 410 827 136 -870 -659 743 551 -813 6 458 -886
1941h86p31K551l07k304J20J609j124m32J236j36j697j19J489L31l98j339L78
$$ -886 -1617 934 627 -1677 -1557 52 -1072 -1504 -268 -404 -2101 -2220 -731 -400 -798 -2137 -1759
1958a759J218P1j090P95J138j415r81K555J368k158j347K170Q74j401L75Q68p41
$$ -1759 -541 -470 -1560 -765 373 -1042 -2023 532 1900 -258 -1605 565 1439 38 413 1281 540
1975E40j096J188R10n39j049j60O73M01o71p0N48l23j986J567K174j833k328J831
$$ 540 -556 632 1542 1003 -46 -206 467 868 197 127 675 352 -1634 -67 2107 274 -2054 -223
1993b23J967j684r26K119q9j527j34J756O43j553m79P37J483m88p95Q02K89j126
$$ -223 1744 60 -866 1253 1164 -363 -497 1259 1902 349 -130 607 2090 1602 807 1609 1898 772
2011G72K43K142l40l061J216J967j274j644J798R13k105r06J850J010j493j058
$$ 772 1015 3157 2817 -244 972 2939 1665 21 1819 2732 627 -279 1571 2581 1088 30
2027C0O41R15p8j389n9J161r91j151J604P23k075p40J828N11k197P54J368j674
$$ 30 671 1586 1508 119 60 1221 230 -921 683 1406 -669 -1409 419 930 -1267 -513 855 -819
2045h19j371J719J841j921j391J195J084m42q92L18Q53j55j581J331J840j627
$$ -819 -2190 -471 1370 -551 -1942 -747 337 -105 -997 -679 174 19 -1562 -231 1609 -18
2061a8j999J738J249j492p63J829m93j912P22J638j145j746P66R53n67o79RJ038
$$ -18 -2017 -279 970 -522 -1285 544 51 -1861 -1139 499 -646 -2392 -1626 -673 -1240 -1919 -1910 -872
2079h72m09j850M54K530q19k966J189K486p93j987J898J356j967R7J938J92j542
$$ -872 -1281 -3131 -2677 -147 -966 -3932 -2743 -257 -1050 -3037 -1139 217 -1750 -1653 285 477 -1065
2096a065KJ364L33o00j49R90r5p39m32J690J20k348j52K284ok819Q87J855j109
$$ -1065 -1063 301 634 34 -115 875 780 41 -391 1299 1419 -929 -1081 1203 1197 -1622 -735 1120 11
2115A1j902J239J686j664j161J395O11r89l83Q09Q89o07q84J027J185j303j116
$$ 11 -1891 -652 1034 -630 -1791 -396 215 -774 -1157 -348 541 -66 -950 77 1262 -41 -1157
2132a157J999J293k210k29J877J53k304J021J882q36j855R63R55o02p87K21N4
$$ -1157 842 2135 -75 -304 1573 1726 -578 443 2325 1489 -366 597 1552 950 163 384 438
2149D38K74j077k3J404l99j658L72J704j205j536J612J335k145n53K061J48j791
$$ 438 712 -365 -388 1016 617 -1041 -669 1035 -170 -1706 -94 1241 -904 -1457 604 752 -1039
2166a039O82J178m48r15O24N15j52l82l84J015M57j689J15J276J48j900Q49J734
$$ -1039 -357 821 373 -542 82 597 445 63 -321 694 1151 -538 -423 853 1001 -899 -50 1684
2184A684j517j663J560J003j710k80J312R7j570J75J081p2n26o85O14P17r36n52
$$ 1684 167 -1496 64 1067 -643 -923 389 486 -1084 -909 172 100 -426 -1111 -497 220 -716 -1268
2202a268J343L63j512l15K138j59k030Q42J785j101j237J177J032j648l71R51
$$ -1268 75 438 -1074 -1389 749 590 -1440 -598 1187 86 -1151 26 1058 -590 -961 -10
2218a0O34p80n58O0R99j64j080J81J433j052j101J255P16j721o30J960O4j297
$$ -10 624 -156 -714 -654 345 181 -899 -718 715 -337 -1438 -183 533 -1188 -1818 142 206 -1091
2236a091K32J301p63p28Q43O79m91k53k66P64M59q91m23J177K6j460Q19J377q97
$$ -1091 -859 442 -321 -1049 -206 473 -18 -271 -537 227 686 -205 -628 549 575 -885 -66 1311 414
2255D14j311J039J317j569j46R36O7j127M63R25m07o44P1N34j0j67n73N18O53
$$ 414 -897 142 1459 -110 -256 680 747 -380 83 1008 601 -43 28 562 552 385 -188 330 983
2274I83r23P7J091k98j269L34J253n55m63M96L75r52R0Q73m1o30j63L04J19K47
$$ 983 60 137 1228 930 -339 -5 1248 693 230 726 1101 149 239 1112 1071 441 278 582 701 948
2294I48m04L5N4k50o55J249K29j555l08J266L17j093J90Q66q88o47R37K34o42
$$ 948 544 579 633 383 -272 977 1206 -349 -657 609 926 -167 23 889 1 -646 291 525 -117
2313a17m25M36Q6P4L2m01R0L43q11P5R63n22j042P71J198j056n56Q63o7p95M82
$$ -117 -542 -106 -20 54 86 -315 -225 118 -693 -618 345 -177 -1219 -448 750 -306 -862 1 -66 -861 -379
2334c79Q20p53k35M81m8J09J54k45k01K23j44j29M57N66j060j54R60rj014L02
$$ -379 441 -312 -547 -66 -114 -5 149 -96 -297 -74 -218 -347 110 676 -384 -538 422 413 -601 -299
2354b99N77p94j09J001m98m73M65K11j30J69K6k25MN78n25J25N45m78l31M51O39
$$ -299 278 -516 -625 376 -122 -595 -130 81 -49 120 146 -79 -75 503 -22 103 648 170 -161 290 929
2375I29p71j45N06j43m69N99M11j036J92N86o92L7K80l75m05Q40k15l77L59k44
$$ 929 158 13 519 376 -93 506 917 -119 73 659 -33 4 284 -91 -496 344 129 -248 111 -133
2395a33k57K0N36o93M1N71J92j266O52O76m17k56M84j7l96J41N17p07M4P73q19
$$ -133 -390 -370 166 -527 -486 85 277 -989 -337 339 -78 -334 150 133 -263 -122 395 -312 -268 505 -314
2416c14M0M10k94l29R00k18j163P84O27p58n5L29k58l40L17L02o80J91N02k93
$$ -314 -274 136 -158 -487 413 195 -968 -184 443 -315 -370 -41 -299 -639 -322 -20 -700 -509 -7 -300
2436c00j8J4m1l10N96L52o34M93L77p33k36P38k21o23M61Q22j224J49O35j18p41
$$ -300 -318 -304 -345 -655 -59 293 -341 152 529 -204 -440 298 77 -546 -85 737 -487 -338 297 179 -562
2457e62L20J94K5K2j61j11L51M27o26J51M88n35p10J049L47o83l72Q17l61l44
$$ -562 -242 -48 -23 -1 -162 -273 78 505 -121 30 518 -17 -727 322 669 -14 -386 431 70 -274
2477b74P26J7r12J12L20l04j03P00p87j26P14k07n49j8N18r21Q41K81m66j91L35
$$ -274 452 469 -443 -331 -11 -315 -418 282 -505 -631 83 -124 -673 -691 -173 -1094 -253 28 -438 -629 -294
2498b94J12k73M72L95p53j61Q69J87l52O8J10l42M81K94m99j21Q0l97J31Q33l35
$$ -294 -182 -455 17 412 -341 -502 367 554 202 270 380 38 519 813 314 193 273 -124 7 840 505
2519E05q39J53O69q92L09L94l44p31P05K09l31l38O10n6m82N66M02l97J64k07
$$ 505 -334 -181 488 -404 -95 299 -45 -776 -71 138 -193 -531 79 23 -459 107 509 112 276 69
2539F9o6R15k36o06P7J011p28k48P02M08j088J03O84Q6q85k17N20k68L90j44l49
$$ 69 3 918 682 76 153 1164 436 188 890 1298 210 313 997 1083 198 -19 501 233 623 479 130
2560A30K11k49l83K10M86p17n25N22L71p49K41O85p60r73J372P5m55l07L72N0
$$ 130 341 92 -291 -81 405 -312 -837 -315 56 -693 -452 233 -527 -1500 -128 -53 -508 -815 -443 -393
2580c93j92J78r3J8j30l39K90Q22j91r53L05O53m20J06O40n18r39Q57O49k93p03
$$ -393 -585 -407 -500 -482 -612 -951 -661 161 -30 -983 -678 -25 -445 -339 301 -217 -1156 -299 350 57 -646
2601f46M31N9m35K99K70k05n9l73N4P56qj287o0R08n7p85P28M70j256J31J230
$$ -646 -215 -156 -591 -292 -22 -227 -286 -659 -605 151 143 -1144 -1204 -296 -353 -1138 -410 60 -1196 -1065 165
2622A65kj298M49Q16m38K8O49J05o52M16j89J194Lj149K31J004q3q74O85M40q08
$$ 165 163 -1135 -686 130 -308 -280 369 474 -178 238 49 1243 1246 97 328 1332 1249 375 1060 1500 692
2643F92o17J202N59j163p00P71J74p86Q14qp92k00N22l9K16n07p56Q03K24m48
$$ 692 75 1277 1836 673 -27 744 918 132 946 938 146 -54 468 429 645 138 -618 185 409 -39
2663c9m01J289k44j533Q45J657n53j631J049M36j85k95O98j48n20R3K24L23k40
$$ -39 -440 849 605 -928 -83 1574 1021 -610 439 875 690 395 1093 945 425 518 742 1065 825
2682H25o89J76O45o78k25M08K79j188l31J683j80k045M74J241l67j052M88M67
$$ 825 136 312 957 279 54 462 741 -447 -778 905 725 -1320 -846 395 28 -1024 -536 -69
2700f9o19m05K94N48j36p51l5Q07K46o72J67P47q31o87J297Q18j440l15J288j41
$$ -69 -688 -1093 -799 -251 -387 -1138 -1173 -366 -120 -792 -625 122 -709 -1396 -99 719 -721 -1036 252 111
2720A11j023P55N15n66q48R08L16q0p08k62M55Q59j236j10J090k34j123P10R45
$$ 111 -912 -157 358 -208 -1056 -148 168 88 -620 -882 -427 432 -804 -914 176 -58 -1181 -471 474
2739D74j038q08Q16M42o74q0J135l93j261O08J143m38n58J0O38L21q52m5O69O95
$$ 474 -564 -1372 -556 -114 -788 -868 267 -126 -1387 -779 364 -74 -632 -622 16 337 -515 -560 109 804
2759H04j431L7J326j20j621O83J181o34r36R51K35p02n9Q19J8l16m76M16L47n70
$$ 804 -627 -590 736 616 -1005 -322 859 225 -711 240 475 -227 -286 533 551 235 -241 175 522 -48
2779d8m97O83O87p68r57J191N68j319j79J360M9j338N07J317r37q77O61Q01k94
$$ -48 -545 138 825 57 -900 291 859 -460 -639 721 770 -568 -61 1256 319 -558 103 904 610
2798F10l73N6M76k40l64R2M42M2r73K63J066m50j269J138N62j357j61J499o49
$$ 610 237 293 769 529 165 257 699 741 -232 31 1097 647 -622 516 1078 -279 -440 1059 410
2817D10p63L7R25o3o93K27K08J38m48j8J73O38j200K73R34j66j280O8J523q11
$$ 410 -353 -316 609 546 -147 80 288 426 -22 -40 133 771 -429 -156 778 612 -668 -600 923 112
2837A12q66R29M54r84l82J257R5q16J56M52k85M3n37M31J94k03p77Q99K37q17
$$ 112 -754 175 629 -355 -737 520 615 -201 -45 407 122 165 -372 59 253 50 -727 172 409 -408
2857d08LJ053j07j659N60J344n88p76P19K90n31K2J64J29k9k76J71M26Mn49K29
$$ -408 -405 648 541 -1118 -558 786 198 -578 141 431 -100 -78 86 215 186 -90 81 507 511 -38 191
2878A91P79p77o54J029P25j584o6J475l61j232N02Q07n68l90O28J31l45j49k05
$$ 191 970 193 -461 568 1293 -291 -357 1118 757 -475 27 834 266 -124 504 635 290 141 -64
2897f4N80K40n44k81N48J15r74K72O43q1j165J137O14j058m69J037j48m19J78
$$ -64 516 756 212 -69 479 594 -380 -108 535 454 -711 426 1040 -18 -487 550 402 -17 161
2916A61L26j56n06R3O9O54p65k67M20L62k31l79O46O7r35L46P52m94q32Q19K74
$$ 161 487 331 -175 -82 -13 641 -124 -391 29 391 160 -219 427 494 -441 -95 657 163 -669 150 424
2937D24o39k02M26k23k46M53j23j49J44r7j22O70l57m66L46M00o33m48J100Q9
$$ 424 -215 -417 9 -214 -460 -7 -130 -279 -135 -232 -354 316 -41 -507 -161 239 -394 -842 258 347
2957C47j045K58O27j84k51P67k85l62j16N73o48J54R1l76O47J14l92r1P52p09
$$ 347 -698 -440 187 3 -248 519 234 -128 -244 329 -319 -165 -74 -450 197 311 -81 -172 580 -129
2977a29l14M05N52o22k88P28P0q86J79L19l15l03O32Ko9j29l34K09M07k49l12
$$ -129 -443 -38 514 -108 -396 332 402 -484 -305 14 -301 -604 28 30 -39 -168 -502 -293 114 -135 -447
2998d47J79N56q30J00Q58k67p64J86P46r76L09N69j96p17O62K39j08l00J90j3
$$ -447 -268 288 -542 -442 416 149 -615 -429 317 -659 -350 219 23 -694 -32 207 99 -201 -11 -24
3018b4j51L65n81o5M68k31n53Q50p9p95J84O26j37m86N16L32j029M52J44L9k13
$$ -24 -175 190 -391 -456 12 -219 -772 78 -1 -796 -612 14 -123 -609 -93 239 -790 -338 -194 -155 -368
3039c68L52p0j7M33Mq17O51M19n92j54O81l76n35O94K07p07M42N16m88k90M43
$$ -368 -16 -86 -103 330 334 -483 168 587 -5 -159 522 146 -389 305 512 -195 247 763 275 -15 428
3060D28J29o52K32Q0l85L76K57o94P9R39p26m38P46m91l00M95L04n71mL34l8m38
$$ 428 557 -95 137 217 -168 208 465 -229 -150 789 63 -375 371 -120 -420 75 379 -192 -196 138 100 -338
3082c38O42o0l22M48n8l07O1M67p43L34M62k64q42M45K98n28p8Q28n09o41O50
$$ -338 304 244 -78 370 312 5 66 533 -210 124 586 322 -520 -75 223 -305 -383 445 -64 -705 -55
3103e5J27o31N9K32j82m35L11K25l71j67N12l46L89K42o56P5N36j75l79N53J55
$$ -55 72 -559 -500 -268 -450 -885 -574 -349 -720 -887 -375 -721 -332 -90 -746 -671 -135 -310 -689 -136 19
3124A9m38K80O70o51l02P80m74nO2M79r1k35Kk74K66M67l28n47M47K05k32j09
$$ 19 -419 -139 531 -120 -422 358 -116 -121 -59 420 329 94 96 -178 88 555 227 -320 127 332 100 -9
3146iM22n74l10J001l42n37K35M52n04N9N86j03m98K01J77j84N77J05p19O97n
$$ -9 413 -161 -471 530 188 -349 -114 338 -166 -107 479 376 -122 79 256 72 649 754 35 732 727
3167G27l60j61O70J64p82M68K90p89O26L88n84l77Q09m6p13J61L82n19J50J86
$$ 727 367 206 876 1040 258 726 1016 227 853 1241 657 280 1089 1043 330 491 873 354 504 690
3187F90o22j06K52J03l89L56k55m98M4R50l66o14N27p8m41L00N06n50l05O51l10
$$ 690 68 -38 214 317 -72 284 29 -469 -425 525 159 -455 72 -6 -447 -147 359 -191 -496 155 -155
3208a55P4M26j39m99L26Lj81K76j45l16lM90L31j018L8O03o44j68Q95o2p93j87
$$ -155 -81 345 206 -293 33 36 -145 131 -14 -330 -333 157 488 -530 -492 111 -533 -701 194 132 -661 -848
3230h48P37k76mJ63n25m4L85o8l42L83j7o98N69M45p26MO58l15m97O55N41o15
$$ -848 -111 -387 -391 -228 -753 -797 -412 -480 -822 -439 -456 -1154 -585 -140 -866 -862 -204 -519 -1016 -361 180 -435
3252d35k10Q35k12K3j25K24l41K20O2L9p7R4l45q6Q42p2r07K94M13p10M72K94
$$ -435 -645 190 -22 1 -124 100 -241 -21 41 80 3 97 -248 -334 508 436 -471 -177 236 -474 -2 292
3274B92j39o67M62J15r3K3r9K3Q1K27j62j17R2k58l32N78L88o99j19R88m83m77
$$ 292 153 -514 -52 63 -30 -7 -106 -83 -2 225 63 -54 38 -220 -552 26 414 -285 -404 584 101 -376
3296c76R41k8p83R4P99l82j49P1J20q3J73K29o0j96m03%K74N77p56n5L55L0p44
$$ -376 565 537 -246 -152 647 265 116 187 307 224 397 626 566 370 -33 -33 241 818 62 7 362 392 -352
3319c52M70N00r67r2O86j5m94K67J17l89j50L24L31l94o4k59J48N15k96o26P42
$$ -352 118 618 -349 -441 245 230 -264 3 120 -269 -419 -95 236 -158 -222 -481 -333 182 -114 -740 2
3340BL15l74j85R06m93q22P23N43m11m75J37M69l84J34K5q9k23j37J28L46j4m57
$$ 2 317 -57 -242 664 171 -651 72 615 204 -271 -134 335 -49 85 110 21 -202 -339 -211 135 121 -336
3362c36N9R34q58m22Q65o9p05j32J063j56j014J36M92j79j69N56k53K58m52m6
$$ -336 -277 657 -201 -623 242 173 -532 -664 399 243 -771 -635 -143 -322 -491 65 -188 70 -382 -428
3382d28M23N39r28L53P40m49l16p1O49o18k38O85K40q31q5Q85j97n58K52J50l06
$$ -428 -5 534 -394 -41 699 250 -66 -137 512 -106 -344 341 581 -250 -335 550 353 -205 47 197 -109
3403a09Q9l31L50J59l72q8K52L37q18j55J121j08q81O74N39j004k33R98q3n25
$$ -109 -20 -351 -1 158 -214 -302 -50 287 -531 -686 435 327 -554 120 659 -345 -578 420 337 -188
3423a88K32L57j39J3k02J28N36k90p25N43N05p53j80M57M81j176K88N84L60j186
$$ -188 44 401 262 275 73 201 737 447 -278 265 770 17 -163 294 775 -401 -113 471 831 -355
3443c55M45N78o97j68J69K43l95K39k22L55Nm91j8Q24q5p98L57N64k65p35P84
$$ -355 90 668 -29 -197 -28 215 -180 59 -163 192 197 -294 -312 512 427 -371 -14 550 285 -450 334
3464C34L19j148J65N85J20m27L23J5j19m11K74K2K51k8m12L98k1n10j91P50p7
$$ 334 653 -495 -330 255 375 -52 271 286 167 -244 30 52 303 275 -137 261 240 -270 -461 289 212
3485B12q10L52R24o19q53R30O0n09p1P37k16p24K89LM43m04J60m8O25n61k87L01
$$ 212 -598 -246 678 59 -794 136 196 -313 -384 353 137 -587 -298 -295 148 -256 -96 -144 481 -80 -367 -66
3507f6L80n31j96O85j03p10K07P31n96m10M75K71o82J15K23J56j7l97j86L05J37
$$ -66 314 -217 -413 272 169 -541 -334 397 -199 -609 -134 137 -545 -430 -207 -51 -68 -465 -651 -346 -209
3528b09k84M51J95l11p46Q13M64j100K56O97j62p64L92L32l24J1J02J40j62N9
$$ -209 -493 -42 153 -158 -904 -91 373 -727 -471 226 64 -700 -308 24 -300 -289 -187 -47 -209 -150
3548a50K10j14J34k34J18M82k25n52O5P27m85m05O50N4p51K40N80k85o30J04Q44
$$ -150 60 -54 80 -154 -36 446 221 -331 -266 461 -24 -429 221 275 -476 -236 344 59 -571 -467 377
3569C77p84L89P0L39j15j89m42J05N12l55l09P01j53n36J55O38k54o16O40Q4o03
$$ 377 -407 -18 52 391 276 87 -355 -250 262 -93 -402 299 146 -390 -235 403 149 -467 173 257 -346
3590c46M87O5j65j30O5O3M93m16o78M30J59P0n52K48N59m93l34O50k60p92Q24
$$ -346 141 206 41 -89 -24 39 532 116 -562 -132 27 97 -455 -207 352 -141 -475 175 -85 -877 -53
3611e3J05l25n69M08L82m78j4O4kL87m50j74N32n3j46l01O42j43j76j65Q49p60
$$ -53 52 -273 -842 -434 -52 -530 -544 -480 -482 -95 -545 -719 -187 -240 -386 -687 -45 -188 -364 -529 320 -440
3633d40n2O12K01p44J64L86l46m9K93k39k34K12K23m70%N13o87L76Q59n57k71
$$ -440 -492 120 321 -423 -259 127 -219 -268 25 -214 -448 -236 -13 -483 -483 30 -657 -281 578 21 -250
3654b50K61J4l72K47M24l10l63M08j44M8K52J43j21R7J29jj95J5k17K92O03n87
$$ -250 11 25 -347 -100 324 14 -349 59 -85 -37 215 358 237 334 463 462 267 282 65 357 960 373
3676C73O6K42J17o47M87J46M1p91M56J17l19k2L63k67O0%l85K8K94R6m68L34j58
$$ 373 439 681 798 151 638 784 825 34 490 607 288 266 629 362 422 422 37 65 359 455 -13 321 163
3699A63l56O37J51m44j82K84N65r33J95P52o02k06O47n85J09Q3j91J35n5O5m72
$$ 163 -193 444 595 151 -31 253 818 -115 80 832 230 24 671 86 195 278 87 222 167 232 -240
3720b40M24l39j61j15P31K6q19J70L95n79K58L63m39M1K35j52j31L1M29l26k87
$$ -240 184 -155 -316 -431 300 326 -493 -323 72 -507 -249 114 -325 -284 -49 -201 -332 -301 128 -198 -485
3741d85M99j35l47M98k08l87M58Q7m57J37L46j50j5R0Om55M26P0k18O3J21K1k64
$$ -485 14 -121 -468 30 -178 -565 -107 -20 -477 -340 6 -144 -159 -69 -63 -518 -92 -22 -240 -177 -56 -35 -299
3764b99k2L32l92M10l94l76L88L64K7l94O4K89o94M21M53n35k2M41k04m7L11J6
$$ -299 -321 11 -381 29 -365 -741 -353 11 38 -356 -292 -3 -697 -276 177 -358 -380 61 -143 -190 121 137
3786A37k21J1K38j97RK62j31l76O50K21n64K85J66p29K71N57l74j80n7M91m0n11
$$ 137 -84 -73 165 -32 -23 239 108 -268 382 603 39 324 490 -239 32 589 215 35 -22 469 429 -82
3808h2O06o56j64L49Q3j03M5K70m96K27K53k90j08K9J23j61J09R2j39j50M61J67
$$ -82 524 -132 -296 53 136 33 78 348 -148 79 332 42 -66 -37 86 -75 34 126 -13 -163 298 465
3830D65j73j73k3k21J96K35P3p9m8l17mM47q5l32K31K45n05J92K55m35j31J57
$$ 465 292 119 96 -125 71 306 379 300 252 -65 -69 378 293 -39 192 437 -68 124 379 -56 -187 -30
3852c0P0j2k12M47j44m57P65l45m0n32L83K6R6L84o07j62J53oq0N34j96m73J24
$$ -30 40 28 -184 263 119 -338 427 82 42 -490 -107 -81 15 399 -208 -370 -217 -223 -303 231 35 -438 -314
3875c14L33J89o17K43N0j90R9K40j61N0l42L47r1K09J21n56K38J62j06l5J89m47
$$ -314 19 208 -409 -166 -116 -306 -207 33 -128 -78 -420 -73 -164 45 166 -390 -152 10 -96 -131 58 -389
3897c89Q9M37k1q18N05K54o8o79O15j34l34K67O2l29L07J14o10Q4L86o3K20R2
$$ -389 -300 137 116 -702 -197 57 -11 -690 -75 -209 -543 -276 -214 -543 -236 -122 -732 -648 -262 -325 -105 -13
3919a3j15o71R82Ol15k14M94k14k15M62R8k3l34L45j01J56m8j55j17Q9j72N0N48
$$ -13 -128 -799 183 189 -126 -340 154 -60 -275 187 285 262 -72 273 172 328 280 125 8 97 -75 -25 523
3942E23Lq99J27K71p4j63K74L7n54J84N09k20l62J48K41j60K03R2o20O69J31l84
$$ 523 526 -373 -246 25 -49 -212 62 99 -455 -271 238 18 -344 -196 45 -115 88 180 -440 229 360 -24
3964b4P6L72n18k1O02j17k34R3L16k72j62N93j14n12k20O38l21J49l32j67n7M33
$$ -24 52 424 -94 -115 487 370 136 229 545 273 111 704 590 78 -142 496 175 324 -8 -175 -232 201
3986B01k06p1M05l00l61J55J21O0l48O9K66k25J65R7j92k86L12L02l56J14n6o3
$$ 201 -5 -76 329 29 -332 -177 -56 4 -344 -275 -9 -234 -69 28 -164 -450 -138 164 -192 -78 -134 -197
4008a97K27j00J40K93k38k56J1M70j89m09M12j04j73k14N52j59n27M48K04n29
$$ -197 30 -70 70 363 125 -131 -120 350 161 -248 164 60 -113 -327 225 66 -461 -13 191 -338
4028c38K95r5m10K44J45l19L93K65n59J05N02r3o78K03O49l52m68N61K14m23J73
$$ -338 -43 -138 -548 -304 -159 -478 -85 180 -379 -274 228 135 -543 -340 309 -43 -511 50 264 -159 14
4049A4J8K51l12J75m04J25K51K52k22J79k53l36J22P13q20j31P69k50p96O49L64
$$ 14 32 283 -29 146 -258 -133 118 370 148 327 74 -262 -140 573 -247 -378 391 141 -655 -6 358
4070C58n62K3L95l16j32L89p3n7m1O7o7P7J72k71l5N29j97n60O51P2o26K28N78
$$ 358 -204 -181 214 -102 -234 155 82 25 -16 51 -16 61 233 -38 -73 456 259 -301 350 422 -204 24 602
4093F02k63J0k30l4j69o5M07j42k93L18k09J92K97p87M13J32R6o74J40P31l73
$$ 602 339 349 119 85 -84 -149 258 116 -177 141 -68 124 421 -366 47 179 275 -399 -259 472 99
4114I9o70N32K16m88JN42l12j63O24j50j49J6j68J29M7M9l17M73j45k09l68P79
$$ 99 -571 -39 177 -311 -310 232 -80 -243 381 231 82 98 -70 59 106 155 -162 311 166 -43 -411 368
4136C68l6o28K11J98J2l56P54l82p99N53Q9l0p6j64j8p9K56j64m24L37M55p13
$$ 368 332 -296 -85 113 125 -231 523 141 -658 -105 -16 -46 -122 -286 -304 -383 -127 -291 -715 -378 77 -636
4158f36M72M84q34n2P43j25l60J89J36j9k61M63j36k56L50Q9n5J7k37m1J5L86
$$ -636 -164 320 -514 -566 177 52 -308 -119 17 -2 -263 200 64 -192 158 247 192 209 -28 -69 -54 332
4180C32l49K8K5J6m79P75pm72l5L13l93K92j19J77n5L4K49k00J44o0k53L3M78
$$ 332 -17 11 36 52 -427 348 341 -131 -166 147 -246 46 -73 104 49 83 332 132 276 216 -37 -4 474
4203D74m44j99M59N4l51L03L19n72J8J44L01m99J86L41Ll02K96m17j3n6O3R7k66
$$ 474 30 -169 290 344 -7 296 615 43 61 205 506 7 193 534 537 235 531 114 101 45 108 205 -61
4226f1k8Q5j07N45n54j81M43j38n45M36N03m74m17P19j63j44k0K77k16K1J0k31
$$ -61 -89 -4 -111 434 -120 -301 142 4 -541 -105 398 -76 -493 226 63 -81 -101 176 -40 -19 -9 -240
4248b40o2N58n88J18K61j31l64L17k64L2l94Q16k96o4%M76n52J60J01j33m5m6
$$ -240 -302 256 -332 -214 47 -84 -448 -131 -395 -363 -757 59 -237 -301 -301 175 -377 -217 -116 -249 -294 -340
4270c40K15M09m37L5r3K04p7r3j69L81j91m91L86M55l81j52N89m83k36M66L79
$$ -340 -125 284 -153 -118 -211 -7 -84 -177 -346 35 -156 -647 -261 194 -187 -339 250 -233 -469 -3 376
4291C76n98k9L5O0M3J67k20M66l32K71l59J58J82k10k8J32K83n74N31n8k96K0
$$ 376 -222 -251 -216 -156 -113 54 -166 300 -32 239 -120 38 220 10 -18 114 397 -177 354 296 0 20
4313B0J39l72L06J17J83r6p1k26P4l8O5n2o4K14J45m18M34j47k59J50L02l63M3
$$ 20 159 -213 93 210 393 297 226 0 74 36 101 49 -15 199 344 -74 360 213 -46 104 406 43 86
4336H6L95j12m56O93l04j13M50k90m56J18K75l31O2K37j56m74O11L06n25k35L21
$$ 86 481 369 -87 606 302 189 639 349 -107 11 286 -45 17 254 98 -376 235 541 16 -219 102
4357A02j12k41L11j65j73P5K63JQ3l62M11l21J87R4k52K08j68l00K01M74k76k41
$$ 102 -10 -251 60 -105 -278 -203 60 61 144 -218 193 -128 59 153 -99 109 -59 -359 -158 316 40 -201
4379b01k2K50m11K96J85k79l48K47J49J09j40l05L97k27M9k56K04J68j10n2P8
$$ -201 -223 27 -384 -88 97 -182 -530 -283 -134 -25 -165 -470 -73 -300 -251 -507 -303 -135 -245 -297 -219
4400b19j2q8K16J41j93m5N45l59n52N12J48k92j42L77k3k24L16j58k59K25q0l48
$$ -219 -231 -319 -103 38 -155 -200 345 -14 -566 -54 94 -198 -340 37 14 -210 106 -52 -311 -86 -166 -514
4422e14L73L85m56m82O99m4m0l82Q22l99j03J45J16m00J82Q4qL14n3j57l2K1p1
$$ -514 -141 244 -212 -694 5 -39 -79 -461 361 -38 -141 4 120 -280 -98 -14 -22 292 239 82 50 71 0
4445@m5m44L63n4M7O82n41j30K94nl72J59j7J25l7K55l5k44M36j81j04J63K83
$$ 0 -45 -489 -126 -180 -133 549 8 -122 172 167 -205 -46 -63 62 25 280 245 1 437 256 152 315 598
4468E98n44M83J42l10kJ09l4Pk54N3k2k13L89l85n1M59o14J86L49l90J85q8m9
$$ 598 54 537 679 369 367 476 442 449 195 248 226 13 402 17 -34 425 -189 -3 346 -44 141 53 4
4491DM2l59N46m42p4L08K9j34L34o3l64J27L65j58n7M8k3J29P3L9n86L44J80k59
$$ 4 46 -313 233 -209 -283 25 54 -80 254 191 -173 -46 319 161 104 152 129 258 331 370 -216 128 308 49
4515D9M2J58j75k46J48q4j14j80L36mk46R4K53k45j77K98m80K53R3K70n20N4L59
$$ 49 91 249 74 -172 -24 -108 -222 -402 -66 -70 -316 -222 31 -214 -391 -93 -573 -320 -227 43 -477 -423 -64
4538f4k65J01k3J06k63L41J90m05P7K33j86l1K69O8m18R9J64k30j13L66j64n3
$$ -64 -329 -228 -251 -145 -408 -67 123 -282 -205 28 -158 -189 80 148 -270 -171 -7 -237 -350 16 -148 -201
4560b01J46J2j80L06j62j75J78j67J03p6K13n48K14L88k96k84k07P94r7n31O84
$$ -201 -55 -43 -223 83 -79 -254 -76 -243 -140 -216 -3 -551 -337 51 -245 -529 -736 58 -39 -570 114
4581A14K9n25K93K69l04K49J75k98R4N60o44LK06J42l04J33L95k92m12N00j3R1
$$ 114 143 -382 -89 180 -124 125 300 2 96 656 12 15 221 363 59 192 587 295 -117 383 370 461
4603D61n01K60k56J07K40j86K1J20k38m02P82n64O5RL05k97j25M12J3l08L24k8
$$ 461 -40 220 -36 71 311 125 146 266 28 -374 408 -156 -91 -82 223 -74 -199 213 226 -82 242 214
4625B14n0j60M09l58R7K94M0l37K98j71j75L47k01l18k0J55j92j02L29%m27J07
$$ 214 164 4 413 55 152 446 486 149 447 276 101 448 247 -71 -91 64 -128 -230 99 99 -328 -221
4647b21M34o1n64M53K8j54k57J77j49k55N33k0k85K44j1j10l2K24k17K46L33l89
$$ -221 213 152 -412 41 69 -85 -342 -165 -314 -569 -36 -56 -341 -97 -108 -218 -250 -26 -243 3 336 -53
4669e3m39M14K50m63PJ10K29m6J11j08j69J45P4k26J89P5m37J07J31J03n18L17
$$ -53 -492 -78 172 -291 -284 -174 55 9 120 12 -157 -12 62 -164 25 100 -337 -230 -99 4 -514 -197
4691a97M23n50J37M74j74l46M17K2m79J32M17l83N0L88j56K1J98q7l57M34j01
$$ -197 226 -324 -187 287 113 -233 184 206 -273 -141 276 -107 -57 331 175 196 394 307 -50 384 283
4712B83l18J60N32p67J18P61p15k13L37q8n26O85L28m94n41N06J89o01K09R8q2
$$ 283 -35 125 657 -110 8 769 54 -159 178 90 -436 249 577 83 -458 48 237 -364 -155 -57 -139
4733a39K43k01L92l60K82L8m15L86L48o61K39K70l18l58L02K46p8n92P69k41l8
$$ -139 104 -97 295 -65 217 255 -160 226 574 -87 152 422 104 -254 48 294 216 -376 393 152 114
4754A14J23l51oL0P7N0J03m58o5K44K55o06m7L58L40o43K18M76k08k49jlJ8J38
$$ 114 237 -114 -120 -90 -13 37 140 -318 -383 -139 116 -490 -537 -179 161 -482 -264 212 4 -245 -246 -249 -231 -93
4778i3J4k77K68L47o08K31J36km24N24o4m93J67L40j2k91L75k89j46K16J25l69
$$ -93 -79 -356 -88 259 -349 -118 18 16 -408 116 52 -441 -274 66 54 -237 138 -151 -297 -81 44 -325
4800c25K04j64K92m5l4k0j40j02l3O7L86Q6k83K3M15m57J0J84K39l75J13j67j2
$$ -325 -121 -285 7 -38 -72 -92 -232 -334 -367 -300 86 172 -111 -88 327 -130 -120 64 303 -72 41 -126 -138
4823a38J4J35l30L96P5k76K70j78J39j53Q4K33j34l00L52l0m71N4P61k71l17K50
$$ -138 -124 11 -319 77 152 -124 146 -32 107 -46 38 271 137 -163 189 159 -312 -258 503 232 -85 165
4845A65L96n40L0M73j79n8q2J09mK72n96J3K70qn05L25L16o18k2M74j80k09K17
$$ 165 561 21 51 524 345 287 205 314 310 582 -14 -1 269 261 -244 81 397 -221 -243 231 51 -158 59
4868E9q5j61M0K89j01J86l75j7J01J33P1l13L31p2j11j38O05j04n47M14j11r0
$$ 59 -26 -187 -147 142 41 227 -148 -165 -64 69 140 -173 158 86 -25 -163 442 338 -209 205 94 4
4890Dj41J49k43J80j63P2j43R8O4k79K09K37m35K44L2k64K00K6K86n16L9L68m3
$$ 4 -137 12 -231 -51 -214 -142 -285 -187 -123 -402 -193 44 -391 -147 -115 -379 -179 -153 133 -383 -344 24 -19
4913a9j93J03J20L8k70L55J14m80J67l18K20J9L5j70jO7k44M67N3J71l83J48j32
$$ -19 -212 -109 11 49 -221 134 248 -232 -65 -383 -163 -144 -109 -279 -280 -213 -457 10 63 234 -149 -1 -133
4936a33k12L31J41k05n5J43J92m12L0J96P3j57M75n45L47k60J0L3r4L05n40M57
$$ -133 -345 -14 127 -78 -133 10 202 -210 -180 16 89 -68 407 -138 209 -51 -41 -8 -102 203 -337 120
4958A20o4m07L43J46q3L7J1K38k54j43L76l48J59J00qJ07J93j41l25K82R3o4L8
$$ 120 56 -351 -8 138 55 92 103 341 87 -56 320 -28 131 231 223 330 523 382 57 339 432 368 406
4981D06k96j51J01m3J75k77M03K6l44K6j13J86k32J87M4l25L32N3m12O82m1k31
$$ 406 110 -41 60 17 192 -85 318 344 0 26 -87 99 -133 54 98 -227 105 158 -254 428 387 156
5003A56k22J33p6K5j1M82m80K68n0J81n93L61P4O1k04J61q4rj25m7k55M11L6o68
$$ 156 -66 67 -9 16 5 487 7 275 225 406 -187 174 248 309 105 266 182 173 48 1 -254 157 193 -475
5027d75o6M02j8m90O53N2kj71j62K39k70P1L08j78oM23k96j40o6J21P2J29J22
$$ -475 -541 -139 -157 -647 6 58 56 -115 -277 -38 -308 -237 71 -107 -113 310 14 -126 -192 -71 1 130 252
5050B52n67N39j13j88q5J03l92J69J68J14k78J19M04n28o7p3P7o2M68r8k52J15
$$ 252 -315 224 111 -77 -162 -59 -451 -282 -114 0 -278 -159 245 -283 -350 -423 -346 -408 60 -38 -290 -175
5072a75j15OJ0K64k56j9N69m47j67K04J71k58j9J92o4l3L41p9j80J74J56j53j20
$$ -175 -290 -284 -274 -10 -266 -285 284 -163 -330 -126 45 -213 -232 -40 -104 -137 204 125 -55 119 275 122 2
5095BK03q5j7KL24p07M76o2n3p6K78K51n89N10m45j64K05k7Q7m1p7K42r7j36K78
$$ 2 205 120 103 105 429 -278 198 136 83 7 285 536 -53 457 12 -152 53 26 113 72 -5 237 140 4 282
5120B82k39K09K35l15J80Qk23j41J58J09j38L2J84Jj46j52%J7N28m26J94k61M41
$$ 282 43 252 487 172 352 360 137 -4 154 263 125 157 341 342 196 44 44 61 589 163 357 96 537
5143E37j32J54k68m04J37J92l3l24L04K22o04K7K22r1k44J26J79k30q9L23j09
$$ 537 405 559 291 -113 24 216 183 -141 163 385 -219 -192 30 -61 -305 -179 0 -230 -319 4 -105
5164a05m9mL14k53J42K35m28J96J26j96J97K1j12k26K8J66q3j23J07J34k00J37
$$ -105 -154 -158 156 -97 45 280 -148 48 174 -22 175 196 84 -142 -114 52 -31 -154 -47 87 -113 24
5186B4l06lK01k88q0K22k28J03j4K69q9k39K78j17K4l0M36j71O3k80L58r9j74
$$ 24 -282 -285 -84 -372 -452 -230 -458 -355 -369 -100 -189 -428 -150 -267 -243 -273 163 -8 55 -225 133 34 -140
5209a40K66O1k07J60n2r6J21K6k52J50K94l65J5K47j83J77j13j13n9j19K83Nk13
$$ -140 126 187 -20 140 88 -8 113 139 -113 37 331 -34 -19 228 45 222 109 -4 -63 -182 101 106 -107
5232a07J52j1k77J01J08J65Q2J11J8m36K86P5J3j70K18j63K62j84k10j1J83J02
$$ -107 45 34 -243 -142 -34 131 213 324 342 -94 192 267 280 110 328 165 427 243 33 22 205 307
5254C07j52r2L65l40J01J92l86J9j21j98j1O29j86k61J46L71k10o8k18K0N0K4
$$ 307 155 63 428 88 189 381 -5 14 -107 -305 -316 313 127 -134 12 383 173 105 -113 -93 -43 -19
5276a9M80p06L90J91m21l52M01K57k32J99j11k51J02K71k45L1k03L86l05K45K6
$$ -19 461 -245 145 336 -85 -437 -36 221 -11 188 77 -174 -72 199 -46 -15 -218 168 -137 108 134
5297A34l52M05l32K49j26J50m7m28J77L8M2l37N15j23j88J53j53j6J85K3P4l88
$$ 134 -218 187 -145 104 -22 128 81 -347 -170 -132 -90 -427 88 -35 -223 -70 -223 -239 -54 -31 43 -345
5319c45K18n2o5J70K49l1k23P0J2j14J28L3O7k10N8k61O73k19l80L04k67J19j0
$$ -345 -127 -179 -244 -74 175 144 -79 -9 3 -111 17 50 117 -93 -35 -296 377 158 -222 82 -185 -66 -76
5342g6K60k77j0q0M83l80j72K75j92K32n8M71k99l04K24j13k6K57k89r5K32O8
$$ -76 184 -93 -103 -183 300 -80 -252 23 -169 63 5 476 177 -127 97 -16 -42 215 -74 -169 63 131
5364A31j60L37n0k14k38J99J86l2J06k88J59J27k48K43p3j99L5l2L5J82j17n1
$$ 131 -29 308 258 44 -194 5 191 159 265 -23 136 263 15 258 185 -14 21 -11 24 206 89 38
5386C8J09k53R6K77j53k72K47J33k72L53k7j11m07M07j3j89L02k0k75K55n2j49
$$ 38 147 -106 -10 267 114 -158 89 222 -50 303 276 165 -242 165 152 -37 265 245 -30 225 173 24
5408B4J4J35K4k7o2Rk33n2J17j36N1J38r4k04N55j49k86j38K26J27k08j74K62
$$ 24 38 173 197 170 108 117 -116 -168 -51 -187 -136 2 -92 -296 259 110 -176 -314 -88 39 -169 -343 -81
5431h1o3R9J59j77o1J26j45j16L38k22k62L96J71m90O6K29K10k49QP1j75J97N1
$$ -81 -144 -45 114 -63 -124 2 -143 -259 79 -143 -405 -9 162 -328 -262 -33 177 -72 -64 7 -168 29 80
5454H0j39o5k2J36J03j63j6j18K81M4l18m3Q3N25o01L52K33m45O6J95J64k80K68
$$ 80 -59 -124 -146 -10 93 -70 -86 -204 77 121 -197 -240 -157 368 -233 119 352 -93 -27 168 332 52 320
5477C20j61j56J71J04l17J56k32L19j07J36q7j80K23L4k91j12J87L79k66o4K8
$$ 320 159 3 174 278 -39 117 -115 204 97 233 146 -34 189 223 -68 -180 7 386 120 56 84
5498H4k04J21M64m47N7N0j90J29J85k20J68k48jK7J81N08q29K91Q3j37k02K0N60
$$ 84 -120 1 465 18 75 125 -65 64 249 29 197 -51 -52 -25 156 664 -165 126 209 72 -130 -110 450
5521D50o5m84M86o12p6M95n84L21q6p5J71l3k2r0J35j63o5P9J88J16k86j89O28
$$ 450 385 -99 387 -225 -301 194 -390 -69 -155 -230 -59 -92 -114 -204 -69 -232 -297 -218 -30 86 -200 -389 239
5544B39k33k62o0O00l35J43N4j22J79m18J33Q8O7j95j69p5J92L8k12K13J47k29
$$ 239 6 -256 -316 284 -51 92 146 24 203 -215 -82 6 73 -122 -291 -366 -174 -136 -348 -135 12 -217
5566b17J01m04K65J4jR1j02j15P5J68J89j0m88L52L1m55Q87m1m11pK25k02J29
$$ -217 -116 -520 -255 -241 -242 -151 -253 -368 -293 -125 64 54 -434 -82 -51 -506 381 340 -71 -78 147 -55 74
5589G4n2J07l25j00M72M3k41l01L49j42q3K91p4j97lp3J4K20L5r8K47m7q9J05
$$ 74 22 129 -196 -296 176 219 -22 -323 26 -116 -199 92 18 -179 -182 -255 -241 -21 14 -84 163 116 27 132
$$ [...]
8191A30
##END NTUPLES=NMR FID
##END=
