##TITLE=1H_SA_54.219
 CDCl3, 108 sc, 
 6.8.2020
##JCAMPDX= 6.0         $$ Bruker NMR JCAMP-DX V2.0
##DATA TYPE= NMR FID
##DATA CLASS= NTUPLES
##ORIGIN= UXNMR, Bruker Analytische Messtechnik GmbH
##OWNER= root
$$ XWIN-NMR		Version 3.5
$$ Fri Aug  7 10:21:03 2020 Russian Standard Time (UT+4h)  she@DPX200
##.OBSERVE FREQUENCY= 200.1314999998
##.OBSERVE NUCLEUS= ^1H
##.DELAY= (6, 6)
##.ACQUISITION MODE= SIMULTANEOUS
##.ACQUISITION SCHEME= undefined
##.AVERAGES= 108
##.DIGITISER RES= 18
##SPECTROMETER/DATA SYSTEM= spect
##.PULSE SEQUENCE= zg30
##.SOLVENT NAME= CDCl3
##.SHIFT REFERENCE= (INTERNAL, CDCl3, 0, 15.7039)
##AUDIT TRAIL= $$ (NUMBER, WHEN, WHO, WHERE, WHAT)
$$ ##TITLE= Audit trail, XWIN-NMR		Version 3.5
$$ ##JCAMPDX= 5.01
$$ ##ORIGIN= Bruker BioSpin GmbH
$$ ##OWNER= she
$$ F:/spectra/data/she/nmr/H-F/1/audita.txt
$$ ##AUDIT TRAIL=  $$ (NUMBER, WHEN, WHO, WHERE, WHAT)
(   1,<2020-08-07 10:19:36.90 +0400>,<she>,<DPX200>,
      <continue with go, POWCHK disabled, PULCHK disabled
       configuration hash MD5:
       00 E9 B6 7A A2 85 ED C7 34 08 36 98 17 FE 4E 26
       data hash MD5: 16K
       B2 13 3D 14 7C CC FE 2E 45 F3 4A 31 38 FD 33 F4>)
$$ ##END=
$$ 
$$ hash MD5
$$ 92 04 05 9B C5 14 E9 78 45 DA 3B 3B 1C A2 A2 83
##$RELAX= 
##$RELAX= 
##$RELAX= 
##$RELAX= 
##$RELAX= 
##$RELAX= 
$$ Bruker specific parameters
$$ --------------------------
##$DU= <F:/spectra>
##$EXPNO= 1
##$NAME= <H-F>
##$PROCNO= 1
##$TYPE= <nmr>
##$USER= <she>
##$AMP= (0..31)
100 100 100 100 100 100 100 100 100 100 100 100 100 100 100 100 100 100 
100 100 100 100 100 100 100 100 100 100 100 100 100 100 
##$AQSEQ= 0
##$AQ_mod= 1
##$AUNM= <au_zg>
##$AUTOPOS= <>
##$BF1= 200.13
##$BF2= 200.13
##$BF3= 200.13
##$BF4= 200.13
##$BF5= 200.13
##$BF6= 200.13
##$BF7= 200.13
##$BF8= 200.13
##$BYTORDA= 1
##$CFDGTYP= 0
##$CFRGTYP= 5
##$CHEMSTR= <none>
##$CNST= (0..31)
1 1 145 1 1 1 1 1 1 1 1 1 1 1 1 1 1 1 1 1 1 1 1 1 1 1 1 1 1 1 1 1 
##$CPDPRG= <>
##$CPDPRG1= <>
##$CPDPRG2= <>
##$CPDPRG3= <>
##$CPDPRG4= <mlev>
##$CPDPRG5= <mlev>
##$CPDPRG6= <mlev>
##$CPDPRG7= <mlev>
##$CPDPRG8= <mlev>
##$CPDPRGB= <>
##$CPDPRGT= <>
##$D= (0..31)
0 1.2 0 0 0 0 0 0 0 0.06 0 0.03 0 0 0 0 0.0002 0 0 0 0 0 0 0 0 0 0 0 0 
0 0 0 
##$DATE= 1596780862
##$DBL= (0..7)
120 120 120 120 120 120 120 120 
##$DBP= (0..7)
150 150 150 150 150 150 150 150 
##$DBP07= 0
##$DBPNAM0= <>
##$DBPNAM1= <>
##$DBPNAM2= <>
##$DBPNAM3= <>
##$DBPNAM4= <>
##$DBPNAM5= <>
##$DBPNAM6= <>
##$DBPNAM7= <>
##$DBPOAL= (0..7)
0.5 0.5 0.5 0.5 0.5 0.5 0.5 0.5 
##$DBPOFFS= (0..7)
0 0 0 0 0 0 0 0 
##$DE= 6
##$DECBNUC= <off>
##$DECIM= 24
##$DECNUC= <off>
##$DECSTAT= 4
##$DIGMOD= 1
##$DIGTYP= 9
##$DL= (0..7)
0 120 120 120 120 120 120 120 
##$DP= (0..7)
150 150 150 150 150 150 150 150 
##$DP07= 0
##$DPNAME0= <>
##$DPNAME1= <>
##$DPNAME2= <>
##$DPNAME3= <>
##$DPNAME4= <>
##$DPNAME5= <>
##$DPNAME6= <>
##$DPNAME7= <>
##$DPOAL= (0..7)
0.5 0.5 0.5 0.5 0.5 0.5 0.5 0.5 
##$DPOFFS= (0..7)
0 0 0 0 0 0 0 0 
##$DQDMODE= 0
##$DR= 18
##$DS= 0
$$ [...]
##$SUBNAM2= <"">
##$SUBNAM3= <"">
##$SUBNAM4= <"">
##$SUBNAM5= <"">
##$SUBNAM6= <"">
##$SUBNAM7= <"">
##$SUBNAM8= <"">
##$SUBNAM9= <"">
##$SW= 24.9337058888022
##$SWIBOX= (0..15)
0 0 2 0 0 0 0 0 0 0 0 0 0 0 0 0 
##$SW_h= 4990.01996007984
##$TD= 16384
##$TD0= 1
##$TE= 0
##$TE2= 300
##$TE3= 300
##$TEG= 300
##$TL= (0..7)
0 120 120 120 120 120 120 120 
##$TP= (0..7)
150 150 150 150 150 150 150 150 
##$TP07= 0
##$TPNAME0= <>
##$TPNAME1= <>
##$TPNAME2= <>
##$TPNAME3= <>
##$TPNAME4= <>
##$TPNAME5= <>
##$TPNAME6= <>
##$TPNAME7= <>
##$TPOAL= (0..7)
0.5 0.5 0.5 0.5 0.5 0.5 0.5 0.5 
##$TPOFFS= (0..7)
0 0 0 0 0 0 0 0 
##$TUNHIN= 0
##$TUNHOUT= 0
##$TUNXOUT= 0
##$USERA1= <user>
##$USERA2= <user>
##$USERA3= <user>
##$USERA4= <user>
##$USERA5= <user>
##$V9= 5
##$VALIST= <valist>
##$VCLIST= <CCCCCCCCCCCCCCC>
##$VD= 0
##$VDLIST= <DDDDDDDDDDDDDDD>
##$VPLIST= <PPPPPPPPPPPPPPP>
##$VTLIST= <TTTTTTTTTTTTTTT>
##$WBST= 1024
##$WBSW= 4
##$XGAIN= (0..3)
0 0 0 0 
##$XL= 0
##$YL= 0
##$YMAX_a= 973469
##$YMIN_a= -726868
##$ZGOPTNS= <>
##$ZL1= 120
##$ZL2= 120
##$ZL3= 120
##$ZL4= 120
##$ABSF1= 10
##$ABSF2= 0
##$ABSG= 5
##$ABSL= 3
##$ALPHA= 0
##$AQORDER= 0
##$ASSFAC= 0
##$ASSFACI= 0
##$ASSFACX= 0
##$ASSWID= 0
##$AUNMP= <proc_1d>
##$AZFE= 0.1
##$AZFW= 0.1
##$BCFW= 1
##$BC_mod= 2
##$BYTORDP= 1
##$COROFFS= 0
##$CY= 11.3945322036743
##$DATMOD= 1
##$DC= 2
##$DFILT= <>
##$DTYPP= 0
##$F1P= 16.9975609425685
##$F2P= -3.02152046262296
##$FCOR= 0.5
##$FTSIZE= 0
##$FT_mod= 4
##$GAMMA= 1
##$GB= 0.15
##$INTBC= 1
##$INTSCL= 1
##$ISEN= 128
##$LB= 0.24
##$LEV0= 0
##$LPBIN= 0
##$MAXI= 10000
##$MC2= 0
##$MEAN= 0
##$ME_mod= 0
##$MI= 1.114404
##$NCOEF= 0
##$NC_proc= 0
##$NLEV= 6
##$NOISF1= 3.799351
##$NOISF2= 2.8
##$NSP= 1
##$NTH_PI= 0
##$NZP= 0
##$OFFSET= 15.70392
##$PC= 1
##$PHC0= -9797.575
##$PHC1= 17.40092
##$PH_mod= 1
##$PKNL= yes
##$PPARMOD= 0
##$PSCAL= 0
##$PSIGN= 0
##$REVERSE= no
##$SF= 200.130013532006
##$SI= 16384
##$SIGF1= 3
##$SIGF2= 2
##$SINO= 400
##$SIOLD= 16384
##$SREGLST= <1H.CDCl3>
##$SSB= 0
##$STSI= 0
##$STSR= 0
##$SW_p= 3612.71676300578
##$SYMM= 0
##$S_DEV= 0
##$TDeff= 0
##$TDoff= 0
##$TI= <>
##$TILT= no
##$TM1= 0
##$TM2= 0
##$TOPLEV= 0
##$USERP1= <user>
##$USERP2= <user>
##$USERP3= <user>
##$USERP4= <user>
##$USERP5= <user>
##$WDW= 1
##$XDIM= 8192
##$YMAX_p= 0
##$YMIN_p= 0
$$ End of Bruker specific parameters
$$ ---------------------------------
##NTUPLES= NMR FID
##VAR_NAME=  TIME,          FID/REAL,        FID/IMAG
##SYMBOL=    X,             R,               I
##VAR_TYPE=  INDEPENDENT,   DEPENDENT,       DEPENDENT
##VAR_FORM=  AFFN,          ASDF,            ASDF
##VAR_DIM=   8192,          8192,            8192
##UNITS=     SECONDS,       ARBITRARY UNITS, ARBITRARY UNITS
##FACTOR=    0.0002004,     1,               1
##FIRST=     0,             0,               0
##LAST=      1.6414764,     0,               0
##MIN=       0,             -726868,         0
##MAX=       1.6414764,     973469,          0
$$ Real data points
##PAGE= N=1
##DATA TABLE= (X++(R..R)), XYDATA
$$ [...]
3111B509o888K633L934n088o19O790l852n419O713J100p108L277M834n695m084
$$ 2509 -4379 -1746 2188 -2900 -3519 3271 -581 -6000 713 1813 -5295 -2018 2816 -2879 -6963
3126f963Q992j374o881M388K188n883J058N521m658k570O091k130m999O103K156
$$ -6963 2029 655 -6226 -1838 350 -5533 -4475 1046 -3612 -6182 -91 -2221 -7220 -1117 1039
3141A039r209K772O579o517k441P343n82q123N687M094o369l50O027l787k832
$$ 1039 -8170 -5398 1181 -5336 -7777 -434 -1016 -9139 -3452 642 -5727 -6077 -50 -3837 -6669
3156f669O847j335n800M475L518p333K736N889m269l983P038p06l755L411L292
$$ -6669 178 -1157 -6957 -2482 1036 -6297 -3561 2328 -1941 -5924 1114 408 -3347 64 3356
3171C356o818J126P372n348m048O613J85p380O195L341o719m66O886m766j700
$$ 3356 -3462 -2336 5036 -312 -4360 2253 2438 -4942 1253 4594 -2125 -2591 4295 -471 -2171
3186b171N060J96o481L401M896n882P06N767m541m273Q296K16p394M820N095p515
$$ -2171 2889 3085 -3396 5 4901 -981 -275 5492 951 -3322 4974 5190 -2204 2616 7711 196
3202A96j232Q207j951o281O098J592n865K292M619n015j593N845l399m319O674
$$ 196 -1036 7171 5220 -1061 5037 6629 764 3056 7675 2660 1067 6912 3513 -806 5868
3217E868j339n389M347M886p960j949O486j815o987O606J629o399Q57O131m724
$$ 5868 4529 -860 3487 8373 413 -1536 4950 3135 -3852 2754 4383 -2016 -1159 4972 248
3232B48k788N733k761l440M586J001n844K817M077o686l81P896l278o708O076
$$ 248 -2540 3193 432 -3008 1578 2579 -3265 -448 3629 -3057 -3438 4458 1180 -5528 548
3247E48L719q171J944O123n755k424N429n76m793M145O55n646J832N541n525k659
$$ 548 4267 -3904 -1960 4163 -1592 -4016 1413 837 -3956 189 844 -4802 -2970 2571 -2954 -5613
3263e613N246k637m177N041L201p783M52O456n056j294P451l428o949N462K631
$$ -5613 -367 -3004 -7181 -2140 1061 -6722 -6270 186 -4870 -6164 1287 -2141 -9090 -3628 -997
3278i97m064N4M957l911k126O210j258m967M264K760o262L001O384n784k664O234
$$ -997 -5061 -5007 -50 -3961 -6087 123 -1135 -6102 -1838 922 -5340 -2339 4045 -1739 -4403 1831
3294A831N6n119M023L190o880N50P064l145n102M869K147n385K653L955o153N14
$$ 1831 1887 -3232 791 3981 -2899 -2349 4715 1570 -3532 1337 3484 -1901 752 4707 -1446 -932
3310i32N429m055j908P160l086n395L746M679p232Q05O643k913n443N587K221
$$ -932 4497 442 -1466 5694 2608 -2787 959 5638 -1594 -789 5854 2941 -2502 3085 5306
3325E306n895J789N427m154j626M449j046j709L185o43m953L483L504p115O02
$$ 5306 -589 1200 6627 2473 847 5296 4250 2541 5726 5083 130 3613 7117 2 604
3340F04P379m949m257O510J786p158J065N590l662l940M719j72m850M178P39n589
$$ 604 7983 3034 -1223 5287 7073 -85 980 6570 2908 -1032 3687 3515 -1335 2843 3582 -2007
3356b007L157K718o036Q59N663m316l668O228M86o611J791O264n262m133O832
$$ -2007 1150 3868 -2168 -1309 4354 38 -3630 2598 3084 -3527 -1736 4528 -734 -4867 1965
3371A965J27o114L990rk387J94M001m952j281O388l261m327N658p33m031J515
$$ 1965 2092 -4022 -32 -41 -2428 -2234 1767 -3185 -4466 1922 -1339 -5666 -8 -741 -4772 -3257
3387c257M602n312k129O394k241n937N161L527n949j137M979j296l359N179j645
$$ -3257 1345 -3967 -6096 298 -1943 -7880 -2719 808 -5141 -6278 -1299 -2595 -5954 -775 -2420
3402b420n530M384L887n329Q43M611n486j482O180l75n772N181K136n551J273
$$ -2420 -7950 -3566 321 -5008 -4165 446 -5040 -6522 -342 -717 -6489 -1308 828 -4723 -3450
3417c450M117k099n120O169L048p159K147M561l913j117M151j500k011L833j388
$$ -3450 667 -1432 -6552 -383 2665 -4494 -2347 2214 -1699 -2816 1335 -165 -2176 1657 269
3432B69l177L137L332o329J884O170m365m819P272L94n316K143N472m948j337
$$ 269 -2908 229 3561 -2768 -884 5286 921 -3898 3374 3768 -1548 595 6067 1119 -218
3447b18M574j947k734K759J635l829L075K201n145J144N581m321m735P041J023
$$ -218 4356 2409 -325 2434 4069 240 3315 5516 371 1515 7096 2775 -1960 5081 6104
3462F104p970L738O168n569l026O127j036m892K999K567l712n9L007l958m37M009
$$ 6104 -1866 1872 8040 2471 -555 5572 4536 -356 2643 5210 1498 1439 4446 488 51 4060
3478D060k211k515L914M29o003L551M414o621k602P425j543o042M248L677o281
$$ 4060 1849 -666 3248 3677 -2326 1225 5639 -982 -3584 3841 2298 -3744 504 4181 -2100
3493b100Q58M894l232m533N188n48m283L712N55l647J219M520n821n23M382q87
$$ -2100 -1242 3652 420 -4113 1075 527 -3756 -44 511 -3136 -1917 2603 -3218 -3741 641 -246
3509b46n296O113K25o077J473N541m558k465N597q32m044J974K038m116n43M689
$$ -246 -5542 571 796 -5281 -3808 1733 -2825 -5290 307 -525 -4569 -2595 -557 -4673 -5216 -527
3525e27k843k719O205l001j621L286J988o004K551M174m779k269N913r3n744L236
$$ -527 -3370 -6089 116 -2885 -4506 -1220 768 -5236 -2685 1489 -3290 -5559 354 261 -5483 -2247
3541b247M974n032j916N904k516k232L701O14l929J247K110l902J400N785m441
$$ -2247 2727 -2305 -4221 1683 -833 -3065 636 1250 -2679 -1432 678 -3224 -1824 3961 -480
3556d80k525N851k64o814N495L243n512j494O854j927m525L630K505m028J24L641
$$ -480 -3005 2846 2582 -4232 1263 4506 -1006 -2500 4354 2427 -2098 1532 4037 9 133 3774
3572C774l176n04M178k934j691M330N03n056K823M264n152j429O830k298n660
$$ 3774 598 94 4272 1338 -353 3977 4480 -576 2247 6511 1359 -70 6760 4462 -1198
3587a198M072L748o041J581L452k727j937M293k532k310L472p14l255K165M009
$$ -1198 2874 6622 581 2162 5614 2887 950 5243 2711 401 3873 3159 -96 2069 6078
3602F078n591j893O528k490m659N522J117n553J956K944k773l294O268j154l862
$$ 6078 487 -1406 5122 2632 -2027 3495 4612 -941 1015 3959 1186 -2108 4160 3006 -856
3617h56K979M40k883M09M178n229J30M449l335l476M274J259m546J055M512l894
$$ -856 2123 2563 -320 89 4267 -962 -832 3617 282 -3194 1080 2339 -2207 -1152 3360 -534
3633e34k607N686j167m380K276K587m737k28M067j498l666L779N47m323M155K14
$$ -534 -3141 2545 1378 -3002 -726 1861 -2876 -3104 963 -535 -4201 -422 125 -4198 -43 171
3649A71l227m24L701k430k657L733Q5m454L253K387m446n92N291k139l297L655
$$ 171 -3056 -3480 221 -2209 -4866 -1133 -1048 -5502 -2249 138 -4308 -4900 391 -1748 -5045 -1390
3665a390J052m762K157K841l724Q59K285j176j974M097j472l091K590L113n168
$$ -1390 -338 -5100 -2943 -102 -3826 -2967 -682 -1858 -3832 265 -1207 -4298 -1708 1405 -3763
3680c763K56O169l610l647M302J233l776R32K809k930n83L817j990k259M322K97
$$ -3763 -3507 2662 -948 -4595 -293 940 -2836 -1904 905 -2025 -2608 1209 -781 -3040 1282 1579
3696A579m032L560R57m744J526L744j731l062M284J316n102J733M380l502r65
$$ 1579 -2453 1107 2064 -2680 -1154 2590 859 -2203 2081 3397 -1705 28 4408 906 -59
3711e9L647j007k830L713n98k558J419K513l454O99K741p52m137L931O93m062
$$ -59 3588 2581 -249 3464 2866 308 1727 4240 786 1485 4226 3474 -663 3268 3961 -101
3727a01J520L290k586k536L375K12l876K687K033m849J957K460k878r38L756O0
$$ -101 1419 4709 2123 -413 2962 3174 -702 1985 4018 -831 1126 3586 708 -230 3526 3586
3743C586m394L869j84k509J26L125k187j959L682j327l904L429J792m227R15L447
$$ 3586 -808 3061 2877 368 494 3619 1432 -527 3155 1828 -2076 1353 3145 -1082 -167 3280
3759C280l985j128L378L94n059K197J982l738J021K921l667j652M427j315l503
$$ 3280 -705 -1833 1545 1939 -3120 -923 1059 -2679 -1658 1263 -2404 -4056 371 -944 -4447
3774d447K778J530m248J227L458k297k959M711m81l425J310L355l473q19M054
$$ -4447 -1669 -139 -4387 -3160 298 -1999 -4958 -247 -728 -4153 -2843 512 -2961 -3780 274
3789B74k475j257K205L40l534L200K331m926m59N051k845k199M608l89m014L19
$$ 274 -2201 -3458 -1253 -913 -4447 -1247 1084 -3842 -4301 750 -2095 -4294 314 -75 -4089 -3770
3805c770N387l855j145M216j172l781M128k14l060K461K281l673L34M879l357
$$ -3770 1617 -2238 -3383 833 -339 -4120 8 -206 -3266 -805 1476 -2197 -1863 3016 -341
3820c41k417L431J029l201J909L132m768j38L588M53m107L590J423l298J805K988
$$ -341 -2758 673 1702 -1499 410 3542 -1226 -1364 2224 2677 -1430 2160 3583 285 2090 5078
3836E078l655j215M127k229k054L571J245n389J390N103n362l59L532j045l445
$$ 5078 1423 208 4335 2106 52 3623 4868 -521 869 5972 610 251 3783 2738 -707
3851g07K412K039m176K049J470j683j158K736p26l707L291J205l808J326L760
$$ -707 1705 3744 -432 1617 3087 1404 246 2982 2256 -1451 1840 3045 -763 563 4323
3866D323l012k013M664j523k617K619P73m154J523L629l243k068L156Q02n563
$$ 4323 1311 -702 3962 2439 -178 2441 3214 -940 583 4212 969 -1099 2057 2859 -2704
3881b704N684R3n255J912L124k756k390L183j151l477K569L049n023J069L162
$$ -2704 2980 3073 -2182 -270 2854 98 -2292 891 -260 -3737 -1168 1881 -3142 -2073 1089
3896A089m326j277L993Q32l387K20L547m354j08N547l042l107M025q54k292K702
$$ 1089 -3237 -4514 -521 311 -3076 -2856 691 -3663 -3771 1776 -1266 -4373 -348 -1202 -3494 -792
3912g92Q79l614Q46L501j496k111K257J66m657L978K533l689q95L213o27l143
$$ -792 87 -3527 -2681 820 -676 -2787 -530 -364 -5021 -1043 1490 -2199 -3094 119 -508 -3651
3928c651M088m66k686Q4K109j878J35K503j420k108L511J431m820J384K662k836
$$ -3651 437 -29 -2715 -2631 -522 -2400 -2265 238 -1182 -3290 221 1652 -3168 -1784 878 -1958
3944a958r5M083p17l222K725Q96l173J209L334k171j061K852j734k474M444r3
$$ -1958 -2053 2030 1313 -1909 816 1712 -1461 -252 3082 911 -150 2702 968 -1506 2938 2845
3960B845k054N80L219l413q00L122j195m076L984J465m414K095L395l543p44M004
$$ 2845 791 1371 4590 1177 377 3499 2304 -1772 2212 3677 -737 1358 4753 1210 466 4470
3976D470j332l618K740K047m112L41L718k616j392L165j970j418J633J180l392
$$ 4470 3138 -480 2260 4307 195 536 4254 1638 246 3411 1441 23 1656 2836 -556
3991e56J181L196l015j360L644j130k688K337J993m643P4M535j978l469L455m56
$$ -556 625 3821 806 -554 3090 1960 -728 1609 3602 -1041 -967 3568 1590 -1879 1576 1120
4007A120k726K309J71k196J91L665m055q61L571O28n457L746J988m606O95M562
$$ 1120 -1606 703 874 -1322 -1131 2534 -1521 -2382 1189 1817 -3640 106 2094 -2512 -1817 2745
4023B745l568l081L394l2k723J821O44k230M77K925k284k697M159N48n013L140
$$ 2745 -823 -3904 -510 -542 -3265 -1444 -800 -3030 -2553 372 -1912 -4609 -450 98 -4915 -1775
4039a775K951m751m86M207p54l951L733m28k629K09L677k752o3K422j016k210
$$ -1775 1176 -3575 -4061 146 -608 -4559 -826 -1254 -3883 -3674 3 -2749 -2812 -390 -1406 -3616
4055c616L819o77l507K321L113m128J86L696k581k985M558J206n295K995L256
$$ -3616 203 -474 -3981 -1660 1453 -2675 -2489 1207 -1374 -4359 199 1405 -3890 -895 2361
4070B361l952L82K553l86k433J841J842l947K227J725k485q43L877k081k665L603
$$ 2361 -1591 -1209 1344 958 -1475 366 2208 -1739 488 2213 -272 -1115 2762 681 -1984 1619
4086A619P85m328K131K475j907q85L044o0l641K706K129m194N17K957j685j614
$$ 1619 2404 -1924 207 2682 775 -110 2934 2874 -767 1939 4068 -126 391 3348 1663 49
4102D9L504j675j427J406R36l796J756L314l407p46L557n23m409L505K596m311
$$ 49 3553 1878 451 1857 2793 -1003 753 4067 660 -86 3471 2948 -1461 2044 4640 329
4118C29o9L694k037k641M472j434l085K067P20j939Q77J969l252p23L272k008
$$ 329 260 3954 1917 -724 3748 2314 -771 1296 2016 77 954 2923 -329 -1052 2220 212
4134B12q35J702O38l324m70N791l347l512L920J175m997K346K479l041m27L517
$$ 212 -623 1079 1717 -1607 -2077 3714 367 -3145 775 1950 -3047 -701 1778 -1263 -1690 1827
4150A827j646k253K758j173j637J417J133l479K64L615k290k161L967O3l052p16
$$ 1827 181 -2072 686 -487 -2124 -707 426 -3053 -2789 826 -1464 -3625 342 405 -2647 -3363
4166c363M557l806j094L351j398j130K089K23k369R06K993k765p57K458k098j230
$$ -3363 1194 -2612 -3706 -355 -1753 -2883 -794 -571 -2940 -2034 959 -1806 -2563 -105 -2203 -3433
4182c433L287j43j989O66K724k763k964N675j292k982K477J100k764N77K566k090
$$ -3433 -146 -289 -2278 -1612 1112 -1651 -4615 1060 -232 -3214 -737 363 -2401 -1824 742 -1348
4198a348n90K872j463j953L298j27l405K722J820l084j58L473j037k264J976K087
$$ -1348 -1938 934 -529 -2482 816 689 -2716 6 1826 -1258 -1416 2057 1020 -1244 732 2819
4214B819l777P51L438l374k067M179P26l486K754K89k490J254K787l167j127M659
$$ 2819 -958 -207 3231 -143 -2210 1969 2695 -791 1963 2252 -238 1016 3803 636 -491 4168
4230D168k869j874L039M54l681P17L665k687j083L324l48k500J590K021k741P7
$$ 4168 1299 -575 2464 2918 -763 -46 3619 932 -151 3173 2825 325 1915 3936 1195 1272
4246A272K829j846k345L090n49l666K665K485l903o92L392j594j957K721P65m248
$$ 1272 4101 2255 -90 3000 2451 -1215 1450 3935 32 -660 2732 1138 -819 1902 2667 -1581
4262a581J926J859k150L45J983k027j650J878N3j728J593J138m669N94M714l101
$$ -1581 345 2204 54 399 2382 355 -1295 583 636 -1092 501 1639 -3030 -2436 2278 -823
4278h23m88K431j77m461K177L051l691j221M316j688j939J955J237l330J723J223
$$ -823 -1311 1120 943 -3518 -1341 1710 -1981 -3202 1114 -574 -2513 -558 679 -2651 -928 295
4294B95k354j346K818j32k762L049K3l040J971K066k485m20L204l147j222K440
$$ 295 -2059 -3405 -587 -719 -3481 -432 -409 -3449 -1478 588 -1897 -2317 887 -2260 -3482 -1042
4310a042P87k609J108K871l447r47L055p08k422L139k86l288K123J751k242l8
$$ -1042 -255 -2864 -1756 1115 -2332 -3279 -224 -932 -3354 -215 -501 -3789 -1666 85 -2157 -2195
4326b195K409j867k042M053L63l778J895L045k340j914L950J43l680K828J132
$$ -2195 214 -1653 -3695 358 721 -3057 -1162 1883 -457 -2371 1579 1722 -1958 870 2002
4341B002k221p6K723j676m75J390R09m419L267J116k748J6L059l271q90L314j260
$$ 2002 -219 -295 2428 752 277 1667 2576 -1843 1424 2540 -208 -192 2867 -404 -1294 2020 760
4358G60j031O99K146k161n07L774k437j704K952j026p99K216P41l420J696J785
$$ 760 -271 428 2574 413 -94 3680 1243 -461 2491 1465 666 2882 3623 203 1899 3684
4374C684k241j587L942j134k532J547J901l889J015K733j824j948K793k22k865
$$ 3684 1443 -144 3798 2664 132 1679 3580 -309 706 3439 1615 -333 2460 2238 -627
4389f27Q51K552l502N67K249k111j223K400L14m225L006J952l629j26L902j650
$$ -627 224 2776 -726 -159 2090 -21 -1244 1156 1470 -2755 251 2203 -1426 -1552 2350 700
4405G00k186J907K68k564J940K83j634J239O75l43l757L330P81l381K186K49j036
$$ 700 -1486 421 689 -1875 65 348 -1286 -47 628 285 -3472 -142 639 -2742 -556 -307 -1343
4422a343j087K543j865k337L410k0k905Q78K937k329j089M423k567k331K982L35
$$ -1343 -2430 113 -1752 -4089 -679 -699 -3604 -2726 211 -2118 -3207 1216 -1351 -3682 -700 -365
4438c65j927P39J722j924p85K511n08k584K447O9j964J247K632k621J27K032j822
$$ -365 -2292 -1553 169 -1755 -2540 -29 -537 -3121 -674 -605 -2569 -1322 1310 -1311 -1184 848 -974
4455i74o74J247J429k244N95K912l438L43K161j076j471J559J478k682Q58K471
$$ -974 -1648 -401 1028 -1216 -621 2291 -1147 -804 1357 281 -1190 369 1847 -835 23 2494
4471B494k782r68M070k026j946K287L13k414O79K221j169k291K876L02j486N20
$$ 2494 -288 -1256 2814 788 -1158 1129 1442 -972 -293 1928 759 -1532 1344 1646 160 680
4487F80Q72k266J767J541k016p92K116K55k420K339J218k768p14L751j901r98
$$ 680 1552 -714 1053 2594 578 -214 1902 2157 -263 2076 3294 526 -188 3563 1662 664
4503F64J926N93l410K386R14k960J627J632k435k584M852l30l944J626J9j135
$$ 664 2590 3183 -227 2159 3073 113 1740 3372 937 -1647 3205 2875 -1069 557 576 -559
4519e59lJ854j789k37J356n0l106K073K461l049M79J890j757l78K378o58k420
$$ -559 -562 1292 -497 -734 622 572 -2534 -461 2000 -1049 -570 1320 -437 -815 1563 905 -1515
4536a515J783J215l217N35L308k774j143K156j90k214J210J265j997J76K141p33
$$ -1515 268 1483 -1734 -1199 2109 -665 -1808 348 158 -2056 -846 419 -1578 -1402 739 6
4552Fk934K187P0k036N52K855k007j084J982k59n38J547k79k758J430J967k610
$$ 6 -2928 -741 -671 -2707 -2155 700 -1307 -2391 -409 -668 -1206 341 62 -2696 -1266 701 -1909
4569a909o54K882Ol631K867J120k778J143K330k231q91K918j799q07J351Q85j769
$$ -1909 -2563 319 325 -3306 -439 681 -2097 -954 1376 -855 -1746 1172 -627 -1434 -83 802 -967
4586i67o48K991k239O03J415j191j241K317J409l859Q30L422k648j135J814M35
$$ -967 -1615 1376 -863 -260 1155 -36 -1277 1040 2449 -1410 -580 2842 194 -941 873 1308
4602A308j675Q22J546j834j86K445k057r44K689j072j219K398n8j490J40K306
$$ 1308 -367 455 2001 167 -19 2426 369 -575 2114 1042 -177 2221 2163 673 813 3119
4618C119j683j327P63j52j653J808K486l005L78O02P51l400K791P64k540J200
$$ 3119 1436 109 872 720 -933 875 3361 356 734 1336 2087 -1313 1478 2242 -298 902
4634I02Q68j052n77K312j970r78K071O99l747K148K069k480o11K726j412k823
$$ 902 1770 718 141 2453 483 -495 1576 2275 -1472 676 2745 265 -346 2380 968 -1855
4650a855L910o58k514J587J274j819r00K287r21k647K632K10k078J381O82k262
$$ -1855 2055 1397 -1117 470 1744 -75 -975 1312 391 -2256 376 586 -1492 -111 571 -1691
4666a691l36K928p79k573J345K634l358J856K20k903N58K049L17k428K059J93
$$ -1691 -2027 901 122 -2451 -1106 1528 -1830 26 246 -2657 -2099 -50 267 -2161 -102 91
4682I1k731J827J377j706m20K826k453p98J584J788l698J133K254l645M74K296
$$ 91 -2640 -813 564 -1142 -1562 1264 -1189 -1987 -403 1385 -2313 -1180 1074 -2571 -2097 199
4698A99j355j897K758Q84k492j46J964k218J63K353p02k14l20K257m243K674O54
$$ 199 -1156 -3053 -295 589 -1903 -2049 -85 -2303 -2140 213 -489 -703 -1023 1234 -3009 -335 319
4715C19q95m41K124j169j005L7K708k887J259O73j496o33J670R82j810M99J731
$$ 319 -576 -1017 1107 -62 -1067 -1030 1678 -1209 50 723 -773 -1406 264 1246 -564 -65 1666
4732A666k067n99K761j677j061K498L91k397K243j8k630R59K040j134j659K710
$$ 1666 -401 -1000 1761 84 -977 1521 1912 -485 1758 1740 -890 69 2109 975 -684 2026
4748B026p47m01O98l10j360K65K161l81j440R59K91k159J077J467k288O24J082
$$ 2026 1279 878 1576 1266 -94 171 2332 1951 511 1470 1761 -398 679 2146 -142 482 1564
4765A564n00j889L338j265k463J774J066j691k75J848j059p81Q63M92k04P3j79
$$ 1564 1064 -825 2513 1248 -1215 559 1625 -66 -341 1507 448 -333 530 1022 818 891 712
4782G12m52J24R15j817q52J389J729k196p8J722j588l25K465j705k345K091J266
$$ 712 260 384 1299 -518 -1370 19 1748 -448 -526 1196 -392 -717 1748 43 -2302 -211 1055
4799A055j730N26K9p23n15J758j076O3O00k85r56N34J695k192q21L442k159q97
$$ 1055 -675 -149 -120 -843 -1358 400 -676 -613 -13 -298 -1254 -720 975 -1217 -2038 1404 -755 -1652
4817a652J82J383k294j4K056o69n99J638o16j615J288N13j382J384m96m06K48
$$ -1652 -1470 -87 -2381 -2395 -339 -1008 -1607 31 -585 -2200 -912 -399 -1781 -397 -893 -1299 -1051
4834a051J770j515j606J922K61m21j147K586k013m04K004O54k202J372M20j860
$$ -1051 719 -796 -2402 -480 -219 -640 -1787 799 -1214 -1618 386 1040 -1162 210 630 -1230
4850a230J311R48r70L9J893k540k15J679M12j620j24J094Kj601J797P95k382P95
$$ -1230 81 1029 59 98 1991 -549 -764 915 1327 -293 -417 677 679 -922 875 1670 -712 83
4868H3J561j355M31J187j108p31K214q77k141J904J339k047M58m8P92q20J68M92
$$ 83 1644 289 720 1907 799 68 2282 1405 -736 1168 2507 460 918 870 1662 842 1010 1502
4886A502j885J681K11j163j120L145k26k296J597l17j561J462k11j135M09K251
$$ 1502 -383 1298 1509 346 -774 2371 2145 -151 1446 1129 -432 1030 819 -316 93 2344
4902B344k875N47J62J006k466J899J671k916N49K109j121k257J124L37j427J477
$$ 2344 -531 16 178 1184 -1282 617 2288 -628 -79 2030 909 -1348 -224 113 -1314 163
4918A63J894k498k77J402o14o17O29k86j671J656L25j282J23J936j212j139J540
$$ 163 2057 -441 -718 684 70 -547 82 -204 -1875 -219 106 -1176 -1053 883 -329 -1468 72
4935G2m21j501k5K533k726R55L52r1p25Q84O80j478M34J335k254K32R97M28j598
$$ 72 -349 -1850 -1875 658 -2068 -1113 -761 -852 -1577 -693 -13 -1491 -1057 278 -1976 -1744 -747 -319 -1917
4954a917J204N79o42O26J017k316k65J279L96j657Q90R18k048J112J103n89n22
$$ -1917 -713 -134 -776 -150 867 -1449 -1714 -435 -39 -1696 -806 112 -1936 -824 279 -310 -832
4971h32P40p59l92J687P57l327J932J498j689n09L028k114j662K754j85j778R70
$$ -832 -92 -851 -1243 444 1201 -2126 -194 1304 -385 -894 2134 20 -1642 1112 927 -851 119
4988A19J603k404k29J641N4j862J367K101k057L57P27q05j131J985M52k199J044
$$ 119 1722 -682 -911 730 784 -1078 289 2390 333 690 1417 612 -519 1466 1918 -281 763
5005G63J160j143l83O56L98j144J209l59n41J674l2k061jJ906k003m93J447O73
$$ 763 1923 780 397 1053 1451 307 1516 1157 616 2290 2258 197 196 2102 99 -394 1053 1726
5023A726k409J776k1j258L77Q00k5k239J695J165k725K274J154k092j41J200J1
$$ 1726 -683 1093 1072 -186 191 991 966 -1273 422 1587 -1138 1136 2290 198 57 1257 1268
5040A268j725Q31J35q61K167K91k723k23J215k40n40N87J439k652l43J454j016
$$ 1268 -457 374 509 -352 1815 2106 -617 -840 375 135 -405 182 1621 -1031 -1374 80 -936
5057i36k81P94L88j737J859N14k191N31K016j670l90J511j307l42J426O90k991
$$ -936 -1217 -423 -35 -1772 87 601 -1590 -1059 957 -713 -1103 408 -899 -1241 185 875 -2116
5074b116K179K73O58k369J734L57l454K284J592l211Q25J180K3o35K88J83r11
$$ -2116 63 336 994 -1375 359 716 -2738 -454 1138 -2073 -1248 -68 -45 -680 -392 -209 -1120
5091a120K77l91k16J55J545j838J91J452l29j824J811K173k561PJ611j639O40
$$ -1120 -843 -1234 -1450 -1295 250 -1588 -1397 55 -274 -2098 -287 1886 -675 -668 943 -696 -56
5108e6n37Q08o16O15M19q77K9J560j625M66N89k38o49m27J367n18j159K199n10
$$ -56 -593 215 -401 214 633 -244 -215 1345 -280 186 775 537 -112 -539 828 310 -849 1350 840
5127H40o23J389o68r15J27P35r00r98J987j45q23J516j310n83J878m87j811O63
$$ 840 217 1606 938 23 150 885 -15 -1013 974 829 6 1522 212 -371 1507 1020 -791 -128
5145a28N25n80R0K74L69m5R86m03j191m0J433j206j362J780J314k392M47L36q5
$$ -128 397 -183 -93 181 550 505 1491 1088 -103 -143 1290 84 -1278 502 1816 -576 -129 207 122
5164A22M93M24q96P0M88J83j079j6J362j108p38J426o56j87O00j87m98j118K482
$$ 122 615 1039 143 213 701 884 -195 -211 1151 43 -695 731 75 -112 488 301 -197 -1315 1167
5183A167k124L29Q92j465N13P8n76n85J266R05r00m12J676j718Q68J48P8r07P0
$$ 1167 -957 -628 264 -1201 -688 -610 -1186 -1771 -505 400 -500 -912 764 -954 -86 62 140 -767 -697
5202f97J132q47j42r6p58j67J565l02r28J154N32m82j593J382j163P60l08J078
$$ -697 435 -412 -554 -650 -1408 -1575 -10 -312 -1240 -86 446 -36 -1629 -247 -1410 -650 -958 120
5220A20o93K95P87n60k196K429J134k213J798m96j095m21J579J1j765K337j394
$$ 120 -573 -278 509 -51 -2247 182 1316 -897 901 405 -690 -1111 468 479 -1286 1051 -343
5237c43J90K53P53p46p5R87j583j91Q93J116k027M22J443j08k295K420q82m81
$$ -343 -153 100 853 107 32 1019 -564 -755 138 1254 -773 -351 1092 984 -1311 1109 227 -254
5255b54P13K43j406N58J519p9j203k91M30l89J631o89j151J281J61o46J03Q03
$$ -254 459 702 -704 -146 1373 1294 91 -200 230 -159 1472 783 -368 913 1074 428 531 1334
5273A334L2j702J001J214k196j98K158p98r09J200j017L64l2O24j867J265K07
$$ 1334 1366 -336 665 1879 -317 -515 1643 845 -64 1136 119 483 451 1075 -792 473 680
5290F80j826J412N03l09k99Q1q2j117L61K009j677j0P69k82j842J956oj284J57
$$ 680 -1146 266 769 460 161 242 160 -957 -596 1413 -264 -274 495 213 -1629 327 321 -963 -806
5309h06J318j983J109J435j060lk47J232j837N02Q77j65k030J393q3j072R89n0
$$ -806 512 -1471 -362 1073 13 10 -237 995 -842 -340 537 372 -1658 -265 -348 -1420 -431 -481
5327d81j018P59J667j088j009P02m86O78J44j14J76k14l78n02M5J599j674k33
$$ -481 -1499 -740 927 -161 -1170 -468 -954 -276 -132 -246 -70 -284 -662 -1164 -1119 480 -1194 -1427
5345a427K208q08r02N8J70n14o21K870j248m05p32K009j534l05J898j184o68J407
$$ -1427 781 -27 -929 -871 -701 -1215 -1836 1034 -214 -619 -1351 658 -876 -1181 717 -467 -1135 272
5363B72r78n06J595o4j359P00J571j605n4M52J177j281j245K752j025r55O72l05
$$ 272 -706 -1212 383 319 -1040 -340 1231 -374 -428 24 1201 -80 -1325 1427 402 -553 119 -186
5381a86J003P09q93o51L34K185k529m96K327j093j124J235O01j430N61l96q81
$$ -186 817 1526 633 -18 316 2501 -28 -524 1803 710 -414 821 1422 -8 553 157 -724
5398g24J4Q76Pl92j24R31r02J198R76j829J161m48N31j569K017q99m77K30J282
$$ -724 -710 166 173 -219 -343 588 -314 884 1860 31 1192 744 1275 -294 1723 824 347 577 1859
5417A859k205j64J066p74L06q4N01j330K79J442m63q71J258l69n92J140p15j327
$$ 1859 -346 -510 556 -218 88 4 505 -825 -546 896 433 -438 820 451 -141 999 284 -1043
5435a043K74Q39p60L31L96O40r46M96K17j814O10J064L39k315J356N43j012N70
$$ -1043 -769 70 -690 -359 37 677 -269 227 444 -1370 -760 304 643 -1672 -316 227 -785 -215
5453b15L60j322O61J343j406o86J613o50q44L04K050k562J056J419j496j028J649
$$ -215 145 -1177 -516 827 -579 -1265 348 -302 -1146 -842 1208 -1354 -298 1121 -375 -1403 246
5470B46l66p46J293j223l06O04J021o05j164J110n85l7k17J094j429J167J20j114
$$ 246 -120 -866 427 -796 -1102 -498 523 -82 -1246 -136 -721 -758 -975 119 -1310 -143 -23 -1137
5488a137O69K81m11K23M46j17j026J172J268j541K99j35n47m0P20M10j20R6k38
$$ -1137 -468 -187 -598 -375 71 -46 -1072 100 1368 -173 126 -9 -556 -596 124 534 414 510 272
5507B72L73j345Q60J292n94o59J815j863o87J458N31j872J167K85j222J091J34
$$ 272 645 -700 160 1452 858 199 2014 151 -536 922 1453 -419 748 1033 -189 902 1036
5524A036r09l08L84N68r34N53J94j023J471o92K14l11R69j595Q39N78Rj600M10
$$ 1036 127 -181 203 771 -163 390 584 -439 1032 340 554 243 1212 -383 456 1034 1043 -557 -147
5543a47J407q61K89J09m18m97M41M64r96J404j66j419L93J284j058j734J756K99
$$ -147 1260 399 688 797 379 -118 323 787 -209 1195 1029 -390 3 1287 229 -1505 251 550
5561E50k139K307n72m34j312K667n86j465J913o34j463Q21O72j041o90J368K9
$$ 550 -1589 718 146 -288 -1600 1067 481 -984 929 295 -1168 -347 325 -716 -1406 -38 -9
5578ij773J536M74j342K98K00p78N17M67j97j359J146L74j434N22J248n43j043
$$ -9 -1782 -246 228 -1114 -816 -616 -1394 -877 -410 -607 -1966 -820 -446 -1880 -1358 -110 -653 -1696
5596a696J495j5q40M89M9J42l47Q04j291k22J486j102J28J558M86k451R86P91
$$ -1696 -201 -216 -1056 -567 -518 -376 -723 81 -1210 -1432 54 -1048 -920 638 1124 -1327 -341 450
5614D50j768O92R49p24m88J83R40p76m49J859k323K608l65Omr7r60o13J177J88
$$ 450 -1318 -626 323 -401 -889 -706 234 -542 -991 868 -1455 1153 788 794 790 693 -267 -880 297 485
5634D85K84l09J83m27r83R81J182j204L9K245j728q59J116k00k79K7k67k75R4
$$ 485 769 460 643 216 -767 214 1396 192 231 2476 748 -111 1005 805 526 553 286 11 105
5653A05N21k21j579J673r12K70Q40k10p53R63m22P40o03N92q29O70M09j95o70
$$ 105 626 405 -1174 499 -413 -143 697 487 -266 697 275 1015 412 1004 175 845 1254 1059 389
5672C89n73J084m76p57L20O51q11j012J978j148p46J758O55j097k70L07p84l45
$$ 389 -184 900 424 -333 -13 638 -173 -1185 793 -355 -1101 657 1312 215 -55 252 -532 -877
5690h77J419j373J620n66o73q58Q11n57N50J221J6m97J87Jk4j720K054m5n22l74
$$ -877 542 -831 789 223 -450 -1308 -497 -1054 -504 717 733 236 423 424 400 -1320 734 689 167 -207
5710b07J270j449K99k71Q63j968P84O47j750J135j59J172q86L26j12l52O17l41
$$ -207 1063 -386 -87 -358 505 -1463 -679 -32 -1782 -647 -806 366 -520 -194 -306 -658 -41 -382
5728c82r25J919q50j04p72K228j673l71J213M99n88k77J303q43l58N01m66J15
$$ -382 -1307 612 -238 -342 -1114 1114 -559 -930 283 782 194 -83 1220 377 19 520 54 169
5746A69K35K44l05l14L14r48R88J190j374k00K03L95j176K70J312j131R53j067
$$ 169 404 648 343 29 343 -605 383 1573 199 -1 202 597 -579 -309 1003 -128 825 -242
5764b42j51l61k30J160k22N51P50j811J230O72p02l04M1O32r76l53J281k08r50
$$ -242 -393 -754 -984 176 -46 505 1255 -556 674 1346 644 340 381 1013 37 -316 965 757 -193
5783a93J833l89j220p3J357j004J39K37p32k31J113p4l72K05K26r63Q32j34j155
$$ -193 1640 1251 31 -42 1315 311 450 687 -45 -276 837 763 391 596 822 -141 691 557 -598
5802e98j11J515o2j77n04M75L50j543J239q77j34M78K72j416J035K34j52j271
$$ -598 -709 806 744 567 63 538 888 -655 584 -293 -427 51 323 -1093 -58 176 24 -1247
5820a247J329l30l37N57O61j578J22J237k89o81J247o65j75Q65n16p59l10J814
$$ -1247 82 -248 -585 -28 633 -945 -823 414 125 -556 691 26 -149 716 200 -559 -869 945
5838I45k824J579N97j310L13N79L71j194N33J606j800l0j21l26k59O14P44K35
$$ 945 -1879 -300 297 -1013 -700 -121 250 -944 -411 1195 -605 -635 -756 -1082 -1341 -727 17 252
5856B52o03M09J3p67Q79J6j019N18Q11j401L36M27K96j562K310j569l8J112P02
$$ 252 -351 58 71 -696 183 199 -820 -302 509 -892 -556 -129 167 -1395 915 -654 -692 420 1122
5875A122j973P17r5m74N61m52m25K63J344r5n48K40P94j128J1J333j253K98J029
$$ 1122 -851 -134 -229 -703 -142 -594 -1019 -756 588 493 -55 185 979 -149 -138 1195 -58 240 1269
5894A269j005k47K48R22k074J88J376Q55k095J163k44n27J76o2K51n74J642p42
$$ 1269 264 17 265 1187 -887 -699 677 1532 -563 600 356 -171 5 -57 194 -380 1262 520
5912E20j004N70N71j829J539J268j877m13J967q55n52R74L14j095o5P99p86L99
$$ 520 -484 86 657 -1172 367 1635 -242 -655 1312 457 -95 879 1193 98 33 832 46 445
5930D45Q28r31j166Q99J05q01J421O24j355p19J397k0j778Q81N94j064P45j74
$$ 445 1273 342 -824 75 180 -621 800 1424 69 -650 747 727 -1051 -170 424 -640 105 -69
5948f9R77r53M66r29j33j58P0m02J93O22Nj542J393j47N02N91q24O21q87Q71p12
$$ -69 908 -45 421 -508 -641 -799 -729 -1131 -938 -316 -311 -1853 -460 -607 -105 486 -338 283 -604 267 -445
5969d45K59n94J036r26m79J486k77j303N81p8M73J71K18n93Q72K42j744P80R32
$$ -445 -186 -780 256 -670 -1149 337 60 -1243 -662 -740 -267 -96 122 -471 401 643 -1101 -321 611
5988F11j157q98J474j698J587k53j01n68O67N17L28j690J448M51j504J797p17
$$ 611 -546 -1444 30 -1668 -81 -334 -435 -1003 -336 181 509 -1181 267 718 -786 1011 294
6005B94l25j047K218jj770M93M19j192P00R97o23j110K37P92o43J276R13j846
$$ 294 -31 -1078 1140 1139 -631 -138 281 -911 -211 786 163 -947 -710 82 -561 715 1628 -218
6023b18M86k6N70j6p31O92j644J237J86P01k131J673j336J190j007O71J131j185
$$ -218 268 242 812 796 65 757 -887 350 536 1237 -894 779 -557 633 -374 297 1428 243
6041B43Q04j233Q31J431j558m97J693j609O36m47k20k49o36J194K90j403Q66M21
$$ 243 1047 -186 645 2076 518 21 1714 105 741 294 74 -175 -811 383 673 -730 136 557
6059E57m69L08k13J5p08N29J48j011K054p22j031P6Q05l59L9P46p65n97Q57Q16
$$ 557 88 396 183 198 -510 19 167 -844 1210 488 -543 -467 338 -21 18 764 -1 -598 259 1075
6079A075j162q18K066k144J317R17j292q47J401J91j393N97M35k31n00J034p34
$$ 1075 -87 -905 1161 -983 334 1251 -41 -888 513 704 -689 -92 343 112 -388 646 -88
6096h8j49m76P37j565P91j192J153O88n78J74j34J55J97n16P48L65o45K83o08
$$ -88 -237 -713 24 -1541 -750 -1942 -789 -101 -679 -505 -639 -484 -287 -803 -55 310 -335 -52 -660
6115f60P06r16O06N50j692P95J229k86p73J268k32r60K10L84j543J498r27J233
$$ -660 46 -870 -264 286 -1406 -611 618 332 -441 827 595 -365 -155 229 -1314 184 -743 490
6133D90n39n6j156N0J745j29j086J08J838j522l4Q56q61o71J343J22m70P24J185
$$ 490 -49 -105 -1261 -1211 534 405 -681 -573 1265 -257 -291 565 -296 -967 376 498 28 752 1937
6152A937l442M24K339o33n67m31J492j969P34K057k034k50K156n60p39o58K286
$$ 1937 -1505 -1081 1258 625 58 -373 1119 -850 -116 1941 -93 -343 1813 1253 514 -144 2142
6169B142j898L8J655k299M67O18P10j286k51O24o28L70J029j270K62m28N26j138
$$ 2142 244 282 1937 -362 105 723 1433 147 -104 520 -108 262 1291 21 283 -145 381 -757
6187g57J012l04o40R0J074j48r93R91j482N03j05J178O39r50Q8J151j688J141
$$ -757 255 -49 -689 -599 475 327 -666 325 -1157 -654 -759 419 1058 108 196 1347 -341 800
6205H00J09j581J083P34q36p00J67N12M12N4m26j357J06J114l16j275J722n48
$$ 800 909 -672 411 1145 309 -391 -224 288 700 754 328 -1029 -923 191 -125 -1400 322 -226
6223b26l37k52J171j358J170k5n77p69P42P56j536J330J111k700J712R05o23j908
$$ -226 -563 -815 356 -1002 168 143 -434 -1203 -461 295 -1241 89 1200 -1500 212 1117 494 -1414
6241a414J733K07r8j261L98Q81q98N04k63q78M12K19J47P82q64R19j245J133l86
$$ -1414 319 526 428 -833 -435 446 -452 52 -211 -1089 -677 -458 -311 471 -393 526 -719 414 28
6260B8L74m59m45K74L38l1j044J281L92j19j005M73P15j142P51o66o55Q09P56
$$ 28 402 -57 -502 -228 110 79 -965 316 708 589 -416 57 772 -370 381 -285 -940 -131 625
6279F25n18j401K208j073K09m85m6K88m08J828j112q56R41M52o98N04r94L84J318
$$ 625 107 -1294 914 -159 50 -435 -481 -193 -601 1227 115 -741 200 652 -46 458 -536 -152 1166
6298A166m91l43m0N13m48K66l48J210j375N1K66L75j443R44K36k307J755r15J63
$$ 1166 675 332 292 805 357 623 275 1485 110 161 427 802 -641 303 539 -1768 -13 -928 -765
6317g65J077Q49j067L52r16P46o48m1J109q58J92Q42r24p07J783n84j089J442
$$ -765 312 1161 94 446 -470 276 -372 -413 696 -162 30 872 -52 -759 1024 440 -649 793
6335G93J85k093J100K35o71j42J061m9k74J38R6j135L92J176m21o78M83R22k800
$$ 793 978 -1115 -15 220 -451 -593 468 419 145 283 379 -756 -364 812 391 -287 196 1118 -1682
6354a682J661l0m86R74j025J054r11L72M88l52N71j37j681J255N2l00K5N57j250
$$ -1682 -21 -51 -537 437 -588 466 -445 -73 415 63 634 497 -1184 71 123 -177 -152 405 -845
6373h45J123k00N44j643M42N97j44L28l0l81Q4p21K480k014m29O07J30m9O25k41
$$ -845 278 78 622 -1021 -579 18 -126 202 172 -209 -125 -846 1634 -380 -809 -202 -72 -121 504 263
6393B63O1J87p72N6n52J191j14o15j4j23M22L38N89o21m01M20j19r25R07R50j671
$$ 263 324 511 -261 -205 -757 434 320 -295 -309 -432 -10 328 917 296 -105 315 196 -729 178 1128 -543
6414e43k39J260n12n98J117J32K62J90n6j843J094M82j92q83Q42o39l24j94J134
$$ -543 -782 478 -34 -632 485 617 879 1069 1013 -830 264 746 554 -329 513 -126 -450 -644 490
6433D90n17o0R44o15j87J28J13j087O12J119j204J61o9l16j50J867o91j468J702
$$ 490 -27 -87 857 242 55 183 296 -791 -179 940 -264 -103 -172 -488 -638 1229 538 -930 772
6452G72l0l49p20L75K87n99P00K25j187J146n45K50J076j043j48o14m68J440k052
$$ 772 742 393 -327 48 335 -264 436 661 -526 620 75 325 1401 358 210 -404 -872 568 -1484
6471a484J635J1r82J83P80j23P7j76K70o98M17K10p37R37o68p4l76R91Q11k611
$$ -1484 151 162 -820 -637 143 20 97 -79 191 -507 -90 120 -617 320 -348 -422 -798 193 1004 -1607
6491a607J349M55p9l74MR06q54R3J481j448j98q34J432q77J406j685n92J167k39
$$ -1607 -258 197 118 -256 -252 654 -200 -107 1374 -74 -272 -1106 326 -551 855 -830 -1422 -255 -494
6510d94j32o58J913q12L68J024j532J333j503l60M75O47k70L47J97q05M53p53
$$ -494 -626 -1284 629 -183 185 1209 -323 1010 -493 -853 -378 269 -1 346 543 -262 191 -562
6528e62J338n48q33k31J786j111k5L50m37L94P26l73o53J451j677K2N93J015q39
$$ -562 776 228 -605 -836 950 -161 -186 164 -273 121 847 474 -179 1272 -405 -383 210 1225 386
6547C86o16J578o29j095J82J103j270Q94N36o81L62J88J5j684J164O53l95j473
$$ 386 -230 1348 719 -376 -194 909 -361 533 1069 388 750 938 953 -731 433 1086 691 -782
6565g82R00j379J480l19N93R6p7o76J007k45j123Q82j651J239J10l57K2O34k48
$$ -782 118 -1261 219 -100 493 589 512 -164 843 598 -525 357 -1294 -55 55 -302 -280 354 106
6584A06N79o17O68p72K94n91j90k44O56O04j181J073l39l8k16M84j240Q89p0j074
$$ 106 685 68 736 -36 258 -333 -523 -767 -111 493 -688 385 46 8 -208 276 -964 -75 -145 -1219
6604a219R31J14J213j675J091j221r2L31j74O63n56P11l23K02l42L90r95O40m7
$$ -1219 -288 -174 1039 -636 455 -766 -858 -527 -701 -38 -594 117 -206 -4 -346 44 -951 -311 -358
6623c58J24p20N81Ol51k09M36kQ19k44k16J20J63J064j863J99L4L07P56K35j967
$$ -358 -234 -954 -373 -367 -718 -927 -491 -493 326 82 -134 -14 149 1213 -650 -451 -417 -110 646 881 -1086
6644a086O01J780j282O69l98n90q44J187l57O32j43L25Q59j115q11j07k82N67
$$ -1086 -485 1295 13 682 284 -306 -1150 37 -320 312 169 494 1353 238 -573 -680 -962 -395
6662c95R09L19j598P42l19N68R63r80k38p50J416L29j834J189Q2J3pj130Q38n1
$$ -395 514 833 -765 -23 -342 226 1189 209 -29 -779 637 966 -868 321 403 416 409 -721 117 66
6682F6J50r35J181J83k83l04n15K31Q06j77l04J056k287L99J145m5j000N97r31
$$ 66 216 -719 462 645 362 58 -457 -226 580 403 99 1155 -1132 -733 412 367 -633 -36 -967
6701i67J540n15K48p61J075op46M69l14Q27l36J11j122O00P33L33m29j138m59
$$ -967 573 58 306 -455 620 614 -132 337 23 850 514 625 -497 103 836 1169 740 -398 -857
6720h57Q82J47M17K1j419N02P7p83P37K91j83l09L33j38n99Q06L71m50N16p09
$$ -857 25 172 589 610 -809 -307 -230 -1013 -276 15 -168 -477 -144 -282 -881 -75 296 -154 362 -347
6740c47R88o68J84m52m96k72R43n77k92J204K9j355K064n64j358K67Q54j83j49
$$ -347 641 -27 157 -295 -791 -1063 -120 -697 -989 215 244 -1111 953 389 -969 -702 152 -31 -180
6759a80N82r60M10l51Q83m20P22j479K34J265j656N65r8k27P79q4k4P24j502J083
$$ -180 402 -558 -148 -499 384 -36 686 -793 -559 706 -950 -385 -483 -710 69 -15 -39 685 -817 266
6779B66o05L03J6m17R59k27o56J403q96K18j92j62R7J07K65j404J489m08j022
$$ 266 -339 -36 -20 -437 522 295 -361 1042 146 364 172 10 107 214 479 -925 564 156 -866
6798h66n3J109p9L74m19q2P80j261J324n32j95K66q1r64J117M70p11L14N21j057
$$ -866 -919 190 111 485 66 -16 764 -497 827 295 100 366 285 -679 438 908 197 511 1032 -25
6818b5l12O07J169r22l44J450j907L24J516j614L47j437L70N62J9J540j656o33
$$ -25 -337 270 1439 517 173 1623 -284 40 1556 -58 289 -1148 -778 -216 -197 1343 -313 -946
6836i46J762j043Q76J04n57o0J155n90j032o55l2M14O14O68k21j066M8J269r55
$$ -946 816 -227 649 753 196 136 1291 701 -331 -986 -1018 -604 10 678 457 -609 -561 708 -247
6855b47K9Q64o86r87R77L60l08j56m57n35R25J187j229j89J519o20o42K96k0j80
$$ -247 -218 646 -40 -1027 -50 310 2 -154 -611 -1146 -221 966 -263 -452 1067 447 -195 101 81 -99
6875i9q40J028p43J026K58q88K64m67M55r48R8Q98J88m43K3J326j654L48k82Q16
$$ -99 -939 89 -654 372 630 -258 6 -461 -6 -954 -856 42 230 -213 -190 1136 -518 -170 -452 364
6895C64j52J91r92O78L02j86l00j75Q96n89l94J76N85j105J448k64K26r79L40
$$ 364 212 403 -589 89 391 205 -95 -270 626 37 -357 -181 404 -701 747 483 709 -270 70
6914G0J68j328J162k19Q56o68J346j761O91J069q24K96n23o97M63R35M86j501
$$ 70 238 -1090 72 -147 709 41 1387 -374 317 1386 562 858 335 -362 101 1036 1522 21
6932B1l56Q75M2l65l9L86n96N45j24q35K65M40k22k75j43M52l54Q82N6r70n2P89
$$ 21 -335 540 582 217 178 564 -32 513 389 -446 -181 259 37 -238 -381 71 -283 599 655 -315 -367 422
6954D22j298K93J024k48q21J225j044M63P72k22l52J23k92o39M11P00o9q77K5
$$ 422 -876 -583 441 193 -628 597 -447 16 788 566 214 337 45 -594 -183 517 448 -429 -404
6973d04o11O69o38J564o46o69M4J030J11j338R87q23J2K02J561j883R32n26O70
$$ -404 -1015 -346 -984 580 -66 -735 -691 339 450 -888 99 -724 -712 -510 1051 -832 100 -426 244
6992B44j400P64M13j237K506j522Q49p72J58k92j8J60n5j112J057K34r39j26K353
$$ 244 -1156 -392 21 -1216 1290 -232 617 -155 3 -289 -307 -147 -202 -1314 -257 -23 -962 -1088 1265
7011A265j689o09J305l23J25o23O81j19j82R33q54j72Q44j896R77Q87M09r54k61
$$ 1265 -424 -1033 272 -51 74 -549 132 13 -169 764 -90 -262 582 -1314 -337 550 959 5 -256
7030b56J041j979J420J99o00l65q0jJ364j267j83J123m81p30J772N4k99j182Q3
$$ -256 785 -1194 226 425 -175 -540 -620 -621 743 -524 -707 416 -65 -795 977 1031 732 -450 -367
7049c67J826n47l84j190Q68O52j093R3K94Q37o01o71J504m85j84O30j690J230
$$ -367 1459 912 528 -662 206 858 -235 -142 152 989 388 -283 1221 736 552 1182 -508 722
7067G22p50K72m0L68j15j139O68P67n06j072J910j582N52j53m35P38M07r57Q04
$$ 722 -28 244 204 572 457 -682 -14 753 247 -825 1085 -497 55 -98 -533 205 612 -345 459
7086D59j039n90R95L17M99j279J97j06J090q50P40j128Q10j010M84m76N41J195
$$ 459 -580 -1170 -175 142 641 -638 -441 -547 543 -307 433 -695 115 -895 -411 -887 -346 849
7104H49o00j713J607P92j131J20J88J97j828J537M37n36N07j239j81J18J006o45
$$ 849 249 -1464 143 935 -196 -76 112 309 -1519 18 455 -81 426 -813 -994 -876 130 -515
7122e15M6P01r15K37j03J237j724L15M82j0O46J26j201K44J13O89j067L99J048
$$ -515 -469 232 -683 -446 -549 688 -1036 -721 -239 -249 397 523 -678 -434 -321 368 -699 -300 748
7141G48l68l78J102j120O04j245K62K91j67p8K84m98P40q78R42j088P55Q71n32
$$ 748 380 2 1104 -16 588 -657 -395 -104 -271 -349 -65 -563 177 -701 241 -847 -92 779 247
7160B47l11K14J67j039M27r2K88J376j658O13j22p66K66L25P10j526J478m05j2
$$ 247 -64 150 317 -722 -295 -387 -99 1277 -381 232 110 -656 -390 -65 645 -881 597 192 180
7179A80m03n53Q85O93l20J255j444j597J689o92j012J415J053p58J054m80j219
$$ 180 -223 -776 109 802 482 1737 293 -1304 385 -307 -1319 96 1149 391 1445 965 -254
7196b54l40J113n25N18Qj106o56L05J447j260K17M55j272J544k7r07L82L59o08
$$ -254 -594 519 -6 512 520 -586 -1242 -937 510 -750 -533 -78 -1350 194 167 -740 -358 1 -607
7215f07J72P28J91k2p31L12k10N45M46L40j267O06J47j282o3m92J395l28o53M15
$$ -607 -435 293 484 462 -269 43 -167 378 824 1164 -103 503 650 -632 -695 -1187 208 -120 -773 -358
7235c58%L92M76j185R52ll19j346J326L57o45P6J28J2k38j8k46O68q31R04r08
$$ -358 -358 34 510 -675 277 274 -45 -1391 -65 292 -353 -277 -149 -137 -375 -393 -639 29 -802 102 -806
7256h06O09N01j421M71P02j88J62j078N32Q69j241R00m03l00J446J59j551J342
$$ -806 -197 304 -1117 -646 56 -132 30 -1048 -516 353 -888 12 -391 -691 755 914 -637 705
7274G05j062j16K01R6J25j021R91J120k029N21M77P34m77O43j019J62M25l22o58
$$ 705 -357 -473 -272 -176 -51 -1072 -81 1039 -990 -469 8 742 265 908 -111 51 476 154 -504
7293e04K13M11K35K57L84j503Q05k2O08m56P65k97j166l06K000j559O46J51j559
$$ -504 -291 120 355 612 996 -507 298 276 884 428 1193 896 -270 -576 1424 -135 511 662 -897
7312h97K066j394KL12Q97o0n43p81J160l9n34q31J190p76J621j025o67q60J819
$$ -897 1169 -225 -223 89 986 926 383 -398 762 723 189 -642 548 -228 1393 368 -299 -1159 660
7331F60k52Pl76K19L11l46j101p1Q83J152j074l78J70J18J72m24J652j956M09
$$ 660 408 415 39 258 569 223 -878 -949 -66 1086 12 -366 -196 -78 94 -330 1322 -634 -225
7350b25L15Q57q20m58O86k93J041j126j232M12J033o96r7M93j26Q89j641J369
$$ -225 90 947 127 -331 355 62 1103 -23 -1255 -843 190 -506 -603 -110 -236 653 -988 381
7368C81o49q56J541O02j622L1R57o33k25O78j461M85Q54j08n66P53p18J221K1
$$ 381 -268 -1124 417 1019 -603 -572 385 -248 -473 205 -1256 -771 83 -25 -591 162 -556 665 686
7387F86n47j85O4L20k22j205J103J48p59j34O8k28J255n69J191n06k72n4L47n18
$$ 686 139 -46 18 338 116 -1089 14 162 -597 -731 -663 -891 364 -205 986 480 208 154 501 -17
7407a7l03N64m75M95r04R48p19J091j56n01l31k3L34r6P96o45q32Q87Q4%n74Q81
$$ -17 -320 244 -231 264 -640 308 -411 680 524 23 -308 -331 3 -93 703 58 -774 113 197 197 -377 504
7429E04j536J301L5M28p52r26J192J68o14k5J37R5Q81q15M54o13O11r45N34J2
$$ 504 -1032 269 304 732 -20 -946 246 414 -200 -225 -88 7 888 73 527 -86 525 -420 114 126
7449A26O68p88P29j254J40K98k04M51l13l77K27N81M73k198J293k06R14j120J221
$$ 126 794 6 735 -519 -379 -81 -285 166 -147 -524 -297 284 757 -1441 -148 -354 560 -560 661
7468F61n6j016O40k56J181p16L87r30J23j077J378O1J44K88J05k263R77P64o00
$$ 661 605 -411 229 -27 1154 438 825 -105 18 -1059 319 380 524 812 917 -1346 -369 395 -205
7487b05m98l3J107L31j63n53O08j169P86J75j277J129K6M82p45k34o7J174j488
$$ -205 -703 -736 371 702 539 -14 594 -575 211 386 -891 238 264 746 1 -233 -300 874 -614
7506f14k71J306l76q40K12J231j080m84L40l1O57P28r36j65k98J452j228m59R07
$$ -614 -885 421 45 -795 -583 648 -432 -916 -576 -607 50 778 -158 -323 -621 831 -397 -856 51
7525E1J31p2K39L66j769P35k27N75N38p75n98L45Q33n73N55j052N90r1M1l15J362
$$ 51 182 110 349 715 -1054 -319 -546 29 567 -208 -806 -461 372 -201 354 -698 -108 -199 -158 -473 889
7546H89r96k35J217j026J08o61J620q05N45o64o89O64L7j21N07l20q78j6qL39
$$ 889 -107 -342 875 -151 -43 -704 916 111 656 -8 -697 -33 4 -117 390 70 -808 -824 -832 -493
7566d93k61P49J08M60n49R16o56j03k48Q90j429Q41P95l0N36k123m42N33N95J38
$$ -493 -754 -5 103 563 14 930 274 171 -77 813 -616 225 1020 990 1526 -597 -1039 -506 89 227
7586B27O84r44K61j70j8K02r01M87J60R02p04K48q23O99n53O70j403R38M12L31
$$ 227 911 -33 228 58 40 242 -659 -172 -12 890 186 434 -389 310 -243 427 -976 -38 374 705
7606G05j152O2Q58l67J61j56o51M12k35L79j159J362j70L61M03o4j165M84m91
$$ 705 -447 -385 473 106 267 111 -540 -128 -363 16 -1143 219 49 410 813 749 -416 68 -423
7625d23J660j093q29K21K76l86J244p02j02r54J043j134J323J107j357j52M27
$$ -423 1237 144 -685 -464 -188 -574 670 -32 -134 -1088 -45 -1179 144 1251 -106 -258 169
7642A69M25p48O12j099O74q63J02K57J062m83m26J11K45l47j29Q53o96j07j89
$$ 169 594 -154 458 -641 33 -830 -728 -471 591 108 -318 -207 38 -309 -438 415 -281 -388 -577
7661e77M91j30K74q12R05j97K28K70k03j47L14l56k18P27Q26k094N10P2J18P0
$$ -577 -86 -216 58 -754 151 -46 182 452 249 102 416 60 -158 569 1395 -699 -189 -117 1 71
7681G1N42p67j2P71j70n79J45J071j20p17j348Q09J197j347M92l35M80j150J192
$$ 71 613 -154 -166 605 435 -144 1 1072 952 235 -1113 -304 893 -454 38 -297 183 -967 225
7700B25o16J362p10j71k45j92N01j026J074R22j532q71J680j446J412q45J393
$$ 225 -391 971 261 90 -155 -347 154 -872 202 1124 -408 -1279 401 -1045 367 -478 915
7717I15n49K92j104R63L3o02l58k59Q09J08m02P90n03j94N1R99j571L85P11o64
$$ 915 366 658 -446 517 550 -52 -410 -669 140 248 -154 636 133 -61 -10 989 -582 -197 514 -150
7737a50O65N28r91n78J47p53R40O62r14k51M76P98l83p5K50r67K49m59J016k26
$$ -150 515 1043 52 -526 -379 -1132 -192 470 -444 -695 -219 579 196 121 371 -596 -347 -806 210 -16
7757a6p07k41N29l2Jl95J227j329J031l11o39J488j253M03L33n60L7K37k9q66
$$ -16 -723 -964 -435 -467 -466 -861 366 -963 68 -243 -882 606 -647 -244 89 -471 -434 -197 -226 -1092
7777a092Q46R14m52j061N40N76k78q36R85k35j086Q74j44q84P10M94j080J273
$$ -1092 -246 668 216 -845 -305 271 -7 -843 142 -93 -1179 -305 -449 -1333 -623 -129 -1209 64
7795F4P32n60j930R90K361k061J708o65j689O73L73Om89O57O23r07j63L02K02
$$ 64 796 236 -1694 -704 1657 -404 1304 639 -1050 -377 -4 2 -487 170 793 -114 -277 25 227
7814B27K56j78l10m21L06ml7L64J37q24Q65O8q88n18J044m47P01J5p1J84p87L23
$$ 227 483 305 -5 -426 -120 -124 -161 203 340 -484 381 449 -439 -957 87 -360 341 356 285 469 -318 5
7836EL64n82J202q32L32J218k184J6J942o37k054Q30P44j22K6j948K412j553L19
$$ 5 369 -213 989 157 489 1707 -477 -461 1481 844 -1210 -380 364 242 268 -1680 732 -821 -502
7855e02K6J172q00J080l37o54l02L9p91K80K50l8M17L60M0r82L30R35n4o79l21
$$ -502 -476 696 -104 976 639 -15 -317 -278 -1069 -789 -539 -577 -160 200 240 -742 -412 523 469 -210 -531
7876e31J027n95n81J052M5o99r0M20l10M61O8k37j63m57J521j692L11K52m71J601
$$ -531 496 -99 -680 372 417 -282 -372 48 -262 199 267 30 -133 -590 931 -761 -450 -198 -669 932
7896I32q21m49M36m38P35n6p09K6m01l08P03l37J053K9j175L00J025j388L25j38
$$ 932 111 -338 98 -340 395 339 -370 -344 -745 -1053 -350 -687 366 395 -780 -480 545 -843 -518 -656
7916f56M76L8J373q62m06k48J160j106j05L14j10J20J80kr54K70L76k88M34R9
$$ -656 -180 -142 1231 369 -37 -285 875 -231 -336 -22 -132 -12 168 166 -788 -518 -142 -430 4 103
7936A03P8k48k27J082j16j383P71M99k65o1k73M57q07J394j019n03O64J01k28
$$ 103 181 -67 -294 788 672 -711 60 559 294 233 -40 417 -390 1004 -15 -518 146 247 19
7955A9K82p60N06P61n96j60K96L44p85p0r6J071k409J918L62l85L5J02j071o27
$$ 19 301 -459 47 808 212 52 348 692 -93 -163 -259 812 -1597 321 683 298 333 435 -636 -1263
7975a263K752j142m96q40J025j26p51R76k32R04p03l54P09q05r9J00L74q44J904
$$ -1263 1489 347 -149 -989 36 -90 -841 135 -97 807 104 -250 459 -346 -445 -345 29 -815 1089
7994A089p08O6J25k67j38M94r15RJ779j455o37R94k79o56o04Q17m53O37j078R73
$$ 1089 381 447 572 305 167 661 -254 -245 1534 79 -558 436 157 -499 -1103 -286 -739 -102 -1180 -207
8014b07o18R62J02q54k30J110P9o38l57J01m60N77m50O7J691j530P38o76M55P01
$$ -207 -825 137 239 -615 -845 265 344 -294 -651 -550 -1010 -433 -883 -816 875 -655 83 -593 -138 563
8034E63m90k37k82J07J03P90k10j278J234M40o55J9m46O49m11J99p63Q14L80J92
$$ 563 73 -164 -446 -339 -236 554 344 -934 300 740 85 104 -342 307 -104 95 -668 146 526 718
8054G18j057l2J474j919Q40L83q98J896j049m03P7o58J126j40p02J803r33m11
$$ 718 -339 -371 1103 -816 24 407 -491 1405 356 -47 30 -628 498 358 -344 1459 526 115
8072A15j75M12J637j640O22r62o47Q05L53J77n01K00o10R14q38k03J147o61l67
$$ 115 -60 352 1989 349 971 9 -638 167 520 697 196 396 -214 700 -138 -341 806 145 -222
8091b22p04J119O84p73O69J4j428J407j64o75n49R30K17m05k77J095q33P45J52
$$ -222 -926 193 877 104 773 787 -641 766 602 -73 -622 308 525 120 -157 938 105 850 1002
8110A002j414m33J353N96j331J423p49r81O84m22K24p97o01J052m2p8L10P33o36
$$ 1002 -412 -845 508 1104 -227 1196 447 -534 150 -272 -48 -845 -1446 -394 -436 -514 -204 529 -107
8129a07l98Q42m51O9M05l49k07N19M12m80o7l10q5K02N5n77l50J436q66M23M40
$$ -107 -505 337 -114 -45 360 11 -196 323 735 255 188 -122 -207 -5 50 -527 -877 559 -307 116 556
8150E56j079N80o42Q25j223m24J608l44K17L72p13k73o14J751o11j44j3Q4N4K33
$$ 556 -523 57 -585 240 -983 -1407 201 -143 74 446 -267 -540 -1154 597 -14 -158 -171 -87 -33 200
8170B00j803J388ML58j296m79J639l92J189j23m41m78Q21j209J171p89L53N34
$$ 200 -1603 -215 -211 147 -1149 -1628 11 -381 808 685 244 -234 587 -622 549 -240 113 647
8188F47j262R76n34
$$ 647 -615 361 -173
8191a73
$$ Imaginary data points
##PAGE= N=2
##DATA TABLE= (X++(I..I)), XYDATA
0@%%%%%%%%%j6J24k16K16k16K56l64M32n25O33p47Q57r74J180j362J544j769K021
$$ 0 0 0 0 0 0 0 0 0 0 -16 108 -108 108 -108 148 -216 216 -309 324 -423 434 -540 640 -722 822 -947 1074
27A074k273K575k923L291l699M151m653N191n783O440p166P953q809R764j0813
$$ 1074 -1199 1376 -1547 1744 -1955 2196 -2457 2734 -3049 3391 -3775 4178 -4631 5133 -5680
42e680J1971j3254J4680j6274J8065k0107K2454k5157K8327l2116L6722m2477
$$ -5680 6291 -6963 7717 -8557 9508 -10599 11855 -13302 15025 -17091 19631 -22846
54b2846M9906n9925P4242r6510J36232k28639Q46380K74629j580821K30204R77189
$$ -22846 27060 -32865 41377 -55133 81099 -147540 698840 973469 -607352 -377148 600041
65F00041j5440r03604J43700O70501l6771p20549p7867N50385K49200m62519k36107
$$ 600041 584601 -319003 -175303 495198 458427 -262122 -339989 210396 459596 -2923 -239030
76b39030K80456J56657k51661q346J80486o9427j16484J63002j6687k05805J22016
$$ -239030 41426 198083 -53578 -61924 118562 49135 -67349 95653 78966 -126839 -4823
87d823K50661j97877k22991K17838J81227k09637j35949J51848J22310q8774j57541
$$ -4823 245838 47961 -175030 42808 224035 14398 -121551 30297 152607 63833 -93708
98i3708k3927J92141J01581k22211j76545J76210J38070j41011p7615R7962J4645
$$ -93708 -117635 74506 176087 -46124 -222669 -46459 91611 -49400 -127015 -29053 -14408
109a4408q9765o6359J191J63543J46862k34116k96059K22722L22848j93297k24925
$$ -14408 -104173 -170532 -169341 -5798 141064 -93052 -389111 -166389 156459 -36838 -261763
120b61763K36737J28928l02185j04672L08227J63517k06537j95508Q6530J89910
$$ -261763 -25026 103902 -198283 -302955 5272 168789 -37748 -233256 -146726 43184
130D3184j9650j76311N2126K12181j02528k57451J38692K57897j49748j91430
$$ 43184 23534 -152777 -100651 111530 9002 -248449 -109757 148140 -1608 -193038
140a93038J70407J10822j69896m6921J37587J0955o6454K0107J1243k0881P557
$$ -193038 -22631 88191 -81705 -128626 8961 19916 -46538 -26431 -15188 -36069 -28512
151b8512p544K1151P3315n5475j26735Q8751J32318j14849p8130J53414L241j99560
$$ -28512 -36056 -14905 58410 2935 -123800 -35049 97269 -17580 -95710 57704 60945 -138615
163a38615M2060K23410l1491j86744q460J09746M5062m0496n9102M4746R0021
$$ -138615 -96555 126855 95364 -91380 -99840 9906 54968 14472 -44630 116 90137
174I0137j04552j43577J80031K12253j97539k21297J85599J70307j63782q2926
$$ 90137 -14415 -157992 22039 234292 36753 -184544 1055 171362 7580 -75346
184g5346J54964L1818j32476l0754Q1769N8573k2632q7839j2762J02826n838j20387
$$ -75346 79618 111436 -21040 -51794 29975 88548 65916 -21923 -34685 68141 62303 -58084
196e8084M7328J17761r4547r4986J31074L8087j52646J7884J56550n1319j27900
$$ -58084 -10756 107005 12458 -82528 48546 86633 -66013 -48129 108421 57102 -70798
207g0798N8816P9522m1089k8410J8980J9390K1354m5808o8136R6990J17212j32759
$$ -70798 -11982 67540 26451 -1959 17021 36411 57765 11957 -56179 40811 158023 25264
219B5264j39765J42631J13662j35462o2483J17330J1934j00456r085N4434L9620
$$ 25264 -114501 28130 141792 6330 -56153 61177 73111 -27345 -36430 18004 57624
230E7624k358r0918n4381J20214O5419j38911l4484J44679j8303j44330N7789
$$ 57624 55266 -35652 -90033 30181 95600 -43311 -77795 66884 48581 -95749 -37960
241c7960J27675p0322q6068N4973L6325k5172j661q524j137L8413k6506o1655
$$ -37960 89715 19393 -66675 -11702 24623 -549 -2210 -10734 -11871 26542 36 -61619
253f1619O4340N2095j06119k8334J23719j9034j31112N4487J02090q5880o8127
$$ -61619 2721 54816 -51303 -79637 44082 25048 -106064 -51577 50513 -35367 -103494
264a03494Q4656K7746p1553r685L4498J7618L370m8149l5695R2168M9634j24633
$$ -103494 -18838 8908 -62645 -72330 -37832 -20214 -16844 -64993 -100688 -8520 41114 -83519
276h3519k9100J51541n437j54112N0106J49771o9937j18141O6383Q3377l5534
$$ -83519 -112619 38922 33485 -120627 -70521 79250 9313 -108828 -42445 40932 5398
287E398m7203j695L5251L6090n0560o2353Q8611O9884j28825n7750J53591K8699
$$ 5398 -41805 -43500 -8249 27841 -22719 -85072 3539 73423 -55402 -113152 40439 69138
299F9138j52200J3862J29706m6830r1350O4942N7337m5722k5891J8553J6134K5376
$$ 69138 -83062 -69200 60506 13676 -77674 -12732 44605 -1117 -27008 -8455 7679 33055
311C3055j7461m6322N3070N4944q7097l4751J28334R912j33819K8505J20853n7948
$$ 33055 15594 -30728 22342 77286 -9811 -44562 83772 93684 -40135 -11630 109223 51275
323E1275q6247P5491N1792o2601k4437K6770R642J8590j8529n0402M0745O1143
$$ 51275 -34972 40519 92311 29710 5273 32043 41685 60275 41746 -8656 32089 93232
335I3232q0636n5391J14673L2344j29984o674J17277k3645q5366L9829M6094l6515
$$ 93232 12596 -42795 71878 104222 -25762 -32436 84841 61196 -24170 15659 61753 25238
347B5238j7469O577M072L3226p158p1863K2294Q4875n5978p6570Q8866N1197j14459
$$ 25238 7769 14346 18418 51644 44486 -27377 -5083 79792 23814 -52756 36110 87307 -27152
360b7152k3662J05562q780p9231K5014L9741l3943j2364Q571m081K5706M0o8245
$$ -27152 -50814 54748 45968 -33263 -8249 31492 -2451 -14815 -6244 -10325 15381 15421 -52824
373e2824J0076Q4243m6028p9651P9046N3110j08311k8738J08935J055q5797J4579
$$ -52824 -42748 41495 -4533 -84184 -5138 47972 -60339 -89077 19858 20913 -64884 -50305
385e0305M4939k2136j1014M711k763K8621L586p2108J1889R8742l6797r9891O8532
$$ -50305 -5366 -27502 -38516 -33805 -36568 -7947 -4361 -76469 -64580 34162 -2635 -102526 -33994
398c3994P7699r4735m4873J03041J8579q5058j38M7818n815j0673p46j0411L2463
$$ -33994 43705 -51030 -95903 7138 25717 -59341 -59479 -11661 -17476 -28149 -28895 -39306 -6843
411f843J2185o7865L845R6802k4267r8889N5963Q4202q1990m8824R7259K0735
$$ -6843 5342 -62523 -58678 38124 13857 -85032 -29069 55133 -26857 -75681 21578 42313
423D2313q0937K758N1394j0448j0570P661r997J8545J6817n4002j820Q7779j7948
$$ 42313 -38624 -35866 15528 5080 -5490 2171 -7826 10719 27536 -26466 -28286 59493 41545
436D1545r5742M5901Q3079o7511n2259Q5720K4634p7303j735N0015m346p140Q27
$$ 41545 -54197 -8296 74783 7272 -44987 40733 65367 -11936 -13671 36344 31998 24858 25685
449B5685j8689K1923K9439n2118k0184Q9133m18j02419K6007R2791m9840o4564
$$ 25685 6996 28919 58358 6240 -13944 75189 74771 -27648 -1641 91150 41310 -23254
461b3254O6888L3180o7896j2617M1061p77l616n258l0610J8888L8859n0133l2261
$$ -23254 43634 76814 8918 -3699 37362 36585 32969 27711 -2899 15989 54848 4715 -27546
474b7546Q0046Q684j04311J6015R9440m0168p4000N5047L8628n8967j1271M1375
$$ -27546 52500 61184 -43127 -27112 72328 32160 -41840 13207 51835 -7132 -18403 22972
486B2972n42j0391n853k3715K0218M0482m9864m1206P5688J8490r9880J786R6937
$$ 22972 22430 12039 6186 -17529 2689 43171 -6693 -47899 27789 46279 -53601 -51815 45122
499D5122l2711q0292M5478M6949n4700k6219L4854R121l827r826l0400J7774M7491
$$ 45122 12411 -67881 -22403 24546 -30154 -56373 -21519 -12398 -16225 -26051 -56451 -38677 8814
512H814m2221m1996P3677K5222r9226q31J10142j7548q9349L6651N5879m2483
$$ 8814 -33407 -75403 -1726 23496 -75730 -76561 33581 16033 -73316 -36665 19214 -23269
524b3269k4890L9577J1398j8527j2812j5568K6491M3537m7997n0260O5719L3113
$$ -23269 -48159 -8582 2816 -15711 -28523 -44091 -17600 25937 -22060 -72320 -6601 26512
536B6512q4522l2R2654k9527q3730M8526O2850m9920k6733M3074N063j4328J3384
$$ 26512 -58010 -58042 34612 5085 -78645 -30119 32731 -17189 -43922 -848 4215 -10113 3271
549C271n768j005L4117j6687l2321N0674K9158o8699o281Q1055j2862o4715L3479
$$ 3271 -2497 -3502 30615 13928 -18393 32281 61439 -7260 -13541 67514 54652 -10063 23416
562B3416L4397m3701n555M0411j5543j8982J5767j9324j1287N1416m921p1821
$$ 23416 57813 14112 8557 48968 33425 14443 30210 10886 -401 51015 46094 -25727
574b5727J9480O3366l7767l7952N2589J0444n4047O497M0936m189n302m010k5877
$$ -25727 -6247 57119 19352 -18600 33989 44433 -9614 -3117 37819 33630 28328 24318 -1559
587a559K0887M5579m0316l1525O0293K996p8358L0849Q0751n6572p3703O4332
$$ -1559 19328 64907 24591 -6934 53359 56355 -22003 8846 89597 33025 -40678 23654
599B3654M3434o5100j9853M5425l174l5944n042J6431K0625j2336o0545Q570Q4797
$$ 23654 67088 1988 -17865 27560 24386 -11558 -16600 -169 20456 8120 -52425 -43855 40942
612D0942k1976j01351L9851Q9927o6545o9302Q8824M3669r8112k3220P9635J3713
$$ 40942 18966 -82385 -42534 47393 -19152 -88454 370 44039 -54073 -77293 2342 16055
624A6055m7234q040J5097Q218M062j8571L977L5853k7623n5865N6839O4170p4248
$$ 16055 -31179 -39219 -24122 -15904 -11842 -30413 -26436 9417 -18206 -74071 -17232 46938 -27310
637b7310n1355Q3812J9709q2368J6113P5474l7293n9126L6329L9962j7335j5422
$$ -27310 -78665 5147 24856 -57512 -41399 34075 -3218 -62344 -26015 13947 -3388 -18810
649a8810j2741q58L6851m84m7895J7684M5253m6006l3859O3536J7781o5499p1
$$ -18810 -31551 -32409 4442 3958 -43937 -26253 19000 -27006 -60865 2671 20452 -45047 -45118
662d5118M2812j9015p016L5764k2202l5633M1394K5318l6143O580K7175k7525
$$ -45118 -2306 -21321 -28337 7427 -14775 -50408 -9014 16304 -19839 -13259 13916 -13609
674a3609l425M8364q053l2802K7183J1783l3556J9431L9622l0426k5695K4118
$$ -13609 -17034 31330 23277 -9525 17658 29441 -4115 15316 54938 24512 -1183 22935
686B2935K93m856K9501k2623n3500L9036M8481n7882l2981O4050j850p0776J7661
$$ 22935 23228 18372 47873 25250 -28250 10786 59267 1385 -31596 32454 30604 -40172 -22511
699b2511O0834k3529m3647O447J7995J7925N265l6179k521N0627r315m7010M2515
$$ -22511 38323 14794 -28853 -22406 -4411 13514 18779 -17400 -19921 30706 21391 -25619 16896
712A6896N1001o7687l0895Q4642J6064p2490J2725N4175l3278l3883M2597J8051
$$ 16896 67897 210 -30685 53957 70021 -2469 10256 64431 31153 -2730 39867 57918
724E7918l4713k1854O268K5422J7791m4511m3077N5343L4894p9345k0022R0361
$$ 57918 23205 1351 7619 33041 50832 6321 -36756 18587 53481 -25864 -45886 44475
736D4475j0960r9842K8524Q5995l5712o0134K8958K8292j6172j154N241j791Q916
$$ 44475 33515 -66327 -37803 48192 12480 -47654 -18696 9596 -6576 -7730 -2489 -4280 4636
749D636j0073j6220L7121K0969n8628j4044O7392p612o0244L3764M4166o2625
$$ 4636 -5437 -21657 15464 36433 -22195 -36239 31153 23541 -36703 -2939 41227 -21398
761b1398l1579O6377J4611n8171p124K6170k921p13m511k1653J7404K0459m0261
$$ -21398 -52977 13400 28011 -30160 -37284 -11114 -14035 -14748 -19259 -40912 -23508 -3049 -43310
774d3310j1611N7942m112o5700J7643N6144k6720k8029K8509k432k1990K4824
$$ -43310 -54921 3021 -1091 -66791 -49148 6996 -19724 -47753 -19244 -21676 -43666 -18842
786a8842J0403k9083R075K2166k9878k724L9624j6600l4326K8477J6818l3950
$$ -18842 -8439 -37522 -28447 -6281 -36159 -38883 741 -15859 -50185 -21708 -4890 -38840
798c8840R308K8611k9373j5886L8953m33k4127J7936L061k6298K5255K8659l9756
$$ -38840 -29532 -921 -30294 -46180 -7227 -7660 -31787 -13851 -10790 -37088 -11833 16826 -22930
811b2930j0765N1235j0945m4329L8808L7086m5712k0284M0855Q897j7038K279
$$ -22930 -33695 17540 6595 -37734 1074 38160 -7552 -27836 13019 21916 4878 7157
823G157m414n78K4002j1570k9387L6963K2698n7613o962P1858j0796o7304L0472
$$ 7157 2743 2165 26167 14597 -14790 22173 44871 -12742 -19704 52154 41358 -25946 4526
836D526N3051m2634k8907M9250J2751m0430m034K6617R475n774k0135m842L9810
$$ 4526 57577 14943 -13964 35286 48037 7607 3573 30190 39665 33891 13756 8914 48724
849D8724K939n5400J1097O6753l3346o6140N5085N1918p0247l3571P0154J0468
$$ 48724 51663 -3737 7360 74113 40767 -25373 29712 81630 11383 -22188 47966 58434
861E8434n8924L899L7845j0385k2570L274O750J1901o377l1779J2792M1140k9027
$$ 58434 -490 3409 41254 30869 8299 11573 18323 30224 23847 -7932 4860 46000 16973
874A6973m2839M4908K6419n9487q335N8761j4080n1605K5898K6691l2452o266
$$ 16973 -25866 19042 45461 -14026 -22361 36400 22320 -29285 -3387 23304 -9148 -15414
886a5414K2283j2490r184J5136j2961j2093K6502k451l4268J7792K6223l1985
$$ -15414 6869 -5621 -14805 331 -12630 -24723 1779 -672 -34940 -17148 9075 -22910
898b2910j0027L4214q169k6388K3320N081k3885J4879J7176l1461M3L7751k2308
$$ -22910 -32937 1277 -6892 -33280 -9960 -4879 -28764 -13885 3291 -28170 -28127 9624 -12684
911a2684l0443L9722J3254m7824L667M3928j9053k9978K3605J1315j8658K092
$$ -12684 -43127 -3405 9849 -37975 -34308 9620 -9433 -39411 -15806 -4491 -23149 -21057
923b1057N523q167J2937K336k6915J4457L3900l1011k8614M8686J8147n2236K850
$$ -21057 -15534 -23701 -10764 -8428 -35343 -20886 13014 -17997 -46611 2075 20222 -32014 -29164
936b9164N1786k0750l3924L3666K0076k7451j960J5148m478P793N225k1814P907
$$ -29164 22622 1872 -32052 1614 21690 -5761 -7721 7427 2949 10742 15967 -5847 2060
949B060K9660k3809k5482M2652J3580n4036L470N1354j5275l8956K4187J9787
$$ 2060 31720 7911 -17571 25081 38661 -15375 -11905 39449 24174 -14782 9405 29192
961B9192k7676O76J6740p809J902N414k0940P603L3988k1711l4422L7732K3130
$$ 29192 1516 2192 18932 11123 13025 18439 -2501 5102 39090 17379 -17043 20689 43819
974D3819m7445j822M9712j5902m0709K7712K4405k6272n714J4366o825K876Q178
$$ 43819 -3626 -5448 44264 28362 -12347 15365 39770 13498 7784 22150 15325 18201 26379
987B6379k0969j151K7599j8085k8125L4961J7324n1873n205N0567j2494l9449
$$ 26379 5410 4259 31858 13773 -14352 20609 37933 -13940 -19145 31422 18928 -20521
999b0521K2729J9161l1720m00K2284j0644p513R406j4662m103L0525r320l5245
$$ -20521 2208 21369 -10351 -10751 11533 889 -6624 2782 -11880 -15983 14542 5222 -30023
1012c0023K2302K4356l3735p807L9854j0508l5221K0643K0268k2235k035J4066
$$ -30023 -7721 16635 -17100 -24907 14947 4439 -30782 -10139 10129 -12106 -14141 -75
1024g5j6423n98K1478j6846j4585K9288m067l7542K0648L3535l4467k3878L8524
$$ -75 -16498 -17096 4382 -12464 -27049 2239 -1828 -39370 -18722 14813 -19654 -43532 -5008
1037e008N232l3188J0811J9432j8891m260J5807q485O27J5196j9463j1306L8181
$$ -5008 224 -32964 -22153 -2721 -21612 -25872 -10065 -18550 -17923 -2727 -22190 -33496 4685
1050D685M54m1092J7418L6315l1675k0699M3257N176m0017R386K9542j5477o513
$$ 4685 5139 -35953 -18535 17780 -13895 -34594 8663 13839 -26178 -16792 12750 -2727 -9240
1063i240J1563r803k659K0137j1623j5171K8071R10l8239J7907L8026k8633k6534
$$ -9240 2323 -7480 -10139 9998 -1625 -16796 11275 12185 -26054 -8147 29879 1246 -25288
1076b5288L6375R123l4554J1508K5561j9507p757J7646m968l010J7884j4006j8673
$$ -25288 11087 20210 -14344 -2836 22725 3218 -4539 13107 8139 5129 23013 9007 -9666
1089i666L1302J1933l8759P211L6553k4749k6141L5175J2628l5905K078K4855
$$ -9666 21636 33569 -5190 2021 38574 13825 -12316 22859 35487 -418 1660 26515
1101B6515j2483q168J4318r769o169J8629q444k0961K6796J0099l8893M786M1457
$$ 26515 14032 5864 20182 10413 4244 22873 14429 -6532 20264 30363 -8530 -3744 37713
1114C7713j9455l3318K9793J4377l1296R62K5875j5346r929J4693o216q136J8595
$$ 37713 18258 -15060 14733 29110 -2186 -1224 24651 9305 -624 14069 7853 -283 18312
1127A8312q732k4231K3175J6480l6862k287L6766j5267l1850K5981J8623l2241
$$ 18312 9580 -14651 8524 25004 -11858 -14145 22621 7354 -24496 1485 20108 -12133
1139a2133l242K3322j0315r303J5766r369j1845K2989l195k7253K0024K0531l4212
$$ -12133 -15375 7947 -2368 -11671 4095 -5274 -17119 5870 2675 -24578 -4554 15977 -18235
1152a8235r761M0287p492l6024J9124K1689k5645o782K0680q653j0250J4275q376
$$ -18235 -27996 12291 4799 -31225 -12101 9588 -16057 -22839 -2159 -10812 -21062 -6787 -15163
1165a5163r223K2664o276k7475K1312K5931l5177j3347M2185n56l8312J7378K9145
$$ -15163 -24386 -1722 -7998 -35473 -14161 11770 -23407 -36754 5431 4875 -33437 -16059 13086
1178A3086k5174j1425K5046j017j0672R937m879p208J9690k597k5124J7520K2544
$$ 13086 -12088 -23513 1533 516 -10156 -219 -5098 -12306 7384 4787 -20337 -2817 19727
1191A9727l3861j2034M2315m887m2029J6919L1158k7116j4010K5285j442j6850
$$ 19727 -14134 -26168 16147 11260 -30769 -13850 17308 -9808 -23818 1467 25 -16825
1203a6825J2378K749p416J1266J450k0521J6779K2669k4921j2710L7847l08l2854
$$ -16825 -4447 -1698 -9114 2152 3602 -16919 -140 22529 -2392 -15102 22745 22437 -10417
1216a0417J8058K8512k8307j1138K9266k345j7998J3866J158j8601J2261J1818
$$ -10417 7641 36153 7846 -3292 25974 23629 5631 19497 20655 2054 14315 26133
1228B6133k2499m39K1526k0075j6030K8894K779l3849R169K1914j9755o360K2745
$$ 26133 3634 3195 24721 4646 -11384 17510 20289 -13560 -4391 17523 -2232 -8592 14153
1241A4153j0573j5869K0136M455k0749J4449J4271k6928r91L5807j1744k8058
$$ 14153 3580 -12289 7847 12302 -8447 6002 20273 -6655 -7646 28161 16417 -11641
1253a1641K2266J4658k4702K378K0849j5189q890J3359k999r620J5968p576k5151
$$ -11641 10625 25283 581 2959 23808 8619 -271 13088 10089 469 16437 8861 -16290
1266a6290J7729J8160k9984p634L2025j3983l1035K6309K1571l4832r249K6298
$$ -16290 1439 19599 -10385 -18019 14006 23 -31012 -4703 16868 -17964 -27213 -915
1278i15k885j4578J0504p89q704Q638l803j1430K1740R887l9007P60M3994j2508
$$ -915 -3800 -18378 -7874 -8663 -17367 -8729 -12532 -23962 -2222 7665 -31342 -30582 13412 904
1292I04l6829K3889K4518l1837r491L4338k998k4410Q591R485n688O972j069j4325
$$ 904 -35925 -12036 12482 -19355 -28846 5492 2494 -21916 -13325 -3840 -9528 -2556 -3625 -17950
1306a7950J3695J0970k4470M697L0088j9511l3302L6419K3277m1681r431L8937
$$ -17950 -4255 6715 -17755 -13058 17030 -2481 -35783 636 23913 -17768 -27199 11738
1318A1738q367k9580J8783J6394j8633m341P504l178R284N024k2611N5L0523r863
$$ 11738 3371 -26209 -7426 8968 -9665 -14006 -6502 -9680 -396 4628 -17983 -17928 12595 2732
1332B732k3411K5980J3992l2197K695L6736j1713k3819K3435Q320k2838R370K3014
$$ 2732 -20679 5301 19293 -12904 -10209 26527 14814 -9005 14430 22750 -88 9282 32296
1345C2296j8117j0328J8668j924q430J4145o954j8454J6575J1942k2410p44K0773
$$ 32296 14179 3851 22519 20595 12165 26310 19356 902 17477 29419 7009 6265 27038
1358B7038j7690j5356K4651L377k7212J1239J3731k2908k05L0729j4572k8204
$$ 27038 9348 -6008 18643 22020 -5192 6047 19778 -3130 -3335 27394 12822 -15382
1370a5382K4507J7569k3380l029K1548q051j1534J0842K227l744R318r832j4850
$$ -15382 9125 26694 3314 285 21833 13782 2248 13090 15317 11573 20891 11059 -3791
1383c791K4648J0371l4243P68L2686j9054k8528L1342J3390m1076l243L5444j1194
$$ -3791 20857 31228 -3015 -2247 30439 11385 -17143 14199 27589 -13487 -16730 18714 7520
1396G520k6502J5347J0051j4551k834O322j577P424n995k0257J5419K6425k7633
$$ 7520 -18982 -3635 6416 -8135 -10969 -4647 -6224 1200 -4795 -25052 -9633 16792 -10841
1409a0841k5194M1332R658m3562N028M1786j9367l1354K2665J9233k3032m011
$$ -10841 -36035 5297 14955 -28607 -23579 18207 -1160 -32514 -9849 9384 -13648 -17659
1421a7659J0913o692Q98M751j0680L695J4014j9009j1563L1224L556l7578J1199
$$ -17659 -6746 -13438 -12540 -7789 -18469 -14774 -760 -19769 -31332 -108 3448 -34130 -22931
1434b2931L1700k1510k1745L2965R282l2043N256K4134r946p518J0454m244m497
$$ -22931 8769 -12741 -34486 -1521 7761 -24282 -19026 5108 -4838 -12356 -1902 -6146 -10643
1447a0643J5856n840j4711J8261N821k5104Q199K3527j8336j6503K5173L143k4902
$$ -10643 5213 -627 -15338 2923 8744 -16360 -8161 15366 -2970 -19473 5700 8843 -16059
1460a6059J2757J7510k1541n627K2483n949j5394J7979N365k0008R416J5948j5651
$$ -16059 -3302 14208 -7333 -12960 9523 3574 -11820 6159 11524 -8484 932 16880 1229
1473A229k589J8686q439r757K0088l91j9195J4323J1515k0685Q10K4876j4117
$$ 1229 -1360 17326 8887 -870 19218 18827 -368 13955 25470 4785 5595 30471 16354
1486A6354k0111K7146O735k9809N754K4275j6570j5422J9235K660j5477M952M303
$$ 16354 -3757 23389 30124 315 6069 30344 13774 -1648 17587 20247 4770 9722 14025
1499A4025r479Q136L176j8831Q451J9596k2671j3794L2865K746l7438J0903L1975
$$ 14025 4546 12682 15858 -2973 5478 25074 2403 -11391 21474 24220 -13218 -2315 29660
1512B9660k2122k2202K7866O999k3997J223J6318p765l937M657q505L379J1770
$$ 29660 7538 -14664 13202 20201 -3796 -2573 13745 5980 2043 6700 -1805 1574 13344
1525A3344j7333q420K6502n009k9864J5605K6772k8324j7550L1439K978l0841
$$ 13344 -3989 -12409 14093 9084 -20780 -5175 21597 -6727 -24277 7162 10140 -20701
1537b0701P138K1937j6169j0167J1065p89m018O840q025p557J7375j488k1620
$$ -20701 -13563 8374 -7795 -17962 -6897 -7686 -11704 -4864 -12889 -20446 -3071 -4559 -26179
1550b6179J2971J9760k3605j3561L0192K021k7308R949J8740j9279l549J9836
$$ -26179 -13208 6552 -17053 -30614 -422 1599 -25709 -15760 2980 -16299 -19848 -12
1562a2o558j3509J4756K480j3941J1348P090j9344M900J8833j4326j0981K1052
$$ -12 -6570 -20079 -5323 -2843 -16784 -5436 1654 -17690 -12790 6043 -8283 -19264 1788
1575A788N5k1775J2174J6648j8697n367J9242r065j0740K0242k78k2235J3373
$$ 1788 1843 -19932 -7758 8890 -9807 -15174 4068 -4997 -15737 4505 4227 -18008 -4635
1588d635J3812j6678m110K3534j0388j5900J8116Q713j6924N729R509j3919L368
$$ -4635 9177 -7501 -11611 11923 1535 -14365 3751 12464 -4460 1269 10778 -3141 227
1601B27J5917j0232j0851J9333j209j9401J4102J7862k3648q888K6089l117j8962
$$ 227 16144 5912 -4939 14394 13185 -6216 7886 25748 2100 -6788 19301 16184 -2778
1614b778J2512Q161j7823L496J2953q945m598J0673r118p404K0598k264k3037
$$ -2778 9734 17895 72 3568 16521 7576 2978 13651 4533 -2871 17727 15463 -7574
1627g574J1487J8253k3215o792K6986m149k4572J1628J6535j4726l972J1526p524
$$ -7574 3913 22166 -1049 -7841 19145 14996 -9576 2052 18587 3861 -111 11415 3891
1640C891l784J1111n433r261J5296l996j9311J5111J6274k3823j0424K6544k348
$$ 3891 107 11218 5785 -3476 11820 7824 -11487 3624 19898 -3925 -14349 12195 9847
1653I847k3652J2874J4564k0330o920J8385n755p575P541l673r716J2422L610
$$ 9847 -13805 -931 13633 -6697 -13617 4768 -987 -8562 -1021 -4694 -14410 -1988 1622
1666A622j8794P976J4404j9967m867K4569m060k4529J2653J6730j6770n198J7613
$$ 1622 -17172 -9196 5208 -14759 -19626 4943 883 -23646 -10993 5737 -11033 -16231 1382
1679A382q383j1391J5251J695j3092R589M620j7006M856J8825j4967j1604J8814
$$ 1382 -7001 -18392 -3141 -1446 -14538 -4949 -329 -17335 -12479 6346 -8621 -20225 -1411
1692a411m12j8720J0159J4492j7817m419J5775n491q324J4098l867j4530J2919
$$ -1411 -1823 -20543 -10384 4108 -13709 -18128 -2353 -7844 -16168 -2070 -5937 -20467 -7548
1705g548J1514j8927K061J9687j2255j3628K1324O099k1524M882J6380j0041m671
$$ -7548 3966 -14961 -12900 6787 -5468 -19096 2228 8327 -13197 -8315 8065 -1976 -6647
1718f647J5163o308q926J3387l40j2925J2486Q504k0842J096K3338j2384j7420
$$ -6647 8516 2208 -6718 6669 6329 -6596 5890 14394 -6448 -5352 17986 5602 -11818
1731a1818J8961P748k1565M870J8314j3082q957J4234j479r320J2404m77j5109
$$ -11818 7143 14891 -6674 -1804 16510 3428 -5529 8705 7226 -2094 10310 9833 -5276
1744e276J0402J2056j6743j119J9856q291j6821J9884R034k1845L74J7359r232
$$ -5276 5126 17182 439 -680 19176 10885 -5936 13948 22982 1137 1511 18870 9638
1757I638q383J4044l308j1211R382L680j4063P405J1008j8150n054K0961m184
$$ 9638 1255 15299 11991 780 10162 13842 -221 7184 18192 42 -5012 15949 11765
1770A1765k0320J4840R306j9947k40J6808p348j1859J2771O60j2326J1134K528
$$ 11765 -8555 6285 15591 -4356 -4596 12212 4864 -6995 5776 6436 -5890 5244 7772
1783G772j5500N620J3827j4856p207K0869n211j9373J3803J1518j9364k770J8316
$$ 7772 -7728 -2108 11719 -3137 -10344 10525 5314 -14059 -256 11262 -8102 -10872 7444
1796G444q200j1588J3300J443j4019Q019N465j1564K193J2808j2618p558J8575
$$ 7444 -756 -12344 956 2399 -11620 -3601 1864 -9700 -7507 5301 -7317 -14875 3700
1809C700l071j7836J0602J3662j6600m234J6425n729j1264J1078K713j4231R222
$$ 3700 629 -17207 -6605 7057 -9543 -13777 2648 -3081 -14345 -3267 -554 -14785 -5563
1822e563O892j6698J479J7751j0070j1969J6738L071j8465P030J5092j4415m964
$$ -5563 1329 -15369 -13890 3861 -6209 -18178 -1440 1631 -16834 -9804 5288 -9127 -14091
1835a4091J5485k447q765J0060K961j2562J0838P885j4950K753J6946j2507j1939
$$ -14091 1394 -1053 -9818 242 3203 -9359 1479 9364 -5586 -2833 14113 1606 -10333
1848a0333K1924K938k2239M016J7750j2494q407J5543q24j2622N271N326q966
$$ -10333 11591 14529 -7710 -3694 14056 1562 -6845 8698 7874 -4748 523 5849 -3117
1861c117M951N942j3729K028J6718j1752j2009J9128M236k0464P392J9835j3780
$$ -3117 1834 7776 -5953 -3925 12793 1041 -10968 8160 12396 -8068 -676 19159 5379
1874E379j2094J7772L953j2521O798O344j0364J735R401q861j10J0531q843j1880
$$ 5379 -6715 11057 15010 2489 9287 15631 5267 7002 16403 7542 7432 17963 9120 -2760
1888b760J7648L797j8769K738J4161j1711r475J6472n56j7635N845R927j1940
$$ -2760 14888 18685 -84 2654 16815 5104 -4371 12101 11545 -6090 -245 9682 -2258
1901b258K56R162r447n771J3207k280j2314J1070O196j6908L216J7189j0085j0916
$$ -2258 -2002 7160 -2287 -8058 5149 2869 -9445 1625 7821 -9087 -5871 11318 1233 -9683
1915i683J3403P63j2217J0512N330j4292m5J3267q149q099J3845j269j7667R719
$$ -9683 3720 4483 -7734 2778 8108 -6184 -6229 7038 -1111 -9210 4635 3366 -14301 -4582
1929d582J1122j2531l773R141m920o805J1255o40j2603O076P551j3305L712J3150
$$ -4582 6540 -5991 -9764 -623 -5543 -12348 -1093 -1733 -14336 -8260 -709 -14014 -10302 2848
1943B848j2232j0638J7569J966j6801P246J2500j5008o130J8365j334j2383N874
$$ 2848 -9384 -20022 -2453 -487 -17288 -10042 2458 -12550 -18680 -315 -1649 -14032 -8158
1956h158K683o427P003M474j2325M770J1214j1664n093K0107j81k2217Q589K0110
$$ -8158 -5475 -11902 -4899 -425 -12750 -7980 3234 -8430 -13523 6584 6403 -15814 -7225 12885
1970A2885j3601j0646J6760N4j3574Q254R101q448j985O671o969K294J0403j0583
$$ 12885 -716 -11362 5398 5452 -8122 132 9233 785 -1200 5471 -1498 796 11199 616
1984F16o058J4093m60j7391J3327J4046k2023q507K4932J424j9747P048J1690
$$ 616 -5442 8651 8191 -9200 4127 18173 -3850 -12357 12575 13999 -5748 1300 12990
1997A2990j1059q13J0610m975k240N788n143k823J3848r63j6414Q940J1066j1902
$$ 12990 1931 1118 11728 6753 4513 10301 5158 2335 16183 15220 -1194 7746 18812 6910
2011F910l643J8114p535j7788J4348J0932j6595l110J4475q175r505J1681J530
$$ 6910 3267 21381 13846 -3942 10406 21338 4743 1633 16108 7933 -1572 10109 11639
2024A1639j0021K505L568q441M584P875j1257o473J4579l094j1565Q464N395j5911
$$ 11639 1618 4123 7691 -750 3834 11709 452 -6021 8558 5464 -6101 2363 7758 -8153
2038h153L250J5435j1071r666J5662j270j7012R144J3862j5413p431J3169k291
$$ -8153 -4903 10532 -539 -10205 5457 4187 -12825 -3681 10181 -5232 -12663 506 -1785
2051a785p746O560O28p992O019J336r984M691R875j2879o561J8707j120j8159
$$ -1785 -9531 -2971 -2343 -10335 -4316 -2980 -12964 -8273 1602 -11277 -17838 869 -251 -18410
2065a8410J0100J1259j6403l327J7654k076j6842O729J0921r353m16M400l918
$$ -18410 -8310 2949 -13454 -16781 873 -1203 -18045 -11316 -395 -9748 -10164 -5764 -9682
2078i682R56M076p043k7J1999o656j6756J5478J2407j8632n618K1945l757j7161
$$ -9682 -8726 -4650 -11693 -11720 279 -6377 -23133 -7655 4752 -13880 -19498 2447 -1310 -18471
2092a8471J0662J1254j2614l194J0842j750l032N919j918l108R359k011q524J0685
$$ -18471 -7809 3445 -9169 -12363 -1521 -3271 -6303 -384 -2302 -5410 3949 1938 -6586 4099
2106D099O151j7023K083J9536p593j7517J4115J1984j7007l003J5445m493r872
$$ 4099 10250 -6773 -4690 14846 7253 -10264 3851 15835 -1172 -4175 11270 6777 -3095
2119c095P564J635o597O143L44q066N014Q675j1966p59J4344q341j1011J4090
$$ -3095 4469 6104 -493 5650 5994 -2072 2942 11617 -349 -1108 13236 4895 -6116 7974
2133G974O513j6436K352J5063r912p750J2981K409j3681N226R181q179j918Q935
$$ 7974 14487 -1949 403 15466 5554 -2196 10785 13194 -487 4739 13920 5741 3823 12758
2147A2758n400n374R543k651q166Q940J694j2825N165J0325j1585o668J3683j348
$$ 12758 7358 1984 11527 8876 710 9650 11344 -1481 3684 14009 2424 -4244 9439 8091
2161H091j5913R896J0058j6241j516J3340m351j1629R521M535r398K740M344n688
$$ 8091 -7822 2074 12132 -4109 -5625 7715 3364 -8265 1256 5791 -3607 -867 3477 -2211
2175b211Q53M425p179j482J2924o485j1551J1870O977j7544j324J9285p236j5037
$$ -2211 -1358 3067 -4112 -5594 7330 845 -10706 1164 8141 -9403 -10727 8558 1322 -13715
2189a3715J2904P099j3926j284R578m470m542N259j968l088P556l899r154J0141
$$ -13715 -811 6288 -7638 -8922 656 -3814 -8356 -3097 -5065 -8153 -597 -4496 -13650 -3509
2203c509M907j4725J565J6661j0247j3979J6816O045j5979o59J4705n517r733
$$ -3509 1398 -13327 -11762 4899 -5348 -19327 -2511 3534 -12445 -13104 1601 -3916 -13649
2216a3649J0307K918o670K219K313n502O026L254j0456J625J2825o500j0520J2867
$$ -13649 -3342 -424 -7094 -4875 -2562 -8064 -2038 1216 -9240 -7615 5210 -1290 -11810 1057
2230A057N385j6364L241J3579p616p039J0675L98j0166O670N549p315k15Q327
$$ 1057 6442 -9922 -6681 6898 -718 -7757 2918 3316 -6850 -180 5369 -1946 -2161 6166
2244F166p658o68J0653p046o845J0037N337j1396J948J1015q396n270J2347o46
$$ 6166 -1492 -2160 8493 1447 -5398 4639 9976 -1420 528 11543 3147 -2123 10224 9578
2258I578r821O459O160j0166R69J1753q286n680R669N10j0328P349N392j1224
$$ 9578 -243 6216 12376 2210 3179 14932 6646 966 10635 11145 817 8166 13558 2334
2272B334N31R220m807n644R918k089j1183Q691N840j2154K95J2183p940q439J2095
$$ 2334 2865 12085 7278 1634 11552 9463 -1720 6971 12811 657 952 13135 5195 -3244 8851
2287H851J900j3325L037Q942p023l240R115m783n878P786p61p674P199L362j2769
$$ 8851 10751 -2574 463 9405 2382 -858 8257 3474 -2404 5382 4621 -3053 4146 7508 -5261
2302e261K699J1899q577r455J2672J560j3460L892J1419r079o203Q982k165m649
$$ -5261 -2562 9337 760 -8695 3977 5537 -7923 -4031 7388 -1691 -7894 1088 -1077 -5726
2316e726M620M15p838M357M137r939J410J1115r908o717J1826L182j4145L601
$$ -5726 -1106 -691 -8529 -4172 -35 -9974 -8564 2551 -7357 -14074 -2248 934 -13211 -9610
2330i610J1234q593o802J3401k488p449N334M957q547J780P033p724j89J0052
$$ -9610 1624 -6969 -13771 -370 -2858 -10307 -4973 -16 -8563 -6783 250 -7474 -7663 2389
2344B389n788p838J1574K235j3494N259J0791r378n189J0337p31p928O006M364
$$ 2389 -3399 -11237 337 2572 -10922 -5663 5128 -4250 -9439 898 167 -7761 -1755 2609
2358B609r230J663P907p249j537Q487k510r340R526N385j0474J085J1742r532
$$ 2609 -6621 -4958 2949 -4300 -5837 2650 140 -9200 326 5711 -4763 -3678 8064 -1468
2372a468m502J0432J185r482O910L630q369K870Q891q578m686J2898k135j0558
$$ -1468 -5970 4462 5647 -3835 3075 6705 -1664 1206 10097 1519 -3167 9731 7596 -2962
2386b962P532N984j1266K47R377l840p822Q078J047q301N810M055r466K585P595
$$ -2962 4570 10554 -712 -465 8912 5072 -2750 5328 6375 -1926 3884 7939 -1527 1058 8653
2401H653o991m725J0689r85j0912P693O935j1504p93J1358m001p459P739J861
$$ 8653 1662 -3063 7626 6641 -4271 3422 10357 -1147 -1940 9418 5417 -2042 5697 7558
2415G558q932M578M537q594P85Q727o357n679J0566p39j1864N701R345j1783k484
$$ 7558 -1374 3204 7741 -853 -68 8659 2302 -3377 7189 6450 -5414 287 9632 -2151 -4635
2430d635J0987m078q907P173K913q940N466L470q537J460P657o561o386J0715
$$ -4635 6352 2274 -6633 540 3453 -5487 -21 3449 -5088 -3628 4029 -2532 -8918 1797
2444A797Q40j2424N874R845j1977k775J1547l043r381P599L017p866J435O955
$$ 1797 2637 -9787 -3913 5932 -6045 -8820 2727 -316 -9697 -2098 919 -6947 -5512 1443
2458A443o067j940Q693m850p392J0286J595j1641M759Q429r535l739J2306j624
$$ 1443 -4624 -6564 2129 -2721 -10113 173 1768 -9873 -5114 3315 -6220 -9959 2347 723
2472G23j0467O838N266q870J308P240o282m050R121j604p930P144K337r452J794
$$ 723 -9744 -2906 2360 -6510 -5202 2038 -4244 -8294 827 -777 -8707 -1563 774 -8678 -6884
2487f884J1699q732n948J0391Q8q692P444M847j0094J185R124o467k965J0680
$$ -6884 4815 -3917 -9865 526 614 -8078 -634 4213 -5881 -4696 4428 -2039 -5004 5676
2501E676k657r632Q627O176j0093P26R243n285n816J0715l45q428M117M570n735
$$ 5676 3019 -6613 2014 8190 -1903 -1177 8066 2781 -3035 7680 7335 -1093 3024 7594 1859
2516A859J241O635p839l664J1299k676q821O580N496j2232k85J3205m613r959
$$ 1859 3100 9735 1896 -1768 9531 6855 -1966 4614 10110 -2122 -2407 10798 6185 -3774
2530c774P011M782r201L593N625o600r44N957k383l030R032m384q109P816P195
$$ -3774 3237 8019 -1182 2411 8036 1436 492 6449 4066 1036 10068 5684 -2425 5391 12586
2545A2586j0519k796J1474m300r666R978L463r581r97P447n573j726O690n049
$$ 12586 2067 -729 10745 6445 -3221 6757 10220 639 -358 7089 1516 -210 6480 1431
2559A431n956P404K73p738M890M230r620j196J0488m249q610O199L937j0698K678
$$ 1431 -4525 2879 3152 -4586 304 4534 -5086 -6282 4206 -43 -8653 -2454 1483 -9215 -6537
2574f537R605p001n043Q092k243n175P043P06r838M738O837p361k103Q572m029
$$ -6537 3068 -3933 -8976 -884 -3127 -8302 -1259 -553 -10391 -5653 1184 -6177 -8280 292 -3737
2589c737q180R062N187j1052J342Q589o790l199Q815J47j1105P916N286r992J542
$$ -3737 -11917 -2855 2332 -8720 -7378 1211 -5579 -8778 37 184 -10921 -3005 2281 -7711 -6169
2604f169Q544q024k091Q608m23o886M081L631q499K330Q609p532m380J0051k181
$$ -6169 2375 -5649 -7740 868 445 -6441 -2360 1271 -7228 -4898 3711 -3821 -8201 1850 -331
2619c31p409Q334L915j0407N21J0484m927o161Q800K988q851L665N880n760K019
$$ -331 -7740 594 4509 -5898 -5377 5107 180 -5981 2819 5807 -3044 621 6501 741 2760
2634B760M638o203j882J1274l731q491Q379M993j0406m69J2674o356r175Q228
$$ 2760 7398 1195 -687 10587 6856 -1635 6744 11737 1331 862 13536 7180 -1995 6233
2648F233N278r097R96N979o016k230N262K1n380M442j406n718P591L506j2207
$$ 6233 11511 2414 3410 9389 3373 1143 6405 6426 1046 5488 4082 -1636 5955 9461 -2746
2663b746K091J1099q357o078J1859K651j4704L449J0257o000l433N441j069n426
$$ -2746 -655 10444 2087 -3991 7868 10519 -4185 -736 9521 3521 88 5529 4460 -966
2677i66M086J912n749N001J232p591J177Q839n445q365J0497L17j1589N336P977
$$ -966 3120 5032 -717 4284 5516 -2075 -898 7941 2496 -5869 4628 4945 -6644 -1308 6669
2692F669r388n762J1129l89q944M691K767o896O85N289m511j278M663l518m924
$$ 6669 -2719 -8481 2648 2259 -6685 -1994 773 -6123 -5438 -149 -4660 -5938 -1275 -4793 -9717
2707i717P549K281r909K826Q462q522k645J0499m158q797Q563N427j0146q2Q436
$$ -9717 -2168 113 -9796 -6970 1492 -7030 -9675 824 -3334 -12131 -3568 1859 -8287 -8369 67
2722F7n414m386Q141j00o229M584J317m729K068O256n414m462Q305j433p806R094
$$ 67 -5347 -9733 -1592 -1692 -7921 -3337 -2020 -6749 -4681 1575 -3839 -8301 4 -1429 -9235 -141
2738a41J978j0228J758J0539o325o677R596J452r756M388O842o337k656O036k066
$$ -141 1837 -8391 -6633 3906 -2419 -9096 500 1952 -7804 -3416 3426 -2911 -5567 469 -1597
2753a597k445O063k095l839N710K508q497L038J0132q381o436J3516J187j3109
$$ -1597 -4042 2021 -74 -3913 1797 4305 -4192 -1154 8978 597 -5839 7677 8864 -4245
2767d245N396Q521o955l534Q719j400n695M490j12l168N382k61o390L660N586
$$ -4245 1151 9672 2717 -817 7902 6502 807 5297 5185 2017 7399 7138 748 4408 9994
2782I994p055m585J1296r40j1784O506R452r962n098J0701j887p358M774M247
$$ 9994 2939 -1646 9650 8710 -3074 3432 12884 2922 -2176 8525 6638 -720 4054 8301
2796H301o257R36L995m850J90N623m314l555R140k731q881P057N854r996j979
$$ 8301 2044 2980 6975 2125 2315 7938 3624 69 9209 6478 -2403 4654 10508 512 -1467
2811a467J0105k454j0578Q157L159r472k7R194n783l391N659j375n951L952K559
$$ -1467 8638 6184 -4394 3763 6922 -2550 -2577 6617 834 -2557 3102 1727 -4224 -272 2287
2826B287o598K913M735q177q14R905n327p831P106M275j0168K855Q680p130n898
$$ 2287 -4311 -1398 3337 -4840 -5654 4251 -1076 -8907 -1801 2474 -7694 -4839 3841 -3289 -9187
2841i187R113Q59p385K952M943n669j514O115l476k186N596k094m163N583J058
$$ -9187 -74 785 -6600 -3648 1295 -4374 -5888 227 -3249 -5435 161 -1933 -6096 -513 545
2856E45q510K689Q813q877m557J2290j855r761N172O080p017k620R264k972m652
$$ 545 -7965 -5276 3537 -5340 -9897 2393 538 -9223 -4051 2029 -4988 -7608 1656 -1316 -5968
2871e968N399Q63m720K815K782o367L423O462o633k996R766k503r086P114P111
$$ -5968 -569 294 -4426 -1611 1171 -5196 -1773 4689 -1944 -4940 4826 2323 -6763 351 7462
2886G462j0027j805J1029l560o381N108K907o043K523K940l683J35M186m670k485
$$ 7462 -2565 -4370 6659 3099 -3282 1826 4733 -1310 1213 4153 470 605 4791 121 -2364
2901b364Q847k178q741N991O248r413r77J0726l867p796O150M369q125J172O001
$$ -2364 6483 4305 -4436 1555 7803 -1610 -2587 8139 4272 -3524 2626 6995 -1130 42 6043
2916F043m858j377O420m125l038N579l52n476K915N538p533j303Q094l031p270
$$ 6043 1185 -192 6228 2103 -935 4644 4292 -1184 1731 7269 -264 -1567 6527 3496 -3774
2931c774Q491K291j0100J499P886o388k838P326j879o537O581K259p922K070N526
$$ -3774 4717 7008 -3092 -1593 6293 -95 -2933 4393 2514 -4023 2558 4817 -3105 -1035 4491
2946D491o550j910P710l669o240N852J967p647L626P169o851m287Q728j695p944
$$ 4491 -2059 -3969 3741 72 -6168 -316 1651 -5996 -2370 4799 -2052 -6339 2389 694 -7250
2961g250O844L395q559R90P386m452m995P289j080o128N025K518n773Q96N604
$$ -7250 -406 2989 -5570 -4580 2806 -1646 -6641 648 -432 -6560 -1535 983 -4790 -3894 1710
2976A710p223j447Q755l635p668N990N896q829j021J0055m990o331O539K53n736
$$ 1710 -5513 -6960 1795 -1840 -9508 -3518 2378 -6451 -7472 2583 -2407 -8738 -2199 -1946 -7682
2991g682L595M136o306R09O556n061l012O143K77p598O446N426j0403J030Q655
$$ -7682 -4087 49 -6257 -5348 1208 -3853 -6865 -722 -445 -8043 -1597 3829 -6574 -5544 3111
3006C111n172l549N848K781p928L477N812o498j257O598l633l391O748r24n788
$$ 3111 -2061 -5610 238 3019 -4909 -1432 4380 -2118 -3375 3223 -410 -3801 2947 2023 -3765
3021c765M698M778q178K33R133m326o576O945J556p455L669O269o932j242O146
$$ -3765 933 5711 -2467 -2234 6899 2573 -4003 2942 4498 -2957 712 6981 49 -1193 4953
3036D953j413m596O362j05q015P119L678p454j304R751m327o536O421K870o546
$$ 4953 3540 -1056 5306 5201 -2814 4305 7983 529 -775 8976 4649 -1887 4534 7404 858
3051H58J92O702o785m51O532k243o355O952J972p643K654N103o145k656P259k104
$$ 858 1050 7752 967 516 7048 4805 -1550 5402 7374 -269 2385 7488 1343 -1313 5946 3842
3067C842o703O388J718p337J451P033m680l312O113j979n926M975K986q985K410
$$ 3842 -2861 3527 5245 -2092 -641 6392 1712 -1600 4513 2534 -3392 1583 4569 -4416 -2006
3082b006P707p126l425P810q33p199M593J938n674J353N047n300k344P224j572
$$ -2006 5701 -1425 -4850 2960 2127 -5072 -479 1459 -4215 -2862 2185 -3115 -5459 1765 193
3097A93p659N770K916p438K81P037m747m771Q318l72q003N602L615o912r41P000
$$ 193 -7466 -1696 1220 -6218 -5937 1100 -3647 -8418 -100 -472 -8475 -2873 742 -6170 -7111 -111
3113a11l822k767O122k816m747N748L324p968J517P969n411m800Q627P23p837
$$ -111 -3933 -6700 -578 -3394 -8141 -2393 931 -7037 -5520 2449 -2962 -7762 865 1588 -6249
3128f249K392N564n100L41O377m933l758O345M26n215M141M071p332Q38P261l325
$$ -6249 -3857 1707 -3393 -3052 3325 -1608 -5366 979 1405 -3810 331 4402 -2930 -2092 5169 1844
3144A844m809O425J822q185L851N144n611k566O853j503n113N882K38o215M310
$$ 1844 -2965 3460 5282 -2903 948 6092 481 -2085 4768 3265 -1848 4034 4272 -1943 2367
3159B367M846p252k36O617l047n051O598J707p102K424N380m939p87O271k014
$$ 2367 7213 -39 -275 6342 3295 -1756 4842 6549 -553 1871 7251 2312 1525 7796 5782
3174E782o330N803K604p584J791O233o536j984P867k414n074M241K314p325J538
$$ 5782 -548 5255 7859 275 2066 8299 1763 -221 7646 5232 158 4399 6713 -612 926
3189I26N811m113m620N479j673m744N017K085p432J442O704p203j419O617j069
$$ 926 6737 2624 -1996 3483 1810 -2934 2083 4168 -3264 -1822 4882 -2321 -3740 2877 1808
3204A808p731M858M105o060Q3M695m124k425O509q82m775L693L087q029K176P528
$$ 1808 -5923 -1065 3040 -3020 -2937 1758 -2366 -4791 1718 836 -3939 -246 2841 -5188 -3012 4516
3220D516q142m041Q628m07p348L967M775p074q88O924m108l062M865l27m792M486
$$ 4516 -3626 -7667 961 554 -6794 -2827 1948 -5126 -6014 910 -3198 -6260 -1395 -1722 -6514 -2028
3236b028J426n275k34M985k861l640P108k012o461M985N894p621r38P700l981
$$ -2028 -602 -5877 -6111 -1126 -3987 -7627 -519 -2531 -8992 -4007 1887 -5734 -6672 1028 -2953
3251b953l503N164K127n126K812J982n218J976O134m798k693O286l0o644N060
$$ -2953 -6456 -1292 835 -4291 -1479 503 -4715 -2739 3395 -1403 -4096 2190 2160 -4484 576
3266E76L741o135j132O888k175m831O200J94p590L820M858n977l18N998k666n018
$$ 576 4317 -1818 -2950 3938 1763 -3068 3132 3326 -4264 -444 4414 -1563 -1881 4117 1451 -3567
3282c567O197J347o157K481L710m263L86M945l356m983O979J416n447J441N451
$$ -3567 2630 3977 -2180 301 4011 -252 134 5079 1723 -3260 3719 5135 -312 1129 6580
3297F580n814j725Q235k058o333M474K862n345J280O207m186l314M049r61l934
$$ 6580 766 -959 7276 5218 -1115 3359 6221 876 2156 8363 4177 863 4912 3951 17
3312A7M659L85n026K306O363o806k473N419k642m994M856L084o271L26M477l406
$$ 17 4676 5061 35 2341 8704 1898 -575 4844 2202 -2792 2064 5148 -1123 -797 3680 274
3328B74l201O260k49n175L405Q98m742J834M283o251k347R272l401n681N653K858
$$ 274 -2927 3333 3084 -2091 1314 2212 -2530 -696 3587 -2664 -5011 4261 860 -4821 832 3690
3344C690o308j275P043l544l786M774N1m793L149K600n079P70L465k013l227N284
$$ 3690 -2618 -3893 3150 -394 -4180 594 645 -4148 -999 1601 -3478 -2708 757 -1256 -4483 801
3360H01j472o147N930L067q254M79P529m559m770P002M96o254K307M123m350n67
$$ 801 -671 -6818 -888 2179 -6075 -5596 1933 -2626 -7396 -394 102 -6152 -3845 278 -4072 -4639
3376d639M413j776l310N560j230m211L182M368o107O4O373l505l605O336m58p847
$$ -4639 -226 -2002 -5312 248 -982 -5193 -2011 2357 -3750 -3686 2687 -818 -4423 1913 1455 -6392
3392f392N455M412n417j847N640q57l912L494K334n068K355K125l786K3L913k582
$$ -6392 -937 3475 -1942 -3789 1851 994 -2918 576 2910 -2158 197 2322 -1464 -1441 2472 -110
3408a10k829P400j854n725L982L052m150j345P834l451n389N218M256o729P72
$$ -110 -2939 4461 2607 -3118 864 3916 -234 -1579 6255 2804 -2585 2633 6889 160 932
3423I32M850m566k520N912j165m244M532J547n642L341K489m590m61N787k457
$$ 932 5782 1216 -1304 4608 3443 -801 3731 5278 -364 2977 5466 876 415 6202 3745
3438C745m914N191K475p099M8O585l404m399N176R86n175K009L033m347O09L148
$$ 3745 -1169 4022 6497 -602 -554 6031 2627 -1772 3404 4390 -785 1224 4257 -90 519 3667
3454C667l950r67P084m726l547O101O50p124K173M858l469m934O514Q93o285J998
$$ 3667 -283 -1250 5834 1108 -2439 3662 4312 -2812 -639 4219 750 -4184 2330 3223 -3062 -1064
3470a064M497l580k843L166j632j921M322j201m425M062K707o484O25O047m523
$$ -1064 3433 -147 -2990 176 -1456 -3377 945 -256 -4681 -619 2088 -4396 -3771 2276 -2247
3485b247m540P119l38o574L341M654m399j221N131k594l723K875J385m088K780
$$ -2247 -6787 332 -6 -6580 -3239 1415 -2984 -4205 926 -1668 -5391 -2516 -1131 -5219 -2439
3500b439K523m715O92L929l498k057M963o50m650L299M479o846N83N157j481m528
$$ -2439 84 -4631 -3939 -10 -3508 -5565 -602 -1252 -5902 -2603 1876 -4970 -4387 770 -711 -5239
3516e239M421J424o085K104M551m208j449N118j969k390L481O99l948K565K871
$$ -5239 -818 606 -5479 -3375 1176 -3032 -4481 637 -1332 -3722 -241 458 -3490 -925 1946
3531A946m579o8N294j873m062M121K188o117N86O168m502k861N953J864o013K851
$$ 1946 -2633 -2701 2593 720 -3342 779 2967 -3150 -2564 3604 -898 -3759 2194 4058 -1955 896
3547H96K367l983J369K967k970L38L297j009m050N254J033p271K783O516o825
$$ 896 3263 -720 649 3616 646 984 4281 3272 -778 4476 5509 -1762 1021 7537 712
3562G12j198N459n72n361K973L025m812N49K525k088o23M056k431k703K953J977
$$ 712 -486 4973 4401 -960 2013 5038 226 775 3300 1212 589 4645 2214 -489 2464 4441
3578D441o074K223M397m201k602N984o45o142L385L784m582r99M838k861k386
$$ 4441 -1633 590 4987 786 -1816 4168 3523 -2619 766 4550 -32 -1031 3807 946 -1440
3593a440K502J277m887L556K211n748J644L155l715k364N691j292m018K283K884
$$ -1440 1062 2339 -2548 1008 3219 -2529 -885 2270 -1445 -3809 1882 590 -3428 -1145 1739
3608A739n038r00N073k498l150N273O0o030L167K623l331m88L502k713k956N332
$$ 1739 -3299 -4199 874 -1624 -4774 499 559 -5471 -2304 319 -3012 -3500 2 -2711 -5667 -335
3624c35P7m851L166K339l533j204M159p06m871M976K054m220Q23M064m375k106
$$ -335 -258 -5109 -1943 396 -3137 -4341 -182 -888 -5759 -783 1271 -2949 -2126 1938 -2437 -4543
3640d543M471r65l129M308O62l216K80L976k961j114M830k395l078L994J080n095
$$ -4543 -72 -1037 -4166 142 804 -2412 -2132 1844 -1117 -2231 2599 204 -2874 1120 2200 -2895
3656b895K086N426o065M9M557q01m374L344K121m038N33L218k737O78K460n40
$$ -2895 -809 4617 -1448 -1399 3158 2357 -2017 1327 3448 -590 -57 3161 424 1102 3562 3022
3672C022k874K325J718m690K330L874n786K55M725r66m234L045K198m050L90L201
$$ 3022 148 2473 4191 -499 1831 5705 -81 174 4899 3933 -301 2744 4942 892 1282 4483
3688D483j978j797M371j166l268L027J686n856K793L137m189k431N170K67n944
$$ 4483 2505 708 5079 3913 645 3672 5358 -498 2295 5432 1243 -1188 3982 4249 -1695
3703a695K694L438m783k42L746k829k250M649J90m768K771J520l978L75M792l802
$$ -1695 999 4437 -346 -588 3158 329 -1921 2728 2918 -1850 921 2441 -1537 -1162 3630 -172
3719a72j789L337m0m982L976L317n958n87N130l142l308N095n77l421J262K855
$$ -172 -1961 1376 1336 -3646 330 3647 -2311 -2898 2232 -910 -4218 877 300 -3121 -1859 996
3735I96l443k246N770l103l226M671J25m411L073J335k908j18L712k739j310L228
$$ 996 -2447 -4693 1077 -2026 -5252 -581 -456 -4867 -1794 -459 -3367 -3485 227 -2512 -3822 -594
3751e94r80k016K011K202m487K11M804k277l420L693J549m390J899L565m576k15
$$ -594 -1574 -3590 -1579 623 -3864 -3653 1151 -1126 -4546 -853 696 -3694 -1795 1770 -2806 -3021
3767c021L009q57k298L671p89l169N74L487l707o00N117j852m006L934K262l483
$$ -3021 -12 -869 -3167 504 -285 -3454 -2880 607 -3100 -3700 1417 -435 -4441 -507 1755 -1728
3783a728M2L944k744p61M119o69m631K480J892l688K282K358l541n76N287k548
$$ -1728 -1686 2258 -486 -1247 2872 2203 -2428 52 1944 -1744 538 2896 -645 -1221 4066 1518
3799A518k412K494K455n268K350L261k884j921L644l94j815K345Q69m396K086
$$ 1518 -894 1600 4055 -1213 1137 4398 1514 -407 3237 2843 1028 3373 4242 -154 1932
3814A932K415k233j137K621j067m780M926J798n587J077L994k783k277M026l10
$$ 1932 4347 2114 977 3598 2531 -2249 2677 4475 -1112 -35 3959 1176 -1101 2925 2615
3829B615m252K740K543l731n99L976k243j746L944p91l342K256K832n363J87N076
$$ 2615 -1637 1103 3646 -85 -684 3292 1049 -697 3247 2456 -886 1370 4202 -1161 -974 4102
3845D102k312l433M545k73m183K490K581m284j17L096k489k944N398k092k591
$$ 4102 1790 -1643 2902 2629 -1554 936 3517 -767 -884 2212 -277 -3221 2177 85 -2506
3860b506J974J662m151l70L273k182k046L361O74l942K422K424l594p77M545k368
$$ -2506 -532 1130 -3021 -3391 -118 -2300 -4346 -985 -311 -4253 -1831 593 -3001 -3778 767 -1601
3876a601k076K244J373k653J064K552l158j772M367J07k678J530K534m161O36
$$ -1601 -3677 -1433 -60 -2713 -1649 903 -2255 -4027 340 447 -2231 -701 1833 -2328 -1692
3891a692K453m024O05K830k223k932L884J199m475J955K338k043j304M778l109
$$ -1692 761 -3263 -2658 172 -2051 -4983 -1099 100 -4375 -2420 -82 -2125 -3429 1349 -1760
3906a760k459L236J434l409J756K993l888R96K164j567k769L577P34l514K336
$$ -1760 -4219 -983 451 -2958 -1202 1791 -2097 -1101 1063 -504 -3273 304 1038 -2476 -140
3921a40M340l822k019L786p63k297J888K602l236L28J866k084j306L925j484k460
$$ -140 4200 378 -1641 2145 1382 -915 973 3575 339 667 2533 449 -857 3068 1584 -876
3937h76L270J330l777M29L804l248j115L758o47l656K208K814l704k93L794j748
$$ -876 2394 3724 -53 376 4180 932 -183 3575 2928 -728 1480 4294 590 297 4091 2343
3953B343k911L615Rk826J193J245j737j48M281l746k706N670j412j971J285J556
$$ 2343 -568 3047 3056 230 1423 2668 931 783 5064 1318 -1388 4282 2870 899 2184 3740
3969C740l407m5M395k795k663L451j407k042J860J512k113j068K846k133j140
$$ 3740 333 288 4683 1888 -775 2676 1269 -773 1087 2599 486 -582 2264 131 -1009
3984a009L323j357l733J727K683l836O34M045k860m200M962J248o123L283K749
$$ -1009 2314 957 -2776 -1049 1634 -2202 -1568 2477 -383 -4583 379 1627 -4496 -1213 1536
3999A536n416Q57M232j699k606J999R63l755J449K977l446M85L002j923k246L922
$$ 1536 -3880 -3023 1209 -490 -3096 -1097 -134 -3889 -2440 537 -2909 -2424 578 -1345 -3591 331
4015C31j015l926K086L199l430j338L512k46l101L263J541m139J861J914k538
$$ 331 -684 -4610 -2524 675 -2755 -4093 -581 -827 -3928 -665 876 -3263 -1402 512 -2026
4030b026l29L314k506j379K529L16k776K208K905m199j111N366j962m894M054
$$ -2026 -2355 959 -1547 -2926 -397 -81 -2857 -649 2256 -1943 -3054 2312 350 -4544 -490
4045d90K011l757K14L883j227l350K582J017k462K204R52k409L84L770l896m93
$$ -490 1521 -2236 -2022 1861 634 -2716 -134 883 -1579 625 1577 -832 -448 3322 -574 -1067
4061a067L223J39l688K878K462l866O30K556k193k037L159M43k892J743K544l550
$$ -1067 2156 2295 -1393 1485 3947 81 711 3267 1074 -963 2196 2639 -253 1490 4034 484
4077D84P99K231j640k826M054m2k818J965l10j480j24L596k125k308K724P44l342
$$ 484 1283 3514 1874 -952 3102 3060 242 2207 1897 417 293 3889 1764 -544 2180 2924 -418
4094d18J155L375m333M07K084j354k085L853L34l833J754J938l919M97K160j465
$$ -418 737 4112 -221 186 2270 916 -1169 2684 3018 -815 939 2877 -1042 -545 1615 150
4110A50j180K927j190k713J585L344m771l46L905j062l506K262K081l724J575
$$ 150 -1030 1897 707 -2006 -421 2923 -1848 -2194 1711 649 -2857 -595 1486 -2238 -663
4125f63J924k608J05J499j389k312M441r60k726J810J988m627p61N022q76l086
$$ -663 1261 -1347 -1242 257 -1132 -3444 997 37 -2689 -879 1109 -3518 -4279 743 -133 -3219
4141c219K170J658l307K67L363k019j350L018q77k873L385m76k704J257K264l271
$$ -3219 -1049 609 -2698 -2431 932 -1087 -2437 581 -296 -3169 216 -260 -2964 -1707 557 -2714
$$ [...]
8191B01
##END NTUPLES=NMR FID
##END=
