##TITLE=1H_SA_54.212
 CDCl3, 8 sc, 
 7.7.2020
##JCAMPDX= 6.0         $$ Bruker NMR JCAMP-DX V2.0
##DATA TYPE= NMR FID
##DATA CLASS= NTUPLES
##ORIGIN= UXNMR, Bruker Analytische Messtechnik GmbH
##OWNER= root
$$ XWIN-NMR		Version 3.5
$$ Tue Jul  7 09:54:52 2020 Russian Standard Time (UT+4h)  she@DPX200
##.OBSERVE FREQUENCY= 200.1315
##.OBSERVE NUCLEUS= ^1H
##.DELAY= (6, 6)
##.ACQUISITION MODE= SIMULTANEOUS
##.ACQUISITION SCHEME= undefined
##.AVERAGES= 8
##.DIGITISER RES= 18
##SPECTROMETER/DATA SYSTEM= spect
##.PULSE SEQUENCE= zg30
##.SOLVENT NAME= CDCl3
##.SHIFT REFERENCE= (INTERNAL, CDCl3, 0, 15.7039)
##AUDIT TRAIL= $$ (NUMBER, WHEN, WHO, WHERE, WHAT)
$$ ##TITLE= Audit trail, XWIN-NMR		Version 3.5
$$ ##JCAMPDX= 5.01
$$ ##ORIGIN= Bruker BioSpin GmbH
$$ ##OWNER= she
$$ F:/spectra/data/she/nmr/H-F/1/audita.txt
$$ ##AUDIT TRAIL=  $$ (NUMBER, WHEN, WHO, WHERE, WHAT)
(   1,<2020-07-07 09:53:23.73 +0400>,<she>,<DPX200>,
      <created by zg, POWCHK disabled, PULCHK disabled
       configuration hash MD5:
       00 E9 B6 7A A2 85 ED C7 34 08 36 98 17 FE 4E 26
       data hash MD5: 16K
       51 63 C1 EC 91 EE 77 0F B2 BF 53 EE 9B D9 7A 98>)
$$ ##END=
$$ 
$$ hash MD5
$$ 5A 6E 03 04 47 46 AE 62 5C 6D D3 3C FA D3 47 07
##$RELAX= 
##$RELAX= 
##$RELAX= 
##$RELAX= 
##$RELAX= 
##$RELAX= 
$$ Bruker specific parameters
$$ --------------------------
##$DU= <F:/spectra>
##$EXPNO= 1
##$NAME= <H-F>
##$PROCNO= 1
##$TYPE= <nmr>
##$USER= <she>
##$AMP= (0..31)
100 100 100 100 100 100 100 100 100 100 100 100 100 100 100 100 100 100 
100 100 100 100 100 100 100 100 100 100 100 100 100 100 
##$AQSEQ= 0
##$AQ_mod= 1
##$AUNM= <au_zg>
##$AUTOPOS= <>
##$BF1= 200.13
##$BF2= 200.13
##$BF3= 200.13
##$BF4= 200.13
##$BF5= 200.13
##$BF6= 200.13
##$BF7= 200.13
##$BF8= 200.13
##$BYTORDA= 1
##$CFDGTYP= 0
##$CFRGTYP= 5
##$CHEMSTR= <none>
##$CNST= (0..31)
1 1 145 1 1 1 1 1 1 1 1 1 1 1 1 1 1 1 1 1 1 1 1 1 1 1 1 1 1 1 1 1 
##$CPDPRG= <>
##$CPDPRG1= <>
##$CPDPRG2= <>
##$CPDPRG3= <>
##$CPDPRG4= <mlev>
##$CPDPRG5= <mlev>
##$CPDPRG6= <mlev>
##$CPDPRG7= <mlev>
##$CPDPRG8= <mlev>
##$CPDPRGB= <>
##$CPDPRGT= <>
##$D= (0..31)
0 1.2 0 0 0 0 0 0 0 0.06 0 0.03 0 0 0 0 0.0002 0 0 0 0 0 0 0 0 0 0 0 0 
0 0 0 
##$DATE= 1594101203
##$DBL= (0..7)
120 120 120 120 120 120 120 120 
##$DBP= (0..7)
150 150 150 150 150 150 150 150 
##$DBP07= 0
##$DBPNAM0= <>
##$DBPNAM1= <>
##$DBPNAM2= <>
##$DBPNAM3= <>
##$DBPNAM4= <>
##$DBPNAM5= <>
##$DBPNAM6= <>
##$DBPNAM7= <>
##$DBPOAL= (0..7)
0.5 0.5 0.5 0.5 0.5 0.5 0.5 0.5 
##$DBPOFFS= (0..7)
0 0 0 0 0 0 0 0 
##$DE= 6
##$DECBNUC= <off>
##$DECIM= 24
##$DECNUC= <off>
##$DECSTAT= 4
##$DIGMOD= 1
##$DIGTYP= 9
##$DL= (0..7)
0 120 120 120 120 120 120 120 
##$DP= (0..7)
150 150 150 150 150 150 150 150 
##$DP07= 0
##$DPNAME0= <>
##$DPNAME1= <>
##$DPNAME2= <>
##$DPNAME3= <>
##$DPNAME4= <>
##$DPNAME5= <>
##$DPNAME6= <>
##$DPNAME7= <>
##$DPOAL= (0..7)
0.5 0.5 0.5 0.5 0.5 0.5 0.5 0.5 
##$DPOFFS= (0..7)
0 0 0 0 0 0 0 0 
##$DQDMODE= 0
##$DR= 18
##$DS= 0
##$DSLIST= <SSSSSSSSSSSSSSS>
$$ [...]
##$SUBNAM2= <"">
##$SUBNAM3= <"">
##$SUBNAM4= <"">
##$SUBNAM5= <"">
##$SUBNAM6= <"">
##$SUBNAM7= <"">
##$SUBNAM8= <"">
##$SUBNAM9= <"">
##$SW= 24.9337058887773
##$SWIBOX= (0..15)
0 0 2 0 0 0 0 0 0 0 0 0 0 0 0 0 
##$SW_h= 4990.01996007984
##$TD= 16384
##$TD0= 1
##$TE= 0
##$TE2= 300
##$TE3= 300
##$TEG= 300
##$TL= (0..7)
0 120 120 120 120 120 120 120 
##$TP= (0..7)
150 150 150 150 150 150 150 150 
##$TP07= 0
##$TPNAME0= <>
##$TPNAME1= <>
##$TPNAME2= <>
##$TPNAME3= <>
##$TPNAME4= <>
##$TPNAME5= <>
##$TPNAME6= <>
##$TPNAME7= <>
##$TPOAL= (0..7)
0.5 0.5 0.5 0.5 0.5 0.5 0.5 0.5 
##$TPOFFS= (0..7)
0 0 0 0 0 0 0 0 
##$TUNHIN= 0
##$TUNHOUT= 0
##$TUNXOUT= 0
##$USERA1= <user>
##$USERA2= <user>
##$USERA3= <user>
##$USERA4= <user>
##$USERA5= <user>
##$V9= 5
##$VALIST= <valist>
##$VCLIST= <CCCCCCCCCCCCCCC>
##$VD= 0
##$VDLIST= <DDDDDDDDDDDDDDD>
##$VPLIST= <PPPPPPPPPPPPPPP>
##$VTLIST= <TTTTTTTTTTTTTTT>
##$WBST= 1024
##$WBSW= 4
##$XGAIN= (0..3)
0 0 0 0 
##$XL= 0
##$YL= 0
##$YMAX_a= 108066
##$YMIN_a= -70316
##$ZGOPTNS= <>
##$ZL1= 120
##$ZL2= 120
##$ZL3= 120
##$ZL4= 120
##$ABSF1= 10
##$ABSF2= 0
##$ABSG= 5
##$ABSL= 3
##$ALPHA= 0
##$AQORDER= 0
##$ASSFAC= 0
##$ASSFACI= 0
##$ASSFACX= 0
##$ASSWID= 0
##$AUNMP= <proc_1d>
##$AZFE= 0.1
##$AZFW= 0.1
##$BCFW= 1
##$BC_mod= 2
##$BYTORDP= 1
##$COROFFS= 0
##$CY= 11.3945322036743
##$DATMOD= 1
##$DC= 2
##$DFILT= <>
##$DTYPP= 0
##$F1P= 16.9975609425685
##$F2P= -3.02152046262296
##$FCOR= 0.5
##$FTSIZE= 0
##$FT_mod= 4
##$GAMMA= 1
##$GB= 0.15
##$INTBC= 1
##$INTSCL= 1
##$ISEN= 128
##$LB= 0.24
##$LEV0= 0
##$LPBIN= 0
##$MAXI= 10000
##$MC2= 0
##$MEAN= 0
##$ME_mod= 0
##$MI= 1.114404
##$NCOEF= 0
##$NC_proc= 0
##$NLEV= 6
##$NOISF1= 3.799351
##$NOISF2= 2.8
##$NSP= 1
##$NTH_PI= 0
##$NZP= 0
##$OFFSET= 15.70392
##$PC= 1
##$PHC0= -9788.26
##$PHC1= 15.60087
##$PH_mod= 1
##$PKNL= yes
##$PPARMOD= 0
##$PSCAL= 0
##$PSIGN= 0
##$REVERSE= no
##$SF= 200.130013532006
##$SI= 16384
##$SIGF1= 3
##$SIGF2= 2
##$SINO= 400
##$SIOLD= 16384
##$SREGLST= <1H.CDCl3>
##$SSB= 0
##$STSI= 0
##$STSR= 0
##$SW_p= 3612.71676300578
##$SYMM= 0
##$S_DEV= 0
##$TDeff= 0
##$TDoff= 0
##$TI= <>
##$TILT= no
##$TM1= 0
##$TM2= 0
##$TOPLEV= 0
##$USERP1= <user>
##$USERP2= <user>
##$USERP3= <user>
##$USERP4= <user>
##$USERP5= <user>
##$WDW= 1
##$XDIM= 8192
##$YMAX_p= 0
##$YMIN_p= 0
$$ End of Bruker specific parameters
$$ ---------------------------------
##NTUPLES= NMR FID
##VAR_NAME=  TIME,          FID/REAL,        FID/IMAG
##SYMBOL=    X,             R,               I
##VAR_TYPE=  INDEPENDENT,   DEPENDENT,       DEPENDENT
##VAR_FORM=  AFFN,          ASDF,            ASDF
##VAR_DIM=   8192,          8192,            8192
##UNITS=     SECONDS,       ARBITRARY UNITS, ARBITRARY UNITS
##FACTOR=    0.0002004,     1,               1
##FIRST=     0,             0,               0
##LAST=      1.6414764,     0,               0
##MIN=       0,             -70316,          0
##MAX=       1.6414764,     108066,          0
$$ Real data points
##PAGE= N=1
##DATA TABLE= (X++(R..R)), XYDATA
$$ [...]
2259H63j323j21J546q22o75P31L84j055L55N27n70J45O40j033L16J244o15j079
2277e42J514K94j401K84J206m46j043J188K74j504O41J026r10l24Q86r68J2O00
2295G87J63q38P32k80q72R47R44j308j217J498M18k013J153J663j977p09J504
2312E95K04p85j41N86r42M25O82n44J45L55o07j96J248l04j796J346J148j504
2330h5p11J876o91j253P54R85j063n09P93m42j90O86p04o44R82j51j005Q54R46
2349D28j590m98J494J7j562J278P60j787J44J438o60o40O60l1n91N97J44r65P89
2368e75K74p32j32J107m56j018R19M20j112l64J339m46p48J362q4j057L23Q21
2386a59r97K41J280j309n06J538L5p26M36N34p96j36J293o63m87J046m11p50P71
$$ plain form
2259 863 -460 -581 965 143 -532 199 583 -472 -117 410 -160 -15 625 -408 -92 1152 537 -542
2277 -542 972 1266 -135 149 1355 909 -134 1054 1328 -176 465 1491 581 257 1143 175 187 787
2295 787 950 112 844 564 -308 639 1583 275 -942 556 974 -1039 114 1777 -200 -909 595
2312 595 799 14 -127 459 -483 -58 624 80 225 580 -27 -223 1025 721 -1075 271 1419 -85
2330 -85 -796 1080 389 -864 -110 875 -188 -697 96 -346 -536 150 -554 -1198 -216 -367 -1372 -518 428
2349 428 -1162 -1660 -166 -149 -1711 -433 327 -1460 -1316 122 -538 -1178 -518 -549 -1140 -543 -399 -1364 -575
2368 -575 -301 -1033 -1165 -58 -514 -1532 -613 -193 -1305 -1669 -330 -776 -1524 -162 -246 -1303 -980 -159
2386 -159 -1156 -915 365 -944 -1450 88 123 -603 -167 367 -429 -565 728 65 -422 624 213 -537 234
2405B34O78r77n4R97l76o92J084J43r85K83R41p38m36R89j78p48J168j43j129
2424F1J091O19j051l02J250r83q77J484O29j252j45Q68o73j96P93m17o24N21J55
2443I51j025Q13O44j522K7J564p36j004Q67O73j425L40R50r01m40R71k89n71O83
2462E70N6j081K27Q91q20n63Q78l73j080O73J073j465n00J255j090j15Q88J85
2480c91j161m0R65q20Q24K64m63n88J260j65r17J028R8q14K0J401j013p34J305
2499E9R3j454J227O72j302j59N94p3k74O13l22j230J166N48r67l4Q38n85n38J526
2519C98n2j400R71N07j290M32J303p34j016J157N78n59k8N94n18m97J074k08n53
2538A59Q11n88k56M18Q79j278q1J385r02q80J325N39j849J06J366m79o85P31j37
$$ plain form
2405 234 912 -65 -119 878 502 -190 894 1037 52 335 1276 538 102 1091 913 165 1333 1190 61
2424 61 1152 1771 720 418 1668 685 -192 1292 1921 669 524 1392 719 523 1316 899 275 796 951
2443 951 -74 739 1383 -139 -112 1452 716 -288 579 1252 -173 167 1117 216 -224 747 458 -113 570
2462 570 626 -455 -228 663 -157 -720 158 -215 -1295 -622 451 -1014 -1514 -259 -1349 -1464 -576 -391
2480 -391 -1552 -1592 -627 -1447 -623 -359 -822 -1410 -150 -315 -1232 -204 -106 -920 -900 501 -512 -1246 59
2499 59 152 -1302 -75 597 -705 -864 -270 -343 -617 -4 -326 -1556 -390 158 -809 -843 -5 -590 -1128 398
2519 398 346 -1054 -83 424 -866 -434 869 135 -881 276 854 295 267 861 343 -154 920 712 159
2538 159 970 382 126 544 1423 145 64 1449 547 -333 992 1531 -318 -212 1154 675 -10 721 584
2557E84q54O87R6l85J04L90q56J14J387r17j167J485L02j562Q00J299j425r10
2575h28J300P22j128J37Q7m03L83Q32p24J91r7k88o03J633Mj795N62J283j527
2594b59l95J892q26j498Q36J098j245q6P13n38o62O15J33m37L36j25o73P79J084
2613G42j586k58J225k51n05O08P36j696M72J267k39p72N73j9p22N99O29n68o74
2632d39L22k37J69Q05p08j360J267K35j306N49J087q92j350J491Q25j496j48J104
2650h2q45m78J197M5o10j30P52k93N34j62q98O02J164j385J19J643k76j930P48
2669b85K214j585j161J147M21q47O2Q18m22n44K63k71Q08P9q76l36R16J4r41Q61
2689C35M89j304o18K014lk009N41J425q27j79O81J54o94m7l2M46M06m08p51P69
$$ plain form
2557 584 -270 417 513 128 232 622 -234 -120 1267 350 -817 668 970 -592 208 1507 82 -828
2575 -828 472 1194 66 203 290 -113 270 1102 378 569 472 184 -419 1214 1218 -577 -15 1268 -259
2594 -259 -654 1238 412 -1086 -250 848 -397 -483 230 -308 -970 -355 -222 -659 -323 -448 -1121 -342 742
2613 742 -844 -1102 123 -128 -633 -25 711 -985 -513 754 515 -257 316 297 -425 174 803 235 -439
2632 -439 -117 -354 -185 620 -88 -1448 -181 54 -1252 -703 384 -508 -1858 -367 458 -1038 -1186 -82
2650 -82 -927 -1405 -208 -163 -773 -903 -151 -444 90 -72 -970 -368 796 -589 -470 1173 897 -1033 -285
2669 -285 1929 344 -817 330 751 -96 -34 784 362 -182 81 -190 618 697 -179 -515 401 415 -526 335
2689 335 824 -480 -1098 916 913 -1096 -555 870 43 -136 545 699 5 -42 -74 372 778 370 -381 388
2709C88P07r56l02J265m53j276J487M34j510j48J081k31r06N53O35j163m15R36
2727A26P3l15J36p24j1R71n89o82R82K41j447L24J462q72j243J429M83j456N54
2746e58J293q62p21R04K38q31M47J12k75L17P3q47Q45Q19j449m84J761o89j115
2765a022O93J249r42q65J094j4j143M30O67N6m06M8r9K53K87m90k07J129l39j573
2785a194J654J011j680n11J713L5j579R47J243r46p76J121l87n84O52o7L4K09
2803H95o37l22J301J31j571K69J403r41j144J494L59j393j72J474m52o94N14L28
2821H42o03K16L30m90J58M26q30L89P79p40o07J277R8j941P89J307j000q39J166
2840G27K34j331P6J067r01k86O77l76k27N22l67o1K88J1j086Q46P52j036m88J505
$$ plain form
2709 388 1095 139 -163 1102 649 -627 860 1294 -216 -364 717 486 -420 133 768 -395 -810 126
2727 126 199 -116 20 -704 -715 256 -333 -1015 -33 208 -1239 -915 547 -325 -1568 -139 344 -1112 -558
2746 -558 735 -127 -848 56 294 -537 -90 22 -253 64 137 -710 135 954 -495 -979 782 93 -1022
2765 -1022 -329 920 -22 -887 207 193 -950 -520 147 203 -203 -155 -254 -1 286 -204 -411 718 379 -1194
2785 -1194 460 1471 -209 -720 993 1028 -551 396 1639 693 -83 1038 651 67 719 652 686 895
2803 895 258 -64 1237 1368 -203 66 1469 528 -616 878 1237 -156 -328 1146 694 0 514 842
2821 842 239 455 785 295 453 879 49 438 1217 477 -130 1147 1245 -696 93 1400 400 -439 727
2840 727 961 -370 -294 773 -128 -414 263 -113 -340 182 -185 -246 42 53 -1033 -187 565 -471 -959 546
2860E46M6j670M77J159q39r38J192j96m79J62O18n05l00N09p10J99N88p93j70
2879a104R72n47q67J097Q07j719j1J453k93j454J012N08j061r4J013o20J67L0
2897g11k13K31L30j62q96J151K58j390N53J231q87j066J570P95j731K06J236n41
2915c6j147J023M37n44J47j92o1N08L15q07j52J135p14q83J591J44j455Q21P59
2934H89o25o93Q98J31o50K14O12n69J11J62J29n74P75m32k78M57L84r45K39Q07
2954A042l49p22J010J26j093M86L96p13p7P45o15m05M70L66o99L03J25l29l50
2973b83Q30p12l73J022j10j282M98Q41j202Q2P53J37j066R95j6r13K06O24l68
2992c37n95Q11l18j91O43n96k06L41J24o40L3J372p14p34O28M25j071K69J196
$$ plain form
2860 546 592 -1078 -601 558 -281 -1219 -27 -223 -702 -540 78 -427 -727 -218 -928 -729 -141 -934 -1104
2879 -1104 -132 -679 -1546 -449 358 -1361 -1372 81 -212 -1666 -654 -146 -1207 -1301 -288 -908 -741 -711
2897 -711 -924 -693 -363 -525 -1421 -270 -12 -1402 -849 382 -505 -1571 -1 794 -937 -731 505 -36
2915 -36 -1183 -160 277 -267 -120 -312 -373 135 450 -357 -509 626 -88 -971 620 764 -691 130 889
2934 889 264 -429 469 600 -50 164 776 207 318 480 609 35 810 378 100 557 941 -4 235 1042
2954 1042 693 -29 981 1107 14 500 896 183 106 851 236 -169 301 667 -32 271 396 67 -283
2973 -283 547 -165 -538 484 374 -908 -410 431 -771 -689 64 201 -865 130 114 -799 -593 31 -337
2992 -337 -932 -121 -439 -630 13 -583 -789 -448 -324 -964 -931 441 -273 -1007 -379 46 -1025 -756 440
3011D40j172o51J122J82p64N30Pm81K00P72j125K50Q86j003l53J303j08q51M98
3030c18Q28o49o66J121J17r30N81L39p95M53O45r12M16L49n40l25J016L40j109
3049c9J02J111j048n19J253j77p76M77L79p70L77O48r47o0N40J74o44L79M58q46
3069G2J26Q12o23n29R15j45o90N34M81o30j05P68m21p24J260k81r01N28P87j163
3089G1k54R32m35m34R15k39r49N94M75j016MJ025n89o11M63L50j192N01O82o33
3109c40j77P84l62l17N22K45q96N84M25o66M7Q57p63l83J065k37r84L62J054o97
3129A23m96M97ol50J63K76o97j40P90o97L0P70o19p42J005J22j019O20P11q55
3149e14l59J095L3q63K08N57q88J22J057m71m91P18j78j04M24j13p19L23R21j108
$$ plain form
3011 440 -732 -1383 -261 -79 -843 -313 -306 -787 -587 185 -940 -690 196 -807 -1160 143 35 -816 -318
3030 -318 510 -139 -805 316 433 -497 84 423 -372 81 726 -186 230 579 39 -286 730 1070 -39
3049 -39 63 1174 126 -393 860 683 -93 384 763 -7 370 1018 71 11 551 725 81 460 918 72
3069 72 198 1010 387 -142 773 628 -62 472 953 323 218 986 565 -159 1101 820 -81 447 1234 71
3089 71 -183 749 314 -120 795 556 -393 201 676 -340 -336 689 100 -511 -48 302 -890 -389 293 -340
3109 -340 -517 267 -95 -412 110 355 -541 43 468 -198 -151 706 -57 -440 625 388 -596 -234 820 123
3129 123 -373 124 118 -232 -69 207 -490 -630 160 -537 -507 263 -356 -1098 -93 29 -990 -370 341 -514
3149 -514 -873 222 255 -608 -400 157 -731 -609 448 -23 -514 204 26 -78 346 233 -486 -163 758 -350
3169c50l16R56mr38N00N77q59O6O34m12m70R21k25o94J88L04o63M99M44m11j36
3190c89L96m5m78O94K35r72M18P64j34q02N02L72q36O10M75n22k07L61j77M8L21
3211F34K56j008j5P11m26J35M26k42q74Q85j5j126N48Q29r83J05R43m30r89M42
3231a94J9Or6N05n67K3N97l98j07N27k24n25M84Q70r54k56R65m64o56N71N44p17
3253d7m46M51J26j51L13l67j46M36k52n14L65N01r49l44J083l77p40N17M29j013
3273a125N38O53q9q15M12J26l97M62K7l23J31J55n7O6J48K8o08O81M04m61n39
3294e83R08j49o29O20J32q98N67N70q05L52L07l18k14L62K30p81N58p0l91j32
3314c64J309o59j064J254J73j228P52O97j018l35J292k96o23O26K66m26o7N63
$$ plain form
3169 -350 -666 290 286 -652 -152 425 -434 -368 266 -146 -616 305 80 -614 -426 -122 -785 -286 158 -253 -389
3190 -389 7 -38 -516 178 413 -559 -141 623 489 -313 189 561 -275 335 810 288 81 442 265 313 634
3211 634 890 -118 -133 578 152 287 713 471 -403 482 467 -659 -111 718 -265 -160 783 353 -636 -194
3231 -194 -175 -169 -265 240 -327 -304 293 -105 -212 315 91 -434 50 920 -34 -290 675 211 -445 126 670 -47
3253 -47 -493 -42 84 -67 246 -121 -267 169 -83 -597 -232 269 -680 -1024 59 -318 -1058 -541 -112 -1125
3273 -1125 -587 66 -23 -838 -426 -300 -697 -235 -208 -531 -400 -245 -302 -236 -88 -60 -668 13 417 -44 -583
3294 -583 325 176 -453 167 299 -599 -32 538 -267 85 392 74 -140 222 452 -329 229 159 -232 -364
3314 -364 945 286 -778 476 649 -579 173 870 -148 -483 809 513 -110 516 782 356 289 852
3332H52m11j06Jm4Q0P77m04p81O33L59o84J11O99n99q56P22N23m55l90M69k36
3353B60j36Q2O0n65J82J50n24N95L77j127J87R86m05j080J213P36j540n13J422
3372C60k86o42N38O57o83k11K49k89K09L34n61l3M38j95l99P03N5j177L38J125
3392E30j131m03R87J02q52j72Q84o08O3K08J55l01j27P9l87R84l1q82M22O17o42
3413e05j28J059l38r89M40O69o16R7K87qn77O00K40o11J17M37j06J02k10j15J80
3434B5M67k99m14L69N39j057j54J518o01q09P99K61p47k27Q30pl49J06m28M83
3454C05L44k85l51O10O1q78K74R99q14r43J138M77j086O9R34m55l75K97L21n20
3474A22J85k00l14K72L14m64M01K43q48k68P47L15j213N40P45o11o58J130j94
$$ plain form
3332 852 441 335 336 292 372 1149 745 -36 597 956 272 383 1082 483 -373 349 872 417 27 496 260
3353 260 124 206 266 -299 -117 33 -491 104 481 -646 -459 527 122 -958 255 991 -549 -1062 360
3372 360 74 -568 -30 627 -56 -267 -18 -307 -98 236 -325 -358 80 -115 -514 189 244 -933 -595 530
3392 530 -601 -1004 -17 85 -767 -939 -55 -663 -600 -392 -237 -538 -665 -586 -973 11 -20 -902 -480 137 -505
3413 -505 -633 426 88 -901 -461 208 -408 -311 -24 -32 -609 -9 231 -380 -263 174 68 170 -40 -155 25
3434 25 492 193 -221 148 687 -370 -524 994 393 -416 383 644 -103 -330 500 493 144 250 -178 305
3454 305 649 364 13 623 684 -194 80 1079 265 -678 460 937 -149 -80 854 399 24 321 642 122
3474 122 307 107 -207 65 379 -85 316 559 -289 -557 190 505 -708 -168 577 -34 -692 438 244
3493B44j18m91O28n47j29P27k41k9J92o16j03N07L1q72N26O11p70k3N29j35o48
3514g27M5P09l53n95P86n8l45J40j60p1J04k5l7M82N6o83J83L57q6m19N39J87
3536B9o40j77Q98k8q99O51M69p57N9K67J7l54K54L46l73P42m23o15Q51n3o28o6
3558d30Q03n00n49Q56M86q21J25O20k45p10N70J13l12J66K30l05J82j32o3k01
3578a17Q95n16j93Q34k36o51L06Q56r40m2L95M5l96J81K83o12j00N76m01j74L19
3599C12K8l17P72n50l07J09J101j220l02R92k66l20J39O48m41m21M25j53l3J98
3619C94J58k55J47P3p06L70N58p11j31R51j10j058O98r3n39J26L84j03p19N58
3639hJ19m12J8N20m53J3M64m12l97M71L44l93K87k33J9j11M14l31k7K82j9o93
$$ plain form
3493 244 126 -365 263 -284 -413 314 73 44 236 -380 -483 24 55 -817 -291 320 -450 -473 56 -79 -727
3514 -727 -682 27 -326 -921 -135 -193 -538 -398 -558 -629 -525 -550 -587 -105 -49 -732 -549 -192 -278 -697 -158 29
3536 29 -611 -788 110 82 -817 -166 303 -454 -395 -128 -111 -465 -211 135 -238 504 81 -534 317 264 -364 -430
3558 -430 373 -127 -676 180 666 -155 -30 590 345 -365 205 318 6 172 402 97 279 147 84 -117
3578 -117 778 262 69 903 667 16 322 1178 238 196 591 636 240 421 704 92 -8 568 167 -7 312
3599 312 340 23 795 245 -62 47 1148 -72 -374 618 352 32 171 819 378 -43 382 229 196 394
3619 394 552 297 444 517 -189 181 739 28 -103 848 738 -320 378 285 -254 -128 256 153 -566 -8
3639 -8 111 -301 -283 237 -216 -203 261 -151 -548 -77 267 -126 161 -72 -53 -164 250 -81 -108 174 155 -538
3661e38K98N30m27j54J03p9k43M04L6k36J44r4k8K14J37n20j09N28O7o31L48M43
3683A93n64n4Q79k26j020N82M08m70k7L83m0m92K64j44j00N85j29o21O81K39l95
3704f8k78O85P8n89K83M74p32K42N35p50o3P30l13k79M76r1n38K05M22l60l07
3725b38M01K0o05M17M55p42N38K34j68j76J40Q2k08j68N99o28R9L55m19l4P12
3746F66m61m78M15O10k64l41J09j15k96M37K89q60K35J20k85J03K76j78m34M21
3766c1P2n71M81L75j079K07P95n30l62N19J32p17M73O23l62o1J08j05l30N93O
3787B36n51K05J95l13J53J96m75k68N17K13n96l0O89o45k13O55O3q47P72J01k55
3808a98N2J46k14j62K32p9kN42k16p07K97R24n68l71R54k32n63O2N41n33k33Q31
$$ plain form
3661 -538 -240 290 -137 -291 -188 -267 -510 -106 -70 -306 -162 -256 -284 -70 67 -453 -562 -34 33 -598 -250 193
3683 193 -371 -425 454 228 -792 -210 198 -272 -299 84 44 -448 -184 -328 -428 157 28 -593 88 327 -68
3704 -68 -346 339 417 -172 111 585 -147 95 630 -120 -183 547 234 -45 431 340 -198 7 429 69 -238
3725 -238 163 183 -422 -5 450 -292 246 480 312 136 276 358 150 -18 581 -47 52 407 -12 -46 666
3746 666 205 -273 142 752 488 147 256 141 -155 282 571 -289 -54 66 -219 -116 160 -18 -452 -31
3766 -31 41 -530 -49 326 -753 -546 249 -281 -643 -124 8 -709 -236 387 25 -36 72 -33 -363 230 236
3787 236 -315 -110 85 -228 -75 121 -354 -622 -105 108 -488 -518 171 -474 -687 -32 31 -816 -44 57 -198
3808 -198 -146 0 -214 -376 -144 -223 -225 317 101 -606 -309 615 47 -324 630 398 -165 -103 438 -95 -328 503
3830E03k01j87J98K6k29K44J01k35k9J78Q3n91N78j68m62P58l56o07O83M25o06
3851A06k64P07k62J85k67L70n26M9K05l70J42kK78l80L08J77n53j09L11j38p7
3872a10O62q9n87K86M62o80j66Q13o67l24O47K56q36L93R0k70l03O38m03k79N11
3893D4l93L30k50J97o44M2O44o3p11P98k83k05L08M40o29J79J99k35q8M79j31
3914B8k30q4J12k98M53L19o07j51L31N10j041M25M99k83k37M14K53n67k11J94
3934a71Q3r0K13k45j40K37j60L09K29k3p67L62M65l30j91P41np82J18O05m77K21
3956B02Q2l99L05K41k38j28K61K50p86O32K08l88l36P29j32k18n8L60m01k64P32
3977F54k81m09N04l39K20m4K39l09J64o0m82K82Q8k07L6J87R2m70l3P62l61o66
$$ plain form
3830 503 302 115 313 339 110 354 455 220 191 369 452 -139 439 271 -191 567 211 -396 287 712 106
3851 106 -158 549 287 472 205 575 49 98 303 -67 75 73 351 -29 279 456 -97 -206 105 -33 -110
3872 -110 552 463 -124 162 624 -56 -222 591 -76 -400 247 503 -333 60 150 -120 -423 215 -188 -467 44
3893 44 -349 -19 -269 -72 -716 -674 -30 -93 -804 -6 -289 -494 -186 254 -375 -196 3 -232 -320 159 28
3914 28 -202 -286 -174 -472 -19 300 -307 -458 -127 383 -658 -233 266 -17 -254 160 413 -154 -365 -171
3934 -171 -88 -178 35 -210 -350 -113 -273 36 265 242 -525 -163 302 -28 -219 522 517 -265 -147 458 -19 202
3956 202 284 -115 190 431 193 65 326 576 -210 422 630 242 -94 635 503 285 227 587 186 -78 654
3977 654 373 -36 468 129 349 305 544 235 399 339 -143 139 227 20 56 243 335 -135 -168 594 233 -433
3999d33N57M50n46q8N78k06j92L15L7n36M45m63q5N41j02n33J30O32o52k94K37
4020b08J71m60o1M05O3k58L64j32k43P7J64m14J83J88l45L06K19l78j29N70r2
4041a0l34K75K43m18L0M23l1p81L51N80p19L06M4l94K75J73m78j22O88R8p00L70
4063a31Q8k38k48N83O5p56N15M76o74m6N01J09q29N55j03J20L53n45L15L47J72
4084F29m98r5N40k38o96P84m5l78K5N69k20p53P29O6n23K49K62k47l94N14P5k49
4106A06L64l70k25L89K4l04k30Q80o56j9P05Nj034N09N82n60j07N82N4p72R6L79
4128C98k91K69k91n24N87J85m01j79Q40m58m78J85L96m19j16M59k94l79O11J37
4148B37k96m0K18j99k1J24j21m22M64J81m88N15j00l44K19L41l73o81O19Q0r1
$$ plain form
3999 -433 124 574 28 -60 518 312 120 435 472 -64 381 -82 -167 374 272 -261 -131 501 -151 -445 -208
4020 -208 -37 -497 -558 -153 -90 -348 16 -116 -359 -282 -118 -532 -349 -161 -506 -200 19 -359 -488 82 -10
4041 -10 -344 -69 174 -244 -214 209 178 -603 -252 328 -391 -85 -41 -435 -160 13 -465 -587 101 199 -501 -131
4063 -131 -43 -281 -529 54 119 -637 -122 354 -320 -366 135 244 -585 -30 -133 -13 340 -205 110 457 629
4084 629 131 36 576 338 -358 426 381 3 28 597 377 -376 353 419 -104 145 407 160 -234 280 355 106
4106 106 470 100 -125 264 288 -16 -246 634 -22 -41 664 669 -365 144 726 166 59 641 695 -77 19 398
4128 398 107 376 85 -439 148 333 -68 -247 593 135 -343 -158 238 -181 -297 162 -132 -511 100 237
4148 237 -59 -99 119 -80 -101 23 -98 -520 -56 125 -363 152 52 -292 -73 268 -105 -786 -167 -87 -178
4169a78l5N9J6m87N31J11r5j50J35l29M39l35j27j15M83j30k94K65K37j20k98
4190d17L97J51l24O9j89j85L82J91j25J74K84k93k19J88j66k02L47J14m56J77
4210a02M57o03P4N28K9o59K92L59k77k76L48l10L28k7Ql23J01M49m97N2L32qo16
4233c41P83j7n06L89M84o97j76P33k18m03J46j78mK49J49k67%M04k92J23j3o6
4255B82o14L65L08j10m71N95J31p62M14K03p86N35K55l78j99J43N7o9L8J2o3K11
4277I7M8m21J10L22j92l97O54M41r12K44L75o90R8qM37k92q1K44m25K58O7k3k72
4300c18K22l0n55K52N34l82l9K32n4l20L26J90o22K18N94m60j94K15m6k50M54
4321c3K98m62J33M34n25j04Q5K40k98L73kn53M31P8k57m5K17K8k8l22M17j93N4
$$ plain form
4169 -178 -213 -154 -138 -625 -94 17 -78 -228 -93 -422 17 -318 -445 -560 -77 -207 -501 -236 1 -119 -417
4190 -417 -20 131 -193 -124 -313 -498 -116 75 -50 124 408 115 -104 84 -82 -284 63 177 -279 -102
4210 -102 355 -248 -174 354 383 -276 16 375 98 -178 170 -140 188 161 169 -154 -53 396 -101 -49 283 275 -341
4233 -341 442 425 -81 308 792 95 -81 652 434 31 177 -1 -5 244 393 126 126 530 238 361 348 282
4255 282 -332 33 341 231 -240 355 486 -276 138 341 -445 90 345 -33 -232 -89 -32 -101 -63 -51 -114 97
4277 97 145 -276 -166 156 -36 -433 221 662 -250 -6 369 -321 -223 -231 206 -86 -167 77 -348 -90 -23 -46 -318
4300 -318 -96 -126 -681 -429 105 -277 -316 -84 -138 -458 -132 58 -564 -346 248 -212 -406 -191 -237 -487 -33
4321 -33 265 -197 -64 370 -155 -259 -174 66 -232 141 139 -414 17 95 -162 -207 10 38 10 -312 105 -88 -34
4344c4j03R4q7N31n53L0K6K27n04J39M91j49m86L89J42O6j91J56j51N5K58mm61
4367a19M60j42l15oL58m46K55J83Kj87M26l96l42M13K28k63J19L55l62k38L54
4388C37m10k66Q62k14j21l00K14j52n9M45m48n9L08L5j96mL25j91m53P41m75j4
4410i5N6N48p60L78K29k67o43P04j01m31N20j01k13j93Q65m65m94N65n13J62L15
4431F6J07m14K3L61j39j48k18J63j21J60L28m93J88J71J6j83j44K81k06O2K68
4452A28O8l69L33j78j13M24j55m60M18q4j85K41K1n4j01M88k4q15N77ll12N1M03
4475B99j16k39M37k21l83N87L6n23q2O99j11o80K52K94j86m39O36l33J40J10j79
4496bl59N70L72n23L38L1l37r3J3L75n35K36L56m92J36K72m9m47K80K29o69N56
$$ plain form
4344 -34 -137 -43 -130 401 -152 -122 -96 131 -373 -234 257 108 -378 11 153 219 28 184 33 88 346 342 -119
4367 -119 341 199 -116 -122 236 -210 45 228 230 43 469 73 -269 144 372 109 228 583 221 -17 337
4388 337 -73 -339 523 309 188 -112 102 -50 -109 336 -112 -171 137 172 -24 -28 297 106 -347 394 -81 -95
4410 -95 -39 509 -251 127 356 89 -554 150 49 -382 138 37 -176 -369 496 31 -463 102 -411 -249 66
4431 66 173 -241 -218 143 4 -144 -362 -199 -320 -160 168 -325 -137 34 50 -133 -277 4 -202 -140 128
4452 128 196 -173 160 -18 -131 293 138 -322 96 12 -173 68 89 35 -66 422 398 -417 160 157 -155 -104 299
4475 299 183 -56 381 160 -223 364 400 -123 -205 494 383 -297 -45 249 63 -376 260 -73 67 177 -2
4496 -2 -361 209 581 58 396 427 90 -3 10 385 -150 86 442 -50 86 358 309 -138 142 371 -298 258
4518B58k15l58K12K66l63k34K46J93l54K89K28l70J16K46k75j09N04n06J5M7J77
4539A3l27J92L01o55L90K69j32k37K54J81n79K59L96l34j82K19K72n73j19N91
4559A99n39M7P7J12m66N62m09J1K42L42l52L7J66m11k9M96r7k73J30K11j20K31
4581A67Ml42Q1J87K28k95K78l9m18R7K94k56j70M37o9k19k04N67n38K74j58J5
4603g9q3J0L71l12j26L91K6m27M11l7m03K91K45j68J26J37l37n2K56j23p0K57
4625C04J38m33j11L07%p0J10J7n57M07j26l4k14O63n34J34k6L2m1K89L3n38K10
4648d0P6k06k11J81K17k16Q2K80j69q5L9j25o9L48j67L9q4K23q4k33M13L4l47
4671a04j26N4m4J01O87o57n1J16j54j70J86J73r3J90M0k62q0l7J35l1N34n55j90
$$ plain form
4518 258 43 -315 -103 163 -200 -434 -188 5 -349 -60 168 -202 -86 160 -115 -224 280 -226 -211 -164 13
4539 13 -314 -122 179 -476 -86 183 51 -186 68 249 -330 -71 325 -9 -191 28 300 -273 -392 199
4559 199 -340 -293 -216 -104 -570 -8 -417 -406 -164 178 -174 -137 29 -382 -411 85 -12 -285 -155 56 -64 167
4581 167 171 -171 -90 97 325 30 308 269 -149 -52 242 -14 -184 253 184 -35 -239 328 -210 64 -94 -79
4603 -79 -162 -152 219 -93 -219 172 198 -229 182 145 -258 33 278 110 236 373 36 -16 240 117 47 304
4625 304 442 9 -102 205 205 135 245 262 -295 112 -14 -48 -262 401 -133 1 -25 7 -34 255 288 -250 -40
4648 -40 36 -170 -381 -200 17 -199 -117 163 -6 -91 -52 -177 -246 102 -65 -26 -110 113 29 -204 209 243 -104
4671 -104 -230 -176 -220 -119 568 -89 -140 -24 -178 -348 -162 11 -82 108 148 -114 -194 -231 -96 -127 407 -148 -338
4694c38K36R5k74j0L27m1m5j5P0k20R8K65k91k8J87K84n68r6N64n21K65K87n19
4717b88P0M33l98k14K95N79n38l20M52k73m12N49j78k54Q59l28k25N9L60k64J9
4738a7L07j51k36K25kl4j89N31l90mJ90P6l57M3N7m0J80j6m80M94J73k43k76J69
4762A0R2k32K16K07o17J31L36j71J75l1J16n29L84P0L7J18j5j2l87L40k45l3J26
4785H6N2j67j71M50o9l41K92J45n09l3L50k4j98J23P8m86N68p0M6J05k79k4o5
4808a41J72O1l62PM19n70N9N17p8m47M75m4l59K68O9q8j18N6O0K20l72L52j43
4831A3J22k34k85M45j13l1k37J25P8j07j04K67pl28L11k42j08N51j07k57K19K40
4853B11j90q6P2M00q63N89K30o96K43L14k31j83M40R4n96L07P4j12qJ25m9l92
$$ plain form
4694 -338 -102 -7 -281 -291 36 -5 -50 -65 5 -215 -117 148 -143 -171 16 300 -268 -364 200 -321 -56 231 -288
4717 -288 -218 215 -183 -397 -102 477 -61 -381 71 -202 -614 -65 -243 -497 362 34 -191 -132 228 -36 -17
4738 -17 290 139 -97 128 126 92 -97 434 44 40 230 306 -51 -8 49 9 189 173 -307 187 360 117 -159 10
4762 10 102 -130 86 293 -324 -193 143 -28 147 116 232 -297 87 157 194 312 297 285 -102 238 -7 -40 86
4785 86 138 -29 -200 250 181 -160 132 277 -232 -265 85 61 -137 -14 64 -422 146 76 122 227 -52 -76 -141
4808 -141 31 92 -270 -263 156 -414 -355 162 84 -363 112 68 -291 -23 46 -42 -160 -104 -44 176 -196 156 13
4831 13 135 -99 -384 61 -52 -83 -320 -195 -117 -224 -328 -61 -68 -396 -85 -327 -435 116 9 -248 -29 211
4853 211 21 -65 7 407 -456 133 363 -333 -90 224 -7 -190 250 344 -252 55 129 17 9 134 85 -307
4875c07M56n5m3O0J9k82M12Q7l53k9N80l62m67L10J4l0K7L46j70n15N53j92k74
4898b15K4J20j4J67L06m26r6K71j64l70N69pl35l1N96m87K5J90J2k31k7O33m73
4921C7J02M0j99N5L91l18L2J23l39l06K05M58l58l57K27L49n71K89O0l00L27l12
4943c65O06n40K15J25l71K88L6J32l30K54j87M7K87O4m37k5J54n7k60J40K47m14
4965c91L48L70k33j83J27k6k22M49k19j79J74J07l31j87M29k29K05q9Q6m70K31
4986b33K34M6j64K59k63Q6K18k14O7R5p6l54K21K00k42k29M47P1l49L81p7j41
5008a7j00Q0L27l38M15k67kJ04K51q1l20L15K4l21J28n9k74Q4QK40o9k5M0l92
5032b49L47l9k44J52M8j81J88J82k33j82J50J18m68N0M04q7k7L15k74j2J44K1
$$ plain form
4875 -307 149 94 51 111 130 -152 260 347 -6 -35 545 183 -284 26 40 10 37 383 213 -302 251 59 -215
4898 -215 -191 -71 -85 82 388 -38 -134 137 -27 -397 172 165 -170 -201 395 -92 -67 123 135 -96 -123 510 37
4921 37 139 179 -20 35 426 108 140 263 -76 -382 -177 281 -77 -434 -207 142 -429 -140 -80 -380 -53 -365
4943 -365 241 -299 -84 41 -330 -42 -6 126 -204 50 -137 -90 197 261 -176 -201 -47 -104 -364 -224 23 -391
4965 -391 -43 327 94 -89 38 12 -210 239 20 -159 15 122 -209 -396 33 -196 9 -80 6 -464 -233
4986 -233 1 47 -117 142 -121 -35 183 -31 36 131 55 -299 -78 122 -120 -349 98 169 -180 201 124 -17
5008 -17 -117 -37 290 -48 367 100 98 202 453 372 52 367 391 70 198 139 -135 -51 -43 197 128 103 143 -249
5032 -249 98 59 -185 -33 15 -166 22 204 -29 -211 -61 57 -411 -361 43 -44 -71 244 -30 -42 102 123
5054A23K4k29L53l86R0j3K2j75N82n90K33k9l09K96p7K79m00l05N28J02m68J87
5076a62J57k35j31N33j07j57K31j42k62p6P63k77r0Nj23m6M01O0j71k84M78l89
5098b4k37L48k41k2R6J52k6l43J98J23J24k13K2j24L06l02J16L57J12l85J18N6
5120B11k9NO14n11m44J97N76o13j22K22J30l31J17L04l13J39j54j90L62q7J93
5141B76l04M6m2j42j72M87l23j19L20J54l32K99r5j83K41k7l0j66L64Kj63r4J38
5164A35j14j36P9n2L2J10J72l93N1R1j25M8K82pj38J26k40J09j04N2K77p15L81
5187g9j3J47k0k86K76ql3l68K48N6R3j93L57L2k73l9q7J05j34M20k79j87K85K12
5211B32m61K8M41k05L8K58k72k15K46l29n7L03L9Mr9k19k3R4J47j35K4l3K34l80
$$ plain form
5054 123 147 -82 271 -115 -25 -38 -16 -191 391 -199 34 5 -304 -8 -85 194 -206 -511 17 119 -349 -162
5076 -162 -5 -240 -371 162 55 -102 129 -13 -275 -351 412 135 45 50 -73 -119 282 342 171 -113 365 -24
5098 -24 -261 87 -154 -176 -80 72 46 -297 -99 24 148 -65 -43 -167 139 -163 -47 310 422 37 155 211
5120 211 182 187 801 290 -154 43 619 6 -116 106 236 -95 22 326 13 152 -2 -192 170 83 276
5141 276 -28 18 -24 -166 -338 149 -174 -293 27 181 -151 148 53 -130 111 84 54 -112 252 254 91 -3 135
5164 135 21 -115 -36 -88 -56 54 226 -167 -116 -25 -150 -102 180 173 35 161 -79 30 -74 -22 255 -460 -79
5187 -79 -92 55 35 -251 25 17 -16 -384 -136 -80 13 -180 177 209 -64 -103 -190 -85 -219 201 -78 -265 20 232
5211 232 -229 -201 240 35 73 331 59 -156 90 -239 -296 7 46 50 -49 -268 -291 -197 -50 -185 -161 -194 40 -340
5235c40M99J61l88R2K0J74m00Q0K23M4n4l72M63k01M26r5j65NP9j9l82M23k01
5258G2j97L24j74k8j49L33j12l7K02j29l84K22J25j17m7J55l9k3Q5J16l31K72
5280A39j85J37j12K94l09q0J41K10j96j42O53r35L58J82K7l44L58k36k04M91k57
5301a0Np8J46P5l58J82q0Q3M7Q7k16K75j02j50j16O32n49k07L06J51k9k65O91
5324E20o65k32K56K05k15K40m5l80q0L37Pj20K6o8m1L99m41L13k47R3j26o7L44
5347A3J80j72j12K38j75k44K15J24l68K04J62k0l61J00K32j74J44L01k45n8j9
5368c5R4j88M91m67o8L92k3m02J10QL08R7l30q7l9K09J92m75P4L75m97J82J68
5391H9K53m41Q3M65o05N23r7l14K75l16L38k72J25K02k86J13O9j41l15M97l01
$$ plain form
5235 -340 159 320 -68 24 44 218 -182 -102 121 165 111 -261 202 1 427 332 167 172 251 232 -150 273 72
5258 72 -125 199 25 -3 -152 181 69 32 234 105 -279 -57 68 -49 -96 59 20 -3 82 198 -133 139
5280 139 -46 91 -21 273 -36 -116 25 235 39 -103 550 -385 -27 155 182 -162 196 -40 -244 247 -10
5301 -10 -5 -83 63 138 -220 -38 -118 -35 12 99 -117 158 56 -94 -210 422 -127 -334 -28 123 94 -171 520
5324 520 -145 -377 -121 84 -131 109 64 -316 -396 -59 -52 -172 -146 -214 -255 144 -297 16 -231 -138 -264 -331 13
5347 13 193 21 -91 147 -28 -272 -57 67 -301 -97 65 45 -316 -216 16 -158 -14 287 42 -16 -35
5368 -35 59 -129 362 -105 -173 219 196 -206 -96 -88 220 317 -13 -100 -139 70 262 -213 -139 236 -261 -79 89
5391 89 342 -99 -16 449 -156 367 270 -44 231 -85 253 -19 106 308 22 135 204 63 -252 245 -56
5412e6J5J34j78P7k69K75p4q3K41m3N6j00J47l55J77j1J51q9j74K82M2r5n1j10
5436i1J75n6oq8K67j50j22nR2k21J11J96j33j67K78k08J75m40K98j18K56R8m90
5459c49j24L92K95l10m6J16k66J56L83l31P5kN3k24K60m6N3l37L80m63N8J18J14
5482d5j00P3j09j96J93n4Q0q2K36M5j73j59N98l29q3K07k03K27P8j08j75K25J87
5505C33n23K68M6j94l56N66j43r6J48L3j22Q3L38l09j03k12M65p1k42K88J2Jj98
5528A2O7n4K76K0m18j57M60m45L10K03l97K66m7m2j29j08O0M48m02M05l55L0O4
5551F7Rp3j09K43o8j76K66K08l77J99R9n58L15j20N3K46k88M0P7N1l85L49n9q0
5575g1j15k8O6Q6J30k51P1J69L7L9l19j27M82k11K98l76L99k07m2K98l99m2j32
$$ plain form
5412 -56 -41 93 -85 -8 -277 -2 -76 -159 82 39 95 -5 142 -213 -36 -47 104 15 -159 123 165 70 19 -91
5436 -91 84 28 22 -66 201 51 -71 -76 16 -205 -94 102 -31 -198 80 -128 47 -393 -95 -213 43 141 -349
5459 -349 -473 -81 214 -96 -142 -26 -292 -136 247 -84 -9 -11 42 -182 78 32 85 -252 128 -335 -277 -159 -45
5482 -45 -145 -72 -181 -377 -184 -238 -158 -240 -4 41 -132 -291 307 -22 -105 102 -101 126 204 96 -79 146 333
5505 333 -190 78 124 -70 -426 140 -3 -99 49 82 -40 43 381 72 -31 -243 222 151 -91 197 209 210 12
5528 12 79 25 301 321 -97 -254 206 -239 71 274 -123 143 96 54 -75 -183 -123 325 -77 328 -27 3 67
5551 67 76 3 -106 137 69 -107 159 367 -10 189 288 -270 45 -75 -22 224 -64 -24 53 104 -281 68 9 -71
5575 -71 -186 -214 -148 -62 68 -183 -112 57 94 133 -186 -313 169 -42 256 -120 279 72 30 328 -71 -113 -245
5598b45K87om2Or5j89L28n5k52K57j57L1l7L81n80ON38k74m9q8L69j89L17m14
5622a52K31K3M2p1p1J51j30k8K95k6m37K4L30k26j20Q1P7j88J30r9M83n65K02
5645d4m5K6J71J44m46K6K41k52K18kJ90k95Q3K75m53m0M16j03J86l8j12l0M4l95
5669b35k2M37J03k32J68k68L81k36j32L04l69j26P34m58l51M68l6j96j02J94l51
5690c25M02Q2l50L33k82K38r1r0J58m69K80J38Q1j83K69l83j06O0J41J21K13o9
5712A68j22k81m7J01k4K2K92j37O6p5Q8j48j94M65l97j8M39l33oK69j39j69R5
5735h5L37l69n3L30k98k14N07k59l3M62j86k46O3K40k71nK07k01J29J30p3l88
5757b76M19p1p9k13J72J63o4L61o12J0K44r3k65J71M76j83l55L15j09l36N97l43
$$ plain form
5598 -245 42 36 -6 0 -95 -284 44 -11 -263 -6 -163 -132 -169 212 -368 -362 176 -98 -147 -235 134 -55 262 -152
5622 -152 79 102 144 73 2 153 23 -5 290 264 -173 -149 181 -45 -165 -84 -7 -195 -65 -164 319 -246 -44
5645 -44 -89 -63 108 252 -194 -168 73 -179 39 37 227 -68 15 290 -163 -203 213 110 296 258 146 116 160 -235
5669 -235 -257 180 283 51 219 -49 332 96 -36 268 -101 -227 507 49 -302 166 130 -66 -168 26 -325
5690 -325 77 159 -191 142 -140 98 7 -83 75 -394 -114 24 105 -78 191 -192 -298 -238 -97 24 237 168
5712 168 46 -235 -282 -181 -205 -183 109 -28 38 -37 51 -97 -291 174 -223 -241 198 -135 -141 128 -11 -180 -85
5735 -85 252 -117 -170 160 -138 -352 155 -104 -137 325 139 -107 -44 196 -75 -80 127 -74 55 185 112 -276
5757 -276 143 72 -7 -220 -48 115 51 412 -200 -190 54 -39 -304 -133 343 160 -195 120 11 -325 272 -71
5779g1k04K62O3J70l89J93K47k34p8R9q6J66l5L29l17J6r0j05MJ67j68n1K38r9
5803B7N0k29O1k30K17K26o2k51K51k09lN6O7J66r1p0q6j31M66r0m12K78j35M24
5827B90j53J73j73l16L59k13j15j46M41k30o3J62p0j76K75o9n95N23%j98K63k51
5849b82K84R2r7J5k82K83nJ30p9N2l88o2K77l9J2PM8r3P9K7K03j06J86m02L46
5874B06J1k10k4Q5J21p1j61J69k1J28m82L94j01j40M3k20K17j37M95l72L35m19
5896a54JK94K22j66l10L4o4N19o01O07k8o88L77M65l37J30k84j49NK59l09R8L06
5919B27m26L66j38J83k72j45M68n8k35J36O3l74J58M29j65l75j07K54p3L5J55
5940A06j74K6K85m32J10r3J47J73%l10k11K14K96j10j37J10j10k01K74J94j24
$$ plain form
5779 -71 -275 -13 50 220 -169 24 271 37 -41 58 -28 138 103 432 115 131 41 -64 -60 107 -61 -112 126 27
5803 27 77 -152 -91 -321 -104 122 60 -191 60 -149 -152 -96 -29 137 46 -24 -110 -241 225 135 -277 1 -134 290
5827 290 137 310 137 -179 180 -33 -148 -294 147 -83 -146 16 -54 -230 45 -24 -619 -96 -96 -294 -31 -282
5849 -282 2 94 -3 12 -270 13 8 138 59 111 -277 -339 -62 -101 -89 -82 -34 -127 -48 -21 182 76 262 -140 206
5874 206 217 7 -17 68 189 118 -43 126 105 233 -249 145 44 -96 -53 -273 -56 -193 302 -70 265 -154
5896 -154 -153 141 363 197 -113 -79 -143 376 -225 382 354 -334 43 508 171 301 17 -132 -127 132 -177 -79 227
5919 227 -199 167 29 212 -60 -205 263 205 -30 106 169 -205 -47 382 217 -158 -265 -11 -84 -49 106
5940 106 -68 -42 243 -189 -79 -172 -25 148 148 -162 -373 -159 137 27 -110 0 -110 -311 -37 157 33
5961C3k24O9P6j62J92Q5l04L76k89J3K23k20K99l41J98R6k09J09o8m7L04l25J87
5984G1o6J42j95J20L4J18m44J69o6L4r8J83j57J74RL2j28J96l9J5J38j89k14O6
6008i5j34K35Q9n05N48l71K48j9R8j38O2J75l4R5k9j40O4p1k92L17N9k42P5N9
6032E4rk45L39M4J09m22R4J69q1o0r2K11j04J29j24J25j91J12m91L58M45k29k37
6055i6K0K99k00k81K48R3k65M30j35J05k23j9j52K38j08R3k15L34l57K70j81J79
6077G7l48L51POj83K03o8j81J37pl15L14L15k97j86K24J53J7m10n5J80m8K58k92
6101a48K60j42J16l0K68m66rj90K68N6j82K56L3k60P3JL00j85Nq1r2m2L78l66
6125a79R5J10j25K07j58J33n1k5J0k36M52m4j62k25N24n80J0L72j89j49J17J82
$$ plain form
5961 33 -191 -122 -46 -208 -16 69 -235 141 -148 -135 88 -132 167 -174 24 120 -89 20 -48 -95 209 -116 71
5984 71 5 147 -48 72 106 224 -220 -51 -117 -83 -181 2 -155 19 28 60 -68 128 89 104 242 53 -161 -95
6008 -95 -229 6 95 -410 138 -233 15 -4 94 -44 18 193 159 254 225 85 149 78 -214 103 162 -80 -5 54
6032 54 45 -200 139 183 292 -130 -36 133 52 -8 -100 111 7 136 12 137 -54 58 -433 -75 370 141 -96
6055 -96 -76 223 23 -258 -10 83 -182 248 113 218 -5 -24 -176 62 -46 47 -168 166 -191 79 -102 77
6077 77 -271 80 87 93 -90 113 45 -136 1 -6 -321 -7 308 11 -175 49 202 219 -191 -246 -66 -114 144 -148
6101 -148 112 -30 86 56 324 -142 -151 -341 -73 -17 -199 57 90 -170 -97 -96 204 19 24 -57 -149 -191 187 -179
6125 -179 -84 26 -99 108 -50 83 32 7 17 -219 233 189 27 -198 326 -254 -244 128 -61 -210 -93 89
6147H9M5l98PJ69J12j28J0o6M6L65l62k90N06j59r1N68n95M42j7l59M5K24O3p4
6171A52j42Q2K67j53M2J00j52k46K46o9l44R0J64j20j13R9K63j74L1q6K30k70
6193a03K66k89J42j18J76l21K31j26Qm6J91K15J16n22L41o0P6n27P2M67m45J10
6215a46J28l1j00P9O9L05j85Pj60J04k93K43J68m71M24J85k65q0P4J18k42J07
6237C8Q9k91J32Q6j22j16N1j55K07J34J75k66j35L35j1j66j37L02o9k8o4j20J03
6260b8J73j34R6j6r1j25J79P5j84J02L55l19m39O69k84j20Q7J52j43j92q6K36
6282c7J97J6k82Q3J01L08m96Mj28K17J74j05J25K9j06J8k13P2K40r4k74r1l3K17
6306e8L6r7m2Q2K64m47M32q1j16J14l33K1L73l09K27l80K05J88K6k99K90n0j19
$$ plain form
6147 89 134 -264 -257 -88 24 -104 -94 -160 -114 251 -111 -401 105 -54 -145 423 -172 270 253 -106 -61 163 226 152
6171 152 10 92 359 206 248 348 196 -50 196 127 -217 -127 37 -83 -196 -97 166 -8 23 -63 167 -103
6193 -103 163 -126 16 -102 74 -247 -16 -142 -134 -180 11 226 342 -180 161 101 177 -350 -278 189 -256 -146
6215 -146 -18 -49 -149 -70 -1 304 119 126 -34 70 -223 20 188 -283 141 326 61 -19 55 173 -69 38
6237 38 127 -164 -32 54 -68 -184 -133 -288 -81 53 228 -38 -173 162 151 -15 -152 150 81 53 -11 -131 -28
6260 -28 145 11 107 91 0 -125 54 129 -55 47 402 83 -356 313 29 -91 -4 148 5 -187 -273 -37
6282 -37 160 176 -106 -23 78 386 -110 -106 -234 -17 157 52 177 206 100 118 -95 -23 217 123 -151 -242 -275 -58
6306 -58 -22 -119 -161 -79 185 -262 170 89 -27 87 -246 -225 148 -161 66 -314 -109 79 105 -194 96 46 -73
6329g3Q6J35k15n4K43M2l10K25Q7j90l31K28N2J08K8k97J01J92jj19K54k08j97
6352b14J67J86k70P6J76j79J90k08J88l9k20N05n88J91j18J89j81K21K3J95m01
6373a11K6J63k82L06jj8k49J75q9J35R1l42n5K43M7j35m4J78N15l04m65N26k80
6396C0N0J41p3Q9m15K06N6J1j20k09K78K8pK6J27k11N9O9k36K17J86m95j09L99
6420I7r0J05k11L75o5l26K21k19J54K65k51O0q8p2m48M21J77O5m27J10K43L38
6442D34n34k5J48j07L34j42j16j47K51l34J08J01p5n0J73j76j6k78M94j54K7J15
6464C1L4k26N5J09l12N97m37p8J59Oj32K69r1k72k62N69L76l14k8P3k51j00L48
6487A23P9k93p1J30M7j9k70L49j92J47k35L21j93k07L90j42n3l39N07l02K67j08
$$ plain form
6329 -73 13 148 -67 -121 122 164 -146 79 166 -24 -355 -127 -75 33 61 -236 -135 57 56 -63 191 -17 -214
6352 -214 -47 139 -131 -55 121 -58 132 -76 112 73 -147 358 -230 -39 -157 32 -149 72 95 290 -111
6373 -111 -85 78 -204 102 101 83 -166 9 -80 55 146 -196 -251 -8 39 -96 -140 38 553 249 -216 310 30
6396 30 80 221 148 237 -178 28 84 95 -25 -234 44 72 65 91 218 7 66 135 -101 116 302 -193 -302 97
6420 97 7 112 -99 276 211 -115 106 -113 41 306 55 115 27 -45 -493 -72 105 170 -257 -147 96 434
6442 434 -100 -125 23 -84 250 108 -8 -155 96 -238 -130 -29 -104 -154 19 -157 -173 -451 43 -111 -84 31
6464 31 65 -161 -106 3 -309 288 -149 -227 -68 -62 -194 75 -16 -288 -550 19 395 81 53 126 -125 -225 123
6487 123 202 -91 -162 -32 15 -4 -274 75 -117 30 -205 116 -77 -284 106 -36 -89 -428 79 -223 44 -64
6509f4L0L24k95Q1M6N3j62p1L41k01j84j30J48J16Q7k09r1nK64l46K67O0J76l07
6533g2L34m90L83jj81J16n9q5M1J92j54M4K17k49J28j61o7M44j81l18J14l5J08
6556F8m6k25n4J55L50K3k43L46m77j12O3M33l85j02M09m41R2L94r3n08N18j48
6578A7K20j98K57n20m1K96j1J69m31L10K5l31K81Lj03J43m1qK45k84K0j01k1L85
6602B81l10n2K56j33J18j24j37K68j66lk7%j17K21j7k2j10m92N96o2k93N70j69
6625G6Q0m66L25k6k99J58J88k0k56m1M00n7n05M06J39J30l80L72M6j54k19k02
6647c05J16K44k38J40M1K58k7j09k2k61J72P3k61M16k63r4Q5j68J99J51k2k49
6669a24K49k9M04p59M26j03r7J80j81J69j60J36k45j17O35j3n83K07R2k12M7Q4
$$ plain form
6509 -64 -34 290 -5 76 122 175 13 -58 283 82 -102 -232 -84 32 119 -90 -181 -186 78 -268 -1 59 235 -72
6533 -72 262 -228 155 154 -27 89 30 -55 -14 178 24 68 285 36 164 3 -64 380 199 -119 -5 -40 68
6556 68 22 -203 -257 -102 248 271 28 374 -103 -215 -152 281 -104 -206 203 -238 -146 248 155 -353 165 17
6578 17 237 39 296 -224 -265 31 20 189 -242 68 93 -238 43 46 -57 86 45 37 282 -2 18 -83 -104 281
6602 281 -29 -81 175 42 160 36 -101 167 1 -2 -29 -29 -146 75 58 36 -74 -566 30 -32 -325 245 76
6625 76 156 -310 15 -11 -310 -152 36 16 -240 -281 119 62 -443 -37 102 232 -148 224 270 116 -103 -305
6647 -305 -189 55 -183 -43 -2 256 229 120 98 -163 9 82 -179 237 -26 -120 -35 -203 -4 147 125 -124
6669 -124 125 96 500 -259 167 64 -33 147 -34 135 -25 111 -134 -251 384 371 -212 -5 87 -125 -78 6
6691Fl01L48J95k57o1L3O3P8QK9k02o7K54k89L0O0J94K90o22J21j28N8J80Q6J02
6716B08l37L25m04K04K25l28l0j20J43J56o2j72P6o2J98J29k86J95J43j25j00
6737b4M70n46J73l15J30O2K80k26j48j59J86K31j13j40j43L01j31L62m3m03JM79
6759B84n23J61J21n8R5r4L58o45L81P4k54J34N2j32l12M74j99J74l18L3K57K8
6781I1k26j7K37J24m25J32O3n8J66l3j33J09j42L12o6k85M32k59k62K95nj48M68
6804C70j28k72KJ25m5j79l2N16n93M70k37p7P3l5L24o6j61O1j58o8K40k00p5O1
6828h4k28N18m27L47o8j76M9K1K13j06l6L57j89j48l48L37Lm6p7J95k7j74Q2P3
6852F1Ol34L32j10j14n8j25J34J09K53j06l59L31J4K61k79K02j67n2K04K20q34
$$ plain form
6691 6 -295 53 248 -9 -70 -37 26 104 112 141 -61 -128 126 -163 -133 -73 121 411 -211 -90 -218 -160 20 106 208
6716 208 -129 196 -208 -4 221 -107 -137 -257 -114 42 -20 -192 -116 -178 20 149 -137 58 201 76 -24
6737 -24 446 -100 73 -242 -112 -50 230 4 -144 -303 -117 114 1 -139 -282 19 -112 250 207 -196 -195 284
6759 284 -239 -78 43 -15 80 -14 344 -301 80 154 -100 34 86 -46 -358 116 -83 91 -227 -194 63 91
6781 91 -135 -152 85 209 -216 -84 -21 -79 87 54 -79 30 -112 200 134 -151 281 22 -240 55 50 -98 370
6804 370 242 -30 -28 97 52 -127 -159 357 -236 234 -3 -80 -7 -42 282 216 55 116 -42 -110 130 -70 -145 -84
6828 -84 -312 206 -221 126 58 -118 -69 -48 165 59 23 380 191 43 -305 32 35 -11 -88 107 80 -94 -12 61
6852 61 67 -267 65 -45 -159 -217 -342 -208 -99 154 48 -311 20 34 295 16 218 51 -1 203 423 -411
6874d11L26L17k5p4m3p2J99j46o5P6k77J03Np3J40r6J23J06m01J27J86j47J01
6897b1nJ96j84J38j81O0K40k55J26o7n6K25n5m63J80j68K69J14k09Q1k30K92j74
6920a47L21k32J29l40L09R5k90J29k26M96j82l53M29j93j94K43Km7K99p4Jk1k14
6943f0j26J93m09L78J29j64J4M0r9J96j00j02M8j73J4J71J61k44M35l86M41l04
6965E3k27J20k6k28L07Kr2J81N1kJ7j3J98n68P9o9L28J5j00n0J98K30n66L22k89
6990a29P0J90j77L57r1k96k02K89nJ72k19J33R3l47J00J72n11M77J00l93K06J08
7012I7l01K09j63J18J61j10J24j33k05M33k49l1K91l18kJ69j61N7k03K57N3k54
7034a61L49m28J51J72j66k37M98N7l1k37P5R3k65n4N23n02p3O04l67j34L00j00
$$ plain form
6874 -411 -85 232 207 133 90 18 217 71 6 82 -195 -92 -87 -160 -20 -116 7 113 -288 -161 25 -122 -21
6897 -21 -26 170 -14 124 -57 3 243 -12 114 47 -9 216 161 -302 -122 -290 -21 93 -116 -35 -265 27 -147
6920 -147 174 -58 71 -269 40 135 -155 -26 -252 244 62 -291 138 -55 -249 -6 -4 -51 248 174 175 154 -60
6943 -60 -186 7 -402 -24 105 -59 -45 -5 -104 92 -8 -110 -62 -235 -221 -50 111 -133 302 -84 357 53
6965 53 -174 -54 -80 -308 -1 1 -91 90 141 139 156 143 341 -227 -148 -217 111 126 26 -24 174 404 -162 160 -129
6990 -129 -59 131 -46 311 220 -76 -278 11 6 178 -41 92 185 -162 -62 110 -401 76 176 -217 -11 97
7012 97 -204 5 -158 -40 121 11 135 2 -203 230 -19 -50 241 -77 -79 90 -71 -14 -217 40 93 -161
7034 -161 188 -240 -89 83 -83 -320 178 235 204 -33 42 135 -130 -184 339 -163 -236 368 1 -133 167 67
7056F7P5n2j61j20lL23J02k85r8N87n73K37J66j96p6r3J87j1O7R2j62n2r3r9M65
7081B94k60k70K05p1J97J41j89l03K71J93k05J3J6o0L14j90l63M40P5o50L27P4
7103am9J15k24j26L9K47L27l10j25J13J60k82J8K3K00k2L3J23r0l11j00J76N3
7126a3j20J29j43j43M72j56jj67R6k02L67n23L60j08K10M2J96j10k63J89l47K67
7148C2O8j60M9j04o6J12K15j15l22M37k12K60j79J86k65K93l2j73k4J20j9J54
7170B55o22M20p4J55qn20L45J44k73L02j28o5n0J40j36r8M66j48j6O1L0k29R6
7193D7j44L80k67K17j49OK33l78M9o9%m4O6J50q6j16Q2k59J55J34p0L65k14K5
7217A13p1n8L5l26L97j44r2l03L91J45j59K41l41K36j83J58R9k33m2L33O3l24
$$ plain form
7056 67 142 90 -71 -191 -194 129 231 -54 -152 435 -138 99 265 69 -7 -100 87 76 143 235 73 21 -72 -171 294
7081 294 34 -236 -31 -102 95 236 47 -256 15 208 3 16 32 -28 286 96 -267 173 248 -402 -75 -1
7103 -1 -50 65 -159 -285 -246 1 328 18 -107 6 166 -116 -98 -75 125 103 136 259 169 -142 -242 -66 -13
7126 -13 -133 -4 -147 -290 182 26 25 -142 -46 -248 119 -404 -44 -152 58 100 296 186 -77 112 -235 32
7148 32 100 -60 -11 -115 -181 -69 146 31 -291 146 -66 194 15 201 -64 229 197 24 0 120 101 255
7170 255 -367 53 -21 134 126 -394 -49 95 -178 124 -4 -69 -119 21 -115 -213 253 105 89 150 180 -49 47
7193 47 -97 283 16 233 84 90 323 -55 -6 -75 -75 -119 -53 97 11 -105 -23 -282 -127 7 -63 302 88 113
7217 113 42 -16 19 -307 90 -54 -146 -449 -58 87 -72 169 -172 64 -119 39 138 -95 -137 196 259 -65
7239f5J53J69n53M45k23q7L44k80K01j13K2P7k61J69j61J68K7P3k77K35m5n6J25
7262H7j70J38l33L17k15j1K9L51l04N17m83k8L17p5m16J57J74j39N4j0K40j49
7284D8pj22J57m8N9k66oJ98q0K10l73L56o9j46L8J28L8j45J08J23l98K14j22J14
7308IJ82q5k64J25o9L23n42R6K81j28L71m85j2J79Q4J82k30j28K93Lj47n9J13
7331I2j67Q0N0l02N31l56o3J31J10k18L74k1j55J68j71j2m68O22j82J94m70O0
7353a73J78J7m0k6k94L73k01J57K66k2J41n33J96j51J24L1L4l62J30J41j6P2J6
7376E8j0j48Q9m5K54l44O6p7j26L93j66Q8J45j15m6j97K17M0j44l11K23K29j64
7399i1L82l05m0mP2q5K05j52R8p7J91l05J95j77Q4j0K0M44l70o8J19j88L55n12
$$ plain form
7239 -65 88 257 -296 149 -74 -161 183 -97 104 -9 13 90 -171 -2 -163 5 32 105 -172 63 18 -38 87
7262 87 -83 55 -278 39 -176 -187 -158 193 -111 406 -77 -105 212 137 -279 -122 52 -87 -33 -43 197 48
7284 48 41 -81 76 28 87 -179 -185 13 -67 143 -230 126 57 -89 -51 77 115 -30 78 201 -197 17 -105 9
7308 9 191 106 -158 -33 -102 221 -321 -225 56 -72 299 -186 -198 -19 65 247 17 -111 182 185 38 -21 92
7331 92 -75 5 55 -247 284 -72 -135 -4 106 -112 262 241 86 254 83 71 -397 225 43 237 -233 -173
7353 -173 5 22 -18 -44 -338 35 -166 -9 257 235 376 -157 39 -112 12 43 77 -285 -155 -14 -30 42 58
7376 58 48 -100 -11 -56 198 -146 -80 -157 -283 110 -56 32 177 62 16 -181 36 76 -68 -379 -156 73 -91
7399 -91 291 -14 -54 -58 14 -71 134 -18 80 3 194 -111 84 -93 -9 -19 1 445 75 7 126 -62 293 -219
7423b19K68k04L59k62QO4N3J6k47QR2j1j03K76j03L3M04o75L23k01R5l46M67k50
7447a55R1J22j54q4M36k27j59R2M3k2K52k88J72k18M4r4J91k34K70ml1j74Q4l06
7471c53M7M78j2k19K19j45j6k40L03RJ49k78K93j12p0L11l99l56L24J44k11J35
7493AK08j16k94J33J63j19j57L7J16k48J68N5o5j2K12J87j09j76l39J54J23J27
7515D9j14rJ79k92J99P5j83oL39m00J05q1M6J1K35j79j82J74J90o8K8r0l4J44
7539A36j19LO5J35m19M71j29j83J4Q7R8j87j27M2J42o4q7M08m67J93R2k43J82
7562D3P5k34J25j17Q5K42R3m54l4L41l38J4L21k80Q4J00Q7j00P3j64R3K1j47M17
7586C46j05n69J59K52j69J0J74r2P0j28J92j62J17J87k74p8q2K61o2nk36O9J05
$$ plain form
7423 -219 49 -155 204 -58 -50 14 67 83 -164 -156 -64 -75 -178 98 -5 28 432 -243 80 -121 -26 -372 95 -155
7447 -155 -64 58 -96 -180 256 29 -130 -38 5 -17 235 -53 119 -99 -55 -149 42 -192 78 74 43 -131 -47 -353
7471 -353 -306 172 160 -59 160 15 -1 -241 62 71 220 -58 235 123 53 364 -35 -391 -67 77 -134 1
7493 1 209 93 -201 -68 95 -24 -181 -144 -28 -276 -108 -53 -118 -130 82 269 160 -16 -355 -201 -78 49
7515 49 -65 -74 105 -187 12 87 -96 -102 237 -163 -58 -139 -93 -82 153 -26 -208 -34 156 88 116 26 -8 136
7539 136 17 20 85 220 -199 272 143 -40 -26 61 159 -28 -155 -113 29 -35 -122 286 -181 12 104 -139 43
7562 43 118 -116 9 -108 -23 219 312 -142 -176 165 -173 -159 162 -118 -34 66 153 53 126 -38 55 76 -71 346
7586 346 241 -328 -169 83 -86 -76 98 6 76 -52 140 -22 95 282 8 -70 -152 109 47 42 -194 -125 -20
7609b0J17j10J86m2j14o7K95J25m50K59k40J23j08P1k48K20o0k11K67J7rj42K76
7632A35P5m6j27L5j38M38m53K41j88l1N5k77K83l5j2J10K6j17P8k78J88J78K7
7655A67J3p7M2n9J16n7m14K57l3R9q4L8P8k23J47K89k57j60L08K9k55j50J27J80
7679A21k42N0J34Q1j79M1k69K13k34K25J06j27l40M84Q9j65J13J20l01K77o5k04
7701g2L95m88J01r9M03pM4K2m06O9J81l26K93k65L41k66J63k84L20o1n4R5j40
7724d1r2K44m2j83K07l3P9J9j12K36j97k58J71j62M14k88K02q5k07J95j21J58
7746A04j02j43P9j05o4L00K9l7k0k92J39M33o02J93N9j07K22m4j95L44j44r0O9
7769B6J7m7j94K46k06K55k50nJ59M0m4j14j13K87k43J61o3l3M1O3k36K84j14Q4
$$ plain form
7609 -20 97 -13 173 131 17 -50 245 370 -80 179 -61 62 -46 25 -223 -3 -63 -274 -7 10 1 -141 135
7632 135 210 164 37 72 -66 372 -81 160 -28 -59 -4 -281 2 -33 -45 65 91 -26 52 -226 -38 140 167
7655 167 180 103 145 86 202 145 -269 -12 -45 54 -30 8 86 -137 10 299 42 -118 190 219 -36 -186 -59 121
7679 121 -121 -71 63 144 -35 6 -263 -50 -284 -59 47 -80 -420 64 153 -12 101 221 -80 197 132 -72
7701 -72 323 -165 -64 -163 240 233 277 299 -107 -38 143 -183 110 -155 186 -80 83 -201 119 58 4 99 -41
7724 -41 -133 111 69 -114 93 60 139 158 46 282 85 -173 -2 -164 250 -38 164 79 -128 67 -54 104
7746 104 2 -141 -62 -167 -231 69 98 61 41 -251 -112 321 -281 -88 -29 -136 86 42 -153 191 47 -43 26
7769 26 43 -4 -198 48 -158 97 -153 -158 1 41 -3 -117 -230 57 -186 -25 -88 -121 -80 -17 -253 31 -83 1
7793AJj50L24k95L69l66K21K3J01n0j4J03k03n6K61m4r5O3j67J13j33K44k63J80
7817A68r1k63N95m71%J4J03m13M08q5M94k79k6j89L7jK05k96n0L82k88l5P1j48
7841a58m1M6QJ64p0L89l30l2K17l29L90k03m87N63j66M60m89L2O8q2J3l9K26m9
7865A01j86L5j18k2l1J29M06k95J08J6j01j31J49J10j95K30l45n0P4K45m37R6
7887b12N2j76L35l8K0j19j28J45K17O1k59J14J89m86M61k66P6j80N2K51r4q9J6
7910e8J13J83m35K21j11K12p7K70n09J95K5K26m21J98Q5j56j4K27l33L84L7k13
7932D9J57k88J52J15j27J10m07k97N76j37L68k75J6J0J86l84J19J1k37N30j24
7953A23l46M08j84j04R8p2J21K65k82l7k15J05j8K39JJ82k47k2K97l16q5L3PL60
$$ plain form
7793 1 2 -148 176 -119 250 -116 105 128 229 179 165 268 65 9 270 226 131 194 27 140 7 251 -12 168
7817 168 77 -186 409 -62 -62 -48 55 -358 50 -35 459 180 154 -35 2 1 206 -90 -140 242 -46 -81 -10 -158
7841 -158 -199 -153 -145 19 -51 338 8 -24 193 -136 254 51 -436 127 -39 421 -68 -36 32 -50 -37 -76 150 101
7865 101 -85 -50 -168 -190 -221 -92 314 19 127 143 42 -89 60 170 -25 205 -140 -190 -116 129 -308 -212
7887 -212 -160 -336 -1 -39 -19 -138 -266 -121 96 157 -102 12 201 -285 176 -90 -14 -194 -142 109 15 -74 -58
7910 -58 55 238 -197 24 -87 125 48 318 -191 4 29 255 -166 32 117 -39 -53 174 -159 225 262 49
7932 49 206 -82 70 185 58 168 -239 -536 40 -97 271 -4 12 22 208 -176 -57 -46 -283 247 123
7953 123 -223 185 1 -103 -5 -77 44 309 27 -10 -225 -120 -138 101 102 284 37 15 312 -4 -89 -56 -49 311
7977C11m67M3L5j88K96j82J99Jm3J11J63k08j22L1J86n52N35l08J44K43J20o79
7999c31Q4O87m78J44N0R8n40N3J81J94k34L69k71j61l5l2K45J7K15m92L83m30
8021b84M52O4l69L15j01l8j57M32o69J33M91m8k7R5k47j0K53j90j06M0q9J65l1
8044G4k04K06N2k64R8Lk6K11j91L83k92l20K92J15k3j21M1k07p6L92k05j33K55
8067F0m2N7K7m48M08k5K48k44%pk29N28k26J91l21j03L66l53M3K71p8k87j78J43
8091a99J01L91k63J91j25j08r8M5M01m82J53K0J55J20j50J9p5j85J83k99K49k21
8113a77M4J27o2k3K15m54K62J66k08PJ99j56K79k51K23l99mK95k48K65k12J17
8135EL51m99l9L33k33j71L08k9k62M08n12L86j57K11O9k39K52k18P3j0r1j05J05
$$ plain form
7977 311 -156 -113 -78 -266 30 -152 47 48 5 116 279 71 -51 -20 166 -386 149 -159 -15 228 348 -331
7999 -331 -247 440 -38 106 156 254 -286 -233 -52 142 -92 277 6 -155 -190 -222 23 40 255 -237 146 -284
8021 -284 168 232 -137 178 77 39 -118 314 -355 -222 269 221 194 289 42 32 285 95 -11 29 -60 105 74
8044 74 -130 76 128 -136 -38 -35 -61 150 -41 342 50 -270 22 137 114 -7 34 -173 -249 143 -62 -195 60
8067 60 18 75 102 -346 62 37 285 41 41 34 -195 333 107 298 -23 -126 240 -113 -70 201 123 -164 -342 -199
8091 -199 -98 293 30 221 96 -12 -110 -65 336 -146 7 27 182 302 152 171 96 -89 94 -205 44 -177
8113 -177 -133 -6 -68 -91 124 -330 -68 98 -110 -103 96 -60 219 -32 191 -208 -212 83 -165 100 -112 5
8135 5 356 -143 -182 151 -82 -253 55 26 -236 172 -340 46 -111 100 169 -70 182 -36 37 27 -64 -169 -64
8158f4j62r4J55k4L09j23J85l24M23j61j33l16M57k86J19J8m55K65M86m92J24
8179i3K10j7Ll3M0rj65K96K8r2j76q1
$$ plain form
8158 -64 -226 -320 -165 -189 120 -3 182 -142 281 120 -13 -329 128 -158 -39 -21 -476 -211 275 -217 -93
8179 -93 117 100 103 70 110 101 -64 232 260 168 -8 -89
8191h9
$$ Imaginary data points
##PAGE= N=2
##DATA TABLE= (X++(I..I)), XYDATA
0@%%%%%%%%Lj1J6j6J6j7K5l2L8m6N4o3P3q7J01j16J33j53J74j97K24k53K85l21
32a70L60m03M50n01N58o20O89p64Q46r37J035j147J272j409J566j743J946k180
50a152K454k784L185l687M334n208O461q415J1920k0146P4895M6209j25859J560
64a6233O3790Q508n5730N467K9166r813m1497J180L0892J2134l2229j6700J5657
77e408Q496j2039J1551Q266k7757r965M4238J0478m5547o627M4419K946l4400
90a1349L970K7731p057k4325K836K2565P041k4330k3506J6172K6227j0695k4043
103a8763J123L150n505R036Q899j8420j2497J3396K66j0386J7063J3448k7143
116b6333k0831K4495K5594o606j6321n287O335J1386J599l795N361M25j3393K440
$$ plain form
0 0 0 0 0 0 0 0 0 0 3 -8 8 -8 8 -9 16 -16 22 -24 30 -33 40 -47 54 -62 71 -82 92 -105 119 -134 151 -170
32 -170 190 -213 237 -264 294 -326 363 -401 445 -492 543 -604 668 -741 825 -918 1028 -1152
50 -1152 1302 -1482 1703 -1984 2350 -2858 3603 -4812 7108 -13038 61857 108066 -17793 -16233
64 -16233 47557 56065 335 5802 34968 25155 -16342 -15162 15730 27864 -4365 -21065 -5408
77 -5408 3088 -8951 2600 10866 -16891 -26856 17382 27860 -17687 -24314 20105 23051 -11349
90 -11349 -7379 20352 13295 -11030 -8194 14371 21412 -2918 -26424 -10252 15975 5280 -18763
103 -18763 -17640 -14490 -19995 -10959 -2060 -20480 -32977 -19581 -19315 -29701 -12638 810 -26333
116 -26333 -47164 -22669 2925 -3681 -20002 -25289 -18954 -7568 -5969 -9764 -4403 -3978 -17371 -14931
130a4931K0436k721j5096O753N358j2918O570K0200j4756k5076J7952K6323j4482
143C612k2442P936J5970l27j0657j512J2425R23k1373o22L2747M974l7633p372
157b3351L1718M417j9966N225R214j5892o854J9302Q226j3621q890L327N354J295
171d96j863L328M485j3194j2134K1896K1274k4083k2752K3535J7580k1721p630
184a1775K1802O79k0533J108J6637J586j1762p084O349J0273l911j1931L729Q949
198D116r285m435J6086n71k1059L186K0761m012j3364P567M887j0088P79J3221
212G789R40p358m124o19Q268Q680p037r729O539L863o464M351P927q973p986P804
228C871K727n388M887J377j1826M13J3190k901r747M825M547o579J390O114l794
$$ plain form
130 -14931 5505 2784 -12312 -5559 -201 -13119 -6549 13651 -1105 -26181 -8229 18094 3612
143 3612 -18830 -10894 5076 4749 -5908 -7420 5005 5928 -15445 -16067 16680 21654 -15979 -23351
157 -23351 8367 12784 -7182 -1957 7257 -8635 -15489 3813 12039 -1582 -10472 -7145 -1791 -496
171 -496 -2359 969 5454 -7740 -19874 2022 23296 -787 -23539 -4 17576 -4145 -11775
184 -11775 10027 10706 -9827 -8719 7918 9504 -2258 -9342 -2993 7280 3369 -8562 -4833 4116
198 4116 -5169 -9604 6482 5911 -15148 -11962 8799 4787 -8577 -1010 3877 -6211 -5432 7789
212 7789 8729 1371 -2753 -3372 4896 13576 6539 -3190 3349 7212 748 5099 13026 4053 -3933 3871
228 3871 6598 1210 6097 7474 -4352 -3939 9251 6350 -3397 1428 5975 -604 786 6900 3106
243C106l110L283K23M52L091n033m824Q643K944j0107J716P919r127q008J3741
258D909N291j6134m037J0847r93p181L310L036n067k995q3L449O335m756j0793
273a4862O666J1208r026p208J3895K750j5786J774J5687l767j1044N167O639m490
287b397l015J715J363J367k224n085M995N602j0035n128J3197K239j5085J308
301a1183J2894m780q867Q323M968p617j187N389J349J187j26m244K506O850l775
316A687m348J0002K186j1792J544J2172m026p513O019L513p022K59M491j910m71
331D791J696m653q68O963l183o349O505L833j0089r73J0255k053o407L979K795
346F242n316R09M018k111P23K105n094r87Q224j397q356N432N498r124k562R672
$$ plain form
243 3106 -4 3279 3502 3954 7045 2012 -2812 5831 8775 -1332 384 8303 -824 -8832 4909
258 4909 10200 -5934 -9971 876 -117 -7298 -3988 -952 -6019 -9014 -9097 -5648 687 -4069 -14862
273 -14862 -8196 3012 -6014 -13222 673 3423 -12363 -10589 5098 1331 -9713 -4546 2093 -2397
287 -2397 -5412 -3697 -2334 -967 -3191 -8276 -3281 2321 -7714 -12842 355 2594 -12491 -11183
301 -11183 1711 -3069 -11936 -3613 1355 -6262 -7449 -2060 -711 476 350 -3894 -1388 5462 1687
316 1687 -2661 7341 9527 -2265 -721 11451 7425 -88 5931 9444 2422 2681 7172 5262 4791
331 4791 6487 1834 966 7929 4746 -1603 4902 8735 -1354 -2327 7928 5875 -532 3447 6242
346 6242 926 1835 5853 3742 4465 6570 1476 489 8713 7316 -1040 4392 9890 766 -1796 7876
362G876l44q251K459K722l922J60J767k595Q58J859n924j740P740j325q417M075
378c002O672q710m108R728J156p842J274L285l093L45L023k024M34J873m656j227
394f872Q461J0r484L429P433p071m080R057J302q485L47M820k268p21J789j947
410d280j82K949m242j981Q192J8r130K615Q358o214m830Q890K282p651M40N470
426G04k022l72K625j486r54L068k564k235P224J013q470J398Q071m365n147O958
442C446K071p119J70N021k072k14J976k364n69L821j856l721O419K339p976J27
458e01Q034k761n663N724L285o553q33M420j205m09K393m235j616N007j566m799
474a278N253K852r114j163R064p84p462K904L937m495j439M117k94j203R75l240
$$ plain form
362 7876 7532 -719 1740 4462 540 700 2467 -128 730 2589 -3335 -5075 2665 1340 -7077 -3002
378 -3002 3670 -5040 -9148 580 1736 -6106 -4832 -1547 -4640 -4295 -1272 -3296 -2862 -989 -5645 -6872
394 -6872 1589 1599 -7885 -4456 2977 -4094 -8174 883 2185 -6300 -5953 -1133 -3401 -4122 -2333 -4280
410 -4280 -4462 -1513 -5755 -7736 456 474 -8656 -6041 2317 -3897 -8727 163 2445 -5206 -4766 704
426 704 -1318 -1690 935 -551 -1505 1563 -1001 -3236 3988 5001 -3469 -2071 6000 1635 -3512 3446
442 3446 5517 -1602 -1432 3589 1517 1303 3279 915 346 4167 2311 -1410 5009 7348 -628 -501
458 -501 7533 4772 -891 4833 8118 1565 732 5152 3947 3538 5931 1696 80 5087 3521 -1278
474 -1278 3975 6827 -2287 -3450 5614 4830 -2632 272 4209 -286 -1725 2392 2098 895 1870 -1370
490a370N99N656l178o665O056M990q768k893R205j026q798L345N914n062m432
505f427L172J863r46l50l092Q8M274k476l340O431K654j0025j626J2560J90r712
521f762K743O555n972k309P445J822n227k020J252K235L264l075m900M150K331
536A532o701Q10Q593m327q991N894P295o576k390O121n09m127M150L524l392l44
552E62K696N47K270J305m562j90O768j074m037M395P34p857J455Q171l267n948
568A968K137l64m294M432M421p830n635N634J575l313J976J042l833r95K227J881
584A029L297k76p261J114R772p86p316M464M709p387r32R664j330j0550K341P178
600G730m290m289K347K30m605j987J766L484k644r966j338J2826J398j4462o72
$$ plain form
490 -1370 -771 4885 1707 -4958 1098 6088 -2680 -5573 3632 2606 -6192 -2847 3067 -1995 -6427
505 -6427 -3255 -1392 -2338 -2688 -5780 -5692 -1418 -3894 -7234 -803 1851 -8174 -9800 2760 2950 -6762
521 -6762 -4019 2536 -3436 -5745 1700 3522 -1705 -3725 -2473 -238 3026 -49 -4949 -799 1532
536 1532 -5169 -4359 4234 -93 -9084 -3190 4105 -2471 -4861 1260 751 -3376 774 4298 906 562
552 562 3258 3805 6075 7380 2818 2628 9396 8322 4285 8680 9414 1557 3012 11183 7916 1968
568 1968 4105 3741 -553 3879 8300 470 -5165 469 2044 -1269 707 1749 -2084 -3079 -852 1029
584 1029 4326 4050 -3211 -2097 7675 6889 -427 4037 8746 1359 427 10091 8761 -1789 552 7730
600 7730 3440 -849 1498 1728 -2877 -4864 -3098 386 -2258 -12224 -13562 -736 662 -13800 -14472
615a4472J2365m162r743R110R683j0359q395R592P863l233l011Q47P60P33R57
630a465K313L659n021p125P435R107q156p810R649K559j2542J274J3812l983j4389
645a0683K452J1567r76p831j656L302L055j828l076M173K512o712j638J0033K055
660D749r098K10O789l382j391Q885o35j1934J816J2148j44p661M8L099j22p52
676B625N55K673J073o059n204Q841P422q232o435N604J052l959M894K364r314
691b100k246R377k78p721J822N212n919m604N409N395l610p698q76R095N188r470
707c024o060J0018M434r521P88J1179m750r919P250Q979o006l885N379o94m951
722g83L959O421l333q037j480P553N397q058q057P009O401j0757n182J3759K546
$$ plain form
615 -14472 -2107 -6269 -16012 -6902 2781 -7578 -15973 -6381 1482 -1751 -4762 -3915 -3155 -2422 -1465
630 -1465 848 4507 -514 -7639 -204 8903 747 -7063 2586 5145 -7397 -6123 7689 3706 -10683
645 -10683 -8231 3336 2360 -5471 -7127 -3825 -770 -2598 -5674 -1501 1011 -5701 -7339 2694 4749
660 4749 -4349 -4139 2650 -732 -2123 6762 6127 -5807 -3991 8157 8013 352 400 3499 3377 2625
676 2625 3180 5853 6926 867 -4337 4504 11926 3694 -2741 2863 3915 -44 4850 7214 -2100
691 -2100 -4346 5031 4753 -2968 -1146 4066 -1853 -6457 -1048 4347 737 -6961 -7837 1258 6446 -3024
707 -3024 -9084 934 5368 -4153 -3365 7814 3064 -6855 395 9374 3368 -517 4862 4168 -783
722 -783 3176 9597 6264 -1773 -3253 4300 9697 1639 -6418 591 6992 -3765 -8947 4812 7358
737G358j7478k397J5964J497j1602o51O573r72k346K703K392j258l117O08O264
752C538J400o820p16Q285k552p709P268P111j1417p720J2766O852j2309o211P657
767e77K369m933j494J991R04l297l844L002O715l664p858K946O202l959j021O022
783d96k917p102O004P449n695m946O090J309n463J237M798j279l694j404J802
798d307L806q37n983M75N292j772m502M539J813o750R10Q076k765n507M562L959
814A009n612M9P313r56n570J303N329J863k789l155J554M976j185n535M476M868
830G938p862m972J0165L346j0241j476Q260k221o039M682M698n402l152L594L648
845D966j119l163L92M274J032n885J204Q949k745r056N604R156p288o702P735
$$ plain form
737 7358 -10120 -12517 3447 4944 -6658 -7309 -736 -1708 -4054 -1351 1041 -217 -3334 -2726 3538
752 3538 4938 -1882 -2598 5687 3135 -4574 2694 9805 -1612 -9332 3434 10286 -2023 -8234 -577
767 -577 1792 -3141 -4635 -2644 -1740 -5037 -8881 -5879 836 -2828 -10686 -7740 -1538 -5497 -6518 -496
783 -496 -3413 -10515 -4511 2938 -2757 -7703 -1613 -304 -5767 -4530 268 -1011 -4705 -6109 -4307
798 -4307 -501 -1338 -7321 -6846 -1554 -3326 -7828 -3289 -1476 -8226 -7316 760 -2005 -7512 -2950 1009
814 1009 -4603 -4554 2759 1803 -3767 -2464 2865 4728 1939 -1216 338 5314 4129 -1406 3070 7938
830 7938 76 -4896 5269 8615 -1626 -3102 5158 2937 -3102 1580 6278 876 -2276 1318 4966
845 4966 3847 684 1076 5350 6382 497 1701 10650 7905 -1151 4453 13609 6321 -381 7354
860G354M636p940j962N966m64m890K1K428O18k759k840J397M052l561n020M709
876A745L125p416j680Q091K7q449J978O284l501l496M051J980l337l56J411N37
892I94L54o58j766J731J733m118J70M942k113n294L469K924m912q97M964k126
908f03m617L033J967l160J7K816k651j523L016j82j632J615l09k188K445J047
924i09k560R51L612l569j986N304M08n159K162M604l294k884M390Q53l513P71
940h19K964j458j270M84n5J321J557l077j075L992r91l673L296L369n790k874
956d099O416J456n080M10L401k027j835K617O94p78k36j321J61L954q72m454L039
973A446K957m061j370O142q39o240K386M468k763k636K559K00j475Q81J99j114
$$ plain form
860 7354 11990 4050 2088 8054 7590 2700 2721 5149 5767 3008 168 1565 5617 2056 -2964 1745
876 1745 4870 -2546 -4226 3865 3892 -4557 -2579 3705 204 -3292 759 2739 -598 -954 457 994
892 994 1348 690 -1076 655 2388 -1730 -1560 3382 1269 -4025 -556 2368 -2544 -3441 1523 -603
908 -603 -5220 -2187 -220 -3380 -3363 -547 -3198 -4721 -1705 -1887 -3519 -1904 -2213 -4401 -1956 -909
924 -909 -3469 -2518 1094 -2475 -4461 843 1251 -3908 -1746 2858 -436 -3320 1070 1923 -1590 -819
940 -819 2145 687 -583 -99 -154 1167 2724 -353 -1428 2564 1573 -2100 1196 4565 -1225 -4099
956 -4099 2317 3773 -1307 -897 2504 477 -1358 1259 1953 1175 939 -382 -221 3733 2861 -1593 1446
973 1446 4403 342 -1028 5114 4275 -1965 421 4889 2126 -510 2049 2249 774 1655 1854 740
989G40R11q42k305K984K041m830j783N017L02m503K387K226m306j163M483N85
1005A944l153Q11k52j639K749J258l020k08K386k220r70M315k14m564P43K896
1021H62j958m8K137j813j985K428P01k132J101R32l257M5M166j847l584K777J547
1038G2l130J012K266k409j699K729N12j693J736n46k664K578K862l592p33L456
1054G57j330k584M234J944m477r58L611n21q29J811p67k200J853N40j086J224
1070A222P41m429j17N159j082m013K219J690l300J69L742j641k489J918Q45j417
1086g83J420M61k317J920K470k525q81L618r05l383L345K773l926j617L446j93
1102B923k285J848L22k776O85J171j902P92J235l489q74L702j36l548J829J920
$$ plain form
989 740 1651 809 -1496 1488 3529 -1301 -3084 1933 2235 -2268 119 2345 -1961 -3124 1359 1944
1005 1944 -1209 -398 -650 -2289 460 1718 -1302 -1510 876 -1344 -2314 2001 1787 -2777 -2034 862
1021 862 -1096 -1144 993 -820 -2805 -377 324 -1808 -707 225 -3032 -2987 1179 -668 -4252 -1475 72
1038 72 -3058 -2046 220 -2189 -3888 -1159 -647 -2340 -604 -1150 -3814 -1236 1626 -1966 -2699 757
1054 757 -573 -3157 1077 3021 -1456 -2414 1197 676 -153 1658 891 -1309 544 1084 -2 1222
1070 1222 1963 -2466 -2583 2576 1494 -2519 -300 1390 -1910 -1741 2001 360 -2129 -211 634 -783
1086 -783 637 1098 -1219 701 3171 646 -235 3383 2478 -905 2440 5213 1287 -330 3116 2923
1102 2923 638 2486 2808 32 717 1888 -14 778 2013 -1476 -2350 1352 1216 -2332 -503 1417
1118A417l214m00L837l58l124J933O92j390J439J583k584L42K598j564j759L398
1134B846p5l537J317K777k950j695K897n64k337J912l37k500J210J321k673K83
1150b105K265k061k316L192K048m532J75L164j526r94K776M78k134R67O59j385
1166a329K061J109k980K3M131k160l232L429J975m707o7L726j547k777K247J157
1182A059j998j39q2n92J293R27k795Q83K604k573k549M561J837n482j51M450j171
1199H2l428L415J523l047o78K390r6R0j72j818J138K409j750j735L246O36m108
1216a903J584M343k972l072L832J710l758J36L035k068j317J783j7r57P6q57p72
1233a194K414K48l546K80K460k399j267L990p09m216J180L600k179n71K778j274
$$ plain form
1118 1417 -1797 -2197 1640 1282 -1842 91 783 -607 832 2415 -169 173 2771 1207 -552 2846
1134 2846 2771 -766 551 3328 378 -1317 1580 1016 -1321 591 254 -2246 -1036 285 -2388 -2105
1150 -2105 160 -1901 -4217 -1025 1023 -3509 -3334 -170 -1696 -2690 86 564 -1570 -603 56 -1329
1166 -1329 732 1841 -1139 -1116 3015 855 -2377 1052 3027 -1680 -1747 1979 432 -2345 -98 1059
1182 1059 -939 -1078 -1160 -1752 -459 468 -2327 -1444 1160 -1413 -3962 599 2436 -3046 -3197 1253 82
1199 82 -3346 69 1592 -1455 -2133 257 161 251 79 -1739 -601 1808 58 -1677 1569 2205 -1903
1216 -1903 -319 4024 1052 -2020 1812 3522 -236 -100 2935 867 -450 1333 1316 359 435 -422 -1194
1233 -1194 1220 1468 -2078 -1798 662 -1737 -3004 986 277 -3939 -2759 841 -1338 -1909 869 -405
1249d05k375K704K661j933l88J271n66J53J882r21n30J610j468j725L150J039
1265D159m750n87M260j766l856K881P46m359p7L803j541l191Q90J407j114K86
1281b809l6J56M43l84r93K903K961n048k147O430J664m749q2N545k481l620L733
1298A486L038l246k504K032M01k56k10j022p1J0k420Q13M302k906n494L339M849
1315B141m631l617N963J528n823L71N584n03l935N67K801Q23l10j614K77K707
1331B329q01k160L244J340m613r32N679k63m878J570L598m300j943N522Q74m749
1347d83q68K958L03j63p86n54J308J4k081J636L312k507l902L657L145l810j103
1364G6L571j766l070L779K407m784j544M084K4k686N10J076o26o67r84R86K753
$$ plain form
1249 -405 -2780 -76 2585 652 264 1535 969 1122 3004 2083 1553 3163 1695 -30 3120 4159
1265 4159 -591 -1178 3082 1316 -2540 341 1087 -3272 -3349 454 -1087 -4278 -3388 -1981 -3095 -2809
1281 -2809 -2845 -2689 -2246 -2630 -3623 -720 2241 -2807 -4954 1476 3140 -1609 -1691 3854 1373 -2247 1486
1298 1486 4524 1278 -1226 806 1207 951 741 -281 -352 -342 -2762 -1949 2353 -553 -6047 -2708 2141
1315 2141 -2490 -6107 -144 1384 -4439 -4068 1516 1013 -2922 -2355 446 1269 959 -655 -378 2329
1331 2329 1528 -632 2612 3952 -661 -1593 4086 3823 -1055 515 4113 -187 -2130 3392 4266 -483
1347 -483 -1351 1607 1910 1747 961 407 1715 1729 -352 1284 4596 2089 -1813 1844 4989 1179 76
1364 76 3647 1881 -1189 2590 4997 213 -1331 2753 2777 91 601 1677 1051 384 -600 386 3139
1381C139k074l928K995M368l464l303M319J056m458J308M905k977m114L051K791
1396C614l084n38J739l55j647p18J603J590j384m416J242N036k641n092L380L801
1412B130n000l195O361J324n885k83M775o54l086J405J454m80j115M67J542O19
1428C79k539j351M169J690n513P4N880j982n321L487M608m544l557M155K315l121
1444a171j068J736L21o31o69N93J780p74l312J409M026k362l597L864J770m256
1460b341nM908j304m594K696K910k355j329K393J92j251J69K28J091O81j217j026
1477a54K875M43l577J556L403k647k501L801J161m424M96M293k080k774K289Q69
1493C029k327m4J301k26q13k06p97J512K19k432Q4L158j743l304L205L146m260
$$ plain form
1381 3139 1065 -2863 132 4500 1036 -2267 2052 3108 -1350 -42 4863 1886 -2228 823 3614
1396 3614 530 -8 1731 1376 -271 -989 614 2204 820 -3596 -2354 2682 41 -5051 -1671 2130
1412 2130 -2870 -6065 296 1620 -4265 -4548 227 -427 -3513 -2108 -654 -1134 -2249 -1782 -240 379
1428 379 -2160 -3511 658 2348 -3165 -3091 2789 807 -4514 -1027 3581 -963 -4520 -365 1950 -1171
1444 -1171 -2239 -503 -182 -813 -1482 -889 891 117 -3195 -1786 2240 -122 -3719 145 1915 -2341
1460 -2341 -2346 2562 1258 -3336 -640 2270 -85 -1414 979 1171 -80 89 317 1408 2089 872 -154
1477 -154 2721 3164 -413 1143 4546 1899 -602 3199 4360 -64 432 4725 2645 -129 2160 3029
1493 3029 702 658 1959 1733 920 714 -83 1429 1648 -784 -700 2458 715 -2589 616 3762 -498
1510d98j453M434K66l867R38L561j555k384J606J331m03l13j025M51J384k090
1526C83j263L065N51m386p6M308j554m406K465L214m377k154M019N40l197j31
1542b999J796K01r07k57K52J569mk808J441L284k371l263L932K265l895k58L608
1559A586j590k280K387J670k522j073J843k91j15k23n94k76J049q80p59K033J59
1576A24l734J059L331j503k568K297J076k480O64K711j476j021J341K81r73J335
1592D64Q69j996Q11J008r30M04J386j941p60K496J60k826J222J895k326p50K805
1609A991o39k873R48J631j052k68J221j299j237J513N10p02P32l68j588K241J603
1626B364k723j85K598j390k215L069J965l450j044K717l17j399J474k78j282M25
$$ plain form
1510 -498 -1951 2483 2749 -1118 -180 3381 1826 -558 1048 2379 1976 1663 638 1089 2473 383
1526 383 -880 2185 2736 -1650 -1726 2582 1028 -3378 -913 2301 -2076 -4230 -211 329 -2868 -2999
1542 -2999 -1203 -1002 -1909 -2166 -1914 -345 -349 -3157 -1716 1568 -803 -4066 -134 2131 -1764 -2022 1586
1559 1586 -4 -2284 103 1773 -749 -1822 21 -270 -385 -608 -1202 -1478 -429 -1309 -2068 -35 124
1576 124 -3610 -2551 780 -723 -3291 -994 82 -2398 -1734 977 -499 -1520 -179 102 -871 464
1592 464 1333 -663 148 1156 226 630 2016 75 -685 1811 1971 -855 367 2262 -64 -814 1991
1609 1991 1352 -1521 -573 1058 6 -262 959 -340 -1577 -64 446 -256 476 108 -1480 761 2364
1626 2364 -359 -544 2054 664 -1551 1518 3483 33 -1011 1706 1389 -10 1464 1186 -96 329
1642C29L45q70R26J70k456J12L136j283k783K207J108l192Q47K913j832k777K165
1659i35J908j896k66Q72p05q1J513p65N1R57j339j660K825J486l564J37K588j246
1677a20j822K560L28l016N00J597q67n56J235j223j034J978l04j312J071M26k082
1694b641O37K526r42k023J742O31j517R98Q29j182q49K104n26j196J573K62k413
1711a987J795J585j515j180J449l28j113J755O45k624M93J484j067J96J677j492
1727b27j473J898J202k356Q28J399j825o23K387k22j926R78N20r50M29J304j305
1744C8r85J857m81j273J913N58k374L81K441j692q22J782j3j896J448Q96j435
1761C43M8J016p03m42J437p76j410J615Q64k132J37J605j667j384K284M14k295
$$ plain form
1642 329 674 -196 730 900 -1556 -1444 1692 409 -2374 -167 941 -2251 -1404 1509 -323 -3100 -935
1659 -935 973 -923 -1189 -317 -1022 -1103 410 -355 -304 653 -686 -2346 479 1965 -1599 -1462 1126 -120
1677 -120 -1942 618 946 -2070 -1570 27 -840 -1396 -161 -1384 -2418 -440 -744 -2056 -985 -559 -2641
1694 -2641 -2004 522 -420 -2443 -701 -70 -1587 -589 240 -942 -1791 313 -213 -1409 164 426 -1987
1711 -1987 -192 1393 -122 -1302 147 -181 -1294 461 1106 -1518 -1025 459 -608 -412 1265 -227
1727 -227 -1700 198 1400 -956 -128 1271 -554 -1177 1210 988 -938 40 560 -390 39 1343 38
1744 38 -947 910 429 -844 1069 1627 -747 -366 2075 383 -439 1343 1330 -566 882 1778 343
1761 343 391 1407 704 262 1699 923 -487 1128 1992 -140 -3 1602 -65 -1449 835 1249 -1046
1778a046L10J556j433O4J092r08o77J320k03j145J396Q63k157L79K289r94j667
1795i61K283O09k488R96J714j717p54J434l40q18Q02j68j780J029J233j773o01
1812a300J595r64j647K219K23k437P66J479j260l76K032j000j020J854O11j523
1828g48P59J289j677k41K047l71r29N36O26j012J13J027j430j04J374p47j149
1845f37J460J62k868J392J962k054j109J570J87j735R91J487j355m56N46n7K57
1862b57J042j215n71K057N0j499J170J531k158j521L563j56k238M29J571j103
1878F95p51J539l12j223K89J60k92J377l51j896P63J608j590m06J963o24k638
1895a689J904K044k161j214J942j0j552J116M21j533mN57J91M58j97j406l72K560
$$ plain form
1778 -1046 -736 820 -613 -549 543 -365 -1042 278 75 -1070 326 1189 -968 -589 1700 706 -961
1795 -961 1322 1931 -557 439 2153 436 -318 1116 776 -42 760 592 -1188 -159 1074 -699 -1300
1812 -1300 295 -669 -2316 -97 126 -2311 -1545 -66 -1326 -1702 330 -670 -1690 164 775 -748
1828 -748 11 1300 -377 -618 1429 1058 129 665 1291 279 392 1419 -11 -115 1259 512 -637
1845 -637 823 985 -1883 -491 1471 -583 -1692 -122 65 -1670 -679 808 -547 -1003 -457 -514 -257
1862 -257 785 -430 -1001 1056 1106 -393 777 2308 150 -1371 2192 2036 -202 227 1798 695
1878 695 -56 1483 1171 -52 237 397 105 1482 1131 -765 -2 1606 16 -390 1573 949 -1689
1895 -1689 215 2259 98 -1116 826 816 -736 380 801 -732 -736 -179 12 470 273 -1133 -1505 1055
1913A055k93k139J359R09k074j66K882n73k229J171J060j519O08J260j042j195
1929i26Q91Q67l13k12o0j304J327Q48k067lJ464j516j259K274M68k689M10J680
1947a20j366o15J602J59k654J166J819p38j75p0k64P55P57q29NJ339o84k092K457
1966D52K402l189j500K461R93k477R29J721j982q87J643P96j249j99m13J89P01
1983C91j71p80J250K7k284J119L341j900l698K509K825k072j396K623Q6j840M17
2000D47J226k54q66n29L44J440L40j715J48J386j431l85K646J34l403L2L331r62
2018A929k397K011J162k381q25K067M84q32r06k78Q62Q53j025j101J193K66k432
2035a350J199J764k165j580K230N69k584Q84J859j805j615K168P42j384r11J232
$$ plain form
1913 1055 762 -1377 -18 891 -1183 -1349 1533 960 -1269 -98 962 -557 51 1311 269 -926
1929 -926 -35 832 519 307 247 -1057 270 1118 -949 -952 512 -1004 -2263 11 479 -2210 -1800 -120
1947 -120 -1486 -2101 -499 -340 -2994 -1828 -9 -747 -922 -992 -1256 -501 256 -573 -568 771 87 -2005 452
1966 452 2854 -335 -1835 626 1619 -858 71 1792 -190 -1077 566 1362 113 -86 -499 -310 391
1983 391 220 -560 690 717 -1567 -448 2893 993 -2705 -196 2629 557 -839 1784 1870 30 447
2000 447 1673 1419 553 24 368 1808 2148 433 581 1967 536 151 2797 2931 -472 -440 2891 1929
2018 1929 -468 1543 2705 324 -501 1566 2050 1218 312 34 896 1749 724 -377 816 1082 -1350
2035 -1350 -151 1613 -552 -2132 98 667 -1917 -1033 826 -979 -2594 -426 316 -1068 -1979 -747
2051g47L56N3k88l78P63Q01j524j16K336m91k905J544K110j914r16K010n54k539
2069b399J272J858j712j282P61M61p05j33J62N8M54j722R0K323K01k731M6L443
2087D45j052k763K472J808k619m14K731J57j486k51J703k44m78K60k42P47m05
2104C69q69J098J142k040j425K894R30l697J24K740j029k505J913K014k240r21
2120a502J158Q92o92l75L23M84J64j207L87K091p43k030J241K120j806j385K733
2137A853N02l020L89K393r51j531J303O16r61o05J10O49J68l56j095R12J193j973
2155d04n09K336n04k305J168J886j959j130K432J08j959L11J428q95m49Q67k15
2172B07r5K12k09l4N50o03o25J443M60k024K91K225j065k379J685J261j849o06
$$ plain form
2051 -747 -391 -338 -626 -1004 -241 560 -964 -1080 1256 765 -2140 -596 1514 -400 -1316 694 140 -2399
2069 -2399 -1127 731 -981 -2263 -1502 -1041 -1746 -1879 -1717 -1659 -1205 -2927 -2837 -514 -313 -3044 -2998 445
2087 445 -607 -3370 -898 910 -1709 -2123 608 765 -721 -972 731 487 9 269 27 774 369
2104 369 -500 598 1740 -300 -1725 1169 2099 -1598 -1474 1266 237 -2268 -355 1659 -581 -1502
2120 -1502 -344 548 -144 -519 -196 288 452 -755 -368 1723 980 -1050 191 2311 505 -880 1853
2137 1853 2355 -665 -276 2117 1166 -365 938 1554 593 -12 98 747 915 559 -536 376 1569 -404
2155 -404 -913 1423 919 -1386 -218 1668 -291 -1421 1011 1119 -840 -529 899 4 -445 422 207
2172 207 112 324 115 81 631 28 -597 846 1306 -718 -427 1798 733 -1646 39 1300 -549 -1155
2190a155J677m15j372Q13Q77n35n49J37l74O69j9q28O34Q86j244j030K219J61
2208E52k346P03K108q43k145J516J336j918L7J140J01q60j22J04P10L06j202k6
2226h49J234n2j680Q08J823k047j648K529K62j417k03J990r13j345J685K24o56
2243b55j94PJ7P67j3j020M98J532j814k62K304j48k308R14J439j031o20J343J06
2262A262j371N60J183j210j90N74o90O13L85m72o34R72j99j257J078R35j627q9
2280a77J587l50j547R81O42j529N79J167p87m23R28n82m15R61J33p84L0N29p57
2299A86K81J316j527p86J598K94j938O59J298j401r12J448N01j647L82P46j120
2316f22M0O51p29P9O98q15j27Q85J3j432J011J463j617r27J825J20j742J083J310
$$ plain form
2190 -1155 522 107 -1265 -452 425 -110 -659 -522 -896 -227 -246 -1074 -440 446 -798 -1828 391 552
2208 552 -1794 -1091 1017 174 -1971 -455 881 -1037 -1000 140 241 -619 -741 -637 73 379 -823 -849
2226 -849 385 333 -1347 -539 1284 -763 -2411 118 380 -1037 -1240 750 -163 -1508 177 401 -255
2243 -255 -449 -442 -425 342 329 -691 -193 1339 -475 -737 1567 1419 -889 25 1464 433 -187 1156 1262
2262 1262 -109 451 1634 424 234 808 118 731 1116 644 10 982 783 -474 604 1539 -88 -177
2280 -177 1410 1060 -487 494 1136 -393 186 1353 566 143 1071 489 74 1035 1168 384 414 943 186
2299 186 467 1783 256 -530 1068 1362 -576 83 1381 -20 -932 516 1017 -630 -248 498 -622
2316 -622 -582 69 -660 -581 117 -698 -825 60 73 -1359 -348 1115 -502 -1429 396 516 -1226 -143 1167
2335A167j189n95P67%m97N78l91m27P84J16q32K54J330j629n57J221L92j568O64
2354d12R37j325k13J416j45j107M82N51o84L91L52p75L78N68l98o70J403j12j252
2373f15O65J323j539o37J714p92n06Q06J45j087K39J168j260QQ43m15q57R95K11
2392D09r69oO98p74J8J266l89j180J109J70j059L81J154j164m33J220k99j016
2410h64J060M74j123Q6J038q84m70J011k99p41Q79l3l90n1J101j157l63J296n95
2429b5p70J119O40j028m05R35j89o66R20j58o64M77l0m52L87O36q49n09J478o74
2449A73j541J270P70j157r5J005j04j088Q11N98j044M92M10j050M44P18n40n22
2467d50J187k80j076R57P90j504l43J377o21p58P74O41j594J56L71n6l45N47n46
$$ plain form
2335 1167 -22 -617 150 150 -347 231 -160 -587 197 313 -519 -265 1065 -564 -1121 100 492 -1076 -412
2354 -412 525 -800 -1013 403 258 -849 -367 184 -500 -109 243 -532 -154 414 16 -654 749 637 -615
2373 -615 50 1373 -166 -803 911 119 -387 419 564 -523 -284 884 -376 -368 475 60 -797 198 409
2392 409 -560 -566 132 -642 -624 642 253 -927 182 352 -707 -326 828 -336 -769 451 152 -864
2410 -864 196 670 -453 -367 671 -213 -683 328 29 -712 167 134 -256 -307 794 -363 -726 570 -25
2429 -25 -795 324 964 -64 -469 466 277 -389 531 373 -291 186 156 -296 91 727 -122 -631 847 173
2449 173 -1368 -98 672 -485 -580 425 321 -767 44 642 -402 90 500 -550 -106 612 72 -450
2467 -450 737 457 -619 338 1128 -376 -719 658 37 -721 53 694 -900 -744 -373 -429 -774 -227 -773
2486g73m41J039Q5j101M96M62p83kJ427k68j271P93P64q72M37J229j424o8R93
2505G22q7o60N86k6r03L75J208j051l77N73n21p9R75M6j711P40P74q63L3Q86k39
2526D01j452J411M89r44l60J023o34l92J146J0m36K9M08r08P70M84q34m15J386
2545A182o82q87J102O53j563o2J527j18j578R47K63j138N76M16p32L59L64j210
2563e81K12J218j211n72P17P55j233p4J247j316o93J332Q18j493l71P36k36j37
2581h82O66k97k80M47l30n36J167J86j267O4J082m24m47J163L65j718N29J482
2599I70q01r09R45m38oL21J66o14lJ56n08M64O36j180n32J099J99j299R08M62
2619C6q51n69J858k38j311O29R39r15L86J211n59q24M51N25K50L10n42n91Q45
$$ plain form
2486 -773 -1214 -175 -90 -1191 -695 -233 -1016 -1018 409 141 -1130 -337 427 -445 -8 1221 -203 -271 722
2505 722 635 -25 561 535 -368 7 1215 164 -213 360 -161 -240 735 781 -930 -190 584 -279 -246 640 401
2526 401 -1051 360 849 -95 -455 568 -66 -458 688 698 262 291 699 -209 561 1045 211 -204 1182
2545 1182 500 -387 715 1368 -195 -257 1270 1152 -426 521 784 -354 222 638 -94 265 629 -581
2563 -581 -369 849 -362 -934 -217 538 -695 -769 478 -838 -1531 -199 619 -874 -1245 -509 -745 -882
2581 -882 -216 -513 -793 -346 -676 -1212 -45 141 -1126 -1062 20 -404 -851 312 677 -1041 -512 970
2599 970 169 -740 205 -233 -239 82 248 -366 -369 -213 -721 -257 379 -801 -1333 -234 -35 -1334 -426 36
2619 36 -815 -1384 474 236 -1075 -446 493 -422 -36 1175 616 -208 243 768 1018 1328 786 195 1040
2638A040N78j453P17J027j161j125J313R75j482j73P88m75m85P40j0q99j75M43
2656A83j10J54j06n49L24Q19q41m27J372L11k063Q10J882j138j533J214P13p43
2674B72k83J393r99m60N09R0l2N48j204j24R54k82p47M70J048j777n83K043j59
2693F77j763K77J640r24j293J396j73l86k20M61l37J67P2j117P57P86q97n17J273
2712a21k54j197J068J106j595n03J704n4j454R76J058q34r08J218k41o8Q3o82
2730f98O3R17k67j020Q87L10j475M75J563p49j538J068Q73j565L80J190q28p42
2748a156N36Q23p04J39J15p1N17J2q85N80Q92r66o16J692K01j743N6K110j259
2767B73j255J604J69j128Q4R98k88k16j75J19J36J74l98j04P47l96q49R36R42
$$ plain form
2638 1040 1618 165 882 1909 748 -377 936 1911 429 256 1044 569 84 824 814 -85 -260 183
2656 183 73 227 121 -428 -104 715 -126 -553 819 1130 -933 -123 1759 621 -912 302 1015 272
2674 272 -11 1382 383 -77 432 522 490 1038 -166 -290 664 382 -365 105 1153 -624 -1207 836 677
2693 677 -1086 -809 831 -93 -1386 10 -163 -549 -769 -308 -645 -478 -406 -1523 -766 20 -877 -1394 -121
2712 -121 -375 -1572 -504 602 -993 -1496 208 154 -1300 -324 734 -100 -1008 210 -31 -99 -16 -698
2730 -698 -635 282 15 -1005 -118 192 -1283 -808 755 6 -1532 -464 409 -1156 -776 414 -414 -1156
2748 -1156 -620 203 -501 -362 -247 -318 199 211 -674 -94 798 -168 -784 908 1109 -634 -578 1532 273
2767 273 -982 622 791 -337 -253 745 457 241 66 185 321 495 97 -7 740 344 -505 431 1373
2786A373j445r26J985Q6k077R88J322q03r31O66N78k83k12K38J4q9L7n83R17L27
2806A182r83o2J227p08j586J606M67j292l80J605J03j552J38J176j016J49K98
2823C72k20K79p2n70J67Q18o67p19Q39N29j696M56J359m09j530J199O66j137l29
2842f65J244o82j74N43K49p61J12L22n47K47K70m79J21R30j121l48J462nj716
2861i98Q75J384j169o34J093m1j010O47M67m86k83%M40j95P04p52m71J329m24
2880D76r98O91Q72j148o99J663J48j442L75R91o66q52J276k4q16O6M4J03L00k84
2900G6q85J088N21j153j55J375n99j178J277Q66j285l91R42m46m80P09L41m93
2918A30n50M70K6O3L25r36L10P11l04r84P65Q13j716L50J392n58j048O32N44q97
$$ plain form
2786 1373 -72 -998 987 1073 -1004 -16 1306 503 -428 238 816 533 321 559 573 484 521 -62 855 1182
2806 1182 199 137 1364 656 -930 676 1143 -149 -529 1076 1179 -373 -235 941 -75 74 372
2823 372 152 431 359 -211 -44 774 107 -612 227 756 -940 -484 875 466 -1064 135 801 -336 -665
2842 -665 579 -103 -277 266 515 -246 -134 188 -359 -112 158 -321 -200 730 -391 -739 723 718 -998
2861 -998 -123 1261 92 -542 551 510 -500 147 614 128 -155 -155 285 90 794 42 -429 900 476
2880 476 -522 169 1041 -107 -806 857 1005 -437 -62 929 263 -589 687 663 -153 -87 -43 60 360 76
2900 76 -809 279 800 -353 -508 867 268 -910 367 1233 -52 -443 499 53 -427 282 623 130
2918 130 -420 50 76 139 464 -472 -162 549 245 -739 26 839 -877 -527 865 307 -741 -109 435 -462
2938d62L06O80o90l60M35j74Q2K30j13l78O01J36r82j3J090m98q43J301J06j104
2958f50Q6Q27l64k93M97M3r99Q17J28j38l78Q87p48j78R79m60n49Q76l34o71L44
2979b78P35p62l59J234o69r01O55O83j182N17M42m57j4J84l8l55M21K40r47K93
2999e58Q79r30m13J458l57j181J058M50r28j86J030r7j008J236J1o45J09m2o96
3018h10M80P33n40l87J049o81m78P96M71j406K28P71n04m67J082m40m24N22J73
3037A68l72k19P74n81OO81j20p30Q03M29q74m4P90l47o17Q04L51j027K10N37l82
3058B40K2K03n2k98J43K86j091R29J85p68m32J498q97k69P98k7j016M21R86r53
3078i2n0N87m27n26R05n8p26K06P21m21n20Q58k60n26M05N12j493M82O50l92k60
$$ plain form
2938 -462 -156 524 -166 -526 -91 -265 -183 47 -66 -444 157 293 -689 -702 388 -110 -953 348 454 -650
2958 -650 -564 263 -101 -394 103 146 -853 -36 92 -46 -424 463 -285 -463 516 56 -493 383 49 -622 -278
2979 -278 457 -305 -664 570 -99 -1000 -345 338 -844 -327 115 -342 -356 -172 -210 -565 -144 96 -851 -558
2999 -558 321 -609 -1022 436 79 -1102 -44 406 -522 -708 322 225 -783 453 464 -181 -72 -114 -810
3018 -810 -330 403 -137 -524 525 -156 -634 162 633 -773 -545 226 -278 -745 337 -103 -527 -5 168
3037 168 -204 -423 351 -230 -224 457 337 -393 410 839 -35 -79 711 364 -253 551 902 -125 85 622 240
3058 240 262 465 413 115 258 544 -547 382 567 -201 -633 865 -32 -301 497 470 -546 -125 861 -92
3078 -92 -142 445 18 -508 397 339 -387 -181 540 119 -401 457 197 -329 76 588 -905 -423 227 -165 -425
3099d25N69l95q70J042K34o38l3Q36q02m33J018k69l57J36L26p97J57Q88l69o59
3119h41M89m1n49R01L47q75K68P94o76p82J193M2k76j42O85p01j27Q68n87j54
3139a64R63n23q01R02K74p76pN72n87m00J170J64j001L94L73n59pO11j3n30K59
3160C14J19m85P57K36r64K56N73m29l01R06K32j045J71O10o63k58J046m33m27
3179B15N98K08p50k8N31m12l50O03l10o74O61k2m19j5J29k45p07J372k69o04K59
3200b29L27q23L21P01m99m49Q26lp07N76J40m19j62O78m35j41N55n13m58Q69J66
3221C21p38P7Q21q38l74Q36K8q07Q6N18k51l47L02k04l23O64m91j44L18M45p18
3242h19q2Q51m32k83Q36k19n97M61Q71j051k63Q07j50j26K81k0m38M98M01n78
$$ plain form
3099 -425 144 -251 -1121 -79 155 -483 -516 320 -482 -915 103 -166 -523 -387 -61 -858 -701 187 -182 -841
3119 -841 -352 -393 -942 -41 306 -569 -301 493 -183 -965 228 270 -6 -148 537 -164 -291 577 -10 -164
3139 -164 799 276 -525 377 651 -125 -132 440 -147 -547 623 787 -214 180 553 -6 -13 598 585 55 314
3160 314 433 -52 705 941 -23 233 806 377 76 982 1214 169 340 950 287 29 1075 642 215
3179 215 813 1021 271 243 774 362 12 615 305 -369 292 270 -149 -164 -35 -280 -987 385 116 -488 -229
3200 -229 98 -725 -404 297 -202 -651 175 172 -535 41 181 -238 -400 278 -157 -298 257 -256 -714 155 321
3221 321 -417 -340 481 -357 -731 105 133 -674 -588 -70 -321 -668 -366 -570 -893 -229 -720 -864 -546 -101 -819
3242 -819 -901 -50 -482 -765 71 -148 -745 -284 587 -464 -727 80 -70 -196 85 65 -373 125 526 -52
3262e2K21N57j063j11Q72K60q83K77M54p24k77J325p49q03O25K27m32K44p8lL0
3283h3L69k11k27K59M0m92K31P11q18k24J411q08k78N14K21j102L32Q34k78l68
3303C3J60J89n79O28K47j66j41J85o76M42K72l76n51N26M07q98P5J018p48n90
3323e43P64l10k69L21l6J47o88P94k20k28N44p5p41P43L11j040M59N72r57o8J132
3344F12l47p56N29Q75p18o05P69k24o31P94K2m35j77K40k58K95L92q22o6Q58l18
3365B9o91M22R25j358j79J744q36p43M84n4k18J51J39n4L95J9o42k5J117n83q25
3386g83J042J88q21L17N39n54o50R14K55m01l65P49j03p14L87K35r9r4j09m65
3406e32O66j21o94N72N08n09m16Q41L06j153K54R93p93m46N32K68m33p5N83k35
$$ plain form
3262 -52 169 726 -337 -448 424 684 -199 78 532 -192 -469 856 107 -696 -71 156 -276 -32 -110 -113 -83
3283 -83 286 75 -152 107 147 -345 -114 597 -221 -445 966 158 -120 394 615 -487 -155 679 401 33
3303 33 193 382 -197 431 678 512 371 556 -120 322 594 218 -333 193 600 -298 -223 795 47 -543
3323 -543 221 -89 -358 -37 -73 74 -614 180 -40 -268 276 201 -540 203 514 -526 -67 505 -452 -520 612
3344 612 265 -491 38 913 195 -410 359 135 -496 298 320 -115 -292 -52 -310 -15 377 -445 -511 347 29
3365 29 -662 -240 685 -673 -852 892 56 -687 -203 -257 -475 -324 -185 -239 156 175 -467 -492 625 42 -783
3386 -783 259 447 -374 -57 482 -72 -722 192 447 46 -319 430 327 -387 0 235 136 42 -67 -532
3406 -532 134 13 -681 -109 399 -110 -526 315 621 -532 -278 715 -78 -524 8 276 -157 -232 351 116
3426A16k54K61M1p7J91j48l71Q35m28m69O30M60p77o11J042K77j049L55R28p18
3446B34p16R33m16m4M2L72n92M23j48k93K43N43p81k18J142m48p45P20L36j184
3466e97N1J111m6j111O46M85p40p7L04P6O3K35p46N37k29o9o23R38J58j004N30
3487a08P82o55q53R28M88r38J68L27l00j50J58O3j77j30L61l66L16K15r49N40
3507b80O53q12p5Q40n4o56l26J070l94m89P03j07k18k87M19m97OL89k57k34N89
3528a7m26MR66m84r65M33P98m41n68R62K56r82L49Q46j052l21Q04q4k36L22l7
3549A27k33L27l55j8K47J13n41M47L21l28p10L27N96j89m10Q43k00o83N09K9l88
3570a69J06K83m33J6O24o35J05N64p38l46O76M39q14q6J105o03l67O66M3m90j73
$$ plain form
3426 116 -138 123 164 87 278 130 -241 594 166 -303 327 787 10 -601 441 718 -331 24 952 234
3446 234 -482 451 35 -9 33 405 -187 236 88 -205 38 581 -200 -418 724 276 -469 251 587 -597
3466 -597 -546 565 519 -592 54 539 -201 -278 26 102 165 400 -346 191 -38 -107 -730 208 366 -638 -108
3487 -108 674 19 -834 94 582 -356 -188 139 -161 -311 -153 -90 -267 -397 -36 -402 -86 129 -820 -280
3507 -280 373 -439 -514 326 272 -384 -710 360 -34 -523 180 73 -145 -432 -13 -510 -504 -115 -372 -606 -17
3528 -17 -443 -439 527 43 -922 -489 309 -132 -700 262 518 -464 -115 731 -321 -642 162 78 -158 164 127
3549 127 -106 221 -134 -152 95 208 -333 114 435 107 -603 -276 320 131 -279 564 364 -319 190 219 -169
3570 -169 -63 220 -213 -197 427 -208 -103 461 -277 -623 53 492 -322 -408 697 94 -273 393 436 -54 -227
3591b27Q19n62n04M36N9R6K85k99k00K55J03m02pM49m32m30P75j64n28N9N33n03
3613c89j46L79P1q06O12L88n76J73J34l0l67M89k59l24N01K19r08O75M04p21j52
3634f33P53m8l91J55M89m00j11L47m56J08J42J13m94M93j18l70M09J60k28l31
3654d11O36j50m40M95L85m51j66N20j83m10O34Rl43K01K44j88J75j18l15K59M00
3675G83k85o50Q21Q6o00J65J75j9k27J50K76o92M49J13l87J51j0P6j48K6j5m08
3697a70M01K13n05L45P1p7l77L08On04M65K93l60o57R11q2k83L33k43k96N40j07
3719B25m75Q9M75k13m89O11k54o04N58M31q65R0N21k21o60N00J20k84J6K44l60
3740e45L25J00m9l0L6J23m37L35J75n5k92O17l77j50J24L20l46k64Q73q27Q5O23
$$ plain form
3591 -227 592 30 -474 -38 21 117 402 103 -97 158 261 -141 -148 301 -131 -561 214 50 -478 -419 114 -389
3613 -389 -535 -156 -85 -891 -279 109 -467 -294 -160 -190 -557 -68 -327 -651 -150 69 -839 -164 240 -481 -633
3634 -633 120 72 -319 -164 325 -75 -186 161 -295 -187 -45 68 -426 67 -51 -421 -12 148 -80 -411
3654 -411 225 75 -365 130 515 64 -102 418 235 -175 459 468 125 326 570 382 557 439 124 383 783
3675 783 498 -152 669 755 155 320 495 476 249 399 675 -17 432 545 158 309 299 375 227 253 238 -170
3697 -170 231 444 -61 284 355 278 -99 209 215 -289 176 469 109 -548 363 281 -2 331 88 -208 332 225
3719 225 -250 -161 314 101 -388 223 -31 -635 -77 354 -511 -421 100 -121 -781 -281 -161 -445 -429 -185 -545
3740 -545 -220 -120 -169 -199 -163 -40 -477 -142 33 -22 -314 303 -74 -224 -100 220 -126 -390 483 -344 -259 364
3762C64k81m16M49j5l38K2J43k78l20R25o06r2L06K1n97J37N46l38k29M77L58
3783B38n34J06M76o64L40N42m12m1L30j75m65N98J75o29K40L92n46l52Q75j71
3803C23p00N02N81q43M40P0n46l5P29j76l71k53L37l39K49K41j82l27M28P7l98
3824a93N60J48o54K1Q10m25l73K70Lk57K29M11o71J54O69p62j69P12j34n79J61
3845f9O10l98n82Q54l14n44P96j18k09j40L26k94j02M04k54j50J41q2n09N80K30
3866A76j54n66P64n19k43M48Ln67K22M00j91o5J80k02r1M07o3k56l10N95j49J09
3888g2R0j3l29j87L43l49N87J72n66N2K57ro87O03J27m99M0N42j5n04K70m6l64
3911e57M56r7m35M33N75o98N6N31l67m94N73K23Nj21K58J3p59L72N92m21j25o2
$$ plain form
3762 364 83 -333 116 101 -237 -215 -72 -350 -670 255 -351 -443 -137 -116 -713 -576 -30 -368 -597 -120 238
3783 238 -296 -190 286 -378 -38 504 92 51 381 206 -259 339 514 -115 125 517 -29 -381 494 323
3803 323 -377 125 706 -137 303 373 -173 -208 521 345 -26 -279 58 -281 -32 209 27 -300 128 205 -193
3824 -193 367 515 -139 -118 692 267 -106 164 167 -90 139 550 -121 33 702 -60 -229 483 349 -230 -69
3845 -69 541 143 -439 415 101 -443 353 235 26 -114 212 -82 -184 220 -34 -184 -43 -125 -634 -54 176
3866 176 22 -544 220 -299 -542 -94 -91 -658 -436 -36 -227 -292 -112 -314 -405 2 -61 -317 -627 -32 -181 -72
3888 -72 18 5 -324 -511 -168 -517 70 242 -324 -272 -15 -24 -711 -108 19 -480 -440 102 87 -417 -147 -193 -557
3911 -557 -101 -198 -633 -200 375 -323 -267 264 -103 -597 -24 199 204 83 341 354 -405 -33 559 138 13 -49
3933d9J86j19M69m73l1M80o8n11N43Jp98K50N14l83k29R9K28j37j16N68o60K14
3955b2L0L19l17L61m01M2K43M6n01m3P94m14j68M47J3l72J67M88p28l20P32J2
3977D08o23L16K37j54k01J73Q5j68K60l64o4K64K10j024J03Q43k93n25O18l73
3997b72k4Q4L2l05K87O6O8l42M55M47p28n1L12j98L59k34O0J14J79m55q0L56K95
4020D25r09K08P50l55n01M23J34m19J78L54o30n8J87LO8Q6j02p07Q14j63m49L32
4042c31Q70q01j63M98M29q84J41P19k02k33J45K8l49L89k17m5M03j3m28J38M28
4063E22m37l20P69m90k94J46N24m13J1K07r9k24Q0M04n18K26k24j38K35L66j29
4084B04OJ29O9l54p6L50k06j70N42r2n70K89K76m97J89q3K10j77K94k50K79j1
$$ plain form
3933 -49 137 18 487 14 -17 463 395 -116 427 428 -370 -120 394 11 -218 -119 109 -28 -144 424 -236 -22
3955 -22 8 327 10 371 -30 12 255 301 -200 -243 551 137 -31 416 429 57 224 712 -16 -336 396 408
3977 408 -215 101 338 184 -17 156 241 73 333 -31 -95 169 379 -645 -542 301 8 -517 101 -272
3997 -272 -296 -212 -180 -485 -198 -132 -64 -406 49 496 -232 -283 29 -169 190 -44 16 130 309 -146 -226 130 425
4020 425 -484 -276 474 119 -382 41 175 -244 -66 288 -342 -400 -213 -210 -142 -56 -158 -865 -51 -214 -663 -331
4042 -331 539 -262 -425 73 502 -382 -241 478 276 43 188 216 -133 256 39 -6 397 384 -44 94 522
4063 522 85 -235 534 44 -250 -104 420 7 18 225 126 -98 -18 386 -132 94 -130 -268 -33 333 204
4084 204 210 339 408 54 -22 328 122 -48 494 402 -168 121 397 -100 89 6 216 39 333 83 362 351
4106C51k34l92M73l1k78k99O49j96l20K68K21l18k92R40n54m55N82j5j46jJ37
4127I0j40M5K43n48J15N08m28j97N11K39o96Q0P48n95m38L11L66o77J78M05n67
4148d47O3K10M5k29M81o52K18L87k30k76K01L34k57j48M68J32o63K20N03l94m58
4169d92M16K53m99K68M05j55k60j26j43K08L49k91l52L50K91o27N15J52n35r8
4189c71O37j97k0r9J60j87J06M28r3j39J26k82r9L83k53k39L41N48p93j8N60j33
4211C66n46M23J28k15j36M09j53m00M04j5k70M36k0k78j38J47J56l95M69k30m98
4232c56N52j66m46K69Q2j56r5N25k20o04M16M74j84n25O23k54n41N13k09K93K25
4253B16j31k87M1L18l13l90R71j43q09K93P68o98J48M67l64l43KK62k05k24L40
$$ plain form
4106 351 117 -275 198 167 -111 -410 239 43 -277 -9 212 -106 -398 542 -12 -467 115 100 -46 -47 90
4127 90 -50 -5 238 -310 -195 313 -115 -312 199 438 -258 -178 570 -25 -463 -152 214 -463 -285 120 -447
4148 -447 -384 -174 -129 -358 123 -529 -311 76 -154 -430 -229 105 -152 -300 168 300 -363 -143 360 -34 -492
4169 -492 -76 177 -322 -54 351 196 -64 -190 -333 -125 224 -67 -419 -69 222 -405 110 262 -273 -371
4189 -371 266 69 49 -50 110 -77 29 457 364 225 351 69 -30 353 100 -139 202 750 -43 -61 499 366
4211 366 -180 243 371 156 20 429 276 -124 280 265 -5 431 411 133 -5 142 298 -97 372 142 -356
4232 -356 196 30 -416 -147 -65 -221 -316 209 -11 -615 -199 275 91 -434 189 -65 -606 -93 -302 -9 216
4253 216 85 -202 -161 157 -156 -546 425 282 -527 -234 534 -164 -16 451 87 -256 -254 8 -197 -421 -81
4274h1k90j0O54m02l28N45m8m82M03J58r0j98K57J45n75L83L22j20j40N2n3k10
4296a08M71l35J7k8K4j51L19L78n57k62P38l89n17K74L29n27N93r8L4l99J94O4
4318F4j43K41k46j47J09N41o31Q8M86J05m04J69k62j24M08K61k03l23M44q8n39
4339a94K43M71k47k52r7l37K15M73l87P4L09j80q0k9M04l22j89M72l86k53P8M44
4361B30k79k57K94K28l24K38N5p14O41k1m87L21M06o20J22K99k61k22Q6L14m61
4382d12L36K03k14p35N41M63l55L93k53k27J76L65o31J64K95k6o72L28L61o70
4402e70J81N37m18j96L02K13k89L90L9m36j16M46p4l24M95k05k61j08O29o42K75
4423a32N79l86n6K5M92n74R9L16l00Q5L35l98k26K90r8l48Q6P00n20k60L67L9
$$ plain form
4274 -81 -371 -381 273 -129 -457 88 40 -442 -39 119 29 -169 88 233 -342 41 363 243 103 155 102 -108
4296 -108 363 28 45 17 41 -110 209 587 30 -232 506 117 -400 -126 203 -324 269 171 205 -194 0 64
4318 64 -79 162 -84 -231 -122 419 -212 -124 362 467 63 232 -30 -154 254 515 312 -11 433 345 -194
4339 -194 49 520 273 21 -76 -413 -198 275 -112 -38 271 91 11 -18 386 64 -125 347 -39 -292 -214 230
4361 230 -49 -306 -12 216 -108 130 185 -529 112 91 -396 -75 331 -289 -167 132 -129 -351 -265 49 -412
4382 -412 -76 127 -87 -822 -281 182 -173 220 -33 -260 -84 281 -350 -186 109 83 -589 -261 100 -570
4402 -570 -389 148 -270 -466 -164 49 -240 150 189 -247 -363 83 9 -315 180 -25 -286 -394 235 -407 -132
4423 -132 447 61 5 30 522 -52 47 363 63 148 483 85 -141 149 51 -297 -211 489 -31 -291 76 115
4445A15j28M2J75m96J11Q50q38J62M49l27k28K70P9n77N60L9o5j78j52L33j63
4466C3M5L32m97M72k27j65J40L60o38j53N83kk7k35J98j41m18M38M52l35j53K89
4488C51o01L19J97m44J32J26K45n64M47r4l26K33j2o9j54J24L81m88K48n8K3K8
4510D4j74k30M44l34K45o7O5k0n20N59k22P4l63N31J06l07K04P2j69j22J92j43
4532a35l19N72n30m9J80N24l88K7M9k67M3q7R9qr8K63J34r2J58j82k55N05k0j73
4556d9J6K08m6k7L3J00m66K72Jk29j39L92l20J71m0j16J36M21K8o38M5L88l26
4579a85n8M12J35l89m4K83k81K88J73j79J2J22Q2k00K59m9l36L16O9j22j10M20
4601F18k31k70J60j4j34j63L85j16k79L92l25j92K98j8k82K97J22k50j47M61N6
$$ plain form
4445 115 -13 29 204 -292 -181 669 -169 -7 442 115 -113 157 236 -341 219 258 193 15 -137 196 33
4466 33 78 410 -87 385 158 -7 133 493 -145 -298 285 283 256 21 219 78 -340 98 550 215 62 351
4488 351 -250 69 266 -178 -46 80 325 -239 208 114 -212 21 9 -60 -214 -90 291 -197 51 -7 16 44
4510 44 -130 -360 84 -250 -5 -72 -7 -27 -547 12 -210 -136 -499 32 138 -169 35 107 -62 -184 8 -135
4532 -135 -454 118 -412 -461 -281 243 -145 -118 -69 -336 -293 -380 -281 -289 -387 -124 10 -82 76 -106 -361 144 124 -49
4556 -49 -33 175 129 102 135 235 -231 41 42 -187 -326 66 -254 -83 -123 -239 -103 318 346 -292 -247 141 -185
4579 -185 -243 169 304 -85 -129 154 -127 161 334 155 167 289 371 171 430 381 45 361 430 308 198 618
4601 618 387 117 277 263 129 -34 351 235 -44 348 23 -169 129 111 -171 126 248 -2 -149 312 368
4622C68n52N68k00n68L96k0o8k60K16M56l68j51K10m7q5L41k91k57M00j06k73
4643b91M45q4l66j28M75l88J40K88k1k33M9J41k46R0L51o05j97M00K22m29K65
4664a22J2n9Q5oK7j4L26j62j29j02K55m05q0M79j66o01O79J18l96K80J7k86J56
4687i4K63j64o4K24L7k17r5J06O9o5N4qm36M71L06k87j78K05j25k0L55q5m07N03
4711C48M2l79J08N35p84k49Q25k60l08L13m9j22k5K97p1m64K27O7K79p1p9n18
4733c38K49L38k66J15K24k75l83L59O72p39k2L61o9l73P6L50m26J45L61m95K20
4754H4Nj34K88Pn68K37K74ql40r6K77L8m63K75L14o37K39o2r8L06K34k08k58K95
4778AJ12l75m7L28k01j5K46m25m7L23l1K07k66N52m97J3L18J20m05o4L12j00j45
$$ plain form
4622 368 -184 384 184 -384 12 -8 -76 -336 -120 336 -32 -183 27 -20 -105 236 -55 -312 88 -18 -291
4643 -291 154 70 -296 -424 51 -337 -197 91 70 -163 -114 27 -219 -129 222 -383 -580 -180 42 -387 -122
4664 -122 -110 -169 -84 -90 -63 -77 249 87 -42 -144 111 -294 -374 105 -61 -662 17 135 -261 19 36 -250 -94
4687 -94 169 5 -59 165 202 -15 -110 -4 65 0 54 46 -390 81 387 100 -78 127 2 -18 337 252 -155 348
4711 348 390 11 119 654 -130 -379 446 186 -122 191 142 20 -5 292 221 -243 -16 51 330 259 180 -338
4733 -338 -89 249 -17 98 322 47 -336 23 695 -44 -66 295 226 -147 -71 279 -147 -2 359 -136 84
4754 84 89 -45 243 250 -318 -81 193 185 -155 -251 26 64 -399 -124 190 -447 -208 -270 -368 -62 172 -36 -294 1
4778 1 113 -262 -309 19 -182 -197 49 -376 -423 -100 -131 76 -190 362 -135 -122 196 316 -89 -153 159 59 -86
4801h6J71o6K23j14J2l30J48L13n74M41j48k19j1L58j44k25K37Q1m53J16L62m2
4823E0j89J74J35k99M66r7n8JK68l26L0M1K6j57J84J67m02j81O23j09l12O3J73
4846B71k16J12q3k73O8O3J54P1J56k02q0j5q3J53j32O9k93K2K18J03o9J41J97
4869C52l76j72K71L35m44R9m12J64Q8J58k08R9K60m58R0L56O1n54J79L83k91j40
4891a60K71k35k0oK50J3j44j72M12n01J05Q6k2K79n2k82M9J10L4l13K19P8n8K02
4915A43k1m37j70N58m9k66K09K9J78j28N8k27l05J04Q5M6K58L5j74O6J81k2j22
4938B9J06J44n17N71k84K08n76M83k30J70J71n26L36m6j49n9K53J28l03j41N44
4959C12l77J70J55O7l13J99j75M27m29K02m7q0k6K96m92M41j24k75jK31q3j80
$$ plain form
4801 -86 85 19 242 128 140 -190 -42 271 -303 138 -10 -229 -240 118 -26 -251 -14 67 -386 -270 92 50
4823 50 -139 35 170 -129 337 240 182 183 451 125 155 196 222 65 249 416 14 -167 456 347 35 98 271
4846 271 55 167 84 -189 -121 -58 96 167 323 121 41 26 -57 96 -36 33 -260 -238 -20 83 14 155 352
4869 352 -24 -196 75 410 -34 65 -347 -183 -95 63 -145 -46 214 -244 -154 202 263 -291 -112 271 -20 -160
4891 -160 111 -124 -144 -150 100 113 -31 -203 209 -292 -187 -101 -123 156 104 -178 -129 -19 15 -298 -79 -1 -59 143
4915 143 122 -315 -485 73 24 -242 -33 -4 174 46 104 -123 -428 -324 -239 -193 65 100 -74 -8 173 151 29
4938 29 135 279 -238 333 49 257 -319 164 -66 104 275 -251 85 39 -110 -169 84 212 -91 -232 312
4959 312 -65 105 260 327 14 213 38 465 36 238 191 111 85 381 -111 330 206 -69 -70 161 78 -102
4981a02N64j9o53N5K81k01k65N36j8k09L2K51l76L89j49k26L2K86k69j02O2J07
5003Fj17J11K43m37L2J98m4l06J85n0L4L4p0r9K36J85j56m17K62K14k19J51R6
5026G2P0k58K61k2j54N0n5j66K11L0J10m59M21k76j17L14l41J23M1J25j5m02L42
5049i5qn05O04j09l8l17O34k21j94L60j35Q6j22M57n81R2L07k60k40L47j45j50
5071b33K85L9m11K04K45j57j53j52M67m46O0M12j52n7J50j27J4J81n8j09J28J26
5093B56j76j61O02n62MM42J1m57K31J21l19Q8J69j24j25L40l18r8J48r5k11M36
5115B02k86N4J94J64m03K00k06l7J15K66L29m35k51M08j74J96l9K9j34o3K8K4
5137A81j54J39j13j9J49Q5l14K6M89n11j64L0K12k29N9K27m9j59J03K97m90R1
$$ plain form
4981 -102 462 443 -210 -155 126 -75 -340 196 178 -31 1 252 -124 265 116 -110 -78 208 -61 -163 -101 6
5003 6 -111 0 243 -194 -162 36 -8 -314 -129 -179 -145 -111 -181 -280 -44 141 -15 -432 -170 44 -175 -24 72
5026 72 142 -116 145 123 -31 19 -36 -202 9 39 149 -310 111 -165 -282 32 -309 -186 -145 -20 -35 -437 -95
5049 -95 -103 -608 -4 -113 -151 -468 166 -55 -249 111 -24 62 -60 397 -184 -92 215 -45 -285 62 -83 -233
5071 -233 52 91 -320 -116 129 -28 -181 -333 134 -312 -252 160 8 -49 101 -26 -12 169 111 2 130 256
5093 256 80 -81 521 -41 -37 405 416 -41 190 311 -8 80 249 125 0 340 22 -76 72 -23 -234 202
5115 202 -84 -30 164 328 -75 125 -81 -118 -3 263 592 157 -94 314 140 336 297 326 192 129 157 181
5137 181 27 166 53 34 183 268 -46 -20 469 -42 -206 -176 36 -193 -134 93 44 -115 -12 285 -205 -114
5159a14j0o0M7J27j45K6L60k1k35n0J41k67J82j58J23k8J22j16k63J69L33k65
5181a02m78P61j99j80K41k02j88K01L01k38J6L60k99l53L28n3k74N30Nk73J87
5202I1j64j50m56O24k2k49J05L45j89q0K18J2J01r1K9m4q1jj90L29r5KL3J31j47
5227F1l20N37j64Q2n1J92j94j05k17J60j02J2J55J10l01L41J30n50L61j59k7J58
5249A09q3%k24M94L8j71k87O28o64J36K35j03J87L4k05o7j50k6J49j38K48k52
5271a12J27K74l89l5k14K35K2J4K06n5l84Q4L52k15l7k39L51j67L75j33j95M8
5293h7k4O9l9M05m10J84m05K75j47J69p8J30j59n3K15l41K14J80r1r3L4k24L21
5316D5l9k31K43N1l97k27O60j12J71n9N5k45j76J63J23j66J94M5l33N58j04m31
$$ plain form
5159 -114 -124 -184 -137 -10 -155 -129 231 210 -25 -75 66 -201 -19 -177 -54 -82 40 -76 -339 -170 163 -102
5181 -102 -580 181 -18 -198 43 -159 -347 -146 155 -83 -67 293 -6 -359 -31 -84 -358 172 177 -96 91
5202 91 -73 -223 -679 -55 -77 -326 -221 124 -65 -145 73 85 186 95 124 80 -1 -2 -192 137 42 44 77 208 61
5227 61 -259 278 114 196 145 337 143 38 -179 -19 -121 -109 46 156 -145 196 326 -224 137 -22 -49 109
5249 109 26 26 -198 296 334 163 -124 504 -160 -24 211 108 295 329 124 57 -93 -119 30 -108 140 -112
5271 -112 15 289 -100 -135 -349 -114 -92 -78 128 73 -311 -227 125 -90 -127 -366 -15 -182 193 60 -135 -87
5293 -87 -111 -42 -81 324 -86 98 -307 -32 -179 -10 -88 42 -117 -170 45 -296 -82 98 7 -86 -52 -276 45
5316 45 6 -225 18 69 -328 -555 105 -7 164 105 160 -85 -261 -98 25 -141 53 98 -235 323 219 -212
5338b12R0K57l09K42m62O16q0r3N9J8j77jL9k41K76J87l88L03J2J2j53K47k81
5361c9j39K46K3k48K32K89l14j41J35K16k47N5P2l77L28L49n09L3R7K38l06k02
5383b09J99Q6Q0J15l63K09J04k93L00k40K33k06j00J96j20j53N4L39j0k93N93
5404E21o56k8K86k15J16J20O4j16Q3k5m35K58o8J28m57K44M89l16o6L26l10l06
5426c63L70k73L21k23J87n0J6J52l07N0K15m82J38N01k20k93J71M9j47o3L10J4
5448G3k93L83j48k03K59l31KJ53L96r7k30j80M01l35J5O5k05L24L9J7j92Q4j72
$$ plain form
5338 -212 -122 135 -174 68 -394 222 142 49 108 126 -51 -52 -13 -254 22 209 -179 124 136 148 -5 242 -39
5361 -39 -178 68 91 -157 75 364 50 -91 44 260 13 68 140 -237 91 440 -69 -36 61 299 -7 -209
5383 -209 -10 76 156 271 -92 117 221 -72 228 -12 221 15 -85 111 -9 -162 -108 231 221 -72 521
5404 521 -135 -163 123 -92 24 144 208 92 175 150 -285 -27 -95 33 -424 -180 309 -7 -73 253 -57 -363
5426 -363 7 -266 55 -168 19 -31 -15 137 -170 -120 95 -387 -249 252 32 -261 -90 -41 -188 -251 59 73
5448 73 -220 163 15 -188 71 -260 -258 -105 291 194 -36 -216 185 -150 -135 -70 -275 49 88 105 -87 -3 -175
$$ [...]
8191d5
##END NTUPLES=NMR FID
##END=
