##TITLE=1H_SA_52.211
 DMSO-d6, 8 sc, 
 2.7.2020
##JCAMPDX= 6.0         $$ Bruker NMR JCAMP-DX V2.0
##DATA TYPE= NMR FID
##DATA CLASS= NTUPLES
##ORIGIN= UXNMR, Bruker Analytische Messtechnik GmbH
##OWNER= root
$$ XWIN-NMR		Version 3.5
$$ Thu Jul  2 10:07:36 2020 Russian Standard Time (UT+4h)  she@DPX200
##.OBSERVE FREQUENCY= 200.1315
##.OBSERVE NUCLEUS= ^1H
##.DELAY= (6, 6)
##.ACQUISITION MODE= SIMULTANEOUS
##.ACQUISITION SCHEME= undefined
##.AVERAGES= 8
##.DIGITISER RES= 18
##SPECTROMETER/DATA SYSTEM= spect
##.PULSE SEQUENCE= zg30
##.SOLVENT NAME= DMSO
##.SHIFT REFERENCE= (INTERNAL, DMSO, 0, 15.7039)
##AUDIT TRAIL= $$ (NUMBER, WHEN, WHO, WHERE, WHAT)
$$ ##TITLE= Audit trail, XWIN-NMR		Version 3.5
$$ ##JCAMPDX= 5.01
$$ ##ORIGIN= Bruker BioSpin GmbH
$$ ##OWNER= she
$$ F:/spectra/data/she/nmr/H-F/1/audita.txt
$$ ##AUDIT TRAIL=  $$ (NUMBER, WHEN, WHO, WHERE, WHAT)
(   1,<2020-07-02 10:04:20.82 +0400>,<she>,<DPX200>,
      <created by zg, POWCHK disabled, PULCHK disabled
       configuration hash MD5:
       00 E9 B6 7A A2 85 ED C7 34 08 36 98 17 FE 4E 26
       data hash MD5: 16K
       7F E1 7C 0F E1 F1 5B D3 CB 59 7E 26 E5 74 60 7C>)
$$ ##END=
$$ 
$$ hash MD5
$$ 94 D0 0A 82 F7 D4 9E B2 3D 59 8F 16 52 CD C6 29
##$RELAX= 
##$RELAX= 
##$RELAX= 
##$RELAX= 
##$RELAX= 
##$RELAX= 
$$ Bruker specific parameters
$$ --------------------------
##$DU= <F:/spectra>
##$EXPNO= 1
##$NAME= <H-F>
##$PROCNO= 1
##$TYPE= <nmr>
##$USER= <she>
##$AMP= (0..31)
100 100 100 100 100 100 100 100 100 100 100 100 100 100 100 100 100 100 
100 100 100 100 100 100 100 100 100 100 100 100 100 100 
##$AQSEQ= 0
##$AQ_mod= 1
##$AUNM= <au_zg>
##$AUTOPOS= <>
##$BF1= 200.13
##$BF2= 200.13
##$BF3= 200.13
##$BF4= 200.13
##$BF5= 200.13
##$BF6= 200.13
##$BF7= 200.13
##$BF8= 200.13
##$BYTORDA= 1
##$CFDGTYP= 0
##$CFRGTYP= 5
##$CHEMSTR= <none>
##$CNST= (0..31)
1 1 145 1 1 1 1 1 1 1 1 1 1 1 1 1 1 1 1 1 1 1 1 1 1 1 1 1 1 1 1 1 
##$CPDPRG= <>
##$CPDPRG1= <>
##$CPDPRG2= <>
##$CPDPRG3= <>
##$CPDPRG4= <mlev>
##$CPDPRG5= <mlev>
##$CPDPRG6= <mlev>
##$CPDPRG7= <mlev>
##$CPDPRG8= <mlev>
##$CPDPRGB= <>
##$CPDPRGT= <>
##$D= (0..31)
0 1.2 0 0 0 0 0 0 0 0.06 0 0.03 0 0 0 0 0.0002 0 0 0 0 0 0 0 0 0 0 0 0 
0 0 0 
##$DATE= 1593669860
##$DBL= (0..7)
120 120 120 120 120 120 120 120 
##$DBP= (0..7)
150 150 150 150 150 150 150 150 
##$DBP07= 0
##$DBPNAM0= <>
##$DBPNAM1= <>
##$DBPNAM2= <>
##$DBPNAM3= <>
##$DBPNAM4= <>
##$DBPNAM5= <>
##$DBPNAM6= <>
##$DBPNAM7= <>
##$DBPOAL= (0..7)
0.5 0.5 0.5 0.5 0.5 0.5 0.5 0.5 
##$DBPOFFS= (0..7)
0 0 0 0 0 0 0 0 
##$DE= 6
##$DECBNUC= <off>
##$DECIM= 24
##$DECNUC= <off>
##$DECSTAT= 4
##$DIGMOD= 1
##$DIGTYP= 9
##$DL= (0..7)
0 120 120 120 120 120 120 120 
##$DP= (0..7)
150 150 150 150 150 150 150 150 
##$DP07= 0
##$DPNAME0= <>
##$DPNAME1= <>
##$DPNAME2= <>
##$DPNAME3= <>
##$DPNAME4= <>
##$DPNAME5= <>
##$DPNAME6= <>
##$DPNAME7= <>
##$DPOAL= (0..7)
0.5 0.5 0.5 0.5 0.5 0.5 0.5 0.5 
##$DPOFFS= (0..7)
0 0 0 0 0 0 0 0 
##$DQDMODE= 0
##$DR= 18
##$DS= 0
##$DSLIST= <SSSSSSSSSSSSSSS>
$$ [...]
##$SUBNAM2= <"">
##$SUBNAM3= <"">
##$SUBNAM4= <"">
##$SUBNAM5= <"">
##$SUBNAM6= <"">
##$SUBNAM7= <"">
##$SUBNAM8= <"">
##$SUBNAM9= <"">
##$SW= 24.9337058887773
##$SWIBOX= (0..15)
0 0 2 0 0 0 0 0 0 0 0 0 0 0 0 0 
##$SW_h= 4990.01996007984
##$TD= 16384
##$TD0= 1
##$TE= 0
##$TE2= 300
##$TE3= 300
##$TEG= 300
##$TL= (0..7)
0 120 120 120 120 120 120 120 
##$TP= (0..7)
150 150 150 150 150 150 150 150 
##$TP07= 0
##$TPNAME0= <>
##$TPNAME1= <>
##$TPNAME2= <>
##$TPNAME3= <>
##$TPNAME4= <>
##$TPNAME5= <>
##$TPNAME6= <>
##$TPNAME7= <>
##$TPOAL= (0..7)
0.5 0.5 0.5 0.5 0.5 0.5 0.5 0.5 
##$TPOFFS= (0..7)
0 0 0 0 0 0 0 0 
##$TUNHIN= 0
##$TUNHOUT= 0
##$TUNXOUT= 0
##$USERA1= <user>
##$USERA2= <user>
##$USERA3= <user>
##$USERA4= <user>
##$USERA5= <user>
##$V9= 5
##$VALIST= <valist>
##$VCLIST= <CCCCCCCCCCCCCCC>
##$VD= 0
##$VDLIST= <DDDDDDDDDDDDDDD>
##$VPLIST= <PPPPPPPPPPPPPPP>
##$VTLIST= <TTTTTTTTTTTTTTT>
##$WBST= 1024
##$WBSW= 4
##$XGAIN= (0..3)
0 0 0 0 
##$XL= 0
##$YL= 0
##$YMAX_a= 140489
##$YMIN_a= -89685
##$ZGOPTNS= <>
##$ZL1= 120
##$ZL2= 120
##$ZL3= 120
##$ZL4= 120
##$ABSF1= 10
##$ABSF2= 0
##$ABSG= 5
##$ABSL= 3
##$ALPHA= 0
##$AQORDER= 0
##$ASSFAC= 0
##$ASSFACI= 0
##$ASSFACX= 0
##$ASSWID= 0
##$AUNMP= <proc_1d>
##$AZFE= 0.1
##$AZFW= 0.1
##$BCFW= 1
##$BC_mod= 2
##$BYTORDP= 1
##$COROFFS= 0
##$CY= 11.3945322036743
##$DATMOD= 1
##$DC= 2
##$DFILT= <>
##$DTYPP= 0
##$F1P= 16.9975609425685
##$F2P= -3.02152046262296
##$FCOR= 0.5
##$FTSIZE= 0
##$FT_mod= 4
##$GAMMA= 1
##$GB= 0.15
##$INTBC= 1
##$INTSCL= 1
##$ISEN= 128
##$LB= 0.24
##$LEV0= 0
##$LPBIN= 0
##$MAXI= 10000
##$MC2= 0
##$MEAN= 0
##$ME_mod= 0
##$MI= 1.114404
##$NCOEF= 0
##$NC_proc= 0
##$NLEV= 6
##$NOISF1= 3.799351
##$NOISF2= 2.8
##$NSP= 1
##$NTH_PI= 0
##$NZP= 0
##$OFFSET= 15.70392
##$PC= 1
##$PHC0= -9799.578
##$PHC1= 19.80087
##$PH_mod= 1
##$PKNL= yes
##$PPARMOD= 0
##$PSCAL= 0
##$PSIGN= 0
##$REVERSE= no
##$SF= 200.130013532006
##$SI= 16384
##$SIGF1= 3
##$SIGF2= 2
##$SINO= 400
##$SIOLD= 16384
##$SREGLST= <1H.CDCl3>
##$SSB= 0
##$STSI= 0
##$STSR= 0
##$SW_p= 3612.71676300578
##$SYMM= 0
##$S_DEV= 0
##$TDeff= 0
##$TDoff= 0
##$TI= <>
##$TILT= no
##$TM1= 0
##$TM2= 0
##$TOPLEV= 0
##$USERP1= <user>
##$USERP2= <user>
##$USERP3= <user>
##$USERP4= <user>
##$USERP5= <user>
##$WDW= 1
##$XDIM= 8192
##$YMAX_p= 0
##$YMIN_p= 0
$$ End of Bruker specific parameters
$$ ---------------------------------
##NTUPLES= NMR FID
##VAR_NAME=  TIME,          FID/REAL,        FID/IMAG
##SYMBOL=    X,             R,               I
##VAR_TYPE=  INDEPENDENT,   DEPENDENT,       DEPENDENT
##VAR_FORM=  AFFN,          ASDF,            ASDF
##VAR_DIM=   8192,          8192,            8192
##UNITS=     SECONDS,       ARBITRARY UNITS, ARBITRARY UNITS
##FACTOR=    0.0002004,     1,               1
##FIRST=     0,             0,               0
##LAST=      1.6414764,     0,               0
##MIN=       0,             -89685,          0
##MAX=       1.6414764,     140489,          0
$$ Real data points
##PAGE= N=1
##DATA TABLE= (X++(R..R)), XYDATA
0@%%%%%%%%%%qJ6j6J6j6K3l1L2m0M8n6O6p4Q8j03J17j33J52j73J94k18K47k75
33a44L06l42L81m21M66n18N73o33P00p73Q54r44J042j154J282j426J590j784K015
52A070k292K637l076L655m457N650p640J1764l7242P0621L4044j03277o1142J7423
66g2262M9480K9537J6056k7430m9713o935N1112L3855j1242j7261l409j4397o673
79b9282K7915L2074j0451k8770j5322o631R526M8174L3255n2275p6584J9682Q7723
92C9034K6913n1155l6038P841R761R599K6184O001l5369k9645J1264K1569Q254
105A4213R177M58l4181l2750K4050N5877J8404l0603l9410k0099K1544O4770L8349
118H9799n7095q6731P915Q7004L6648m8050m7229l441J1590J5951K2498p68l5370
$$ plain form
0 0 0 0 0 0 0 0 0 0 0 0 -8 8 -8 8 -8 15 -16 16 -24 24 -32 34 -40 48 -55 62 -71 81 -92 102 -116 131 -144
33 -144 162 -180 201 -220 246 -272 301 -332 368 -405 449 -495 547 -607 675 -751 839 -945 1070
52 1070 -1222 1415 -1661 1994 -2463 3187 -4453 7311 -29931 40690 74734 -28543 -89685 -72262
66 -72262 -22782 6755 22811 -4619 -54332 -61267 -10155 23700 12458 -4803 -8212 -22609 -29282
79 -29282 -1367 30707 20256 -8514 -23836 -30467 -20941 27233 60488 8213 -68371 -48689 39034
92 39034 65947 14792 -21246 -13405 -3644 5955 32139 38140 2771 -26874 -15610 5959 14213
105 14213 23390 23848 -10333 -43083 -19033 36844 55248 24645 -14765 -34864 -13320 51450 89799
118 89799 32704 -54027 -46112 40892 77540 29490 -17739 -21180 -9590 6361 28859 28091 -7279
131g279k0210K0037K0285m273J714J3197j1089k9961K108L5755K3068r703k5733
144G916k7113l060M3698M6217k3391o7356j4012N2062L6180j3855k0178n979q561
157B568k76K7384K2452j5847k7452n150N969M811J6522J6530k1606m5732p971
170b7798M0830L5084p627l6051l3381J234M6532M5178j8881o1857j6947M5242
182A1558L8214j0474k4031q941l393K959J6376R629j2536j4169J742l70q506R798
196G856K6222q99l5934k2315K2352L5625J0928j9030l3550j6618K6322M4675L604
209D9238m4136k9453J7725K8376N721o687p256j3126o508J3875J9642K216r649
222A9978p425q058n567J6501K8873j068l8202k6806J7432L5499J2186j9880l3683
$$ plain form
131 -7279 -27489 -7452 12833 8560 10274 23471 12382 -17579 -15471 20284 43352 33649 7916
144 7916 -19197 -22257 21441 67658 44267 -23089 -37101 14961 51141 37286 17108 11129 2568
157 2568 2292 29676 52128 36281 8829 3679 9648 14459 30981 47511 25905 -19827 -27798
170 -27798 13032 48116 40489 4438 -28943 -27709 18823 64001 45120 -16737 -33684 11558
182 11558 49772 39298 15267 6326 2933 5892 22268 31897 19361 5192 6934 6564 -1942 7856
196 7856 34078 33179 -2755 -25070 -2718 32907 43835 24805 -8745 -25363 959 45634 49238
209 49238 5102 -24351 -6626 21750 27471 20784 13528 402 -6106 7769 27411 29627 19978
222 19978 12553 4495 -1072 15429 44302 43234 5032 -21774 -4342 31157 43343 23463 -10220
235a0220j6862K1480L7993N865l4453k7136J2600K4525N986n452n047n278n386
248a385L938Q871M643J169j825j2806j5301P680L0217J2257k6148l2289K226L0415
262A1662K3508n005k7567k3647Q642L3536J6893j9870k6824j955J4769R577J115
275A4834k493p806r346j442O995R280O162k571j4872j5428P503K8717J5952j9883
289A5602l0523m156K4468K4762p15k3345k3107K879K5327J5678j2286k0282m615
302a0313Q817O295J482J458j213o102p289n23R308J2212L703j4719k0360K05K4612
317G573K1069j0435k9345j3203J6455K5073P499j6618k2564l680J8929J7529k632
330A5650j5012p649L269N119L284K965J230m722r969n100O973J4778O815j2616
$$ plain form
235 -10220 -27082 -5602 32391 38256 3803 -23333 -10733 13792 19778 14326 9279 4001 -1385
248 -1385 2553 11424 16067 17236 15411 2605 -12696 -5016 25201 37458 11310 -20979 -18753 11662
262 11662 35170 30165 2598 -21049 -12407 21129 38022 18152 -8672 -10627 4142 13719 14834
275 14834 12341 4535 -4811 -6253 742 10022 16184 13613 -1259 -16687 -9184 19533 35485 15602
289 15602 -14921 -19077 5391 30153 29438 6093 -17014 -14135 11192 26870 14584 -5698 -10313
302 -10313 -1496 4799 6281 7739 6526 424 -6865 -7388 1920 14132 17835 3116 -17244 -17039 7573
317 7573 28642 18207 -11138 -24341 -7886 17187 24686 8068 -14496 -18176 753 18282 15650
330 15650 638 -7011 -3742 1377 4661 7626 8856 4134 -5835 -10935 -3962 10816 17631 5015
344E015k1245m660J9495K2438k553k4369j7563Q908K3070J1863j0832j9799o450
357a6682J1891J4539R02q488o417q45J012K295M736M797j327j0434r425L434J6265
372F253J0735q783k0646r362J4592K2552L306j8801j9154J843J8378J3954m707
385A0160j6025q951O099J1021L565l571m716k310k352k32M621P881J680r096j2874
400a5100Q3J4906J4428l760j8903j2725R234K0973Q594j3619j8697k935J4035
413c486J3840j027j1949r425K038P442L956o10j650k462m423k234L718R249N130
428H107p836j3131m230J2264J5689P72j6424j5134L567J7913J1210p972j6155
441a1360o607Q450J2480L761o917q644m03M458L742J786J663r36o553n355K573
$$ plain form
344 5015 -16230 -20890 -1395 21043 18490 -5879 -23442 -14534 8536 20399 9567 -10232 -16682
357 -16682 -4791 9748 10650 2162 -4255 -5100 -4088 -1793 2943 7740 6413 -4021 -13446 -10012 6253
372 6253 16988 8205 -12441 -21803 -7211 15341 18647 -154 -19308 -17465 913 14867 10160
385 10160 -5865 -14816 -8717 2304 5869 2298 -2418 -4728 -7080 -7312 -2691 5190 6870 -2226 -15100
400 -15100 -15017 -111 14317 10557 -8346 -21071 -11837 9136 17730 4111 -14586 -17521 -3486
413 -3486 10354 9327 -2622 -12047 -10009 -2567 1389 779 -871 -3333 -7756 -9990 -6272 2977 8107
428 8107 271 -12860 -17090 -4826 10863 11635 -4789 -19923 -16356 1557 12767 4795 -11360
441 -11360 -17967 -9517 2963 6724 -193 -8837 -9240 -4782 -1040 746 2409 1473 -5080 -10435 -7862
456g862R447O348n348j3189p655P928J4999N123j2121j5752j34J5110J1549l020
470E423j1483o668K838J0013O183l096o990k275J520O84J258M669J622p242q462
485a2006M1R629R379j997j1896r789L725J5452R158q519j6608l832J1696J1508
499E941r95q899p898j228O647P395q30o358k689J480M92J254N994M417m355q817
515h449n32Q596Q892M34p950r635j578J0547J1134m096j4707o290O804Q342J409
530B921k955n129m501J725P597L426k956k235k2l206j749Q065Q384m787j3543
545h965l954Q338R880J365o305j0585l693R286J4088m44j4168p018P026Q296K110
560E257j516m299o171K49O936K647n052k596K040k772n411M593J0124l64j0752
$$ plain form
456 -7862 1585 7933 2585 -10604 -18259 -10331 4668 9791 -2330 -18082 -18216 -3106 8443 5423
470 5423 -6060 -12728 -9890 123 6306 3210 -3780 -6055 -4535 -3851 -2593 2076 3698 -3544 -12006
485 -12006 -11965 -2336 7043 5046 -6850 -16639 -12914 2538 11696 3177 -13431 -17263 -5567 5941
499 5941 4946 -3953 -11851 -13079 -6432 963 133 -6225 -8914 -7434 -6942 -5688 306 4723 368 -8449
515 -8449 -8981 -385 8507 8941 991 -8644 -10222 325 11459 7363 -7344 -13634 -6830 1512 2921
530 2921 -34 -5163 -9664 -7939 -342 3084 128 -2107 -2129 -5335 -7084 981 9365 4578 -8965
545 -8965 -12919 -4581 5299 6664 359 -10226 -13919 -4633 9455 9011 -5157 -12175 -5149 3147 5257
560 5257 3741 -558 -6729 -6480 456 3103 -1949 -4545 -2505 -5277 -10688 -6095 4029 3665 -7087
575g087l872N946P210L900O37n814p097L072J2559N012r032p483J162L027J673
590C813L796m32q263n595M844N825o16j170J289n686o580O224J4064n24j4471
605c482p402P056P599J935j488o403r199J877J2779M726r245p257L496M724Q56
620E72K867J963n066k724N256L995m137o1N826k907j1123MJ2297L418r888o846
636f554K686K408J442N338R04r809n532J0062J0525k575o394l93j93k05O149N808
652A3667o590r038J792N393j027P05M218m990j1605K486J5790L625j3027p353
666e954O011M702j053K060R50q656n824P205P636n159p493K009J341k826K039
681c012M772j861l633K801K781l521K108J0100K47j2746l271J3056P450q176n791
$$ plain form
575 -7087 -10959 -5013 2197 6097 6734 920 -6177 -3105 9454 14466 5434 -2049 -887 2140 3813
590 3813 7609 7177 -1086 -6681 -1837 3988 3372 2202 3491 -2195 -8775 -2551 11513 10989 -3482
605 -3482 -10884 -3828 3771 5706 4218 -2185 -11384 -9507 3272 7998 -1247 -8504 -5008 -284 572
620 572 3439 5402 336 -2388 2868 6863 2726 2665 8491 5584 -5539 -5535 6762 10180 292 -6554
636 -6554 -3868 -1460 -18 5320 6224 -3585 -9117 945 11470 8895 2501 2108 1915 1710 7859 13667
652 13667 7077 -1961 -169 5224 4197 4902 9120 4130 -7475 -4989 10801 14426 1399 -5954
666 -5954 57 4759 3706 5766 6716 -1940 -7764 -559 7077 1918 -5575 -3566 -2225 -5051 -3012
681 -3012 1760 -101 -3734 -933 1848 -1673 435 10535 10782 -1964 -5235 7821 15271 7095 1304
696A304J645j109l037O835O950r008j2179M105J0960J087n117n29j522l089M686
711A982Q328j529q684q21L670j141J213N683j911j2753j823J3186N067r654n614
726d801O096J879m371L522O887m325r192L017Q378k703n335K163J574o357k269
741e837N370J941m034j111k81l601J139R880L597j0807o359R264Q517k840l102
756A736K702k335n304N516J0531l875j3191p44R192J990m263N59k69n290k99P697
772D353K585o061k148J851j130n19N971J359q999n384P279N509n795l705M321
787e13k25o683J872R256o51q205k8O563n45k844M515K873o230m553N157M072k355
804A476k136q16l838j882O876M942o995p647L145O485n76j164K675k109n726K994
$$ plain form
696 1304 2949 1840 -1197 5638 12588 3580 -8599 -4494 6466 7553 2436 1907 385 -2704 1982
711 1982 10310 8781 97 -724 2946 1805 3018 8701 6790 -5963 -7786 5400 10467 813 -4801
726 -4801 1295 3174 -1197 2325 9212 4887 -4305 -1288 7090 4387 -948 1215 2789 -3568 -5837
741 -5837 -467 1474 -2560 -3671 -3952 -7553 -6414 3466 7063 -3744 -10103 -839 7678 4838 1736
756 1736 4438 2103 -3201 2315 12846 8971 -4220 -4964 4228 6218 1955 2514 2245 -3045 -3344 4353
772 4353 6938 877 -1271 580 -550 -1069 4902 6261 -2738 -8122 -843 4666 -1129 -4834 -513
787 -513 -738 -7421 -5549 3707 3056 -5149 -5177 1386 841 -2003 2512 5385 -845 -5398 -241 3831 1476
804 1476 -660 -1476 -5314 -7196 -320 4622 -2373 -10020 -6875 -390 -966 -2130 545 -1564 -7290 -4296
820d296R948L57q863k230N484J193k378K382J413n483l220N183M087k820k023
835a266J040r75k441M351M300l808n915J576M498k336j608K986p22o891n29O375
851a365J900n480j671L065j432j404M651M020m527n141L621M820L02j370M02k580
867b189l006L723O114k782o423o28L138O25n24K075q51n456k54O721K401m458
883a774k256K416o09j230L328K878l732m615J981L548p24n55Q81j702k687J603
899c249N203J48l977j103J825K94M4K609N91n019k265L640K823j988k049M32j757
916c798j320L258K976k467m337O68K898P02M12Q88j380l105J332M557J178l068
932f06j760R17R2L13K146P84l841k127K720K561l77j228N1j329j465K527L272
$$ plain form
820 -4296 5652 6009 -2854 -5084 400 1593 -785 1597 3010 -2473 -5693 -510 3577 757 -1266
835 -1266 -226 -1201 -3642 709 5009 1201 -4714 -3138 1360 -976 -2584 402 -320 -7211 -7740 -1365
851 -1365 535 -4945 -6616 -3551 -4983 -6387 -1736 2284 -2243 -7384 -3763 1057 1359 -11 391 -2189
867 -2189 -5195 -1472 4642 1860 -4563 -5191 -2053 -1428 -1952 123 -728 -6184 -6438 283 2684 -1774
883 -1774 -4030 -1614 -2223 -3453 -125 2753 -979 -5594 -3613 -65 -789 -1344 -463 -2165 -4852 -3249
899 -3249 1954 2102 -1875 -2978 -1153 -859 -815 1794 2385 -2634 -4899 -1259 1564 -424 -2473 -2041 -3798
916 -3798 -5118 -1860 1116 -1351 -5688 -5020 -2122 -1420 -1008 -120 -1500 -4605 -3273 1284 2462 -606
932 -606 -2366 -1449 -1357 -1044 1102 1886 -1955 -4082 -1362 1199 822 -406 -355 -1684 -3149 -622 2650
949B650j291l748p65J538J149J97J574j901l079K65L296J527j827j341k56K66
965a746Q9K546J083k697k411J568K611J69l04l37j414j210J329K995l83k723r01
982a736N00M75O64J480o07k659j137J870K308n7j323j058p84M37K109J610j457
999F35k862k53K138J406N06l74j676j724J014L162N22j801j822k70O87J522R44
1016A754p65j940r17J207K076N34j471q65j71j51J336J200p23j808m47P62M93
1033A04N45N57j242j433l55J745J442k48j200r56R0J011J796N41j686j670RJ619
1051F69J388m49j042j820m30J722K002j08k290j320O40J567J316J04j208j846
1067a105P1K181J189j29j330j567K08N98J252J44j173j357L6J135Q07Q4O0q40
$$ plain form
949 2650 1359 -2389 -3154 -1616 -467 -270 1304 -597 -3676 -3411 -115 1412 -415 -1756 -2012 -1746
965 -1746 -1657 889 1972 -725 -3136 -1568 1043 1212 908 571 -843 -2053 -724 2271 1888 -835 -1736
982 -1736 -1236 -761 -97 1383 776 -1883 -3020 -1150 1158 1101 -222 -1280 -2064 -1627 482 2092 635
999 635 -2227 -2480 -342 1064 1570 1196 -480 -2204 -1190 1972 2494 693 -1129 -1399 -712 810 1754
1016 1754 989 -951 -1868 -661 1415 1949 478 -387 -558 -709 627 1827 1104 -704 -1151 -389 104
1033 104 649 1206 -36 -1469 -1824 -79 1363 1115 -85 -1041 -951 60 1856 2397 711 -959 -950 669
1051 669 2057 1608 566 -1254 -1684 38 2040 1932 -358 -1678 -1038 529 1845 1949 741 -1105
1067 -1105 -1034 1147 2336 2207 877 -690 -482 116 1368 1512 339 -1018 -982 153 960 1044 1104 264
1085B64q88J066J467O23m03q76m19m1Q25J129n80j854j060O78J088N17o72j031
1103a67j591R94J455J173l55k101l97J006J687N12p1j331j472R32J396O49j050
1120A269j156m87K65Q30J235Nj659m32Q88J362M61l1l36p34k1M97J272m05j897
1139I26m79N2Q7M76L95r61j534l75J683J225j95l44m40p77Q60K371P33j690j387
1158F26O12N47O82j76q46j548q11P34J427j28j326n55K22M64O01J004J36j352
1176C13p51J591N36l31k26l16j116l91J841Q65j302j607O39N61M52N98R93q24
1194A525q22R60K033K28j112m29J86o43OJ508o56k405j658J600K54p48K19k77
1212b31j157j187J978J906j663j241Q42Q67l81N01J034m01j931J15J615m16r73
$$ plain form
1085 264 -624 442 1909 2532 2129 1253 834 793 1618 2747 2167 313 -747 -69 1019 1536 864 -167
1103 -167 -1758 -764 691 1864 1509 -592 -989 17 1704 2216 2145 814 -658 274 1670 2319 1269
1120 1269 113 -374 -109 721 1956 1961 302 -130 758 2120 2581 2550 2214 1480 1459 1956 3228 2823 926
1139 926 447 499 586 1062 1457 496 -1038 -1413 270 1495 1300 956 516 -261 599 2970 3703 2013 626
1158 626 1238 1785 2467 2291 1445 -103 -914 -180 1247 1119 -207 -762 -540 -76 525 1529 1665 313
1176 313 -438 1153 1689 1358 1132 816 -300 -691 1150 2015 713 -894 -255 306 758 1356 2349 1525
1194 1525 703 1663 3696 3924 2812 2383 2569 1926 1932 3440 2784 379 -1279 321 575 -173 46 -231
1212 -231 -1388 -2575 -597 1309 -354 -1595 -753 114 -267 234 1268 867 -1064 -949 666 250 -723
1229g23J8K41o81o58K054J155j564j302J233P45l51J396P03j687j932J213K291
1246B151n59k351l14N83p02N12J556j176k009L67K482P76j487Q52P80q36n34K427
1264B518J428k428j409J472L00j573k83J169j277k709J062J898j353j666N49Q12
1280a490p98k10J849N84j790n70J790m00j171P94J518k408k085K447K480j589
1296a049k196J768L53o23J078K804j332k847J481L514j8k612J26J111j512l73
1312c27J808k18k578r59J935L78k230M12J770j307j724K597K179j746j674K525
1328H41P37k072k08K568j58l462L27K644p30k528O19J646k026j142J970J278j503
1345a199j387J699k2r55J046J993j998k993J621L223j826j904J166N19k152N29
$$ plain form
1229 -723 -705 -464 -1145 -1803 251 1406 -158 -1460 -227 518 167 1563 2266 579 -1353 -140 2151
1246 2151 1592 -759 -1073 -490 -1192 -680 876 -300 -2309 -1942 540 1316 -171 681 1461 625 91 2518
1264 2518 3946 1518 109 1581 1881 308 25 1194 -83 -2792 -1730 168 -1185 -2851 -2302 -1490
1280 -1490 -2288 -2498 -649 -65 -1855 -2425 -635 -1035 -2206 -1412 106 -2302 -4387 -1940 540 -1049
1296 -1049 -3245 -1477 -1124 -1747 -669 2135 803 -2044 -563 2951 2933 321 447 1558 46 -327
1312 -327 1481 1263 -1315 -2274 -339 39 -2191 -1779 -9 -1316 -3040 -443 1736 -10 -1684 841
1328 841 1578 -494 -702 1866 1708 -1754 -1427 1217 487 -2041 -1422 224 -1802 -2944 -974 304 -1199
1345 -1199 -2586 -887 -909 -1864 -818 1175 -823 -3816 -2195 1028 -798 -2702 -1536 -1017 -3169 -2640
1361b640L422n19l582M30M448N33k294L85K367r01j088K186R41k124j412J900
1377B052J10k214kK090j285l118J115K870k308j354K314O33k739l65L374P33l138
1394a232m13K534K14k262M39J945j626k216J840J971j214j851J648M85j586R38
1410c86K690q47l321J080L208j039k424J579N91k446k66L120K30l959p20L081
1426A71J006k531j5K778r62j596J406K469j137j362K222R90k536j85K780k61k717
1443E20L6J761j172j466J319J112k858j229L092J441k984r22K226L81k362L46
1459g59K543j195k606P87K499r32j777J017P36j305p23K953L95k643j46K674J81
1476A699j572J254J212j858j109K446J143k576j348K226N77k455j23J938n90k132
$$ plain form
1361 -2640 782 263 -3319 -2889 1559 2092 -202 183 2550 1649 561 2747 3688 1564 152 2052
1377 2052 2162 -52 -54 2036 751 -2367 -1252 1618 -690 -2044 270 903 -1836 -2201 1173 1906 -1232
1394 -1232 -1645 889 1103 -1159 -720 1225 -401 -2617 -777 1194 -20 -1871 -223 262 -1324 -386
1410 -386 2304 1457 -1864 -784 2424 1385 -1039 540 1131 -1315 -1581 1539 1769 -2190 -2910 171
1426 171 1177 -1354 -1369 1409 447 -1149 257 2726 1589 227 2449 3439 903 718 3498 3237 520
1443 520 556 2317 1145 -321 998 2110 -748 -1977 1115 2556 -428 -1350 876 1257 -1105 -759
1459 -759 1784 589 -2017 -1230 1269 337 -1440 -423 313 -992 -1715 1238 1633 -1010 -1156 1518 1699
1476 1699 127 1381 2593 735 -374 2072 3215 639 -709 1517 2094 -361 -484 1454 864 -1268
1492a268M41K009o21j565J606J166k128r06L033Q69k585n50K186J0j283N92J336
1509B342j659k070K115J418j763j204J327M17j141j22J837k56k354M94J611l55
1525F37j316Q09R31j965j206K338P72j686j163J658K71r55N83J504j167j541J742
1542B46J739j607n10J120N04j408k16J585k07j541P5J332m26j264Q26N78r87j294
1560a455J515Q39j296o76Q81L89j023J15J851j039j310N94J207o00n96P35L37
1577D68j342l61J590N24j238k88R34q2q36R33O91j380j224J494J341j380j167
1594a323O84M83r12L74J243j017j402Q22J305j49j009P03K43n09n73J361J14q83
1612d45m71J047j12o31O30M42m76r57Q20Q66r92m38O81J55o78l73J176j66q98
$$ plain form
1492 -1268 -827 1182 561 -1004 602 1768 -360 -1266 1767 2636 51 -499 1687 1697 414 1006 2342
1509 2342 683 -1387 728 2146 383 -821 506 923 -218 -340 1497 1241 -1113 -619 992 637
1525 637 -679 130 1061 -904 -2110 228 1000 -686 -1849 -191 80 -875 -292 1212 45 -1496 246
1542 246 1985 378 -132 988 1492 84 -132 1453 1246 -295 -220 1112 686 -578 248 826 -161 -1455
1560 -1455 60 899 -397 -1073 -192 197 -826 -711 1140 101 -1209 -615 592 -8 -604 131 468
1577 468 -874 -1235 355 879 -359 -647 287 205 -631 302 993 -387 -1611 -117 1224 -156 -1323
1594 -1323 -639 -156 -1068 -694 549 -468 -1870 -1048 257 108 -901 -198 45 -464 -1037 324 438 -445
1612 -445 -916 131 19 -612 18 460 -16 -973 -153 713 -279 -717 -36 119 -559 -932 244 78 -820
1631h20L42K32k42p4N69K57q15o24O88Q87j06q53r1M87k28Q13J47n58j515J001
1651e03R99k08n59K12J35o65L29Q03J49j339J90P91k46k51J36J02l74j40M8O26
1671B35l75o52L10L67o84K01Q15l24m57J52N51l41K56L23J7p07KM77L53l72l91
1692b44j16p4j5M91M94r74o3K46O48L8m06n8J5j33P65J75j35j275o3J412k53j88
1714B87q92N76n60L2N49L35j102J09M45L46k43O3M79k31r6K77K45m08o4K50P3
1735D70o57m6O51k90k16k95K50Q0k18Q54%l44l94O5N94J81l95l90K20p9K75Q5
1757D01o62m38J71K98J07k39j55L86j64J86N47p0m78l6N39J01m81L36M9n39M4
1778i7l5J95p88n6L31k06n4J0N11j20L3j44L09L45l07M89L46p98j89Q82j56j90
$$ plain form
1631 -820 -478 -246 -488 -562 7 264 -551 -1175 -487 400 294 -559 -650 -163 -391 422 569 11 -1504 -503
1651 -503 496 288 -271 -59 76 -589 -260 543 692 -647 -457 334 88 -163 -27 75 -299 -439 -391 235
1671 235 -140 -792 -482 -115 -799 -598 217 -107 -564 -412 139 -202 54 377 394 -313 -311 166 519 147 -244
1692 -244 -360 -434 -449 42 536 -438 -501 -255 393 431 25 -33 -18 -151 614 789 654 -621 -684 728 475 287
1714 287 -605 -29 -589 -557 -8 327 -775 -666 -221 125 -118 -55 424 193 97 374 619 211 147 397 470
1735 470 -187 -233 418 128 -88 -383 -133 -53 -271 583 583 239 -155 -90 504 685 290 -100 120 41 316 401
1757 401 -261 -699 -528 -230 -123 -362 -517 -131 -295 -109 438 368 -110 -146 393 494 13 349 398 -141 -97
1778 -97 -132 63 -725 -781 -450 -656 -710 -700 -189 -309 -276 -420 -111 234 -73 416 762 -36 -225 657 501 311
1800C11q6l35J45nK29J37l44m36N70M72j35j41j4O4j85K02K21l58m50j53K96l30
1822c25l81J88J2o70l69L17O58n70l7P26k16J41K46L10j98R1J26P6j62j4N2Mo59
1845f54J13M40J48n48l55M93J67l68P24J8m19m35J022J01P7o12M33j87m69J89
1865a22L04l99l2j57L01N3j46K5N37m77J36P19j85l51J71K23J2r14N00K41j094
1886f55n24M73j36j12l44K42k03n16L97Q24l16m10L56P16l63k5M33J39k6n49R41
1907C42R3r62J44N26n1p71N70P97q79l26R74O04j127J64Q04k6n45Q4M80o67l93
1928a65L42K34o50m99N74J83q09l45N83O14o30K26O78l81m46O02Q37p20p07N34
1948E5M43p46k92O75n36j083K14J132o25q12K58K86k16K29M91K24o98k25J145
$$ plain form
1800 311 225 -110 35 30 259 396 52 -384 186 658 523 382 368 432 247 449 670 312 -138 -291 5 -325
1822 -325 -706 -518 -506 -1176 -1545 -1228 -570 -1140 -1177 -451 -667 -526 -280 30 -168 -77 49 125 -37 -51 1 5 -654
1845 -654 -541 -101 47 -501 -856 -363 -196 -564 160 178 -241 -676 346 447 524 -88 345 158 -311 -122
1865 -122 182 -217 -249 -406 -105 -52 -198 -173 364 -113 23 742 557 206 377 600 612 -302 198 439 -655
1886 -655 -1179 -706 -842 -954 -1298 -1056 -1259 -1775 -1378 -554 -870 -1280 -924 -208 -571 -596 -163 -24 -50 -599 342
1907 342 435 -527 -383 143 92 -679 -109 688 -191 -517 457 1061 -66 98 902 876 331 415 895 228 -165
1928 -165 177 411 -239 -738 -164 19 -790 -1135 -552 62 -568 -342 336 -45 -491 111 948 228 -479 55
1948 55 498 -248 -540 135 -401 -1484 -1270 -138 -763 -1575 -1317 -1031 -1247 -1018 -527 -303 -1001 -1226 -81
1967h1R93j187k64Q72j4p99M98P44r85m12O99O79o19j80R85L83q87j09J076k46
1987A146p00L92K32p13m03O08N81j026j385J093L56r00l91R46m19n71L72R73n01
2006c10p21P95M96l14n70J303K94j457j09J267n00q69J85R32q10n43P38R23j038
2025c08j132J311P48j042m54J248L21o72j22J006o18q77O07Q73j192m76J036Q55
2043A112j234j30P98Mp76N99Q07j30j073J047Q82r79j132O54J232j382q20J059
2061E38l17j496K49J466m34j646N06J199q10l47N75R56j081l38J016J63q50K76
2079c75Q81n35o15M21J189p09j391Q98J270j172m85J154L24q84j73J285l24j105
2097c46M61J025q91j108P44J231j264p58Q68J19m15k81R17l28o60L58J610o80
$$ plain form
1967 -81 912 -275 -539 333 319 -480 18 762 -223 -635 64 743 124 -56 929 1312 425 316 1392 1146
1987 1146 446 838 1070 357 -46 562 1143 117 -1268 -175 181 -719 -1110 -164 -583 -1154 -782 191 -310
2006 -310 -1031 -236 260 -54 -624 679 973 -484 -593 674 174 -695 -510 422 -388 -931 -193 730 -308
2025 -308 -1440 -129 619 -423 -877 371 692 20 -102 904 286 -591 16 889 -303 -779 257 1112
2043 1112 -122 -252 546 550 -226 373 1180 1050 -23 1024 1906 927 -205 449 1681 299 -521 538
2061 538 221 -1275 -1026 440 6 -1640 -1134 65 -745 -1092 -517 439 -642 -980 36 199 -651 -375
2079 -375 506 -29 -644 -223 966 257 -1134 -236 1034 -138 -623 531 855 -29 -202 1083 759 -346
2097 -346 115 1140 249 -859 -115 1116 -148 -906 -38 81 -334 -615 302 -26 -686 -328 1282 602
2115F02j178M57J147l73r33Q74O49j347j15J257k67j549K08J316p41r52N79J062
2133F96q67q34N97M58m45l38R21m4j032N88R40m90j577J039P65n18o90P02R07
2152G78r44k12O97J99r79K23J359n83j228Q33J048m70j222N16O60o53k81P37m39
2171C9j018L13J020J17j552N14R92Oj007L37K89k46Q7N57j53p92M83J063o66j038
2191f55M92Q97k94p93mN06r2l71P61m4j089K0J578n12j387M72R32l04o45K72L64
2212A04k13J5L38p6j090N23J247k51j447L15R14J08n83r2M95l23M9O38p16k76
2232c21K2J263k73j058r8R48r9q24K19K35k5k41J96K65r23L99J035l35r35P5J258
2253G83k91n06j7L9M49j47L14l45o73K41J022l9q98j19O86J75q69j9KJ78J32o3
$$ plain form
2115 602 -576 -119 1028 655 -278 596 1245 -102 -217 1040 773 -776 -568 748 7 -945 -366 696
2133 696 -171 -1005 -408 50 -395 -733 188 144 -888 -300 640 150 -1427 -388 377 -141 -831 -129 778
2152 778 -166 -378 319 518 -461 -238 1121 538 -690 143 1191 721 -501 15 675 22 -259 478 39
2171 39 -979 -666 354 471 -1081 -567 425 431 -576 -239 50 -196 -109 448 295 -497 -14 1049 383 -655
2191 -655 -163 734 440 -353 -357 149 57 -314 447 403 -686 -666 912 400 -987 -515 417 113 -532 -260 104
2212 104 -109 -94 244 168 -922 -399 848 597 -850 -535 379 487 -96 -188 307 -16 33 671 -45 -321
2232 -321 -299 964 691 -367 -465 483 384 -440 -221 14 -11 -252 -56 209 -714 -315 720 385 -550 -475 783
2253 783 492 -14 -31 8 457 310 624 279 -394 -153 869 830 -68 -187 499 674 -195 -214 -212 -34 98 35
2275C5j99l16K68R63j52j004k33Q36L73l95m01P5pK2J96K73o50r4R25K48r65k71
2297d73P29L31k64l86J06N4m4J06N9p78N28O78k42p10l43O53O02m34o44J75K78
2318a9OO02o62j48k57Q94N03j243j82P91N49r28l62J87pP01J08o85o02n5J301
2339D92J90j135j82O04P95n05m09k10M26L19j7l58n75P4P77L09p32q53Q74N92
2359D76k12m35j18N16J90Ok49o05L58P76R0p10m73J77Q20j90j186oN06M39K41
2380D11m85n41L69L22P84j124n45P69P40k81l86l47j0M07J59k21q46J10J016L89
2400F90r64o25K54J060P0o32k97L08P67L6L2j255L65P99N76q02p50k67R27J97
2420D89q90r1O1O21K79l14o86K0P08L64l32p37j7Q75L3n32n93J59L64L92n57k75
$$ plain form
2275 35 -164 -480 -212 751 599 -405 -638 198 571 176 -225 -150 -157 -135 61 334 -316 -410 515 763 -202 -473
2297 -473 256 587 323 -63 43 97 53 159 218 -560 -32 646 404 -306 -649 4 606 172 -472 -297 -19
2318 -19 -13 589 -73 -221 -478 416 919 -324 -506 285 834 -94 -456 -269 -276 425 533 -152 -754 -809 492
2339 492 682 -453 -635 -31 764 259 -150 -360 66 385 368 10 -565 -491 286 595 -137 -990 -116 476
2359 476 264 -171 -289 227 417 423 174 -431 -73 703 793 83 -390 -213 607 417 -769 -775 -269 170 411
2380 411 -74 -615 -246 76 860 -264 -809 -40 700 419 33 -314 -324 83 242 21 -825 -715 301 690
2400 690 -274 -899 -645 415 485 -147 -444 -136 631 667 699 -556 -191 608 1184 382 -368 -635 292 489
2420 489 -401 -492 -431 190 469 155 -531 -511 197 561 229 -508 -525 350 383 -149 -742 -583 -219 173 -384 -659
2442f59l52O38M64n71n56K43Q98L32o01k27P1P24L94m38q42J02O64M52o47r70
2462h81K45Q63M1o30l55O6R75k57M13n74p43J347O53p49o11j40J111J9l66n04
2482g7m52O01P58m67q74k86O63Q65n78q41K44N73K78p2q46m2K97K96J08r67k68
2503a087O99P62o80j243O62P75N18o27o05R0O67O90j53r26M0R24N85m61j216K57
2523c29Q42P40j013p30M81K81J39J62p97m71Q86J043q00r89L38J012K57q69m24
2542b41l14P87M14M5j148l93P56O97l37r77l02J156K34k50o18k25P21O41k5r85
2562c64o34P93R46j69j336rN89M16m76n21R9j37J087r5o53o90J004J272o24q47
2582c49J60P48O89m26q87K19M77K66k2o60o88N19Q08j59j353K76N18O91l31m67
$$ plain form
2442 -659 -1011 -373 91 -480 -1036 -793 105 437 -164 -391 -320 404 798 360 -482 -380 284 736 89 -881
2462 -881 -636 227 268 -362 -717 -651 324 67 480 -94 -837 510 1163 414 -197 -337 774 793 427 -77
2482 -77 -529 72 830 363 -511 -797 -134 731 153 -688 -444 129 407 335 -511 -553 -256 40 148 -819 -1087
2503 -1087 -388 374 -306 -1549 -887 -112 406 -221 -826 -736 -69 621 468 -458 -418 506 1091 630 -586 -329
2523 -329 513 1253 240 -490 -9 272 411 573 -224 -695 191 1234 434 -555 -217 795 1052 183 -241
2542 -241 -555 232 646 691 -457 -850 -94 603 266 -711 -1013 143 377 127 -491 -716 5 646 621 -364
2562 -364 -998 -205 741 572 -764 -773 -184 232 -244 -765 -666 -803 284 189 -464 -1154 -150 1122 498 -349
2582 -349 -189 559 1248 822 -65 154 631 897 875 215 -473 46 854 695 -658 -382 136 827 496 29
2602B9p15N06R18L8p11j055O86Q61j08j165m31R51Q17j045m88J75J13P77R2n49
2622c04r21N91J610m23j043R1N34L50k33n17m95N03K94P55j214n08N10J128k47
2641D61q00k42Q77N90n91j86j17p2P14J70l62j098O45J315l33j472J17P75R00
2660A291r82o6n42L1R66L71q21r80O10J353j38j591m60R25P90p84j81n00j21N38
2680b91Q60o46j257P75J155k5j202q4Q51L65J3o87J38r5L59R44n09j207K83Q17
2700E57N49j377m22J183M57l60l67M4j29L02O45l17j227L90J306J62j422n70Q26
2719B30P88n16j39p43k06J063O62m05j174k46J723L34j167q11J007P86k77p35
2737A74j90l32N63N05k73j437K64J195L83j216q48J181N09m03l0K66l47J54Q67
$$ plain form
2602 29 -686 -180 738 776 65 -990 -304 557 449 -716 -1147 -196 621 -424 -912 -737 -624 153 245 -304
2622 -304 -1225 -634 976 553 -490 -399 135 485 252 -265 -760 -257 37 792 -422 -930 -420 708 461
2641 461 -339 -581 296 886 295 109 -8 -80 634 804 442 -656 -11 1304 971 -501 -384 391 1291
2660 1291 309 243 -299 -268 698 1069 248 -732 -122 1231 1093 -498 -958 -33 757 -27 -208 -708 -829 -291
2680 -291 569 -77 -1334 -559 596 571 -631 -715 136 501 514 -173 -35 -130 229 1173 664 -543 -260 557
2700 557 1106 -271 -693 490 947 587 220 264 135 437 1082 765 -462 -72 1234 1396 -26 -596 230
2719 230 1018 502 363 -380 -586 477 1139 734 -440 -686 1037 1371 204 -607 400 1186 909 174
2737 174 -16 -348 215 720 447 -990 -726 469 852 -364 -1212 -31 478 75 45 311 -36 118 985
2756I85l93r90k44J539O79j351r43Q51P63K5q61j91L62J4O19J54j174j50J254
2775I48J03r06l97N31M99k09l32l62j26J97P12l8j196l83J674K73r82q78P38P78
2795F44j67j47L8m86M83M63j04j135j61J266M73r96p79K90P91k2n95j22k82J86
2815c62R01M3j435j48J219P86p07r53M82N46j14K8m58j85J15P71K32j192k34J019
2835C54P08r47q99L99O75K2j12l95j00J41P33n2r85o72J592J57l76q58K13O71
2855B69k8m09m00mJ74Q24J61j095l97R58Q27m51j133O99J93L94n20j26l27j14
2875e05J055m8j056k78Q16O85o05q53M27L35K17l72k74k95L67N79p7n40n73R66
2895b9O49k06j169R5L72O00o5n40j67L86K18K07r09j37L45J082n51q13M35N9M50
$$ plain form
2756 985 592 -398 -642 897 1576 225 -718 133 896 921 60 -131 231 245 864 1018 -156 -306 948
2775 948 1051 145 -252 279 778 569 237 -125 -251 -54 658 620 -576 -959 715 988 6 -872 -134 644
2795 644 477 330 368 -118 365 828 724 -411 -572 694 1167 171 -608 -318 473 451 -144 -266 -548 -362
2815 -362 539 582 -853 -1001 218 1004 297 -656 -174 372 258 286 -172 -357 -242 529 761 -431 -665 354
2835 354 1062 115 -784 -385 290 312 200 -195 -295 -154 579 527 -458 -1130 462 619 243 -615 -402 269
2855 269 241 -168 -568 -572 -398 426 587 -508 -905 53 880 429 -704 -5 188 582 62 -64 -391 -505
2875 -505 550 502 -554 -832 -16 669 64 -789 -362 -27 190 -182 -456 -751 -384 195 118 -422 -995 -29
2895 -29 620 414 -755 -660 -288 312 247 -293 -460 -74 144 351 -558 -695 -350 732 181 -632 -197 -138 312
2916C12m28r8l94N9O14K62o55o44R49M53l22q56m1M52M03j08n06j22J95M89Q3
2937I7m52m88M50R14m65p36m5N37K24j01l79j60K8M74M06o96o72Q16M48J51j000
2958f49j89R08r7P4k18n36L56L55K80k01j024N18P94j38r78J07j23R21k82l19
2978d41j63L17M30L09o20o82N87N58j12m82l73N00L19k00k45k96J73M98n3q7p42
2999h05K69J014m64m18k29L66N61j51k23j87k14L03M40l89n43M69L06J77o98o4
3019d80M75K25q1n6l90R7L75O03q14l52J0O68j22p29R5j41O89j71l29k41K36L15
3041a18L51n73l15K11N60L74q57M2K39l8J47j05j25k20M19R3j67o76m3R13j17
3062ej71m39N36p0Q1k08j30%M81L28k77m84K2P01j50p5o07K21K75J99m62K4k45
$$ plain form
2916 312 -116 -214 -608 -549 65 327 -328 -972 -23 430 108 -748 -789 -337 66 -42 -548 -670 -475 14 97
2937 97 -355 -843 -393 521 56 -680 -725 -188 36 -65 -444 -604 -576 -102 304 -392 -1064 -248 200 351 -649
2958 -649 -838 70 -27 47 -171 -707 -351 4 284 83 -941 -423 371 233 -745 -638 -761 160 -122 -441
2978 -441 -604 -287 143 452 -168 -850 -263 295 183 -299 -672 -172 147 -53 -298 -594 -421 77 24 -63 -805
2999 -805 -536 478 14 -404 -633 -267 294 143 -80 -267 -481 -178 262 -127 -670 -201 105 282 -416 -480
3019 -480 -5 220 139 83 -307 -210 165 768 -46 -398 -388 280 158 -571 -476 -617 72 -99 -428 -669 -433 -118
3041 -118 233 -340 -655 -444 116 490 -367 -325 -86 -124 23 -82 -207 -427 -8 85 -82 -758 -801 112 -5
3062 -5 -176 -615 -79 -149 -68 -276 -406 -406 75 403 126 -358 -336 365 215 140 -467 -246 29 228 -234 -210 -455
3085d55O12j3j15m83R1L68L84m76m12L19M44n2o07J71j92M13K14k48l07m09O28
3106a25L90n46m67N28J45K48l16j25j64L32K66n56Q2j10L38J77n01O4r0M08p0
3127i2R3l05R8L68K29k55l45P4L00L06n68RJ55p0J02j02j44R4jJ47n8l01m97P57
3151fL33m89o3pJ99M71m36k54J07M6L07j62p19L40K50Q7R1n11k8K99M04k91k38
3174b70k6K80L36l3m16j49J55N01l77l62K93K58j52L9k6l86M33j02K56N9l41M33
3196D03K0O5k99k11L05m3L00L0p78M41R2L50l90j94K01K53l62j84n01M07L82k35
3218E2l5m75L06M93l7m43m4K03J02J26l50m5K33j87J41P5n31M23L94j57l54p1
3240a81J13M46r9K5n5j50J6o2L88n45l2K37K69k51p8J71K39n5l96R0J51J02p9
$$ plain form
3085 -455 157 144 29 -454 -363 5 389 -87 -499 -180 264 212 -395 -224 -416 -3 211 -37 -344 -753 -125
3106 -125 265 -281 -748 -220 -75 173 -143 -268 -432 -100 166 -390 -308 -418 -80 97 -404 -340 -430 -22 -92
3127 -92 1 -304 -206 162 391 136 -209 -135 165 471 -97 -88 67 -3 99 -3 -147 -53 -54 93 35 -266 -763 -6
3151 -6 327 -162 -225 -232 -33 438 2 -252 -145 -99 208 46 -673 -333 -83 4 95 -416 -444 -145 259 -32 -270
3174 -270 -296 -16 320 287 -129 -278 -123 378 1 -361 -68 190 38 77 51 -335 98 -4 252 311 -30 403
3196 403 423 488 189 -22 283 240 540 570 -208 233 325 675 285 91 292 545 183 -1 -502 -95 287 52
3218 52 17 -458 -152 341 304 -139 -183 20 122 248 -102 -147 86 -101 40 115 -416 7 401 244 -110 -181
3240 -181 -68 378 279 304 249 99 115 53 441 -104 -136 101 370 119 41 212 451 396 0 90 241 343 264
3263B64J52q9k09N53l06j14k08L01J55j13m17K97M5o5j94K92k56m47L48J61k94
3284a44k97Q15M7j44k40j04L26k15j19K0l40L78j21N82l60m47K72J90J56k27K21
3305B49j04P5J42l27q6L70J96k82k91J96Q9O3l4j11O4L1m5K9Q5P8m65O05p8k96
3329A53r8K81k2p1kj39J08j66L28j47N9j34K4J30j1l78J73N2j1J03q7K96n00R1
3353C2J71n49J13L44j9j46m36O33K42n20P6O8N4M9r3N1J50j29K03K32j28k85K20
3376C33N7p8k42L78p3k79nL59l16o70L79K28j12J36J01K01k75k08M47k35j02k22
3398a98N70k28l65L64J43j71o87P26k32L21k20J50N5j98j70K77K84m06j35O45
3418E25k92n85P53O0m13j43K23L2k96J81J47J6l20J48K65j84j33M2K11K02l48
$$ plain form
3263 264 416 327 118 671 365 251 43 344 499 386 -31 266 311 246 52 344 88 -359 -11 150 -144
3284 -144 -441 374 421 277 37 -67 259 44 -75 -55 -395 -17 -138 444 84 -363 -91 99 255 28 249
3305 249 145 220 362 35 -51 319 515 233 -58 138 227 290 256 145 209 240 195 224 309 387 -78 527 449 153
3329 153 55 336 314 243 241 102 210 44 372 225 284 150 174 304 293 -85 88 140 129 232 145 441 -59 32
3353 32 203 -346 -233 111 92 -54 -490 143 385 -135 -59 9 63 112 19 70 220 91 294 526 398 113 333
3376 333 390 312 70 448 375 96 91 450 134 -536 -157 71 -41 95 196 397 122 -86 361 126 24 -198
3398 -198 372 144 -221 143 286 115 -572 154 -78 243 23 173 228 30 -140 137 421 15 -120 525
3418 525 233 -352 401 461 48 -95 128 160 -136 45 192 208 -112 36 301 117 -16 26 237 439 91
3439I1NL77l32l84M7J55K1J62N1k88j67L51R4P9l87J67J49l90R9K77j16k37Q2
3462i4J73K47p10L57M37q7j96Q2J93n80R8KK17l56K85K54K72q31K88K36j59lp9
3485D6o7Nn7n3M53l46j74O98l68j24q7J78J53n25J98J32pk24J39J27m18KK44P
3509f8J37m47N50l78j78M74%Q4k88P4oJ72m11J72M16o24K64L90l28m83O19j41
3531@N8K07j23j27P7l20L21L5l97K30K11J10n48M48l10L62o04J08M55o55O20r1
3553F7K36n82R3L29j03l34J20J97n7j11n7L01l11j10J53K51n13N9M41o8k84K38
3575d5k2N0l84K88L28k85k00M88j44l49J2M61j66M5L9q9q2j29M06k06q0K7J17
3598H0r6J45l3j90k11J16K49k63K8j35J31M60k72N3%l25lJ92J03J37l32m7M22
$$ plain form
3439 91 96 473 141 -243 -196 -41 -20 142 193 -95 -262 89 183 262 -125 42 191 -199 -100 177 61 -176 -94
3462 -94 79 326 -384 -27 410 323 127 209 402 -178 -80 -78 139 -217 68 322 594 -237 51 287 128 125 46
3485 46 -21 -16 -73 -126 327 -19 -193 505 137 13 -74 104 257 -268 -70 62 55 -169 -30 97 -321 -319 -75 -68
3509 -68 69 -378 172 -206 -384 90 90 174 -114 -40 -46 126 -285 -113 303 -321 -57 333 5 -478 141 0
3531 0 58 265 142 15 92 -228 93 128 -269 -39 172 282 -266 182 -128 234 -370 -262 193 -462 158 67
3553 67 303 -279 -186 143 40 -294 -174 23 -34 -145 -202 99 -212 -322 -169 82 -431 -372 69 1 -283 -45
3575 -45 -67 -17 -401 -113 215 -70 -270 218 74 -275 -263 198 32 77 116 27 -55 -184 222 16 -64 -37 80
3598 80 -16 129 96 -94 -305 -189 60 -203 -175 -310 -179 281 9 62 62 -263 -266 -74 29 166 -166 -213 209
3621B09m08L82l80J31J2k9J10L73n83J19J11N9j69J18L0J45o23kP96n99K46L3
3643H1J93j89m09M48j12J09m65L50l3R1j45K29l64J52P7q4l21L57j35O1J73k10
3665a46Q4J37j52M8j27J46j89J95k55O5K28k58L24k47J42J97j06k85L81j22J24
3686A84m09P7k1J65J46J44j53l59K60j03Ko4M39m11J94j34j00N19n37J82j10M2
3708d7J06m07j05K97K85m43M25k51o4L40ln58M94k39R0m1%J05J9n4m4M9%k18K01
3733f3kJ75j34J39L32m77j7J23L14j90j18K48l62M1Q2J05l75M17n12L42K79l06
3755D1q2M10l86k60K67n1J49j06M46o56J4L01j42O4n5o4K72j33j81J77O2k60l04
3778d77K52K31l68K27k97L37K2K88o0j98J68L3k63k6r7J17J1O6L6J34p8j99M21
$$ plain form
3621 209 -199 183 -197 -66 -54 -83 27 400 -183 -64 47 106 -63 55 85 230 -393 -395 401 -198 48 81
3643 81 274 85 -324 124 12 121 -344 6 -27 64 -81 148 -216 -64 13 -71 -392 -35 -170 -109 64 -146
3665 -146 -62 75 -77 -29 -156 -10 -199 -4 -259 -194 34 -224 100 -147 -5 192 86 -199 182 60 184
3686 184 -225 -148 -169 -4 142 286 133 -226 34 -69 -67 -131 308 -103 91 -43 -143 376 -161 21 -89 -47
3708 -47 59 -348 -453 -156 129 -314 111 -140 -204 136 133 -425 69 -170 -80 -121 -121 -16 3 -51 -95 -46 -46 -264 -63
3733 -63 -65 110 -24 115 447 -30 -47 76 390 200 82 330 -32 9 91 196 -179 238 -274 68 347 41
3755 41 -41 369 -17 -277 -10 -61 88 -18 428 -228 -214 87 -55 9 -46 -110 162 29 -152 25 87 -173 -477
3778 -477 -225 6 -362 -135 -432 -95 -73 215 155 -43 125 158 -105 -131 -228 -111 -100 -34 2 136 58 -141 280
3801B80j11Pk56J82j64m3P6qJ11k00O6j00l3K87j45J15k76P5R8p7L67l29J72j95
3825a01qJ64P8k46k10K83j21k4j20K43j99L58k33LR9j12Q8Op9%p1K36j24%J20
3850C0o5J22j83J68l59J11K84J5l08J50J1k1o4P7K53k75J49j12M09j50k77l0R5
3873C0j3l34J40M62p2J32j75j36J5j07K49k36k48J75oJ94l20r9L93o1k0l10O81
3896C34n37J12N8j72K10k19J40J32j46m4N8k92K53m3R2J47j06L2k7K3m77M10l16
3919c78M2M77k23K57l10J88l1j63J33L42k94K27l62J29m5Q0K17n06M81k31P4R9
3941B03k48J45MPk98M4J88l84j2J82j67L21N4M2k6r8J5l14L56k97J44K86mj24
3965A9K16k98J16n50k5M91L33m88K1J26k28P4J22O1l06M97M7k65j01L92k29q3
$$ plain form
3801 280 169 176 -80 102 -62 -105 -29 -37 74 -126 -60 -160 -193 94 -51 64 -212 -137 -39 -116 251 -78 94 -101
3825 -101 -109 55 133 -113 -323 -40 -161 -185 -305 -62 -261 97 -136 -133 -34 -146 -58 -52 -131 -131 -202 34 -90 -90 30
3850 30 -35 87 -96 72 -287 -176 108 123 -185 -35 -24 -45 -109 -32 221 -54 95 -17 392 242 -35 -65 30
3873 30 17 -317 -177 285 213 345 170 34 49 -58 191 -45 -293 -118 -124 70 -250 -349 44 -17 -37 -347 334
3896 334 -203 -91 -33 -205 5 -214 -74 58 -88 -132 -74 -366 -113 -156 -64 83 -23 9 -18 5 -472 -62 -378
3919 -378 -336 141 -82 175 -135 53 22 -141 -8 334 40 267 -95 34 -11 69 286 -220 261 30 104 203
3941 203 -45 100 104 111 -187 -143 45 -339 -351 -169 -336 -15 39 81 55 -43 -28 -342 14 -283 -139 147 143 19
3965 19 235 -63 53 -497 -522 -31 302 -186 -165 -39 -267 -193 -71 -10 -316 181 228 -37 -138 254 25 -58
3987e8J7M87k87j1k88K44J62l80n9K25l1j94m8N26o11K63J22p6K27k03O2l97J82
4010a26J63j12M3KJ18K9k33%K49k66p6MP5O8K85j98r8O1kj4J70l79MK92J29l49
4036a61o7M02J5ml01K69n3K0Q0l93J21PK51k2m73K97m7M25l43J21j83L08k83m5
4060e9n0M35m99M3K25n5j65K81j02k93K19p8J81k59J48K17k06J99j45j58L36l76
4082a61Q2L48l12l0J82L21m72j45K14j14l3K59J00j45m18M52l86J61J93n8j41
4103a03K83m22K73j00k22M37l62L89j78LQ1n3j15M74m12k99N42l9j90j85M77k14
4125F5j30k15j2M32k82j27L27J45k01R5k64K37j53K5J92j78L9M03j42m6k67J21
4147F4j63p3L97M6l25k42M61j22O3J0k50K43j50o9M14m25p1J58n5J76J70m28J90
$$ plain form
3987 -58 -41 446 159 148 -140 104 266 -114 -173 52 21 -173 -221 305 -306 -43 79 3 230 27 89 -308 -126
4010 -126 37 -75 -32 -30 88 117 -116 -116 133 -133 -209 -205 -130 -62 223 25 -73 -12 -14 -28 142 -237 -233 59 188 -161
4036 -161 -228 174 189 185 -116 153 100 120 200 -193 -72 -65 186 164 -309 -12 -59 366 23 144 -39 269 -14 -59
4060 -59 -109 326 -173 -130 95 40 -125 156 54 -239 -20 -98 83 -176 -28 189 -17 182 37 -121 215 -161
4082 -161 -79 269 -43 -73 109 430 -42 -187 27 -87 -120 139 239 94 -324 128 -258 -97 96 38 -103
4103 -103 180 -242 31 -69 -291 146 -216 173 -5 -2 79 26 -89 385 -27 -326 216 177 -13 -198 279 65
4125 65 -65 -280 -292 140 -142 -269 58 203 2 97 -167 70 -83 -58 134 -44 -5 398 256 210 -57 64
4147 64 -99 -172 225 271 -54 -296 165 43 106 116 -134 109 -41 -110 304 -121 -192 -34 -89 87 257 -171 19
4170A9o2K5n5O0J36j63K14j93ol56M36Q4l10n8K83k09L5L92k23L58j38l2k08j59
4194a30q5K76j38L4K56M6k80R2J37nr5j13M66j38l26j65L25j27o1P9lJ14k00J28
4218H7l90M64j21R4K03k67j99M6L29N7k27j72j22K32M6J63m35L80j02Mp9j61M8
4241a22K46l2R4R2j60q3j61L92j97K51o8j06j07J27N3j32J5J7l1Q7J35j37o1j71
4265e9N0J92j89J34j49K87k81n9J19K39j93L8J97l61K70k85J68j01o5J77Jj6l02
4288a88M4M34j82k85K49K96n98M03q1m3n5l11M82k31j75M77J41l71k59L92j71
4309c2J83r2q5k03J96j9M1qj38K00j80oJ19J92k86K47j26JK69j53j86n7J34R4
4333A05j83J92J1k43J21K0K58k81J69k19J45j82K60rk68N8j1J87J07l22M69m8
$$ plain form
4170 19 -43 -18 -73 -13 123 -40 174 -19 -25 -381 55 139 -171 -229 54 -155 -120 272 49 407 269 237 29 -130
4194 -130 -215 61 -77 -43 213 259 -21 71 208 203 108 -5 461 323 -3 -168 157 30 -31 48 45 159 -41 87
4218 87 -303 161 40 134 337 70 -129 -83 246 303 76 -96 -218 14 60 223 -212 168 66 70 -9 -170 -122
4241 -122 124 92 186 278 118 35 -126 266 69 320 252 146 39 166 219 87 102 119 88 175 310 173 112 -59
4265 -59 -9 183 -6 128 -21 266 -15 -74 45 284 91 129 326 -35 235 -50 118 17 -48 129 130 114 -188
4288 -188 -144 290 108 -177 72 368 -230 173 92 49 -6 -317 165 -66 -241 236 377 6 -253 139 -32
4309 -32 151 59 -26 -229 -33 -52 -11 -19 -157 43 -137 -143 -24 168 -118 129 3 4 273 120 -66 -123 11 105
4333 105 -78 114 125 -118 3 23 281 0 169 -50 95 -87 173 164 -104 -46 -57 130 237 -85 384 336
4355C36j81L9j24m2j36L3K80L7l15J1J54o6J47O0l13N3K52M4l21L27n48K88j94
4378a79p4L1L19j69j1J46Q9J74n29J36R4k47k48M73r6j84K09K78j79j28J70K34
4400C09k38k27l75O92q3j11K0J01J2M2k58P6K05k85L60j61R0O1j71l61L16J3m7
4423b0K91j84K81l10j57p4n7L73j28p5J41o0j37J74J0k91K68o19M68k5O9J77l04
4446a89Q7K35K27n59nJ94k46nK2o9J20j46lO6M54O1p7L1l27L31r9l50O6K06K04
4471B29j48j56NN8j24L64m34j35N33l05L25J38j71l3j51L0q5N0m7N7Rm7k01o4
4495c03K19J04jj70J65o8j23jJ42K17n40K8L30j49J34l92L06N3J58K0o1j93K61
4518A36j36q8l94K45M04j64j3k26M78j10k58J9O4j97L74K26l62k35L0Q3L93m44
$$ plain form
4355 336 155 194 70 28 -108 -75 205 242 -73 -62 92 26 173 233 -80 -27 225 269 -52 275 -273 15 -179
4378 -179 -253 -222 97 -72 -83 63 152 326 -203 -67 27 -220 -468 5 -91 -275 -66 212 33 -95 75 309
4400 309 71 -156 -531 161 78 -33 -13 88 100 142 -116 -40 165 -120 240 79 169 230 59 -302 14 27 -20
4423 -20 271 87 368 58 -99 -173 -230 143 15 -60 81 21 -116 58 68 -223 45 -574 -106 -131 -62 115 -189
4446 -189 -102 133 360 -199 -204 -10 -256 -261 -239 -308 -188 -334 -337 -271 183 244 167 198 -129 202 103 -247 -181 25 229
4471 229 81 -75 -70 -12 -136 228 -206 -341 192 -113 212 350 179 146 -5 25 -60 -10 -57 0 9 -38 -239 -303
4495 -303 -84 20 19 -151 14 -54 -177 -178 -36 181 -359 -331 -1 -150 -16 -408 -102 -49 109 129 68 -125 136
4518 136 0 -88 -482 -237 167 3 -10 -236 242 132 -126 -107 -43 -240 134 360 -2 -237 -207 -124 269 -175
4540a75K40J69j61O8l9J31m49J19o4N4l4J40j61o0k8R2O2R4qJ13j47J2k34Q4R3
4565h9J45m24K84j73L86p8l13r8M49k99L89j36j39j78J90k19K84J19L5k24J86
4586I7j22o4O6k15J86q4K11J16j85l50L01L05l69k97O37j41p1j52q8r8M28K47
4608C58n36K45j60M6J05l43J16J36J90r5k09J18J03n17J48M55l31J61j09J4K40
4629A35k03j58J56J8Pj03N5J18K8k23J24p1J82J9o5k4K7k07K33K33k48L23k10
4652A46l10M9J85K50k49k70L58k21j18J2K94j87J50rO0m08K98J20j80o6L62l33
4674f7q2K79J6j21j53p9M87L2m27J90j26p5J65Q6K58m24l2%j61L86L3R3k68K3
4698C3j45J75K8K04j49p6Q1k7k23M0Q7NR0J9k42O5K79m37K96j4J17k9j32J49p9
$$ plain form
4540 -175 65 234 73 141 102 233 -216 -97 -161 -107 -141 -1 -162 -222 -250 -158 -96 -2 -10 103 -44 -32 -266 -182 -89
4565 -89 56 -368 -84 -257 129 51 -262 -360 89 -210 179 43 -96 -274 -84 -303 -19 100 135 -89 97
4586 97 -25 -89 -23 -238 -52 -136 75 191 6 -344 -43 262 -107 -404 233 92 21 -131 -219 -317 111 358
4608 358 -178 67 -93 -47 58 -285 -169 -33 157 62 -147 -29 74 -443 -295 160 -171 -10 -119 -105 135
4629 135 -68 -226 -70 -52 -45 -148 -93 25 53 -170 -46 -117 65 84 19 -5 22 -185 48 281 33 356 146
4652 146 -164 -115 70 320 71 -199 159 -62 -180 -168 126 -61 89 80 140 -268 30 150 -30 -96 266 -67
4674 -67 -149 130 146 25 -128 -207 280 312 -115 75 -51 -126 39 125 383 -41 -73 -73 -234 152 185 278 10 33
4698 33 -112 63 91 295 146 70 151 124 -99 -59 28 33 123 142 -100 -35 244 -193 103 89 206 177 45 194 115
4723A15j92M64l19o9Q9Q4m4j58J19k60J92j50Q7P7l7m3k80L84J05k17K91k44M4
4746C8J3K80rl31L09jk60J02l77K53R5k83K25O1P5j89l0nK41j37j86J94k00r3
4770b15K59j40J43R2Jl06N2J48K47l38o9L31M8lj66j0j33K37j69L7o5j2J72j43
4794bo1L14j29J47k75j68M01l57J9L75L5J4m88K07k4k3j05J97k5Mn5m2M7n8J01
4819D9j51J54J0p8k42K12M20n27K46j09j90R4p6J88l7p5q7nL85k18R3j74L79n02
4843b41K87p4q9J75J55j93k39K10k27L14m3m77K08P8J82lJ92j45K26k75K7q3j18
4866a53J17J21j73J91j20j34N9J7P2K07k87Ll0N9J4M6l95%N71m3J8q8j83l05L61
4891e5K00j52j78J60j78L78j95j6j22J7J12J12k09J30j6K81l60k5J16j00R4m06
$$ plain form
4723 115 -77 387 68 -1 88 172 128 -30 89 -171 21 -129 -42 35 -2 -45 -325 59 164 -53 238 -6 38
4746 38 51 331 322 -9 300 299 39 141 -236 17 112 -171 54 115 190 1 -29 -34 207 70 -116 78 -122 -215
4770 -215 44 -96 47 139 140 -166 -114 34 281 -57 -126 205 253 250 84 74 -59 178 9 46 -19 -31 141 -2
4794 -2 -63 251 122 269 -6 -174 227 -130 -111 264 299 313 -175 32 8 -15 -120 77 52 56 1 -41 6 -52 49
4819 49 -102 52 62 -16 -258 -46 374 -153 93 -16 -206 -112 -188 0 -37 -112 -199 -204 181 -37 56 -118 261 -241
4843 -241 46 -28 -117 58 213 20 -219 -9 -236 78 35 -442 -234 -156 26 23 215 70 296 21 48 -35 -153
4866 -153 -36 85 -88 103 -17 -151 -92 -75 -3 204 -83 -80 -110 -51 -37 9 -386 -386 185 142 160 72 -111 -416 -55
4891 -55 145 -7 -185 -25 -203 175 -20 -36 -158 -141 -29 83 -126 4 -12 269 -91 -116 0 -100 -6 -412
4913d12L12R5q5K3K28m00M2J30m3j36j04P4K82j28J58K8j71R8L34k43j84M3j34
4936a93J62m0J13n5J30k10M1j38j6J33K38p7j83k54M62j25j41j93J87J56q1n6
4958a40K84l62J58J15j47R5q6KN0M3p6Q3j49O5J96J6m57L32j22J13K16k87J86
4981A28k7k38k2j18K21m8k9j38K68j32n5K86l03J73m60M99P0j50k45L74N6k29
5003a19j20K39J35k49L30l81l5J03k9K87O3l81J63Q1j18J70k78O6J84j55o9j96
5025c09L15q3N7k45L42L0o4j77J00j99L90p3r5K42k05q7O97m63m08K90R6j82n54
5048e85M62p1J02lQ1j95J17K97o21N04q0k10Q1n1N8k01M3M34k12m2M6K1M6K54
5072B75j5l39J67pJ11j78k99L74J91m10L03j67j58J20N6J61O1l47j99K14n1K11
$$ plain form
4913 -412 -100 -5 -90 -67 161 -239 -197 -67 -110 -246 -350 -276 6 -122 36 64 -107 -9 325 82 -102 -59 -193
4936 -193 -31 -71 42 -13 117 -93 -52 -190 -206 -73 165 88 -95 -349 113 -12 -153 -346 -159 -3 -84 -140
4958 -140 144 -218 -60 55 -92 3 -83 -81 -31 12 -64 19 -130 -65 131 147 -310 22 -100 13 229 -58 128
4981 128 101 -137 -159 -277 -56 -104 -133 -271 -3 -135 -190 96 -207 -34 -494 5 75 -75 -320 54 110 -119
5003 -119 -239 0 135 -114 216 -165 -200 -97 -126 161 224 -157 6 87 -31 139 -139 -73 111 -44 -113 -309
5025 -309 6 -77 -20 -265 77 107 43 -134 -34 -233 157 84 -11 231 26 -61 636 173 -235 55 151 -31 -585
5048 -585 -123 -194 -92 -95 -14 -209 -92 205 -416 88 8 -202 -121 -172 -114 -315 -272 162 -50 -92 -46 -25 21 275
5072 275 260 -79 88 81 192 14 -285 89 280 -130 173 6 -152 -32 24 185 246 -101 -300 -86 -137 74
5094G4O9l68M53M6k56J0k0M3m5K59l54P8L21l09K67k82N0p0O6j02k25J60J30J7
5118A2r2L2J72l17J23k97N73l9m0J79j81Rj87j10J61J25K0k83K40j34K2q7J14
5141A5j24J85L14m03J82m9l56J83j08K08q6K17M9j61L15l40J52j41j44KP0M4r4
5164g0J3O8k10J39j32OL27j44PL2j84J29j35J64l4m9k13N23j00q6J82L4K35k49
5188B53j89j0N9J03M8j29J46k96J43k32K46l04K05Kj7O3r4J40o9j16j37J47P4
5211C6J79j09J05j47N6L2o3m9k18J70j17J74J48k55qlK27l45K2J03o4K62k40P6
5235b8r7K06J7J83k58k00M68k06j01r0N3K06k23K52k73k35K75K87k46j18m0Q9
5257g9J00m2J33J38l88L53j44k24J06q0O4K57j03k79M40o47L18J7J46j90K42j04
$$ plain form
5094 74 143 -225 228 274 18 28 8 51 6 265 -89 -11 310 1 268 -14 36 -34 32 -70 -295 -135 -5 12
5118 12 -80 -48 124 -193 -70 -367 206 167 127 306 125 134 -53 -163 -2 123 143 -140 100 -34 -12 -99 15
5141 15 -109 76 390 -13 169 120 -236 -53 -161 47 -39 178 227 66 381 41 193 52 -92 -90 -20 24 -70
5164 -70 -57 11 -199 -60 -192 -186 141 -3 4 36 -148 -19 -154 10 -24 -73 -286 237 137 51 233 267 502 253
5188 253 64 54 113 216 264 135 281 -15 128 -104 142 -162 43 45 28 91 -3 137 68 -48 -185 -38 36
5211 36 215 106 211 64 120 152 89 40 -178 -8 -125 49 197 -58 -66 -69 158 -187 -165 -62 -126 136 -104 -28
5235 -28 -125 81 98 281 23 -177 291 85 -16 -106 -53 153 -70 182 -91 -326 -51 236 -10 -128 -168 -79
5257 -79 21 -21 112 250 -138 215 71 -153 -47 -127 -63 194 91 -188 252 -395 -77 -60 86 -104 138 34
5279C4n9m6pK36k61J23k71M03j07J6l37K17k9j3M63k46k16K39K1j14l1j6j10P9
5303c2K25k63N2l90L33K27l07J78j26J13J38l93L52pK9K9k32k26K65K72l42j79
5325b84J11J4K92K41n85K47l00K85L87p07k7J73M24m26J51j49M7q0K48j19j1L3
5347c5r0P2j27N0L54n32M17K2j52k93M35k66k1l7J61Q4K26k46J04j08k13L95k19
5370a9n6j1L48m41N4J51j62K27l68M49j61q0M30l80R9j30k42L39rk33Q3L38m20
5393a94M74o35N19M4m14L36k24j1k00M12j8k19J19l31J66L01l64J08L03KN1r8
5415A27J49n39L15m2J23l46JN41n24Q3L17k34k82M25j21k30K65J58Q1l06JJ12
5437G4k49q7N25k64p4l4J16k33M4j85K26j94K36K01k1j53o9J4N2J14k73M26J5
$$ plain form
5279 34 -25 -71 -78 158 -103 20 -251 152 45 61 -276 -59 -88 -101 362 116 -100 139 160 46 15 -1 -111 -32
5303 -32 193 -70 -18 -408 -75 152 -155 23 -103 10 148 -245 107 100 129 158 -74 -300 -35 237 -105 -284
5325 -284 -173 -159 133 374 -211 36 -264 21 408 -299 -326 -153 271 -155 -4 -153 -106 -186 62 -57 -68 -35
5347 -35 -125 -53 -180 -130 224 -308 109 131 -21 -314 121 -145 -166 -203 -42 42 268 22 126 18 -195 200 -19
5370 -19 -75 -86 262 -179 -125 26 -136 91 -277 172 11 -69 361 -19 80 -50 -292 47 38 -195 -112 226 -194
5393 -194 280 -355 164 208 -206 130 -94 -105 -305 107 89 -130 -11 -342 -176 125 -239 -131 172 174 225 127
5415 127 276 -263 52 10 133 -213 -212 329 -195 -112 205 -29 -311 114 -7 -237 28 186 267 -39 -38 74
5437 74 -175 -262 263 -1 -75 -109 7 -226 -182 -367 -141 -335 -99 102 81 -72 -141 -127 -75 39 -234 192 207
5460B07m53L61p3k36L16k02o1J19M1r2J03q1j22K02O7p1K9j5o6K72l45P3J08M6
5484A27o8j0K9q7k7J14l36K12j30P7l1J38J35l13K74p9P0l42L4J64J71l69j14
5507c61O05o6k76K60k13N8k63N4L23l71Q8K91m7k9j64J66j74P4O8L32k6l30J48
5530A47j30j65J69j48J46r8K2K2R6j76M3L49l70K25L05k52k77L79K10n84O8j08
5552a27M7J60j84K15M4j69J17j18j6j09M48n5j85P6k23Q9J99L1n83M18j84N43
5574D34l76Q0n3N2N9l37J91J12j95O2J97l04Q3J51J9l95j9J87L49p7L4m00J17
5597b9M31k60n8M4j05k41J28j0j34K8J42J99j60M0L23m64J90J57m87K93K29k13
5619D3r7k2N9k82Q84p03K58m54L49m3k08M45l11J42J73k42K47l98L55j50k09K33
$$ plain form
5460 207 -246 115 42 -194 122 -80 -141 -22 19 -73 30 -51 -173 29 96 25 54 39 -27 245 -100 -27 81 127
5484 127 59 49 78 -9 -36 78 -258 -46 -176 -99 -130 8 143 -170 104 25 95 -247 -213 -49 122 -247 -361
5507 -361 244 178 -98 162 -51 7 -256 -202 121 -250 -162 129 82 53 -111 55 -119 -45 23 355 329 -1 147
5530 147 17 -148 21 -127 19 -79 -57 -35 61 -115 -72 277 -93 132 437 185 -92 287 497 -87 -19 -127
5552 -127 -80 80 -104 111 155 -14 103 -15 -31 -140 308 253 68 144 -79 10 209 240 -343 75 -109 434
5574 434 58 138 85 137 196 -141 50 162 -33 29 226 -78 5 156 175 -220 -239 -52 297 220 254 -146 -29
5597 -29 402 142 84 128 23 -218 -90 -100 -234 -206 -64 135 -25 15 338 -126 64 221 -266 27 256 43
5619 43 -54 -76 -17 -299 585 -118 140 -314 35 -8 -216 229 -82 60 233 -9 238 -160 195 45 -164 69
5641F9j72O5K92j93j70oJ31l1k3L1n4j88K60L81k96k19J86j20O9r0P0j39k75O24
5665B02k15J29k12k80O15l03p6K07q9J52J9k03k70K30K90k34rl4Lj36P3J38j2
5688a5o9l4J46K00j61J34r3j74N8k30K31K50n9j20m5J85k19jk19J43L69j92j69
5711h4L05J4l58K77l02n8N85o6k07l17j34M17k68K49P5j16J5k31L19j46q9J48
5733B8L9j70J71j22P3K10k06j57P0P4j98M60l07J2j4P8p7K66j75J8k13J59J36
5756A55p9k73OJ09J62j20n1J9M15k75K1j80J30j46L2J49l94K58k25M83k84j94
5778b82J06L01j26J80j69Mj81P8K5R6J7l78J84k86M30j75L69L7j62Q8k48L08k89
5801g3r3K55j34R2j01j7K11j7l44J10r7J16j19K15q5L61j15l12J82L6k06RQ2j24
$$ plain form
5641 69 -103 -38 254 61 -109 -115 16 -15 -38 -7 -61 -249 11 392 96 -123 63 -57 12 -78 -8 -147 -422 202
5665 202 -13 116 -96 -376 239 -64 -140 67 -22 130 149 -54 -324 -94 196 -38 -47 -81 -78 -214 -141 -3 -15
5688 -15 -84 -118 28 228 67 201 108 -66 -8 -238 -7 243 184 64 19 204 -15 -16 -235 -92 277 85 -84
5711 -84 221 235 -123 154 -148 -206 379 313 106 -211 -345 72 -196 53 128 12 27 -204 115 -31 -120 28
5733 28 67 -103 68 -54 19 229 23 -134 -64 10 -188 272 -35 -23 -37 41 -36 230 55 73 -140 19 155
5756 155 76 -197 -191 -82 80 -40 -91 -72 343 68 89 -91 39 -107 -75 74 -320 -62 -287 196 -88 -282
5778 -282 -176 125 -1 179 10 14 -167 -89 -64 32 49 -329 -145 -431 -1 -176 193 230 68 156 -92 216 -73
5801 -73 -166 89 -45 47 -54 -71 140 123 -221 -111 -208 -92 -211 4 -81 280 165 -147 35 71 -135 -126 -44 -168
5825a68K45l01M18m03L99k35M0Q4l31J88J82j13k01L34m5j9N3J55m51M85l32o
5847b2K1j40q4K50L2Pq6J69j25m2k75J49L9J96j2or6o6K76k43j51L93N5P2j67
5872A44k70P3Ol51O24l66J45j33j23P2J48k7P8m7R0J86n68M1L85j16l1j5J10j26
5896g1l2j52J71L62l06m8o5o7L83k8j38j15Q8jJ36m08K20N2j26K23n9P7j94j58
5920b56L7K55j37J97j94J07J26m72L88K6M7l09n8J27L94k86J54j66r8J13k00L61
5942A56j49k08K88O2n3j19J42k29qr5K15k59Q6q3M18l51J71j2k4J61j82k2K68
5965A73k17J8N35l86k59M7P7K52l77J45p0J27M9k93N71j38M3k08o1k40L96k35
5987e1M44m94L03j33j58n3K3R7K76k77j49L60k67j78K88l48l0M45m4M6L56m19
$$ plain form
5825 -168 77 -224 194 -209 190 -45 -5 79 -252 -64 118 5 -196 138 93 74 127 282 -169 316 -16 -22
5847 -22 -1 -141 -225 25 57 64 -22 147 22 -20 -295 -146 -107 89 77 71 -25 -91 185 -58 -209 184 239 311 144
5872 144 -126 -53 -47 -398 226 -140 5 -128 -251 -179 -31 -58 20 -27 63 249 -319 -278 107 -9 -40 -55 55 -71
5896 -71 -103 -255 -84 278 -28 -76 -141 -208 175 147 9 -106 -18 -19 117 -291 -71 -19 -145 78 19 96 -98 -256
5920 -256 -219 36 -101 96 -98 9 135 -337 51 77 124 -185 -243 -116 278 -8 146 -20 -118 -5 -205 156
5942 156 7 -201 87 149 96 -23 119 -110 -118 -213 2 -257 -171 -254 164 -187 -16 -28 -52 109 -73 -95 173
5965 173 -44 -26 509 123 -136 -89 -12 240 -137 8 -62 65 114 -179 392 254 297 89 28 -212 184 -51
5987 -51 393 -101 202 69 -89 -142 -119 -22 254 -23 -172 188 -79 -257 31 -317 -347 98 54 100 456 37
6009C7K25j97k13K74l10J7q7M28k69N16l08r2L79n71K82r1J40r9p6K51m90J79
6031g5J25Q3J74m52J62k7k09J04P4k1L08k86r1j53L42ll6Q2l18kL61m1qL7k8l3
6057F9q2J5j91O7l3J24L24k27k14L63m54J60J6m8k10N25m54K53k02M88j73J19
6079B35P0k36J96l88j31J33K5P9Q3k74K42l64M25j47J59k7k25M03m30R3J86j6
6101I1j17K1J9np4J47m5Lr8l4K01k07k2Q2p2L34l45O6L48q5n7O2k06K37n31K00
6127h7J68k0j62JJ43q0J6qK20l41M8J9K39k81M29m00K6j49L64J16j39j95O4PQ9
6152H7K16j62k51O8q1K35k6j68j19K86L3O7r4j74J34q6Q9R5M9l14N0j57j8K79
6176C8j90Q2p6K23o0j7J38l08L35Om80L75q1K45j56K13k14j49J9K00Km19L40J31
$$ plain form
6009 37 262 65 -148 126 -184 -167 -254 174 -95 421 113 21 400 -171 111 20 160 61 -15 236 -254 -75
6031 -75 50 133 307 -145 17 -10 -219 -115 -41 -62 246 -40 -131 -284 58 55 19 101 -217 -219 142 101 93 130 102 69
6057 69 -13 2 -189 -122 -155 -31 293 66 -148 215 -239 -79 -63 -111 -321 204 -250 3 -199 289 116 235
6079 235 305 69 265 -123 -254 -121 -96 -17 66 -208 34 -330 95 -52 107 80 -145 258 -172 -79 107 91
6101 91 -26 -5 14 9 -65 82 37 40 -58 -92 109 -98 -120 -38 -110 224 -121 -55 293 208 151 213 7 244 -287 -87
6127 -87 81 61 -101 -100 43 -37 -21 -29 191 -150 -102 -83 156 -125 304 -96 -70 -219 145 261 122 -73 -9 -2 87
6152 87 303 141 -110 -42 -123 112 86 -82 -201 85 118 185 91 -83 51 -35 54 149 198 -116 -66 -223 -241 38
6176 38 -152 -70 -146 77 17 0 138 -170 165 171 -309 66 -15 230 74 287 73 -76 -57 143 145 -274 66 197
6200A97k99J8m0j63K43LK80m83M96l20q6K53j6j11j39j61M45K9j99Q3j96L86j26
6223I4L9j04J44k62M21j28r9k85N4J8K70l24L18O5k62j92M92j21j68j46J91o8
6245e3L40n52P6K35n8K20j67RJ39l46J19J07k24J98k54K71j69J69j85L44l12J76
6267H3o9M95n43L8q0K68l29L77o6k03n2j46K16j38k94L29k9J36L35n04M09J19
6289C52k62k85j17L16j50R7K83k54Q1j69J44K1L8N9o82P50k33K18k23L64o93N10
6311A65J50j78Rq7N1j83k12J52N24n51J05R1rJ39l35M08l56J21L61l95K8J58L5
6334A91r1O8m43M59P8k97o9L6k5K13mj36Q7j6j30J66m7o1K62k53n7j39L26r3q
6359A7n2N2j29K84o9J18j20L02o55N20j87j39L14m75N56n67K5J81L5J79j22K67
$$ plain form
6200 197 -102 -84 -124 -287 -44 -41 239 -244 252 -68 -154 99 83 -28 -167 -328 117 146 -53 30 -166 220 94
6223 94 133 29 173 -89 332 204 105 -180 -126 -108 162 -162 156 221 -41 -233 259 138 -30 -176 15 -53
6245 -53 287 -265 -189 46 -12 208 41 50 189 -157 -38 69 -155 43 -211 60 -109 60 -125 219 -93 83
6267 83 14 509 -34 4 -76 192 -137 240 174 -29 -81 -227 -11 -149 -443 -114 -143 -7 328 -176 233 352
6289 352 90 -195 -312 4 -146 -49 234 -20 61 -108 36 57 95 154 -528 222 -11 207 -16 348 -345 165
6311 165 315 137 146 59 110 -73 -285 -133 391 -160 -55 36 27 166 -169 239 -117 4 365 -30 -2 156 191
6334 191 100 168 -275 184 262 -35 -104 -68 -93 120 116 -20 67 51 -79 87 40 -21 241 -12 -69 -208 118 25 17
6359 17 -35 17 -112 172 103 221 101 403 -252 268 81 -58 256 -219 337 -230 -205 -24 11 190 68 335
6381C35l57m1j34K21j55P7k73N75l41j28K94n5k6j29k95L70J05J3l05J30J50k2
6403IJ7l8J99m48P7K8J5J1K93lo3k80K61LJ45J94p5m20Q6J2j01j45J09r6R6L0
6429h4Q2k94K98LJ57k01j20K36J12r0n3j15J49K51j20l16L9j8j41J44p7L65l76
6452a69K08J40O8m6o14K48J30P9N3l43L50j23P0J69l87J25K95l4j9Ll11J18j32
6475a22K18q1J43j24K13l11L31j98J1j51M28L8l59J26m80K27j51M17R1j82j92
6496a08J63j32J20q7K01m72M72m73Q8L80j56n4j04K74M1k04J91m9q6L30m97L02
6518A40J64l41k35M73k12k21N64m31K01L2j12l2p4J98J20j22k14K90l69K80l62
6539b63M69KK9k50J76j83J20mo8J49j48l0Q7j4o6J4k86O33k93mM7j19k48J53L09
$$ plain form
6381 335 -22 -63 -197 24 -131 -54 -327 248 -93 -221 73 18 -8 -137 -432 -62 43 56 -249 -119 31 9
6403 9 26 -12 187 -261 -184 -156 -141 -130 163 160 97 -183 78 81 226 420 345 -75 11 23 -78 -223 -114 -210 -114 -84
6429 -84 -2 -296 2 5 162 -39 -159 77 189 99 46 -69 80 331 211 -105 -66 -84 -225 -81 -158 207 -169
6452 -169 39 179 247 201 -413 -165 -35 44 97 -246 104 -19 51 220 -167 -42 253 219 200 203 -108 10 -122
6475 -122 96 15 158 34 247 -64 267 69 80 -71 357 395 36 162 -318 -91 -242 175 266 84 -108
6496 -108 55 -77 43 -44 157 -315 157 -316 -228 152 -4 -58 -162 112 153 -51 140 91 5 335 -162 140
6518 140 304 -37 -272 201 -11 -232 332 -99 102 134 22 -10 -84 114 234 112 -102 188 -181 99 -263
6539 -263 206 208 237 -13 163 -20 100 96 28 177 29 -1 86 72 6 20 -266 367 74 70 117 -2 -250 -97 212
6564B12k76J40o1O1p1L00o06L77l1j10K07j36J29l6p4j55m2K77l56K76M0k2k29
6587a86K34k05J23K72j05rJ53j79k01J12l6N35k44l41K4M6r6J46n5j27O51n84
6609g2L9R3j1J08k00Q4K4L19j18l81J24j35K17j52l6J68o0Q9j06OJ22P0l76K97
6633A13Lk19J54k90L22Q3M8j59p5lJ78p4k97K87J99k40l8J16l76L82j55L53k17
6656I5K6l70k2L69k90K81K67n28M75l50RlL4N0k47K82m1q2K53l28J62j58L28J31
6680C43j23m04Q0k3L28n32O11k05m13M71j06K5k0M7J52k91j84J33m7L55j22r2
6702a7m2r4JP1M46j57l72j1P8K29j90K21k04L9j39L11l97J64o5L07k59K73j67
6725B6o7J52k56J57j89m2J97J78m3l44M65m0j57l18L14J21j43K4k28N79j98l58
$$ plain form
6564 212 -64 76 15 76 5 305 -301 76 45 -65 142 6 135 99 25 -130 -172 105 -251 25 65 43 -186
6587 -186 48 -157 -34 238 133 124 277 98 -103 9 -27 508 264 -77 -53 -7 -103 43 -12 -139 512 -72
6609 -72 -33 60 49 157 -43 41 65 384 266 -115 9 -126 91 -61 -97 71 11 100 -6 0 122 192 -184 113
6633 113 116 -103 51 -239 83 166 214 55 -20 -23 155 81 -216 71 270 30 -8 108 -268 114 -41 312 95
6656 95 121 -249 -271 98 -192 89 356 -172 303 -47 -38 -41 -7 43 -204 78 37 -45 208 -120 42 -116 212 343
6680 343 220 -184 -104 -127 201 -331 280 75 -338 133 27 52 32 79 231 -60 -244 -111 -158 197 75 -17
6702 -17 -59 -153 -152 -81 365 208 -164 -175 -97 132 -58 163 -41 -2 -141 170 -227 -63 -128 179 -80 193 26
6725 26 -41 111 -145 12 -177 -219 -22 156 113 -231 234 194 37 -281 33 154 11 35 -193 386 188 -170
6747a70n4L47q7k05L57k48j17J51J37l0J94l14L07k50m3M2N1j31J2k21p7O0L75
6770H6%j64J82l00Q4j0j58K90Pj05k44M48o8J05l14J50j00L01j34k4M0j62k22
6793c12L30j8j16o8K69J7r3j57J20q4J53j04M1J43l24J99j91M54l01J77J59n3
6815B41j83j60J01L7L4k29m5L07k30J20l88K29Q8j63K20O8l5j05J8J56j05p8L13
6838B11j23o8P7j03j12K19N5J16k33J3J05k07j65N0J68K74m15K54o9j09Mk6J39
6861E5j36L66k64L37l50pN4J64k18rK26m03K02j41K41j76N8Lj40L14l39J62K36
6884B35k69L3P7j37j07K17J21J55j84k12M6k26L78J50m53K24K93j43q2j23M0j36
6906a03J41K7K1j96J26P4K19l66j50L97K57l66oj84J55M65p39L41j09o9J1J25
$$ plain form
6747 -170 -224 123 36 -169 188 -60 -177 -26 111 81 275 -39 268 18 -25 17 68 -63 -51 -272 -349 -289 86
6770 86 86 -78 104 -196 -112 -122 -280 10 17 -88 -332 116 48 153 -161 -11 -111 190 56 32 72 -90 -312
6793 -312 18 0 -116 -184 85 102 9 -148 -28 -112 41 -63 -22 121 -203 -4 -195 259 -42 135 294 241
6815 241 58 -102 -1 36 70 -159 -204 103 -127 -7 -395 -166 -78 -241 -21 47 12 -93 -75 81 -24 -102 211
6838 211 88 20 97 -6 -118 101 156 272 39 52 157 -50 -215 -165 3 277 -138 116 47 -62 -58 -84 55
6861 55 -81 285 21 358 8 1 55 219 1 -8 218 -185 17 -124 117 -59 -1 2 -138 176 -163 -1 235
6884 235 -34 -1 76 -61 -168 49 170 325 141 -71 -25 -251 127 277 -176 48 341 198 116 -7 33 -103
6906 -103 38 65 86 -110 16 90 309 -57 -207 190 447 81 75 -109 46 511 -228 113 4 -65 -54 71
6928G1k74o1K28q8K73k11M03l70K77k32N8k1k87J6K27O5J01j93k17J58J80l83
6950b80j9J76K14j37Nj07l3J53r2K05l94L09j06J87o2K49k54ok60O00n32J16J46
6973G8N4R5j91r4J76k00K81k3j73r4m4J38j8P1J10k80j5k26L38L0k96K32L96m82
6997a37k7L5J32m6j18k3P9J70m4ok18L34j11L1k24L53l3j38m0j88K23K07k41M9
7021A9o2m5J30Q6l73L8M45k15K40n48J79K71m53M36j32o0o2k44K41L30K75k52
7043B44n28L28L36l54J01J37j62l69O3L1K83M5m18K44L0L8pk07O8L14k26j97N6
7066a50J09l0j3J41j6j97J66j90K11K1K04k26k38L30k42K47j19J08J46m25k01
7087c64M59K13k15J22j62j62l6J08L00j74m65M43p7k08K52J14j06k40M71n03K00
$$ plain form
6928 71 -203 -264 -36 -124 149 -62 341 -29 248 16 74 53 -234 -218 9 74 175 -18 -235 -77 103 -280
6950 -280 -299 -123 91 -46 -41 -148 -181 -28 -120 85 -309 0 -106 81 19 268 14 8 -252 348 -184 -68 78
6973 78 132 227 36 -58 118 -82 199 176 3 -91 -135 3 -15 56 166 -114 -129 -355 -17 13 -283 -51 345 -137
6997 -137 -164 -129 3 -43 -161 -184 -105 65 21 15 -203 131 20 51 -173 180 147 9 -31 -219 4 211 -30 19
7021 19 -43 -88 42 128 -245 -207 238 23 263 -285 -106 165 -288 148 16 -44 -106 -350 -109 221 496 244
7043 244 -284 44 380 26 127 264 102 -267 -204 -173 110 155 -263 -19 11 49 42 -165 -97 217 -9 -206 -150
7066 -150 -41 -71 -84 57 41 -156 10 -180 31 52 256 30 -208 122 -120 127 8 116 262 -163 -364
7087 -364 95 308 93 215 53 -109 -145 -37 263 89 -376 67 -10 -218 34 148 42 -198 273 -230 -30
7108c0K27o6K2k20j09N6J25r5K79j54k29J43l2L27o14L27J2O6N4N6n9j95k8K06
7132F9j18J14o6M0j64J67N0P9k10R1j66J76j54j16K85o7j8j96K2L24k49K3L88
7155C04j52o6J45k5l57%L2J34J42o4p9J47N0l20O9m6L49k12N1j69j8n4J35M33
7179D29m75J07j74l6J97j74L99r1J26K3l78K06q1lk1j73j15K27p9J30m9K35l14
7202h4r8r1K02J06L0j19J51J3j32K06j50l30J37K54j33k65K96pq2J79j37J81j90
7225f3K84k63k36L10k12J02J73p1L0o3k23J66K03j98p3O3m4J26r0j03P8J38o2
7248b8k11L15k69L75jn55M04j30p8L72l34J63N1j3Kk64R8K55k99K73K01j60K04
7271C71m40n4K1Q4o3K8J41j16j33L10o9O3q6Q4k37L68q7k83J22J95j56j72J21
$$ plain form
7108 -30 197 131 153 -67 -176 -120 5 -90 189 35 -194 -51 -83 244 -370 -43 -31 35 89 145 86 -109 -137 69
7132 69 -49 65 -1 39 -125 42 92 171 -39 52 -114 62 -92 -208 77 10 -8 -204 -182 142 -107 -84 304
7155 304 152 86 231 206 -151 -151 -119 15 157 93 14 161 211 -109 -40 -86 263 51 102 -67 -85 -139 -4 429
7179 429 -46 61 -113 -149 48 -126 273 182 308 331 -47 159 78 75 54 -119 -234 -7 -86 44 -5 230 -84
7202 -84 -182 -273 -71 35 65 -54 97 110 -22 184 34 -296 -159 95 -38 -303 -7 -14 -96 83 -54 127 -63
7225 -63 221 -42 -278 32 -180 -78 95 24 54 -9 -232 -66 137 -61 -134 -71 -115 11 -79 -182 -104 34 -28
7248 -28 -239 76 -193 182 181 -374 30 -100 -178 194 -140 23 74 61 63 -201 -103 152 -147 126 327 167 371
7271 371 -69 -123 -102 -18 -81 -53 88 -28 -161 149 80 143 57 141 -96 272 185 -98 24 219 63 -109 12
7294A2k64J46j19K53K29l50J28K15j48L6r8j58J12r0m2L58k26JK5j44r8P3k63
7317d12L73j7l97O93k31j04J80n1J09l18L89l40L97o5j85j59L35J37j50n65N65
7338A84K6n79M5M03P5k3j88J40k2j44k5J33r9K88p0j41K8J13j32k39k8J36J90
7361G1R6j86q1L22k66L5J93m74M90k40l3J67l25J30R5M3k04L44k24J21j67J87
7383I4k12K88k43M5R6m65N89j98j35K95k91J90J20m4kq0r8J13L4j36k28M43m40
7406b65K01J92l54J27L9j7K34J4l6p6l1K73k72k7P5LJ02m06K81k38K12j59p6J95
7430iJ92N4k28l05l1K39k5J59p8L31k89O2L2j53M4j3J54l3M6p9M3j7L2L0l30K74
7456A02j72N7O2k62L43j04l3N2j69M27l51JK75r7k24K96k40L16k47J09J01l37
$$ plain form
7294 12 -252 -106 -225 28 257 -93 35 250 102 138 40 -118 -6 -96 -138 220 -6 -5 20 -124 -222 -149 -412
7317 -412 -39 -56 -453 240 9 -95 85 34 143 -175 214 -126 271 206 21 -138 197 334 184 -381 184
7338 184 210 -369 -324 79 154 131 -57 83 61 -83 -108 25 -74 214 144 3 31 144 12 -227 -255 -119 71
7361 71 167 -19 -100 222 -44 -9 184 -290 200 -40 -73 94 -231 -101 -6 37 -167 177 -47 74 -93 94
7383 94 -118 170 -73 -28 68 -397 192 -6 -141 154 -137 53 173 129 127 47 -51 62 96 -40 -268 175 -265
7406 -265 -64 128 -226 -99 -60 -77 157 171 135 59 28 301 29 2 77 80 182 -224 57 -181 31 -128 -204 -9
7430 -9 183 237 9 -296 -327 -88 -113 46 -32 299 10 72 104 -49 -5 -18 136 103 149 70 113 96 128 158 -172 102
7456 102 -70 -13 49 -213 130 26 -7 45 -124 303 -48 -47 228 131 -93 203 -37 279 32 141 242 -95
7478i5N14n49L20l14J46R4j85J05k19M4n9K42j66k71M67j43Rj95J63N5L00l51
7500h8Q3J52k26k5J30l4J16j04k98J52R4R9k99M58m47j6K15K59m71K11r2M80k6
7523C23j26k74QK54k47O6j11Kj22L72j82O0N5M5r6Jj90K35k41M87k40J07j11k2
7547E3P9j91J01K27j29L3j69K0p7j22N5N5M3O8n5J4m0j5r7K5mj3q5L27R3j18j42
7574f4Q9k63M4P8L43j48L2L8m56J53M0j50K92k85o7L97o0L33n30K35K52n66L05
7597D2R4l00J43N7r5J16k53J4J50L8j38K97j35l3J70l8Ql27L55q6j87K40k40M8
7621f0Kj30K11k12J35O8q5M82l21j79m4J90l96M04N6j69K60n82L93M5L6j23k5
7644d4qJ79j15l9J10j73r0L62k11j69K75p5L3j30J54j68j33L21n8j35R2Rm4j05
$$ plain form
7478 -95 419 -130 190 -124 22 116 -69 36 -183 -139 -198 44 -122 -393 74 -69 -60 -255 -92 -37 263 -88
7500 -88 -5 147 -79 -104 26 -8 108 4 -294 -142 -48 51 -248 210 -237 -253 -38 221 -250 -39 -131 349 323
7523 323 197 -77 -69 185 -62 4 -107 -105 -227 145 -37 23 78 123 27 28 -162 73 -168 319 79 186 75 53
7547 53 132 -59 42 269 140 173 4 24 -53 -175 -120 -65 -22 46 -9 5 -35 -50 -147 -122 -126 -139 -224 103 196 78 -64
7574 -64 25 -238 -194 -116 227 79 111 149 -307 -154 -114 -264 28 -257 -324 73 13 346 -184 51 303 -263 42
7597 42 136 -164 -21 36 -59 57 -196 -182 -32 6 -132 165 30 -3 167 129 137 -190 165 79 -108 132 -108 -60
7621 -60 -58 -188 23 -189 -54 14 -71 411 90 -89 -133 57 -339 65 121 -48 212 -370 23 68 104 -19 -44
7644 -44 -52 127 12 -27 83 -90 -180 182 -29 -198 77 2 35 -95 59 -109 -242 79 21 -114 -22 -13 -57 -162
7668a62P9j30K78Nj79L2J03J31m14K54J59n2P6l01L82j26J60n37J41rJ07q0K43
7691A60k22j6j46J9N61o16K98J57m2k43J35Oj94L09J92j44j25j25R0N6k18M48
7713C40l60k06L78k40J44o6j6N7j84P9K2j35J58k58L04J9K66k64r7J54k33J50
7735A2l9J08Pj92L44k80J49m17L13K30k52K60m67J65J35k96L85K04k55l94M21
7756A41Kj32j72L9K60K9l3K71n21j66K89K16j38p7P3j07L16k41m4o9k00L51j01
7779a4QL0n5n7k59N34k25l22L81p4J08j00j56K71j91m4J48l47O3K74j65L14j87
7802f5K25j94O5K97Q9l50k28oj10j8N46m32o2j8J84n2Q9l8J52M2l1j09k41L66
7826A01k8j82J84l96M02P4q5Or5o4J72J6n1l3j95J37J30J7j83K25M2l08L54k18
$$ plain form
7668 -162 -83 -213 65 70 -109 -77 26 157 -257 -3 156 104 180 -121 261 135 295 -242 -101 -110 -3 -83 160
7691 160 -62 -78 -224 -205 356 -260 38 195 153 -90 45 51 -143 166 358 214 89 -36 54 110 -108 340
7713 340 -20 -226 152 -88 56 -10 -26 31 -153 -74 -52 -187 -29 -287 17 36 302 38 -59 95 -138 12
7735 12 -27 81 88 -104 240 -40 109 -308 5 235 -17 243 -224 -59 76 -220 165 369 114 -280 141
7756 141 143 11 -161 -122 138 167 134 405 -116 -282 7 223 85 8 81 -26 290 49 5 -64 -264 87 -14
7779 -14 -6 24 -31 -88 -347 187 -38 -360 21 -53 55 -45 -201 70 -121 -165 -17 -364 -301 -27 -192 122 -65
7802 -65 160 -34 31 328 417 67 -161 -167 -277 -295 251 -181 -243 -261 -77 -129 -40 -78 74 116 85 -24 -265 101
7826 101 73 -109 75 -321 81 155 70 76 -19 -83 89 105 54 21 -174 -37 93 110 -73 152 194 -114 240 22
7850B2r2O9k35j39L55R4j00J14j15j87k5N0J74J60k33j6j58L76p9K05q5l82J10
7873a17K85j07l04M19m08L50K5K9k00J10k64J64j52J47J79k19K16k05J37q0j21
7894a16n8M05k98k7j00L99l09K16J70j84k22J33J52m32N51q7k25j48L06j46j72
7915a92M53j93m73L86J05j4l7K17j81P2K5J02p4l09N2m5J54n1J05J26l8k07l3
7938e0pK39j00n6l74N52j68N7k33K18Q7Q9k89J38n5k32L10J56m90j84K88L32l73
7961a45M84o11J19K65l5J39l26pJ76l2j72K25Kr2m9J39j50P2J22p0K29j72j52
7984d1J35j95J65p1K91l80O2J41j2K75k60p0j39k84O53l23j4j0q5r6J33M55l94
8007f4q3P6J06N0K08l35j51J44j32K18j35J62J75l30O9k13O8K49L4j79L4j8K17
$$ plain form
7850 22 -70 -1 -236 -375 -20 74 -26 88 -27 -214 -239 -189 -15 145 -88 -104 -262 114 35 240 155 -227 -117
7873 -117 168 61 -243 176 -232 118 143 172 -28 82 -182 -18 -170 -23 156 -63 153 -52 85 5 -116
7894 -116 -174 231 -67 -94 -194 205 -104 112 282 98 -124 9 161 -271 280 193 -32 -180 126 -20 -192
7915 -192 261 68 -405 -19 86 72 35 252 71 143 168 270 196 -113 -61 -106 48 -3 102 228 190 -17 -50
7938 -50 -57 182 82 26 -348 204 36 93 -140 78 165 254 -35 103 48 -184 126 282 -208 -392 -104 228 -145
7961 -145 339 -272 -153 112 77 216 -110 -117 59 27 -145 80 82 -10 -59 80 -70 2 124 54 283 111 -41
7984 -41 94 -101 64 -7 284 -96 -34 107 95 370 110 40 -99 -383 270 -53 -67 -77 -162 -258 -125 330 -64
8007 -64 -147 -71 35 85 293 -42 -193 -49 -181 37 -98 64 239 -91 -22 -235 -167 82 116 -63 -29 -47 170
8030A70k43n5L83k47j62k6l2nJ49l7M1l02M7J72J0K14p4p6k68K75J06J19q9J38
8054B08p6k22O8k92K33J90l8m85N02O2j69k3Q1j2l49L98o5l6K7M8j49L46L3k62
8078A8n9J18j17p5j37K67K9l32K1L69j99o1R5L71l82j3J25K5k75L97l16K21J77
8101B67k30l48M57j06L2j05K50j81k26K6J45L33k30j16Q8R5k05kk5J50m21K11
8123a41k09L70o3L87k86l0j04J07j87j37K95p7L7k28k2J72OK45k50J38m5k67M06
8146A17K19l69n0j09L09l39K62J52j18j70K09R5k02r9K99N3l88J56l33M35j66
8167c7j55K80m06L98J2k35J47p2J94P9R8k61j90j02J46k4K99j6J14j30J64j52
8189A51J81l38
$$ plain form
8030 170 -73 -128 255 8 -154 -180 -212 -217 -68 -105 -64 -366 -319 -147 -137 77 3 -73 -341 -66 40 159 70 208
8054 208 132 -90 -22 -314 -81 109 71 -414 88 150 -19 -42 39 27 -322 76 11 -25 2 50 -99 247 280 18
8078 18 -41 77 -40 -115 -252 15 44 -288 -267 102 -97 -158 -63 308 -74 -87 38 63 -212 185 -131 90 267
8101 267 37 -311 146 40 72 -33 217 36 -190 -164 -19 314 84 -32 56 151 -54 -56 -81 69 -352 -141
8123 -141 -350 20 -43 344 58 28 -76 31 -156 -293 2 -75 -38 -266 -288 -116 -110 135 -115 23 -22 -289 117
8146 117 336 -33 -83 -192 117 -222 40 192 74 -96 113 208 6 -93 206 259 -129 27 -306 129 -37
8167 -37 -192 88 -318 80 92 -143 4 -68 126 205 303 42 -148 -250 -104 -128 171 155 269 139 303 151
8189 151 332 -6
8191f
$$ Imaginary data points
##PAGE= N=2
##DATA TABLE= (X++(I..I)), XYDATA
0@%%%%%%%%Qj6J6j6J6k4L2l2M0m8N6o8P6q8J04j20J37j56J79k03K29k59K91l25
32a71L64m06M51n02N56o16O81p53Q35r22J019j127J248j386J542j719J922k160
50a144K443k785L206l737M436n398O796r022J3096k2886R0760O4724j47313m0540
64d7364M7103O7274K083j6040m2356l6418O522N8214K2562k9666l1115L420N01
77D720N129K5758K2532k2894l3790m709J4245J6594K9604O754n6437n8845M0092
90a1247Q8062N699p3766l5538K9345K8398O540J1756l363l4264j9470K5580K9613
103D7345q7r042r961k7336j7132L2028M7028n467m9732l3518P090L7698M8507
116F7421Q373o5510o5198L8140R5799J9147o9911m7539J9918L2489J2969N528
$$ plain form
0 0 0 0 0 0 0 0 0 0 8 -8 8 -8 8 -16 16 -16 24 -24 32 -36 40 -48 56 -64 73 -83 96 -107 122 -137 154 -171
32 -171 193 -213 238 -264 292 -324 357 -396 439 -483 536 -591 657 -729 813 -906 1016 -1144
50 -1144 1299 -1486 1720 -2017 2419 -2979 3817 -5205 7891 -14995 75765 140489 -6824 -47364
64 -47364 -261 67013 69096 53056 10700 -25718 -19196 39018 61580 31914 799 4219 4720
77 4720 9849 35607 58139 35245 1455 -3254 10991 27585 57189 63943 7506 -51339 -11247
90 -11247 76815 82514 8748 -26790 2555 30953 37493 49249 45886 11622 -7848 17732 47345
103 47345 47258 38216 28255 919 -16213 15815 62843 57376 7644 -25874 -18784 18914 67421
116 67421 75794 10284 -54914 -16774 79025 98172 28261 -19278 640 33129 46098 51626
128E1626j3445l5398j3913K6964K1104j2787j1392M593j0062k1980R170L5989
140C0469J1859k5829k7951r308J5472L9563K3962l7868o1581L303O3511K8075
152E3677l3834l2427O59N694P363K2207J2653k2661k6359O212K0700R907P464
165C1255M249k2711l3125Q440M6172K1910k8998m2835j6338J9841M3122K1637
177E2619l7419n9235O16N7844L2015k6792l3636r26J1162R768J3319L823j5985
190G173j4206N540O914l321N735J5434r539l4729j0715L2038L0956o601l0960
203f281k5006K376L3778L3931j2602m8610j8995L2041L2375m761j9395j0936n991
216a8076N69J5322J4952o330j7097o638J851M239J5800J9370j0156l5012j2209
$$ plain form
128 51626 38181 2783 -11130 15834 36938 24151 12759 17352 7290 -14690 -5520 30469
140 30469 42328 16499 -11452 -20760 -5288 34275 58237 20369 -41212 -37909 25602 53677
152 53677 19843 -12584 -11925 -6231 1132 23339 35992 13331 -13028 -6816 13884 23791 31255
165 31255 35504 12793 -20332 -11892 34280 56190 27192 -15643 -31981 -12140 30982 52619
177 52619 15200 -44035 -43419 14425 46440 19648 -13988 -14914 -3752 6016 19335 23158 7173
190 7173 -7033 -1493 5421 2100 7835 23269 13730 -20999 -31714 324 31280 24679 -6281
203 -6281 -31287 -28911 4867 38798 26196 -22414 -41409 -9368 23007 18246 -1149 -12085 -18076
216 -18076 -17507 -2185 12767 6437 -10660 -17298 -15447 -11208 4592 23962 13806 -21206 -33415
229c3415L1655L5850k335l1390k6195J112L0035K9391r287m1433k0155K2976K7549
242A4358k066j6193q332j572l45O789R264Q57m545m723p837n550J3129K4296P87
257A8317l1956k4330J5648L4202J2082j9747k9360j0210K0433L2460N126k8794
269f129k3672R188K2882Q548o409p598o548m460L211R696N853j764q574j3043
283a8819o799J3563K4143L428k6856k5007R676L1160J7072j3066k6259j2560J4732
296a5592K7902P614k0026k0485K797J5175O756k988l405l188n415l410M279R389
310e97O764m089j5848j2328Q797K5635J0849k0102k7325j818K5483K1397m918
323A1900k3534j7499O894K3245J2314j1872j7462l512R405Q349J762l35j906n409
$$ plain form
229 -33415 -1760 34090 31755 365 -25830 -24718 5317 34708 25421 -16012 -36167 -13191 14358
242 14358 12292 -3901 -12233 -13805 -14150 -7361 1903 2760 -1785 -6508 -14345 -19895 -6766 17530 18317
257 18317 -13639 -37969 -22321 11881 23963 4216 -25144 -35354 -14921 17539 22665 -6129
269 -6129 -29801 -20613 2269 10817 4408 -3190 -9738 -14198 -10987 -1291 4562 2798 -5776 -18819
283 -18819 -25618 -12055 12088 15516 -11340 -36347 -26671 4489 21561 8495 -17764 -30324 -15592
296 -15592 12310 19924 -102 -20587 -17790 -2615 4141 1153 -2252 -5440 -10855 -14265 -9986 -597
310 -597 6167 2078 -13770 -26098 -17301 8334 19183 -919 -28244 -30062 -4579 16818 11900
323 11900 -11634 -29133 -22239 1006 13320 1448 -16014 -19526 -10121 -1772 -10 -345 -2251 -7660
337g660n898Q99J0512J1144j486j6058j5071M806K2626J4551j2845k6335q504
350b9319J8589K2066K251j8962j7582J779J7657J2097n183j2688m492L294M812
363e681K358K732J379m560q574l591Q748J4377L159j4195j7399J27J9764J7388
377A6032o528k2360j3209J1993K0758P043j2458j6839l103J2308J1437m21p455
390b802n824j96J629J745M882M310k905j0530p478N795J5527P213j0584j8320
404a7538m890J5649J8830M20j8945j4993N740J8218J0036p159j4389n394P181
417g234J0042J716l980l919k156k134N38N509O778n90r744j0090K406J4842J1420
432A3404p001j7620q746J1514J8673L952j4307j5341M54J2936J0766j791j1595
$$ plain form
337 -7660 -13558 -12659 -2147 8997 7511 -8547 -23618 -18812 3814 18365 5520 -20815 -29319
350 -29319 -10730 11336 13587 -5375 -22957 -21178 -3521 8576 3393 -9295 -13787 -10493 -5681
363 -5681 -3323 -591 788 -3772 -12346 -15937 -7189 7188 10347 -3848 -21247 -21120 -1356 16032
377 16032 9504 -12856 -26065 -14072 6686 13729 1271 -15568 -18671 -6363 5074 4653 -2802
390 -2802 -8626 -8822 -7193 -5448 -566 3744 839 -9691 -17169 -11374 4153 11366 782 -17538
404 -17538 -22428 -6779 12051 12471 -6474 -21467 -15727 2491 12527 5368 -9021 -14415 -7234
417 -7234 2808 4524 544 -3375 -5531 -7665 -7127 -1618 5160 4570 -5174 -15264 -12858 1984 13404
432 13404 6403 -11217 -19963 -8449 10224 14176 -131 -15472 -15018 -2082 8684 6893 -4702
445d702p407L038P689K973n97j146k167l837j354N829Q799J842q076j0879p52
460a0747J1730J2328k284j5950j1874O101J6596O720j0015j3474k602Q016J0260
473D805K444o621p244L36M924K919J263K130k86o621n015L539J0907M232p093
488D619j2112m102R130J3813K946j3400j3922K785J6090Q981o214j1555m387L833
502c495Q143M780m396q402k318L258J760k94K519Q02n893o912L020J0075O002
517H649l796q594m786M508J2558P400p966j3585j699J1319Q105k599o873m899
531b258j551L360O624J264n555l692Q13L09O03O911M427o563j1274J088J2122
546F628P409l794r650p324J141J1174R471o119j5506m086J1272R473j641n008
$$ plain form
445 -4702 -12109 -9071 -1382 1591 994 -152 -2319 -6156 -7510 -1681 7118 8960 884 -9995 -10747
460 -10747 983 13311 11027 -4923 -16797 -10696 5900 12620 2605 -10869 -13471 -5455 4805
473 4805 7249 628 -6616 -6280 -1356 1563 2826 4956 4670 -1951 -6966 -3427 7480 11712 4619
488 4619 -7493 -11595 -2465 11348 14294 894 -13028 -10243 5847 14828 8614 -2941 -7328 -3495
502 -3495 4648 9428 5032 -3370 -5688 -2430 -670 -964 1555 2357 -3536 -10448 -7428 2647 8649
517 8649 4853 -3741 -8527 -4019 8539 15939 7973 -5612 -7311 4008 12113 9514 2641 -2258
531 -2258 -3809 -449 6175 7439 1884 -1808 -995 -686 -83 6828 11255 4692 -6582 -5494 6628
546 6628 14037 10243 593 -6731 -5590 5584 15055 8936 -6570 -10656 616 10089 8448 3440
560C440l640k119L173Q083J543o074l281K356n14l413L172O779m197j2088k545
575i325P877O062r00m575n148l727O090J1809K384j1116o090O114O984J182Q42
590H463q11o836l154P051O382l117m383J0k877l799P367J0778m082j4746l553
605g307J2019Q080j619n463n710l655L618J1441R38j2599p893N639N720j038j194
620I77k55m797j953O314M552l973j077N272j279p873K704J2773J532j2746o147
635e976N994M866j606N32j751q759l712J0267Q520o544q780R53L802J692M290
650C788L684o225p596M762Q489o14k456J473l925p893M381J4415J46j5115n992
665h678R906O818k466o83m9n204k967Q881O663o808q379K341L795l111q81K775
$$ plain form
560 3440 -200 -2319 854 8937 10480 4406 1125 3481 2967 -446 2726 9505 5308 -6780 -9325
575 -9325 -1448 4614 3714 -861 -6009 -9736 -3646 8163 10547 -569 -6659 -545 6439 7621 8463
590 8463 7652 816 -2338 4713 11095 7978 3595 3605 728 -3071 4296 15074 10992 -3754 -7307
605 -7307 4712 12792 11173 5710 0 -3655 -37 11404 12342 -257 -8150 -2511 3209 2171 977
620 977 722 -4075 -6028 286 4838 865 -212 5060 3781 -4092 -1388 11385 12917 171 -5976
635 -5976 18 4884 3278 3810 2059 -6700 -10412 -145 8375 1831 -6949 -5996 -2194 -502 3788
650 3788 7472 1247 -6349 -1587 6902 6288 3832 5305 1380 -6513 -2132 12283 12429 -2686 -8678
665 -8678 1228 8046 5580 4897 4848 -356 -3323 5558 12221 5413 -2966 -625 3170 59 -822 1953
681A953k876n936J232K935l020l08O669j133j1180q11J4637O411r730o336M923
696b570L294j267M559M257q722j0138O210J2085j699r030k034J509j094L626O231
711E217l056q649M30O959Q09n47L614k614r629J78J3350L632j2368o519P245L632
727A684m394J186N546m175q140M822R387j761o587K572L226m047j369N624J355
742D929n774k899J278k353k36O446j68j1835n419J0437Q209o067o220K963J028
757e681k866N675Q494m843j1757J749J2743J214o411j277J302k814M32O565J284
772C809p177k392M073J123k27L506J067p695l408R054N708o840n061L838J574
787I52o093P15P582k069r445r5P289r4l971K725L221n216l324O755N884l271l693
$$ plain form
681 1953 -923 -6859 -5627 -2692 -5712 -6020 649 -484 -11664 -12475 2162 8573 -1157 -7493 -2570
696 -2570 724 -543 4016 8273 -449 -10587 -4377 7708 6009 -3021 -5055 -3546 -4640 -1014 5217
711 5217 2161 -6488 -6058 901 1710 1163 4777 2163 -7466 -7288 6062 9694 -2674 -9193 -1948 1684
727 1684 -2710 -1524 4022 -153 -8293 -3471 5916 4155 -2432 140 3366 -681 -2050 3574 4929
742 4929 -845 -3744 -2466 -4819 -5055 1391 1223 -10612 -16031 -5594 2615 -3452 -9672 -6709 -5681
757 -5681 -8547 -2872 5622 779 -10978 -9229 3514 4728 -1683 -2960 -1658 -4472 -4040 2525 3809
772 3809 -3368 -5760 -1687 -564 -791 2715 3782 -3913 -7321 1733 7441 601 -4460 -622 952
787 952 -5141 -4426 3156 1087 -8358 -8453 -1164 -1258 -5229 -2504 717 -4499 -7823 -1068 4816 1545 -2148
804b148M21n67j66N786K709q330p556M740P456k159m473O38q97l979L216Q075
820B766j373r625p05P869K540l773R06J834m365k523O195M347m573l675K015P67
836a373j331L415L450m084m756L168N449j105k446J956K50m539k80O525J089p010
852a622k440L402j36k117K447K440n633m559M094N698j043k938J58l99r58L938
868C32N080l050o371P35N273J072j916K06j068l952L82O253J410n874k601L402
884f87J093j351K099K324m044l625L179M153p37k357j35l69j933K006M172j504
900B284m598r48L715P51J69R43J82l491p30M562L216k749k907J029n1q22K282
917B837K168l545m355J180L682K40j829k21j182j678J582M080K28l971j745K194
$$ plain form
804 -2148 -1727 -2294 -2460 3326 6035 -2295 -9851 -5111 2345 186 -4287 -3649 -4546 -8525 -5309 2766
820 2766 1393 -8232 -8937 -1068 1472 -2301 -1395 439 -3926 -6449 -254 4093 -480 -4155 -2140 -1373
836 -1373 -2704 711 4161 77 -4679 -1511 3938 2833 387 2343 2593 -1946 -2226 4299 5388 -1622
852 -1622 -4062 -660 -796 -2913 -466 1974 -3659 -8218 -4124 1574 531 -2407 -2249 -2648 -3606 332
868 332 5412 2362 -4009 -3274 1999 3071 1155 1361 293 -3659 -3277 2976 4386 -1488 -4089 -687
884 -687 406 -945 1154 3478 -566 -4191 -1012 3141 2404 47 -88 -457 -2390 -384 3788 2284
900 2284 -2314 -3262 453 1204 1373 2316 2498 -993 -1723 2839 6055 3306 399 1428 1377 555 2837
917 2837 5005 1460 -2895 -1715 1967 2207 378 157 -1025 -2703 -1121 2959 3187 -784 -2529 -335
933c35J198M31J519m16l140j825L933L167j816k367K16j74p20K408K612k132l703
950a144N13K549J273m78m04j273k371R88L647Q75l402j746M25J481L46P78M31
967B488l085j661K169K963m17j125o59p02l72J873K492p21k863r59J953N70P69
984B713Q7r46k259o65K943J803j177j888p89n2Q49J459J111k259k210N50K756
1001B026P83q01j098j331p20K026K671l75k718j307Q63J419J183k07j112j985
1017f83R5J994J497p14j633p53O77N68R48P22j350j604J35J249J202O8q65q75
1035F78j152N83J912O73j436j152q59P24J343Q61l30j889j062P64K582O79r53
1052A966j542n55J82J936J440j153k459o77J242J261M83p09j485p88M62K251R03
$$ plain form
933 -335 863 1294 2813 2397 -743 -2568 1365 4532 2716 349 565 391 -329 2079 4691 2559 -1144
950 -1144 -631 1918 3191 2713 2309 1036 -1335 -347 3300 4175 773 -973 -548 933 1279 2057 2488
967 2488 -597 -2258 -89 2874 2457 1332 673 -29 -401 1472 3964 3243 380 -579 1374 1944 2713
984 2713 2800 1854 -405 -1070 1873 3676 2499 611 -178 -230 619 2078 3189 930 -1280 -730 2026
1001 2026 2809 2008 910 -421 -1141 885 3556 3181 463 -844 19 1438 2621 2414 1302 -683
1017 -683 -588 1406 2903 2189 556 -197 480 1048 1996 2718 1368 -236 -101 1148 2350 2418 1553 678
1035 678 -474 109 2021 2694 1258 106 -753 -29 1314 2175 1845 -44 -1106 -342 2240 2919 1966
1052 1966 424 -131 51 1987 3427 2274 -185 -862 380 1641 2124 1415 -70 -858 -396 1855 2758
1069B758j110j485o87J181R65J015o31j780n51M77J310K76p41r05m72l63N62J636
1087A455J34j220r42L49J215J129N21m11j675j61J504J105j05j342j108o88N73
1104C33J314J94j231j864n81K097R17P4j342k35q94J326J921O3j765j061NR85
1122B56M95M38q34j749n08J522Q50j4k70r90j47R35J173J087n65j335LP95P49
1141A891M3m1j199j331J45J345J39p77j305j62j43N31J234Q04k119j066J615J708
1159A312j0J75r78q20j47J127J265r15j744p80J002j67L99l1j92j693J23J454
1177f20J086r22l25j72l65j99J894P23j996j657O11R82l26k00m17j185l14J087
1195b315J797R8j008k42R26N38R14J268n4j625n71J767R30r67j047n8j061p27
$$ plain form
1069 2758 1648 163 -524 657 1622 2637 2006 226 -325 152 1462 1738 997 92 -380 -743 -181 1455
1087 1455 1589 369 -573 -224 991 2120 2641 2230 555 394 1898 3003 2898 1556 448 -240 333
1104 333 1647 1841 610 -1254 -1835 262 1179 1253 -89 -324 -1218 108 2029 2092 327 -734 -729 256
1122 256 751 1189 355 -1394 -1902 -380 470 456 186 -804 -951 -16 1157 2244 1679 344 347 1142 1891
1141 1891 1934 1893 694 -637 -492 853 992 215 -1090 -1252 -1395 -864 370 1174 -945 -2011 -396 1312
1159 1312 1302 1477 499 -321 -468 659 1924 1009 -735 -1515 -513 -680 -281 -312 -504 -2197 -2074 -620
1177 -620 466 -456 -781 -953 -1318 -1517 377 1100 -896 -2553 -1942 -960 -1286 -1486 -1903 -3088 -3402 -2315
1195 -2315 -518 -420 -1428 -1670 -744 -206 708 1976 1922 297 -274 1493 2423 1456 409 351 -710 -1437
1213a437J691Q55k156j475O89J147j47m47J050m28j678Q76K027L0k162%Q83q66
1231a548q62J765L14k175j133J160J244p86K99O19r90j270K426K663j179k653
1247b106R08J227j48n71Q69j393j849R5K068K14j977j30Q45p17j28K245J528k092
1265a112q05K475J327j224j07J824n81j909R63K228j646k271N46J112j151p37
1281a068J542N3k277l91K178J51j222Q50O61j553j557K444J692k449k599J334
1297b211P95r29J49J757j293l153J766L766q9k893O77K345l77o42K155K22k320
1314b75K00K137K86k667m9J847j522j767J454J629k064j795K172J492j745k01
1330h68K763K46k911O88L363l58k503M81J760j778j394K369R80k633j631J916
$$ plain form
1213 -1437 254 1109 -1047 -2522 -1833 -686 -833 -1280 -230 -658 -2336 -1460 567 597 -1565 -1565 -682 -1548
1231 -1548 -2410 -645 -331 -2506 -3639 -2479 -1235 -2021 -1722 -1103 -2093 -3363 -937 1726 547 -2106
1247 -2106 -1198 29 -119 -690 179 -1214 -3063 -2968 -900 -686 -2663 -2793 -1948 -2665 -2793 -548 980 -1112
1265 -1112 -1917 558 1885 661 554 2378 1797 -112 851 3079 1433 -838 -292 820 -331 -1068
1281 -1068 474 527 -1750 -2141 37 188 -1034 -184 477 -1076 -2633 -189 1503 -946 -3545 -2211
1297 -2211 -1416 -2345 -2196 -439 -1732 -4885 -3119 647 558 -2335 -1658 687 310 -332 1823 2045 -275
1314 -275 -75 2062 2348 -319 -368 1479 -43 -1810 -356 1273 -791 -2586 -414 1078 -667 -868
1330 -868 1895 2141 -770 -82 3281 2923 420 901 2661 883 -511 1858 2838 205 -1426 490
1346D90L98r16M98J582j513k636J985L311j670l027J222J123j635j95K332r14
1362D35m239K96L829K08l615J06K199j48q67J646J678j411q76K770R35j900K1
1379A067K341p02k637R64K578j802k012J694M97k209n25L063M34l410j060L710
1395A991M32k676M55K034j026k232J612K203j819k342J248R46j619L60J908q85
1411E90k946R94L646n19k492O00K133j703n44K637K56l632r79L319N21l089m73
1428a681K001o13k297J076K073j444j659J998R87j642J72K576L66k650L07L017
1444B587l64k198J007J523j973j428K739J226l059j565K812Q19k726O71J919q43
1460A147k297J044K082l97k539P87J082j609p54K124Jl042k97K652o9j552M37
$$ plain form
1346 490 888 -28 470 2052 539 -2097 -112 3199 1529 -1498 -276 847 -788 -983 1349 435
1362 435 -3804 -3508 321 529 -3086 -2980 -781 -929 -1796 -150 1528 117 -759 2011 2946 1046 1067
1379 1067 3408 2706 69 1033 3611 1809 -203 1491 1988 -221 -746 2317 2751 -659 -1719 1991
1395 1991 2423 -253 202 2236 1210 -1022 590 2793 974 -1368 -120 826 -793 -433 1475 590
1411 590 -2356 -1362 2284 1765 -727 -127 2006 303 -241 2396 2652 -980 -1959 1360 1881 -1208 -1681
1428 -1681 320 -293 -2590 -1514 559 -885 -2544 -546 441 -1201 -1029 1547 1913 -737 -430 2587
1444 2587 2223 25 1032 2555 582 -846 1893 3119 60 -1505 1307 2126 -600 71 1990 1147
1460 1147 -1150 -106 1976 1579 -960 -173 909 -700 -1454 670 671 -2371 -2668 -16 -85 -1637 -1200
1477a200J671j806o78K860R02k508j026K609Q22j470q85K087l81k382K09K473
1493A297j128j622P78R65j336j348K480P40k243q61K214Q86j749K62J680j282
1509b67j013J534J323j627j319J281R00j386j68J865l77j984K60J954l06j376
1525g06P34R69j262j025J706R48k209j203J972L17j276n99J270j214j387J977
1541i88J223j505q74J270Q39j221J02J616J87j622O1J393P6j214N11R24r98j028
1559a248J430J114j897r55J196P53j131k6J067p41j285P90J215m92j187Q40O08
1576E1j275n20J493Q13j655r6P82L36o86O76N49q95j027J726R85j249j192Q21
1594c63Q97r84L69Q44p26j332L11J787o28r26pN06m25k22P25O38j358m20J213
$$ plain form
1477 -1200 471 -1335 -2013 847 1749 -759 -1785 824 1646 176 -709 1378 997 -1385 -1176 1297
1493 1297 169 -1453 -675 290 -1046 -2394 86 826 -1417 -2278 -64 822 -927 -665 1015 -267
1509 -267 -1280 254 1577 -50 -1369 -88 812 -574 -742 1123 746 -1238 -978 976 670 -706
1525 -706 28 997 -265 -1290 416 1364 -845 -2048 -76 241 -1035 -1634 -364 -1578 -2965 -988
1541 -988 235 -1270 -2144 -874 -35 -1256 -1154 462 649 -973 -912 481 557 -657 -146 778 -220 -1248
1559 -1248 182 1296 -601 -1556 -360 393 -738 -764 303 -438 -1723 -933 282 -210 -1397 -557 51
1576 51 -1224 -1744 -251 562 -1093 -1189 -407 -71 -757 -81 468 -427 -1454 272 1257 8 -1184 -363
1594 -363 534 -450 -81 763 37 -1295 -984 803 175 -751 -758 -252 -677 -899 -174 464 -894 -1314 -101
1613a01Pn17K05Q60o88p48J249Q32j051o26P28M20r21J76Q18Oj261j07J115l43
1633E3l47M11O9n22q35J196P68q35m52j38Q29l29L95r3n88n93O23J164l66j130
1653g20K53M05k62N80N33q08p53L44R75L97r50q5Q80l97l64M62L55n90l20L21
1673B56R2j30n4J05k69p49J06P51j57l98O28J28m06l29R33L96o37o35L67J66K22
1694C86J45j00n95p35P13Q23O7j071J33K93k6K99P2j54p29J88J002J67o47k28
1714CL19n0l04M45l02n79k69O69k99j05J6K75n0j72L38M91l13k77J07M45k45l33
1736a90N02M9n26j85J60J96j9j27j46m17L7P06L4K57p10J88J74L52J91j03j68
1757B55p20M20N62q4o05j96J08m49K29K99j9n34j36Q01K39k72J38k33J24M00J85
$$ plain form
1613 -101 -94 -611 -406 454 -234 -982 267 1099 48 -578 150 570 -351 -175 643 649 -612 -719 396 53
1633 53 -294 117 186 -336 -1171 25 793 -42 -494 -632 197 -132 263 170 -418 -1011 -388 776 410 -720
1653 -720 -467 -62 -324 256 789 -19 -772 -428 547 944 -6 -91 789 392 28 490 845 255 -65 256
1673 256 348 218 164 269 0 -749 -643 108 -49 -447 181 309 -97 -426 507 903 266 -369 -2 164 386
1694 386 531 431 -164 -899 -186 637 704 -367 -234 59 33 332 404 250 -479 -291 711 878 231 3
1714 3 322 272 -32 413 111 -468 -737 -68 -367 -472 -456 -181 -231 -403 -65 426 113 -164 -57 388 143 -190
1736 -190 312 361 -165 -350 -190 6 -13 -140 -286 -703 -666 40 74 331 -379 -191 -17 335 526 423 255
1757 255 -465 -45 517 433 -172 -368 -260 -709 -480 -181 -200 -734 -870 -69 170 -102 36 -197 -73 327 512
1778E12N29j018k4K90M5n69j16O4r9On09K57q9M2J11R3m56K05O11M88p69J68N5
1801a73K5O3J26%l76n42L49R40m48k12j74O31m58O86K07Rn92OJ068j65n19m3M09
1824H17p51L86l48M36p88k39L0j50l86m5N94j56m57Q30P6Nl4L84l9m81J03K58
1846D5J37m93k15N29j65m82j50L70o75n2P95K24j4j88L8K98o72P31N13q94l7K94
1868f3L99j13q32M32m1m26K32L40J98m64L75O33M3m15N73J55J2l64N49M80o20
1889A083m48K3l43q55M43N56j031m44m1Q52m32j11K55N0o06J64Q56K80q55j28
1909g32P20L30q86L24L69k57q59Q95M50q79k19O76L37l18J62P74l59m79N66M47
1929A062k05o76Q12J36j037l07R44J20q17l29P53n50n39K72J195m43p01Q08Q93
$$ plain form
1778 512 1041 23 -1 289 334 -235 -351 -287 -386 -380 -889 -632 -721 -679 -568 -475 -931 -726 -115 373 -396 -228 -173
1801 -173 -148 -85 41 41 -335 -877 -528 412 -36 -248 -422 209 -249 437 644 653 61 67 1135 970 451 408 817
1824 817 66 452 104 540 -248 -487 -457 -607 -993 -1038 -444 -600 -1057 -227 -151 -146 -180 204 165 -316 -213 45
1846 45 182 -311 -526 3 -162 -644 -794 -424 -1099 -1151 -356 -132 -146 -334 -296 2 -670 61 574 -320 -357 -63
1868 -63 336 223 -609 -177 -218 -644 -412 -72 126 -338 37 670 713 298 871 1026 1038 674 1223 1703 1083
1889 1083 635 658 315 -540 -97 459 -572 -1016 -1057 -205 -637 -748 -493 -443 -1049 -885 -29 251 -604 -732
1909 -732 -12 318 -568 -244 125 -132 -991 -96 354 -525 -744 -68 269 -49 113 887 528 49 615 1062
1929 1062 857 181 993 1129 92 -215 729 849 32 -297 456 -94 -633 -361 834 391 -310 498 1391
1948A391n83m51R79Lj230M55P31r9j341J87O33l59j101Q29K7q06m98J143J95r78
1968h73j62P84K52p25J65J058r27m35N64R46j227l76J006J99j128l2J281K56p07
1987h1N97O72o38l17J000P95j002j048J261O74j098j56N92l44j262L73R95n80
2005D33j396M89J350p82j039J407O8r43O3J158k18o43OO92l98p32O66P12j359
2024d66p20J210O77j316m76J154N60j335K39J134j80j027N08P18p80q89J403K49
2042F63r80j110J220M11p83P3R92n42r60J183R12o88j071J312J118r25n72P84
2060A037M88j082j11J401n31j552O95P28j025r41Q51N42q36k91P15L72j033j61
2078g34J109m67o39K92J144o69j337Q48J208j371p49J305L72p36m84J272j44p38
$$ plain form
1948 1391 808 357 1336 1339 109 564 1295 1196 -145 42 675 316 -785 44 71 -735 -1233 -90 105 -873
1968 -873 -1035 -251 1 -724 -559 499 -428 -863 -299 647 -580 -956 50 249 -879 -911 370 626 -81
1987 -81 516 1188 550 233 1233 2028 1026 -22 1239 1913 815 659 1251 907 -355 18 1013 433
2005 433 -963 -474 876 94 -945 462 530 -413 -350 808 590 -53 -47 645 247 -485 181 893 -466
2024 -466 -1186 24 701 -615 -1091 63 623 -712 -473 661 481 -546 -38 680 -100 -989 414 663
2042 663 -317 -1427 -207 204 -579 -506 486 -56 -1016 167 1079 391 -680 632 1750 825 253 1037
2060 1037 1525 443 332 1733 1202 -350 345 1073 48 -893 -42 500 -336 -627 88 460 -573 -734
2078 -734 375 -92 -731 -439 705 36 -1301 -453 755 -616 -1365 -60 312 -424 -908 364 220 -518
2096e18L85J161n69j254J466P93r06j129P65L79n32j65O40n73j243J092Q00n82
2114A0j282P52J256n99q51J007L60p44j15J239R0j386L14J236m11j384P68Q60
2132A120m89j172N99M62n49m94Q56q4r90M12R85n09j188N89J161p78q78P63N65
2151C81n77n19P76J9j144O96J376p92j293R65J204l36j080O11K60l19M3m7N18
2170G42j280M01J299l10j414k1J087j93r55M43N03n13m39Q40j02o00J16J114j70
2189E48j440P23O49J45q82q6Q84n79l15P59K69r07Q6J121k91r80M5R81J81j370
2209d59K67P48m72j74M80k14p97M64Q36n00j150M82J385m95p58j21O81j62j54
2228a13N77j69m72l48J299J09j384J64J066M1q54J93L86l94j5M35k9o83O8P91
$$ plain form
2096 -518 -133 1028 459 -795 671 1464 558 -571 194 573 41 -124 516 -57 -1300 -208 592 10
2114 10 -1272 -520 736 137 -714 293 653 -91 -206 1033 1123 -263 51 1287 876 -508 260 1120
2132 1120 631 -541 58 520 -29 -523 333 249 -741 -329 656 147 -1041 -452 709 -69 -947 -184 381
2151 381 -196 -715 61 80 -1064 -368 1008 216 -1077 -112 1092 756 -324 287 547 228 271 224 742
2170 742 -538 -137 1162 852 -562 -583 504 311 -644 -201 302 -211 -650 190 88 -512 -396 718 548
2189 548 -892 -169 480 625 -257 -343 541 -38 -353 406 675 -232 -146 975 684 -296 -251 730 911 -459
2209 -459 -192 556 84 -90 390 176 -621 -157 679 179 -971 -489 896 401 -357 -478 203 41 -113
2228 -113 464 295 -177 -525 774 883 -501 -337 729 770 -84 109 495 101 86 521 492 -191 -123 668
2248F68m09j069J91Q47J93r27n1J60N80j65K44j77n80L80P01J22j335q9J245K44
2268G73p74o10N99K54P2m9k43m64J95J107j33j315k05J039L53m51l50J00L42k94
2288e4L38k25q33M97P28K48j365j21Q98M62m76o23M95o4K41J03K4p69P38Q02l41
2309G03j217K3J106j52m02n90k0O87J40Rk71o90K37J046P5j341k92J021P56m03
2329D25j070N74L34K04o61l21j65M31Q00j46q98m29P04R08o11n43j10M60M06K44
2349E36n44m63K06P24L22o96p90Q57J52j17o16l53Q07J4j65k66l97O79N82J48
2369F20j036m77P75N20K3p96k7P42J02n56k08k45j6J104j13r35n32Q20J105o96
2389A74o77J94M14M03l5o80n67O79N33P7j149l01K82J078k21j044j80L12P06K82
$$ plain form
2248 668 259 -810 -619 228 421 -506 -557 -397 183 18 262 85 -495 -115 586 708 -627 -716 529 773
2268 773 -1 -611 -12 242 314 265 22 -442 -247 860 727 -588 -793 246 599 148 -202 -102 240 -54
2288 -54 284 59 -774 -277 451 699 -666 -787 111 573 97 -526 -31 -95 146 249 273 -496 242 1044 703
2309 703 -514 -491 615 463 61 -529 -549 138 278 287 16 -674 -437 609 684 -657 -949 72 828 425
2329 425 -645 -71 263 467 -194 -515 -680 -249 551 405 -493 -922 -218 690 79 -464 -574 -114 292 536
2349 536 -8 -471 -265 459 781 85 -705 152 304 187 -429 -782 25 39 -126 -392 -789 -110 472 620
2369 620 -416 -893 -118 402 425 -371 -398 344 446 -110 -318 -563 -579 525 412 -523 -1055 -235 870 174
2389 174 -503 -309 105 508 473 -207 -774 -95 438 515 -634 -935 -653 425 204 -840 -1020 -708 -2 280
2409B80k65k89l02O93N59n38o21K87J002k79n00k87N31j83L81l03r25M29P35K81
2429F86n29q49O56N34N58j204k63O04M58j78m49p31N10O16N1o48q40N41R88m71
2449D0m07n13K72Q23J05n65n63M71P50L75o33q32M50R60m0o31p69L07M30N34p97
2470b33n39j11Q01O39n45p26O74Q70K43j142r1J05P71L54o28o83J75N88L62m71
2490D13q30L72O99j5o69l3k08P11M88m61m36j29O77O81r83q04K02O75k97j93p95
2511i35l5R78J70m07p66L6P68N82n64q33O17J258qq26m66L43K35L15j93n67l02
2532f00Q09O12p46j020K86J264J7m50n47J33R99L74m81r66K55Q45N35p82q94J70
2552a87P37M13q31r57N63N82M36j62q94n76J141J209j252n59j49J366o5o78n76
$$ plain form
2409 280 15 -274 -576 117 676 138 -483 -196 806 527 27 -260 271 88 469 166 -759 -330 405 686
2429 686 157 -692 -36 498 1056 -148 -411 193 651 473 24 -707 -197 419 470 -178 -1018 -477 511 40
2449 40 -367 -880 -608 215 320 -245 -808 -337 413 788 155 -677 -227 733 693 62 -707 -400 30 564 -233
2470 -233 -772 -883 -82 557 12 -714 -40 830 1073 -69 -160 -55 716 1070 442 -241 -66 522 884 413
2490 413 -417 -45 654 639 -30 -63 -271 440 928 467 31 -98 579 1260 277 -527 -325 350 53 -140 -935
2511 -935 -970 8 178 -229 -995 -959 -191 391 -173 -1006 -389 869 861 35 -431 -88 147 462 269 -298 -600
2532 -600 209 821 75 -945 -659 605 622 172 -375 -242 757 1131 650 -316 -61 784 1319 537 -357 -187
2552 -187 550 963 132 -825 -262 320 756 594 -300 -876 265 1474 222 -337 -486 880 815 137 -439
2571d39q1L79L45j09p12n74N82J176q56j146L03J377L6k40o93J72O20M94j96o14
2591a76n26R37J047p26j284L68R96L32q88l92K04N92M70O8r31j87N83Q28k34j203
2611a22j15R10N01m79j006L98K51J94J67j010p92Q78J045m60j368J29J185O35
2629I41r43k86J38K7N91K42o46q30O71Q74k66j468LQ45P32n47q02J09O32J33K90
2650D40o76m12Q43R86l28j603K42J111J92p07k70j30N86K54N79q39r96P33J575
2669A580n69j016n73J346N86n00q30j44J87Q09N5q55p72m2J511j90j573K10Q57
2688G7J65n04m22K12J72M74J52m05q33K27J483M0j469j63R58N39o11l56l0j7M22
2709A11J98n70p12M25J280K10j540k87J282L75n68l05L0l0L08N37p63p80L09R75
$$ plain form
2571 -439 -520 -141 204 95 -617 -1191 -609 567 -289 -1435 -1132 245 281 41 -652 -480 140 634 438 -176
2591 -176 -702 235 1282 556 -728 -360 636 968 80 -312 -108 484 954 1022 91 -96 487 1315 1081 -122
2611 -122 -237 673 1174 695 -311 87 338 532 699 -311 -1103 -225 820 360 -1008 -879 306 941
2629 941 -2 -288 -150 -123 468 710 64 -766 -95 779 513 -955 -952 -107 625 78 -724 -615 17 150 440
2650 440 -236 -648 195 1181 853 -750 -508 603 795 88 -182 -312 274 528 1107 268 -728 5 1580
2669 1580 1011 -5 -578 768 1354 854 24 -120 67 876 931 76 -696 -738 773 583 -990 -780 77
2688 77 242 -262 -684 -472 -300 174 326 -79 -912 -685 798 838 -631 -794 164 703 92 -264 -294 -311 111
2709 111 309 -261 -973 -548 732 942 -598 -885 397 772 204 -101 -71 -101 207 744 -19 -799 -490 485
2729D85K12j302m23J347M21l17m43p3J15N65L22p27q19K86J178J2j182q04J132
2748a5O54n04o94k59K93P1P10j85r63n3J254M58j183o07R52M11j81m83k69K98
2768b95J87O36n36p45k8J623k89j202R4P25L23n3p06L0l25Q76l7Q0j298l0J455
2789D85K3q88p34Q73O30o2p55m39O45L75J57j89j170L23J390K08j081p57O68P69
2809D71k87n13k51N4L82K76k18p97jJ142K87j043r05R08P72m71l39j02m8L12L63
2830hL1r77k56J617J5r57m26O30P42k54j97m04L9M14M52m67p22j17J205K87m76
2851A71j204L67R06l5k40n91k49P02M78P7r56k51P83P29q36r35J80J002j40l13
2871c55J90l96O32R9n8q10m10J145P36q27q76K09Q55J20m91m17K40K86K1L6m92
$$ plain form
2729 485 697 -605 -1028 319 740 423 -20 -93 22 587 909 182 -637 -351 827 839 -343 -1147 -15
2748 -15 639 135 -559 -818 -525 -454 256 71 -892 -945 309 767 -416 -1023 -71 340 159 -324 -593 -295
2768 -295 -108 528 -8 -753 -781 842 553 -649 -555 170 493 440 -266 -236 -561 315 278 358 -940 -970 485
2789 485 508 -380 -1114 -241 389 327 -428 -867 -222 153 310 121 -1049 -726 664 872 -209 -966 -298 471
2809 471 184 -329 -580 -526 -144 132 -86 -883 -884 258 545 -498 -1403 -495 277 -194 -533 -635 -683 -371 -8
2830 -8 23 -954 -1210 407 422 -535 -961 -331 411 157 -40 -444 -405 9 461 -6 -728 -845 360 647 171
2851 171 -1033 -666 240 205 -35 -626 -875 -173 305 382 -574 -825 -42 687 -149 -1084 -904 98 -42 -355
2871 -355 -165 -561 71 170 112 -698 -1108 37 773 -54 -930 -721 134 254 -237 -654 -414 -128 -107 -71 -563
2892e63k31M84J267o15j385K94Q67j16n19K97l68O69J10j55o23l78R50P24q74
2911a65p78L82P46K11o70k66n3O67j95L52l92n93N53J309r72q31R8R09j47k46
$$ plain form
2892 -563 -794 -310 957 342 -1043 -749 118 2 -517 -220 -588 81 191 36 -587 -965 -15 709 -165
2911 -165 -943 -561 185 396 -274 -540 -593 74 -121 231 -161 -754 -201 1108 136 -695 -597 312 165 -81
$$ [...]
8191A5
##END NTUPLES=NMR FID
##END=
