##TITLE=1H_SA_52.210
 DMSO-d6, 8 sc, 
 2.7.2020
##JCAMPDX= 6.0         $$ Bruker NMR JCAMP-DX V2.0
##DATA TYPE= NMR FID
##DATA CLASS= NTUPLES
##ORIGIN= UXNMR, Bruker Analytische Messtechnik GmbH
##OWNER= root
$$ XWIN-NMR		Version 3.5
$$ Thu Jul  2 10:13:13 2020 Russian Standard Time (UT+4h)  she@DPX200
##.OBSERVE FREQUENCY= 200.1315
##.OBSERVE NUCLEUS= ^1H
##.DELAY= (6, 6)
##.ACQUISITION MODE= SIMULTANEOUS
##.ACQUISITION SCHEME= undefined
##.AVERAGES= 8
##.DIGITISER RES= 18
##SPECTROMETER/DATA SYSTEM= spect
##.PULSE SEQUENCE= zg30
##.SOLVENT NAME= DMSO
##.SHIFT REFERENCE= (INTERNAL, DMSO, 0, 15.7039)
##AUDIT TRAIL= $$ (NUMBER, WHEN, WHO, WHERE, WHAT)
$$ ##TITLE= Audit trail, XWIN-NMR		Version 3.5
$$ ##JCAMPDX= 5.01
$$ ##ORIGIN= Bruker BioSpin GmbH
$$ ##OWNER= she
$$ F:/spectra/data/she/nmr/H-F/1/audita.txt
$$ ##AUDIT TRAIL=  $$ (NUMBER, WHEN, WHO, WHERE, WHAT)
(   1,<2020-07-02 10:12:06.96 +0400>,<she>,<DPX200>,
      <created by zg, POWCHK disabled, PULCHK disabled
       configuration hash MD5:
       00 E9 B6 7A A2 85 ED C7 34 08 36 98 17 FE 4E 26
       data hash MD5: 16K
       BA D4 E1 DC 36 CB 23 B7 4D 25 C3 A9 32 57 FF 68>)
$$ ##END=
$$ 
$$ hash MD5
$$ 35 E1 6E 2A 22 DE 65 D8 A5 9D 61 C0 82 08 9B 19
##$RELAX= 
##$RELAX= 
##$RELAX= 
##$RELAX= 
##$RELAX= 
##$RELAX= 
$$ Bruker specific parameters
$$ --------------------------
##$DU= <F:/spectra>
##$EXPNO= 1
##$NAME= <H-F>
##$PROCNO= 1
##$TYPE= <nmr>
##$USER= <she>
##$AMP= (0..31)
100 100 100 100 100 100 100 100 100 100 100 100 100 100 100 100 100 100 
100 100 100 100 100 100 100 100 100 100 100 100 100 100 
##$AQSEQ= 0
##$AQ_mod= 1
##$AUNM= <au_zg>
##$AUTOPOS= <>
##$BF1= 200.13
##$BF2= 200.13
##$BF3= 200.13
##$BF4= 200.13
##$BF5= 200.13
##$BF6= 200.13
##$BF7= 200.13
##$BF8= 200.13
##$BYTORDA= 1
##$CFDGTYP= 0
##$CFRGTYP= 5
##$CHEMSTR= <none>
##$CNST= (0..31)
1 1 145 1 1 1 1 1 1 1 1 1 1 1 1 1 1 1 1 1 1 1 1 1 1 1 1 1 1 1 1 1 
##$CPDPRG= <>
##$CPDPRG1= <>
##$CPDPRG2= <>
##$CPDPRG3= <>
##$CPDPRG4= <mlev>
##$CPDPRG5= <mlev>
##$CPDPRG6= <mlev>
##$CPDPRG7= <mlev>
##$CPDPRG8= <mlev>
##$CPDPRGB= <>
##$CPDPRGT= <>
##$D= (0..31)
0 1.2 0 0 0 0 0 0 0 0.06 0 0.03 0 0 0 0 0.0002 0 0 0 0 0 0 0 0 0 0 0 0 
0 0 0 
##$DATE= 1593670326
##$DBL= (0..7)
120 120 120 120 120 120 120 120 
##$DBP= (0..7)
150 150 150 150 150 150 150 150 
##$DBP07= 0
##$DBPNAM0= <>
##$DBPNAM1= <>
##$DBPNAM2= <>
##$DBPNAM3= <>
##$DBPNAM4= <>
##$DBPNAM5= <>
##$DBPNAM6= <>
##$DBPNAM7= <>
##$DBPOAL= (0..7)
0.5 0.5 0.5 0.5 0.5 0.5 0.5 0.5 
##$DBPOFFS= (0..7)
0 0 0 0 0 0 0 0 
##$DE= 6
##$DECBNUC= <off>
##$DECIM= 24
##$DECNUC= <off>
##$DECSTAT= 4
##$DIGMOD= 1
##$DIGTYP= 9
##$DL= (0..7)
0 120 120 120 120 120 120 120 
##$DP= (0..7)
150 150 150 150 150 150 150 150 
##$DP07= 0
##$DPNAME0= <>
##$DPNAME1= <>
##$DPNAME2= <>
##$DPNAME3= <>
##$DPNAME4= <>
##$DPNAME5= <>
##$DPNAME6= <>
##$DPNAME7= <>
##$DPOAL= (0..7)
0.5 0.5 0.5 0.5 0.5 0.5 0.5 0.5 
##$DPOFFS= (0..7)
0 0 0 0 0 0 0 0 
##$DQDMODE= 0
##$DR= 18
##$DS= 0
##$DSLIST= <SSSSSSSSSSSSSSS>
$$ [...]
##$SUBNAM2= <"">
##$SUBNAM3= <"">
##$SUBNAM4= <"">
##$SUBNAM5= <"">
##$SUBNAM6= <"">
##$SUBNAM7= <"">
##$SUBNAM8= <"">
##$SUBNAM9= <"">
##$SW= 24.9337058887773
##$SWIBOX= (0..15)
0 0 2 0 0 0 0 0 0 0 0 0 0 0 0 0 
##$SW_h= 4990.01996007984
##$TD= 16384
##$TD0= 1
##$TE= 0
##$TE2= 300
##$TE3= 300
##$TEG= 300
##$TL= (0..7)
0 120 120 120 120 120 120 120 
##$TP= (0..7)
150 150 150 150 150 150 150 150 
##$TP07= 0
##$TPNAME0= <>
##$TPNAME1= <>
##$TPNAME2= <>
##$TPNAME3= <>
##$TPNAME4= <>
##$TPNAME5= <>
##$TPNAME6= <>
##$TPNAME7= <>
##$TPOAL= (0..7)
0.5 0.5 0.5 0.5 0.5 0.5 0.5 0.5 
##$TPOFFS= (0..7)
0 0 0 0 0 0 0 0 
##$TUNHIN= 0
##$TUNHOUT= 0
##$TUNXOUT= 0
##$USERA1= <user>
##$USERA2= <user>
##$USERA3= <user>
##$USERA4= <user>
##$USERA5= <user>
##$V9= 5
##$VALIST= <valist>
##$VCLIST= <CCCCCCCCCCCCCCC>
##$VD= 0
##$VDLIST= <DDDDDDDDDDDDDDD>
##$VPLIST= <PPPPPPPPPPPPPPP>
##$VTLIST= <TTTTTTTTTTTTTTT>
##$WBST= 1024
##$WBSW= 4
##$XGAIN= (0..3)
0 0 0 0 
##$XL= 0
##$YL= 0
##$YMAX_a= 172829
##$YMIN_a= -92596
##$ZGOPTNS= <>
##$ZL1= 120
##$ZL2= 120
##$ZL3= 120
##$ZL4= 120
##$ABSF1= 10
##$ABSF2= 0
##$ABSG= 5
##$ABSL= 3
##$ALPHA= 0
##$AQORDER= 0
##$ASSFAC= 0
##$ASSFACI= 0
##$ASSFACX= 0
##$ASSWID= 0
##$AUNMP= <proc_1d>
##$AZFE= 0.1
##$AZFW= 0.1
##$BCFW= 1
##$BC_mod= 2
##$BYTORDP= 1
##$COROFFS= 0
##$CY= 11.3945322036743
##$DATMOD= 1
##$DC= 2
##$DFILT= <>
##$DTYPP= 0
##$F1P= 16.9975609425685
##$F2P= -3.02152046262296
##$FCOR= 0.5
##$FTSIZE= 0
##$FT_mod= 4
##$GAMMA= 1
##$GB= 0.15
##$INTBC= 1
##$INTSCL= 1
##$ISEN= 128
##$LB= 0.24
##$LEV0= 0
##$LPBIN= 0
##$MAXI= 10000
##$MC2= 0
##$MEAN= 0
##$ME_mod= 0
##$MI= 1.114404
##$NCOEF= 0
##$NC_proc= 0
##$NLEV= 6
##$NOISF1= 3.799351
##$NOISF2= 2.8
##$NSP= 1
##$NTH_PI= 0
##$NZP= 0
##$OFFSET= 15.70392
##$PC= 1
##$PHC0= -9804.886
##$PHC1= 26.60087
##$PH_mod= 1
##$PKNL= yes
##$PPARMOD= 0
##$PSCAL= 0
##$PSIGN= 0
##$REVERSE= no
##$SF= 200.130013532006
##$SI= 16384
##$SIGF1= 3
##$SIGF2= 2
##$SINO= 400
##$SIOLD= 16384
##$SREGLST= <1H.CDCl3>
##$SSB= 0
##$STSI= 0
##$STSR= 0
##$SW_p= 3612.71676300578
##$SYMM= 0
##$S_DEV= 0
##$TDeff= 0
##$TDoff= 0
##$TI= <>
##$TILT= no
##$TM1= 0
##$TM2= 0
##$TOPLEV= 0
##$USERP1= <user>
##$USERP2= <user>
##$USERP3= <user>
##$USERP4= <user>
##$USERP5= <user>
##$WDW= 1
##$XDIM= 8192
##$YMAX_p= 0
##$YMIN_p= 0
$$ End of Bruker specific parameters
$$ ---------------------------------
##NTUPLES= NMR FID
##VAR_NAME=  TIME,          FID/REAL,        FID/IMAG
##SYMBOL=    X,             R,               I
##VAR_TYPE=  INDEPENDENT,   DEPENDENT,       DEPENDENT
##VAR_FORM=  AFFN,          ASDF,            ASDF
##VAR_DIM=   8192,          8192,            8192
##UNITS=     SECONDS,       ARBITRARY UNITS, ARBITRARY UNITS
##FACTOR=    0.0002004,     1,               1
##FIRST=     0,             0,               0
##LAST=      1.6414764,     0,               0
##MIN=       0,             -92596,          0
##MAX=       1.6414764,     172829,          0
$$ Real data points
##PAGE= N=1
##DATA TABLE= (X++(R..R)), XYDATA
$$ [...]
2034G84j031o40J585L56j176k29Q56N03m40n55J42J5j28K75L94o41j85J88k24
2053a51m32J42P98l0j018j8Q56j72m98J73R71j7q17l78J266o6k13J44L59j041
2073a42N35N95p33m61M93J454j154j128K26Q34J50o37q1J27RL06L0o83K34J87
2093A61O31o62p01J94J553o93p90J02Q80n53n87M15O44m74m6j39J96l6j7L63j00
2114C41k10j39N30K9m04M19K71q79n03N31Q35q72n57N08J006n64l54q9J57K21
2134B77N30m40n62j20J048N14j154n90Q60M75n54j101M17Q55M44j141j64M81j43
2153f8M64o7o98o3R90l04m38k96R49J76o50p8m0L46K22L3k28k55p3O8M29m53L43
2176C09k04K3n08M96L25k96m93L38R33p85r46L50R48P7q99j60L82K23N38l63o51
$$ y = [784, -247, -887, 698, 1054, -122, -351, 505, 1008, 568, 13, 155, 170, 42, 317, 711, 70, -115, 73, -151, -583, -441, 357, 327, -691, -709, 147, -25, -523, -350, 621, 604, -213, -591, 675, 609, 396, 540, 899, -142, 393, 988, 255, -206, 287, 1741, 587, -541, -315, 519, 669, 32, -49, 78, 87, 393, 423, -260, -26, 161, 792, 130, -571, -377, 1176, 483, -307, -205, 675, 122, -465, -50, 594, 120, 74, -65, 131, 95, 78, 441, 341, 131, -8, 522, 551, 147, 566, 837, -42, -545, -14, 821, -51, -608, -100, 906, 342, -12, -101, 56, 277, 807, 367, -195, -315, 733, 1247, 93, -497, 363, 838, 284, -817, -400, 455, 899, -242, -406, 75, -68, 396, 329, -369, -432, 558, 254, -184, -480, 469, 645, -5, -83, -123, 223, 445, 478, 250, -5, -78, -10, 419, -34, 309, 105, 128, -380, 116, 441, 145, -348, -10, 923, 138, -808, -458, 490, 567, -332, -492, -110, 113, 651, 288, -363]
2197c63R9N90L02o06o52N62Q76k05r49j57J131J63o91j24k98J54M09J39o31l67
2217f18Q86M89r39j97K40M25P2m27RP2m4q1K54K91o42J05N54m6j13p72N31N38
2239E87l94j42j35l19K06R74m15q89k46J034J81m83n94L27J010N9j146m09O16
2258a78Q84J02r70l03P1J106j5p57p50R67N79m16q70J40N20O54j65j349J50R31
2278C31J93k35n85J82L61n1J1l19K10K89M3l22J60l24k69Q6Q75l48m52PO36m43
2300C6J51k23k76K99P74o28r02j61J212P20o93j209K47P05P67l93j020J64O79
2319B49J07P9p46k11J012J74m50j152R05P75P9j015l70L94L87K19o93q0J36P12
2339E11j61r41L07K39K97J44n79l56O82O1L5k01N5k31J40N02j79o04k1M68N2O9
$$ y = [-363, -264, 326, 628, 22, -630, -68, 808, 603, -346, -503, 628, 791, 100, -24, -322, -168, 241, 380, -251, -618, 268, 757, -182, -379, -139, 286, 358, -69, -60, 12, -32, -113, 141, 432, -210, -105, 449, 403, 290, -482, 49, 587, 193, 51, -84, -403, -197, 777, 362, -527, -773, 261, 442, -41, -635, -308, 702, 761, -385, -794, -178, 706, 808, -162, -465, -394, 712, 697, -60, -810, 157, 736, 320, -550, -410, 110, 764, 599, -750, -600, 331, 524, 289, -296, -114, 247, 196, 207, -112, 98, 387, 430, 108, 268, -56, -325, -239, 636, 288, -164, -157, 479, 36, 187, -36, -312, -13, 761, 133, -769, -930, 282, 1002, 309, -900, -653, 52, 819, 426, -594, -430, 249, 356, 435, -311, -522, 490, 664, 214, -938, -33, 742, 821, -194, -564, -170, 217, 436, -257, -337, -201, 511, 350, -591, -284, -45, 252, 396, -183, -539, 143, 204, 239, 38, 93, -138, 2, 504, 325, -279, -300, 168, 220, 289]
2361B89m34n30M08R11j33p91j44L80Q86l93q60j95R27J026j126r49M84N56N28
2380H40p73o76K2Q76Q92r05j484O46J153o3p97k29L02M52K13q53l98N82O36J66
2400F02j34q49j19J145J37o75n41K56L01K98l52q9m12K72N56P9q27m00N34J138
2420I20p24j66n12K80R01j24p19j66M28O60k69p49n08P67R08k76j285j93Q70N91
2440F34j01p25n88N86J182n87j062J07J002L27m69q26r8R06O19p77l46j09O02
2459B77L20m01n69K72N77J48k81p01L05M02L82o04J60p73P33M27L8o84n09M12
2479f9M79J36r46n67Q45Q63l50q75l53O26P73K39j115q21Q64J426m52j436k58
2498i91J293N52n32p84k74Q62P18l68j081k69Q60P05k50j089k60J155J004j014
$$ y = [289, -145, -675, -267, 644, 511, -280, -424, -44, 842, 449, -411, -606, 321, 1347, 221, -728, -244, 312, 840, 67, -609, -587, 289, 1181, 276, -1208, -562, 591, 528, -269, -498, -196, 256, 469, -384, -782, -200, 436, 602, 468, -381, -500, 645, 782, 107, -434, -178, 123, 421, 69, -20, -432, -160, 396, 475, -352, -752, -218, 920, 196, 30, -482, -202, 699, 575, -144, -310, 118, 778, 509, -240, -748, 19, 927, 651, -634, -827, 43, 634, 533, -192, -780, -194, 988, 401, -661, -554, 448, 775, 306, -520, -618, 288, 907, 130, -216, -325, 277, 597, 196, -373, -101, 476, 624, 343, -358, -53, 349, 731, 127, 287, -486, 247, 674, 712, 28, -481, -69, 410, 546, -400, -967, -122, 741, 391, -484, -837, -211, 562, 801, -314, -1135, -271, 1155, 703, -733, -991, 302, 854, 322, -462, -736, 126, 844, 476, -605, -874, -14, 691, 441, -648, -908, 247, 1251, 237]
2516B37p96K69P31K49k02k90o50N21P47j62o43m80N08L62K43j099j65K11L36K96
2536B23l79n15J61M65P20p32j333Q14J379r1p01l26L08Q14J26j326l26L40J044
2555F65K47j411o93J463N51j12o01r51Q73Q99J13j261k43N50O42N6r66n57Q26
2574I0J011p39r72J39L30L33N15m31r90L21R26k44o80j70O6J243n16l85r6l7P38
2595D52J59m35m57l47N68J003q39j152O63J243J66r36o76r5Q17P04q60m53l38
2614h13J626L39j076r28L74J336P0j012o20Q72Q58k84r99m68K10J091k0o11r47
2633a002N50J075j00j112k44M90P18M4m74l94L38N58K04n08m09M5O15M65o24p59
2653e24K61Q23j42l01p22Q2O07Q34m22j153l25J611N24j078j009J57J069L81k37
$$ y = [237, -559, -290, 441, 690, 488, 198, -452, 69, 816, 654, 11, -469, 39, 401, 644, -455, -620, -409, -73, 223, -156, -671, -510, -45, 675, -57, -1390, -576, 803, 712, 11, -315, -7, 807, 933, -393, -719, -379, 665, 912, -499, -1192, 271, 822, 710, 109, -842, 31, 930, 1043, -218, -461, 89, 731, 787, -179, -736, 90, 1101, 362, -610, -471, -141, 192, 707, 276, -714, -393, 533, 289, -391, -561, -495, 748, 232, -153, -249, -286, 452, 611, 176, -281, -628, -60, 943, 104, -1048, -385, 858, 1024, 88, -588, -683, 134, 838, -22, -475, -813, 813, 1152, 76, -852, -478, 858, 928, -84, -704, 168, 1026, 742, -257, -725, -515, 576, 556, -55, -1002, -452, 623, 523, -589, -833, -343, 375, 419, -55, -449, -111, 447, 651, 143, -266, -221, 394, 859, 235, -524, -263, 560, 418, 117, -605, -523, 84, 918, 496, -657, -982, 629, 1153, 75, -934, -777, 292, 673, 436]
2672D36j189L29P47M69o38r14l4J439N07j290q84O25J155r2o17n57Q8N13N92k88
2692C97q52j45J158O21j400m77N46J093j77o04n75PN53K70M23q53l15J74R39l90
2712C93j170M13O58M48o89l46P4L7P86L00j248p93J324Q99o09j297r0J111Q88
2731A089p62r50p7P42N87m19n81O8O01O55r0j510L4J367M57j258m87N67M89K11
2751G33m15q71J11O75L73m90j077N80Q00J37o76n76M51K36L19j09k42l74M2P61
2771C88L93p46p30J094K06j02l41l38J7M63N38j040n20O58P64l41p32q69J101
2790a37J317n63j297K28P83M92m79n22m91L55J352k7j639j00J322P00j073r36
2808g15M35P93O1j93n85JK84O8L01q50mL83N59m51q99M05N18K11%o09J90k35N38
$$ y = [436, -753, -424, 323, 792, 154, -760, -794, 645, 1152, -138, -1022, -397, 758, 666, 49, -508, -420, 93, 685, 397, -455, -600, 558, 1179, -221, -698, -152, 941, 764, 160, -415, -408, 145, 415, 838, -15, -330, -156, 783, 393, -777, -364, 294, 742, 53, -293, -219, -182, 604, 904, -344, -1137, 187, 1086, 477, -820, -910, 201, 1089, 327, -623, -700, 42, 629, 210, -371, -303, 298, 953, 863, -647, -613, 754, 1211, -47, -534, 33, 522, 733, 318, -553, -442, 233, 606, 116, -961, -381, 419, 556, -120, -696, -245, -9, 310, 201, -41, -415, -373, 388, 781, 35, -695, 399, 605, 503, 162, -176, -159, 304, 842, -198, -718, -60, 704, 363, -369, -1238, -137, 1180, 617, -680, -452, 331, 823, 344, -178, -669, -314, 1038, 1011, -628, -728, 594, 1294, 221, -715, -280, 513, 574, 381, -204, -203, 81, 149, 450, -400, -404, -21, 538, 87, -812, -407, 111, 322, 322, -287, -97, -332, 206]
2831B06M13n62r41P29Q00l93n21l92M26Q69M8p63o37L55P18L80o70q20O96N77
2851E18M84j576o15J230N71p5q08m92N65Q98J8j201n79J038N30k12p74R1M46M45
2871E02l26o39k17P08L41l36j94n43L43R36l15n74j10M94J15l00j99l7L55M29
2891D33K59p02n53K76N85j6k14q04M86N62j49n1o85N2M38O74m53j076K6J387L20
2912G95j020p77R17L91K59r45K3J49P40J50q32n12L58O79R6q96J5M68K14M10j141
2933d59n5L10N49m29J04j95m1K13N88q57k23P4N83P7l30n26J95M57L08j7m96j75
2955c45J91M55k10o21J01O59O00p80o77j31R71K60j78r64r9Q74P64o05j072Q49
2975D2M12K11o10q16P15N01M50q50p69L81N17K67k72n56L21L94Jo35j18K41M96
$$ y = [206, 619, 57, -884, -155, 645, 252, -269, -661, -235, 634, 682, -81, -718, -363, 355, 735, 65, -755, -59, 518, 1002, -574, -1189, 41, 612, 537, -271, -763, -198, 700, 718, -483, -1062, -24, 506, 294, -480, -389, 57, 502, 176, -463, -680, 28, 369, 33, -161, -704, -361, 575, 260, -314, -424, 70, 185, -115, -314, -351, 4, 433, 692, -10, -563, -287, 298, 282, 68, -736, -250, 312, 163, 112, -573, -521, -83, 591, 138, -938, -912, 475, 795, -225, -1002, -85, 306, 565, -380, -357, -208, 532, 682, -150, -662, -304, 375, 471, -425, -410, 58, 272, 682, -459, -514, -204, 345, -84, 20, -175, -216, -3, 585, -272, -495, -421, 162, 239, -91, -617, -422, 35, 343, 326, -170, -345, -154, 301, 91, -530, -429, 230, 830, 50, -627, -758, 213, 473, 295, -669, -768, 106, 870, 265, -807, 42, 454, 665, 55, -761, -46, 455, 905, 55, -714, -333, 184, 451, 179, -377, -56, 338, 339, -296, -414, -173, 323]
2996C23m13j52Q5l80P24P7l04k1r3M00J39m14J32l14J89K99k07m33J06L08M62
3017E13L6q61m72L59J022n30n80O9M66K04Q0m14k65O76N11n83j081M41Q89m2k39
3038A99n51M3L82N25n36m28J94N52r8l21m67O5N29N88n83n88M01K94L25k16l48
3059c9j93M71J66m49o9L3J65J2K6l19j47j49Q90k91k45j08j21L85L96l64k36Q0
3081a06O78l32l93l2M35K56j4m08q12Q70L70k60m73J04K03L59l40n03l2M72L35
3102C77q2j108O47J69K11r9k26P3Q4L94n93k23P9P99m67k32n07L09L90k57K90
3123B8k52k51J81L4K62j12m19L91L57j6k45j30k60P00L4l80q67L97Q98j12mo78
3145d44L29K09P6m37m89N23N27l01m33m0M04L97k12m84kM06L60n25k36L12j19
$$ y = [323, -90, -242, -157, -537, 187, 264, -40, -61, -154, 246, 385, -29, 103, -211, -22, 277, 70, -363, -257, 51, 513, 549, -312, -784, -425, 597, 67, -513, -444, 22, 226, 306, -108, -373, 303, 814, 231, -850, -409, 480, 438, 199, -352, -309, 73, 598, 62, -366, -172, 380, 282, -39, -506, -441, 88, 676, 93, -495, -94, 200, 525, 309, -39, -232, 239, 405, -44, -113, -80, 85, 97, 123, -196, -343, -492, 398, 107, -138, -246, -367, 18, 414, 50, -186, -106, 572, 240, -153, -185, 250, 506, 492, 84, -728, 142, 512, 252, -221, -117, 86, 445, 105, -398, -430, 42, 377, 295, -813, -166, 3, 214, 115, -111, -38, 46, 440, -153, -376, -297, 502, 35, -197, -704, -395, -5, -262, 28, -224, -475, -294, -260, 2, -110, -529, -138, 219, 203, -42, -172, -432, 268, 302, -78, -945, -548, 350, 238, 234, -444, -115, 94, 170, -267, -756, -233, 294, -7, -440, -480, -76, 321, 109, -375, -377, 29, 389, -136, -372, -60, -179]
3166a79K69k65j25j27M60n5k75o7O6L23J35j41r4j91J21J76k76L85L6l72J23K42
3188A69j4m90j14P38j88M7k15j48J55K56j71j15JJ21K36m23j25l60R63J09n68
3209a36m82L01N57J37k63o23K31J52K66n01K8K79N85o60q8j21L63L34p3l03k05
3230b22K65J68n27J44J97o3Q7K7O8m67K55J62P9l09R8j33Q4M93m58k11J38J77
3252E2J91j95k0j20J9O7j14l44J93L83K11l00k89k55L16K76k42j8J24j32K33J45
3274A81m10m1L46J66j12l93J86P18m87j99K62j21P1k01j76L31j67L75m12j82L4
3295b31N3L51O1m05Rj44J79k5J49J07r1k27K37M6N6j13l40K30L52q5k59m7M41
3318C04L0l92k44J22L94r9n9m32M19J63j42k05J05J68J03j96l68n0K52O38l47
$$ y = [-179, 90, -175, -300, -427, 33, -22, -297, -364, -298, 25, 160, 19, -75, -266, -145, 31, -245, 140, 176, -196, -73, 169, 155, -335, -449, 289, 101, 148, -67, -215, -60, 196, 25, -90, -89, 32, 268, -155, -280, -640, 323, 432, -136, -618, -317, 240, 377, 114, -509, -278, -126, 140, -361, -333, -54, 531, -129, -217, -338, 25, 359, 286, -17, -222, 43, 211, -316, -172, 25, -38, 49, 76, 144, -323, -68, 94, 173, -136, -38, -171, -87, 406, -52, -263, -125, 52, 243, 48, 28, -92, -73, -6, -120, -464, -271, 112, 323, 23, -266, -521, -205, 71, -171, -189, -65, -197, 36, 181, -229, -270, 76, 242, 130, -263, -77, 641, 154, -45, 217, 96, 167, -34, -210, 121, -46, 329, -83, -265, -231, -178, 173, 234, -171, -162, -306, -127, -152, -3, 104, 13, -214, 23, 69, 125, 12, -328, -98, 254, 169, -90, -137, 304, 334, -58, -302, -180, 214, 115, 56, -376, 43, 206, 64, -141, -36, 132, 235, 39, -329, -379, -127, 511, 164]
3339A64m61J27M34R2p64N82r3K52Km19O5o3K01l96N90K75p20K92k49l00M42P5
3361A28l12J02K04j31J06m16L40L44m41m39N63L8j17L65l66M7L76k25k73J87Q1
3382A61J05j74O3n78O25K2Nl76j45M35jl68R0J39O7K83j61n64L91K61j13J67l8
3405B96l11j22K21l69J42L30n53L07J67k68K22m2J10p2N0j46J79K0m40O12k37
3426I6l07J11N54q9l76n6J23N33m83q7l2K68k37k00L7J83m99N32K61m31j86N82
3448B97N2o09J39M75n3m50q6K42K48k23P2l20K08j04K42j83r5L5L60k62Q9n89
3470e15Q81J63r65J59L44K1j44Q8J08l26N11l68NJj75N2k65N8K84L8K00m02m7
3493b94O43k01k74o2K10L08m69K38o3J6r0KK0L3K0J1m37K8K59K29p3j96j44N34
$$ y = [164, -297, -170, 264, 356, -408, 174, 81, 333, 335, -84, -19, -82, 119, -277, 313, 588, -132, 160, -89, -389, 53, 128, -184, -82, 122, -9, 97, -319, 21, 365, -76, -515, 48, 86, -31, 334, -32, 15, 391, 166, -107, 80, 161, 266, 92, 155, -423, 202, 224, 229, -147, -292, 143, 142, -226, -136, 3, 70, 353, 192, -372, 19, 280, 167, 334, 296, -15, -137, 84, -285, -143, 187, -366, -59, 108, -160, 62, 20, 130, 58, 108, -38, 141, 161, -279, 333, 96, -211, -100, 454, 365, -11, -67, 56, 589, 106, 19, -13, 255, 18, -182, -145, 38, -461, 71, 332, -99, -285, 297, 349, -260, -121, 354, 301, -149, -235, 7, 255, 32, 104, -216, -8, -112, 130, -53, -148, -113, 247, -15, 74, -515, 366, 529, -436, -277, 67, 88, -56, 32, 140, -186, 325, -43, -38, -37, -212, -160, -425, -367, -83, -45, 155, -247, -294, 349, 148, -126, -188, 22, 330, -139, 99, 36, 52, -38, -36, -16, 17, 37, 48, -389, -361, -102, 127, 54, -142, -286, 248]
3517B48k66k66j59O10J9q3l1O0l03j46O65m90P4J52Q6m78J4J21N00l81J30m79
3539d03J51L57l16J5L46P6k59j53l89M74L20K56n86J89l59J9J15j72K69M68l85
3560C3k58M6L31N4m33J09Q1N2J71J05o66L60J82l13O7p0K64R5j51m39O97k36m14
3583c33M22j38J29J54j52j67j21J47j35L64k76l0N5P1m1l24M15Lp1m80N33K9j5
3606C9r9K34j00j35o6K9J91m9K20L3m78L15J32j79j98j44K37L28m41J19J55j20
3628B3K44m99r2L58J02J41k6j63l77N56j60l37J27L20j96k87L03k57J44J24m3
3649Ej89PL40k31J97J57k35j64L8n2j49M40k73j5j21N86r0l65J96o3l3K5P2k82
3673a99K49J97j91K2q8L8M5j76J94J59l6j04j22n9J68nj25J03k88K61n8J88l68
$$ y = [248, -18, -284, -443, 167, 186, 103, 72, 132, -171, -317, 348, -142, -68, 84, 170, -308, -294, -173, 327, -54, 76, -403, -252, 105, -211, -196, 150, 226, -33, -186, -575, -101, 219, 475, -111, 78, -281, -262, -147, -319, -50, 418, 33, -225, -179, 152, 206, -227, -118, -37, 15, 186, 291, -375, -15, 167, -146, -79, -149, 115, 210, 59, -380, 317, 81, -333, 89, -49, 80, 234, 82, -85, -206, -59, -194, 170, -106, -136, -81, -10, -51, -375, 40, 43, -28, -508, 25, 54, 39, -60, 174, 74, -61, -127, -98, 93, 44, 264, 297, -181, 134, 266, 87, -111, -255, -18, 310, -131, -12, 143, 23, 267, -232, -324, 34, 136, 277, 251, 88, -289, 267, 107, -230, -103, 217, 21, -266, 37, -220, -76, 48, 5, -184, -177, 163, -68, 129, 286, 51, -113, -75, -127, -276, 164, -109, -124, -245, 341, 251, -114, 82, 19, -14, 11, 83, -199, 50, 247, 56, 78, -10, 28, 73, -103, 91, 250, 214, 110, -12, -71, 97, 92, -33, 70, -218, 43, -15, 173, -195]
3696a95N7M23n9m00j29J53K67k78k28L65K24r3k13k79N58k21J74k30k43O54j50
3717A57N6l34J28J52j87l97L43K07j25J22l34M91l49L08j25q7K07J70m54M0j30
3738a41L09j16O8m34M39K9N5l05K3K44j22j04l3K48k72K55l37J22k12M48r5k68
3760a99M6J18N11k60j92P2J67l12J94J2k62L01kj06l3p2J67j57R0j5J83m6k60
3783e5L0J51j1O1l68K40l1O6m31R8J37L31j46j56J05L8j37J97K4j33l5J34%m99
3807c90N65L24n87J19j64L32k22O7k81J69M17m47j55K00K32k41J07k86O8p1K81
3828C7q0l42L21R8L8j3o6q8J54k2j97PK67j41K86j90j07L60k10j65N8J70P5l58
3852a08J39L2nM3k6k30R8K64J4j60J48K6m33K12k1j07L40l51K83L1m15L60j53
$$ y = [-195, -138, 285, 226, -174, -303, -150, 117, -161, -389, -24, 200, 107, -106, -385, 173, -48, 126, -104, -347, 307, 157, 213, -121, 7, 159, -28, -425, -82, 125, 0, 122, -212, 279, -70, 238, 113, 26, 233, 403, -51, -11, -141, 168, 52, 120, -314, 125, 154, 209, -96, -73, 171, 49, -55, -88, 160, -112, 143, -194, -72, -284, 164, 69, -199, -153, -35, 476, 216, 24, 96, 263, -49, 145, 157, -105, 196, 194, 88, 55, -17, 150, -7, 83, 68, 251, 205, -55, -25, 126, 115, 176, -192, 48, 17, 83, -348, -250, -113, 218, 72, -84, 21, 59, -78, 119, 143, 10, -25, 109, 109, -390, 175, 499, -88, 31, -133, 199, -23, 44, -237, -68, 349, -98, -253, -53, 179, -62, 45, -241, -173, -244, 37, -43, -385, -64, 34, 72, 59, -7, -95, 59, 37, -160, -153, 114, -27, 259, 69, -38, 322, 112, -53, 5, 175, 250, -108, 31, 63, 58, 101, 75, -155, -57, 207, 221, 61, 209, 235, -198, 14, -7, -114, 226, -125, 158, 189, -226, 134, -19]
3875a9L1l1M59l64k75J35K21J24k91J41k79K6L49L0p57O6L50K91q3l1k1%j57j58
3899b43P5jK76j24p1P6J19J24k49K75j29J57l08k24K17J24rJ4n34O11j69L06m09
3922i6J47J20r8m0j03j10L92k05P3l18P8L86J53n86J46J37L21n34J02J88k33J86
3944A06j29r8J83J83l78j92L82k37L42r2k74J06k1Q0K24r8k11J35k1l4p7N9Q9
3967B7L67n42K03m2j26j84L67J31j24j67l10N91j27L98o18R3K70k58L7k28PK14
3989b1j10J1m5p3J82j32j35L10RK45n14%M03j10K91m31K5L01k56ol0K83j07n3
4013C7K8l9r8j56M70j36l46K36J35o1Qj41j42L84j74k9j12J10j38Rk77K62K53
4036H3k31J14K50k33J37k78L65j28R1n9k27k5Q4jo0k42L65K82k20j92l11M63k6
$$ y = [-19, 12, -19, 440, 76, -199, -64, 157, 281, -10, 131, -148, -122, 227, 257, -500, -434, -84, 207, 124, 93, 72, 72, -85, -243, -168, -169, 107, -17, -88, -12, 107, 231, -18, 257, 128, 285, -23, -247, -30, 94, 85, 99, -435, 176, 7, 313, -96, 51, 171, 73, 33, -70, -180, 212, 7, 80, -238, -160, 226, 379, -207, -61, 76, 397, -137, -35, 153, -80, 106, -23, -121, 62, 245, -133, -325, 57, -180, 162, 70, -204, -98, -119, -39, 185, 87, -124, 11, -10, -44, -121, -62, 27, 394, -148, 55, 13, -113, -297, 70, 201, 77, -90, -400, 191, 64, 462, -156, -63, 207, -51, -14, -242, -235, -21, -131, -120, -165, -238, -56, -188, -323, -13, -4, 241, -273, -273, 130, 20, 311, -120, -95, 206, -50, -56, -86, 197, 90, 37, 65, 26, -72, -228, 242, 106, -240, -4, 131, 70, 78, -63, -205, 179, 5, -24, -136, -26, -164, -155, -432, -170, 83, -148, -34, 216, -17, 120, -158, 207, 79, 170, 111, -116, -141, -57, -58, -118, -360, 5, 287, 67, -125, -436, 27, 1]
4059AJ65j08l86L00k32J06Q5j50L42l67J95PM2J6J95m80J96K50J61m94O3N34j52
4082B89l73J18k14J87j47J5K16j96P0K46m80J27j59N02K6n21K83J30L25l09k14
4103g9j5l2J05o0J23p4O9k56M4K67j47L8K7j97K3K72n4q2K61l86N9J23l39J3L18
4128B1Qk8K5J01n6k20J10j51J93J85j23n1LJ58j97l3q9L17k33j80k2J83L10r0
4152A41L87n25k97N03m12p1N5L48L25o60p0L38l4p2J76r4r1o8J02j28j62O6K30
4175a3J70m80K34P9Oj81RJ5L52k27k9j31R3qPK66l51M08J52l49O2J68l17O5k35
4200b35K30K24l8j40l60K07J16N3l41K71L21j91k05p6J06L20j94j43p9K68j07
4221GM5j36Q0NLP6rkr4l0J51j40Q2o9K01k83j89N03j22oj62J90K06k19j64MJ42
$$ y = [1, 166, 58, -328, -28, -260, -154, -69, -219, 123, -244, -49, -42, 0, 16, 211, -269, -73, 177, 338, -156, -93, 441, 289, -84, 34, -180, 7, -140, -125, 91, -105, -35, 211, -269, -142, -301, 201, 227, -294, -11, 119, 444, 135, -79, -94, -126, -21, -81, 42, -32, 37, -219, -175, 92, -55, -17, 10, -187, -164, 108, 54, -28, 233, -153, -94, 29, -310, -297, 21, 29, 1, 26, 127, 71, -149, -39, -190, 3, 188, 65, 14, 17, 175, -22, -55, -144, 173, -60, -240, -262, -79, 231, 141, 528, 3, -294, 209, -203, -274, -219, 129, 454, -206, -276, 62, 28, -44, 132, 38, -53, -121, -19, -147, -309, -243, -13, 157, -323, -89, -10, -4, -185, -176, -161, 191, -36, -65, -196, -103, -111, -104, 162, -189, 219, 371, 22, 84, 252, -65, 0, -235, -5, 219, 181, 41, -319, -112, 4, 57, -284, -13, 308, 117, -88, -164, -58, 262, 68, -75, -154, 114, 7, 52, -84, -4, 1, 4, 80, 71, 69, -25, -55, 96, -44, 38, -31, 170, -113, -302, 201, 79, 73, -89, 101, 307, 88, -76, -72, 70]
4248G0k2j08K2R4j12J17k24j00L10Q2q1k29k07O90l75j9R6J07qj79K28k89J49
4271A2Q5n9K5K17j74K55m80M4k76O81k09qn4n8R7j45K84p7Q8l58J63q9J39K15
4295C18l93q2J79m3R8j34q7J61p9K96j33m47N07j74J08l22M41j33K23j82l26J13
4317i1N13j95l64L17r4j74j3q1M81J8j86j50k63M03O9m01J89M06j71l24RK5m31
4340e08O26q5k56J50N35l23l94O1J32Q1o4n5l08N03k0J76m34l5J88K36k26J06
4362H6n7k3j5l44J94J73J83l05k0L39L5l13R5k82M20j90m8K62n0k41m5L16j94
4385b4k11N5L19m07K21O4K86l30k42K93j38k40J63K97k65L21r3l08J52m1L16o4
4407A24J00n44M25jj08j29J24q1Q3k95J79K18j36K70o32J87J77J50j44l15K37
$$ y = [70, 48, -60, -38, 56, -56, 61, -163, -263, 47, 129, 48, -181, -388, 302, -73, -92, 4, 111, 103, -76, 152, -137, 12, 97, 38, 63, 280, 106, 361, -119, -75, -351, 330, 121, 113, 59, 1, 98, -47, 237, 160, 248, -110, 53, -36, 103, 318, -75, -157, 22, -21, 77, -57, -144, 17, -62, 234, 101, -346, 161, -13, 95, -227, 214, 81, 304, 122, -204, -91, 422, 227, -137, 180, 86, -88, -101, -182, 299, 317, 131, -19, -282, 121, 190, -211, -22, 384, 213, -111, -102, -77, -508, 118, 33, -223, -73, 462, 139, -255, -194, -62, 19, -45, -100, -408, 95, 75, 251, -183, -218, -30, 206, -20, 86, 29, 6, -9, -353, -159, 14, 197, -108, -128, 211, 246, -67, 28, -254, 166, -24, -72, 190, 140, -101, -146, 170, -24, -235, -180, 139, -268, -47, 17, 303, -27, -269, 24, -114, -354, -191, 106, -159, 162, 69, -239, -87, -128, 188, 124, 224, -320, 105, 104, -4, -133, -9, -90, -7, -302, -123, 95, -41, 229, -403, -216, -39, 111, -33, -348, -111]
4428a11P1L2J67k07j3k0j1O6K76l01j83K23M4q5j54K81j73p8K76O6j62o7J77P8
4452A92l16r1J07P2j05J01L25n13L66j46M2j78K16j39p8K81k18o5R1k59K45m6
4474a16K42k28o1p4L39k40J28O0j04J76P5m41K88r1J92m1k33k14K40J82k56j84
4496c61L34l3r8R9k4M03k96n5J99k37nK44m18j42L98J50j89K61l78K81R8m05K11
4519C7j63K48m3k34J81j38K20j81J49k22P5L9L10Nj57K05l38M9jk44L71j24L8
4542H2p0O1K07m53K96q1L0J31MOo0N3j24j21J24K63n3l19k5l0M9J18k97J38K8
4567d3K3jj96O7J57O4k49j0L8K00J17m09p4J69J56n1J7K08j21m5k25L37l90r9
4591c60M49j32nL35k12j89p8K66ll2J35j91j32M05k47K2J79l96L81O4k87J44j46
$$ y = [-111, -40, -8, 159, -48, -61, -81, -92, -26, 250, -51, -234, -11, 33, -52, -206, 75, -98, -176, 100, 166, 4, -63, 114, 192, -124, -215, -108, -36, -141, -40, 285, -228, 138, -8, 34, -144, 72, -67, -145, 136, -82, -147, -56, -315, -70, -116, 126, -102, -163, -237, 102, -138, -10, 50, -54, 122, 197, -244, 44, -47, 145, 104, -129, -343, -103, 79, -177, -361, -27, -60, -158, -59, -83, 320, 24, -31, 168, -69, -74, 170, -248, -390, 8, 158, -31, 230, -148, 133, 231, -174, 37, -126, 122, 79, -155, 26, -112, 108, -73, 76, -146, -71, -32, 278, 283, 126, 331, -7, 42, 41, -203, 168, 44, 82, 12, 73, 280, -173, 123, 42, 72, 203, 207, 213, 153, 206, 82, -39, 85, 348, 295, -24, -49, -79, -30, 88, -209, -71, -43, -20, -21, -217, -150, 7, 71, -178, -188, -150, 50, 167, -242, -316, -147, 9, -42, -25, 183, 62, 17, -208, 129, -261, -360, 89, -43, -48, 287, 75, -114, -192, 74, 71, 39, 174, -17, -149, 256, 9, 31, 210, -186, 195, 259, -28, 116, -30]
4614c0Q7k94K19J11r2pr8p6k4M65k25j01L43l70J71p4J00j25J62m06K01J85l83
4637b61J00K63l14j40L76O0p2Q6n8j62L71o35J50L44J7l47L62j19l02K42k8K76
4659B09J28j76m41J34L2K84K2k94j07L62l20m9K07M2r0J48k94M33j17Q5m91J40
4681a53r0N14m48K02j25j20L71j37k38K18r0j17M02k40J19p7M1k2j78L53l15O5
4703f5K02j75q3m3M13p6j81J24q0m26K47L73K3l61K22l28K99k1o4j51N7K73k05
4726b6J37J81n3j65j79L72l98J22J97k61m30M22L02k57k21J32j45L35j39p2K5
4747a21J07J55k32R3n4J79M1l86L56m02K10k09l3N43k93J30m9qO5J20l02J8j9
4770i1J94j77K32q2k83N00j29j36k23L19MMj06k4j92N49m39J19k7P0q2K54k74
$$ y = [-30, 57, -237, -18, 93, 1, -6, -104, -180, -204, 261, 36, -65, 278, -92, 79, 5, 105, -20, 142, -264, -63, 122, -261, -161, 102, -212, -352, 24, 84, 12, 98, 40, -122, 249, -386, -236, 108, 125, -222, 140, 21, -281, -39, -67, 209, 337, 161, -280, -146, -114, 170, 192, -102, -209, 153, -167, -216, -9, 33, -57, 91, -203, 230, 113, 198, -293, -153, -243, 271, -177, 25, -100, -220, 151, 14, -224, -6, -96, -213, 189, -51, 68, -9, 32, 10, -168, 185, -130, -65, 137, -38, -121, -164, 249, 173, -8, 116, 36, -390, -143, 230, 253, -108, 114, -214, 85, 64, 0, -151, -94, 179, -26, 111, 292, 239, 74, -105, 267, -131, -9, 188, -73, -503, -81, 221, -36, -257, -125, -270, 65, -74, -146, -121, -14, 141, -91, 2, -52, 127, 168, -218, 138, -264, -54, -263, -296, 247, -46, 84, 35, 27, 92, 212, -90, -72, -91, 103, -74, 158, 76, -207, 293, 164, 28, -195, 124, 128, 132, 26, 2, -190, 359, -80, 39, 12, 82, 0, 254, -20]
4793b0r2R2Q8j50L8lk29J83J21O0r4K23P0j95j87N4k73L85O4j85J25l56L63j82
4817a00M2M3k41J72J80p4j18N7J6J89k60Q9k32N32j94j33K46j96L6k83K79k76
4839b26J05J97o8L7j12O3qr2K84j05K69n74J74l20O2M98j42k04O7J37j32K03k5
4862H8k21QlJ2L72k96K10j02j97J14J56k36O7mj22N67o95p4L09J96m5k98L2L63
4886B01j15k55R3j19K4NL88j26k12K9J87l22M86l27J8qJ90J40j75l93J51L69j23
4909A06l46K51K01J31l24J07q6K85j66j87l7K42l89L13o0l70M62q6J20K73l54
4930H6j24k08L12j68j74J82L99j93l02K94k11O8J36l24J59n4M01R1o50n3N11n9
4952A19j73L08m7J55j15j68Q1m61M06m39K69J20J18n0K30j34l12j09K52k96M27
$$ y = [-20, -112, -20, 68, -82, -44, -47, -276, -93, 28, 88, -6, 217, 287, 92, -95, -41, -314, 71, 135, -50, 75, -281, 82, -100, -58, -15, -256, -84, 96, 22, -96, -39, -23, 166, -94, -5, -237, 295, 101, -32, 214, 18, 54, -229, 50, -226, -121, 76, 8, 45, -67, -4, -12, -104, 180, 75, 344, -230, -56, -376, -314, 184, 42, -162, -95, 42, -90, 113, 88, -133, -125, -128, -116, 256, -40, 170, 68, -129, -15, 141, -95, -28, -32, -154, 413, -282, -356, -47, 149, 104, -194, -162, 201, 86, -169, -76, -195, -171, -166, 222, 96, -116, -87, 100, -222, 264, -63, -45, -53, 137, 277, 102, -291, -140, 229, 106, -240, 11, 212, 343, 19, 126, 40, 325, 159, -28, -65, 177, -212, 101, 41, -329, 133, 47, 167, 440, 86, -38, -246, 66, -102, -276, -94, 305, 112, -190, 104, -107, -39, 97, -227, -68, -122, 279, 370, -280, -333, 178, 119, -54, 254, 207, 362, 247, 79, 160, -301, 105, -334, -65, 55, 173, 123, 353, 219, -93, -202, 50, -246, 181]
4973A81m23K57k05J43n2L53j38l92L01K07m58N5K07j39k49N43k92j75M85j68j54
4994a13K11m48J30N13n28K48J52r2Nk46M3L30j24j4n8j9K75m66M2J87k21L25R3
5017B25l03R1m5L3k2m8L50k42K8q9K02m55J48j27J00J38j6J12j99P2K8L8p4J70
5041A15l69M04p6j23J59k32J67n1j4p2j41M05k02j53Q7n6J68J31n03M30O6m04
5063b64K16j43J85O4j72o1J6L26j10P2k27NJ81M6j3O3k30K83k51o3K75n3q4K16
5087B77j3k48j62K91j34n3l1O6N7m96N15q9o3J81p8m4J15o9O3k52J04mm48L75
5111a40J60m6m3o3k67N04j4J46l61l24N40n4J59j39j52J86R4N9o08N07j83K3m6
5134f2R2l3O4m2j87J44j45K84k74J8K86l36N4K89k39n6L50J0o69K31j7N3Q5J91
$$ y = [181, -242, 15, -190, -47, -99, 254, 116, -276, 25, 232, -226, -171, 36, -103, -352, 191, -101, -276, 209, 41, -113, 98, -350, -220, 293, -235, 13, 165, 73, 78, -168, -125, 205, 81, 67, 9, -10, 265, -201, -159, 28, -193, 132, 225, -78, 13, -32, 1, -21, -69, 281, 39, 67, -22, 180, -275, -127, -254, -154, -16, -32, 80, -119, -47, -19, 19, -55, 115, -254, 150, 74, -49, 110, -122, 45, -6, -20, -92, -233, 172, -30, -183, -96, -152, 16, 147, -356, 74, 140, -264, -48, -191, -6, 58, -114, -175, -159, 167, 57, 129, -98, -93, 88, 134, 121, 184, -46, 237, -14, -77, 198, 145, 61, 277, 264, 16, -146, 145, 11, -42, -73, -7, 50, -446, 69, -20, -83, 98, 20, -24, 91, 22, 85, -167, -63, -67, -515, -140, 20, -26, -69, -132, -399, 105, 91, 237, -124, -448, 92, 38, 197, 58, -94, 92, 186, 245, -363, 144, -39, -16, -62, 30, -3, 61, 19, -168, -24, -169, 115, -159, -141, 145, -191, -137, 152, -87, -143, 207, 217, -452, -221, -238, -185, -100, 91]
5158I1p0K62m43l6K36K12l73J16N7j41J76k73J1o9M96k71J56n0k8j45M4O8j70
5181a44L7R7K37l09R3K84l53J89J3k44J03l0J91q1l96L24P5k31J51P9k52k51O20
5204B02m00O5J32p5N53n60K7J91k26K34M6J33l75l08L25J99k68O9n0J55j79K0
5226i0Q3O5K47k98n9K5J24K47l13q7L2J23J25k58K50j45l48K27P2M5j06mJ37j25
5250c1j91J91J48J19n6k60J91m3M2O5Lj03j76K23P3j52N7j30J23L9j35k98L41
5273D0lln5p1M2J27%k13K57k35j00M45k6j94j02M50m87J90m07N34o5J23j56k84
5297a93M15j81L2o0n4K25Q4l92N3l57O72j44l51qL09j12P7L1k08N9M3M05m36K36
5321A45pK4k34J86j32q7J68k58L03j77oO9q8M24k47k72K74j35j4J5k10L14J78
$$ y = [91, 21, 283, -160, -196, 40, 252, -121, -5, 52, -89, 87, -186, -175, -244, 252, -19, 137, 87, 59, -86, -42, 26, -144, -107, -10, 227, -82, 11, 295, -58, 131, 144, -100, 3, -27, 164, 83, -313, 11, 86, -145, 6, 85, -167, -418, 202, -198, -133, -1, -76, 477, -83, -56, 135, -91, 143, 189, 322, -53, -361, -36, 163, -105, -36, -86, 69, -110, -90, -7, 58, 305, 7, -52, -27, 97, 344, 31, -56, -24, 99, 224, -34, 216, 71, -277, -50, 22, 67, -39, -43, 94, -31, -222, -31, 117, 236, 180, -80, 111, 68, 110, 175, 178, 75, -101, 122, 195, 43, 100, -30, 93, 132, -3, -301, 40, 37, 34, -21, -92, -50, 77, 77, -136, 121, -114, -214, 231, 205, 11, -91, 359, -128, 62, -345, 189, 124, 247, 91, -193, 222, 41, 73, 13, -41, 184, 268, -124, -71, -428, 244, 100, -251, -259, 50, -62, 15, 46, -162, -103, -60, 345, -91, 145, 138, 162, -72, 114, -18, -105, 63, -195, 108, -69, -75, -6, -94, 330, 83, -189, 85, -50, -64, -49, -259, 55, 233]
5344B33j83j23k31N76p6l94N7J77Q0N47n42j54K84J70k32j68l25M05kL4q4k22
5366a73K20J34l14J70j8j05P6k78R5K77j20l4L88m39j62L76n7L64n53K52O4j21
5388D2k46K07J22l29J41k7Q8Q7k46L41n8l6J81l31k35J65J64j50l6J30R4n8r1
5411h1j08K24k31J58J16l87M75k68j5n4J13l8J77mk52j82N20j09m25M18K21k10
5433E8j07J28k06Q3J91r4n0M9J6m0K27j67j08J86k87p6J14n5K29J85k95J0K37
5456B28r3j56r8l0K33L1l51L68m4j22k55QL29O5j53J60J18k15p2k62L97J88m38
5479a64K4l8K54k74NK24j12k1J40K06m83K65J51l8R0k84L97n41J48l7n5K84k60
5502a19L7Lk67K29j10K83k21L08k17o4J32k86N20j11J70l68K12j29L08k58k30
$$ y = [233, 50, -73, -304, 272, 196, -198, -141, 36, 116, 663, 121, -33, 251, 421, 189, 21, -304, 101, 99, 133, 49, -173, 47, 181, -133, 37, 19, -86, -10, -288, -193, 84, -36, -70, 318, -121, -283, 93, 36, 400, -153, 99, 163, 42, -204, 3, 125, -204, -63, -90, -2, 85, -161, 180, 122, 86, 267, -64, -299, -134, 30, -120, -156, -26, 68, 10, -81, -189, 35, -196, -38, 78, -309, 166, -102, -117, -171, -58, -96, 81, 77, -175, -357, 163, 54, -371, 47, 268, 58, -49, 79, -127, -44, 147, 53, 3, 52, 68, 28, 255, 88, -20, 166, -121, -197, -83, -138, 91, 276, -19, -9, 228, 135, -21, -119, -149, 84, 115, -236, 132, 88, -34, -289, -281, 48, 113, -40, 120, 238, 23, -49, -311, 86, 274, -164, -140, -178, 76, -198, -193, 31, -81, -102, 38, 244, -239, 26, 177, 139, 229, -55, 342, -199, -51, -88, -143, 141, -119, -82, -79, -346, -117, -227, 56, -165, 143, -74, -138, -6, -292, 228, 117, 287, -81, 131, 2, 310, 52, -178]
5523a78J46j9J44k62o2L77k2k35L10k7K07k93l1o4M5L39n84K07j44J40j1m6J22
5546E9q3m6J64j81J37J97p3J8j77n8j93M2J15J46q0J74j08l48N59k83j09J84j10
5569e4k3J14k04J20J22Q5k11n9O4J19j62K7k9J3J47j07l6k09K39j20J47j37l7
5592a91J7Q5L29j57l17K98R4J12j76k8J05q7l9k35O0J86K60j95l29L68l30K54
5614H4J48j64q8K76j91J1L1k79L1O6Q9l16N35j09m3L3K1k23Q0K4J6J3j34j12o2
5639b63N23n47J86J48L34k43n37L27k00J97k60O05m17K72Rm1n3J3k10L45K9l30
5661a13k19L86o4L3qJ38mj12J50n26L54o9j9J64J87j30j90K7j23K43P6n5%q3j69
5686a26J20n5j49K80J42k29k28M34o8nP2j44K5L4J1k42J54k26J60J15L1j27j27
$$ y = [-178, -32, -51, 93, -169, -231, 146, 124, -111, 199, 172, 379, 86, 55, -9, 36, 375, -209, -2, -146, -6, -17, -63, 59, -24, -70, 94, -87, 50, 247, 174, 192, 15, -43, -236, -194, -79, 67, -13, 161, 53, -295, 264, -19, -128, 56, -54, -77, 37, -167, -47, 75, 160, -51, -110, -46, 73, -89, -62, -91, -78, 69, -38, -74, -283, -44, -164, -17, -154, -191, -174, -89, 240, 83, -234, 64, 158, 270, 94, 66, 171, 84, 45, -190, -130, 56, 316, 121, -208, 160, -170, 84, 232, 68, -20, 256, 65, 76, 107, -172, -141, -75, 14, -302, 233, 124, 81, 114, 135, -88, -8, 16, 32, 45, -89, -201, -263, 260, -287, -101, 47, 381, 138, -399, -72, -272, -75, -335, 270, -147, 125, 134, 93, 40, 53, -157, 188, 217, -113, -332, 54, -10, 23, 15, 153, 149, 37, 187, -339, 15, -54, -73, 91, 278, 148, -42, -15, -138, 105, 181, 126, 126, 43, -126, -6, -61, -210, 70, 212, -17, -245, 189, 121, 116, 188, 44, 69, 103, 114, -128, 26, -200, -40, 75, 106, -21, -148]
5709a48L40j9k3o8RJ65k26j76pK61R3l01k0O9K9J56P3L2j43Qj12o0N9J27j41K35
5735B12Kj79J24l21lL07l01J06L34k85L4K5K37l43L0K49j91j29Q7ok15K02K87
5758B63k86J70k50J1J40o1n6M19l68j23K5K95k03j59j9P0J88M2k61k1J31J14J51
5781B12m13K83k79M05p6k84M60l53j9L44p32L06J75j16LK33j34Q7o5Q0j86rL90
5804C12l74O2J5k37q8L79O4j99q3k1J84L96l43J1m37M34J89n20J26nJ69pj18J63
5828G2p5o1P6j83q5L91j90K99j02j29j90K25J84l46K35P5Pj75q4Q8k03J06J47
5851H2k03K55m04M04j69k9J7j87K65o7R4k27Q5K41l05J52k83L76q3R3o3k4m21
5874d01M64n60P54l75J56J45l25M17k63K8J73l36J1L54k50K81j60l56J29R1j55
$$ y = [-148, 192, 173, 150, 82, 91, 256, 30, -146, -153, 108, 201, -100, -120, -51, -22, 134, 207, 239, 96, 104, -8, -68, -9, 118, -23, 212, 214, 35, 159, -162, -165, 142, -159, -53, 281, -4, 30, 55, 292, -51, -21, 228, 37, -92, -5, -11, -226, -24, 263, -23, 147, -103, -92, 48, -13, -69, 350, -18, -141, -116, 179, -24, -183, -202, -132, 56, 98, -163, -184, -53, 61, 212, -201, 82, -197, 208, 132, -152, 308, -45, -64, 280, -452, -146, 29, -87, -84, 149, 15, 102, 37, 117, -69, -78, 312, -62, 0, 15, -222, -310, 69, 133, -66, -149, -170, 14, 410, 67, 78, -359, 75, 264, -256, -130, -135, 34, 27, -91, 72, -3, -64, 12, -171, -256, 135, -55, 244, 142, 13, -177, 48, 232, -114, 121, 196, 203, 28, -56, 32, -171, -65, 82, -121, 134, -270, 134, -35, -64, -47, -234, 31, -36, 58, -169, -84, 157, -148, 4, -279, 97, 14, 107, 44, 20, -401, 63, -497, 257, -118, 38, 183, -142, 275, 12, 40, 213, -123, -112, 242, -8, 273, 113, -243, -114, -23, -178]
5895a78Q2J04P8n2l8j83J82j16J96K40l56K40m13J03L16k37j08M21k93P8lj01
5917c8K68j63K60m87M15l19J23O3q0j16K12l49k95N94J05l35L4J11m8mj26j31
5939c06O55l68j15j19M20j57P6J61l0j16K7k10Q7m9p1K44k5l37J74J33K9j04m37
5962d38K57R0q7K22L8P0J6K20l16j5Q9j30l6q4J97J9o0q9L18n04j5M46N1k10J2
5987F1J21l97J65J53j7q7j95J4K32K16m62J0J60J07j04l45K81K04k13J66m2n7
6009b9J21r1k50L76l71J88o0K82k9J09l31q1K63k01j8LP6L3mK25j89K9J19l24
6033a54K19k24P8mj5L13J3l22J34j03J39L1m7rJ22j23n0K60j29j25j25K55k19
6056h5J40N4j95l01L64k86N53k28L6o3j00J84p9pL18l9m00L26j48R7l09mN8m9
$$ y = [-178, -96, 8, 86, 34, -4, -187, -5, -121, 75, 315, -41, 199, -214, -111, 205, -32, -140, 281, -12, 66, 63, -38, 230, 67, 327, -160, 255, -64, 59, 122, 42, -74, 138, -211, -506, 88, 193, -142, -108, 3, -45, -49, -175, -306, 349, -19, -134, -253, 167, 10, 86, 247, 217, 101, 128, -82, 5, -44, -115, 129, 104, -233, -59, 74, 103, -1, -438, -181, -91, -178, 44, 82, 152, 168, 388, 72, 57, 146, 16, -20, -104, 93, 112, 52, -37, 281, -223, -238, 208, 259, 49, 61, 182, -215, -50, 103, 86, -1, -196, -182, 50, 266, -196, -186, -26, 81, -23, -368, -87, 117, -96, 70, 28, -29, 92, 1, -249, 127, -244, -56, -116, 166, 137, 246, -85, -166, 97, -104, -122, -119, -43, -10, -14, 211, 22, 51, 170, -154, 65, -159, -81, -85, -100, 213, 226, -96, 38, -65, 74, 105, 58, 49, 171, 48, -2, 258, 129, 4, -121, 134, -85, 55, 109, -86, -387, -23, -309, 244, 16, 52, -11, -111, 73, -6, -13, 305, 266, -134, 192, 44, 141, -168, -172, -114, -163]
6080a63Q1K39l70K36O0o6k09KO35m34J6K15m58L20J07m67K84n3J96j9m59K86K98
6103B77k11l94M00J7J31M0l67j74M87l53K99j90j7m9J45j46R9N2R8L7m36L37j18
6126c6J63N5j40k2K48j17j97J29k91L03j38j87K39o5r7J22LJ63J75m68J48K39
6148B29r7l68M02k46l0L94j19l35L76n5L6k15p4J19j28k89K77k3K91rl8j24m23
6171d49N56o6Q0m4n7Q1l8l63M6J24L21l96J0M34k73l04O7J97MM30n99L23l44L99
6195A39l30P7J36k74L73M1J13l76J61l71L84l2j88J25pj38j19K35j5m3K42l42
6217b09R5J56J86l58M4P9J32M7Mk64p9K09Q5j63N1k09J04m8K16p3L94p41N20j87
6241iJ3J33m47N10l98k04M72K09l05J61n12J68P7K25m9K71l89j32K84o5j01l8
$$ y = [-163, -82, 157, -213, 23, 83, 17, -192, -190, 445, 11, 27, 242, -216, 104, 211, -256, 28, -25, 171, 152, -307, -21, 277, 66, -328, 72, 89, 220, 260, -107, -281, 206, -147, 152, -38, -55, -104, 41, -105, -6, 46, 144, 181, -255, 82, -36, 127, 182, 42, 20, 268, 151, -46, 83, -208, 95, -43, -230, 9, -56, -153, -31, -28, 135, 310, -158, -10, 229, 132, -236, 166, -80, -110, 284, 165, -170, 206, 151, 187, -28, -102, 17, -111, -400, -123, -146, 145, 136, 98, -26, -449, 107, 41, 121, 77, 20, 101, 63, -300, -254, -130, 191, -205, -195, 239, -34, -338, -271, -74, -70, 360, -239, 84, -260, 139, -191, -114, 22, -252, 121, 162, 275, -101, 60, -311, 73, 41, -147, -22, -29, -167, -286, -51, -66, -109, 133, -209, -114, 42, 228, -130, -86, -7, 125, 172, 176, -88, -167, 42, 127, -36, 15, -194, -90, -138, 78, 5, 399, -342, 178, -9, 4, 137, -310, 200, -198, -402, 70, 279, -26, 135, -377, -209, -132, 93, 44, 315, -74, -206, 78, 13, -88, -126]
6263a26P0J01l15J45K50o1j02j5J53k26J98L8LJ5o8o9K05q4k66P5J6Q8k81L17
6287F1JL4j33k05K04j06M00k86Q5k41m4K08J8R6p0n16M21Q8j24J87N2L0j05k26
6311a71J33K6j64O7K72J4m14N59j61k53J94n0j34Q3K29l34j43M70j60J51k27k02
6333b15M37l36j31M83l93m5K80o7j31J98K21r6l14K47k86P5K87l59j3J95j6J06
6355A27j74q6J93K3Jm1J62j63J8O9j26J52j70k93K62%L2q3K79q1m9l24L24j57
6379a05K40l3l32q4L03n6j03K4K9q1K84k51P2j97K39K00m9k28j46J15M78k53O3
6402A29OK23k81j85j74J87L82j20j54Q2L0j42O7L04k13j61O2n7k6K17l0j46j68
6425a68J38P7j51K7k5k16L22j22j9K34J00l69K01p7N9J39j83l40K97Q5k91K36
$$ y = [-126, -56, 45, -270, -125, 125, 64, -38, -53, 100, -126, 72, 110, 113, 128, 60, -9, 196, 112, -154, -79, -63, 25, -256, 61, 62, 96, -37, -242, -38, -144, 256, -30, 55, -186, -230, -22, -4, 92, 22, -494, -73, 15, -109, 78, 130, 160, 55, -171, -38, -12, -176, -109, 163, 177, -237, 322, 161, -92, 102, 52, -82, 1, 230, -104, -247, 223, 63, 214, -13, -215, 222, -114, -245, 238, -155, -200, 80, 13, -118, 80, 301, 205, -109, 138, -148, -73, 214, -145, -158, 37, 21, 127, -47, -133, 60, 83, 84, 43, 205, 42, 60, 129, 3, 155, -15, -308, -46, -46, -14, -97, 182, 101, 52, -272, 52, -105, 135, 102, -230, -314, -11, -67, -170, -146, -117, -198, 86, -165, -93, -290, -51, 149, 100, -128, -274, -159, 319, 66, 129, 135, 358, 77, -108, -282, -95, 287, 167, 13, 95, 125, -17, 50, 354, 141, -20, 42, -15, -41, 176, 146, 0, -168, -30, 47, -104, -77, -102, -318, 4, -118, -137, 97, 197, -172, 29, -48, 11, 150, -33, -373, -76, 9, -282, -46]
6447d6N2k24J95j48L06K4j46OQ1r5k2J13J30l30l5R2K34l36K3k85K79j62J06K21
6471C3P1j23p1K46k27j02N28k51n1k37J84L0j46L3jJ25k13K21l53L95Q2r8p1o
6495bj21J89J72l19j6n1K04l07m8M44k60K08OJ06l30Q2N8j37k64M44m01J46K94
6518I7J04k99j63J37L8K6LO5j79M06k05qL2ok6n9n5R2L3J06k16p4O1Q4n6m3J24
6545A9k79J39K73O4j24k39J99j14l5M14k89J58M6K6l36O3k71L52k29J92l5j39
6567a45P6O0j82L98k21K18n0p8J28J35m42J29r0J74k59L95m3l34J14lJ65j92K16
6590A69J21N5k42j25k96M17q3K68j76j21j49M36l15J85oj73J17r3J98j93j24J78
6612D8K6k97L54M6l5k73N6j97K26K56l60r9L2J94J64j13j81K51R3j06m21K53J56
$$ y = [-46, 6, -218, -23, -171, 135, 159, 13, 19, 100, 5, -17, 96, 226, -104, -139, -47, 187, -149, -126, -411, -132, -294, -188, 33, 104, -19, -90, 156, -71, -173, 355, 104, 53, -184, 0, 30, -116, -83, -84, 41, -172, 49, -304, 91, 173, 75, 4, -2, -123, 66, 238, -81, -97, -148, 56, -251, -299, 145, -115, 93, 99, 205, -125, -43, 15, -122, -386, 58, -343, -197, 97, 201, -98, -261, -124, -86, -60, -57, 8, -171, 235, 30, 22, 54, 48, 22, -37, -92, 0, 33, 139, -77, -151, -90, -6, -62, -105, 19, -260, -121, 152, 216, 92, -147, 52, -62, -97, 317, 28, 186, 232, 258, -78, -15, -286, 66, -163, 29, -6, -145, -69, -9, -191, 207, -14, 204, 154, 76, 204, 339, -103, 26, -64, 110, -149, 246, 203, -131, -17, -20, 145, -47, 169, 290, 345, 103, -22, -318, 99, 16, 284, 108, -13, -162, 274, -41, 144, 138, -35, 82, -11, 187, -6, -130, 48, 74, -223, 131, 177, 142, -131, -75, -272, -46, 210, -150, -249, -217, -23, 141, 28, -153, 98, 191, 85, -336, -83, 73]
6635G3j24o4M16k04l00P2J96k37q3J64j16J86k14M56n9K3j5m0k28k26O16l19J37
6658A10n5M3N1l11K57J60m49J96K21m7k43L73k51K4l60K43j06K13qJ24m42L01
6680D4O0J16m84J99K27k58k16L12K6j79j0L91j11%J05k80j07M36j89j70P3L27
6702C12k70L5M32o76J10k4r9J20J54m9r3J43k3m12L76n8j5L52l46P0J72l92J81
6725@Q6K07j04j10K7j97K92m6j84m8K4P3k72K07l1K87l72K88j11M4k6j72q6K31
6749Gn1K16l4j98J44p9J5j03jk86K64k3O8j74L45l48L44Q8m70Q0K56m79L64P7
6773B2j36K37P0k56j21L46k72l0M30k71K65l49J2K66k87K73m48K58J50j52p9J28
6795E6p4j64L74k69O7j8j4j52M07j73q6L48l54R8l65K87K32j59Q7m1J71k04L3
$$ y = [73, -51, -115, 301, 97, -203, -131, 65, -172, -255, -91, -207, -21, -235, 221, 162, 185, 170, 130, -98, -324, 292, -27, 110, 55, 98, 149, -162, 95, 255, -194, 2, 223, 176, -67, 306, 55, 79, -281, -38, -144, 69, 61, 185, -257, 44, 104, 220, -264, -65, 162, -96, -312, 0, 26, -153, -163, 228, 117, 117, 222, -58, -165, 271, 82, -88, -15, 312, 42, 77, 509, -167, -57, -81, -180, -60, 94, 45, -48, 95, 72, -340, 36, -22, -37, 315, -31, 39, 211, -181, 0, 86, 293, 189, 79, 106, -91, 201, 155, -29, -77, -53, 20, -252, -45, -76, 211, -161, 127, 16, 60, 34, -138, -224, 7, -44, 172, 138, -60, 84, 5, 20, -83, -84, -370, -106, -129, -61, -235, 110, -238, 106, 194, -276, -196, 60, -419, -55, 22, -114, 123, 193, -63, -184, 162, -110, -140, 290, 19, 284, -65, -53, 213, -74, 199, -249, 9, 159, 7, -72, 56, -18, -182, 192, -77, -10, -28, -42, -194, 213, 40, -46, 302, -52, 46, -319, -32, 200, 41, 128, 87, 258, 54, 87]
6818H7m53K75K28k98M8K42j30J55k6k06K26l84J36J62J95j38K15j64j28K42k48
6839C6L7k69K40l11M65k21N9J83j81K54m74j4Q8M14r72Q01J09m50K27j17K15m76
6861c57O09l67K13m2l24J29K80k13J19P2k09L3L54k14l48N4K1M04k97l33N65k70
6883a21k25J61K60j31l0RL09k29q9J67K61l80j20M47k84O7k67o2K29K45j96qk97
6906b84L57k04q9J29m2J58l3J71m9j72L7K14j46q4l40N28Qk06J93p2j27J98r5
6929E0J44j95K58k65J2O7j17J33J9m75L56L93q40L96K70l29p6K19J52L8j40j34
6951f4K10j6k98J77j35J23N6l9lK0r2L2P0M0p3L1k08K15j40K27l08J66J61l47
6975a95L07j42QL5l06J93j1J1K40k77L07j03l04J13L90j42R8k86k2N03o47J26
$$ y = [87, -366, -91, 137, -161, -113, 129, -1, 154, 128, -78, 148, -236, -100, 62, 257, 119, 334, 170, 42, 284, 36, 73, -196, 44, -267, 198, -23, 36, 219, 38, 292, -182, -196, -108, 306, -666, 135, 244, -206, 21, -96, 119, -357, 252, -115, 98, 56, -268, -139, 141, -72, 47, 119, -90, -57, 297, 83, -265, -211, -190, 214, -83, -416, 149, -121, -346, -185, 75, -56, -86, -77, 232, 3, -86, 81, 342, -38, -158, 289, 5, 72, -195, -257, -28, 217, 21, 13, -284, 73, -131, -220, -91, -133, 25, -8, 163, 114, -58, -21, 193, 47, -37, -377, 151, 159, -47, 146, 74, -53, 145, 50, 194, -1, 257, -8, 4, 71, -46, 87, 106, -369, -13, 380, -460, -64, 206, -123, -199, 20, 172, 210, 70, -64, 146, 130, -168, 9, -126, -3, 53, 14, 11, 31, -61, -29, 41, 81, 8, 39, -169, 46, -94, 133, -175, -9, 152, -195, 112, -30, -22, 13, -293, -100, -111, -100, 140, -137, 170, 67, -237, -124, 266, 124, 222, -64, -86, 417, -230, -104]
6997a04J52j37O4o1O1j52J26K27m5k42J09j33K4K9MK91j64j73L69l41K10j7K49
7020C46m39J26j72J8J30L2k91N8J38K12l31J25J88o7k88P7J79o3P3j15l6J06J02
7043A08k41M77k41j04k46L84J2j29N3k06k64P67o21J04J67j5j14p0L14l50M15
7064B00j55k04R2J09M7J2j38j24J31L54n06K01k39K11K36j36j00K09l13K72p2
7085H7l54O8K17r6J35p9P2m38M12n9n2L86j19j25k4k30l5J2J22n6L43k34L40k92
7109AJ97M0k10j16qQL40l82o4J83L5R1r8j13J40J77l80N3Q1k05M54m13J30K61
7133B02n03K29J97j94J02k87L98k69J78J40k50J95p0k14L88l66l6K28k38K95j99
7154g4P2o6j97K58K15k45JR5P5l66O7R1K44k5j63j66J68l5L52k18k74K04K10j24
$$ y = [-104, 48, -89, -25, -86, -25, -177, -51, 176, 131, -111, -2, -135, -111, -82, -78, 213, 49, -124, 245, -96, 114, 97, 346, -93, 33, -139, -121, 9, 41, -250, -192, -54, 158, -173, -48, 140, 73, -215, -138, 41, -22, 51, -64, -100, 6, 108, -133, 344, 103, -1, -247, 137, 149, 20, 73, -133, -397, 370, -251, -147, 20, 5, -109, -179, 135, -215, 200, 45, -159, -67, 42, 89, 101, -37, -161, -30, 324, -182, 19, -220, -9, 227, 91, -9, 200, -113, 159, 87, -267, -199, 18, -78, 57, -22, 50, -388, 24, -35, -87, 299, 180, 55, 31, -199, -234, -222, -100, -156, 187, -47, 293, 1, 198, 238, 28, -88, -96, -88, 252, -130, -194, -11, 24, 115, 17, -96, 44, 221, -159, -106, -25, -230, 224, -189, -59, 202, -301, -72, 125, -69, 33, -254, 144, -125, 53, 193, -57, 138, 68, -146, 242, -124, -160, 68, -170, 125, -74, -2, -68, -265, -7, 208, -37, -36, 59, 134, -232, -165, -74, 170, 145, -18, -184, -16, -51, 301, 83, -191, 13, 223, 99]
7178I9mm2j60L64k85K10m8k47J36R2J3K24o65K91L0k32K93L27m91R3J94l24K04
7201G2J1J40k0k83j22J14K03nj74QL15j58J33m69K70j13J39k34J6J28K02k64J5
7224g6K48k56jJ29j09M8Q3j9j9k68L33J14pp5j50J50j21k34L58J30k51m4O5Q2
7248A10P9K2m16M70n35M23p6p4k3nJ89n56L54J07k54q6L54l60N24j94R5q3k02
7271a37L02j07M4j93j74K70r4R3j53K87l71K96o6k3j82J43K78k74PJ81l31L80
7293A76j49J51J4j72J01j81L8J34ok74K04q9r8n2J07K15j22oK14k56k7K81j39
7316F4j31j62R9J20K38m33pK17L09l53OJ35o6jP7j41jm1P7o4J29j83L4j12L34
7341A44j15k6P0m9k04j21M20l17J62j08j3n1%J71j04J62L95p19L68j52L9L3K24
$$ y = [99, 95, 53, -107, 257, -28, 182, 134, -113, 23, 115, 128, 352, -313, -22, 8, -224, 69, 396, -95, -2, 192, -132, 72, 83, 223, 203, -80, -202, -88, 115, 110, -64, -56, 259, 101, 234, -235, 35, -78, 61, -173, -157, -29, 173, -91, -76, 172, -84, -85, 44, -65, -17, 66, 47, 28, -240, 93, 207, 200, 125, -25, 125, 4, -230, 128, 258, 7, -37, 28, 110, 189, 211, -205, 265, -270, 153, 77, 3, -20, -25, 164, -392, -38, 69, -185, -271, 83, -277, 247, 53, 148, 65, -137, 165, 58, 102, -91, -265, 5, -89, 4, -149, 138, -233, 63, -3, -26, -208, -65, 213, -61, -54, 127, -204, 176, 27, 178, 192, 20, 121, -60, -22, 112, 106, -168, 36, -53, -151, -203, -96, 119, -3, -9, 205, -51, -78, 203, 64, -67, -229, -130, -10, 228, -205, -212, 5, 314, -39, -33, 102, 36, 35, 112, -29, -30, -71, 6, -58, 71, -112, -78, -190, 144, 29, 3, 73, 24, -180, -301, 119, -198, -36, -144, -157, -208, -208, -37, -141, 21, 416, -303, 65, -87, -48, -15, 209]
7364B09j71Q2k41J63j22J90K2l6p1K21k93M1J94m49J00J40J59m39J88J20r1k5
7386a09K69j30Pj10J44n27M54P3J36k41K9P0j14K64n0P0j0k65j54J91j14K86n80
7409d11N97m19J54J40L3Mp8jj9j12J94j14K71l67L81n18O01m99n3O3J67J08k50
7432a28k13K33P5Qj15r4K50j63M87n09K01mj58J61J99j20l63J80m6%J18K18j56
7455F1j79r6P4P3J38K8k83L17o7k57J60N24n43QJ21k34J87j11K86k98Q3k51J02
7478a57j0K16n1j01Q9j7L39qm16M38l66Q9j57O1L0M2Or6P7q2M6p0R0L8q8qj65
7505b31J13J14j46K75j75K24l17M26k24K62k05k25N3J54j51j43K45m9q6J47J7
7526G8k2o7j57K28N4k01L41l60q0K06L4j54L37m2m98L13p3L85J04l96j84Q9L82
$$ y = [209, 38, 120, -121, 42, -80, 110, 132, 96, 25, 246, -47, -6, 188, -261, -161, -21, 138, -301, -113, 7, -84, -109, 160, 30, 37, -73, 71, -456, -2, 71, 207, -34, -5, 65, -49, 215, 165, 235, 225, -40, -194, -3, -117, 169, -411, 186, -233, -79, 61, 94, 98, 20, 19, 0, -112, 82, -32, 239, -128, 253, -265, 336, -163, -216, -153, 14, 122, -128, -341, -108, -33, -25, -140, -234, 16, -147, 340, -169, 32, 28, -130, 31, 230, 110, -253, -73, -119, -119, -1, 217, 61, -118, -214, -140, -67, 71, 99, -184, 133, 66, -191, -31, 493, -50, -42, 79, -155, 32, -79, 207, -91, -8, -259, -157, -167, 49, -2, -103, -14, -31, 308, 300, -116, 322, -44, 45, -112, -51, -21, 21, 27, -69, 8, -74, -28, -98, -8, 30, -58, -66, -231, -118, -4, -150, 125, -50, 174, -143, 283, 59, 321, 116, -109, -56, 98, -53, -196, 49, 0, -86, 61, 78, 56, -11, -168, 60, 114, -87, 254, -106, -186, 20, 54, -100, 237, 195, -303, 10, -63, 322, 426, 30, -154, -65, 317]
7549C17l3k16j3k36L42k58J07P9j14J73k53K33k84J41Q0m52J04K80j14K42M0m36
7571b71J55K45nn2j69KJ90j92M0J94k71L51J36l75K3J53j58J61r0K44m58L59m72
7594b60O78m92J29l00J06J77Mk59j89P61k66j80L13l29r7K61M39l91Pq3j28J87
7616H8m5k49q9L57K54j28j53R7l30K68r6Q5k82J45P2j67L02j08j98J83Q2J05j89
7639Dq3K69N2j83j54K99l89K1K85j42J12j9J8k39L91l99J91mj24o7K02o9m7q2
7663a57n5O1L7l03K04J94l8J13j00j12p6N80n08r6K77j36N0J19j91j10K67n6k91
7686c27M60p4m6r0l6J81L79m40l6rk9pP2J99k70K48j82j33K55l87N06r9n4j63
7710h2J30l23L08K43l82p0L24Kq0J76k23L52o31L41j24j20L15j09j81Q6r9J83
$$ y = [317, 284, 68, 55, -181, 161, -97, 10, 89, -25, 148, -105, 128, -156, -15, 65, -387, -283, -3, -117, 125, 165, -271, -116, 129, 124, 72, -97, -95, 95, -97, -57, 137, -134, 217, 353, -22, 1, 154, -4, 157, 67, 311, -147, 212, -260, 418, -74, 55, -245, -139, 38, 42, -217, -406, 355, 89, -91, 222, -107, -204, 57, 496, 105, 112, 29, -99, 88, 43, -206, -295, 62, 316, 188, 35, 132, -198, 70, -26, 59, -223, -78, -6, -173, 129, 21, -177, 6, 88, 193, 4, -79, 190, 242, 59, -95, 204, -185, -164, 121, -21, 91, 72, 90, -149, 242, -157, 34, 30, -94, -161, 41, -28, -75, -157, -212, -151, -114, -417, -213, -19, -57, 56, -44, -156, -232, 348, -160, -256, 21, -115, -65, 54, -137, -247, 20, -36, -327, 133, 59, 13, -77, -113, 68, 447, 7, -29, -38, -67, -74, -2, 197, -73, 175, -7, -140, 115, -272, 234, 135, 81, -82, 48, -275, 33, 276, -106, -176, 148, 150, 70, 246, 23, 375, -256, 85, -39, -159, 156, 47, -134, -48, -147, 36]
7732C6K41j99j9J18j25J41o3j75k8M1J11l09K29K62j23J3n8k30K71k36N8Q5K8
7755F9j26k07K44j70K47j15N3j24n8J28o9M83l65j69K82O5j20J2l72M81J9P0j44
7778A14j67J43J04J3l27l58O46m76M02j76M6j06l2N0j1N5J40m0J15Q7l36N5M22
7801C63l99K26K9R5j56j3J0q9K24l78j22M13j06L87n08q1j51J93P3NpO7R6j51
7825B0j2N8O7j59J39m0j43k17L33j13J42q5L38k14k64L00j0k37J35j07J50M5J78
7848C04l94j88M28j5o4L2j63pP1pK97m51J97j20L38o45K62R9Q2l3Pm3j9Q6k66
7873b12K68K50k85J6j03K84o6k40j89J63M85l23k7j00M46n97L38k49L74k36J03
7894A00k17J59j80J11k24N51l61j11N89m22l1j85M23k53N5o4K85j94J08k71K6
$$ y = [36, 277, 78, 59, 177, 52, 193, 130, -45, -73, -32, 79, -230, -1, 261, 138, 151, 93, -137, 134, -102, -44, 41, 69, -57, -264, -20, -190, 57, -58, -5, -129, -187, -59, -128, 355, -10, -179, 103, 168, 48, 60, -312, 169, 188, 258, 114, -53, 90, 194, 207, -120, -478, 168, -308, 94, -82, -36, -142, -174, -124, -135, -80, 60, 20, 135, 222, -114, -59, 363, -36, 190, 219, 314, 158, 145, 155, 66, 290, -88, -210, 203, 97, 484, -24, -105, -256, -63, 10, 15, 8, 75, 171, 20, 8, 66, 133, -26, 113, 73, -70, -287, 46, -67, 75, -10, 328, 114, -150, 150, 140, -97, 38, -69, 81, 126, 304, -90, -278, 150, 135, 71, 103, -60, -67, 4, -3, 294, -157, 40, -80, 258, -387, -125, -26, 56, 23, 30, -13, -32, 54, -212, 56, 306, 21, 37, -66, 218, 152, -88, -277, -114, 371, 48, 21, -79, 367, -230, 108, -141, 233, -3, 100, -117, 42, -138, -27, -251, 300, -61, -172, 417, -5, -36, -221, 202, -51, 4, -60, 225, 31, 139, -132, -106]
7915a06K57J6k85k75j5K44L92m70Q2J61l3j55J16m2K52kl15J6k03J99K80j05r9
7938i0Jl8J36o1M93l85k32K12m0j2J13K15j31k66m7M67l33K85k85k84n8O94n16
7961a62r4M19l25N21l89J96K5k34OJ00m9j51Rj08L56q6j22J16r1j65j9L01P0J50
7985B74r3j59l17M77j11PJ20k57J2R5M5J1p8k04K38j85Q8j5RL5q4P5P7J45j76
8010B9NJ07K7j93M0Q4l15M07j77j54K03q9pJ00J7j67J89J77l15K0l14J94L67l94
8034a59L44j87J98q5j37J97j75j45K66K6j90M33o52K63J14k86K20r8j8K16o3J54
8056B36n24J42J58J8nj05K33l05J84o5j11L61r7o8q8j53L20l89M31l11J21l6O9
8079A6m2K4j52L24l36M77m16L37j34L0j63O4K9J45m1j61l34K90j08J77q9l95N32
$$ y = [-106, 151, 167, -118, -393, -408, -164, 228, -242, -160, 1, -32, -187, -71, -113, 139, 137, -178, -162, -365, -166, 114, 9, -90, -89, -127, 9, -52, 441, 56, -176, 36, -4, -16, 97, 312, 181, -85, -132, 335, 2, 287, 2, -282, -340, 354, -162, -256, 163, -162, 359, -30, 166, 191, -43, -37, 63, 14, -137, -128, -236, 120, 34, -88, 28, -63, -228, -247, 54, 124, 274, 181, 22, -295, 182, 71, 78, 198, -59, -47, 48, 93, 104, 26, -178, 60, -125, -37, -52, -43, -8, -92, -17, 60, 205, 29, 34, 141, 168, -25, 15, 99, -216, 191, 14, -140, 63, -26, -33, 67, 84, -83, 106, 283, -32, -12, -326, -132, 235, -159, 185, -2, 196, 111, -26, 171, -4, -149, 117, 143, -47, 386, -266, -3, 111, -175, 45, -53, -71, 145, 82, 236, -288, -146, 12, 30, 25, -80, 153, -152, 32, -33, -144, 217, 120, 52, -36, -189, 131, -258, 173, -138, -17, -53, 16, -26, -2, -154, 170, -166, 311, -105, 232, 98, 128, -35, 29, 58, 203, 162, 1, -333, -43, -151, 26, -63, -458, 74]
8102G4k42L21l16kL43l82L27p2M5j81j38L74q0j50j12K65j60O6J64p0j29J33q
8125G0j75j31M39l05j0j6J6K18j39M29l56m9O0K14n49L38q4J50m01K05J32k52
8147a96L33J97km92L05q6jn6j42M6K01m56M90k72K27O5k50R5l10L68j00L43K7
8170C34n60M38k72k0l0J38q1J07m9M5Q6j97J70k88N6R8Q6r3r6J59p3
$$ y = [74, -168, 153, -163, -165, 178, -204, 123, 51, 96, -85, -223, 151, 71, -79, -191, 74, -86, -20, 144, 74, -55, 78, 70, -105, -236, 203, -102, -112, -128, -112, 106, -33, 396, 40, -9, 51, 265, -284, 54, -30, 120, -281, -76, 56, -196, 137, 334, 332, -160, 145, 59, 58, 2, -140, -94, 107, -349, 141, -131, 96, 161, -89, 6, -304, 64, -36, 307, 334, -226, 212, -60, -80, -110, 28, -53, 54, 5, 50, 136, -61, 109, -179, -123, -25, 61, -32, -128, 31, -42]
8191d2
$$ Imaginary data points
##PAGE= N=2
##DATA TABLE= (X++(I..I)), XYDATA
0@%%%%%%%qJ6j6J6j8K6l2M0m9N7p1Q6j02J18j36J59j83K10k42K75l13L57m05M56
31B41n12N74o43P19q02Q94r93J100j219J353j499J660j838K035k258K506k786
48a468L111l486L927m451N085n878O903q285J0256j3322J8803l1613J16242P7005
62A72829j80865k2405O6887N4272l0159r558j6354k3750p257L8830K906l1425
74A3951j0232K9398n215k6887L766L2474j858j8792j189N839r130J2767K3860
87D8752j8945m3076J7382N1269q716n7494p614M3274J5360k3794j5648q11J717
100A656J2867J4970j7226k8107J3349L8929k107m2179j0823L3584K0542j3899
112B1556j6384q678n194J6540K9373r603m7868r695M5015K0754l6206k6745K2152
$$ y = [0, 0, 0, 0, 0, 0, 0, 0, -8, 8, -8, 8, -10, 16, -16, 24, -25, 32, -39, 47, -55, 63, -73, 86, -97, 113, -129, 146, -167, 190, -215, 241, -271, 303, -340, 379, -423, 471, -522, 578, -641, 712, -787, 873, -965, 1070, -1188, 1318, -1468, 1643, -1843, 2084, -2367, 2718, -3160, 3743, -4542, 5714, -7608, 11195, -20418, 95824, 172829, -8036, -30441, 36446, 90718, 60559, 51001, 34647, 10897, 3640, 42470, 45376, 13951, 3719, 33117, 27902, 1015, 4781, 37255, 35397, 16605, 15416, 21255, 12125, 24892, 48752, 29807, -13269, 4113, 55382, 46666, -10828, -18442, 24832, 40192, 16398, 750, -61, 1656, 14523, 29493, 12267, -15840, -2491, 36438, 34331, -7848, -18671, 14913, 35455, 21556, 5172, -3506, -8700, 7840, 37213, 27610, -20258, -29953, 15062, 35816, -390, -27135, -4983]
125d983K5655r931k2997l689J2113J2887J639j3079j4563P971K1507l99k5433
138a3302p210K5863J4827j9127j8005Q563J3016N569L958p036k2377j264L4242
151A7717K0181k7636l1536J4268L2108j34k6124j0108J3935J3331j285j2004j6334
164a3621m014K0356J9712j5787l1091K160K7764P181j7829r095Q251Q735L079
177E801l372j1294l692J9322J7035j7195k8290O385L1980N973k7443j5596J6117
190d269J5887o523j4218m825N206J3435Q587j4766k2529P658L0532N828k4337
203d334j3423J1554J3943K810n049q949n539R809J3643o552k1614j751K3304J1827
217A9679j8898k0046N937J6484M917n492q960o057O913J4589k541j9348j204K2471
$$ y = [-4983, 20672, 10741, -12256, -15945, -3832, 9055, 10694, -2385, -16948, -8977, 12530, 12131, -13302, -20512, 5351, 20178, 1051, -16954, -8391, 4625, 10194, 14152, 7116, -15261, -16525, 17717, 37898, 10262, -21274, -7006, 25102, 24968, -1156, -11264, 2671, 16002, 14717, 2713, -13621, -17635, 2721, 22433, 6646, -24445, -22285, 5479, 12660, -5169, -14264, -6013, 2722, 5801, 2429, -8865, -12557, 6765, 23800, 6605, -21685, -15300, 16680, 22653, -4790, -20386, -4269, 11618, 5095, -9123, -13948, -8742, 4693, 13280, -1486, -24015, -16357, 14175, 20003, -4334, -17757, -6203, 7740, 10550, 5501, -3448, -8987, 822, 14465, 7913, -13701, -15452, 7852, 19679, 781, -19265, -13328, 3156, 8073, 2581, -6379, -12436, -5523, 9066, 6525, -12823, -14027, 8444]
231H444R356j9666j5074R895J6374L973r056j2283l202J1859J3828n389j8628
244i569k189J9912J0519j8101j8045J0408K1568J608j5125j1692J158J1517J2338
257A4307n127j7674m713J6547J0688j3220j3015N658J3617K372r296q797J48J0419
271A914J0198k358j3719p580J1030J5157m537j5293j100J3444N729r045r595l89
285f144R696J0228l773j6794o732J4443J4161n861j6663l077J3333J0369o871
298F315j3674J54J3277Q812q068j4219k862J4314J3846o543j8228m322J3505J0191
312A2498o135j1042j877R076P027n053j2343j438J2628R126o397j2804k549R947
326F64R591k258j0492l608O423P283j338q533l139P062R797l339j4061m356J1752
$$ y = [8444, 17800, -1866, -16940, -7045, 9329, 13302, 4246, -8037, -11239, 620, 14448, 9059, -9569, -11758, 8154, 18673, 572, -17473, -7065, 14503, 16111, 986, -10706, -9548, 1969, 14307, 9180, -8494, -13207, 3340, 14028, 808, -12207, -6549, 7068, 9440, 144, -8653, -8505, 1914, 12112, 9754, -3965, -11545, -515, 14642, 10105, -5188, -6288, 7156, 12885, 3840, -5755, -6144, 3552, 13780, 10007, -6787, -13519, 924, 15085, 9224, -7439, -10516, 2817, 13186, 6315, -7359, -7205, 6072, 14884, 6816, -7403, -10265, 4049, 17895, 11352, -6876, -11198, 2307, 12498, 6363, -4679, -6556, 2520, 9547, 4494, -7849, -9287, 3341, 12467, 6070, -6734, -9283, 664, 10255, 7997, -2495, -6103, 320, 7603, 6265, -2268, -5407, 1655, 11452, 8113, -5948, -10304, 1448]
341A448J1022k904j1714o828N753J1126J493j0738p214Q057J0856k615j2989n359
355a0606J1023J2787l811j5172n264J0512J1076k141j0421n985O322J0480j394
368G406j1585l955J0943Q589n718j1840k633R647R419k277j1139m381O588P503
382F567r31p518l458M635P581p84r891l852P588P959j734q699n693L872R889J996
398G527q352o902L669P429J198o444m900M194R341J64j0765p126P405J1700K08
413H346r486p508M342R810J304r242n474O038P703j114r337n152O441J0399j137
428E933j1573o084P586R256n10o687m596L270O427P99o441l026N181O587q52o836
444a566n153L760Q122J638p445n845K786N316J079l433m130Q8N554K531n468n711
$$ y = [1448, 12470, 9566, -2148, -8976, -3223, 7903, 9396, -1342, -8556, -499, 10357, 7742, -5247, -10606, 417, 13204, 9393, -5779, -11043, -531, 10545, 8404, -2017, -8002, -1680, 8800, 7406, -4179, -8134, 2809, 11398, 5680, -6160, -8793, 854, 10273, 7996, -3143, -7524, -936, 6567, 5636, -1882, -5340, -705, 6876, 6092, -3799, -7651, -63, 7896, 6162, -2537, -8230, -4358, 5531, 7527, -825, -7727, -4058, 3371, 4569, -1875, -6775, -2581, 6760, 6924, -3841, -10967, -3562, 8138, 8346, -1140, -8648, -4306, 5504, 6808, -2434, -7908, -1870, 5833, 4719, -4618, -9770, -3329, 7070, 5933, -5640, -11724, -4138, 5118, 4608, -2079, -6675, -3405, 3022, 3821, -2620, -5646, -465, 6122, 5270, -1566, -6719, -2959, 5163, 6801, -644, -6489, -3703, 1613, 2692, -741, -4871, -4783, 771, 3302, -2166, -7877]
460g877L149P949K035o636o837K030R146L515o197o153J782O167K443n115n806
475f405K034Q618J388q542o683N130Q761P14p020n494K175P471K332o159m772
490f452L616N847Q1n544m038L552O600Q99o433m872K385N286K795k607m839m89
506d213M829K523m152k949K432L337Q57k579l850q25M349M999l153o844o22N383
522d78L629l750m614J174N347J262m455l351K337N259L850k615p758q09R012N554
538I594o291o786K692N721k72m072l117R42L572K265l701n915o02O674L349m405
554c52n445J960M985j51k699P99J922J63q5J106j821j312L850L631l338n363J395
571g55L201N18j315j704j576R34K763N1l762k066M271M953k971p053N96P682L384
$$ y = [-7877, -4728, 3221, 5256, -1380, -8217, -6187, 2959, 6474, 277, -5876, -4094, 2073, 4516, -599, -6405, -4371, 4247, 5635, -2907, -9590, -4460, 4301, 5015, -2005, -7499, -5324, 2147, 4479, -1680, -6452, -2836, 3011, 3092, -2452, -6490, -2938, 3662, 4561, -1872, -6744, -4359, 927, 3722, 1115, -3724, -4213, 616, 3139, -1013, -3962, -1530, 1807, 2664, 85, -3765, -4590, -241, 4758, 1605, -5239, -5861, -478, 3151, -599, -5213, -4039, 1308, 2570, -1885, -5236, -2899, 2360, 6210, 3595, -4163, -4972, 4040, 9594, 3303, -3483, -791, 4930, 4658, 586, -2531, -1589, 1983, 4248, 547, -5368, -5970, 704, 4053, -352, -5797, -3837, 1148, 997, -1702, -903, 1019, 1182, 1097, 2203, 382, -930, 2920, 6551, 3213, -2150, -755, 2446, 2964, 1649, -55, -1631, -697, 2066, 2117, -1645, -3711, 560, 5513, 2542, -4511, -3915, 3767, 7151]
588G151m094m130J97K332L089J022m329l274M497M367m074n678J563N141Q43l037
604A586k965o75J932K763P65l307k372K137L194j798l774J789N192j175n233l87
620b328M079K46j023R09N0k465P15L778O4l038L45K945P56j550j406P53N82J388
638D800J821k376m990r1O948K611q320m946N960N322m647m323K664L089p58j76
654B588l75j239O99L953J545l440k610L504K130k192k433J698K080k471k568J087
670A956L52j199J190J647m499l005N592M470m932m249M782M269k428k884L081
685D143J795q88O65K000k259l396J430M147q90l439j367j85j092R49K289k910
701I92n881K274P523l335q225L048Q403j617p210Q26N860j13k831J251J033j559
$$ y = [7151, 3057, -1073, -876, 1456, 4545, 5567, 1238, -2036, 2461, 6828, 2754, -2924, -1361, 3780, 4623, 1586, -1379, -2054, -122, 2641, 3406, 99, -2273, -136, 3058, 1260, -2514, -725, 4467, 3292, -1941, -2328, 1751, 1997, 974, 1883, 1933, -532, 183, 3961, 4025, 987, 1332, 4277, 5033, 3483, 2077, 2830, 3412, 4800, 6621, 4245, -745, -836, 6112, 8723, 403, -4543, 1417, 6739, 2092, -2231, 433, 3522, 2764, 2588, 2213, 974, 1673, 5626, 7171, 3731, 1121, 4625, 6755, 4563, 2130, 3828, 5908, 3437, 869, 1956, 2308, 1109, 2299, 3946, -553, -3558, 2034, 6504, 1572, -2677, 2105, 6374, 3946, 1062, 4143, 5938, 5050, 5715, 7715, 5456, 2060, 3490, 7637, 6747, 3308, 1941, 1756, 664, 1613, 3902, 992, -4889, -2615, 4908, 1573, -6652, -3604, 4799, 3182, -4028, -3202, 2658, 2545, -286, 965, 1998, 439]
717D39J31J606j865k281K682L389l868n380L309N413k270m328K786K286l621J33
733a439O046r97o753J227P745j032p121P70N774p24m246P99J973k716k232L710
749G84K140m378l327L506K743k874k30K725j544l012L234L781m373l129N704K924
765D674n990k854O067J842m876k963M330K642l418k629J658K225N44j90p66j978
781a682P34N065Q86m844j059M882J455m522n58L713j230l366J384K261l091k980
797b952K431K016k199k154J328J156k129K81K935l4l022j55L812Q67k917N38L161
814B963j076k829K044K379k096j708K666l21k888M24L132j649l419K022M418k132
830A930m700R57M829N96m336m92K854L73j324J235N00k718l67L667p84l659J217
$$ y = [439, 570, 2176, 311, -1970, 712, 4101, 233, -5147, -1838, 3575, 1305, -3023, -237, 2049, -1572, -1439, 4607, 3610, -3143, -1916, 5829, 4797, -2324, -1554, 4220, 3496, -750, 49, 2022, -694, -2926, 784, 2924, -1454, -4781, -1275, 1468, -1406, -1636, 1089, -455, -3467, -233, 3548, -825, -3954, 1750, 4674, -1316, -4170, 1897, 3739, -1137, -4100, 230, 2872, -546, -3175, -1517, 708, 1252, 1062, 296, -1682, -948, 4117, 5003, 159, -900, 3982, 5437, 915, 357, 4070, 2840, -526, 858, 3119, 28, -2952, -521, 1495, -704, -2858, -1530, -374, -2503, -2222, 713, 679, -2343, -2498, 1314, 2181, -736, -198, 2963, 1887, -942, 1102, 3481, 1385, -323, 2343, 2022, -866, -442, 2690, 1041, -2378, -356, 4062, 1930, -2770, -1813, 3016, 3612, -724, -1216, 1638, 2011, 687, 1922, 2422, -296, -663, 3004, 2220, -1439, -222]
847b22L934k325m026K552L001k331k410K084K513k012k544J669K630j762q92J784
863A643P1k791M08L099p42l514J619L184k180l267L200K703k673j939K498J260
879B579j799m57J601K5p98P67K13j287j239K034J530l152k547K071K594k677j735
896b277K139J391k251n44J611k8o01J355O50k316q3K831L58k045r7K528j8l007
914d04p01K525P42k099r36J343n9j595N21J311j171q68J635rk152L96L087o57
932I09k862L42L237o54j575r3J642r4j202j95O18O10j72k21k60j090K7J696j60
951E03j837K67K816j209k927N97L065l3k068o7P63j27j48K75Q5M36J16m09k43
970a45m15P07P58m30j411J21J536J96k463Q33J819j92j945k50R90O3J34n7o58
$$ y = [-222, 3712, 1387, -2639, -87, 2914, 583, -1827, 257, 2770, 758, -1786, -117, 2513, 751, -141, 1643, 1714, -1077, -669, 2430, 1688, -1826, -207, 2977, 797, -2470, 730, 3433, 760, -1179, 1319, 2579, 780, 323, 1924, 1949, 1151, 1918, 2131, 844, -395, 1639, 3169, 17, -2530, -459, 2135, -542, -2277, -138, 1253, -998, -1542, 69, 41, -560, 795, 1445, -871, -954, 1877, 2235, 190, 93, 2621, 2603, -404, -1105, 1420, 2162, 63, -873, 470, 411, -1184, -663, 648, -523, -1391, 244, 235, -1917, -1521, 1566, 909, -1953, -1611, 1626, 972, -603, -696, 946, 852, -350, -545, 73, 683, 511, 290, 30, -1060, -1033, 663, 503, -1334, -1067, 1749, 540, -2387, -1790, 1275, 1242, -826, -893, -130, -257, -405, -130, -45, 391, 507, 98, -145, -560, 147, 905, 475, -936, -815, 721, 917, -1546, -713, 1106, 914, -1031, -1281, -291, -228, -94, -151, -809]
989h09N9P10p2n93n7J022o7j265j84Q27J187j68j074q55J238L36o93M5J76N52
1009C15J77o10j349j10K179N31j677k23M65M09r29J94P42P5l12q06L2K27O58k58
1029b70l56k64p7L14K36p73P7J506L15j890o25K156N01n17p63P07q0k67N7o0K46
1050A73N30o34r46k21M99O09K81j052q10J312M11j518l88J420J360r03j346M95
1068g28M49P88J45o70k5M05m58m77L57O15p4l15m82o33P86N12r29o96M53J261
1088B84o02j324M93J106J62k01p86l87J407O84j086j67M50J55j013j4N01M74m2
1107I4j77j556N66J009m00n22P00O74r3k29o93m8J294O75j260j243Q87P83j54
1126C07j29L4M2l8l42q94O56J242k48j001o00P14O02K29k95l14O49Q07j395j142
$$ y = [-809, -750, -40, -112, -705, -762, 260, 193, -1072, -1256, -429, 758, 590, -484, -1339, -101, 235, -458, -413, -237, 315, 492, -118, -1467, -1577, 602, 1133, -544, -767, -302, 107, -822, -628, 114, 189, -123, -929, -897, -670, -12, -270, -626, -890, -967, -653, -417, -1190, -1113, 393, 708, -1182, -1807, 349, 850, 333, -430, 277, 197, -70, -13, -73, 173, 703, 69, -877, -1098, -599, 10, 291, -761, -1571, -259, 152, -1366, -1754, -334, 1026, 123, -1223, -728, -279, 509, 654, -16, -41, 364, -94, -571, -214, 401, 327, 12, -470, -1103, -317, 195, -734, -1430, -977, 284, -318, -1642, -1149, -43, 119, -82, -868, -1255, 152, 836, -250, -417, 33, 188, -825, -839, -338, 136, 94, -83, -1639, -1073, -64, -464, -986, -286, 388, 295, 66, -627, -675, 619, 1294, 34, -1209, -322, 461, 307, 178, 212, 254, 216, -126, -1020, -364, 878, 630, -371, -971, -257, 345, 574, 279, -35, 614, 1421, 26, -1116]
1146a116J022J266p74p06N1j53j7K22K71m02n4K99m96k88M73R98J93p47j38O51
1166E55R90n55p45J261O39j153j239O18Q76k55j61l21j022L90P30o97q66M99Q39
1185C83p89j368M83J365L10m24r85N1J193K02l83j08M59J43J26r41q41J150J762
1204A788p67j981N75Q16n87l13P51L63l24L21j47n43o7J119L80j238L27n7K01
1223F17n57k69R52L62r95j795J270J514r27p48Q16k34r85N30N56l5p7J121r65
1242A51j389M01J806k64j079n49O41O64j116n71R04J397l89j325k65P37M88R66
1260A208J93j142l03J265K18j058M84J559l18j494o26P19M78m88o26l0J02o45
1278e04q58K03R93K68l57l09o26K9J543J68j015M08R16p0j514J064R63M24p03
$$ y = [-1116, -94, 1172, 398, -308, -257, -410, -427, -205, 66, -336, -390, -91, -587, -875, -402, 596, 789, 42, -96, 555, 1545, 990, 245, 1506, 2145, 992, -247, 371, 1247, 992, 831, 510, -512, -122, 608, -89, -955, -456, 383, -406, -1774, -1291, 74, 384, -40, -1025, -974, 219, 421, 38, -70, 389, 532, 658, -283, -1124, 26, 1788, 1021, -960, -385, 431, -156, -469, 282, 645, 321, 642, 495, -48, -115, 1004, 1384, 146, 473, 416, 617, 60, -209, 743, 1105, 110, -1685, -415, 1099, 172, -576, 240, 6, -979, -449, 107, 72, -5, 1116, 151, -1238, -837, 969, 705, -374, -923, -282, 382, -734, -1305, -401, 996, 607, -718, -983, -246, 242, 1208, 1401, 259, -44, 1221, 1439, 381, 865, 2424, 2106, 612, -14, 705, 1183, 695, 69, 39, 141, -504, -1362, -1159, -166, 102, -255, -564, -1190, -1161, 382, 550, -465, -57, 859, 789, -725, 339, 1302, 1726, 1023]
1297A023o87m90M41L10l64m21J57J25j90l53o16J092J197K8k103k21J784L87q66
1316B33L97M00l91k65M09m55m63J292O66j859j367Q45J146o94q71L85R74q21j573
1335b012R51J683o3j219M71M62j314M25J178n27q23N82M95j673m90K530L68j955
1353i31r83J741O64r23p83J472J182o24r56N4N19L74P88J1j494q39J839J27j932
1372f94m38K000rj982r13J342K89k98P55o34j557R75J327l83k19L9J447k59j326
1391e38l5J782O49j724l60N20j34j083P27O69q64m22M27o53n32J141P10p71j195
1410a686J583Q50j430m84J906J608j266j572M32J226J99o12j75J78j207L95J65
1427A10n69p82J461M41k062j356J711J702j512m92L14P35p14L04M15L36j07J87
$$ y = [1023, 336, -154, 287, 597, 233, -188, -31, 94, -96, -449, -1065, 27, 1224, 1252, -851, -1072, 712, 1099, 233, 630, 1030, 639, 374, 783, 328, -135, 1157, 1823, -36, -1403, -558, 588, -106, -977, -592, 382, -439, -2012, -1061, 622, 559, -660, -189, 273, -1041, -616, 562, 35, -788, -206, 289, -1384, -1874, 656, 1024, -931, -1914, -173, 491, -432, -1215, 257, 1439, 815, -141, -87, 432, 806, 1594, 1605, 111, -728, 1111, 1238, -694, -1132, 868, 859, -1123, -2036, -694, -405, -703, 52, -582, -2139, -1164, 163, -220, -439, -400, 1047, 788, -538, -573, 1209, 1858, 134, -226, 294, 160, -923, -196, 473, -391, -813, -386, -1039, -1571, -430, 280, -491, -1686, -103, 747, -683, -1167, 739, 2347, 1081, -491, -59, 1167, 1366, 754, 579, 757, -450, -55, 110, -459, -1241, 220, 661, -1401, -2757, -1046, 656, -856, -1348, -1034, -299, -1013, -709, -294, 42, -65, 122]
1445A22M7q19K94R79J134j159j205P16M89r18k64J188O48j433r10J138J87k13
1463B1J13L53n68J25J06n76J82O83Q69n49j727J08J183O70j001m17P81M32j176
1482c88n07J077M72K98n97m96o21M68J392l21j368L37J353p69j516P22R81J81
1500F98m65p44J21L37J31N41K01o37J86M54q9j012Q66J778r62j919N90J273r01
1519D47n00P37M63j061j004N36K94j6m4K21m85k52M22O36m82m81P88J103j394
1538g2j123J412J430l57j526M02L11l66K13O41m24j3N01o27j233l7J550M80j336
1557a74o98L17J200l53o92L75J019p37r30N68K10L78M43J30j271k45J109K48p84
1576A13P9J198p61j223p0J147K13m52m16J47M33j71q20N31M26l9J06n72p82M12
$$ y = [122, 169, -650, -356, 623, 1757, 598, -607, 109, 598, -320, -584, 604, 1252, -181, -1091, 47, 234, 21, 134, 487, -81, 44, 150, -426, -244, 439, 1308, 759, -968, -860, 323, 993, -8, -425, 356, 788, -388, -895, 182, 654, 952, 355, -141, -762, -294, 1098, 777, -591, -254, 1099, 330, -1186, -464, 517, 698, 233, -511, -390, -53, 78, 619, 820, 183, 369, 823, 734, -278, 588, 2366, 1404, -515, 75, 1348, 447, -53, 684, 1147, 86, -918, -382, -88, -104, -148, 73, -412, -664, -242, 394, -88, -569, 219, 1322, -72, -1195, 217, 1647, 1290, -236, 166, 477, 111, 324, 965, 541, 528, 1029, 402, -831, -868, 682, 1162, -174, -872, -555, 645, 292, -400, -25, 994, 257, -673, -105, 105, 483, 926, 1056, -215, -460, 649, 897, 113, 192, 1390, 629, -594, -664, 483, 696, 244, -172, -25, 408, 237, -583, -52, 374, 335, 441, -131, -913, -501]
1596e01J559k04j506J11J224k53j409P75Q58L1o01l76j15P56L76N7o26m94L87
1615D9K78m06m77K55J306l80j565k0J297N51q83M7K62m76n08P45K30k80M04m2
1635C87o94l45R75K10m21j21j12M61J34j505N63J205K68j336o93R08M5J71L72
1654D72j37m03J02J90r47J78P97Q17j121j045N28M66P14p74k42N37J78m47p92
1673i29O83P54r4M7r02l24N12J112p74n72K53L24q02R3M83M88l90m43l14j45Q41
1694i9N73n53j46O68k86l77l98K72J039J71r01q32Q14L69n93LM09q6j98k21k66
1715f38J29P46L80o32q92M39J025l95n78J37N83N9p26m12O54Q35l24q18Q6Q2k85
1736e45M25J97m37J93L63q25m55J054O40m94n74J36M83L13j32k88L76L58m99j337
$$ y = [-501, 1058, 854, -652, -541, 683, 430, -979, -204, 654, 685, 84, -292, -407, 349, 725, 782, 156, -338, 49, 327, -79, -556, -301, 1005, 625, -940, -960, 337, 888, 5, 52, 314, -162, -670, 75, 305, 25, 429, 387, -307, -652, 323, 533, 112, -9, -121, 340, 474, -1031, -468, 737, 1005, -331, -1024, -116, -71, 100, 472, 335, -68, 34, 224, -723, -545, 252, 1069, -52, -1097, -569, -103, 611, -163, -405, 132, 310, -137, -929, -246, 508, 414, 461, -441, -765, -253, 859, 85, -487, -234, 90, -712, -619, -136, 352, -38, -481, -795, -940, -99, 474, -79, -225, 443, 157, -220, -618, -346, 693, 864, -37, -869, -55, 314, -279, -276, 133, 47, -151, -372, -638, -509, 237, 617, -15, -907, -468, 557, 162, -416, -279, 304, 363, -363, -775, -121, 714, 390, -428, -342, -260, -545, -120, 77, -360, -167, 196, -629, -1084, -30, 610, 116, -458, -322, 161, 474, 342, 54, 430, 788, 289, -1048]
1756a048N69P02K55j31nr86K41M91k48l75N38J03k47o94K81M63N81l58l20j81
1776c69O33j53j25O4J80J04j84n39n19Q68N76j47j020rL86l65J32J27P72j21k52
1797C9l85lL04M81j04o73O45J50r2n99O0O55J03n45r78L89Q08k82k42L26k98l07
1819e48J25J46l58M56P73o73r10K4J338J58o88q9L46J55p96J2M25M91K11q79J09
1840a72J61J93J16L06o16k10N41K6o85L21J317l57j204k38N35J16k56J35L23k62
1860I0o4l90j49K38N91L3m16n96K53O55J42n86K99M50m87q59M42O17N1n2m55m81
1882f74K62N72k42l14K69M39k87m23J8P35Q94l79r93J35Q75L0m16L29j08j82j05
1903D35l12m19R1Q58p9j068k82P38lp77j32R62q4o65l02L15N67O7j62J14K4k00
$$ y = [-1048, -479, 223, 478, 347, 342, -644, -403, 88, -160, -535, 3, 106, -141, -835, -554, -91, 490, 132, -188, -369, 264, 111, -14, 50, 230, 334, 150, -389, -908, -40, 536, 389, -631, -640, -254, -619, -487, -360, 412, 291, 39, -346, -349, -45, 436, 332, -341, 304, 454, 362, -237, -177, 478, 581, 36, -942, -553, 255, -27, -269, 57, -241, -548, -423, -277, -635, -179, 594, -79, -989, -965, 373, 531, -157, -246, 100, 255, -541, -529, -104, 387, 598, -281, -172, -11, 182, 298, 604, -12, -222, 319, 345, -340, -19, 1298, 941, -263, -501, 34, 150, -106, 29, 352, 90, 26, -364, -513, -275, 316, 349, -67, -663, -410, 245, 387, -199, 100, 550, 63, -796, -354, 263, 314, 262, -193, -674, -412, 160, -82, -396, -127, 312, 25, -398, -380, 355, 1249, 870, -123, 12, 887, 917, 501, 830, 722, 540, 435, 123, -296, -205, 653, 574, -494, -776, -38, -41, -818, -950, 12, -72, -737, -1039, -724, -157, -90, -252, -138, -114, -314]
1925c14M41M2j3o2L69J15j204j66J399J37q99k67O52J3n49J96M99L30m74k57k4
1946c6l8K35K54K05r79K9P15K69j203J51R38j49q07m63R19J32k21k6J9j13J62
1967gJ03l67l53O65L23m29p00J48J243n3r77j09N64M43j113J96K91Q2o3M95l72
1988A0n22L52J162l90q81R02L99q15n89Q48O55n27j086M37L20j40l71P0J53m83
2008d96o03P41k13m47R10P88r02j101J047J260j066m65R37N70r38k48J04O42K66
2027G86l59n36n32l06J250j08m51q50Q55O34j174n40J393O36q53l88N68K85n50
2046b40K17P61n77k15N85m20k61N7O49k81q89J34M31j24n75K03M83L13j249k90
2066a288J169n7j7pK8k74K63P59p72j71N34Q99r91q95N51Q80R5r03k40N48K57
$$ y = [-314, 127, 169, 156, 94, 463, 578, -626, -792, 607, 744, -155, -422, 230, 243, -306, -110, 389, 719, 245, -12, -36, -74, 161, 415, 620, -359, -330, 385, 654, -549, -398, 540, 391, -416, -879, 40, 172, -49, -75, -56, -169, -7, 96, -271, -624, 41, 364, -65, -765, -617, 626, 573, -404, -513, 51, 494, -619, -423, -132, -50, -113, 382, 10, -512, -160, 1002, 612, -269, 633, 1032, 217, -372, 476, 1131, 604, -482, -45, 275, 135, -236, -166, -13, -496, -1099, -358, -571, -1018, -108, 680, -222, -1323, -276, 984, -82, -547, 390, 960, 22, -226, -122, 520, 786, 427, -109, -641, -947, 303, 195, -256, -1106, -251, 383, -791, -1331, 62, 698, -155, -543, 25, 310, -240, -23, 738, 161, -54, 531, 111, -150, -93, 556, 275, -614, -480, -49, -173, -748, -545, -62, 251, -998, -1288, -119, -176, -193, -200, -172, -446, -183, 576, -196, -367, 167, 1066, 75, -820, -269, 611, 706, -197, -437, 111, 368]
2087C68k79J15q1k16N6Q56p90o39N79J027n08j157K48J143m53o72O10N49p23m12
2107c79N48n16QK04L53K42o37J75P5K50l23L05K97q35l14O93R70j074n11P51N17
2128G99q46m14L05M24k29K05k35k57kP83J87j085l59J146L83o28o09M41R09k68
2148F50j143j1P39k15K39O5n89j61M46L02q14j57P62L94m46m80K5M90N0P0j93
2169B3J27k70J56K20J53k62n71M04L00l33O35k34n69K10O86j45j361O64J052m77
2189D08o75j9K0P45k69k01j50J68L41m5o52o44J119O98l01j398K48J090J41p43
2209a19j16L65l09P5K17m81N0N23L89o49p97N01J094l32n58K06Rl3K8J23J88n87
2231b13j36L55J28j41m15L61M03k24q5j7m93M66P79o02o25K57R44J60q32l94M01
$$ y = [368, 89, 204, 123, -93, -37, 819, 29, -610, -31, 996, 488, -669, -421, 722, 269, -403, 207, 756, 33, -379, 169, -347, -339, -135, 218, 460, -177, -2, 73, 323, 0, 305, 602, -233, -547, 146, 1116, 42, -469, 282, 799, -47, -461, -156, 268, 39, 244, 9, -248, -250, 533, 720, -365, -724, 422, 805, 177, -432, 9, 918, 650, -493, -504, 235, 20, 259, 324, -265, -426, 20, 322, -492, -649, 113, 507, 61, -419, -394, 96, 146, 216, 23, 150, -120, 36, 256, 409, 147, -424, -20, 280, -53, 582, 348, -221, -11, 675, 530, -831, -167, 885, 408, -267, -286, -266, 479, 210, 9, -141, 27, 368, 323, -329, -973, 146, 844, 543, -855, -607, 483, 624, -119, -235, 130, -179, -104, 113, -368, -318, 205, 594, -55, -852, -351, 743, 411, -147, 59, 68, 35, 63, 186, 374, -213, -349, 6, 134, -7, -422, -61, 342, 118, 33, 16, -477, -11, 768, 166, -459, -202, 742, 902, 70, -324, 77]
2252G7Q06l21j157M6O46O67k46o81p84N96Q15J74p38p94J047O60n55n19k17P26
2272B48N64n39o61l50R78P26p70l56L42J84r9j61l27M28L13j26p07L69j82l72
2292d98M90O52o28m44j66J170j47l27j92p9L35O02n42o34J57J137K2j153o82N14
2312d13R25N15p58q07J29O61K3q56o9J9J056L33r26p75Q00J149l95p85l8L79P08
2333H75o32p36K69N31K99p60q8r5N06K25k35o87k64R98K66O2m98r1P1J15K14l09
2355C6l60n0N44L77m67n87R1O63K69k84j031k6J183K59n10r26P1J043M14o18p44
2376f53N35P59L96r67m92J6R72M05j208q95N83J292p7j067l21Q66M01k71o38o77
2396a041P37P04n5o21l71K35P16L13n13o34L69N65j70k29l67K06R4M47j48q49
$$ y = [77, 883, 562, -595, -549, 97, 764, 518, -163, -947, -351, 464, 638, -100, -894, 153, 813, 258, -261, -478, 248, 812, 273, -388, -738, 240, 966, 196, -160, 182, 366, 267, 106, -221, 207, 520, 394, -313, 56, -126, -498, -8, 644, 16, -428, -594, 576, 429, 102, -90, -169, 166, 768, 226, -408, -251, 886, 908, -245, -927, -413, 512, 1027, 269, -538, -409, 252, 275, -581, -650, -631, 425, 758, -168, -943, -143, 1006, 611, -174, -212, 167, 875, 243, -493, -224, 307, 606, -154, -242, -337, 169, 394, 159, -528, -792, 206, 472, 534, 36, -55, 16, 131, 345, 36, -324, -374, 170, 547, 80, -507, -416, 247, 516, 232, -799, -825, 358, 617, 107, -819, -748, 295, 709, 91, -653, -118, 641, 1037, 70, -422, -406, 566, 971, -237, -1132, -549, 743, 666, -401, -722, 144, 545, 274, -364, -1041, -304, 400, 345, -276, -647, -412, 304, 617, 104, -530, -161, 404, 234, 5, -362, -156, -62, 385, 237, -612]
2416f12PL21N15m45p37m4O84R55q11m97K21L53P65p03n19n50J536N31r29j071
2436a030J45J405N01j024r36oJ019K94m26j063L59R61J18m45p31q6J480R3n72
2455E6j091O20R08j93m09n80J42O38N38r04p36M82Q47K42m74m94n1M33N01k03
2475B72n53l62P74N86k81o57m41O71P97o60r28o5O58Q93m62o72n16N76J226l95
2495D61j284j1J245N22j157k28l27O33R38m86j004o4R08O67o58q80l20J383L12
2514F50q90j005N54J248l36m24j72k09N48Q88m84r69L36O67M16m81l33l98P03
2533C09J72j69n06l68L13O89K6p58n67M49Q34j29j029k88P35O94k55k60r75O59
2553d24J360n70j342j04R48Q20l12j059k26Q36J080l67j435j00J059M45l48q56
$$ y = [-612, -605, -284, 231, -214, -951, -995, -311, 644, -167, -664, -443, -90, 675, -28, -547, -1097, 439, 970, 41, -1030, -885, 520, 1021, -3, -939, -945, 74, 368, -58, -1121, -762, 199, 317, -128, -859, -945, 535, 628, 56, -1035, -415, 493, 300, -109, -689, -547, 91, 629, -275, -1011, -529, 318, 560, 86, -408, -459, -26, 475, 272, -281, -643, 131, 717, 436, -221, -662, 9, 806, 146, -782, -847, -189, 704, 242, -430, -946, -370, 856, 461, -823, -834, 411, 933, -224, -452, -779, -146, 792, 306, -698, -762, 146, 813, 155, -725, -1045, 338, 650, -240, -1245, -691, 557, 221, -203, -375, -584, -36, 852, 368, -601, -265, 402, 818, 337, 4, -394, 309, 481, 312, -194, -562, -249, 440, 466, -292, -859, -410, 424, 295, -734, -1022, -287, 407, 152, -108, -1083, -424, 936, 366, -976, -1080, -132, 688, 376, -683, -909, -73, 1007, 640, -795, -895, 164, 609, 261, -595]
2571e95K0O99Q96q60j124O38N67L01n17n27M9J62O90o4j095k35N92N34o2p68J18
2592e81PP65K9o95p5K0M73O25n99j167N10J256j09j142k15R56L19l00k58p71L45
2613f07J032L36j108j022R59J121kj016p90J297Q48m80o30m43Q46L53o4j008o53
2632a031O09Q22J31j426k15R13N86n40l99k85K80N99K8m57l04r4P05K93m88o85
2652i58K35R80o0m29j31K33J88P96o35j235J66J290O65j379n80O55P51k5q27n98
2672h98J91J018M43r77p98N31J192L04j227p84P32J115l91q05o98J092J19l5l04
2691a80r25Q34O59K27j193m33J022P28m51o36j98N05K49k29P6k75l56P07N16n08
2711A39j121P34O07M75j023m17M57k1R33j97j149j33P30J204r01j008j16J468
$$ y = [-595, -575, 124, 1020, 160, -964, -326, 241, 542, 25, -502, -453, -291, 399, 335, -760, -995, -403, 131, 69, -699, -581, -574, 191, 220, -475, -550, -530, -57, 568, -31, -1198, -688, 568, 459, -683, -898, 58, 377, 77, -181, -952, -607, 425, 761, -347, -1369, -410, 711, 709, -307, -1097, 200, 1048, 568, -62, -505, 341, 694, 630, -378, -1031, -422, 400, 531, -895, -1110, -197, 389, -151, -550, -835, -555, 44, 72, -385, -689, -783, -78, 215, -273, -958, -723, 257, 197, -232, -363, -130, 58, 854, 219, -1016, -850, 440, 1105, -274, -854, -199, 552, 527, -300, -898, -707, 311, 754, -223, -1021, -490, 702, 1006, -221, -1005, -273, 842, 451, -354, -1052, 40, 159, 124, -180, -1105, -271, 388, 615, -578, -1011, 11, 739, 288, -348, -546, -41, 208, -21, 55, -220, -576, 131, 647, 139, -982, -248, 359, 834, -189, -606, -149, -170, 763, 566, -583, -716, 14, 1218, 317, -691, -807, 661]
2729F61K27j040n74L01P30L61p10p35k0J033Q70q55j449N03J638l06r79n07O72
2748a79N72K68n56o60o8Q82N77q82m18J45N34K69n58n31M62O61J20r16K3m11M54
2769b12O74l10q04j34J303M36q44l76r1L34L75L0o00k97K79R06q0j353j42J074
2789A68N91l58j357K76Q73M80o87o86L9N89P32j17j588K88J256M93j095q40O73
2808b70P66l9n88o83J59J026J16j83n30j19M95O23o64q37K93Q56%k62k97j90k48
2829e76N80M96o29p43Q18O47J01j438M2R28P55n69p01l69P90N18P5p18p93N44
2849b42J307m63j140j56Q87N24m78n69j19L80M70K8r23n64J077P84o62p35K9Q56
2869B91K53n08n62K21N72M50n56j93k26K79P01l98o77p9Q03k63K91p74j24M41
$$ y = [661, 888, -152, -726, -425, 305, 666, -44, -779, -799, 234, 1104, 249, -1200, -697, 941, 635, -344, -851, -179, 393, 661, 105, -555, -623, 259, 836, -46, -464, -319, 215, 484, -74, -605, -143, 518, 638, -278, -255, -666, -212, 462, 152, -652, -786, 517, 953, 109, -267, -358, -24, 351, 381, -219, -516, -237, 669, 589, -764, -906, 168, 759, 401, -956, -680, 193, 673, -14, -700, -661, -72, 660, 543, -1045, -757, 499, 992, -103, -943, -270, 496, 457, -131, -814, -655, 371, 487, 304, -226, -345, 150, 773, 109, -728, -435, 421, 421, 159, -138, -328, -576, 4, 500, -129, -872, -54, 593, 694, -744, -702, 226, 981, 412, -289, -658, 132, 650, 725, 7, -786, -242, 1065, 602, -538, -694, 193, 717, 239, -330, -449, -69, 401, 429, -494, -1058, 19, 803, 141, -594, -565, 291, 544, 36, -526, -305, 267, 717, 161, -32, -258, 21, 722, 324, -353, -432, 371, 108, 399, -375, -499, -58]
2889e8L79P7p71o02P27M70L96o69o75K95Q89O0p36l12M62O14J95p23p74J07J359
2910G10J59j427l87P83R46n17q81N7O52K26M5r79J47L80O32k70p45p0K25J097
2930G83n18o76k35N44M33m92lj25J01N59J7n53k80K94J99o4l00l85L45K57j39
2951b38M25p42K16K95J39l4l66j28O64J21n89l61L92L89L22n31m26J31M93M44
2971F16r27n04M29J015j51p42o53R09O91j81p25m34M17O02L20q21j93K50L78J14
2991D10q45R3N53P7L6n47k99m5O67L11k91m94j18M57L53k89j53q4K61j56O4m8
3013h7j6K82J55l80k51m40M70J106q80l05p8M15R0j49p0n67Q49M33o07o05p1J031
3035C25K66n49p40N05J57N19o38j32K95N44j53q87k2K00O88qo44j49J50L72j97
$$ y = [-58, 321, 398, -373, -975, -248, 222, 618, -51, -726, -431, 458, 518, -218, -530, -68, 546, 741, 18, -756, -649, 710, 869, -558, -945, -162, 784, 267, -614, -557, 95, 321, 366, -613, -466, -86, 546, 276, -469, -539, -314, 783, 265, -411, -646, -102, 331, -161, -164, -289, -188, 371, 388, -165, -445, -151, 48, -16, -316, -701, -356, -99, -238, 187, -555, -339, -44, 95, 61, -305, -433, 231, 352, -237, -598, -206, 183, 505, -26, -452, -321, 172, 616, -311, -815, -386, 629, 478, -264, -917, -8, 683, 502, -223, -657, -240, 362, 682, -139, -332, -82, 296, 410, -435, -342, 211, 288, 324, -223, -522, -567, 100, 411, 120, -374, -492, -35, 318, 29, -124, -208, 53, -103, -39, -87, -103, 179, 334, -46, -297, -737, -267, 839, -41, -346, -424, -9, 81, -68, -138, -705, 144, 577, -30, -635, -706, 325, 591, 42, -698, -193, -36, 483, -155, -287, 8, 552, 399, -488, -510, -310, 378, 370, -274, -423, -273, 99, -98]
3056i8K37j22j79P6Q4k13k35O06J98j0j09o84J07L45L63j57k49m07K46L56N2o34
3078d27j48N99O42o80k01p5M16K63j28o57o1M12O47l77m66J96L3N96m13n90K57
3099a62N98q5m96l25M21L91j50k50mQ7M03l3l06j97L50p5J75m08L39o39N94k1
3121B07j81j4q7j99K36M29l87l14J15L87K22l96k33L16JJ07p2k50L17J29J16n24
3143g5k16M31K87J08r32P8L48O67l93p30K42L8M74K20n79l12N24l2l7l57OP28
3165D88m01j68k63K61L00J19n39q9J83l0O8l17K83NJ38k28J61%J24l82J56L38
3187B07j5l94j17L49K30k84Q0n72L47L95l11k10k78Q40l8n47p1J66O20p1m46l69
3209d89N77j26L25j99n39J59M11o4L6n38L72M3j43l47J3M28K43J82m51L5Q0J31
$$ y = [-98, 139, 17, -162, -86, -2, -215, -450, 156, 354, 344, 235, -449, -342, 3, 366, 209, -40, -447, -201, 155, 207, -427, -575, 24, 666, -14, -215, -290, 126, 389, 261, -396, -457, -45, 602, 225, -241, -45, -12, 584, 171, -419, -162, 436, 351, -145, -470, -49, 342, 192, -58, -62, 25, 428, 395, 89, -108, 242, 167, 342, -66, 273, -366, 228, 207, 26, 12, -75, -274, -38, 391, 4, -310, -195, 192, 414, 18, -215, 101, 102, 209, 137, -113, 204, 333, 449, -75, -291, 140, 427, 535, -397, -319, 29, 696, 303, -427, -185, -147, 327, 547, -32, -344, 180, 148, 111, -246, -240, 488, 87, -81, -344, -83, 217, 336, -203, -292, -109, -139, -71, -388, -105, -100, 38, -190, -29, -29, 95, -287, -131, 207, 192, -202, -319, 30, 260, -24, 56, -516, -169, 226, -85, -295, -573, 267, 229, -318, -389, -223, 397, 326, -120, -489, 88, -38, 287, 88, -451, -292, 119, 55, 91, -447, -75, -32, -175, -522, -509, -81, 162, 344, -107, -72, 8, 139]
3231A39r2k33J04J2k15K28j49q2J28L06l5m05M54k16j05n5O07m20k99J96P4J31
3253G3J05l78M3M62j13l50r8N56p1l68k97J98N84m6l43k0N4q5Lq0Jm3K22L46n16
3278a61k73L32M42k81k88L6Q7J43j42J02K81j06l0j78q8K7m9N05l68m0K6J19j42
3301d6j80Q9J76l1m54L60M04r3j74m0L12N1p99L27K59m4l9l60J72J77m3o4J16
3324G6k75K73K83n57l23K44P18j19l54k22J14J33K62k80r8O5L04j68k85j24M76
3345A43L54l95k82O9pK10j7k80N83k56Lk28J40q7J5k6J96k38J96%j91k38L45L79
3369C88m42kk31Q9K35k75K05J67k51J91l17K88k02O27n14p2O5K37j0o19K05O59
3391D21l72l04Q2K41N52l28k20k81J55L36r5J3l75p9O1K82r4j12K27P1k89R5J31
$$ y = [139, 47, -186, -82, -70, -285, -57, -206, -288, -160, 146, 111, -294, 160, -56, -161, -216, 391, -29, -328, -132, -58, 73, 178, -200, -157, 305, 192, -158, -256, 300, 229, -139, -436, -238, 346, 300, -43, -63, -9, -94, -91, -171, -170, -213, 9, 355, -161, -434, -102, 340, 59, -229, -193, -106, 37, -105, -3, 278, 172, 142, -36, -124, -97, -146, 359, -9, -49, -23, 96, -46, -226, -137, 39, 8, -446, -86, 318, 225, 51, 11, 323, 374, -425, -98, 161, 117, 78, -282, -110, 67, 24, -40, 76, -199, 74, 357, -200, -523, -279, 439, 320, -34, -256, -142, -9, 253, -27, -125, -60, 244, 76, -209, -333, 143, 497, 102, -180, -111, -118, 92, 75, -205, 378, 122, 125, -103, 37, -50, -35, -61, 135, -103, 93, 93, -98, -336, 9, 388, -54, -56, -287, -198, 37, -238, -33, 134, -117, 74, -243, 45, -157, 470, -44, -116, -51, 186, 176, -443, -238, 421, 49, -255, -173, 68, 620, 292, 72, -209, -54, 282, 187, 200, -175, -254, -193, 89, -5, -117, 110, 181, -108, -13, 118]
3414A18j09J8j85J06q8K53L8j27M20m84J46m52L03KK29L5n03J31K57k65J21j91
3436b27P24Rl90j84J09k6J43j83j53J84L31k34k62J61M23k05j66m78K92K11J52
3457B31l12K15J11J5n6m32J46J36K19k53k2k44L40J57r3k68L43Mk18m15N03l38
3479b31L00P1l56M27p9no9J58n2J98l20L0k61M66k28k07m3L54o1On4R8l4k93L11
3504A26k75K69J88M4n04k19M06M24n38OJ94N9P0q3l90L17n5r0k90N90l48J84P7
3527A62j04j97K11J35l66l8K28K57j45n68q0N55Q1l96m3N53j97P6k74n4K66MK49
3550C15k44o6k1j40K20k16N10k49m96k1N45j02MM6k56Q7J89O8n82K03L55p5l16
3573b42K47k76J32L45j50l32K59R7j86K82k69j27J58K39n3k64j57M16l17J27K05
$$ y = [118, 9, 27, -158, -52, -140, 113, 151, 24, 444, -40, 106, -346, -43, -41, 188, 223, -280, -149, 108, -157, -36, -227, 497, 506, 116, -68, 41, 15, 158, -25, -178, 6, 337, 103, -159, 2, 425, 220, 54, -424, -132, 79, 231, -81, 134, 245, 260, 204, -228, -82, 54, 273, 20, -2, -246, 94, 251, 158, -110, 233, 237, 19, -396, 107, -231, 69, 140, -216, 211, 132, 127, 58, 216, 164, 362, 42, 72, -189, 277, 49, -158, -201, 153, 92, 98, 44, 142, 108, -185, 126, -149, 120, 308, 352, -152, -371, 35, 459, -79, -73, 121, 180, 250, 167, -223, 94, 39, -51, -341, 249, -99, 85, 162, 58, -139, 72, 207, -159, -197, 31, 288, 143, -425, -505, 50, 131, -265, -308, 245, 48, 124, -150, -204, 62, 66, 315, 71, 5, -16, -156, 64, -152, 358, 109, -387, -408, 137, 35, 39, 85, -171, -84, 105, 173, -409, -206, 149, 74, -242, 5, -271, -139, 206, 56, -276, -17, 80, -106, 176, -93, -220, -62, 177, 124, -140, -297, 119, -198, -71, 134]
3594A34o6Q1k78o4M8J75j9j61K07J46m14N9N3J26n2R7J37l58K19K10j68j69n2
3617a09L77o7k04j42j1P5J49l47O5L11j22j21P7L50o18K71R8l32L55J2J36o08
3639d05M31K89n33J60p0K24J64k84j42J33J02l5k9k2q7J45k99M26k50N4L46j56
3661A62m42N30nql67L0K35j07r3l3Rj20R19l22m39j90L73q9j17j37J86K30j78
3684B7j58M5J73Kk82rJ32K35ql38K61p0K05j37m06K08K43M45o11j34K4K58j61
3707e6l26L5N36j3j81l01M74p7O0k98J24%l6R0J3j27K85Q0q3q0o3K93k71n07M96
3732F7L47k21k64M6J66K13m53J52pp2k24M94k05l9J64j09K22k70R7j65J78j39
3754b2J28p2j33L3K70k36O9k46K00j27K30O0o6J81q5J07k90j04J54L9l90L03p5
$$ y = [134, 68, 149, -129, -193, -145, 30, 11, -150, 57, 203, -211, -152, -99, 27, -25, 72, 209, -149, 70, 280, 112, -57, -109, 268, 201, -3, -145, -156, -81, 68, -279, -214, 97, -25, -146, -69, 281, -337, -66, 32, -300, 55, 67, 203, -405, 26, 315, -218, -58, -128, 96, 260, -24, -166, -33, 69, 34, 5, -17, -104, 41, -258, 168, -82, -28, 318, 162, -280, 250, 245, 237, -130, -100, 135, 28, -65, -98, -89, -209, 710, 388, -51, -241, 132, 43, -74, -211, -25, 205, 27, -131, -86, 87, 89, -193, -202, -70, 165, 157, -181, 80, 10, 215, 78, -328, -120, 123, 568, -43, -177, -153, 105, -56, -382, -347, 189, 176, -5, -306, 168, 91, 151, -147, -23, -23, -59, 31, 44, -83, 202, 282, 199, 119, 56, 349, 78, -429, 67, 414, 193, -71, -25, 141, 354, -99, 53, 46, -26, -250, 244, 39, 0, 164, 55, 277, 7, 104, -61, 117, -22, 106, 34, -99, -66, 204, -32, 37, -209, -9, -136, 94, 154, 88, 269, 184, 291, 1, -103, 51, 90, -300, 3, -72]
3777g2J73j87K35K60n12p2K82M6l96K66m45M56J18l41j48j20M42j09J32Q7k48
3798a53J03J37k05k12N75J96n34l43L49L94m46O9m3J59L31k59m55L90J70j9m18
3819b14J09K45K05n0l98j05l5K26R0j95L74j81l39p0l0L63L8J17K6j50K10j28
3841A08j88P5N7j45q4P8J55L20j57n21j12L26L33m61J48P9N7j00K52k9k55J4K48
3864A98q5n53M44K1j55L57k37L73n7m02m8k09M70j76K8r5K5L05l91J2J2J01n8
3887a20J46k24M6L08k36J41J45j7m76L40k55K35J02p7q7k0J05jqN1m5O7o2k97
3911b39J13k33L23P0m75K84K49L93m53k68K62Q0J90k33m80O69J0j94k57J91J26
3932A28j16j96J41J59J64j09Jj73k8K48k17m4P1k09o6N77l05k57L23J42m9l18
$$ y = [-72, 101, -86, 149, 409, -103, -175, 107, 153, -243, 23, -422, 34, 152, -189, -337, -457, -15, -124, 8, 95, -153, -50, 87, -118, -330, 245, 441, -93, -436, -87, 307, -139, -70, -113, 46, 377, 118, -337, 53, 223, 204, -214, -105, 140, 345, 295, -103, -208, -243, -17, 73, -122, 252, 71, -268, -338, -368, -5, 33, 150, 176, 26, 236, 108, -80, -5, 52, -93, -177, -99, 56, 376, 219, -302, -414, -88, 245, -216, -68, 11, 68, -32, 220, 191, -64, -50, 198, 113, -440, 4, 25, -130, 227, -10, 363, 306, -96, -144, -353, 117, -59, -31, -126, -101, 204, -187, -175, -163, -62, -120, 26, -198, -152, 156, -80, 61, 206, 189, -287, 53, -202, 33, 135, 58, -29, -49, 56, 55, 47, 98, 53, 120, 58, -239, -126, -359, -36, 34, -441, -157, 92, 485, 32, -236, 26, 106, 296, 63, -417, 252, 262, 68, -189, 2, 128, 12, -184, -43, 116, 280, 171, 172, -1, -29, 219, 2, -42, 29, -180, -246, 331, 26, -231, 92, 234, 185, -133]
3954a33j38K64l4j72K83mk23rK13l45O22m16J27m63L80K76l22j9J9L57j42j93
3976g2r3J90K11j38N1l5k26J87o5OK8l6Jp5J79j91K21k6l41K08K05j52j40J73
4000G0K34k37j43k82M6N7K38K3k68M3K88k86J91k0j12J83k82J78J86m9Q2l10K89
4023A19J18m3j33p4J4J5L50l44M5k00J73N2J51k80j05P1R2K2q2J42J08l22q7L79
4047A81lj0l8k50n0L24j81j47k90N45j17j08J11p6M7k10M90l28R1r5K65m32K40
4070d1o5K52p3l27K51J38O6j73j37N3K01Jl40M50k33j85J47k86M17M9M0m35K58
4093B8M1k86K24j36M8L14j86j78j8K76j0N3k70O6J06Q7J19j55k71J09M23m94p7
4116a87J90K90l29k20L92P4P0j43m14K33Om0p6K44j31J19J35l54L72j29j81j13
$$ y = [-133, -271, -7, -41, -213, 70, 66, -157, -166, 47, -298, 324, -92, 35, -428, -48, 228, -94, -113, -94, 263, 121, -72, -165, 25, 236, 98, 149, 114, -112, 75, 10, 16, 44, 8, 9, -66, 113, -78, 143, 117, -224, -16, 189, 37, -103, 70, 304, 67, -76, -358, -312, -255, -17, 6, -262, -219, 69, -217, -26, -46, -158, 25, -257, -79, 107, 58, 140, -170, 119, 237, 194, 61, -13, 1, 16, 366, 22, 67, -133, 40, 92, 243, -37, -142, -71, 21, 43, -39, 103, 211, -111, -198, 181, 178, 168, 130, -120, -170, 154, -27, -174, -464, 81, -36, -144, -33, -109, -62, -272, 218, -110, -19, -114, 151, -281, -41, -106, 146, 73, -254, -3, 135, 201, 28, -109, -56, 145, 146, -194, 256, 23, -162, -15, -301, 116, 165, 205, -230, 28, 69, -217, 7, -129, -81, 233, 47, -131, -149, 127, 117, 170, -100, -34, 72, 159, 278, 123, -148, -39, 384, -110, -187, 3, 293, -36, -256, 136, 210, 280, 137, -277, -44, -38, -78, -154, 90, -41, 78, 213, -141, 231, 102, -79, -192]
4138a92j66M68L56m61j72J62J94l84j62J58j14K89K0k37K23j50K76j53r4L4K89
4159A84l09J53j06L7K76k14j88J50M3J99n47K78j59K85k46K06j74j64L65k60J64
4180b7k3j12N1r9k03L29L97m68Q7j15K83j78J30Nj72n8N1N46n97K68K20k01k78
4203a64OJ71R3k63K0O8J19o0j23j72M76j64QN8k8K8l02L18j69K90o4k98k69J23
4227b98L28J74k51j75J41j6oK71l35M41j22l56k0L28J32j65r7l20J27K92J1L5
4249A19l2M1l87M64k44j23L40j12J49k24k7R2j20J18j77M0r3J94k80J19M96N5
4271D08j96k02j17j35R5J91j50J05L87j36m45j26M17N1m10Q2J20J18m0j27J34
4292B4J16k15J37m07R0R2M0j45m1K41K80r6j02P0J64p7n07P98m44J14J10j92p2
$$ y = [-192, -358, 110, 466, 5, -167, -5, 189, -195, -357, -199, -313, -24, -4, -241, -18, -168, 108, -45, -139, -105, 184, -125, 28, -78, -41, 235, 21, -167, -17, 26, 225, -322, -44, -203, 82, -164, 42, -132, -296, 69, -191, -27, -50, -162, -111, -210, -413, -84, 313, -155, -68, -183, 100, -78, 52, 57, -115, -173, -122, 424, -173, 95, 315, 114, -164, -158, 13, 106, -157, -137, -69, 50, -10, -133, -305, 171, 7, 15, 73, 45, 73, -229, 89, -80, 210, 146, -152, -421, -298, 30, 204, -47, -222, -81, -97, -103, 168, -167, 274, 152, -204, -224, 104, 236, 71, -26, -346, -219, 73, 84, 119, 87, 128, -259, 205, -39, -162, 178, 66, 215, -9, -36, 56, -64, 54, -123, -83, -176, 18, -262, -143, 353, 408, 212, 10, -107, -242, -147, 44, -106, -1, 386, 250, -195, -321, 96, 147, -263, -181, -61, 57, 17, -110, 24, 140, -75, 62, -345, -255, -163, -123, -268, -309, -68, 212, 116, 14, 84, 248, 171, -336, 462, 18, 132, 242, 50, -22]
4315b2J31o9r6p8N1L29k30j37j42M84k03k5RJ14q7O4j77k33K95K80l45q2n9K31
4339Cj21M18l19k25L39j23j36R9m2J04K76l46O8K37p1l1l1k25J10K46Ok28N4r7
4363c5M26q08N18p5J26l91K49k46M12j82k3l9K11k61LK45l50M21j46j8k05J33
4385c5L66l42J68j58O5j01j34J30M18l02l83M12j34R6j13N3q1J27k15K68K19m13
4407h9k4Mj5k6p7P7L63k05m7J85q7j11K05Lj57K40k1k30K1K35k32k10L67k49n0
4432a30M49m36j22K24L01l82j66L19l32L60J35k55O4J36K51o10J98K6J94M6j97
4453G3n3j03J38k6N9j30JK06j84L7N3k0K26k66R5l24K15p4j64K41J60k47Q4j60
4477a63J23j53K03k9q8K65k06J44l4k43K48M63m65K5k33L17r3k75K3K02J13k18
$$ y = [-22, 109, 40, -56, -134, -83, 246, 16, -121, -263, 221, 18, -7, 2, 116, 29, 93, -84, -317, -22, 258, -87, -169, -228, 3, -118, 300, -19, -244, 95, -28, -164, -65, -107, -3, 273, -73, -5, 232, 161, 130, 99, -126, -16, 230, 236, 8, 62, -35, 391, -417, 101, 26, 152, -239, 10, -236, 176, -6, -29, -68, 143, -118, -115, 130, -220, 201, 55, 37, -168, -35, 331, -11, 157, -1, 64, -37, -171, -41, 377, 75, -308, 104, -30, 66, -47, 6, -75, 52, -163, 105, 324, -89, -113, -109, -124, -150, -227, -150, 213, 8, -39, 146, 59, -52, 153, 156, -1, 239, 218, -12, 9, 244, 12, -198, 169, -80, -130, 319, -117, -239, -15, 286, -96, -262, 57, -275, 85, 220, -35, 29, 165, 416, -194, 4, 30, 224, 270, 73, 20, -83, 55, 29, 88, -42, -41, 165, -19, 18, 71, 51, 277, 11, 106, -218, -3, -77, -241, 0, 160, -87, -3, -163, -40, -193, 10, -19, -107, 158, -48, 96, 62, -181, 67, 530, 65, 90, -143, 174, 81, -194, -171, 31, 144, -74]
4499g4j76M76n29J31J64n2j7n0j73J22J22J48l15L54k52J89N5k94J12j80K2K36
4521A9j21j88K94N1q6J20k79Q5R6o1k00N09k66q3K4q3M76m11J07j37L97l30K91
4544B24k76j55K33l71L26o2j22P5K42J25k67K99q0j03k66J78L8J72j05J23l95
4565a67L08J49K8n90P2K08Q1n5k27L2K74K06k74k81L32J82m42r4K61n9P4m4l6
4588f2K13k1N8k72J01M54l57j20N9O7l78K41l0o1J84K70l60j39R9J86j18J38j60
4611hK0k14J35j91K07R4K51n67n8N34j55J96j38m96M30p1%j87J65J3p7K3RR5N9
4636F9j04J04N8l67O59m56J59p6l85N8L75j78J16J1r7o7J19J03J03k7m16J36K43
4659A40J98k57k3M3J64l88N4M56l67M6k94J50r5M9J58l7j82L86j17J6r3o7P9J05
$$ y = [-74, -250, 226, -303, -172, -8, -60, -77, -127, -300, -178, -56, 92, -223, 131, -121, 68, 123, -171, -59, -239, -217, 19, -102, -290, 4, 55, -31, 89, -190, -105, -9, -70, -270, 239, -27, -110, -86, -169, 307, -104, 3, -134, 263, -67, 224, -52, -207, 26, -345, -19, -81, -203, -128, 114, 239, -28, 271, 191, 88, -178, 0, 38, 210, 105, 228, -167, 141, 290, 318, -272, -200, 8, 89, 34, -193, -161, 113, 319, 45, -236, 96, 278, -164, -258, 3, -56, 18, -26, -62, 151, 130, 188, -84, 17, 471, 114, -6, 53, 120, -258, -17, -47, -108, 76, 346, -14, -153, -54, 132, 14, 152, -8, 12, -202, -67, -258, -51, 43, 294, -273, -331, 203, 48, 244, 106, -390, 40, -31, -31, -218, -53, -40, -117, -94, -85, 10, 69, -35, 69, 127, -240, 419, -37, 122, 46, -339, -281, 94, -84, 32, 43, -54, -121, -2, 101, 204, 177, -239, -103, 140, 338, 81, 58, 101, 265, -123, -69, 387, 20, 66, -228, -78, -173, -124, 34, -3, -185, 201, 84, 100, 7, -60, 19, 124]
4683A24O9m60M43m7N7o74L81K79k04K93J67p62L38kj51K43m3K72k64r4L79j37
4705B07J45k86l0J8k42K63M6K9j15Q8K73l20j40QQo3l65J97O1J65o1J5M80m85
4729a04q4J31J77n9j42J33k7k16J30M0k49L72J65m69j63K46J72l8j46q5K73q8
4751c1p2n7J01j65M77J6k33J19m1l4k18l3L17j0Q8j85m25M76m3Q3m23N0L78k76
4775a41M77j75ml25L73l57K97O9j80J86l89K66J00j77l92L61l4J20%l72K20P7
4797@j5k07K55P8N2j80K80l24J23L6j06l29K39K31J93l60Q9j97L33k17l6j16J80
4820BR0J49k31k23M65l71Q4J06j51j40L96o3j36q4N0j85L43l60L96j93j09K5K77
4843A37Q3r0J65m22O6j84M57j84p4N7Q8k00K3nK65j73J60m3k01K95o85J21M76
$$ y = [124, 193, -267, 176, 129, 186, -488, -107, 172, -32, 261, 428, -334, 4, 2, -149, 94, 51, 323, 59, -35, 344, 207, 352, 66, 36, 54, -188, 75, 121, 150, 35, 123, 396, 76, -64, -56, -48, -111, -476, -279, -218, -53, -114, -99, 381, -104, -188, -57, 120, 61, -81, 52, 25, -191, -61, -21, -270, 102, 267, -202, -365, -119, 53, 15, -131, -216, 57, -31, -103, -160, -59, -224, 253, 269, 36, 155, 114, 80, -138, -171, 146, 136, 224, 39, -386, 90, 47, 130, -293, -243, 135, -141, 336, 161, 157, -168, 205, -152, 145, 214, 34, 220, -169, 97, 197, 20, -372, -11, -45, 75, 75, -297, -77, 0, -15, -222, 33, 111, 163, -17, 263, -61, 62, 98, -8, -337, -98, 133, 326, -34, 55, -142, 191, -26, -62, -178, 2, 92, 241, 10, -213, 252, -119, -35, 71, -80, -220, 176, 113, -23, -107, -57, -242, 101, -259, 137, -56, -165, -140, 137, 220, 130, 295, -127, -61, -245, 212, 28, -46, 11, 99, -101, -78, -83, 182, 9, 169, 126, -75, 220, -465, -344, 132]
4866A32L07l62l8k58J72j23K20j94J04Q0j56M22k01k83L30J29k25klk56rL30j20
4889dl3J43l68L26j12Pk20M06R5q4J31m29M54k68J65k56l05K46K81k66m1J11j98
4912b19J30K75l07j29L93l75K1j03J1M81k31j7k60M09m27L74j53l7J59K15k67
4933e7j21j77N69l14P9k32J83K85k15q4K03PJ22k72k91K17R2K94n10K02l36K75
4955h1J53J10k43l6J27K75l01p5L12k23j13j11L32n15L95p0rM4K00J9l13J59J04
4978A40O7k60NN3Q5Rn17N63p1M2m69K29K27j13j64j91R6M97J88k89n33M65Q2j15
5002B6J89n10K21R2l8p9r2J40K71o1l60M49k52K45r1j13N5j46J42o5J29k14k3
5025h5K75p8j64j47l5M83m17K52p6k46J60L65l30k27K59J39Q3j75j01J08n2J43
$$ y = [132, 439, 77, 39, -219, -47, -170, 50, -144, -40, 40, -116, 306, 105, -178, 152, 281, 56, 54, 51, -205, -214, 116, -4, -37, 106, -262, 64, -48, -41, -261, 145, 240, 156, 287, -142, 312, 44, 209, -47, -352, -106, 175, -91, -132, -21, -219, -89, 186, -121, -250, 143, -232, -211, -314, -303, 178, -53, -70, -330, 79, -348, 26, -127, -164, -5, 210, -57, -178, -355, 214, -100, -21, -253, -70, 215, 0, -84, 119, 126, 248, -24, -315, -98, -6, 288, -222, -20, -356, -81, 72, 182, -61, -97, 30, 305, 4, -71, 241, 18, -95, -206, 126, -389, 6, -64, -73, -29, 171, 190, -123, 36, 140, 207, -53, -48, 5, 90, 99, -418, 145, 74, 116, -353, -124, 103, -10, -174, -365, -269, 228, 416, 127, -406, 59, 141, 26, 215, -295, -74, 18, -20, -99, -191, -51, 220, 159, -201, 248, -4, 241, 150, 37, 92, -54, 88, 23, 152, -62, -85, 190, 112, -52, -199, -234, 249, -168, 84, 8, -238, -78, 287, -43, -270, -11, 128, 211, 36, -65, 43, -9, 134]
5047A34k63K08j01K16j28J26k39o3K65K9k86j80J50K55J23l25OL0q9J13j10L7
5069i2K7K59j54k73N50o66L66K88r7l68N31l98K43k52J23l8k44K91j15J96k98
5090a21J84l5n8P2l20J89K91j64k09K05k4J89J2Jm33J50M28j79j27k6J66k18K2
5113eO6J07l81l5q8K14L15K2Ql08j96K40j32J79Or1k08O8j15N21l98K36J29j01
5137E3k22Q9j55N89r0k11o4j00J44j04j47L54l90L35k84K50j34J1n8J87K18k22
5159D9M8j85K17k08J3l61M58j03J14k78K75r1J29m6M4r1j27L40m3n8j76J2J15
5182D7J50k27j44J46R1K23k66K0J26k93K63l02J78p6L72j15j7K12l47j62q5R1
5204a15M7K61j15j57J29j06J96p5J70k9m53K26j08M78k31m51M07k90K94q2k13
$$ y = [134, -129, 79, -22, 194, 66, 192, -47, -110, 155, 184, -102, -282, -132, 123, 246, -79, -73, -43, -132, -19, -129, -92, -65, 194, 40, -233, 317, -349, 17, 305, 208, -160, 371, -27, 216, -36, 87, 49, -195, 96, -19, 177, -121, 63, 28, -30, 42, -278, -89, 202, 38, -171, 34, 10, 199, 211, 212, -221, -71, 357, 178, 51, 25, 191, -27, -5, 61, 168, -213, -248, -336, -122, 193, 215, 223, -85, -281, -41, -173, 6, 12, -79, -287, -219, -334, 187, -211, 25, 154, 53, -169, -80, -235, 354, 264, 53, -11, -111, 33, -71, -218, 136, -254, 81, -203, 47, -87, -76, -134, 53, 271, 49, 97, -88, 129, -79, -66, -427, 31, -72, 42, -236, 39, -52, 77, 31, 75, -16, -143, 197, 154, 96, -80, -68, 47, 197, -30, -174, -28, 63, 286, 20, 40, 166, -127, 136, -166, 12, -64, 308, 193, 176, 388, 41, -121, -206, -115, -68, 193, 78, -79, 50, -56, 140, 65, 235, 206, -247, -21, -129, 349, 118, -333, 74, -216, 78, -4, -217]
5225b17k4L37l61L78k85j7J58L3k16J7r4K44J05j06j94L07R4j97J93N3P0k42J29
5248A65k93j3L11J00j46r7j6J95j7l49K30L21k58j2j34J70j07q7r2K41j2j03J42
5271A39K3k29J41o3J52m94M43J34m41n6K25O1j09l7L43Q0k36k1k98R6J65K17j52
5294H3r7l02M81j38k22L4Q6K82l66J86m1J85P2j37r4j52K26m0J92k49L44k60M6
5317A19j3j92J57K40k41n8J40l44M03k30J12k38M25m93J17Q8L13n94M10k34K70
5338A57j30J7J48q2M4M8k38M8J01p7j08K9J26R5j50J70k5k67K72Q9m80N4jK88
5362A28j00J49k37J15R2J94r2k96K68j78Q4N6k88K08j24r3J95R0J11k34L1q1q3
5385h5j26K24K33k35k15J17k52O58n18J53k10L14k32rJ50J27o5k36Q6l52M11K10
$$ y = [-217, -241, 96, -265, 113, -172, -189, -31, 2, -214, -197, -291, -47, 58, -48, -242, 65, 159, -38, 155, 208, 278, 36, 165, -128, -141, 170, 270, 124, 27, 11, 206, 189, -160, 70, 391, 133, 121, -13, 157, 50, -37, -129, 112, 100, -3, 139, 162, -67, 74, 11, 163, -331, 112, 246, -195, -251, -26, 35, -74, -111, 232, 312, 76, 55, -243, -147, 18, 235, 83, -14, -316, 165, 27, -195, -161, -75, 207, -159, 27, -14, 171, 243, 106, 12, -140, 86, 46, 238, -11, 333, 73, 119, 106, -86, 71, 311, 70, 12, 152, -192, 211, -19, 93, -145, 280, -213, -96, -8, 305, -289, 121, -113, 157, 27, 44, 192, 110, 154, 202, -36, 12, 113, 36, -72, -43, 83, 178, 28, 198, 173, -94, 178, 267, -213, -159, -160, 128, 28, 177, -60, 55, 147, 341, 249, -47, 221, 43, 127, 183, -105, 103, -21, -114, 81, 171, 282, 48, 79, -2, -85, -211, 13, 246, 11, -204, -87, -339, 319, -199, -46, -256, 58, -174, -183, -33, 94, 29, -207, -121, -473, -62, 148]
5407A48l4q9L0m04M99j2k13J36J88J13r2j74m4j29R4j5j46L47j48j38J35l25O9
5430b04M12p6k28K41k33O9J52l08J31k26J77k0J07L1p9J69j18j85L06k5k7K07
5452B73l03p6J83k93j6L57l8k15OJ39O3O8j51k78J23J55L90k74k54m3J69k7N5
5475A3P9j43K78l69J12L1j40K29N4l67O9k4M28l18jK3n0K20Nq2j58L08k98r0P6
5500a15J5j2L49j58K41m46K90K20m83m9j92K76o9J91k3j1j81K95L1o1l98L30l03
5523b63K59L2J4j61j03L11l15R7k9K32R9n47q9O39L8k71K44Q6J3l22L33n18J91
5546c0J80Q6k07nr1O2j95K13k21L63r7k98K99Q7rQ6l26L02J18l63p5m4K20K98
5570C53n76J15J27J30j56K6k71L55r7L25o48K6J98J28j31J57K02k22K6j78O6j72
$$ y = [148, 114, 25, 55, -349, 150, 138, -75, 61, 249, 362, 270, 96, 52, -77, 17, 2, -144, 203, 55, -83, 52, -273, -204, 208, 132, -96, 145, -88, -19, 133, -175, -44, -270, -93, -113, -6, 25, -54, 115, -3, -188, 118, 93, 66, 273, -30, -106, 77, -216, -232, 125, 87, -128, -122, 17, 80, 148, -3, -281, -158, -3, 387, 113, -141, -184, -15, -42, 13, 92, -51, 227, -142, -30, 1, -139, 90, 144, -223, -154, -178, 250, -68, -69, -46, -96, 124, 129, 47, -111, 197, -101, -191, -115, -100, -112, 237, 79, 320, -126, 164, 384, -99, -148, -340, -64, -133, 58, 35, 24, -157, 138, 169, 108, -290, 40, -263, -4, 28, 42, -119, -222, 89, -226, -129, -158, 74, 173, -374, -463, 176, 214, -57, 187, 273, 286, -36, 297, -221, -30, 150, 236, 29, 24, -67, -5, -200, 13, -208, 155, 58, -240, 59, 146, 137, 223, -103, 199, 317, -46, -121, -165, 55, 353, -223, -108, 19, 149, -7, 19, -252, 103, 6, 331, -317, -291, -93, 35, -96, 61, 263, 41, 67, -111, -45, -217]
5592b17M12J35m17r5J50R9Op2J25P0l60K34r0j98K73k28K71k75Q3Q3K68j30o3
5615F4P6q9k36K73k1q6k99J15L47k54j74N36l39J95k96R6N9r5K81p5q8M4k09K86
5639A11J20k13j38K28Mm00M41n13M91J8j77L34k60j21K26p0k84J90j21L88m91
5660b37K19N2MJ08k70Q8lJ86k90J62J67k45k33M16j32K98l48j73J86j4l9K70P0
5683B42l81oK09m2oj86N14k89l71J22O6K24k03ko0J07J29M1m49N64k30l00O5M10
5707A68j90L22j73l95K22M4K9l4K74k2l43j06N29m05j26L57j95m17O96k37N4N6
5729A08L2p2N5j63k4J6l5j56K36o7L05n0k87J48J19M2j84k03o8O9K72R1m7J4j72
5754b1K14m44O0J06L35M1m82J35k92L66q5l01K59J63L87n73L02k27m8K21O9k35
$$ y = [-217, 195, 330, -87, -182, -32, 67, 73, 1, 126, 196, -164, 70, -20, -218, 55, -173, 98, -177, -94, -11, 257, 127, 64, 140, 51, -185, 88, 67, -19, -318, -203, 144, -110, -284, 252, -87, 108, -188, -92, -33, -128, 153, 78, -10, 34, -175, 111, 231, 18, -120, 108, 112, -288, 153, -360, 131, 149, -28, 306, 46, -75, 151, 81, -203, -13, -134, 254, -237, -18, 34, 38, 146, -124, -36, -39, 147, -143, 19, 186, -59, -292, 124, -8, 290, -58, -231, -45, -59, -98, 172, 242, -139, -145, 64, 22, 16, -170, 344, 55, -316, -194, -128, 96, -107, -109, -169, -62, 67, 108, -341, 223, -7, -307, -242, 168, -22, 300, 127, -268, -46, -2, 27, -7, 267, 245, -98, -204, 325, -80, -206, 151, -44, -461, 235, -2, 52, 108, 140, 68, 123, -40, -64, -48, -83, -239, -3, -70, 235, 185, -102, 46, 165, 207, 23, -180, -248, -179, 93, 184, 137, 151, -21, 193, -251, -191, -85, 250, 291, -191, -56, -348, 18, -67, -368, -109, 54, 441, -132, 170, -57, -105, 116, 185, -50]
$$ [...]
8191b6
##END NTUPLES=NMR FID
##END=
